##TITLE=1H_LR-762-R2-EtOAc
 CDCl3
 8 sc, 
 26.12.2024
##JCAMPDX= 6.0         $$ Bruker NMR JCAMP-DX V2.0
##DATA TYPE= NMR FID
##DATA CLASS= NTUPLES
##ORIGIN= UXNMR, Bruker Analytische Messtechnik GmbH
##OWNER= root
$$ XWIN-NMR		Version 3.5
$$ Thu Dec 26 16:30:50 2024 Russian Standard Time (UT+4h)  she@DPX200
##.OBSERVE FREQUENCY= 200.1315
##.OBSERVE NUCLEUS= ^1H
##.DELAY= (6, 6)
##.ACQUISITION MODE= SIMULTANEOUS
##.ACQUISITION SCHEME= undefined
##.AVERAGES= 8
##.DIGITISER RES= 18
##SPECTROMETER/DATA SYSTEM= spect
##.PULSE SEQUENCE= zg30
##.SOLVENT NAME= D2O
##.SHIFT REFERENCE= (INTERNAL, D2O, 0, 15.7039)
##AUDIT TRAIL= $$ (NUMBER, WHEN, WHO, WHERE, WHAT)
$$ ##TITLE= Audit trail, XWIN-NMR		Version 3.5
$$ ##JCAMPDX= 5.01
$$ ##ORIGIN= Bruker BioSpin GmbH
$$ ##OWNER= she
$$ F:/spectra/data/she/nmr/H-F/1/audita.txt
$$ ##AUDIT TRAIL=  $$ (NUMBER, WHEN, WHO, WHERE, WHAT)
(   1,<2024-12-26 16:29:37.71 +0400>,<she>,<DPX200>,
      <created by zg, POWCHK disabled, PULCHK disabled
       configuration hash MD5:
       00 E9 B6 7A A2 85 ED C7 34 08 36 98 17 FE 4E 26
       data hash MD5: 16K
       1D 0E DB 13 05 F1 3B 30 75 A9 6C B8 16 92 DE C1>)
$$ ##END=
$$ 
$$ hash MD5
$$ EA 97 04 89 59 38 38 92 E2 CA 71 19 DA 39 F7 36
##$RELAX= 
##$RELAX= 
##$RELAX= 
##$RELAX= 
##$RELAX= 
##$RELAX= 
$$ Bruker specific parameters
$$ --------------------------
##$DU= <F:/spectra>
##$EXPNO= 1
##$NAME= <H-F>
##$PROCNO= 1
##$TYPE= <nmr>
##$USER= <she>
##$AMP= (0..31)
100 100 100 100 100 100 100 100 100 100 100 100 100 100 100 100 100 100 
100 100 100 100 100 100 100 100 100 100 100 100 100 100 
##$AQSEQ= 0
##$AQ_mod= 1
##$AUNM= <au_zg>
##$AUTOPOS= <>
##$BF1= 200.13
##$BF2= 200.13
##$BF3= 200.13
##$BF4= 200.13
##$BF5= 200.13
##$BF6= 200.13
##$BF7= 200.13
##$BF8= 200.13
##$BYTORDA= 1
##$CFDGTYP= 0
##$CFRGTYP= 5
##$CHEMSTR= <none>
##$CNST= (0..31)
1 1 145 1 1 1 1 1 1 1 1 1 1 1 1 1 1 1 1 1 1 1 1 1 1 1 1 1 1 1 1 1 
##$CPDPRG= <>
##$CPDPRG1= <>
##$CPDPRG2= <>
##$CPDPRG3= <>
##$CPDPRG4= <mlev>
##$CPDPRG5= <mlev>
##$CPDPRG6= <mlev>
##$CPDPRG7= <mlev>
##$CPDPRG8= <mlev>
##$CPDPRGB= <>
##$CPDPRGT= <>
##$D= (0..31)
0 1.2 0 0 0 0 0 0 0 0.06 0 0.03 0 0 0 0 0.0002 0 0 0 0 0 0 0 0 0 0 0 0 
0 0 0 
##$DATE= 1735216177
##$DBL= (0..7)
120 120 120 120 120 120 120 120 
##$DBP= (0..7)
150 150 150 150 150 150 150 150 
##$DBP07= 0
##$DBPNAM0= <>
##$DBPNAM1= <>
##$DBPNAM2= <>
##$DBPNAM3= <>
##$DBPNAM4= <>
##$DBPNAM5= <>
##$DBPNAM6= <>
##$DBPNAM7= <>
##$DBPOAL= (0..7)
0.5 0.5 0.5 0.5 0.5 0.5 0.5 0.5 
##$DBPOFFS= (0..7)
0 0 0 0 0 0 0 0 
##$DE= 6
##$DECBNUC= <off>
##$DECIM= 24
##$DECNUC= <off>
##$DECSTAT= 4
##$DIGMOD= 1
##$DIGTYP= 9
##$DL= (0..7)
0 120 120 120 120 120 120 120 
##$DP= (0..7)
150 150 150 150 150 150 150 150 
##$DP07= 0
##$DPNAME0= <>
##$DPNAME1= <>
##$DPNAME2= <>
##$DPNAME3= <>
##$DPNAME4= <>
##$DPNAME5= <>
##$DPNAME6= <>
##$DPNAME7= <>
##$DPOAL= (0..7)
0.5 0.5 0.5 0.5 0.5 0.5 0.5 0.5 
##$DPOFFS= (0..7)
0 0 0 0 0 0 0 0 
##$DQDMODE= 0
##$DR= 18
##$DS= 0
##$DSLIST= <SSSSSSSSSSSSSSS>
$$ [...]
##$SUBNAM2= <"">
##$SUBNAM3= <"">
##$SUBNAM4= <"">
##$SUBNAM5= <"">
##$SUBNAM6= <"">
##$SUBNAM7= <"">
##$SUBNAM8= <"">
##$SUBNAM9= <"">
##$SW= 24.0689530833862
##$SWIBOX= (0..15)
0 0 2 0 0 0 0 0 0 0 0 0 0 0 0 0 
##$SW_h= 4816.95568400771
##$TD= 16384
##$TD0= 1
##$TE= 0
##$TE2= 300
##$TE3= 300
##$TEG= 300
##$TL= (0..7)
0 120 120 120 120 120 120 120 
##$TP= (0..7)
150 150 150 150 150 150 150 150 
##$TP07= 0
##$TPNAME0= <>
##$TPNAME1= <>
##$TPNAME2= <>
##$TPNAME3= <>
##$TPNAME4= <>
##$TPNAME5= <>
##$TPNAME6= <>
##$TPNAME7= <>
##$TPOAL= (0..7)
0.5 0.5 0.5 0.5 0.5 0.5 0.5 0.5 
##$TPOFFS= (0..7)
0 0 0 0 0 0 0 0 
##$TUNHIN= 0
##$TUNHOUT= 0
##$TUNXOUT= 0
##$USERA1= <user>
##$USERA2= <user>
##$USERA3= <user>
##$USERA4= <user>
##$USERA5= <user>
##$V9= 5
##$VALIST= <valist>
##$VCLIST= <CCCCCCCCCCCCCCC>
##$VD= 0
##$VDLIST= <DDDDDDDDDDDDDDD>
##$VPLIST= <PPPPPPPPPPPPPPP>
##$VTLIST= <TTTTTTTTTTTTTTT>
##$WBST= 1024
##$WBSW= 4
##$XGAIN= (0..3)
0 0 0 0 
##$XL= 0
##$YL= 0
##$YMAX_a= 824059
##$YMIN_a= -569009
##$ZGOPTNS= <>
##$ZL1= 120
##$ZL2= 120
##$ZL3= 120
##$ZL4= 120
##$ABSF1= 10
##$ABSF2= 0
##$ABSG= 5
##$ABSL= 3
##$ALPHA= 0
##$AQORDER= 0
##$ASSFAC= 0
##$ASSFACI= 0
##$ASSFACX= 0
##$ASSWID= 0
##$AUNMP= <proc_1d>
##$AZFE= 0.1
##$AZFW= 0.1
##$BCFW= 1
##$BC_mod= 2
##$BYTORDP= 1
##$COROFFS= 0
##$CY= 11.3945322036743
##$DATMOD= 1
##$DC= 2
##$DFILT= <>
##$DTYPP= 0
##$F1P= 15.6554695791079
##$F2P= 12.8336369535428
##$FCOR= 0.5
##$FTSIZE= 0
##$FT_mod= 4
##$GAMMA= 1
##$GB= 0.15
##$INTBC= 1
##$INTSCL= 1
##$ISEN= 128
##$LB= 0.24
##$LEV0= 0
##$LPBIN= 0
##$MAXI= 10000
##$MC2= 0
##$MEAN= 0
##$ME_mod= 0
##$MI= 1.114404
##$NCOEF= 0
##$NC_proc= 0
##$NLEV= 6
##$NOISF1= 3.799351
##$NOISF2= 2.8
##$NSP= 1
##$NTH_PI= 0
##$NZP= 0
##$OFFSET= 15.70392
##$PC= 1
##$PHC0= -26573.49
##$PHC1= 16.58744
##$PH_mod= 1
##$PKNL= yes
##$PPARMOD= 0
##$PSCAL= 0
##$PSIGN= 0
##$REVERSE= no
##$SF= 200.130013532006
##$SI= 16384
##$SIGF1= 3
##$SIGF2= 2
##$SINO= 400
##$SIOLD= 16384
##$SREGLST= <1H.CDCl3>
##$SSB= 0
##$STSI= 0
##$STSR= 0
##$SW_p= 3612.71676300578
##$SYMM= 0
##$S_DEV= 0
##$TDeff= 0
##$TDoff= 0
##$TI= <>
##$TILT= no
##$TM1= 0
##$TM2= 0
##$TOPLEV= 0
##$USERP1= <user>
##$USERP2= <user>
##$USERP3= <user>
##$USERP4= <user>
##$USERP5= <user>
##$WDW= 1
##$XDIM= 8192
##$YMAX_p= 0
##$YMIN_p= 0
$$ End of Bruker specific parameters
$$ ---------------------------------
##NTUPLES= NMR FID
##VAR_NAME=  TIME,          FID/REAL,        FID/IMAG
##SYMBOL=    X,             R,               I
##VAR_TYPE=  INDEPENDENT,   DEPENDENT,       DEPENDENT
##VAR_FORM=  AFFN,          ASDF,            ASDF
##VAR_DIM=   8192,          8192,            8192
##UNITS=     SECONDS,       ARBITRARY UNITS, ARBITRARY UNITS
##FACTOR=    0.0002076,     1,               1
##FIRST=     0,             0,               0
##LAST=      1.7004516,     0,               0
##MIN=       0,             -569009,         0
##MAX=       1.7004516,     824059,          0
$$ Real data points
##PAGE= N=1
##DATA TABLE= (X++(R..R)), XYDATA
0@%%%%%%%Qj6J6j6K4l2L5m3N6o4P7r8J12j29J54j78K01k34K72l07L48l97M47n00
31b64N65o35P08p90Q80r79J088j206J336j482J642j816K010k230K472k745L060
48A614l422L838m332M928n653O574p778R422j1819J5667k2820M0442j60967k42631
62c76937L91970K05650l20270j98221M82798M45870k87551n51135O9877N22542
72C84593J45338m95480n29759j3382L84114J86732k85123l19423K49971N97643
82C05224J19556m88191k28305M56552M01184k80918m43035L6600K19642r1804
92F505j48363J56811J62141j63815j61831J79407J78690k32588l36825P5901L44349
103F0382M9888l39247k37906K45799N08470K01746l09328l27740K08440M59731
$$ plain form
0 0 0 0 0 0 0 0 0 8 -8 8 -8 16 -16 19 -24 32 -32 45 -53 59 -70 84 -94 107 -127 145 -162 186 -211 236 -264
31 -264 301 -334 374 -416 464 -515 573 -633 703 -779 863 -953 1057 -1173 1299 -1446 1614
48 1614 -1808 2030 -2302 2626 -3027 3547 -4231 5191 -6628 9039 -13781 26661 -134306 -376937
62 -376937 15033 220683 -99587 -297808 184990 630860 343309 -207826 -137949 384593
72 384593 529931 34451 -495308 -508690 -124576 62156 -222967 -542390 -292419 305224
82 305224 424780 -63411 -291716 164836 566020 285102 -157933 -121333 98309 6505
92 6505 -141858 14953 177094 13279 -148552 30855 209545 -23043 -359868 -283967 60382
103 60382 110270 -228977 -466883 -221084 287386 489132 179804 -147936 60504 520235
113E20235p6798o12192k51917M39795L16775l92187m90148J49567M81864J12344
123A97338k28478q5011J17406M0106n3097K3391M5332p0634q0021Q2865J54837
134A44034J6452j21154n4593J44210K02145o1793l91415k82058K21627L69888
144A87343j43407n11800n6310N52531L44385l18391l49755K52845M78244m336
154D31349m16988k14653J76188J96497n5892j83259p9484P9813J20031K2947p7155
165f06n1483K0597P169k8122J397k1305j23572m6156K36686K72842j04664l11724
177a48941N9782M34269J45726l98260l49520J79346L16621j25466m10231j08659
187d05333L01675K64180q6208k44052l5716K32821J99441r2756k32402l7976J64371
$$ plain form
113 520235 443437 -168755 -420672 19123 335898 -56289 -546437 -396870 84994 197338
123 197338 -31140 -116151 1255 41361 -11736 11655 56987 -13647 -93668 -10803 144034
134 144034 160486 39332 -15261 128949 331094 269301 -122114 -404172 -182545 187343
144 187343 43936 -467864 -524174 28357 372742 54351 -295404 -42559 435685 431349
154 431349 14361 -200292 -24104 172393 116501 -66758 -146242 -66429 53602 76549 -606
165 -606 -52089 -31492 -24323 -52445 -51048 -72353 -195925 -242081 -5395 267447 162783 -148941
177 -148941 -89159 345110 490836 92576 -256944 -77598 239023 113557 -296674 -405333
187 -405333 -103658 160522 74314 -169738 -205454 27367 226808 134052 -98350 -136326 28045
198B8045P1211j02542m8922Q9408N2552k9295M3355Q1869r9104k14858M869K15683
210I2271P16l26875j86969K54049L19872o6780k72868P105L25766K13503j60371
221A99419k89834k7199K44482J27229k17549k76886N0776K76610Q1115j90628
231b2465j20140J19479J22597o6716j14796j1574Q381m0404K8544J21352K6904
242E1162j15138q444K20323J78145j22300k47465k5009J96757P5529k26495k69955
253b92890L5479K76553J08547k18092j92366J69814L22654K2638k78166j40769
263a86598J81446J83551r4010j92084r79J46281P7852k4629k3108k979k2333q633
275C3777K7286j8447j28211j33105K3308J51689O5137j18934j03678J40252K70828
$$ plain form
198 28045 99256 -3286 -52208 37200 89752 60457 103812 185681 86577 -128281 -123412 92271
210 92271 92987 -233888 -420857 -166808 153064 86284 -186584 -179479 146287 359790 199419
221 199419 -90415 -117614 126868 254097 36548 -240338 -189562 87048 168163 -22465
231 -22465 -142605 -23126 99471 32755 -82041 -93615 -85234 -125638 -97094 24258 51162
242 51162 -63976 -72420 147903 326048 203748 -43717 -68726 128031 203560 -22935 -292890
253 -292890 -257411 19142 127689 -90403 -282769 -112955 209699 232337 -45829 -186598
263 -186598 -5152 178399 84389 -107695 -108674 37607 115459 90830 67722 64743 42410 33777
275 33777 61063 42616 -85595 -218700 -195392 -43703 21434 -97500 -201178 -60926 209902
286B09902N6993k23601j55795J64255K31747r2144l27055j06220K36296J88902
296A83280j38760k26263L2469K21424Q3889j39119j43161J7268R3404J9103o2792
307e9258m3242K3039O1535P4526P2357J9016o0235n1495N5590Q6393o8285k19476
319a09535j16679J33956J62074r0046k24604O796K77110J72885j52365k11752
329a52160O2761K40056N5576k07624j67171R6072J95014J8729j43809o7384R7305
340B7365J06404k4574j02968o3905j1801q000p176M620k1692m9152K4202J49725
352B3048J30602n0314j30496L1097J87784N9421k00763k09901N8890K09763J5567
363A24698k24907j35058J59784K22865k9423k15023p6533J53152J32507q2975
$$ plain form
286 209902 266895 43294 -112501 51754 283501 191357 -135698 -241918 -5622 183280
296 183280 44520 -181743 -149274 72150 156039 16920 -126241 -108973 -15569 3534 -59258
307 -59258 -102500 -79461 -17926 56600 128957 147973 87738 36243 91833 178226 109941 -109535
319 -109535 -226214 -92258 69816 -20230 -244834 -238038 39072 211957 59592 -152160
329 -152160 -89399 150657 206233 -1391 -168562 -72490 122524 141253 -2556 -69940 27365
340 27365 133769 109195 6227 -57678 -69479 -77479 -84655 -80035 -101727 -150879 -126677 23048
352 23048 153650 103336 -27160 3937 191721 251142 50379 -159522 -100632 109131 124698
363 124698 -100209 -235267 -75483 147382 117959 -97064 -173597 -20445 112062 29087
373B9087j64593j2730J34191R1868k6792l9928K7658N3857L0194P813k4971q3420
385B2234r3313m200O9472l498j30625q9186J16446J99167J7815j67651o7160J75359
397D4860J78521q5380k33688m7556J94959J34909j23686j85608L5840J97622P0504
408A81297j39009j35819L0171R3971j0089j02996o3828K3353N1281L9200L8981
419F513K4337j1809L854Q0199Q5303m7700j55180o2927J07215R0463j11702j89998
431a81432O796K09786J11242j46710j73525P1174K09163K8350j96525j34585J10239
442h6027J76472k650j33671l1667J27352J12815k5385q5991l3089J3361m709l0985
454d174l7566m8349m9492Q736Q9069P1712m3760q0638N2441J66706N4200j53246
$$ plain form
373 29087 -135506 -148236 -14045 77823 51031 11103 38761 92618 122812 130625 105654 22234
385 22234 -71079 -75279 -5807 -9305 -139930 -229116 -112670 86497 104312 -63339 -130499 44860
397 44860 223381 138001 -95687 -143243 51716 186625 62939 -122669 -86829 110793 181297
408 181297 42288 -93531 -63360 30611 20522 -82474 -146302 -122949 -71668 -32468 6513
419 6513 30850 19041 22895 103094 188397 140697 -14483 -77410 29805 120268 8566 -181432
431 -181432 -174636 35150 146392 -318 -173843 -102669 106494 134844 -61681 -196266 -86027
442 -86027 90445 87795 -45876 -77543 49809 162624 137239 51248 18159 31520 26811 -4174
454 -4174 -41740 -90089 -139581 -130845 -41776 29936 -13824 -94462 -42021 124685 178885 25639
466B5639j45173Q0887J80677r636k03366r4196J62843J83526n6157j93808m1699
477a10463J44548Q5999j14337j61938q403J12983N7997n1449m3536N1044Q8536
488E0981M4015O018m14k7658m9348m755M6988j0529j23217r1157Q5440J48568
500G4932j9038j64349m0859J74987J40079j09040k01130k988J82984Q9158j27558
511b822j38706O9438J93672O1683j22445r7122O9341J05824l8703j40079o9619
522a09538L1148K3922k1125j119K8450K20l703P1033R6989j7795j15810k5751
534d3079J17466O5982j20863j51008M2026J79761N9417j43990j31665P9423J74743
545A28213L994j90242j24197R7902J38777m7818j54702r878J62328J13088m4506
$$ plain form
466 25639 -119534 -38647 142030 132394 -70972 -165168 -2325 181201 125044 -68764 -110463
477 -110463 34085 120084 5747 -156191 -164594 -51611 6386 -45063 -88599 -37555 50981
488 50981 94996 101014 100600 72942 23594 18839 65827 55298 -67919 -159076 -73636 74932
500 74932 55894 -108455 -149314 25673 165752 56712 -144418 -147406 35578 124736 -2822
511 -2822 -141528 -72090 121582 183265 60820 -36302 33039 138863 100160 -39919 -109538
522 -109538 -78390 -54468 -75593 -76712 -48262 -48042 -51745 19288 116277 98482 -17328 -43079
534 -43079 74387 140369 19506 -131502 -89476 90285 149702 5712 -125953 -46530 128213
545 128213 132207 -58035 -182232 -84330 54447 6629 -148073 -157951 4377 117465 72959
556G2959o2663L5648N9735q706l6732j5311l7979p2707k1969O1574L7771o3434
568e1814o6720O2756J35273K0132j34319r8499R1728J56782j8744j86365p9637
579a69427J61334J78123n6032j73567L661J82595O9697j55633j55397L1967J04913
590B2234j0965j04001n0847M0747O0514L8587K8543J8646p314j1419K3682L9212
602H7619j9065q8896n2225O7147R6824l8546j45473k8053J69244J28480j21676
613E5380k05502J1075J86755M6622j74402j24235J12559J78922O910j21894l4290
624f2100J15545J12099k2495j06125n8022K1645K0313l3243m5779j0233Q091M676
636e5628K8946M9515n042o4604j66J11360N5893j29128j45565P1651J97124K9181
$$ plain form
556 72959 10296 45944 105679 96973 60241 44930 6951 -65756 -87725 -26151 11620 -51814
568 -51814 -118534 -55778 79495 99627 -34692 -133191 -41463 115319 96575 -89790 -169427
579 -169427 -8093 170030 113998 -59569 -55908 126687 196384 40751 -114646 -82679 22234
590 22234 11269 -92732 -143579 -102832 -42318 -3731 24812 43458 36144 24725 48407 87619
602 87619 68554 -20342 -72567 -5420 91404 52858 -92615 -120668 48576 177056 55380
613 55380 -150122 -139047 47708 94330 -80072 -204307 -91748 87174 94084 -27810 -62100
624 -62100 53445 165544 143049 36924 -21098 547 20860 -12383 -58162 -68395 -60304 -55628
636 -55628 -26682 22833 17791 -46813 -46979 64381 120274 -8854 -154419 -82768 114356 143537
648A43537j68228q4245J39839J52071n8553j73041m2426J16275O7784j07589j53703
659a68279l976J37103Q7466n6881p3121M5460J02816K2585m4629j0150J7055k7681
671B7768m0876J9431K5485n6574o2714O3337J19852j7276j45761n1231J23626
682E067J00235q8976j57600m098J45189Q3208q2412r9102O3952J68715N0566j27965
694E6779j12988N4785J05223l2529j29833m7428N6670K8534l5433n380M8818K1721
706H939j9941J5711M7662j6178q0337j6470R2132O2568p5730j08962K9398J46343
718H5135O8551j01127j20173L3324J20606q289j62085r5409J01160J28671m2231
729H133j28399N854J43520Q6119m8550n8036K1917L5501j9841l6574p028o138
$$ plain form
648 143537 -24691 -108936 30903 182974 124421 -48620 -91046 25229 93013 -14576 -168279
659 -168279 -172255 -35152 52314 -4567 -77688 -32228 70588 93173 48544 38394 55449 27768
671 27768 -13108 6323 31808 -24766 -87480 -24143 95709 78433 -67328 -118559 5067
682 5067 105302 16326 -141274 -145372 -183 83025 613 -98489 -34537 134178 184744 56779
694 56779 -56209 -1424 103799 71270 -58563 -105991 -49321 -20787 -56220 -61600 -12782 8939
706 8939 -11002 4709 52371 36193 -44144 -60614 31518 94086 18356 -90606 -61208 85135
718 85135 153686 52559 -67614 -34290 86316 78027 -84058 -179467 -78307 50364 8133
729 8133 -120266 -114412 29108 115227 66677 8641 30558 66059 46218 9644 2616 -3522
741c522k7843n620M0969K7798l9488n2808K7490Q8293J8230j07455r8931N3813
753g9074J30825M308j30661m4045J46762J38890o1889j46690Q250J42379M3547
764A52602j31012j26330J8906Q0136L778n9613k1667M2503M7635J0636o774J614
776A2414L809l773K492J6333o057n2899l2722O3406R7633j4015j18388l7052J16903
789D8084Q6977j05648j61861J1846J43240L0127j35184q4196J03305J47439P883
800I2012r4249k7836Q0325O8366l6668q6982l0105L3596J9909k8518k8582O794
812c1938J3220K766K0335L2769j9282p2725k1216P8096N4693p5259r6716N2566
824f2691J48132L1040j16389o1129J05731J16271n4243j54797n0402R0293O3791
$$ plain form
741 -3522 -31365 -36985 3984 31782 -7706 -60514 -33024 55269 73499 -33956 -132887 -79074
753 -79074 51751 56059 -74602 -118647 28115 167005 105116 -41574 -33324 109055 152602
764 152602 21590 -104740 -85834 -5698 -1920 -61533 -83200 -40697 6938 17574 10800 12414
776 12414 16223 12450 14942 31275 25218 -27681 -60403 3003 100636 86621 -31767 -68819 48084
789 48084 135061 29413 -132448 -120602 22638 52765 -82419 -166615 -63310 84129 92012
800 92012 -2237 -30073 50252 118618 81950 -5032 -35137 -1541 18368 -10150 -38732 -31938
812 -31938 -18718 -15952 4383 37152 17870 -54855 -76071 2025 56718 -18541 -115257 -62691
824 -62691 85441 116481 92 -61037 44694 160965 106722 -48075 -98477 -8184 55607
835E5607p1639j06600N804J00896N5228l9697m1462L3033N8790M259l6997j7044
847A78M220r599p122L0372K6147l4420m6121L6845Q3528q026j14498o3592P4835
860b7253Q3498n9316j29468m803J37306R0677o4639r1126M3535J27320L2866r9704
872C8893q2684L5976O9333k0630q6547l3712M5714M3546p266j8068M137M232p475
885a4551Q703K4883j1919n6827j8990O8354O9929l0729p6768J8833J14052M6017
897A40987j01045j09612K9905J02883o588j30128p6342P8459J10060j0879q9526
908f1826j1923R4037P2003l4872o9942o007M5214J6120k8855k5197J019P056Q230
921E057K1812J4669k8774m5948N635N0716J647q2339o2986N5320J04002L775r1753
$$ plain form
835 55607 -16032 -122632 -116828 -15932 39296 -401 -41863 -8830 49960 54219 17222 178
847 178 4398 -5201 -12323 18049 44196 9776 -36345 500 84028 76002 -38496 -102088 -27253
860 -27253 56245 -3071 -132539 -137342 -36 90641 26002 -65124 -21589 105731 138597 38893
872 38893 -43791 -7815 61518 40888 -45659 -79371 -33657 9889 2623 -15445 -11308 -7076 -14551
885 -14551 -5848 19035 7116 -49711 -68701 -347 69582 38853 -37915 -19082 94970 140987
897 140987 39942 -69670 -39765 63118 56530 -73598 -149940 -71481 38579 27700 -61826
908 -61826 -73749 20288 92291 57419 -12523 -18530 26684 42804 13949 -11248 -10229 -3173 5057
921 5057 26869 41538 12764 -33184 -27549 23167 24814 -57525 -120511 -65191 38811 42586 -49167
934d9167k6055J09198J05409m0783j17024k0431R1176M4382q6201j02907J3327
945g9076Q8543K6399o1530m4294L7521N8529O306l4464j9580L575N268N607J4020
958F824L311k1788p142M7632N7499j6609p5586k4916O3734M2827p3918j11070
970a09202r71J01646M7432p5137p1879N9627J20143K2628q6639n3391N5466P1042
982H0765k1999q1884k9180M6183M1568j3348l1366k574J5994P811j147n762k3516
995a8455l5392l513M0533K7762l4106m3188L7612R7652L3812p1132o1618M8775
1007A8742Q4004k2630j17554n8339O6828P5168l6602r0602m709R0573N9165m2076
1019B1968o4275P789N4746J6380l7202l0999J1229K6406J4406R339N843j0518
$$ plain form
934 -49167 -75222 33976 139385 98602 -18422 -38853 52323 96705 10504 -92403 -79076
945 -79076 9467 35866 -25664 -69958 -32437 26092 32398 -2066 -21646 -18071 -12803 -7196 6824
958 6824 10135 -11653 -18795 28837 86336 69727 -5859 -30775 32959 75786 1868 -109202
970 -109202 -110173 -8527 38905 -36232 -108111 -48484 71659 94287 7648 -45743 9723 80765
982 80765 58766 -23118 -52298 -6115 35453 22105 -9261 -11835 4159 11970 10823 5061 -18455
995 -18455 -53847 -57360 -16827 10935 -23171 -66359 -28747 68905 102717 31585 -30033 18742
1007 18742 102746 80116 -37438 -95777 -28949 46219 9617 -80985 -85694 4879 64044 21968
1019 21968 -42307 -34518 20228 36608 -594 -31593 -20364 6042 20448 29787 35630 25112
1031B5112j5640J2883L0191j3603p0294m8098L6251N8453k1253p9259j1392R6163
1043d86Q1854l6353q2463R749R5655L8448p9922q6116K0419P9865J1687o8959
1055a6622m2562M1919N9226m074m6638k2396J3750J0792r039j0447o340p565O851
1068c3145L9147M1260n908l8997J708N9819L1233o2231q5996K588P3782J6111
1080C9371q3975o5675N2366J00464Q271q1277l6862O8161P0716k8971q0611j5910
1092e3932N8169L9597k5957l5218J1673L6393J3865j1119j2869j4778k2554j0489
1104b7219J2947L351l6697l5145K9767P2901K3262n2408l2488O0343Q0814j8922
1116H0506r7239l7576O8986N9150n1013r1529J006Q7913M3443n5813o2097K1301
$$ plain form
1031 25112 9472 22355 52546 38943 -31351 -79449 -43198 15255 -5998 -85257 -96649 -486
1043 -486 81368 45015 -37448 -27699 67956 106404 26482 -59634 -39215 40650 52337 -16622
1055 -16622 -59184 -17265 41961 37887 -8751 -31147 -17397 -6605 -15644 -26091 -32431 -39996 -33145
1068 -33145 6002 47262 41354 2357 4065 63884 95117 32886 -53110 -50522 23260 39371
1080 39371 -44604 -110279 -57913 42551 50822 -30455 -67317 844 71560 42589 -38022 -53932
1092 -53932 4237 43834 17877 -17341 -5668 30725 44590 33471 20602 5824 -16730 -27219
1104 -27219 -14272 -10921 -47618 -82763 -52996 19905 43167 -9241 -41729 18614 99428 80506
1116 80506 -16733 -54309 14677 73827 22814 -68715 -67709 20204 63647 7834 -54263 -32962
1128c2962O0752L985n3597l4714J9299L0023N136m735P800J2528P770J7327K4449
1141F3061n436m6550l3917K4125L4075l4290p7444j3102P7790N8343m5253p1286
1153f9884K5444R7415K8908p9052o5965M0990P7568n164p4076k7681N6611N6802
1165F1916j4758m7857r292K7643P654k7112k5721o839o221p385J5558K9568J971
1178h75k3356J1087O2495L7151m9023o6062J6825P1226J812q8848n6060N5745
1190b7883P9136j5212q0920j8852P2111N3395m3402p5292k079N9939K6562l9223
1202a1720l3546K6332M6808J0381j3298L497J0281j1485j7679N266K014l9489
1214b2638m5575J6787N6420O219n6865k3325O6726P3122k2321p8825j4131P1179
$$ plain form
1128 -32962 27790 31775 -21822 -56536 -37237 -7214 -2078 -6813 987 13515 21285 38612 63061
1141 63061 57625 11075 -22842 1283 35358 1068 -76376 -89478 -11688 46655 1402 -69884
1153 -69884 -44440 52975 81883 2831 -63134 -22144 55424 50260 -23816 -51497 5114 61916
1165 61916 47158 -699 -9991 17652 25306 -1806 -27527 -34366 -40587 -47972 -32414 -2846 -875
1178 -875 -24231 -13144 49351 86502 37479 -28583 -11758 59468 61280 -27568 -83628 -27883
1190 -27883 51253 36041 -44879 -63731 8380 61775 18373 -56919 -58998 941 27503 -11720
1202 -11720 -45266 -18934 27874 38255 24957 28454 38735 27250 9571 14837 16851 -22638
1214 -22638 -68213 -51426 4994 11213 -45652 -68977 -2251 70871 48550 -30275 -44406 26773
1226B6773M4426n5740p6207J6334Q4966K9242o2117n1027L6841O0397j1195o1754
1238a9061k5554K3542J1077k1616j0216J7067J1611o57J8580L6806O004l4824
1250A2759j5816L8540L1896m1314p5888r180O6955L9145n3294o6977K9127R0949
1262D6902J7432q3021n5990N3896P3591k4404q0940j2913O9263M7332k4714l1922
1274e488J5792L2758K278k1871j6014r817j5214r655O860O266j6520k2522J6620
1287c6527N6488L0309l8741m8851K7772P3517R48q7835m6497O8479P3900l8969
1299C3993q8481N077R1705L8037o4882o5920J5083M9435j75m5741k7114K0930
1311c8053L4470J0093p848K874J9496J2404r31J953p41k6264l5266Q784M1954
$$ plain form
1226 26773 71199 15459 -60748 -44414 40552 69794 7677 -43350 -6509 53888 42693 -19061
1238 -19061 -44615 -21073 -9996 -31612 -41828 -24761 -13150 -13807 4773 41579 47583 12759
1250 12759 -3057 35483 67379 26065 -49823 -59003 7952 47097 -6197 -73174 -44047 46902
1262 46902 64334 -18687 -74677 -20781 52810 28406 -52534 -65447 3816 51148 26434 -5488
1274 -5488 10304 43062 45340 23469 7455 -2362 -17576 -27231 -20371 -14105 -30625 -53147 -36527
1287 -36527 19961 50270 11529 -37322 -9550 63967 64915 -22920 -69417 -938 72962 33993
1299 33993 -54488 -49411 42294 80331 15449 -50471 -35388 14047 13872 -31869 -58983 -38053
1311 -38053 -3583 6510 -1338 1536 21032 33436 32505 34458 33717 7453 -27813 -19029 22925
1324B2925m970o6435k5044P1512O4983m4425q1942J6927Q9541J7859q0892n6863
1336g6824M5368P1997n58n4564j8317M6714N0403j0755n0883j9947K7058J5630
1348B5322l3157l7682L812J8625l154L51K8669J5060k7283j1580M8501M0237m3431
1361B4290o6648J5401P0387N245p2162l6393N6525O5627j8516o9681k2695N0926
1373B306M3987l3699p0661j1569N8446L6875l3407l5499L1624N4752L564k8482
1385A8237p06J5645j3794k5269P071J3772k9321l8220J9768N2747K389n0998j7159
1398d5838N1378M7043k7819o6919j2093O0283M7461l5133o5300R662Q0211L4665
1410G7601n7258n2652L4062N3782k2671o8501j7826L4618J4705j9692p542J5730
$$ plain form
1324 22925 17955 -48480 -73524 -2012 62971 18546 -63396 -46469 43072 60931 -19961 -76824
1336 -76824 -31456 40541 39983 -14581 -32898 13816 64219 53464 2581 -17366 9692 25322
1348 25322 -7835 -45517 -41705 -23080 -26234 -25883 2786 17846 -9437 -21017 27484 67721 24290
1361 24290 -42358 -26957 43430 48675 -23487 -59880 -3355 62272 43756 -25925 -48620 2306
1373 2306 46293 12594 -58067 -69636 -11190 25685 -7722 -43221 -11597 43155 46719 18237
1385 18237 17531 33176 19382 -5887 1184 14956 -14365 -52585 -32817 19930 22319 -28679 -45838
1398 -45838 5540 52583 24764 -42155 -54248 6035 53496 18363 -46937 -37275 42936 77601
1410 77601 20343 -32309 1753 55535 32864 -35637 -53463 -18845 -4140 -23832 -31374 -15644
1422a5644P807Q66J9704K5072o639l0988q523K5282J7131k4524m1244m2M8737
1435A6995L2639l8112n9004J4553P3341J4121p8937n5976M8746O7190k4008o8114
1447e6566M541P1517L6468k9809k9341J2959K3889J090j6236j7284j3565p952
1459b0289k32M401L570j465n452N619K4577J5550k6027l7382J8271N8198L114
1472D2453p0748l5331O4846P0445k8506p0186M646O6130J5699n9671m8605J7017
1484c1811L7943k624l5254k1002J9944L6499J4964j0236n490J3645J0377q493
1496A8462p253L636r043k1914L317L1552J446m5225j7641N2230M5111l8549o7556
1509e1427M682O0151J4690n2424l5023L7012N7318M744m0771j7384L6894M2623
$$ plain form
1422 -15644 -7837 -6971 12733 37805 31166 178 -8345 16937 34068 9544 -31700 -31742 16995
1435 16995 49634 11522 -47482 -32929 40412 54533 -24404 -80380 -31634 35556 11548 -56566
1447 -56566 -52025 19492 55960 26151 -3190 9769 33658 34748 18512 1228 -12337 -20289
1459 -20289 -20521 -16120 -12550 -14015 -19467 -13848 10729 26279 252 -37130 -18859 39339 42453
1472 42453 -28295 -63626 1220 71665 43159 -27027 -22381 43749 59448 -223 -48828 -31811
1484 -31811 6132 3508 -31746 -52748 -32804 3695 18659 8423 2933 16578 26955 18462
1496 18462 11209 14845 5802 -16112 -12795 18757 20203 -25022 -42663 9567 54678 16129 -51427
1509 -51427 -46745 13406 28096 -24328 -59351 -22339 34979 39723 -1048 -18432 18462 61085
1521F1085r822n0717k5759K0490J5973k0837k3786P976J6337l277k937J8169J0309
1534A3204j7552q222K8499J9163l2761m1436J7481N5382J1478m6381k9666L3846
1546C035M8220q418n6245k8640L2095L5474k5692n7374n875N4970L6836k3371
1558E015k9359K0321L8815K857k3158p960O414n085j0755K242L413j4922j2899
1571b5061J7507K8757k760l5181j7301K5981L2153j2831m6418j4492M3785M3482
1583C7621j8831m6041R499O2270K5435m9135m8862J7761M0787r039m7881k1002
1595d7418K2133K1884k664q976L546J1031P358N174J563p515j2354k407J5013
1608F368J3854j0609k5460j33L6377K5830k9098m6153M946M5829P559n5102m0726
$$ plain form
1521 61085 51263 546 -25213 -4723 11250 -9587 -33373 -25397 -9060 -12337 -15274 2895 13204
1534 13204 -4348 -12570 15929 35092 2331 -39105 -21624 33758 45236 -1145 -30811 3035
1546 3035 51255 42837 -13408 -42048 -9953 25521 -171 -57545 -63420 -8450 28386 5015
1558 5015 -24344 -4023 34792 37649 14491 6531 12945 7860 -2895 -653 2760 -12162 -25061
1571 -25061 -7554 21203 18443 -16738 -34039 -8058 24095 11264 -35154 -49646 -5861 37621
1583 37621 18790 -27251 -17752 44518 69953 20818 -28044 -10283 30504 21465 -26416 -47418
1595 -47418 -25285 -3401 -6065 -15041 -11495 -464 6894 12068 13631 6116 -6238 -8645 6368
1608 6368 20222 9613 -15847 -15980 20397 46227 17129 -29024 -24078 21751 29310 -25792 -66518
1621f6518L2313N3336l489m4387o922M6311L7922j3509l3807m565K1216Q720j8444
1634H177k2659l052J0576O267j148l48j515m965J915J4506O540k2361k6749J1439
1648b3377L9076Q087l6162j9165L8848M7059j0956m9912j2336L8571K4040l4811
1660H962n0316k000L8555J7480k5725k5009J6645L5961J0231j8683j2095Q827
1672B833R957l398o779j766m598l881J0252J9363j47k5043j3060K2953K2524k2406
1686F804m5730p504M0051K4897k8060l5050J8255N4891J9078l5256k9928K2089
1698D537L8021o919m3954k1667K1182K1805j0553k1492q86J7681R279l370l573
1711I1k760p020m210R568J0585j0217j8144P580L5162J9118k3838k8404J3831
$$ plain form
1621 -66518 -34205 19131 15642 -28745 -35667 10644 48566 35057 1250 -3315 17901 26621 8177
1634 8177 -14482 -17534 -6958 -691 -1839 -2187 -3702 -8667 -6752 7754 14294 -8067 -34816 -23377
1648 -23377 15699 23786 -12376 -31541 7307 54366 43410 -6502 -18838 19733 43773 8962
1660 8962 -41354 -43354 -4799 12681 -13044 -38053 -21408 14553 24784 6101 -5994 2833
1672 2833 12790 9392 2613 847 -3751 -7632 2620 21983 21836 -3207 -16267 6686 29210 6804
1686 6804 -38926 -46430 -6379 18518 -9542 -44592 -26337 28554 47632 12376 -17552 4537
1698 4537 42558 35639 -8315 -29982 -8800 13005 2452 -19040 -19926 -2245 7034 3664 91
1711 91 -2669 -9689 -13899 -4331 6254 -3963 -22107 -14527 20635 39753 15915 -12489 1342
1724A342L8203j496m9224l3519K3903L7082j0894m4504q922M2645L5908j4866
1736A5658l2079L048L2589J1596k2383k1350M121J4531K625o047l36J820j389
1749B404K063J0100L46k1445k0896P851K4291k850l2967j2214L6419M1003p905
1762B6200l7543k026M3928K4661l3879m6641L631L8241O764l6593k6304K0091
1774a9470L3718J152k3625q481J5135J1855o880j0856j526J083l86P628J4107
1787A3454K133j2772l826K2144J9110j9977l9387o107L1324J2113l6044l6360
1799e4195J9230M9364R972l5894j8768L2782L8985r156m0637j2584K6374J9817
1811B5290j6556k5221K647K1605Q583j0069p389K043j347o998P08L922r948j8202
$$ plain form
1724 1342 39545 38049 -11175 -44694 -20791 16291 5397 -39107 -48029 -5384 30524 15658
1736 15658 -16421 -13373 19216 30812 8429 -12921 -8800 5731 8356 2309 1973 3793 2404
1749 2404 4467 14567 14913 -6532 -27428 -19577 4714 1864 -31103 -43317 -6898 34105 26200
1762 26200 -11343 -13369 30559 55220 21341 -25300 -21669 16572 23336 -13257 -39561 -19470
1774 -19470 14248 15400 -8225 -16706 -1571 10284 3404 -7452 -8978 -7895 -8281 -653 13454
1787 13454 15587 2815 -1011 21133 40243 20266 -19121 -25228 6096 18209 -17835 -54195
1799 -54195 -34965 14399 24371 -11523 -30291 2491 41476 32320 -8317 -20901 5473 25290
1811 25290 8734 -16487 -13840 7765 16348 6279 -1110 933 -414 -7412 -6704 -2782 -12730 -30932
1825c0932N173K9907J5725k0972j8006K5127L9310k795m3107k0921K7443K6691
1837C2643k2710m5744n061L9102K4559k3287k9730J1271L5201P251k7639j7916
1849b2060J3758J6974n554j0150M572R203M20J065J1753M182j7997j6929Q936
1862a827J6881j2428l4778r926K9843K6786j4497k9573P700M3679K1725k9900
1874A3685l4785J3343L7885N12m0607k0833K6311K7907j0891k4999J843J9196
1886H567K705j3376p543R67l723n510O966J2328j397j0278M661K4523J6867j4186
1900B1571k6804O15K7590P600l6346l5054J6732M1144j025m1758j3971L9704L3575
1913C3573k0256l5073L557L0161O929k2153j3247J0543J5325L184k765k64O95
$$ plain form
1825 -30932 -25759 4148 19873 -1099 -19105 6022 45332 42537 -570 -21491 5952 32643
1837 32643 9933 -35811 -40872 -1770 22789 -498 -30228 -18957 16244 23495 -4144 -22060
1849 -22060 -8302 8672 3118 -7032 -2460 6743 7163 8228 19981 24163 6166 -10763 -1827
1862 -1827 15054 2626 -32152 -42078 -12235 14551 54 -29519 -21819 21860 43585 13685
1874 13685 -21100 -7757 30128 30640 -9967 -30800 -4489 23418 12527 -12472 -10629 8567
1886 8567 11272 -2104 -9647 -8680 -12403 -17913 -10947 1381 -16 -10294 -5633 18890 35757 21571
1900 21571 -5233 -4618 22972 30572 -5774 -40828 -24096 17048 16023 -25735 -39706 -2 33573
1913 33573 13317 -21756 -18199 11962 18891 -3262 -16509 -5966 9359 12543 9778 9514 10209
1926A0209k179k212J261j701j2875j6743o07J9691R526j9771j7121K5244M1340
1939C4062k958m2336j0585M0598K6671l2796m2542Q001L8253O481k9451j7833
1951b4435J8266K3675k102k1396j2259Q407J1079l761j2056j061R426M760J747
1964B90J1349J0749q633j4312R879K0616j2984l9432q903L4387J8194l2157l3079
1977d4036K0058M4038N122l3260j6599K3438K6384r739l0352q746K5088K2353
1989B3749j0477k3030K170K2919P389j4579r181M356m970j5879o82J3964j250
2002e501j9290J812L1335J5795k1663j8679K1742L2294o851l8296j7985K2546
2014b741K6050j0457l2442o982L0737K3878k0013l2564N524L2432M643k9945j7103
$$ plain form
1926 10209 8030 5818 7079 5378 -7497 -24240 -24847 -5156 4370 -15401 -32522 -7278 34062
1939 34062 31104 -11232 -21817 18781 45452 12656 -29886 -21885 16368 22849 -6602 -24435
1951 -24435 -6169 17506 15404 -5992 -18251 -9844 1235 -2526 -14582 -15643 -6217 -1457 290
1964 290 11639 22388 13755 -557 9322 29938 16954 -22478 -31381 3006 21200 -10957 -44036
1977 -44036 -23978 20060 25182 -8078 -24677 -1239 25145 15406 -14946 -23692 1396 23749
1989 23749 13272 -9758 -7588 15331 22720 8141 -1040 3316 -1654 -17533 -18215 -4251 -5501
2002 -5501 -24791 -22979 8356 24151 2488 -16191 5551 37845 30994 -7302 -25287 -2741
2014 -2741 23309 12852 -19590 -26572 4165 28043 8030 -24534 -19010 13422 18065 -11880 -28983
2027b8983J7355J6675o086l881J2424Q509p283j813J2532K859j9296j5539R404
2040c123J2837j1655k5634n070K5627K6197p444k9373m816L2919K3125k4186l5401
2053b5997J0271L8794K522l8141j4291L2056K6748j3318k4226J61J0330k401r060
2066f552j919j327o507k174R542J0090j23l719M639J4554R420j1087k3129l357
2080a1649K4883J3460k8491l3816J4622M2036J769m0086j3856L5124K5100k4027
2092E069l3397M508K6916Q573j3201r383O360J2384P620o13m896k123N81k910
2106E488o627m219l803p543L5J5255R122j7378j7021K0565L6012l642l7827j2350
2120b3933L1713K1492k3941k8949J1322L2261M760k4256j6656J2210K0579j50
$$ plain form
2027 -28983 -11628 5047 -1039 -4920 7504 16013 8730 6917 19449 22308 3012 -12527 -3123
2040 -3123 9714 -1941 -27575 -32645 -7018 19179 11735 -17638 -22454 10465 33590 9404 -25997
2053 -25997 -15726 23068 25590 -12551 -26842 5214 31962 18644 -5582 -5421 4909 2508 -6552
2066 -6552 -8471 -9798 -16305 -18479 -8937 1153 1030 -2689 1950 16504 25924 14837 -8292 -11649
2080 -11649 13234 26694 -1797 -35613 -20991 21045 22814 -17272 -31128 3996 29096 5069
2092 5069 -28328 -23820 3096 11669 -1532 -10915 -4555 7829 15449 14836 9940 7817 8398 5488
2106 5488 -1139 -5358 -9161 -16704 -16669 -1414 7708 -9670 -26691 -6126 29886 26244 -11583 -23933
2120 -23933 7780 29272 5331 -23618 -12296 19965 24725 469 -16187 -3977 16602 16452
2132A6452k1617j6711M825J3699k76r139J443J2022M982j711N193P243o754j1156
2146a505P685J4592j1273k9307l958K8593J5628k2148k3625J2309K8326K503k5943
2159h123j5625J5613K3172l251k5688j0341K2750K5504m329k0364j469J6799L339
2172A7987j4759r653L723J8q898j524P112l13q468O401K0313O729j8252j5114
2186a4698J1826K1827j056k3621j2965J5098K2129l265k4393p026K4510J9023
2198B7389j8291l1163j0K4493O426k0130j3411J3213J5925M7l470M892N579j764
2212I725j113L278l796j2766p105Q201J0398m549j5479m611J6304J7698o589k2750
2226a3154n217K1768J4709j9448k5306R478L2294Q203k3503j3528J8206K0624
$$ plain form
2132 16452 -5165 -21876 -17051 -3352 -3628 -12767 -11324 698 5680 3969 9162 16405 9651 -1505
2146 -1505 6180 20772 9499 -19808 -23766 4827 20455 -1693 -25318 -13009 15317 17820 -8123
2159 -8123 -23748 -8135 15037 11786 -13902 -24243 -1493 24011 19682 -682 -2151 14648 17987
2172 17987 3228 -6425 -2702 -2684 -11582 -13106 -5994 -6307 -14775 -8374 11939 18668 416 -14698
2186 -14698 -2872 18955 17899 -5722 -18687 -3589 18540 15275 -9118 -16144 8366 27389
2198 27389 9098 -22065 -22075 2418 8844 -11286 -24697 -11484 4441 4488 1018 5910 11489 9725
2212 9725 8612 11890 8094 -4672 -11777 -3576 6822 2273 -13206 -17817 -1513 16185 9596 -13154
2226 -13154 -18371 3397 18106 -1342 -26648 -17170 15124 23327 -176 -13704 4502 25126
2238B5126n644j9584p017O300K071p295p136p05L284M410N220L841o00k862R45
2253C54R211N819r317j6904q01J8802J0816j6447j8334J0573K6728J016k7357
2266e841j5210J6906J8680j1482k5462l496K0901J4710p183j0478M862J5973O606
2279A9486p410q050j064J727k288l567k090l529n090L617J1516N422j1597j1081
2293a3998R776J8228l806k2849q542J9862J9191r676k0770K166K5614J3350j6683
2306A1863k0797K949J6389J146j9611j4348O876J3735J02p550k20R282O424O75
2320F915M71L1m924n214M423P819m372j3964k656J5950J2847j0859j9092J089
2334a1536J9606O304k0651j9593Q038K2944M344j8592q674J8098K1539k857j7391
$$ plain form
2238 25126 19482 -102 -7119 -819 1252 -6043 -13179 -13884 -10600 -6190 -970 2871 2271 -591 354
2253 354 9565 15384 6067 -10837 -11638 7164 17980 1533 -16801 -6228 20500 21516 -5841
2266 -5841 -21051 -4145 14535 3053 -22409 -25905 -5004 9706 2523 -7955 -3093 12880 19486
2279 19486 12076 4026 2962 4689 2401 -1166 -3256 -6785 -11875 -8258 3258 8680 -2917 -13998
2293 -13998 -4222 14006 10200 -12649 -21191 -1329 17862 8186 -12584 -10418 15196 28546 11863
2306 11863 -8934 -5985 10404 11550 -8061 -22409 -15533 -1798 -1696 -9246 -9466 -184 6240 6915
2320 6915 7386 7417 2493 -2721 1702 9521 5149 -8815 -11471 4479 17326 6467 -12625 -11536
2334 -11536 8070 14374 -6277 -25870 -17832 5112 9456 -9136 -17810 288 21827 18970 1579
2347A579m103J1669O198j0479j2422j171M099J88o97J429O25k763J015Q591M911
2362H669p999j2245L468J5292N040j5053j1467J2435K2534o3k1559j0396J6510
2375E166J5132j2392k5711m607J7803J0204j1294j3256O892J8473N598p546m998
2388e36M592N099k072l862j579k428l791J998P711J936r454p257Q675J2328m914
2403F446j9609p175J6326J4386j0155j8755L999K5299J2489j4662j6216Q543J9054
2416A9970p23k0989j2653Q639J0017m654j1123p25Q713N652j291o00J359j647
2430e5l101K940N911k484j1051p35J4625J1697r802j5867L576J9485L951k1854
2444b764j8393R244J9348l018k1483p199J9288J8915m939j5191J249J6127O388
$$ plain form
2347 1579 -2524 9145 15343 4864 -7558 -8729 -4630 -4442 -5139 -3710 -3085 -5848 -4833 3758 8669
2362 8669 670 -11575 -8107 7185 12225 -2828 -14295 -1860 20674 20611 -948 -11344 5166
2375 5166 20298 7906 -17805 -22412 -4609 5595 -5699 -18955 -12063 6410 12008 4462 -536
2388 -536 4056 9155 7083 3221 1642 -786 -4577 -2579 5132 7068 -2386 -9643 -968 11360 6446
2403 6446 -13163 -20338 -4012 10374 219 -18536 -14537 10762 23251 8589 -7627 916 19970
2416 19970 19247 -1742 -14395 -5756 4261 -393 -11516 -12241 -3528 2124 833 233 1592 -55
2430 -55 -3156 -216 5695 3211 -7840 -8575 6050 17747 7945 -7922 -4346 15139 19090 -2764
2444 -2764 -21157 -11913 7435 4417 -17066 -24265 -4977 13938 8999 -6192 -4943 11184 17572
2457A7572j1108j1097J383O313q26n035k16K450j296n77N119M565p655j1038K141
2472i305J2869J776j5432q877J4087K0583j803j8471l884J9670J4879j4108k2973
2485a0989n97J7523M893j7776j4267Q844J7055J270j1249k135R516N923m361m556
2499i06J155M12m265R12P488K627p748m582R900J1597o591j7863n309J4864Q887
2514A0578j5090j9533O043K3404P565j6546j0847J4857K0594l148k0234n994J3525
2527E174P686j0736j2308K417R329J417m407j14L498j494l828J359M410l217r776
2542a0590j139J2531R068q288j1098P808K0154L240j9528j4367J1951J6786q928
2555G600k4122n086J9186J2311j1669j4393P500J7512L301j1530o467N528O010
$$ plain form
2457 17572 6464 -4633 -3250 3063 2237 -2798 -3014 -564 -1860 -2437 2682 7247 -408 -11446 -9305
2472 -9305 3564 5340 -10092 -18969 -4882 15701 13898 -4573 -8457 11213 26092 11984 -10989
2485 -10989 -11586 5937 10830 -6946 -21213 -12369 4686 5956 -5293 -7428 2088 8011 3650 -906
2499 -906 249 661 -3604 -2692 4796 7423 -325 -4907 4993 16590 9999 -7864 -13173 1691 10578
2514 10578 -4512 -24045 -18002 5402 12967 -3579 -14426 431 21025 17877 -2357 -8351 5174
2527 5174 12860 2124 -10184 -7767 1562 2979 -1428 -1542 1956 462 -3366 -2007 2403 -814 -10590
2542 -10590 -11729 802 9870 1582 -9516 -1708 18446 21686 2158 -12209 -258 16528 7600
2555 7600 -16522 -21608 -2422 9889 -1780 -16173 -8673 8839 12140 610 -5857 -329 5681
2568E681k812n139J155K899p92j064M863M489m959r358J428J0344j103j7361r910
2583b1639J3864J7418o656j8718J659K4034J2645j5524j6403P351J7758j321j9383
2596d915r524J1010J1873m779j1659q01R489M516m780m429J744J648m430j300
2610f337O563L053o198l408J1541J1899o416j5815N93J6833M292j9596j6495P828
2624a1663J7727j069j7703n388J6364J5815o008j6125n93J5545O998j0213j1761
2637h074M205R692j014n883J615N493j759o073J161N021m748j0762M9J1897K822
2652C642j2528p255J3432J8340j030j6348n316J4098J2004j0015j8979q47J5717
2665D915N988j5023j2411R112J6512p14j3143l937Q520M082o408l333M669K845
$$ plain form
2568 5681 2869 -2270 -1115 1784 992 -72 4791 9280 4321 -5037 -3609 6735 5632 -11729 -21639
2583 -21639 -7775 9643 2987 -15731 -14072 9962 22607 7083 -9320 -1969 15789 14468 -4915
2596 -4915 -14439 -3429 8444 3665 -7994 -8795 694 5210 430 -3999 -2255 -607 -5037 -6337
2610 -6337 226 3279 -2919 -6327 5214 17113 10697 -5118 -4525 12308 16600 -2996 -19491 -11663
2624 -11663 6064 4995 -12708 -18096 -1732 14083 8075 -8050 -8643 6902 13900 3687 -8074
2637 -8074 -3869 5823 4809 -1074 541 6034 4275 -1798 -637 4384 -364 -11126 -11077 820 3642
2652 3642 -8886 -16141 -2709 15631 14601 -1747 -7063 7035 19039 9024 -9955 -10802 4915
2665 4915 10903 -4120 -16531 -7419 9093 8379 -4764 -8701 -181 3901 -2507 -5840 -1171 1674
2679A674l904L60P771L660o348m705P325P996p251j5805m797J1889Q663q494j5266
2694a7232L080J8222Q179j2775j1338J1091J7711l815j9238o061J3594J0086p931
2707C573r546L107P606n23m555N28J796k974m964L69L263k344n148K055J1301
2722C544P157p049r635M999J5572L108j6222j3740Q686J4519n857j8498k714J7654
2736A524J0451j0630j3407M672J3899J601j0352m719M129M554j536j879K543L158
2750D008M24l24K351Q87o221o895J710P736j334j2715p387J1701J4970l159j4003
2765h251L44J6670P964j3388j3534N606J5441M89j5193q008R065J1254j204q943
2779a688k351N330K545n261m259J629J243k373K35N333K493m007r22R411P373
$$ plain form
2679 1674 -2230 -1870 5901 9561 3213 -1492 5833 13829 6578 -9227 -14024 -2135 6528 -1966 -17232
2694 -17232 -14152 4070 12249 -526 -11864 -773 16938 13123 -6115 -12176 1418 11504 3573
2707 3573 -5973 -2866 4740 4217 -338 190 1986 -988 -5952 -5583 -2320 -4664 -9812 -7757 3544
2722 3544 10701 3652 -5983 -984 14588 17696 1474 -12266 -3580 10939 5082 -13416 -16130 1524
2736 1524 11975 1345 -12062 -7390 6509 8110 -2242 -6961 -2832 1722 186 -1693 850 4008
2750 4008 4432 4108 6459 7346 1125 -5770 -4060 3676 2342 -10373 -17760 -6059 8911 5752 -8251
2765 -8251 -7907 8763 16727 3339 -10195 -4589 10852 11341 -3852 -11860 -2795 8459 7255 -1688
2779 -1688 -4039 1291 3836 -1425 -5684 -4055 -2812 -5185 -4950 383 2876 -1131 -2053 7358 14731
2794A4731o281j3181k54J1859L342j3738j1340O867J4179J92j3246n789J2287
2807c72J2007m831j3784l033J0950O748o812p897M442Q218R23n045k46L589p71
2822D086l930j35J139m946p110J641R471L365q347n371R041J1738o49j1432m613
2837f052R709Q475p231j4400q10J4186P852r942j1703M531J2700K48j0591n873
2851h901N945M296l999l417K221L754M27J551L969J480m562l197M218M144m383
2866C546j0349k849P979O180n291r970J656J4379N808j0853j1234N989J3581j4
2880H558j2987n882J0308R966m070q208J275P069J771n207m513m64j03j435k97
2895d219J383r44k617K050P067M497l223o238J910Q721J883j0693q883O009J1759
$$ plain form
2794 14731 8450 -4731 -4985 6874 10216 -3522 -14862 -7995 6184 6376 -6870 -12659 -372
2807 -372 11635 6804 -6980 -10013 937 7685 873 -7024 -2582 5636 6559 1514 1268 4857 4086
2822 4086 156 21 1160 -3786 -10896 -9255 216 3581 -4766 -10137 -1096 10642 9993 -1439 -6052
2837 -6052 3657 12132 4901 -9499 -10309 3877 11729 1787 -9916 -5385 7315 7563 -3028 -8901
2851 -8901 -2956 1340 -2659 -6076 -3855 -101 326 1877 5846 7326 2764 -433 3785 7929 3546
2866 3546 -6803 -9652 -1673 4507 -784 -10754 -9098 5281 11089 236 -10998 -5009 8572 8558
2880 8558 -4429 -10311 -3 9963 5893 -2315 -1040 6029 7800 2593 -1920 -2384 -2487 -3922 -4219
2895 -4219 -2836 -3780 -6397 -4347 2720 7217 3994 -2244 -334 8387 10270 -423 -9306 -3297 8462
2910H462j563j3238m225J1643R878p180j1999O0R860L469q349o533L702P911J966
2925C864k633m95L080K238k65j216j072k739m421m63L858L62o052l689O687R649
2941F693k080j0203j669J0578P240p916j1782K183J2058M204r076o793N773J0190
2955I400k01r898n156M683L916l814o243q26L751K437l04J813K348O6l55K727
2971D344M087l541q095j372O778M258p210q529L223J1086K765j0243o839O238
2985c050R732k118j1348m772R182Q658l223p688J160R490M060m601m654L68K165
3000C361j993l867q55n18j976N11M024L406k861l744L821P510L27q598n333O001
3016g84Q611k712j0287k198J0863Q059o246j0742P56R491K100r382q279L776P317
$$ plain form
2910 8462 6899 -6339 -10564 1079 10957 3777 -8222 -8162 1698 5167 -3182 -9715 -6013 1898 3864
2925 3864 1231 736 3816 6054 5789 4573 3501 762 -3659 -4122 -264 98 -5954 -9643 -2956 6693
2941 6693 4613 -5590 -7259 3319 10559 2643 -9139 -6956 5102 9306 230 -6563 -790 9400
2955 9400 9199 -699 -5855 -1172 2744 -1070 -7313 -8139 -4388 -1951 -2255 -442 1906 1972 1617 4344
2971 4344 8431 4890 -3205 -4577 2201 6459 -751 -9280 -6057 5029 7794 -2449 -9288 -3050
2985 -3050 6682 4564 -6784 -11556 -2374 6284 3061 -4627 -3467 6023 10083 5482 828 1196 3361
3000 3361 1368 -2499 -3354 -3872 -5848 -5337 -1313 2093 -768 -4512 -691 6819 7146 -1452 -6785 -784
3016 -784 7827 5115 -5172 -7370 3493 11552 5306 -5436 -4680 4811 6911 -2471 -10750 -6974 343
3031C43L8m666m74N331L609J56m13n3j00k716n8J793j068n543k778M523O757k067
3049B614q220q81R321N455q090r551K380J0566K845r175n924P367J0962n73r178
3064h2k600O252M638m864p813j458L726P25k413n94K429R38l83K781L304j321
3080C265m736r90N943K522n915p108L611R970J526r715n677P330R244m638j1831
3095g199l124Q465N968n357q366L184R620L398m408l450L690M272j724l959j082
3110g2Rj873j689K601J557k565l084K667O617L38p932l996O762P047l704r861
3126g178m23J1401O340o577q296L540R585J462j0201o722L829O094k551p214q68
3141g779N714L790j560j271K517J620j666n26K108K43m584k946M520N424l041
$$ plain form
3031 343 381 -4285 -4759 572 4181 4337 3924 3871 3771 1055 997 2790 1722 -3821 -6599 -2076 4681 2614
3049 2614 -5606 -6487 2834 8289 199 -9352 -6972 3594 6439 -2736 -8660 -1293 9669 9096 -82
3064 -82 -2682 3570 8208 3344 -4469 -5927 -2201 -1476 -3889 -4483 -2054 -1116 -1499 1282 4586 3265
3080 3265 -1471 -2461 3482 6004 89 -7019 -3408 6562 8088 -1627 -7304 26 9270 4632 -7199
3095 -7199 -10323 -1858 4110 -1247 -9613 -6429 3191 6589 2181 -1269 2421 6693 4969 1010 -72
3110 -72 -63 -1936 -3625 -1024 533 -2032 -5116 -2449 4168 4506 -3426 -7422 -660 6387 2683 -7178
3126 -7178 -7601 3800 10140 3563 -4733 -1193 8392 9854 -347 -7069 -3240 2854 303 -6911 -7779
3141 -7779 -2065 1725 165 -1106 1411 3031 1365 839 2947 3190 -1394 -4340 180 5604 2563
3156B563p330N88R206L275q189q617L284R256l33j0115m621Q243R574j964q076
3171c256k28Q847M818n819o619R65M210j363m545p42K084K21j383J714L240j074
3187A070l899k56N362K047o039n519M137R255J20q584k968Q355Q063n142j0965
3202d963j002Q520L377r033p798L698Q988P95n964j337N526M229j947k833Q96
3217A152J201k073j412J595J593k774k591K940N313o20p536k879O487N303n292
3232D07r895R79J0556M483p928n726O584J0520j019r470l325O202M476n096p068
3247e320J48M860O36k428p67K423J389j564K37J878K18m118j553M846M209l781
3263A313o286K593Q914K683q103p164N636P949m114j0655k743Q465N958m896p263
$$ plain form
3156 2563 -4767 -4179 5027 8302 113 -8504 -5220 4036 3703 -6412 -11033 -2790 6784 4820 -3256
3171 -3256 -3484 5363 10181 4362 -2257 -1292 2918 1555 -2990 -3732 -1648 -1427 -2810 -1096 2144 1070
3187 1070 -2829 -3085 2277 4324 -1715 -7234 -3097 6158 6278 -2306 -5274 3081 11144 6002 -4963
3202 -4963 -5965 2555 5932 -3101 -10899 -7201 1787 2582 -3382 -4719 807 5036 3089 256 1152
3217 1152 2353 280 -1132 463 2056 -718 -3309 -369 4944 4324 -3212 -6091 396 5699 407
3232 407 -9488 -8509 2047 6530 -1398 -7124 -540 9980 8961 -509 -3834 2368 6844 1748 -5320
3247 -5320 -5172 -312 324 -2104 -2871 -448 941 -623 -386 1492 1710 -2408 -3961 885 5094 1313
3263 1313 -4973 -2380 6534 9217 1114 -6050 -414 7535 3421 -7234 -9977 -1512 4446 -450 -7713
3278g713K599Q961L312n219l855K974L491j570l891m64K033Qk072J151K515j452
3294H08l502O30N139L71p415m719N456P311j846p868K05R478N279n677p288K709
3310i29Q094P86q990o655M010O398j164o491q04N400L197k964k198K860J724k423
3326a49j647K613J047l549j750N197N080k656o722K15O156K257p088p076K772
3341e300P385M85q034l881P200Q821j223p932j436P661L872n379n638K073L997
3356B671j199l840K95K902j28j344O63J910k144m087L79M557J300m167l869L858
3372b243P359R60n884l560N930O224m163r483j579P781L854p014o775L672P830
3387B909J5n254p90M442J521j986j861P01P41o37l0K310N88j888j726J928L311
$$ plain form
3278 -7713 -5114 3847 7159 1940 -1915 1059 4550 2980 -911 -1375 658 666 -1406 -255 2260 808
3294 808 -2694 -2064 3075 3446 -3969 -8688 -3232 4079 2233 -5635 -5430 4048 9327 3650 -3638 -929
3310 -929 7165 7951 -1039 -7694 -3684 2714 1550 -4941 -5745 -345 2852 -112 -2310 550 2274 -149
3326 -149 -1796 817 1864 -1685 -3435 1762 6842 4186 -2536 -2321 3835 6092 -996 -8072 -5300
3341 -5300 2085 2570 -5464 -9345 -2145 6676 5453 -2479 -3915 3746 7618 2239 -3399 -1326 2671
3356 2671 1472 -2368 -2073 829 701 -643 20 1930 -214 -4301 -3922 635 1935 -2232 -6101 -2243
3372 -2243 5116 6076 192 -3368 2562 8786 4623 -4860 -6439 1342 5196 -1818 -8593 -4921 2909
3387 2909 2924 -2330 -3120 1322 2843 857 -1004 -303 438 -199 -229 2081 2669 781 -945 983 4294
3404D294p69o063l251L871M803l630p149J248R080M446o776n719N630P965r22
3419G058p842l290N101L022l316m136M0L808J421j838j317P48R23p04j028N76
3435g74K96k297q63L827M170k014m400J079P112K047p946n805M170O148k908q041
3451f199j214O207M801l257m870J436N746K579l928m198J346L760L24l124p38
3466a329J958J222j379O46J840j239m133q5L687K09o195k635N066N825k005n574
3482d121R66O956M215m607o057O39N579J308n540n276K603N963L45n177j775M058
3498G9K879k352l085P02J670j045n40J740J516j865j059M172L504k924n100k02
3514a910M458J398n229m933J229N825J744m822l471M166O906m73o695k322N791
$$ plain form
3404 4294 3525 -2538 -5789 -1918 2885 -745 -7894 -6646 2434 6880 104 -5615 15 7980 7058
3419 7058 -784 -4074 1027 4049 733 -3403 -3363 445 1866 28 -1289 -541 382 -322 -1350 -774
3435 -774 -478 -2775 -3638 189 4359 2345 -2055 -976 6136 8183 237 -5568 -1398 4750 1842 -6199
3451 -6199 -7413 -1206 3595 338 -4532 -3096 2650 5229 1301 -2897 -1551 2209 2533 -591 -1329
3466 -1329 629 1851 472 1118 2958 1719 -2414 -2499 1188 1397 -4798 -7433 -2367 3458 1453 -4121
3482 -4121 -3155 3801 8016 3409 -2648 -2009 3570 4878 -662 -5938 -3335 2628 2973 -2204 -3979 79
3498 79 2958 606 -2479 -1777 -107 -1152 -1692 48 1564 -301 -1360 2812 6316 3392 -1708 -1910
3514 -1910 2548 3946 -1283 -6216 -4987 838 2582 -2240 -5711 -1545 5361 4888 -1807 -4129 1662
3529A662L873m071n369J192M674R57k309j007J300K68j181N1M31j733k575N99
3545c238K477J524k112k303K872N573P46m511l270L594M243k037p538j315N678
3560C83L602m134n480K142O097Q74m371k783K567K715j404j880k70J444J268J29
3576H99K02J453o20q42M13J198j036m284k335K643L981j963n030L73O367L771
3592E190l934m967K655N938j61n881l437L576M383q55m394j034L815K658j829
3607A723l071k66J194J35j836N8Q90o61J91K070K751o03l400J066L796J424m856
3624F05n282K441N073o56n311k437M813M717j513n525p81M489L120k823m835P11
3640c194M676J005k430j211K582J792q16j519L86n26j851m98J046L16k687j691
$$ plain form
3529 1662 5535 1464 -3905 -2713 1961 2918 609 -398 902 1170 -11 40 471 -1262 -3837 -3238
3545 -3238 -761 763 -1349 -3652 -780 4793 5539 1028 -2242 1352 5595 3558 -3980 -5295 383
3560 383 3985 -149 -5629 -3487 2610 3484 -887 -3670 -1103 1612 208 -1672 -1942 -498 770 899
3576 899 1101 2554 1934 1092 1505 2703 1667 -2617 -4952 -2309 1672 -291 -5321 -4948 1419 5190
3592 5190 1256 -3711 -1056 4882 4721 -1160 -4597 -1021 3362 2507 -1887 -2921 894 3552 1723
3607 1723 -1348 -1614 -420 -285 -2121 -2063 -1173 -1834 -1643 427 3178 2575 -825 241 4037 5461 605
3624 605 -4677 -2236 2837 2181 -3130 -5567 -754 3963 2450 -3075 -3856 633 3753 930 -3905 -3194
3640 -3194 1482 2487 57 -1154 1428 3220 2404 885 1271 745 -1106 -1604 -558 -242 -2929 -4620
3656d620K384M650J40m027j325M486L705k374n889m3M762K928m058m919J574N979
3672C353J008m857l127L000K790j444l506o94K096J113q51M04J197R45m42J070
3688B055K018j124l539j074K160J632k377m339P61M962K111l637l901K397N726
3703C831j7n889k775M316M301j865m366k09M817K485k955k177M41K078j092k214
3719a290o18J43o53n02J170K121l51j449Q02L672J384l513l597K381M223q04n251
3736b132k447M874L996k171n428J80N077J864m198m503J689L987N77l455m74K303
3752b61K853m75n96M77M01r88j053J64L89k219k422J645L428m78l473q67M055
3769E80L766k920m839N06N164K095m952l715L047N454K53m753k000L273L327k480
$$ plain form
3656 -4620 -2236 2414 2554 -1473 -2798 1688 5393 3019 -2870 -2913 1849 4777 719 -4200 -2626 3353
3672 3353 4361 -496 -3623 -623 2167 723 -2783 -3477 -1381 -268 -1119 -715 482 1427 985 2055
3688 2055 4073 2949 -590 -1664 496 2128 -249 -4588 -3827 1135 3246 -391 -4292 -1895 3831
3703 3831 3814 -2075 -4850 -534 3767 1902 -2464 -2673 2144 4629 1674 -503 -62 2016 924 -1290
3719 -1290 -1908 -1765 -2418 -2920 -1750 371 20 -1429 -627 3045 4429 916 -2681 -300 3923 3119 -2132
3736 -2132 -4579 295 4291 2120 -3308 -3128 1949 3813 -385 -4888 -3199 788 1365 -2090 -2564 -261
3752 -261 2592 2117 1521 1998 2399 1411 358 522 911 -1308 -3730 -2085 1343 865 -2608 -3475 580
3769 580 4346 1426 -3413 -2907 2257 4352 -600 -4315 -1268 4186 4439 -314 -2314 959 4286 1806
3785A806l810q04K105J94j884n49J748J032n47P23K251J58j617j403K243J863
3801C509k675m185R83M221J540m435k937L267M659j256n594j740M174L813l059
3816B85m740R63M926K068k712k203K728K291q38k353n02L36q34j653L41J735o79
3833h41j854O39L562J048l120k358K515M070j502m872j171M993L604l319m575
3848c181J303N421J266m933l570K390L183j628l798m0K844J258o41n09J533R20
3864A818m08n48J011K58k200j881J540K415j115l365r70M596K473l169m414J292
3880b667M807P81n059k937L873M862r64m483n5M463J822k670k718L35J924r79
3896C35j832r70J313L83n09J37J567L68j419m36K177J675k221l713J587M568j06
$$ plain form
3785 1806 -2004 -2808 -703 -509 -2393 -2942 -1194 -162 -709 14 2265 2423 806 -597 1646 3509
3801 3509 834 -3351 -2368 1853 3393 -1042 -3979 -712 3947 2691 -2903 -4643 -469 3344 285
3816 285 -4455 -3492 1434 3502 790 -1413 1315 3606 2768 415 -87 249 -585 -2238 -1897 -162 -841
3833 -841 -2695 -2056 1506 2554 -566 -2924 -409 3661 2159 -2713 -3884 1109 4713 1394 -3181
3848 -3181 -1878 3543 4809 -124 -3694 -1304 1879 251 -3547 -3587 -743 515 -126 -635 898 1818
3864 1818 1410 862 1873 2131 -69 -1950 -410 2005 890 -2475 -3445 1151 3624 455 -3959 -2667
3880 -2667 2140 2921 -2138 -5075 -1202 3660 2696 -1787 -1842 2621 4443 1773 -945 -610 1314 335
3896 335 -1497 -2467 -1154 -771 -1280 -1143 424 792 -627 -1063 1114 2789 568 -3145 -1558 3010 2904
3913B904m344j923M321M082k359n523O5M129J551l873l613J280L854Q98k739r65
3929b255K977K283p61k001m7J392j065r83n3J255j169k242R01L579ml446j476
3946c115L547K836l344l853P11M344J898l370k626K339M470M97m158k361K240
3961E5K864j395m631l45L278M81j949p78K297J269j623N7K064O3k497r28K581
3978H63J852k387k921J050M012Q23l184k838K160L439r16m428k307L538L677k070
3994C63l935N88N084J579k776k317K660J702j647k288N01R45j209o89R54J156
4010F71p97j599J041K278j57k667j368J563K871qm254p29M132L534k172m538Q38
4027a361M690O33m735l142K483L093j971k741L30K845J059q03n51P13J27K3K4
$$ plain form
3913 2904 -1440 -3363 958 5040 2681 -2842 -2777 1352 2903 -970 -4583 -3303 551 1449 -1290 -2255
3929 -2255 722 3005 2244 243 196 1588 523 -460 -513 742 -427 -2669 -1768 1811 1807 -1639 -3115
3946 -3115 432 3268 -76 -3929 -3218 1126 3024 -346 -2972 -633 3837 4334 176 -2185 55
3961 55 2919 1524 -3107 -3452 -174 307 -1642 -2420 -123 1146 -477 -420 1644 1707 -790 -1718 863
3978 863 2715 328 -2593 -1543 2469 3292 108 -2730 -570 2869 1953 -2475 -4782 -1244 2433 363
3994 363 -3572 -2984 2100 3679 903 -1414 1246 2948 1301 -987 -486 459 -750 -1439 -485 671
4010 671 -126 -1725 -684 1594 1437 -1230 -2598 -1035 1836 1828 -2426 -3155 977 4511 2339 -2199 -1361
4027 -1361 3329 3962 -773 -3915 -1432 1661 -310 -3051 -2721 124 1183 380 -171 542 669 692 716
4044G16q2n0o91j062Q76K062O9k848j026L254K423l082m600Q81M755N47m503k125
4062d486L747L736j270l096O53K979J195k102k024l76J295N39j363j238P17J328
4078B34n45n25J022Q18j553j376J646K151j936k961J589M451P4l916j295L590
4094A468K833k761l972K22K563Q81k134k679R43L050J741k021k066J960K510m69
4110B069k437j46J632k22j967M09J823l39k095O20K926p32l504n38K559J732k368
4127e78k921P93L200J706j710k029J562L018R52l652k263J403L269j327l770n01
4143b848K931J070j961m73J420R45j092l55R06N5k107K12K124J025j391j657J305
4160A09K458L54k359k320P29K080l4l356j848K620L973j615l461L93M083J500
$$ plain form
4044 716 634 584 -107 -1169 -293 1769 1838 -1010 -2036 1218 3641 559 -4041 -3160 1595 2142 -2361 -4486
4062 -4486 -739 2997 1727 -1369 -716 2263 3458 1356 -668 -1044 251 790 -573 -1811 -1094 234
4078 234 -311 -836 186 1004 -549 -1925 -279 1872 -64 -3025 -1436 3015 3089 -827 -2122 1468
4094 1468 4301 1540 -2432 -2210 353 1234 -900 -3579 -2636 414 2155 134 -1932 28 2538 2069
4110 2069 -368 -514 1118 896 -1071 -662 1161 822 -1273 -653 2273 1541 -1963 -2501 58 1790 -578
4127 -578 -3499 -2706 494 2200 490 -1539 23 3041 3993 341 -1922 -519 2750 1423 -2347 -2848
4143 -2848 83 1153 -808 -1281 139 1084 -8 -363 543 598 -1509 -1297 827 1852 461 -1196 109
4160 109 2567 2921 562 -1758 -1029 1051 1017 -2339 -4187 -1567 2406 791 -2670 -2277 1806 3306
4176C306k267k124J111J899j121j230n44J413kp77K34P16q64l46j88J054j70j779
4194a679q20Q13K615P16k629r93K984L080j670l923M24L397R21l961k887K123
4210a489K503l45k183o18J986J620n33j249j15L25L07J21q50O40q5J9l9J713J31
4229A859j952j332J946J756j957l797M25L402O60k356j757K604L265l77k661j129
4245a401J897K027j176k260r44K049R02j099j075M95J814k39j423k13K78k98p38
4262a404P65J297o58j973R83L314O33k593j316J999J733j189l146j301K198K052
4278A394j478k629L00K752J838j851k382J369K587n54j916p49J438P57o81m30
4294b35J081m3q36J65Q73K38k208j089J017J673l73k590k54K753K108j194k577
$$ plain form
4176 3306 1039 -1085 26 1925 804 -426 -970 443 441 -336 -102 614 -250 -596 -784 270 100 -1679
4194 -1679 -2499 -1686 929 1645 -984 -1977 1007 4087 2417 -1506 -1082 2315 3236 -725 -3612 -1489
4210 -1489 1014 669 -1514 -2132 -146 1474 941 -308 -423 -98 209 330 -520 120 35 54 15 1728 1859
4229 1859 -93 -1425 521 2277 320 -3477 -3052 350 1010 -1346 -3103 -499 2766 2389 -272 -1401
4245 -1401 496 2523 1347 -913 -1857 192 1094 -5 -1080 -585 1229 990 -433 -646 -368 -666 -1404
4262 -1404 -639 658 0 -1973 -990 2324 2957 364 -952 1047 2780 1591 -1555 -2856 -658 1394
4278 1394 -84 -2713 -2413 339 2177 326 -2056 -687 1900 1346 -570 -1319 119 876 195 -235
4294 -235 846 803 -33 132 1005 1243 -965 -2054 -1037 636 263 -2327 -2581 172 2280 1086 -1491
4311a491R17K906Q44k956k249J075L044q67k227j326K570J569j366j546J97J497
4327E91o40n64j72M80k22k35O88J236j05j011l35J780P94j466k398J46K269N48
4345A384k814j993K435K732k68k915p55K988J313j099k832O07K115N96j241j323
4361a070J174J493r33n30R2L69p10j053M28O02q55j437J024J880P54j630p74K228
4379A052K001j008k859r04K665J190j663k653L76L261L77k345j636J433K132l35
4395A084k386k49J139J150q42o92J195K53L5j55R50o6j154j190J029J415j404
4412A12k422l50K701J425j543k178J175K937P66k904j751J707K732j137k759j79
4428a668K187J756j578j624L57J460k43j261o24N93p1o65M99R32L72q05jJ877
$$ plain form
4311 -1491 -574 2332 3176 220 -2029 -954 2090 1223 -1004 -2330 240 1809 443 -1103 -906 591
4327 591 -49 -613 -785 -305 -527 -762 -74 1162 1057 46 -289 1491 2285 819 -1579 -1433 836 1384
4345 1384 -1430 -3423 -988 1744 1476 -1439 -2194 794 2107 1008 -1824 -1217 898 1494 253 -1070
4361 -1070 104 1597 664 134 226 595 -115 -1168 -740 -138 -993 -2430 -1406 474 1228 -402 -1176 1052
4379 1052 3053 2045 -814 -1718 947 2137 474 -2179 -1803 1458 1835 -510 -2146 -713 1419 1084
4395 1084 -1302 -1551 -412 738 -104 -796 399 652 687 532 1482 1416 262 -928 101 1516 112
4412 112 -2310 -2660 41 1466 -77 -2255 -1080 1857 2623 -281 -2032 -325 2407 1270 -1489 -1668
4428 -1668 519 2275 697 -927 -570 890 647 -614 -1238 -645 -716 -1381 -882 50 422 -383 -384 1493
4446A493R41j932j577J073J670j88k703j359J989K418j195k658L2L028J128k213
4462e3j871K86K553n9j451j023J420J563m00q83L58M07k52q74M64J75o03j584
4480a827N65J313J40j307n86J765K626j312k610J32K683R92k509k533J755K702
4496A989rk615q59J685K037j504j974J10R23L60j379q9Q66N47l02L71Q18N16q10
4515F81r54J287O13q66k465K15K140Q48k196j785J762K808l80k903o92K026K094
4532B233k251j929M5K977P59j347j352J232J552q12j178l31Q86o16p27m02J258
4549cm03p01o2K054N35j323j041R49K401j013k644o15K471J459j239k647P15K527
4567A420O05j877k173J223J886k74k498n39J835J204r37r76J293J240o87p58J016
$$ plain form
4446 1493 2434 502 -1075 -2 1668 1480 -1223 -2582 -593 1825 630 -2028 -1996 1032 2160 -53
4462 -53 -1924 -1638 915 856 -595 -1618 -198 1365 965 82 440 847 595 -279 185 360 -243 -1827
4480 -1827 -1262 51 191 -1116 -1702 63 2689 1377 -1233 -1101 1582 2574 65 -2468 -713 1989
4496 1989 1980 -635 -1494 191 2228 724 -1250 -1140 -217 143 -1236 -1325 -459 88 -214 157 975 1491 681
4515 681 -273 1014 1627 761 -1704 -1489 651 1499 -697 -2482 -720 2088 1708 -1195 -1887 139 2233
4532 2233 -18 -1947 -1902 1075 1834 487 -865 367 1919 1107 -71 -402 484 -132 -859 -1261 -3
4549 -3 -406 -1107 -1169 885 1420 97 -944 5 2406 1393 -1251 -1866 605 2064 825 -1822 -1107 1420
4567 1420 2025 148 -2025 -802 1084 810 -1688 -2227 -392 812 -125 -1101 192 1432 745 -13 1003
4584A003K73r53j526P44J458q69j936j13K222J212j120k282Q45K129N61k411j418
4601b181J863J696K15k623k19K229J211j314j510J65J636n32j740j80Q83K31r95
4618a165O12Q54M64q58k71J100R93j292j372L46J744M43k197j243J896J838p23
4635A169k591m03K318J604k070k523R73K407K96k015m81J660J022j07j009M02
4651F52L17l89r50J90K16n23l79k51J323L05j019j315J687K216j068k678l10K689
4669G13J231k191j895J701K543p4k572p41J732J204j199j763k19J127L35o58n32
4686a258P22R42j34j16L95L89o23m38J92R48p75j678Q8J662J700j980j838R62
4704h40K459n57k633m78J859J487j433j614K81K128J512j282j288N34J128R9j483
$$ plain form
4584 1003 1276 323 -1203 -459 999 130 -1806 -1919 303 1515 395 -1887 -1042 1087 1648 -763 -2181
4601 -2181 -318 1378 1593 -1030 -1249 980 2191 877 -633 -468 1168 636 -1104 -1284 -401 -170 -1165
4618 -1165 -553 301 765 -93 -364 736 1729 437 -935 -589 1155 1598 -599 -1842 54 1892 1169
4635 1169 -1422 -1825 493 2097 27 -2496 -1523 884 1180 -835 -1316 344 1366 1259 250 652
4651 652 969 580 -370 -180 36 -487 -866 -1117 206 511 -508 -1823 -136 2080 1012 -1666 -1976 713
4669 713 1944 -247 -2142 -441 2102 2028 -544 -1285 447 1651 452 -1311 -1530 -403 -68 -726 -1258
4686 -1258 -536 406 272 156 551 940 317 -121 71 1019 244 -1434 -1346 316 2016 36 -1802 -840
4704 -840 1619 1062 -1571 -2049 -190 1297 -136 -1750 -1469 659 2171 889 -399 135 1263 1362 -121
4721a21p45P75L76j014k05Q82K54j375N03J186O61j432j039Q44J899n10j855n59
4739a475K024J247j175j550K80J983L81j920j762R25J504J35j887p20J607J190
4755G87n77o97O13J135j62j275K55K67m21m45O09M20r9j407l48J649J189j157
4773C36j351k29J651M66j441j479J448J814L51k208m16J924J227j125j972L50
4789f54J431l7j428q55Q51M73j52K72K2L47l51j13P36K81o96q77J17J486M01j603
4809c49r94J525J623m53k052q73J720J105j362j869M06J925N72j334l78R26J053
4826A191k30p76j74N26J21n48o10K2N98o64p2Q77L03p70r55R41J116l64k099L42
4846a225J660J093j070j599P90J987L53j922r64N56J497n17j752p83J267J066
$$ plain form
4721 -121 -866 -91 285 -729 -934 -52 202 -1173 -670 516 1177 -255 -1294 -450 1449 939 -916 -1475
4739 -1475 549 1796 621 -929 -649 1334 1715 -205 -1967 -1042 462 597 -1290 -2010 -403 787
4755 787 210 -487 126 1261 1099 -176 79 346 -75 -520 89 509 410 -997 -1345 304 1493 336
4773 336 -1015 -1244 407 873 -568 -2047 -599 1215 1566 -642 -1058 866 2093 968 -1004 -654
4789 -654 777 740 -688 -1543 -692 -219 -371 -99 -77 270 -81 -194 542 823 127 -750 -633 853 1254 -349
4809 -349 -1343 182 1805 1352 -700 -1573 147 1252 -110 -1979 -1573 352 924 -410 -788 138 1191
4826 1191 961 185 11 537 658 110 -500 -478 120 -544 -616 261 564 -206 -1161 -220 896 532 -1567 -1225
4846 -1225 435 1528 458 -1141 -351 1636 1989 67 -897 -341 1156 639 -1113 -1896 -629 437
4862D37o37r31J87J572J17p07J49J62l14Qj79N54J11r85m5R93J028j097j407M62
4882e22J427q1j520j620J374J640k10j134l78J588J121o44j613K90J224M8r99
4899ij077O49O94k75m98M60q3j49k52O67K61n78r02M28J271J22j195l92J043J339
4919A524n65j282j53J416J06j141j734M54J762O31j983j53O67J552k50j291m3
4936d83R32K74l80n25K94l02M4L16J45O34j023l86L91R08n02j448k02J250J127
4955A064j618p22N95J736M81j660n62J407R00p75j394m06R85M43n91j081N81O80
4973F3M02p62J21J46K64n04k30R02j81o33l2R97O83o73j147O42J247m59j481r70
4993a605J290J226j271j133J08J496J135q25j158N83J525j26j349l33M06M82q3
$$ plain form
4862 437 -200 -1131 -944 628 745 38 187 349 35 43 -136 418 529 -456 -501 492 1520 423 -984 -522
4882 -522 905 824 -696 -2316 -942 698 488 -646 -1024 564 1685 1041 -572 -282 942 990 -9
4899 -9 -1086 -437 257 -18 -516 -56 -139 -288 -540 127 388 -190 -1092 -664 607 729 -466 -858 185 1524
4919 1524 959 -323 -476 940 1046 -95 -1829 -1375 387 1018 -965 -1118 -451 1101 851 -440 -483
4936 -483 449 723 343 -182 112 -190 -146 170 315 949 -74 -460 -69 839 337 -1111 -1313 -63 1064
4955 1064 -554 -1276 -681 1055 1536 -124 -686 721 1621 846 -548 -954 31 474 -117 -1198 -617 63
4973 63 465 -297 -176 -30 234 -270 -500 402 221 -412 -444 553 1236 563 -584 58 1305 846 -635 -1605
4993 -1605 -315 911 -360 -1493 -1385 111 1246 421 -737 -154 1371 1245 -104 -437 -31 451 368
5010C68p35J41M08n8l31O81J17o46o13J07P34k5j000j54J120J091o35j066J67
5029c29J720K49j433j036J25J451oj511o01P21J429m86j089P0R72M24n39m81K37
5048a13J69n18R0O50R7l76k55P85O92o84j519K42R16N61j495q53P88J623O5j479
5068f14l35J442R78n23j506J2J457K5q25j065N99J191n26l21k55M57J57o39J93
5087i8L60j95q86P8J113K28p23l48L74J572m11j306o09J123Q84j284j591M99J490
5106B70N11j494n03R31J301j62r84n60J033M59o75n06L03N63J7K7l54O56l70q23
5126c60K07N44l63r73n39J439P58o83j235M85J561P74j800r41J045J622p14j653
5144h26o72J591R76p44j030L32Q20J62q70l35J64K62j73p7K49M39o47J2R75N57
$$ plain form
5010 368 -367 -226 182 124 -207 474 591 -55 -668 -561 173 148 -852 -1006 114 1205 570 -496 -329
5029 -329 1391 1640 207 -829 -704 747 741 -770 -1371 -650 779 293 -796 -726 246 670 131 -350 -113
5048 -113 56 -462 -372 278 375 -1 -256 529 1221 537 -982 -740 176 737 -758 -1611 -823 800 865 -614
5068 -614 -949 493 1471 948 -558 -546 911 936 111 -954 -355 836 310 -11 -266 191 348 -291 -98
5087 -98 262 67 -819 -741 372 600 -123 -471 -97 1475 1064 -242 -851 272 1156 -128 -1719 -1220 270
5106 270 781 -713 -1216 -285 1016 854 -130 -690 343 802 127 -379 -76 487 504 531 177 833 463 -360
5126 -360 -153 391 28 -945 -1484 -45 713 30 -1205 -720 841 1615 -185 -1126 -81 1541 827 -826
5144 -826 -1498 93 1069 325 -705 -373 447 609 -261 -596 -432 -170 -343 -420 -171 268 -379 -367 608 1165
5164A165m60j019q6J096O40j441j520J169J306o52j140n21J881J096j249j611
5180a346R08J450n2j166r24J219L48J27j009M36N95k79k69m7M21n74r47M62O24
5199b3K13o43o01J194J076o67j071l29J440R81j351j443O05J613r0j205o91Q96
5217i6J172o04j182J05O04N01o60n32J21O78J22n06L58P39j41o41J4O16l31p59
5237d22q32J346L41p52j033N86J589J16j331p15J542P01m13j451K23J057L34p79
5255A07o71L94J156j47o77p28P38j03m80j03N27j9n99K6R07K90l53p99O52J047
5275A165j20j153r30J465N79p60j413M27J055Q69j158j089P27J161l48r58m52
5292i33Q38N13j17o04K8P40J54m79J47K58l74p45L02N47j20r17m32J164R12l39
$$ plain form
5164 1165 705 -314 -400 696 1336 -105 -1625 -456 850 198 -942 -1463 418 1514 265 -1346
5180 -1346 -438 1012 960 -206 -1130 89 437 564 -445 -9 586 307 38 -9 412 -162 -1109 -647 -23
5199 -23 190 -453 -1054 140 1216 549 -522 -851 589 1570 219 -1224 -619 994 904 -301 -992 -96
5217 -96 1076 472 -710 -605 -1 500 -160 -692 -571 107 229 -277 81 820 679 38 52 668 337 -422
5237 -422 -1254 92 433 -319 -1352 -766 823 939 -392 -1107 435 1136 723 -728 -505 552 886 107
5255 107 -564 -170 986 839 162 -566 172 69 -411 -514 13 -6 -605 -579 328 618 265 -534 118 1165
5275 1165 1045 -108 -1038 427 1006 246 -1167 -740 315 1184 26 -1063 -336 825 477 -481 -933
5292 -933 -95 418 301 -303 -275 465 619 140 287 545 171 -574 -272 275 155 -762 -1194 -30 882 543
5312E43q91o5J314L94j305j105J080Q32j1j232q16J759N75o53j030OQ46J70q23
5331d12k89N27J02m26N3O58o0j25m6P40K01m00r14J24Q41N0p91j123O73J208k19
5352C72j161o4J051R27p91j361L85J070J51p97n06J039N36m61n66K02K36K12n45
5371g1J7j41j11m08P3M64L54k63n38O25O04L09j093m98R98N90j208o56M9J870
5391I66k30j179k26P35P89k62j012j36N12N16p45n39N30O43j09m4l81P77J5q90
5411b70K27M08j58j018n3R92K71q34m87P04R48j12r60n92R24Q66k53j068m70J378
5431D43O29p07p19k8P98K69m57r62O69M61p48l02N80J04n76J41O08M32p39l92
5451d96O01M61J36j129j65N86R18p04n07j49O81Q23p56j037J82N48N98j064o03
$$ plain form
5312 543 -348 -413 901 1295 -10 -1115 -35 797 786 -446 -1262 497 1072 419 -611 -605 241 411 -412
5331 -412 -701 -174 -72 -498 -445 213 153 28 -18 722 923 523 -391 -267 574 624 -167 -1290 -617 591 372
5352 372 -789 -853 198 1125 334 -1027 -642 428 579 -218 -724 315 851 390 -176 26 262 474 -71
5371 -71 -54 -195 -306 -714 -641 -177 177 -86 -624 1 605 914 -179 -677 321 911 -297 -953 -904 966
5391 966 736 -443 -669 66 855 593 -419 -555 -43 473 -272 -811 -281 362 253 209 -172 605 620 -270
5411 -270 -43 365 207 -811 -864 128 399 -435 -922 -218 730 618 -342 -934 -10 856 603 -465 -935 443
5431 443 1072 365 -354 -382 416 685 228 -734 -65 396 -352 -654 -74 30 -546 -405 203 635 -104 -496
5451 -496 105 566 702 -427 -592 -6 912 208 -299 -448 233 1056 300 -737 -555 -7 591 -473 -1076
5470a076J080N06q3o75n9P69J82j10l02r8o2m17K07J34J84m70k3K17O27k71q39
5491e79J20Q28K73p93o32M56J095N3j232l53R85Q79m70r71k15R19K21j233R8j89
5511g40P94l19J95O5K75j05J77k87L13o8l61%K65K30n28l38K62J346m79j125q76
5532a304J359N21m20j030J22J055j4k11n34L84O53o8l67n40O32J2O9n24l11K45
5552b71J13j44J91K13K44n23j1P65k24r21k24Q52L02k14q46K79J127K05r44n94
5572f25L26J023l17p24n13O60M11M9r61J55O98N61n84k73L61j16j99j17L68J22
5592C05o69k96O12O85n01p88K70O68K80p31m54J86Q79j02o13k78P70R54m33j115
5612c71J07P28J18o39n65L31L20l4l86J44K24J95k05n3L66O7p88L86J28M90p05
$$ plain form
5470 -1076 4 510 427 -248 -307 462 644 534 232 134 72 -345 -138 -4 180 -290 -313 -96 531 260 -579
5491 -579 -459 369 642 -151 -783 -327 768 821 -411 -764 221 1100 630 -341 -556 363 584 -649 -551 -740
5511 -740 54 -265 -70 -5 270 165 342 55 368 300 -61 -61 204 434 -94 -432 -170 1176 697 -428 -1304
5532 -1304 55 576 156 -874 -752 303 289 78 -456 -72 581 513 146 -394 238 250 319 -205 -516 -271
5552 -271 -158 -302 -111 102 346 -177 -188 577 353 -568 -792 60 362 148 -698 -419 708 913 -31 -625
5572 -625 -299 724 407 -317 -830 -170 241 290 -671 -516 182 743 159 -114 247 131 -68 -185 183 305
5592 305 -364 -660 -48 637 136 -652 -382 286 566 -165 -619 -433 446 344 -269 -547 223 1177 744 -371
5612 -371 -264 464 582 -57 -622 -291 29 -5 -391 -247 -23 172 -33 -86 280 347 -441 -55 73 563 -142
5633a42l11M13O52K02r81j36L48R86j112p53q7J039K56p68n73O84P01J52r34J49
5653b15R20j65k67l68J70J14j83k15J62L50m95o8K08M45l70o48j43N27P51m78
5673C2q20L05Q17M60q54o30Q06O25l44p50N5L94K51l76o08J97P73J87r02K37K36
5694I1P7j77j86L51j22L4l44O38M29n82q57P89q3L83l93m64J02M39P0j031P7P11
5716d8Q85n08o93L02O75J42q87j02M08J90m18l8l64N12o1r1m26O61K23p16PO50
5738C03j15l20l49N24J08K25n13Q5N30K37n03o37K09L19L76j004k28M10P94k97
5758A54q43J87O15N73o09l65K60L94k97k35n4O31m73j82M45J99j06p95l5N16P89
5779G69p66j067M85Q90L2n35k21O35J081o92j057K40K93K72l43m49%O67o5n13
$$ plain form
5633 -142 -453 -40 612 814 -167 -303 45 1031 -81 -834 -921 118 374 -394 -967 -283 418 570 -364 -215
5653 -215 705 540 273 -95 75 189 6 -209 -47 303 -192 -260 -52 393 23 -625 -768 -241 510 32
5673 32 -788 -483 334 794 -60 -690 116 741 397 -353 -298 96 347 -29 -637 -440 333 520 -382 -145 91
5694 91 168 -9 -195 156 34 68 -276 362 791 209 -648 141 58 441 48 -416 -314 125 195 -836 -759 -48
5716 -48 837 329 -364 -62 613 755 -132 -234 174 364 -54 -92 -456 56 -5 -96 -522 139 362 -354 -347 303
5738 303 188 -132 -481 43 151 376 -137 -52 478 715 212 -425 -216 103 479 -525 -753 -343 451 154
5758 154 -689 -502 113 686 77 -288 -28 366 69 -166 -220 411 -62 -244 201 400 294 -501 -536 -20 769
5779 769 3 -1064 -579 311 343 -192 -413 222 1303 611 -446 -206 87 359 16 -433 -433 234 169 -344
5799c44J06N82J72o14j61L71k1j08r5J62K95m38k42K94L44L33l35p80N33M03k95
5820A62q97K5Q98J60l49p11K93R95r0p45m4M02P14p93l59n4N97j17k11J66p0m1
5842f9m2k02N51P3q39l8O87l5J9r04K71J218J85r26l07J54R60L7j496j30P66M49
5864C82l89l23j01Q60J21p01k88K52L97l4n72J53N10l43j5J20K51q5j4l29K51
5885A03N90r69l26K70M38j9l42m78R94M04m41o48L6J297j84j103j95L67M78r7
5905A75l20j13O83L1r08K52M55O6p66K41L18R8j99n96O29M09n5k55n99N64Q21
5926I31r76o38K04Q56r6m74m85M84M52k4n69J18L86M84m65m54l3K25K90k67j08
5947a59M20J83j14J7k19L01o07j49J0O15m24n05L06P94L75q21m96M54O97j93p65
$$ plain form
5799 -344 -238 344 516 -98 -259 112 91 -17 -112 50 345 -93 -335 -41 303 636 301 -479 54 457 162
5820 162 -735 -710 188 348 -1 -712 -419 576 486 -259 -303 99 813 20 -339 -393 204 87 -124 42 -28 -69
5842 -69 -111 -313 238 311 -528 -566 121 86 105 -799 -528 690 875 -51 -358 -204 756 793 -703 -833 -67 382
5864 382 -7 -330 -431 429 550 -151 -439 -187 210 176 -396 -243 267 -76 -91 29 280 195 181 -148 103
5885 103 693 -276 -602 -332 106 87 -255 -733 261 665 224 -424 -388 909 725 -378 -573 -206 272 175
5905 175 -145 -258 425 456 -452 -200 255 321 -445 -204 114 212 13 -583 46 455 400 145 -454 110 931
5926 931 -45 -683 -479 377 281 -193 -678 -194 258 234 -335 -217 169 653 188 -266 -299 -74 216 -51 -159
5947 -159 261 444 330 347 128 429 -178 -327 -317 298 -126 -631 -325 469 844 23 -473 -19 678 485 -280
5968b80p3O76M6m92o38N27L96K55n85j01L11J99k98j06K02J42N3m25L53k34k2
5989i4q4K07j86M52j83m63K73O82j95j059k32J100L79q10o36P05M65j58l31j47
6009c15L47N85m69k93N8R5K60k23m13L37M01n76O2L34O4n47m54P92J11j95l98
6030d37K64N98r8m63l70O04L13j24m38m79P27M67k47m15j20O52K00n42m78M7K74
6051f5J06n54L65K78J83k65k95O48J14o09J3K75k7j75l09O7M27p4j08l87M21N49
6073E78k23o56j46Q41K69p61m55N75J38K89n75k84O96j29l27n6K74J91k04k29
6093a94N33k66m37j4L87K25j70J53k17L7L37Mj005pO22P91q81n36L90Q82m84l10
6115a60l80P94j2j26m78J60L69O3j16k32R2Q7k6o2Qk2j52J7j27K49k23r5p3O39
$$ plain form
5968 -280 -353 323 369 -123 -761 -234 162 417 -168 -269 42 241 -57 -163 39 181 234 -191 162 -72 -94
5989 -94 -178 29 -157 295 112 -351 -78 604 409 -650 -882 218 597 -213 -849 -144 321 163 -168 -315
6009 -315 32 617 148 -145 -87 8 268 45 -368 -31 370 -206 -144 190 254 -293 -747 45 156 -39 -437
6030 -437 -173 425 327 -136 -506 98 411 287 -151 -630 97 564 317 -98 -218 434 634 92 -386 -339 -65
6051 -65 41 -513 -148 130 313 48 -247 401 515 -94 -81 194 167 -8 -317 -250 177 103 -5 -392 29 578
6073 578 355 -301 -447 394 663 -98 -553 22 160 449 -126 -410 286 157 -170 -226 48 239 35 -194
6093 -194 339 73 -364 -378 9 234 64 217 0 37 374 378 -627 -634 -12 779 -102 -638 -248 634 150 -160
6115 -160 -540 254 242 116 -362 -202 167 230 114 -118 -26 61 35 -27 -19 -41 -193 -176 -303 -54 -277 -372 -445 194
6139A94L52n36l30J12J022m86n95m11Q76K80k69p12N32K52lk22l74L77j45kj03
6160a91k75K92N97n30J58j24L20k23j24K75J65j81n82P47j93o9n78R6M55N04n42
6181cm66J91N88k51j85m35J66O32J85n93l5M43M65o11j71j90J54j03R9N0k0k25
6203c15k4K60L17Qm75J63K07L09j72q32M64M42J73l46m06P7M31K66p69N7N09J58
6225E02k53q23K38M83q4m62M08r6K65j74K21L79k87k51j97R6L0k7K3k51K79P7
6247I6k7m71M31O20n03o37K12J83N75l52p08O86L5L51m35k47K36J98K0n83M49
6268A29j27j49j18J56K78k35k65L87R4k27J58k24K14J40j95k62K05P4M88l18l16
6289a13J28K65k39j96l43L72L51l96j66K37K25K60k06M0j78K29Pk88j40J08K78
$$ plain form
6139 194 546 10 -320 -208 814 328 -267 -678 198 478 209 -503 29 281 278 56 -318 59 -86 -88 -191
6160 -191 -466 -174 423 -107 51 -73 247 24 -100 175 340 159 -423 324 131 62 -516 -420 35 539 -3
6181 -3 -469 -278 310 59 -126 -561 -395 237 422 -171 -206 237 702 91 -80 -270 -116 -219 -120 -70 -90 -315
6203 -315 -339 -79 238 246 -229 -66 141 450 278 -554 -90 352 525 179 -227 -150 281 547 -222 -165 344 502
6225 502 249 -574 -336 147 63 -399 9 -87 178 4 225 604 317 66 -131 -35 -5 -32 -9 -260 19 96
6247 96 69 -402 29 649 146 -491 -279 -96 479 127 -581 105 140 491 56 -191 45 243 263 -320 129
6268 129 2 -147 -265 -109 169 -66 -331 56 150 -77 81 -143 71 211 16 -246 -41 33 521 203 -113
6289 -113 15 280 41 -155 -498 -126 225 -171 -337 -100 125 385 179 219 41 270 277 -11 -151 -43 235
6310B35m19J79K83k87l44K28L73l1m92J38r1M17rn74p1P41L51l74k26k39M79j
6332B66j80n98J95J75J17k39J16L42l9l32k41M80j8L41l72K5J56n4n30K90O76
6353E76k94n15j4M22J5p5m73m6N94K49m60m44L19M24L18l85j48r2N24n87Pl18
6375d03L15K10j8p7O5L25m08j01J32K60l38j52K86J76k48m87J69N09r2J71l02
6396hL6N33l81m67j26K24P1J31n96P7O52K37n85j8N19J48k55l8j1o3k32j84J51
6419a85L62l82J36k62O33j11k97k91J36L26M71o59m08O85K89l43l95K07K68L83
6439E63q32K39j36L87j87k70J02K21k15nl49N84L0k11P9K90o8k70j84K94L98l56
6461A04m69J15L60O13o83j03k01M53r6j69m63L57O94k84l06p3J82L06m51J66P4
$$ plain form
6310 235 -184 -5 278 -9 -353 -125 248 217 -275 -137 -228 189 180 -394 -465 276 627 253 27 -212 267 266
6332 266 86 -512 -317 -142 -25 -264 -148 194 155 -177 -418 62 44 385 13 38 194 140 -390 -100 576
6353 576 282 -233 -247 175 190 115 -358 -404 190 439 -21 -465 -146 278 596 211 63 -29 495 -92 -85 -403
6375 -403 -88 122 104 27 92 417 9 -92 40 300 -38 -190 96 272 24 -463 -294 215 123 294 -8
6396 -8 28 561 180 -287 -413 -189 -118 13 -583 -506 146 383 -202 -220 299 447 192 154 143 80 -152 -336 -185
6419 -185 177 -205 -69 -331 302 191 -106 -397 -261 65 536 -123 -531 154 443 100 -295 -88 180 563
6439 563 -269 -30 -166 221 34 -236 -134 87 -128 -133 -482 102 132 -79 0 290 222 -48 -232 62 460 104
6461 104 -365 -250 110 723 40 -63 -264 189 93 -76 -539 -182 512 228 -78 -151 31 337 -114 52 126
6482A26L68m83k52M03j85K64l68P7m2M72m92j46M33N8j10j83l88P23k48j09m82
6503e64N78M17j24k37n96O69J95m09n28M79l9K17p8k47M65j70j8N3m6M03k13j88
6525A9p0J14m8l29J46J87L09p49L32K87l03K23n32P5K69L08k77n5N0L43k54k80
6547b35P2L13J13J40l51k90P22l68n2k57K55J45j57j15J19k2l16R6O1R0j3m13
6569d63K82M28P6l28m51O52L22m30m32O8PQ16n76n96K67M12J37m7l53jJ54m8P6
6592b8J69Jl00K85k63J12J65m53J22J58N21o70k05K88K65k41m2k0q4O52n3o13
6614b34K63K09j96l16K13k0L80k38k58P8r4K84j31K59j69M36n12q8J07J58j57
6635b6j85J01K66j41j93J19K44L34p54k17L23K47J80l45m68M28L85m3n90n9O02
$$ plain form
6482 126 494 11 -241 162 -23 241 -127 -50 -92 380 -112 -258 175 233 123 -60 -448 275 27 -82 -564
6503 -564 14 431 307 70 -526 143 338 -71 -599 -120 -159 58 -20 -267 198 28 10 63 17 420 207 19
6525 19 -51 63 15 -314 -168 19 328 -421 -89 198 -105 118 -414 -339 -70 238 -39 -94 -44 299 45 -235
6547 -235 -163 150 263 403 52 -238 484 116 64 -193 62 207 50 -65 54 32 -284 -188 -127 -37 -50 -463
6569 -463 -181 247 323 -5 -456 196 518 88 -344 -276 -269 547 -29 -625 -358 54 191 144 -209 -210 -56 -104 -28
6592 -28 141 142 -158 127 -136 -24 141 -312 -190 -32 489 -181 -386 -98 167 -74 -116 -136 -220 432 379 -234
6614 -234 29 238 42 -274 -61 -81 299 61 -197 -119 -213 71 -60 199 30 466 -46 -134 -27 131 -26
6635 -26 -211 -110 156 15 -178 -59 185 519 -235 -452 -129 118 298 -47 -515 -87 298 255 -335 -394 208
6656B08l16K47n49N50J74j07n24L38m3n3K4R1J36p1k8k83J63Q5J29k48j21J91
6678gK04k67m12M30N31n9o72L40M54l12j10l72J21K10K81k79j85K77J63m57k16
6699c37K51J71j24pJ75m4j33p4l8P17l22j59l91J73K32q4l97q6M50M82n83l19
6721d47M74K35K42n52l74N42K21p5k80k49L72O8m2J17m58K90O4l10L15j95Kk48
6743b88N63P8l35j93J30J85K82j88k26O0J17j07j77l01N05K67l80n0k79N91l63
6764a09k21L31m2K37m40J18K66Q5k04p4n0J72k05Q6J15P7j14l15Q9N6M98j89n39
6787c72L81M1l1L10o74K12K52p4q4l38M06QL31n42O0M82j07l95K21m6J65j88K9
6810D7J32k4k81R4m23O30K30l32k63M34Qm9n02j69L40L06m48M0j31O26j3m27J92
$$ plain form
6656 208 -108 139 -410 140 314 207 -317 21 -22 -75 -51 40 176 105 77 -206 -43 42 171 -77 -198 -7
6678 -7 197 -70 -482 -52 479 420 -252 88 542 230 120 -252 -131 79 360 81 -104 173 336 -121 -337
6699 -337 -86 85 -39 -46 129 85 -48 -122 -160 557 235 76 -315 -142 90 6 -391 -477 -27 455 -128 -447
6721 -447 27 262 504 -48 -422 120 341 266 -14 -263 109 177 135 252 -206 84 148 -162 153 -42 -40 -288
6743 -288 275 353 18 -175 -45 140 422 234 8 68 185 78 -99 -400 105 372 -8 -58 -337 254 -109
6764 -109 -330 1 -41 196 -244 -126 140 225 21 -53 -103 69 -136 -50 65 142 28 -287 -198 -142 356 167 -372
6787 -372 9 50 19 329 -345 -133 119 45 -39 -377 29 37 368 -174 -114 368 261 -134 87 41 206 18 47
6810 47 179 155 -126 -32 -455 175 405 73 -190 244 252 203 -299 -468 -128 178 -270 -230 -361 265 252 -175 17
6833A7o3Q7j90N6o3M27k32Q8J14r5P5J40j36k08J29j08l38Q7K36k68P7NO34l59
6857A12k73j34ON83n68K63j08K09k01K67j01k61J85Npj78K99k44L0K59J58l90
6879h9N9Q1p0L61l63L2J39j04R3K77o21KL26r0r0n32O83K37k21l09k11N54K65
6902D09m67N2k2K24K41m66j8J57J38l72K70n49N58m22J4K92j70K53j61J59m0K71
6924C51m48J35R0Lk02k19K03M1J17j65l16K99K69r9o07J69N35J50k22m67L19K42
6946A78RJ74m25M64n0k36M0k4r9kJ27l27L07l09k60L56K19K01n25k29K70L47j14
6969I2m06K46K40J95m52l15L56K05m73l3j4M85J43m38j6K41p5q5O8q2M9L2mj23
6993a64J73K97j79m61L28L48l59p8NK01L16m19j92K51M21l98j46Q6l31M42J17
$$ plain form
6833 17 -46 41 -149 -93 -156 271 39 127 241 146 221 361 225 17 146 38 -300 -213 23 -245 -168 -163 471 112
6857 112 -161 -295 -289 294 -274 -11 -119 90 -111 156 55 -206 -21 -16 -23 -201 98 -146 -116 143 301 -89
6879 -89 -30 51 -19 342 -21 11 150 46 139 416 -205 -203 123 33 -57 -589 94 331 110 -199 -410 144 409
6902 409 -58 -6 -28 196 437 -29 -47 110 248 -124 146 -403 155 -267 -253 39 -131 122 -39 120 80 351
6924 351 -97 38 128 131 -71 -290 -87 -46 71 -94 -410 -111 158 59 -548 -379 156 306 84 -383 -64 178
6946 178 187 361 -64 400 350 114 154 130 31 29 156 -171 136 -173 -433 -77 142 343 -182 -411 -141 206 92
6969 92 -314 -68 172 367 -85 -400 -44 161 -312 -345 -359 126 269 -169 -185 56 -19 -104 -36 -118 -69 -37 -41 -164
6993 -164 9 306 127 -334 -6 342 -17 -95 -90 111 427 8 -184 67 488 90 -56 30 -301 141 258
7014B58m87k2J66L89l61K11N8o8m7J73j47k57n9J27J09R4r3j16k61O25o9Pn80
7037c50K25J62J98l02l7J31L39l89k55K32PM12j22n44j32Q51m75j55L4J60J67
7058A57k21N2P6K1K66m36O5L29l50l03m0M79q2m8k75K79M42k71m24J8L57rJ79
7081B61l10J36L13k50l00K65R9J42M9m97k18M77k97r9J20L90m51J35j03o4L44
7102A42l47P8K76L74o46L7Q0K22k72J39j94M11L55l71l62m97N59K14Q3p98N04
7123a3J74L70p17q0K37P6j95j7J48Q0j03k32J63M7K37l11j09L72m6j53l86L82
7145g6J20J9l05k37K89L94k5o49L73L52P3O6m89K61k67K39k54K4lOo4o4K01K5
7169IL07n91M57L7j80k77q3P52l50j64r5K86Q8m92q6l1N86K5l48j26K19J70J60
$$ plain form
7014 258 -229 -251 -85 304 -57 154 212 144 97 270 123 -134 -193 -66 43 137 44 -72 -333 292 223 230 -350
7037 -350 -125 37 235 -67 -104 27 366 -23 -278 -46 -39 373 251 -293 -425 426 -49 -204 -170 -10 157
7058 157 -64 -12 64 85 351 -85 -20 309 -41 -344 -384 95 13 -35 -310 -31 411 140 -284 -266 91 82 261
7081 261 -49 87 400 150 -150 115 214 356 405 -92 -310 167 -130 -229 -109 281 -170 -35 -138 -202 142
7102 142 -205 -127 149 523 -123 -86 -6 216 -56 83 -111 300 655 284 -78 -575 -16 198 281 -517 -13
7123 -13 161 531 -186 -266 -29 47 -148 -165 -17 63 -40 -272 -109 -62 175 -136 -245 127 81 -72 -458 -76
7145 -76 44 63 -242 -479 -190 204 179 -470 -97 255 328 394 -95 166 -101 138 -116 -92 -95 -89 -153 -217 -16 9
7169 9 316 -275 182 219 39 -238 -321 431 81 -83 -178 108 196 -296 -382 -413 173 198 -150 -276 -57 113 273
7192B73m67N0J48L42l09p8J74j08l4J94j67Q5lL4j17P7j43l13J07J90O0J17l16
7215b04K6L89k19j87k52M41L42j18k27J2K51oo2k52J04Nj97q4K28L63k92J56m60
7238b43L15r7J48l52K18J27K02m55K83o1N7k07J7q5M94n64J08k90K79J27J34m01
7260b46j80M39j57k54J20O5N83k63j46k69K68J78m09K91l27K81K99j01j05O7l28
7281a94K69l44O46l28k82K14qM52k61j69L10J2k75k34k3P2R0j49J31k06M56O4
7303B43l37K57l79L71L0j55K88n37j9K11j27L80l87L25N4j22L90m88j98R2J58
7324E0K82m29m67K56N86k87j38q6O03l24j75P7K36n24N26l53J27M7J89n28J40
7345a92L68m8k89q4M18j13j99k58M31K70n3j95k25J56N11m54l47N14n02N47k47
$$ plain form
7192 273 -194 -144 4 346 37 -41 133 25 -9 185 18 103 100 134 17 94 -49 -362 -255 -65 -5 112 -204
7215 -204 -178 211 -8 -195 -447 -6 336 218 -9 3 254 248 186 -66 38 43 -154 -238 -10 353 61 217 -243
7238 -243 72 -25 123 -229 -11 116 318 -137 146 85 142 -65 -48 -133 361 -203 -95 -385 -106 21 155 -246
7260 -246 -426 13 -144 -398 -278 -213 370 107 -39 -308 -40 138 -271 20 -307 -26 273 172 67 134 -194
7281 -194 75 -269 377 49 -233 -19 -27 425 164 -5 305 317 42 -192 -215 -143 -53 -202 -71 -277 179 243
7303 243 -94 163 -216 155 185 30 318 -219 -238 -27 -154 226 -161 164 218 96 486 -2 -200 -108 50
7324 50 332 -97 -564 -308 278 -9 -147 -233 370 46 -129 -52 184 -340 186 -167 -40 7 196 -332 -192
7345 -192 176 128 -161 -245 173 60 -139 -397 34 304 251 56 -169 -13 498 44 -303 211 -291 256 9
7366Im31K21K72n8l3r7J52O98o98j7k1K27l91J75j21K23j40j15j62L96J77o07
7388c41J18M56j74m24pQ1M69j96k56M25j94L27n5k85j11K28j54J58m64K44M7O7
7410d1j85l9L79M78n45m21N34Q5j31l76L14p8M0J81l57J53L19j87J8j30M1J50
7432B02j10k07J9L37N2n42J03M19l28J56l39L58Q2j59K9j30J65Q4k79l5O6J01
7454D4N7k13Q7m5j72J41p9L32P0m10j82M27M37m53Rl25J74L6L2l32N52k64K54
7477A77l59kK96O5j33k63P7K20K70n04N1K44r7j45p1M96j78J7l89R7L47k9m82
7500b95K19L11l39p0L4L17K38o31J49K8M03r9j13pL3k35K47J02q11N94O8j22k24
7523b03L18K62n06J00L3K61k54l78L97o0L26o71J62N19l71L29k16j88L26l13J8
$$ plain form
7366 9 -422 -201 71 13 -20 -117 35 733 35 18 -3 224 -167 8 -113 110 -30 -145 -307 89 266 -341
7388 -341 -223 233 59 -365 -372 -291 178 -18 -274 151 -43 284 229 -56 -167 61 -93 65 -399 -155 -108 -41
7410 -41 -226 -265 114 592 47 -374 160 245 114 -262 52 -26 14 195 -162 -9 310 123 141 11 52 202
7432 202 92 -115 -96 241 293 -249 -146 273 -55 101 -238 120 202 43 72 -58 107 191 -88 -123 -57 44
7454 44 101 -112 -25 -70 -242 -101 -180 152 222 -188 -370 57 494 41 50 -275 -101 -65 -33 -365 187 -77 177
7477 177 -182 -184 112 177 44 -219 -142 78 348 -156 -105 139 42 -103 -174 322 144 161 -228 -131 216 187 -295
7500 -295 -76 235 -104 -174 -140 177 415 -216 -67 -39 364 265 152 145 178 -57 190 292 -519 75 143 21 -203
7523 -203 115 377 -129 -29 4 265 11 -367 30 -30 296 -375 -213 306 -65 264 48 -140 186 -127 -109
7544a09k31k29J012k96k47RJ00k40N70n98k83O80j94R3k67m6K03k9Q3J32j74L18
7566B57o13K59J61l71J41J19k08O08n24N3J12K71m1j96l05L53L31l14j03J42R8
7587B30l5m17O8J08l5K32n6l12K17q6j35J96L75l86j6j03M37J14k26m36J15L8
7609a13L74o39q5P14q0K56o52J97j59L61l11j56q1M22J25k89q8J84K75j2j03l58
7631b18L00O4k4j69L14l23K5j16M59l10K68k68M29l78L82n03k90P65m15j39j08
7652b55J23L06k63rk28K90J4j45J28j61K69J02k45Q2N0j5L5L5k6j7J66k83l36
7675c83N42j5j19k21K4L33k26J29k59K54M33m47k11Q7L46k6m40O0Q3K00k15j74
7697b45K41L53j65k49k12K56p7L2k42K18k26N6J42J68L81m5n45K94j5L25n68l62
$$ plain form
7544 -109 -340 -569 443 147 -100 -91 9 -231 339 -259 -542 138 -56 37 -230 -276 -73 -102 -19 113 -61 257
7566 257 -356 -97 64 -307 -166 -47 -255 353 -171 -118 -6 265 224 28 -277 76 407 93 -10 132 230
7587 230 195 -222 -154 -46 -81 151 95 -217 0 -86 -221 -25 350 -36 -52 -155 282 396 170 -266 -151 -113
7609 -113 261 -378 -463 251 171 427 -225 -28 -187 174 -137 -293 -374 48 173 -116 -204 -20 255 243 140 -218
7631 -218 82 146 122 -47 267 -56 -31 -147 312 2 270 2 431 53 435 -68 -358 407 -8 -147 -255
7652 -255 -132 174 -89 -98 -326 -36 -22 -167 -39 -200 69 171 -74 8 58 43 78 113 87 70 236 -47 -383
7675 -383 159 144 25 -196 -172 161 -65 64 -195 59 492 45 -166 -79 267 241 -199 -139 -56 144 -71 -245
7697 -245 -4 349 184 -65 -277 -21 -98 -66 -308 -90 -316 -260 -118 50 431 386 -159 135 120 445 -123 -485
7719d85O98O4k71m79M17K97Q8j59m66J17L43j49o6Nr9Q1J57m32N68j69j50K69
7741A79k43R8k08K42j0q8J78l35L80l12O58l34k81J55k5l65K02l2L23j17m51K70
7763a16J5K19n6j12J03m3j19M17k74q8M0j60M45k15K16J7k25l22M44l82K05k95
7785b86M28j04r9q6J95J19J67n16k35J53M0N95m26j63O2M90j26k32k0K47M5n9
7807A89m08L25M3k00J89j49K87K17o16N4K3M50k05j77J64m64Q2M99l59K04M0j91
7829cq2J43P0P4N2m37N3L68l01k69M10O1J31j02l09K5L31j71l87K36K25o5J21
7852A74rm4k19K22l32K41N1j59Qj30M77k04o9k51K09J36m7k31j80P81j27l52K13
7875A58k92L18kk80k01K68M8j85QJ26J72J79J67k74k74O5l20J65L94k75k8j80
$$ plain form
7719 -485 213 277 6 -473 -56 241 329 170 -296 -179 164 15 -51 -46 -145 -64 93 -339 229 60 -90 179
7741 179 -64 34 -174 68 58 -30 148 -187 193 -119 539 205 -76 79 54 -311 -109 -141 182 65 -386 -116
7763 -116 -101 118 62 -50 53 10 -109 308 34 -54 -14 -174 271 56 272 289 64 -258 186 -196 9 -286
7785 -286 142 38 -61 -147 48 167 334 -182 -417 -264 -224 371 -55 -218 -156 334 208 -24 -44 203 248 189
7807 189 -219 106 149 -51 138 -11 276 493 -123 -69 -46 404 199 22 186 -278 -196 303 -56 148 188 -3
7829 -3 -85 58 128 202 254 -183 -130 238 -63 -332 78 139 270 168 -141 -116 215 44 -343 -107 118 53 174
7852 174 165 121 -98 124 -208 33 84 -75 -67 -197 280 76 7 -244 -35 101 54 -177 -357 424 297 -55 158
7875 158 -134 184 182 -98 -299 -31 17 -168 -160 -34 138 317 484 210 -64 1 -319 -154 240 -35 -63 -243
7897b43J19M17q2k59l3j5Ol0j7r5N16m9k94q8K98j3K57k95Kk12K91l32R0J08J30
7922A77o8l30M27j47j9k21J99k8J54r6q9j48M21k12j01J65L83l82k09j20K47J49
7944A52k23j02j51N16k05o2l3J70N1R4k99l2J38J65k77r2J12L6p7J21j44K5L01
7967A84k56J16M18m62j35o9M40k70J1R3P5N5k29K47l87L19j36K66j55m3o0o4o5
7990a07J20PJ85k68J50j15J65j60L37o90N45J78n22K4K96R8k36k22M8J60j95R4
8012a08k51M37j41j8Q2j80n1M81l00j19j84L37L80o37M64j75L53m84K44l34K4
8033a80J87k90L78j72k9J13k32K20R6n1p49R45m5k28l8j11L36K02l14j29L71o3
8055B17m6m33L68M7K7k39l2J05l30L01m8J61m1l90j70N25p9J6R6j20K12Qj81L8
$$ plain form
7897 -243 -124 293 211 -48 -81 -96 -90 -120 -137 -232 284 235 -59 -147 151 138 395 100 102 -110 181 -151 -61 47 177
7922 177 109 -221 206 59 40 -181 18 -10 144 48 -41 -189 232 20 -81 84 467 85 -124 -244 3 152
7944 152 -71 -173 -324 192 -13 -75 -108 62 113 207 -92 -124 14 179 -98 -190 -78 -42 -119 2 -142 -117 184
7967 184 -72 44 462 0 -135 -204 236 -34 -23 70 145 200 -29 218 -169 150 14 280 125 82 22 -42 -107
7990 -107 13 20 205 -63 87 -28 137 -23 314 -376 169 347 -175 -151 145 243 7 -215 -167 -7 -202 -108
8012 -108 -359 78 -63 -81 1 -179 -230 251 -49 -168 -352 -15 365 -272 192 17 370 -114 130 -204 -180
8033 -180 7 -283 95 -77 -106 7 -225 -5 91 40 -709 236 191 -37 -75 -186 150 352 38 -91 280 217
8055 217 171 -262 106 153 180 -59 -91 14 -316 -15 -63 98 57 -333 -503 22 -57 -41 55 -65 147 155 -26 12
8079A2j16J48K06j56k92J82L53m7l05k10N12j37j64n0j28K21J06n3p2kN9R8o0
8102A05j68J50j09J5K37k82J42k49K51kk27L67l59J87L95l82k67R9J95n3j9j06
8124h0j42L49l2q3j07K47J03ko0k90K49j19Q5l83N12l13J03j05l4K46j46q9r5
8147a86L40Pl32Q0Q3j80K72j47M3M45o00N13j58l44oK14j6j94J51Rk12J40q8M0
8171a26J68j56J81N5J0l4k82M62l64j06J22K1J21q3P4n37M67J25Nm32
$$ plain form
8079 12 -104 44 250 94 -198 -16 337 290 -15 -225 287 150 -14 -64 -192 29 135 82 10 8 67 165 105
8102 105 -63 87 -22 -7 230 -52 90 -159 92 90 -137 230 -129 58 453 71 -196 -97 98 45 26 -80
8124 -80 -222 127 95 12 -95 152 255 253 193 -97 152 33 118 -265 247 -66 37 -68 -102 144 -2 -91 -186
8147 -186 154 161 -171 -91 -8 -188 84 -63 -20 425 -175 338 180 -164 -170 44 28 -166 -15 -6 -218 -78 -166 -126
8171 -126 42 -114 67 122 132 98 -184 278 -86 -192 -70 -49 72 -11 63 -474 -7 118 123 -309
8191c09
$$ Imaginary data points
##PAGE= N=2
##DATA TABLE= (X++(I..I)), XYDATA
0@%%%Qk4K4k4M0n6P2q8J12j39J71k10K53l07L69m36N14o07P07q20R49j092J252
26F68j431J631j849K091k364K656k977L339l732M158m629N152n715O331p020P776
42D085q604R526j0557J1702j2990J4455j6128J8059k0324K3023k6300L0386l5641
55a9308M2686n2697O8160r5454J57812n46010j24198R99855j90248n29362o4409
66c53173N71579K06292k02030k46034O3328R4550L4749j16662j46445q5381J38486
77d0741J80811N5634r2819j01220j43226p1723J50876J99221k17482m35028P1026
88d44671N98000J84218n03107k35263O23679O01203l18344p05690n1516N02130
98B50639J62969m27376l97787P3621L01867R0274j82725j47110J52591L05549
$$ plain form
0 0 0 0 0 8 -16 8 -16 24 -32 40 -48 64 -75 96 -114 139 -168 201 -235 279 -328 379 -441 508 -584 668
26 668 -763 868 -981 1110 -1254 1402 -1575 1764 -1968 2190 -2439 2713 -3002 3329 -3691 4085
42 4085 -4519 5007 -5550 6152 -6838 7617 -8511 9548 -10776 12247 -14053 16333 -19308
55 -19308 23378 -29319 38841 -56613 101199 -444811 -569009 430846 240598 -288764 -353173
66 -353173 218406 424698 222668 -23366 39962 134512 169261 52599 -93846 -179227 -40741
77 -40741 140070 195704 102885 1665 -141561 -213284 -62408 136813 -80669 -515697 -444671
88 -444671 153329 337547 -165560 -400823 222856 824059 505715 -199975 -251491 250639
98 250639 413608 -13768 -411555 -337934 -36067 54207 -128518 -275628 -123037 182512
108A82512N9776k53803j76627J13394J25177n4114k902J36619k7039k09502O2653
119d3856L85236R6516m09070k65954K84981K59149l42877n05791P1247M99416
129B8997J72007l39053k72999K27298M59868J49936k71948k61486J25825K84473
139C02918o1479l71622j30508K68120J84094j66482j63696J02773J04761r0014
149b1135m3750J22236j4382k64339j16287K55476K29511j54196k27810J57592
159g7084L87620R4997k89521k33631J44810K96631k3341m12072l06238J90165
169b27664L61415n0518l68549n6107L79688K33424k16606k40261J13768K16133
179A44723k8580j52446k2845M4336j8056K7150J49095P2257j38205j34990Q0162
$$ plain form
108 182512 242288 -11515 -188142 -74748 50429 -3685 -6587 130032 102993 -106509 -43856
119 -43856 341380 437896 28826 -237128 47853 307002 -35875 -541666 -470419 28997
129 28997 201004 -138049 -411048 -183750 276118 426054 154106 -107380 18445 302918
139 302918 241439 -130183 -260691 7429 191523 25041 -138655 -35882 68879 -21135
149 -21135 -64885 57351 42969 -221370 -337657 -82181 147330 -6866 -234676 -77084
159 -77084 310536 405533 116012 -117619 27191 323822 300481 -111591 -417829 -227664
169 -227664 133751 83233 -285316 -341423 38265 271689 55083 -185178 -71410 144723
179 144723 116143 -36303 -59148 -14812 -32868 -5718 143377 215634 77429 -57561 22601
190B2601J48275o0711k51557j54296J17130K10183k0985k59272q7989L29416L61486
201C54281j08709l78633j9106L83307J62147l28929l15751J28316K79127k8084
211A27966k35975o0124J52163J11713k6861o7587n0914l9374j303M0303J9111
222c0882m2646n4580K5208J41148J51609r333j54740l7778K00481J41158k21558
233A08087l50180L091L13144Q5518l13715k25370K23048L37397j7741k62457o5273
244a64451K06898J53963r8771j90080l9466J25802J08571k4419p6620m01O8463
255F9489M3615k677k2779o6100j12364m6966Q2488N3338j34128j56252J14132
266a78204K97325P7857k21612j18249K30335K54003j06374l16585q9543K10468
$$ plain form
190 22601 170876 110165 -141392 -295688 -178558 31625 10640 -248632 -336621 -7205 354281
201 354281 245572 -133061 -152167 231140 393287 64358 -251393 -123077 156050 127966
211 127966 -108009 -168133 -15970 95743 68882 1295 -49619 -88993 -90296 -49993 -30882
222 -30882 -73528 -128108 -102900 38248 189857 180524 25784 -11994 188487 329645 108087
233 108087 -242093 -239002 74142 159660 -154055 -379425 -156377 181020 163279 -99178 -164451
244 -164451 42447 196410 97639 -92441 -131907 -6105 102466 78047 1427 1026 69489
255 69489 113104 110427 87648 21548 -90816 -137782 -55294 -1956 -136084 -292336 -178204
266 -178204 119121 196978 -24634 -142883 87452 341455 235081 -81504 -171047 39421
276C9421J48996j48850k34214J2180K31047J21545j31985j65390L2066J38386
286D3202J5282j20721q0189L2743N3389K5371M7039N3125j6272l0850Q4782J35010
298B41911m0375k18053j12008J29376J21316j42520k51594r408K55205J66466
308A40316j35252j96046P6550K67424Q2342k12929j92702R0857K08928Q557j80571
319d2526p9854J33810J42948k1246r9993l5170J6197p054k6081k7152n8256p7524
331a81901M971J22022J01811m7594r5234O9144K13349Q5843j70967j89631O2220
342b5967J97616n572k52503j61356J53199K31335k8989k24994o5090J88896J50959
353A57534j03801j92819k0884J33049P4324n7788o0857L8731Q9329N6946J9838
$$ plain form
276 39421 188417 39567 -194647 -182467 48580 170125 38140 -127250 -95184 43202
286 43202 58484 -62237 -142426 -109683 -56294 -30923 16116 69241 52969 22119 106901 241911
298 241911 201536 -16517 -128525 851 122167 -20353 -271947 -281355 -26150 140316
308 140316 5064 -190982 -114432 152992 235334 22405 -170297 -79440 129488 138045 -42526
319 -42526 -122380 11430 154378 133132 33139 -2031 14166 7112 -18969 -46121 -104377 -181901
331 -181901 -176930 -54908 46903 -691 -95925 -26781 186568 272411 101444 -88187 -25967
342 -25967 171649 166077 -86426 -247782 -94583 136752 107763 -117231 -182321 6575 157534
353 157534 53733 -139086 -159970 -26921 47403 -10385 -71242 -32511 56818 113764 133602
364A33602m134m5286o1159j72M9026k9526j52560j11933Q3667J66162K557j64584
376a34340n3764J96526K03897o9671k25739l7684K02126J25473j48124k05112
386a46412L2689K11763Q4352j36330j29333N8377J26820p419j29929r0470J1542
397a14350L9089Q192l407M305M186L0855R2736R6200j7734j15000l7484J11710
409I9298P9571j26325k03685q059J89064R2243j54230j69452Q4501K28301M0981
420A52208j99210j40426J09856J73226k4272j67402n0853J39418J37903j5161
430A15287q3519m755O2108K3812m0224n5894n5404n8230j6330N1438L8633n6662
442g9740p2954O4433J72137O2923j31193j17943R4651J76968j9199k09996j02478
$$ plain form
364 133602 129468 84182 23023 22851 71877 42351 -110209 -222142 -138475 27687 30244 -134340
376 -134340 -188104 8422 212319 142648 -83091 -120775 81351 206824 58700 -146412
386 -146412 -113723 98040 182392 46062 -83271 -24894 101926 94507 -35422 -125892 -114350
397 -114350 -75261 -67069 -70476 -66171 -61985 -31130 61606 157806 140072 25072 -12412 99298
409 99298 178869 52544 -151141 -159200 29864 122107 -32123 -201575 -117074 111227 152208
420 152208 -47002 -187428 -77572 95654 71382 -96020 -146873 -7455 130448 115287
430 115287 31768 27013 89121 112933 72709 16815 -38589 -96819 -113149 -61711 -23078 -79740
442 -79740 -152694 -88261 83876 146799 15606 -102337 -7686 169282 150083 -59913 -162391
453a62391J51562J77963n5161j93938l3387J75557J17954j17221j82853j0567
463a32482J20487L4992j00114p6948M7361R3485M5649J1288J7744Q138q213K1557
475H2944M3454k8008j23433q3059O6280J05363l8857j50915l5032J60830J44994
486A44561p9948j88955j2809J84803R4791j52167j74676O7375K11625N6857j39390
497A2067q2669J10663J34621k7317j25124n6836K4633N296m0955l7669j6530q764
509a08584K0225P0164O7713j1174o2513O553J07174O8043r8038j57334M285J64714
521G1228P0974j47606j43547J00677K09559P45k13823j09853J34347J35773q8723
532A9751j84338k4042J37259R5436l4106n2405L6845Q8621M4090k3632m1183k4786
$$ plain form
453 -162391 -10829 167134 111973 -81965 -115352 60205 178159 60938 -121915 -132482
463 -132482 -11995 22997 -77117 -154065 -106704 -13219 32430 43718 61462 69600 61387 82944
475 82944 126398 98390 -25043 -108102 -41822 63541 24684 -126231 -161263 -433 144561
486 144561 64613 -124342 -137151 47652 142443 -9724 -184400 -117025 94600 151457 12067
497 12067 -70602 40061 174682 147365 22241 -34595 -9962 -4666 -45621 -83290 -99820 -108584
509 -108584 -88359 -18195 49518 38344 -24169 -17616 89558 157601 59563 -97771 -93486 71228
521 71228 142202 -5404 -148951 -48274 161285 162030 -51793 -161646 -27299 108474 19751
532 19751 -164587 -188629 -51370 44066 9960 -42445 -5600 83021 127111 103479 62296 37510
544C7510j8648j5494j044r391n8209o3172L7310J26667M8286j13311r9789R6047
556c3238J64194l4977k03877o3578J75236J43150r9220j66608M0779K01158Q6438
567B09457j22614j37842K2045J01961n801j28222q8892M1820P6396k752m1653
578g6097J4973O0925L3791J4674L7212R668p6541p0878N7473J00992m3711j52835
590i0354k6145J53344J01115j05221j43317M3807J59809J9158j73524j39043P6441
601a23930J66500J9256j31862n5265J29342J43703k0950j03838m235Q0671N746
612A05138r1109o0565Q119n421k9452K3886N7108j5357p2577J1258J17505N9084
624A07617r2066j09872L6294J25322J8332j24888p8193J09252J67144n158j66165
$$ plain form
544 37510 18862 3368 2324 -7067 -65276 -128448 -91138 35529 83815 -29496 -129285 -33238
556 -33238 130956 95979 -107898 -171476 3760 146910 47690 -118918 -78139 123019 209457
567 209457 86843 -50999 -28954 73007 67206 -61016 -149908 -108088 -31692 -34444 -76097
578 -76097 -61124 -199 33592 48266 85478 95146 18605 -52273 5200 106192 62481 -90354
590 -90354 -116499 36845 137960 32739 -110578 -66771 93038 112196 -61328 -200371 -123930
601 -123930 42570 61826 -70036 -125301 4041 147744 126794 22956 18721 99392 105138
612 105138 14029 -46536 -38417 -43838 -73290 -49404 7704 -7653 -80230 -68972 48533 107617
624 107617 15551 -94321 -58027 67295 85627 -39261 -117454 -8202 158942 153784 -12381
635a2381p5708J27464J20783r4093j85424k4496J17137L3002r5621m4686Q5955
646d8068R0046J436j9844J7485J0749k1815J768L8325o579q6129o7675M6950J01638
659E8287J2740r7401o4134P6277J12421l8232j63864n4451J44814J16994j08234
670d783j69564M7764K11699Q0231j20097q7041Q2088J01823l8029j12360m4396
681e2665K7954J5576k4864k7217r128N211K6021M9946L9806j5996o0202k5616
693e1174O0227O8622m1618j13001n660J42458Q5106j12010j33913P4683J84412
704A58132L653k00641j25241R5922J25907m9264j38459j8250J17672Q6593k9551
715B6473n5515K6034Q2460L4592m5629n9726j9769J618Q07J4129J7878l0642n9613
$$ plain form
635 -12381 -88089 39375 160158 66065 -119359 -143855 -26718 6284 -89337 -134023 -48068
646 -48068 41978 43414 23570 41055 51804 29989 31757 70082 63503 -22626 -90301 -43351 58287
659 58287 71027 -26374 -90508 -14231 98190 59958 -103906 -158357 -13543 103451 -4783
670 -4783 -174347 -126583 85116 165347 45250 -41791 40297 142120 104091 -8269 -52665
681 -52665 -24711 -9135 -33999 -61216 -70344 -65133 -39112 10834 50640 34644 -25558 -51174
693 -51174 9053 77675 36057 -76944 -82604 59854 144960 32950 -100963 -26280 158132
704 158132 161785 -38856 -164097 -68175 57732 8468 -129991 -148241 -30569 56024 26473
715 26473 -29042 -3008 79452 114044 68415 8689 -11080 -9462 -8655 5474 23352 -7290 -66903
728f6903J5738J02133L9308j05364r9554O5209J25352l5316j61913l9442J59295
739a457J37031o2689j34033J5443J51381P2200j02693j29742R368R4054L063j15258
751f3332p5382N5561Q7894N550l8355N778L2288K094j006L2438Q741o4507n2698
764f4936N4576Q4954k6933r7818L769J26866O5184j04600j35031J6430J24146
775D6607K8255j31974j19350N7398J48042L0426j03553m1959J13617J14415l9051
786A02873j09307j2245O9730J4285o2990m0957J0876J800j2381K7984M4742j9207
798A5203o3765J252P6975K5615q8773q5865M6218J20978K5914r8732o0965R7181
810A1236J40234j0499j43192o3940R7941Q2537r1694j51367m070J20266M9021
$$ plain form
728 -66903 -51165 50968 90276 -15088 -114642 -49433 75919 40603 -121310 -160752 -1457
739 -1457 135574 72885 -61148 -45705 105676 177876 75183 -54559 -45191 48863 51926 -63332
751 -63332 -138714 -83153 4741 10291 -28064 -22286 10002 12096 11090 43528 52269 -12238 -64936
764 -64936 -10360 74594 47661 -50157 -46388 80478 145662 41062 -93969 -77539 46607
775 46607 74862 -57112 -176462 -119064 28978 59404 -44149 -86108 27509 141924 102873
786 102873 -6434 -18679 51051 65336 2346 -38611 -27735 -25935 -38316 -10332 34410 15203
798 15203 -48562 -47310 29665 55280 -33493 -119358 -73140 47838 73752 -24980 -85945 11236
810 11236 151470 140971 -2221 -66161 31780 114317 22623 -128744 -132814 -12548 36473
821C6473p6417n5638N5134P8350R120k7114m545K343j5994m949K5794Q473m1773
834a0743l0413M6132P4570p466q9799m3300P1738P4125o1356j40157l0266J20108
846b6827Q9695p3995j09396M8586J60682N5779j04206q3068O0134R2362k7171
857H2575j07532m4200M5792L8026k0757k9522N966J8881O573R341J3912j6863
$$ plain form
821 36473 -39944 -95582 -40448 37902 47022 19908 15363 17706 1712 -3237 22557 31030 -10743
834 -10743 -41156 4976 79546 72080 -17719 -61019 10719 84844 23488 -116669 -146935 -26827
846 -26827 62868 -11127 -120523 -71937 88745 144524 40318 -42750 17384 109746 82575
857 82575 -24957 -69157 -23365 14661 -6096 -35618 -29652 -10771 -4198 5143 19055 2192
$$ [...]
8191a22
##END NTUPLES=NMR FID
##END=
