##TITLE=1H_LR-762-2-CH1
 CCl4
 8 sc, 
 11.4.2023
##JCAMPDX= 6.0         $$ Bruker NMR JCAMP-DX V2.0
##DATA TYPE= NMR FID
##DATA CLASS= NTUPLES
##ORIGIN= UXNMR, Bruker Analytische Messtechnik GmbH
##OWNER= root
$$ XWIN-NMR		Version 3.5
$$ Tue Apr 11 13:43:27 2023 Russian Standard Time (UT+4h)  she@DPX200
##.OBSERVE FREQUENCY= 200.13135
##.OBSERVE NUCLEUS= ^1H
##.DELAY= (6, 6)
##.ACQUISITION MODE= SIMULTANEOUS
##.ACQUISITION SCHEME= undefined
##.AVERAGES= 8
##.DIGITISER RES= 18
##SPECTROMETER/DATA SYSTEM= spect
##.PULSE SEQUENCE= zg30
##.SOLVENT NAME= MeOD
##.SHIFT REFERENCE= (INTERNAL, MeOD, 0, 15.7039)
##AUDIT TRAIL= $$ (NUMBER, WHEN, WHO, WHERE, WHAT)
$$ ##TITLE= Audit trail, XWIN-NMR		Version 3.5
$$ ##JCAMPDX= 5.01
$$ ##ORIGIN= Bruker BioSpin GmbH
$$ ##OWNER= she
$$ F:/spectra/data/she/nmr/H-F/1/audita.txt
$$ ##AUDIT TRAIL=  $$ (NUMBER, WHEN, WHO, WHERE, WHAT)
(   1,<2023-04-11 13:42:00.70 +0400>,<she>,<DPX200>,
      <created by zg, POWCHK disabled, PULCHK disabled
       configuration hash MD5:
       00 E9 B6 7A A2 85 ED C7 34 08 36 98 17 FE 4E 26
       data hash MD5: 16K
       22 FA 46 B5 2D B0 5C A3 6C ED D8 5D 60 42 31 BE>)
$$ ##END=
$$ 
$$ hash MD5
$$ 87 47 5A 2A 0D 34 B1 5D 38 7F 55 BB 2A E4 F7 F1
##$RELAX= 
##$RELAX= 
##$RELAX= 
##$RELAX= 
##$RELAX= 
##$RELAX= 
$$ Bruker specific parameters
$$ --------------------------
##$DU= <F:/spectra>
##$EXPNO= 1
##$NAME= <H-F>
##$PROCNO= 1
##$TYPE= <nmr>
##$USER= <she>
##$AMP= (0..31)
100 100 100 100 100 100 100 100 100 100 100 100 100 100 100 100 100 100 
100 100 100 100 100 100 100 100 100 100 100 100 100 100 
##$AQSEQ= 0
##$AQ_mod= 1
##$AUNM= <au_zg>
##$AUTOPOS= <>
##$BF1= 200.13
##$BF2= 200.13
##$BF3= 200.13
##$BF4= 200.13
##$BF5= 200.13
##$BF6= 200.13
##$BF7= 200.13
##$BF8= 200.13
##$BYTORDA= 1
##$CFDGTYP= 0
##$CFRGTYP= 5
##$CHEMSTR= <none>
##$CNST= (0..31)
1 1 145 1 1 1 1 1 1 1 1 1 1 1 1 1 1 1 1 1 1 1 1 1 1 1 1 1 1 1 1 1 
##$CPDPRG= <>
##$CPDPRG1= <>
##$CPDPRG2= <>
##$CPDPRG3= <>
##$CPDPRG4= <mlev>
##$CPDPRG5= <mlev>
##$CPDPRG6= <mlev>
##$CPDPRG7= <mlev>
##$CPDPRG8= <mlev>
##$CPDPRGB= <>
##$CPDPRGT= <>
##$D= (0..31)
0 1.2 0 0 0 0 0 0 0 0.06 0 0.03 0 0 0 0 0.0002 0 0 0 0 0 0 0 0 0 0 0 0 
0 0 0 
##$DATE= 1681206120
##$DBL= (0..7)
120 120 120 120 120 120 120 120 
##$DBP= (0..7)
150 150 150 150 150 150 150 150 
##$DBP07= 0
##$DBPNAM0= <>
##$DBPNAM1= <>
##$DBPNAM2= <>
##$DBPNAM3= <>
##$DBPNAM4= <>
##$DBPNAM5= <>
##$DBPNAM6= <>
##$DBPNAM7= <>
##$DBPOAL= (0..7)
0.5 0.5 0.5 0.5 0.5 0.5 0.5 0.5 
##$DBPOFFS= (0..7)
0 0 0 0 0 0 0 0 
##$DE= 6
##$DECBNUC= <off>
##$DECIM= 32
##$DECNUC= <off>
##$DECSTAT= 4
##$DIGMOD= 1
##$DIGTYP= 9
##$DL= (0..7)
0 120 120 120 120 120 120 120 
##$DP= (0..7)
150 150 150 150 150 150 150 150 
##$DP07= 0
##$DPNAME0= <>
##$DPNAME1= <>
##$DPNAME2= <>
##$DPNAME3= <>
##$DPNAME4= <>
##$DPNAME5= <>
##$DPNAME6= <>
##$DPNAME7= <>
##$DPOAL= (0..7)
0.5 0.5 0.5 0.5 0.5 0.5 0.5 0.5 
##$DPOFFS= (0..7)
0 0 0 0 0 0 0 0 
##$DQDMODE= 0
##$DR= 18
##$DS= 0
##$DSLIST= <SSSSSSSSSSSSSSS>
$$ [...]
##$SUBNAM2= <"">
##$SUBNAM3= <"">
##$SUBNAM4= <"">
##$SUBNAM5= <"">
##$SUBNAM6= <"">
##$SUBNAM7= <"">
##$SUBNAM8= <"">
##$SUBNAM9= <"">
##$SW= 18.05172834244
##$SWIBOX= (0..15)
0 0 2 0 0 0 0 0 0 0 0 0 0 0 0 0 
##$SW_h= 3612.71676300578
##$TD= 16384
##$TD0= 1
##$TE= 0
##$TE2= 300
##$TE3= 300
##$TEG= 300
##$TL= (0..7)
0 120 120 120 120 120 120 120 
##$TP= (0..7)
150 150 150 150 150 150 150 150 
##$TP07= 0
##$TPNAME0= <>
##$TPNAME1= <>
##$TPNAME2= <>
##$TPNAME3= <>
##$TPNAME4= <>
##$TPNAME5= <>
##$TPNAME6= <>
##$TPNAME7= <>
##$TPOAL= (0..7)
0.5 0.5 0.5 0.5 0.5 0.5 0.5 0.5 
##$TPOFFS= (0..7)
0 0 0 0 0 0 0 0 
##$TUNHIN= 0
##$TUNHOUT= 0
##$TUNXOUT= 0
##$USERA1= <user>
##$USERA2= <user>
##$USERA3= <user>
##$USERA4= <user>
##$USERA5= <user>
##$V9= 5
##$VALIST= <valist>
##$VCLIST= <CCCCCCCCCCCCCCC>
##$VD= 0
##$VDLIST= <DDDDDDDDDDDDDDD>
##$VPLIST= <PPPPPPPPPPPPPPP>
##$VTLIST= <TTTTTTTTTTTTTTT>
##$WBST= 1024
##$WBSW= 4
##$XGAIN= (0..3)
0 0 0 0 
##$XL= 0
##$YL= 0
##$YMAX_a= 81752
##$YMIN_a= -82447
##$ZGOPTNS= <>
##$ZL1= 120
##$ZL2= 120
##$ZL3= 120
##$ZL4= 120
##$ABSF1= 10
##$ABSF2= 0
##$ABSG= 5
##$ABSL= 3
##$ALPHA= 0
##$AQORDER= 0
##$ASSFAC= 0
##$ASSFACI= 0
##$ASSFACX= 0
##$ASSWID= 0
##$AUNMP= <proc_1d>
##$AZFE= 0.1
##$AZFW= 0.1
##$BCFW= 1
##$BC_mod= 2
##$BYTORDP= 1
##$COROFFS= 0
##$CY= 11.3945322036743
##$DATMOD= 1
##$DC= 2
##$DFILT= <>
##$DTYPP= 0
##$F1P= 2.36226072786647
##$F2P= -0.459571619588291
##$FCOR= 0.5
##$FTSIZE= 0
##$FT_mod= 4
##$GAMMA= 1
##$GB= 0.15
##$INTBC= 1
##$INTSCL= 1
##$ISEN= 128
##$LB= 0.24
##$LEV0= 0
##$LPBIN= 0
##$MAXI= 10000
##$MC2= 0
##$MEAN= 0
##$ME_mod= 0
##$MI= 1.114404
##$NCOEF= 0
##$NC_proc= 0
##$NLEV= 6
##$NOISF1= 3.799351
##$NOISF2= 2.8
##$NSP= 1
##$NTH_PI= 0
##$NZP= 0
##$OFFSET= 15.70392
##$PC= 1
##$PHC0= -19383.12
##$PHC1= 11.4008
##$PH_mod= 1
##$PKNL= yes
##$PPARMOD= 0
##$PSCAL= 0
##$PSIGN= 0
##$REVERSE= no
##$SF= 200.130013532006
##$SI= 16384
##$SIGF1= 3
##$SIGF2= 2
##$SINO= 400
##$SIOLD= 16384
##$SREGLST= <1H.CDCl3>
##$SSB= 0
##$STSI= 0
##$STSR= 0
##$SW_p= 3612.71676300578
##$SYMM= 0
##$S_DEV= 0
##$TDeff= 0
##$TDoff= 0
##$TI= <>
##$TILT= no
##$TM1= 0
##$TM2= 0
##$TOPLEV= 0
##$USERP1= <user>
##$USERP2= <user>
##$USERP3= <user>
##$USERP4= <user>
##$USERP5= <user>
##$WDW= 1
##$XDIM= 8192
##$YMAX_p= 0
##$YMIN_p= 0
$$ End of Bruker specific parameters
$$ ---------------------------------
##NTUPLES= NMR FID
##VAR_NAME=  TIME,          FID/REAL,        FID/IMAG
##SYMBOL=    X,             R,               I
##VAR_TYPE=  INDEPENDENT,   DEPENDENT,       DEPENDENT
##VAR_FORM=  AFFN,          ASDF,            ASDF
##VAR_DIM=   8192,          8192,            8192
##UNITS=     SECONDS,       ARBITRARY UNITS, ARBITRARY UNITS
##FACTOR=    0.0002768,     1,               1
##FIRST=     0,             0,               0
##LAST=      2.2672688,     0,               0
##MIN=       0,             -82447,          0
##MAX=       2.2672688,     81752,           0
$$ Real data points
##PAGE= N=1
##DATA TABLE= (X++(R..R)), XYDATA
0@%%%%%%%%%%%%%%%Qj6J6j6J6j6K4l2L2m0M8n1N9o8P6q8J04j16J28j44J60j80
37i6K03k25K50k79L10l43L76m13M56n02N53o09O70p37Q12q96R89j092J209j347
57g11J506j691J913k182K516k944L508m285N422p224J0475j7915N9055J0863j40753
72h2447J35737o2016k34L3328m9160N3242j7824j0649k9171M9246K3831q3781
84c9898O4083k3397O027Q78l0694P0066n7381K4126k7324o025J01291j35187N8662
97E227M4429r5760Q3038n2225J5166M7748o9646P416K5227K3979n8886K7649K4641
110B8003n2244N1332n5206L7952L5632q4069M8122j7625K8471j3604m2922Q3932
122D7774o6647J0716J8900l5658P1776o3750q860M3688j5398n332j3804M0283
$$ y = [0, 0, 0, 0, 0, 0, 0, 0, 0, 0, 0, 0, 0, 0, 0, 0, 8, -8, 8, -8, 8, -8, 16, -16, 16, -24, 24, -27, 32, -36, 40, -48, 56, -60, 68, -76, 84, -96, 107, -118, 132, -147, 163, -180, 196, -217, 239, -263, 290, -319, 351, -386, 426, -470, 519, -573, 636, -711, 795, -896, 1017, -1165, 1351, -1593, 1915, -2370, 3052, -4172, 6303, -11612, 47443, 58306, -82447, 53290, -8726, -8960, 24368, -24792, 28450, 10626, -23, -29194, 20052, 43883, -39898, 24185, 788, 6815, 7693, -23001, 47065, -10316, 13810, -13514, -19539, 81752, -53435, 5227, 49656, -46104, 36934, -15291, -125, 47623, -22023, -14607, 10620, 34599, -24287, 3362, 28003, -24241, 27091, -28115, 9837, 45469, -38600, 9522, -8103, 20368, 6764, -36158, 47774, -18873, -8157, 10743, -24915, 46861, -16889, -25749, 17939, 2541, -2791, -16595, 23688]
134B3688l3417K287O866k3245O8991o6738m587N2217m6550L1169k8053J9514J6858
147A9000n0362L3657j3098K5978j2372l7280N2535k4935p03J979K020K0750m1371
160b4202J9103n83J2946J396m2596N0910k0366j1855K0877j8591L3661l5386l345
173a8031K7349j2887J3527k9677K2843N832k7640K3534j0612J9554j7211j8134
185b1553L4341j5933R384j3135K854J9017l0992J6936J936N095l709k3177K9694
198A0758r157k67J807j0181K4001k7185N438J5881q421O368k1902J7071N003j2779
212c565J0390r094J2639j0969q906K1133o103M88j2034P409P678j2509J0740q180
226h83R151m690j6574K5174o443m214Q92p227J3586r358P65N217j409j259j1581
$$ y = [23688, -9729, -7442, -576, -23821, 45170, -21568, -26155, 26062, -20488, 10681, -17372, 2142, 19000, -31362, 2295, -10803, 15175, 2803, -34477, 18058, -6877, -7580, -5601, -3581, 17169, -24202, -5099, -5682, 7264, 8660, -33936, 16974, -3392, -15247, 5630, -12961, 20700, -14686, -18031, 9318, -3569, 9958, -19719, 3124, 8956, -18684, 4850, -5762, 13792, -3419, -21553, 12788, -3145, 6239, -6896, -4042, 14975, -16017, 919, 2855, 7950, 4241, -18936, 10758, 1601, 1334, 3141, -7040, 16961, -10224, -4786, 11095, 2674, 9042, -12860, 4211, 9214, -3565, 6825, -2269, 10370, -599, -9505, 11628, 5525, 6013, -6021, 1388, 9066, -3443, 7297, -883, 8268, 3578, -12996, 12178, 5735, 1521, 2413, -4814, 8772, -586, 179, 5396, 3987, 2728, -8853]
241h853J3747K198o448R30n285Q890o099p21O772l272J112j1395Q481P700j0242
256b485M273m358K089K059p001Q551L10m592m783L207O559m701L51k054J231O99
272f45n279P088J738n136k225q48P150k155k140J180r66K66l273M075L936m183
288a417l260l5M250O76k668J384l69r14k321K650M626k762l623l32K980J450j815
305a500O04J011j968k150K176M169r50l536j220K515J565j404P18J445k224k045
321b794J214L929N63l412j677K156R89q47J097R83j258k566J88L869J662l676
337D20p98P71O97l2M32J323n10k959r20M209J378k696m83l86L40J188j506L194
355C662q23l441k1J636L012k150j227N22j175J467p78J598J202l939n33J056L178
$$ y = [-8853, 4894, 7092, 644, 1574, -3711, 5179, -920, -1641, 5131, 1859, 2971, -8424, 57, 7757, -2485, 1788, -2570, -481, 1578, -5423, 3128, 3438, -1154, -5937, -2730, 3829, -872, -521, -2575, -1344, -645, -5924, 1164, 2902, -2234, -4459, -5307, 1843, -312, -2452, -1272, -2238, -1972, -5245, -1170, 2766, -1417, -4677, -4712, -462, 214, -2454, -1070, -1439, -2353, -4674, -2024, 2602, -160, -3783, -4115, -1135, 315, -1500, -896, 115, -1853, -4003, -1827, 2342, 1392, -2144, -3364, -849, 716, -688, 30, 1475, -749, -2794, -1580, 2349, 2912, -500, -2177, -21, 968, 121, 1218, 2201, 943, -1623, -1435, 2434, 4096, 420, -378, 393, 1090, 1058, 1490, 2813, 2303, -656, -1576, 2633, 4011, 1315, 832, 446, 786, 1974, 468, 3662, 2839, -602, -623, 1013, 4025, 1875, 648, 1170, -5, 1462, 684, 2282, 3484, -455, -988, 68, 3246]
372C246j820o71O75l308L838k303N78M795p234J532O23k60L463l706J017j541
388a076N91N11j257M996n243p0J024j970N864m895J646j149j641M098n206O618
404B841k770l798M736n986P356j812l739M470n583N413m039K461L108p133N241
419G66n705N486K138p658P240o206L808l99l757R613r069L049k052N61P323j0721
435e583P570l849m1M510j0206J4327p158m214O731p333J1281q262k58N510n881
450b856N379q742J0881q67j0117R709q251J0562n391n453J1868j0557P364q536
464e007N757J0190k1430J4921n030p34R817j7840J4924k027o796K021J664Q762
478I192j5743Q522j545j965J1486k1473J7947J85j4608J2221q686J4803j2080
$$ y = [3246, 1426, 755, 1430, -1878, 1960, -343, 235, 5030, -2204, -672, -49, -309, 3154, -552, 465, -1076, -485, 26, -1231, 3765, -1478, -1548, -524, -2494, 3370, -1525, 121, -1028, -2669, 1429, -3777, 2841, 71, -3727, 1009, -4977, 2379, 567, -3172, 1298, -4285, 1128, -2911, -450, 2658, -4475, 766, -4939, 547, 2685, -4973, 2267, -3939, -131, -530, -4287, 5326, -3743, -694, -2746, -2185, 5138, -5583, 1987, -1862, -1903, 2607, -7599, 6728, -430, -4644, 2087, -5246, 6035, -2227, -2485, 3025, -2856, 2523, -6219, 4662, 3795, -6322, 3387, -4864, 5698, 307, -5146, 6722, -3835, 3529, -5007, 750, 10940, -10490, 4431, -599, -1333, 8484, -9356, 5568, 3541, -3255, -1234, 430, 9192, -6551, 1971, 426, -1539, 9947, -11526, 6421, 6606, -8002, 4219, -4467, 10336, -1744]
491a744m782J5241j4468J3721j2703J340J7998k3927P832M454Q87k902o515J0948
505E380r147J1470j3668M07K4980l3511J3336O750j0726J5083k1764J4052K716
518E358r530N680r193K1611j8186o302K0081j3058Q340j0679M232Q024j0292M356
532D42r319K3260j6711j3582L1397k4115J2738k898j4421K9199k2391O8Q824L49
546B840J083j7929K1005o646j972L725j3211K4083j6497m933J2195l116O589k2544
560a5328K0193J298j5566J8319k2064K2003k416k5424K9070q849r28m382J42J3037
574I105j4931Q448r125J1566K999k6046K7111p133l013J790j0085K2418j8401
587e297L250L949m746J5712k8612J7740R019j9031J2367j1251J3547l830j0727
$$ y = [-1744, -6526, 8715, -5753, 7968, -4735, -3395, 14603, -9324, -1492, 2962, 3849, 947, -5568, 5380, -3767, 7703, -5965, -5558, 19422, -14089, -753, 5997, -4729, 10354, -11410, 2642, 5358, -4172, 1508, -7685, 13926, -4260, -10562, 9519, -3539, 4801, -5878, -1646, 6378, -3914, 442, -8877, 14383, -2328, -15910, 15487, -8628, 4110, 1212, -13209, 15990, -6401, -6333, 2491, 2840, 3923, -14006, 6999, 353, -1619, 2106, -11105, 12978, -3519, -8452, 3743, 627, 7216, -15328, 4865, 6163, -9403, 8916, -13148, 8855, 6439, -18985, 10085, 1236, 308, -4074, -3932, 9105, -5826, 2622, -6503, 5063, 8062, -17984, 9127, 1994, -1019, 771, -9314, 13104, -5297, -2047, 1902, -2844, 12868, -15744, 1996, 11015, -8016, 4351, -6900, 6647, 2817, -7910]
600g910J2100n064R561j8922Q117J5341k2096J3627r746P551N740k0969J9073
613F403n396J670m407o520K2228j9201M025K951m509J2767k0628J2628L697p592
627a884L549j0196J8966j1059m985J0779r705J3309j5833M057J3051j5508Q181
640B722q601J0235N56j4226J5039q023N938n347n185J7560j5095M225j172M29
654i45Q491j6743J2064j105l042L056r403J5546q717l019N742n260J0312j3467
668f490N590O156r427O985q717R563m76r771R990o203O389n523k583J1384j0917
683d050M931l063J881N369j1238Q140k430R95K68o229J1539q318P52K492m049
698c010Q697j0140L923L172m825M260o047P058k005m506N622m635N925m886j044
$$ y = [-7910, 4190, -874, 8687, -10235, -2118, 13223, -8873, 4754, -4992, 2559, 8299, -12670, 6403, 1007, 2677, -1730, -8250, 13978, -5223, -1198, 1753, -2756, 10011, -10617, 2011, 5708, -1884, 1665, -8531, 10435, -624, -5609, 5170, -4535, 8774, -7059, -3002, 10049, -5459, 2722, -5879, 4356, 4912, -9314, 5725, -2298, 3640, -1707, -6892, 10668, -4427, -202, -1374, -945, 7546, -9197, 2867, 1762, -1280, 1776, -7627, 7919, -798, -3817, 1925, -3335, 6977, -6490, -900, 5256, -4171, 2814, -5903, 3660, 3184, -6587, 3403, -2800, 3589, -1934, -4517, 6867, -4050, 881, -2182, -301, 5068, -6170, 1970, -460, 535, 803, -5426, 6113, -2205, -1453, 1039, -3010, 5687, -4453, -530, 2642, -2183, 2077, -3970, 3088, 1083, -3423, 2199, -2436, 3489, -1397, -2441]
713b441O266o223L865l324K529K204o623N744l045K117P0m558P071m896R83P94
729E33j676M322n599K776L94j310K366m328M656j866j710K997l066L946l310r0
745i65K749k918K508k360J452Q47k985K928j991J798o21k057L444k759J455l24
761B01p92K052k588J440j11k41R13k139K184j063k60J161j556J675j302K4P88
778C86o16Q13j272R34j01q49J472j393R01m3j088J284n15J11n9j54K91m54O02
797B50m86K44K62r66R23l20J6J72l40K33j53R5N5j28L19n48K34K31l06L69l37
818a81Q6L8k0j7J66l8j91M6J30j24K75l12L5K51l97L25mk7m7m9o1K24L8k40J04
843A0J78m66M65j23j67L97n46K71R1p5J7j39L18m50K54J61m68P76p91J67M02m54
$$ y = [-2441, 3825, -2398, 1467, -1857, 672, 2876, -3747, 1997, -1048, 1069, 1139, -3419, 3652, -1244, -261, 533, -1143, 3179, -2420, 356, 750, -560, 1806, -2522, 2134, 268, -1442, 1555, -1511, 2435, -875, -965, 1784, -1134, 1374, -986, 466, 1313, -1672, 1256, -735, 1063, 442, -1615, 1829, -930, 525, 201, -591, 1461, -1127, 313, 202, -39, 874, -1265, 919, -144, -404, 757, -799, 876, -426, -402, 386, -230, 583, -689, 245, 144, -705, 767, -626, 275, 232, -856, 428, -87, 24, -35, -189, 102, -352, 250, -236, 8, 270, -696, 227, -93, -77, 95, -245, -12, -165, -70, -15, -143, 176, -372, -138, 93, -213, 156, -181, -95, -57, -77, -94, 72, 34, -157, -111, 19, -105, 170, -142, -107, 144, -253, 72, 68, 41, -6, -55, -116, 108, 146, -94, 10, 188, -278, 187, 64, -103, 294, -252, 19, 110, 35, 52, -87, 231, -219, 35, 196, -272, 504, -287, -120, 282, -172]
865a72L96m00M04k51j16N28q80J112o88m49J212j156Q69n10%N53r44R09p30N76
885B63J02j326J838j227M39K07r52J719j837R66m2m47J218k117J763l31q11J327
903G52j819K287j691j93J696k059K364k410Q13J614k668K129j573J385j74k095
919a642L227k643J992j130j288L930m025J819o5m85J708l621L617j645N8J174
935I81l623N604l912m89L233l097K905l240J655J274k475K478l875M928j884l643
951c180O189m558K585j343j425M509m365K313k134K283J392o755P551l398m26
966g62K427n017O597l789n79J389n48L236p324O164j98m197N567o820O285q60
982A571n252N673k738L030n023K262M112p144O149n184K925L672r479P672j705
$$ y = [-172, 224, -176, 228, -23, -139, 389, -491, 621, -67, -516, 696, -460, 409, -101, -101, 452, -492, 417, -313, 263, 365, -961, 877, -350, 89, 296, -656, 1063, -774, 192, 150, -297, 921, -1196, 567, 236, -575, 752, -1067, 1220, -471, -664, 1032, -1027, 1337, -1073, -260, 1354, -1314, 815, -758, 627, 453, -1642, 1585, -1058, 934, -196, -1484, 2446, -1579, 240, 175, -310, 1398, -2223, 1394, -251, -193, 981, -2642, 2962, -950, -1439, 1794, -1303, 1602, -1638, 17, 1291, -1184, 1294, -2581, 2347, 463, -3180, 3009, -1549, 1036, -307, -1732, 2777, -1588, 725, -1409, 874, 2266, -4489, 3062, -336, -762, 1665, -3352, 3245, -544, -1123, 266, -282, 2954, -4370, 1794, 1596, -2601, 2966, -3854, 2431, 1571, -3681, 1992, -746, 2284, -2739, -477, 3635, -3509, 2640, -2544, 381, 4053, -5426, 2246, 541]
997E41k86p39j959O912p173L521j261j215P274j1296O429K379n389L602m469O696
1013C567l933j424L241l915P766r449K402P360r523N615l795L223J482o712O250
1028B155l735M901m912k522J0945j0346L656P1j713O265r531N700q4k88K20o139
1044e357J1723p786j171N217n718Q164q420J417N920n707L115n642Q023k206o452
1059d880Q416o231O090m207l733J0289p946K506k162K395L671j0025Q425l188
1073e80J214J172p880J1631o004j781L126k550O558r441M551K275l902M493q491
1088e609R371j758o591P213m742N828n621j137P726p199M501n116L845L725j0107
1103e671Q001k942J858m09n662R699o181R92N1j440P058j0112N071J472k852L565
$$ y = [541, 255, -484, -2443, 4469, -2704, 817, -444, -1659, 5615, -5681, 748, 3127, -2262, 1340, -3129, 3567, -366, -1790, 1451, -2464, 5302, -4147, -1745, 5615, -3908, 1707, -2088, 1135, 2617, -4095, 2155, -1580, 3321, -1591, -4113, 6832, -3514, 142, 213, -1500, 4765, -4766, 934, 850, 562, 782, -5357, 6366, -1420, -2591, 2626, -3092, 5072, -3348, -1931, 3989, -1718, 1397, -4245, 3778, 1572, -4880, 3536, -2695, 3395, -812, -4545, 5744, -2202, 304, -1858, 537, 4208, -5817, 2608, -580, 634, 1806, -6074, 5557, -447, -2228, 898, -1652, 4906, -4535, 16, 2291, -1611, 2882, -5609, 3762, 2004, -4587, 2626, -2116, 3712, -1909, -3046, 4680, -2519, 1982, -3134, 711, 4436, -5671, 2330, -612, 1246, 837, -4825, 4874, -1307, -315, -264, -1704, 5354, -4758, 313, 1785, -1067, 2498]
1119B498p390Q315k312l903M523m088O647o583M2O067n885M296n399M219K234
1134C281p466O330l508L408j691m446Q455n835J943j242m34N542q282M894m91
1149D58o35K209o449P665k882j998K784l357O006o049J124L492l902L822n511
1164c223M400J099n252M710l263L480k052k613N760m469K576k439N61L988o377
1179c114M189j216J65J327m544N565k583l18R02k120M758n086J736J590k393K891
1195A749m283L578P1k800K811k735L439k365j026L579l385K559k423Q86K320l921
1211a946K833j487R62L52k712L770k429P51l8j249L225l432J509K91r89J728k748
1228a609K486m85j196J501j888K513j768j92J641j878J778j717Q34R76k058J704
$$ y = [2498, -4892, 3423, 1111, -2792, 1731, -2357, 4290, -2293, -2251, 3816, -2069, 2227, -3172, 1047, 3281, -4185, 2145, -1363, 2045, 354, -4092, 4363, -1472, 471, -771, -1205, 4337, -3945, 949, 458, -177, 2032, -4417, 3248, 366, -1632, 1152, -2205, 3801, -2248, -1124, 2368, -1534, 2288, -3223, 1177, 2276, -2976, 1734, -1529, 1951, -101, -2714, 3046, -1423, 1153, -1286, -725, 3263, -3114, 1075, -141, 24, 1351, -3193, 2372, -211, -529, 373, -1747, 3011, -2075, -339, 1251, -1142, 1749, -2534, 1044, 1115, -1685, 1126, -1609, 1830, -535, -1561, 2018, -1367, 1192, -1231, -345, 1975, -1946, 887, -600, 362, 714, -1998, 1772, -657, 94, 56, -1193, 2032, -1400, 109, 400, -589, 1139, -1609, 877, 392, -804, 697, -1191, 1322, -446, -638, 1003, -875, 903, -814, 20, 996, -1062, 642]
1244F42j186R70l6j377K053j642Q61k93m85J631j859R86j92k59Q43j401J402o88
1262c0j75O32j060J524j152Q9O23q89J003q81M41K48q25Q03o45O38k06n24Q49
1281D63p83N49k13j14N21p75N07j63k4L48o69O33l96N3K71l77M50m23P3J76k29
1302a22L44l38R1N2k41L79k67K28j90q2K13k51K69j42q8J72k19J80J9n2O0k02
1324a87J87j79K16j0j44J38j83Q1J46j13O1j25O4l2N1J38k15J22j21j7J85j35
1346g2O8j8r9R6p2K65k62R4j9j30K60k15J47k8j55J61j65K66n8k00L04l84L59
1369A43j35j8K14l80K43j55J85J24l93L85l24J86P4k83N61o63L68j57l5N51q82
1390c91O52j54m21P26o87O04j63m01M39l49O10p22L62J92p34R24p91N43J53r38
$$ y = [642, -544, 426, 390, -987, 1066, -576, 285, -8, -493, 1138, -721, 265, 73, -186, 657, -744, 658, -30, -205, 427, -633, 891, -261, -172, 451, -438, 565, -316, 125, 373, -452, 351, -294, 344, 138, -386, 463, -320, 229, 16, -98, 423, -352, 155, -8, -32, 316, -353, 280, -116, -63, 208, -169, 281, -142, -69, 107, -122, 222, -116, -25, 27, -214, 165, -102, 126, -64, -146, 67, -184, 85, -57, -145, 27, -192, -12, 7, -45, 15, -187, 0, -179, 37, 27, -117, 21, -162, -81, 65, -48, 13, -112, -48, -80, -29, 109, -106, 16, -105, -122, 63, -72, -4, -22, -121, -25, -97, 168, -94, 0, -19, -149, 111, -104, 43, 15, -140, 21, -144, 122, 64, -136, 168, -216, 143, 8, -10, 204, -176, 67, -88, 97, 221, -172, 213, -111, 75, 149, -134, 427, -236, 132, -25, -60, 491, -391, 261, 107, -314, 412, -275, 329, 166, -235, 204, -145, 465, -257, 105, 297, -437, 487, -304, 239, 392, -546]
1410e46R56o81P20m89l55J295j651J103k34n05J352j695P65K88m34K96n99J177
1428G63j303N99J76q84J857k167P97Q89j448J347j332J197l07j142J786j648J688
1445H68j077r19K462k080P94q8k8N96j539J544j090J186m68j891L575k747N11
1462c91J098j740K363k446Q78R19j119J190k382K741q58j645K524k003J794j420
1478d97m29K063j726J294k130K109L53l271L875k424J117M13k980M138k197k2
1494c14L39m23K042l531K503j71q45J613l466L819j120j520J771j509K684l362
1510a490J122K014k883K832l463K296J595m327L462j522J097p89j510L592k755
1525g29J402j496M06K977m972L148l21n68J128l369M506k115n91J039j806M114
$$ y = [-546, 410, -271, 449, -40, -395, 900, -751, 352, 118, -387, 965, -730, 35, 323, -111, 185, -414, 763, -540, 59, 235, -649, 1208, -959, -162, 727, -721, 626, -706, 491, 184, -958, 828, -820, 868, -209, -1128, 1334, -746, 48, -40, -68, 528, -1011, 533, -557, 629, 161, -1730, 1845, -902, -391, 707, -1033, 1330, -1116, -238, 681, -438, 752, -1630, 1111, 253, -1392, 1132, -871, 923, -497, -926, 1137, -589, 705, -1425, 684, 1037, -2234, 1641, -783, 334, 747, -2233, 1905, -292, -314, 25, -398, 1644, -1887, 616, 445, -400, 1213, -2253, 1566, 446, -1074, 697, -812, 1872, -1490, -368, 1646, -1237, 1595, -1868, 428, 2023, -2304, 1158, -364, 733, -56, -1566, 2026, -729, 673, -823, -417, 2560, -2412, 736, 415, -153, 975, -2394, 2112, -3, -594, 445, -1361, 2753]
1541B753m532J174K457k996K417l235K913M61l082K583k060L017k513j137M291
1556B511l720K008j927P18K964m898L052j000P86K40l402N057k773j11O09j483
1572a369M113m559J350J504j722J961l832M016n54k613K554k347L654k836j036
1587a716L714l118K093k579J704K061m520L207j686J732l23l160M797k848N80
1602f2k17q70L844m692J840N85p78J713l930M032r60j609J672k023L817l344k80
1619a262K817k550K354l103K043J475l706K764j763K177q21k579M058k527J064
1634D41q72l33L108m064J958j55R3J037l487L791j334p15J110j875L508l129N9
1651h59J970j727J973l006K159O55k450K124j810K317j236j684L060k110J433
$$ y = [2753, -1779, -605, 1852, -1144, 1273, -1962, 951, 1412, -1670, 913, -1147, 1870, -643, -1780, 2511, -1209, 799, -1128, -410, 2554, -2344, 708, -292, 494, 734, -2668, 2389, -384, -495, 114, -1369, 2744, -1815, -465, 1039, -683, 1278, -2554, 1462, 908, -1705, 849, -1498, 2156, -680, -1716, 1998, -1120, 973, -1606, 98, 2159, -2361, 846, -840, 892, 569, -2591, 2206, -642, -62, -279, -1149, 2695, -1997, -157, 428, -350, 1363, -2567, 1465, 505, -1104, 568, -1455, 2362, -982, -1262, 1555, -995, 1359, -1744, 299, 1774, -1932, 832, -931, 1246, 425, -2154, 1904, -623, 441, -431, -764, 2344, -1720, 238, 83, 176, 1213, -2274, 1517, 183, -532, 578, -1297, 2211, -918, -859, 1111, -616, 1357, -1649, 510, 1165, -1285, 839, -971, 1346, 110, -1574, 1486, -624, 809]
1666H09j436J75K224l201J978p72N48O36k811L069j228j02M40j383K717k573O36
1683b74Q73r61J469k618K036J16j412J421j583J939j152q90K045j589J296j481
1699g65M59J368k069J508r38O98K09j796K204j105L40j35p97J917j866P75J61
1716A68m85J047j858J548j53p37Q48j185J501r57k20J014r86R82j209N77P29j272
1734f48J044r20O53R3r75J357q84M04k20l27J125j189O51j81j76O36j045R53k66
1753H5k44L53o92J012o74Q6L70o13O87p07M25K95o58N22n32M44J2m31O38n86L79
1774A71k40k1N07o39L66j71l7L38m89N06l02j8J64k88M85l58M1R2k38L52k86J91
1796A26J0k64K63k34L00j41j09J90k95K69j05J1J49k83J58o9K7J17j90J13j09
$$ y = [809, -627, -452, 1772, -1429, 549, -223, 325, 961, -1850, 1219, -9, -111, 329, -1054, 1663, -910, -274, 599, -362, 1107, -1511, 525, 641, -771, 650, -933, 1006, -146, -1036, 1009, -580, 716, -765, -306, 1062, -1007, 501, -437, 261, 470, -1326, 878, -227, 113, -22, -819, 1098, -768, 7, 168, -317, 730, -1128, 420, 267, -470, 378, -807, 694, -263, -483, 531, -455, 527, -682, -105, 624, -648, 396, -524, 129, 222, -753, 604, -280, 124, -96, -423, 702, -487, 164, -17, -193, 443, -602, 351, 85, -159, 194, -498, 514, -160, -74, 296, -317, 370, -337, 88, 383, -275, 247, -285, 159, 171, -260, 378, -208, 171, -69, -90, 417, -222, 144, -27, -64, 274, -215, 291, -11, -29, 135, -153, 332, -26, 15, 107, -131, 221, -65, 126, 136, -128, 135, -99, 201, 60, -49, 141, -154, 115, 10, 21, 170, -113, 45, -24, 3, 120, -70, 43, -66]
1817f6M3N3o6J46j91M6K5o5J94j41%j7o8J67j16J25j22j7P1r0J35k6j01Q4j31
1842a28J15OJ4j1r9J08j53J33j7k6L3r6Q0L4l4Q4j72J27r1k6K12k04Q9m7j7J03
1868A7o1R5r7K2rp9K77k42J01l7p2J81j99K63j70q3J98l21L91q1k34L37l31J73
1892C9ql2J07j44J15k81L47j6l19M57m57L09j9k68M86m47K67j91L8L93o25M37
1914A88r1k58M14m36M16j37j59P9r0M66p02M55K7m60P11p63N17J00o75O77m78
1935a99M57l00k09P00q31N83l35K9N83r50N61j37R7K4m75R34q81M16j5m45J206
1956H13j393N18M18p15P68q92Q11j74o05P25p13J055q83j76J034j026P14n97L34
1975A6M61j181J064o92O84k25j017J759j275L54J53n45J237j472O31K22k85N66
$$ y = [-66, -23, 30, -36, 110, -81, -35, -10, -75, 119, -22, -22, -39, -107, 60, -56, 69, -53, -70, 1, -89, 46, 20, -81, 3, -128, -13, -7, 7, -4, -103, 5, -148, -15, -32, -58, -25, -121, -41, -7, -41, 43, -129, -2, -93, -119, 93, -111, -22, -69, -86, 17, -44, 51, -46, -24, -33, -112, 165, -77, 24, -13, -85, 96, -103, 160, -10, -93, 105, -216, 175, 94, -140, 197, -134, 39, 31, -1, 106, -38, 77, -204, 143, 127, -192, 265, -192, 117, 98, -170, 316, -131, 136, -55, -17, 376, -249, 188, 97, -161, 253, -183, 233, 96, -63, 16, -74, 392, -310, 145, 172, -288, 423, -340, 177, 277, -398, 279, -199, 258, -42, -251, 449, -382, 201, -134, -105, 478, -472, 89, -48, 49, 73, -402, 532, -349, 67, 52, -393, 813, -580, -62, 356, -359, 409, -483, 328, 154, -451, 274, -439, 616, -267, -443, 591, -435, 279, -318, 16, 477, -704, 360, -332, 352, 127, -890, 869, -406, -52, 101, -444, 793, -679, -48, 174, -111, 455]
1993D55j421J640o32m84Q35r74J457j311pJ073j000R21j305J001L53j532J510
2010E79j037R66l53j133J891j222N23m67jJ246j967J248k64KN70j802K054p70
2028F3l89N73q25J666j753L89R25j009J111j803J474K77j539J376j089J329q56
2045h0p79J869j386Q63j022L20J398k194J380n46M38K09j763K289j109N8R2p16
2063f79K025k184O90N89p14J017j999J832q0j166J085j155J745j284n10J717j370
2080d41J037j388P55J118k061J423q58Q86j10j604K279j262L40k96m56J956k197
2097h79Q29J70k53Q83k027J924l54p50P16j049J924j503k47J257j108J156j653
2114i64J071P61j753J280j003J214m31j225J924j219O37o03j46J662k031R73k35
$$ y = [455, -966, 674, 42, -442, 393, -581, 876, -435, -442, 631, -369, 552, -753, 248, 601, -931, 579, -458, 508, 155, -978, 913, -309, 214, -253, -254, 992, -975, 273, 9, 11, 581, -1221, 833, 63, -326, 247, -578, 1088, -665, -276, 649, -360, 751, -1052, 422, 699, -840, 536, -553, 776, -80, -859, 1010, -376, 487, -535, -215, 1183, -1011, 369, -177, 261, 470, -1293, 996, -113, -55, 37, -679, 1346, -838, -148, 441, -273, 744, -1255, 577, 497, -669, 416, -739, 1006, -278, -788, 929, -441, 596, -792, -37, 1081, -980, 443, -415, 471, 361, -1243, 1036, -226, 114, -182, -638, 1318, -879, -50, 120, -133, 750, -1277, 647, 293, -457, 259, -790, 1134, -369, -616, 641, -467, 689, -964, 107, 868, -885, 395, -608, 606, 175, -1050, 874, -345, 292, -311, -457, 1205, -826, 147, -88]
2131h8J19O23j793J839o10l04L82q84J828j556P4Q04p81J053j595J103M03j240
2149f23R68r40J274n48r33J487j038Q07q49R1J281j687R31m52M00L51j420J476
2167E76o02J4R0o24J476j383L67K88m22R11j475J070P1p42O95q41J123o38m78
2186e24J016q02P82q53K25P78j143P64n14M85Q7r58J103n95K96j70l88J107j108
2205d12L94J18k27O09j031P60q5l11L98o33Q78n83j56N82n51O40p27K75L88o51
2225c25N33m67M42o8n59P60n04L16j67k64O76o62L52r9l1L03o49N92k12l7K09
2246A39m39O05m19J3K56k89L81m95K42J53l08L36l64L16o6k70M21l45K54j66j01
2267a46L63l72K45j30kJ63l55L81j69JJ01k57L55k57P0M7j18K06k59J77M6k02
$$ y = [-88, 31, 654, -1139, 700, 90, -214, 168, -716, 1112, -444, -370, 434, -347, 706, -889, 214, 617, -623, 345, -595, 679, 131, -802, 685, -353, 454, -395, -304, 977, -710, 221, -231, 169, 520, -900, 576, -26, -12, 78, -546, 930, -453, -86, 202, -220, 691, -784, 286, 357, -385, 310, -531, 592, -46, -524, 492, -310, 472, -381, -156, 622, -521, 243, -271, 214, 301, -657, 446, -149, 147, -23, -411, 696, -412, -18, 100, -127, 482, -549, 211, 126, -185, 213, -420, 458, -125, -281, 301, -250, 390, -337, -62, 326, -325, 208, -259, 183, 115, -444, 316, -188, 128, -39, -303, 373, -289, 63, -36, -67, 236, -413, 179, -33, -70, 139, -300, 305, -114, -101, 155, -134, 247, -248, -6, 147, -161, 175, -189, 127, 61, -209, 212, -133, 121, -45, -146, 217, -155, 90, -40, -42, 121, -234, 147, -22, -21, 80, -177, 178, -79, -9, 38, -80, 126, -133, 44, 90, -112]
2289a12K19k34J78lj33K14j74J39j34K9J36j77J14j02M4R0j90J90j09K0J4o1J51
2312A09j32K0J9o1R1r5Q5Jr9J05j03P6rk2P2j18R0l3PN4q3O3m0RN8r5P8o1M2J4
2342D2p4P5o4N2k2k6N4r3Q3k9k4P7j23R9m3k7N9p4Q1n3K1K2n8Q8q0N0j4k4O6j02
2372f1R6m8JM3j02J48q1l8J20j63J18n8rJ07j14N4o2P0Mq3J37j13O6lj24K20k21
2399i6J36o9l0J24j60J57q5J2Q7k24K54j08n1J33j78K27k04R7K5q1J47k47K14
2422H0j0k05K97k72K05r0j12K72k58J92k11J08J75l61L05j69L8Q1k77L92k38M8
2444a0L4j49L78m76K71K1j95L15m27L75m1k58L08l06L91l53L7K98l92L61l42J86
2466B6J92n03M65k71K05p6l23N97m97K71j46j16N45o92L81Mj55L13n72N86k37
$$ y = [-112, 107, -127, 51, 48, -85, 129, -45, 94, -40, -11, 125, -52, 62, -40, 4, 94, -96, 94, -15, 5, 19, -42, 109, -23, -3, 16, -45, 46, -49, 36, 37, -62, 43, -60, 16, 7, -15, 57, -61, 29, -4, 3, 57, -26, 37, -3, 6, 64, -31, 47, -14, 28, 42, -32, 43, -21, 31, 9, -17, 37, -56, 27, -2, -26, 51, -72, 27, -16, -43, 16, -58, 23, -30, -9, 13, -45, 43, -37, 13, -1, -25, 41, -61, 35, -13, -12, 31, -71, 77, -4, -42, 78, -85, 33, -25, -34, 73, -41, 13, -49, 21, 25, -58, 79, -34, 32, 29, -95, 125, -96, 40, -29, -59, 65, -95, 62, -23, -11, 76, -148, 106, -2, -53, 80, -98, 129, -75, 22, 47, -34, 113, -134, 80, 70, -135, 162, -110, 95, 5, -107, 165, -93, 99, -112, -4, 171, -190, 115, -54, -16, 65, -212, 180, -58, -10, 24, -125, 253, -223, 48, 69, -126, 189, -238, 137, 96, -162, 146, -160, 231, -122, -85, 213, -179, 182, -160, 26, 218, -285, 180, -91, 114, 38, -285, 312, -185, 86, -60, -176, 369, -323, 58, 62, -93, 220, -352, 234, -3]
2487cj43K64l94O63n88O4M11m63M47n77L98J68n93N50m30M72j95m02P43n92L36
2508A36k40j7N80q52M96j48P8J91p37R00m31n0J82l87P76p75J97K95l83N18p94
2529d65O49N4n89N95n79P19m47k89P71o27M53n09J78N76r46O40l12K67Q4q08J041
2550D56n39J30l1l28Q94r61L38J65k56N01r52Q37m3m92M92n93Q80o59j93P29o02
2571b27N57p34L41N16q82O40m63N00n6p43R91n93K85k36j80R20j039M49k2o3M45
2592D06j028R58k13l13L55n62R65p64q3N67n14O45q82M87L71p95O38n64O52k28
2612I8n96R10o09M19m08m4Q00r75N02j87R8L06r04R42l54l3J18m84R79q35J42
2633a15K88l65O24r14O14J42n32M67n82P24l34m02P14n52M79m95O0O47p94M53
$$ y = [-3, -146, 118, -276, 387, -201, -137, 274, -189, 258, -319, 79, 247, -346, 204, -226, 246, 51, -351, 392, -200, 136, -104, -121, 459, -393, 103, -45, 33, 224, -513, 387, -44, -94, 88, -299, 477, -298, -101, 194, -189, 329, -465, 184, 238, -351, 244, -335, 384, -63, -352, 419, -208, 245, -264, -86, 490, -456, 184, -128, 139, 223, -585, 456, -83, 47, 16, -312, 582, -379, -41, 124, -132, 369, -583, 254, 211, -281, 211, -382, 498, -161, -354, 375, -227, 330, -404, -63, 453, -429, 211, -252, 248, 192, -551, 440, -153, 132, -104, -284, 636, -403, 46, 24, -39, 406, -622, 336, 123, -190, 165, -397, 568, -196, -279, 288, -226, 419, -463, 24, 395, -400, 238, -326, 326, 98, -498, 412, -197, 222, -186, -230, 570, -405, 97, -90, 8, 314, -590, 352, -2, -35, 83, -401, 578, -257, -115, 173, -192, 432, -482, 132, 274, -258, 209, -373, 351, 17, -385, 329, -223, 256, -239, -179, 468, -326, 127]
2653A27l06K55J90p89Q60l78O7J5l67Q15p06J52J68k29M95q05O02m2k95L46n27
2674c52P16l67k67N28m50M62n21J83M09o28M75m13L44M0n29O26l73J77j03k35
2694b78O44n91K76o8q3L92o40N18j33j21K19m28N84l66o2K95l12L97m50K33J92
2715B18l99L33l40K80J5l42L97k97K51j73j06M14m28K38j12K5J81m16L74j36k3
2736d6J26k91M11k69J5J13j53K83l41J55R6j91J72k24K31n1j70K56k23K15j36
2757b2p6K60k90J98j10L5R7k42K19j12L2N5j63K41k20R7N2j10J72k25J10M2p6
2780c6R8j61J69o9o2J38j46J25j04K5J05j59J06m8J6O1j34J32p9L9J5o5J29j34
2804c9P4Jp8P3p4P3l2m5Q9j21J06o1%P6r5P9n4RN4r1P9k7ML1q2J00q8O4k4mP0
$$ y = [127, -179, 76, 266, -523, 337, -41, 26, 41, -326, 489, -217, -65, 103, -126, 369, -436, 166, 124, -171, 175, -352, 364, -3, -270, 258, -192, 270, -251, -68, 341, -287, 188, -225, 119, 159, -370, 256, -117, 60, -43, -278, 366, -225, 51, -17, -100, 292, -348, 170, 37, -84, 135, -293, 291, -75, -137, 158, -154, 243, -207, 26, 218, -181, 152, -188, 92, 107, -235, 162, -135, 116, -57, -163, 251, -177, 61, -51, -26, 155, -261, 113, -23, -46, 80, -211, 200, -69, -54, 59, -94, 189, -152, 3, 99, -92, 80, -144, 87, 36, -134, 122, -101, 114, -22, -98, 162, -128, 70, -40, -5, 92, -150, 69, -43, -11, 44, -119, 122, -98, -1, 51, -59, 113, -112, -2, 40, -36, 62, -99, 70, 1, -61, 77, -69, 56, -48, -23, 82, -77, 29, -19, -3, 58, -76, 56, -23, 16, 31, -34, 95, -39, 35, 36, -42, 31, -43, 30, -2, -47, 42, -79, 27, -34, -34, 42, -53, 26, -28, -19, 35, -56, 23, -4, 0, 31, -51, 49, -39, 25, 1, -3, 67]
2835F7r4L3NlK1l7M7m0J4K4p0O3l6qM1n9M7m7JM4o5P6q7O5j0l3O5o1L4J9n9N7
2867A4m0L6lj3K2l4M5m2NM1n1N8o6J8M2n5O6n0L5j8l5Q4j09P0j7l2P8j04O9j8
2897dk3N0n5P5o7J0Pn8J01r2N3M0p2P7r5Q2Mo0Q9j04P4k4m2J07r7N8m9rR4j29
2927e9J17p6L8J3j40K19j43K3L0q7J52j45R3k4m7R8j78J60l0r3J51j68J90j40
2951d6j0J43j70J57j62J02P4j86K00j70J16L0k04K69k23J55r0o2K65l40K00l0
2973A8n0J54l11L03j21m3J10k05L20k87K9J76j94K32l14K05R3k59K55k30K22j01
2995Bj70L43k62J86j58rK49l48K46q8K7J17l75M17k25K6Q8k29M05l85J17Q5j45
3018h6K72m41L31L4k65K67l17L72k06j53L51k78K88l29J17K63m27L21k27J83O2
$$ y = [67, -27, 6, 11, 8, 29, -8, 39, -1, 13, 37, -33, 30, -6, -14, 27, -32, 15, -32, -31, 13, -52, 24, -63, 2, -8, -41, 24, -37, -3, 16, -43, 14, -26, 10, 7, -6, 16, -18, 27, -15, -10, 31, -20, 38, -28, -10, 32, -23, 43, -7, 28, 10, -25, 59, -50, 20, 3, -29, 49, -55, 14, -4, -27, 23, -32, 43, -24, -14, -7, -65, 36, -56, -3, 37, -35, 42, -53, 29, 33, -27, 62, -42, 32, 8, -34, 73, -24, 34, -15, -24, 70, -59, 58, -18, 20, 33, -107, 112, -31, -8, 22, -65, 87, -58, 35, 11, -36, 62, -116, 44, 14, -79, 72, -96, 94, -46, -56, 87, -83, 74, -88, 14, 88, -98, 102, -68, 48, 78, -126, 143, -80, 75, -15, -77, 188, -152, 48, 18, -32, 122, -189, 114, -7, -50, 60, -145, 175, -112, -83, 93, -101, 131, -183, 22, 115, -144, 111, -119, 103, 2, -168, 175, -87, 99, -59, -68, 181, -167, 79, -9, 18, 135, -240, 177, -48, -22, 66, -163, 242, -143, -26, 59, -86, 186, -255, 76, 110, -155, 112, -205, 167, -39, -192, 159, -119, 169, -160, -43, 220, -207, 114, -113, 70, 132]
3039A32m19N08k78J01o6j36M62m56J49L2j04L01n08M14n0k05K30l59N13l52o5
3060a56L22l24L79m10J87J88m20L55k99L08j9l93M92l09K06j44j35M79n04K50
3080E3r9J8K47n65N21j51o7J34l48N70l85n5K50k34L54m95K72J71l60L21l66M07
3102A93j44l19M79l22K90k80l7M22m83K76j60P0K09n03M86k04L4M2l13N68m16
3123a12N3J17j45L68n46L22Q1k65K66l68M50k15j90L66l01K94l12K1L48m20L08
3144A20k52J92Q5m15M41k53J31n4k15M50l87J86l8n4K85m81L08J9j25J52l02M35
3166B28k33j35K83k89L63l51J09K17l22K46k73K65J9l37L73k34J69r3j69M21l84
3187a27J79p2l4K27l79K81p3k5R6k69L94k28m7J42j70K91l01R1J46k54K41k39
$$ y = [132, -287, 221, -57, 44, -22, -158, 304, -152, -3, 29, -75, 226, -282, 132, 82, -123, 107, -252, 261, -91, -156, 166, -158, 221, -189, -2, 186, -234, 121, -178, 130, 111, -282, 210, -99, 107, -37, -172, 307, -197, 53, -46, -28, 219, -346, 175, 24, -43, 91, -257, 313, -72, -127, 123, -111, 243, -252, 20, 191, -169, 152, -214, 193, 49, -270, 209, -113, 177, -103, -140, 282, -201, 75, -85, -15, 194, -309, 177, -27, 7, 49, -264, 304, -112, -59, 58, -87, 281, -265, 57, 138, -127, 139, -229, 221, 6, -184, 182, -119, 175, -137, -116, 232, -188, 120, -132, 60, 145, -270, 171, -82, 49, -5, -220, 230, -157, 29, -9, -63, 222, -259, 49, 68, -57, 95, -207, 228, -5, -140, 143, -146, 217, -134, -25, 192, -130, 116, -157, 108, 127, -210, 163, -71, 98, 5, -164, 257, -127, 52, -20, -54, 173, -206, 75, 2, -23, 73, -196, 198, -30, -77, 65, -105, 186, -115, -24, 122, -132, 109, -130]
3209a30K34k5k20K65k07J78j05r8K84k50J34r3J4J35k71K46j54P4L5j86K64j65
3231d1L0J8j02K19k24J11L1q7J49k12J79l2j08J60j59J37r3k4J39j74J34j05O5
3254A1O6j67J49o8M0kj19K02j51N5l3l1J23j47Q6k9k3O2j19J41o2n5J25j19J09
3279D4q6NQ0r5P9l9M4J7j23J23r7P8k6o8J07o1O4k8n2R6q1J7K1j8P3j17J03m9
3307A1m3N0l5M0o5M8M3r3N7l5K1J2o9Q4n4N5k2l7O1m0J8Pj7L2n3L3Mj1K7l4M1
3338C6m2jL9l0K5k0mrOKj5K1kl9L3k5K9j4m6R8p5M1%l0N7o0M8j7k4J6j6L5n1M9
3372A5lk2L3qJ1k7j8L8m8M2Qm6M2o0O0j3jK3q1M9J0Lnj8M0o8J4M2m5M9m8L3J4
3405A5n4O1p0R0m0l8N7m7O7n8JN7n3K5k2L1j0p3R9m1lK7m9R2r0M2j6j0O6j11N9
$$ y = [-130, 104, 79, -141, 124, -83, 95, -10, -108, 176, -74, 60, -33, -19, 116, -155, 91, -63, 11, 46, -140, 124, -41, -11, 7, -95, 124, -100, 11, 42, -45, 104, -108, 71, 39, -69, 91, -68, 69, -24, -48, 91, -83, 51, -54, 11, 77, -90, 59, -9, 31, 29, -90, 112, -39, 16, -17, -48, 75, -72, 14, -15, -38, 24, -95, 46, -16, -71, 54, -65, 44, -42, -37, 43, -52, 27, -12, 32, 49, -74, 49, -48, 30, 4, -64, 43, -18, 46, 18, -34, 62, -19, -2, 19, 1, 74, -43, 60, 11, -32, 18, -17, 23, -42, 6, 49, -44, 13, -22, -1, 11, -58, 26, -28, 27, 5, -32, 29, -11, 7, 14, -3, 29, -24, 9, 13, 2, 29, -5, 36, -6, -7, 32, 2, 27, 7, 3, -6, 0, 2, -13, 8, 6, -33, 0, -25, 4, -10, -56, 42, -33, 8, 8, -22, 35, -25, 23, 6, -18, -2, -18, 17, -34, 15, 12, -10, 23, 15, 26, -1, -19, 19, -29, 13, 21, -25, 17, -43, 17, 4, 3, 26, -55, -6, 4, 7, 2, -16, 24, -44, -30, 12, -33, 16, -32, 1, 15, -39, 22, -48, 42, 2, -36, 21, -26, 41, -17, -16, 41, -12, 13, -9, 22, 12, -61, 38, -3, -6, 21, -28, 64, -26, 16, 0, -10, 56, -55, 4]
3436DLm3P3r5P4l8k3R7j20J17q6L7N3j29J09p0O3J0j02J32j02N3k6l1J40j65J13
3463D8j5l8P0j67J61m7l1N1j07J73j24J4P0j00J05j47J01Ro9R0j19J16k1j14J65
3488G4j27J12o1m7J52j64R0n6L1P0k03J99p0K1Oj17K20j76L6P4r3J59k31J36M2
3513G7j49J49k08K12o1j27J81j42J52j58M0J46k09J52j16Q7O1k70K90j55Q2o8
3535c4o7K70k77J23j9k0J77l19K42l2p0J01k17K90j64n1J32j35J88j96O3J53k51
3558a13K11k00J48J4k02K58j65J40j09j16L03k62J11m8jJ92l43K50l1n9P9j94
3580a37L26k04n7J22j04K12k81J05J18j79J91k02K02n8j99K70j66J46j18r3K74
3601A68k70J57j05M3J33k96K43j13P4Nj78L06k46N4O2q6J79k93J87M6j45J69k35
$$ y = [4, 7, -36, 37, -58, 16, -22, -45, 52, -68, 49, -37, 0, 53, -76, 33, -37, 26, 36, -66, 66, -36, 17, -9, -40, 100, -65, 48, 33, -5, 65, -102, 59, 12, -19, 32, -75, 98, -26, -12, 58, -42, 63, -84, 17, 26, -43, 47, -72, 44, 23, -91, 74, -53, 59, -2, -49, 103, -61, 29, -27, 4, 74, -129, 70, 0, 21, 27, -90, 130, -46, -10, 64, -29, 130, -101, 35, 77, -72, 77, -131, 81, 20, -107, 74, -68, 84, -74, -34, 112, -97, 55, -61, 26, 87, -183, 107, -48, 34, -34, -101, 169, -108, 15, -4, -24, 153, -166, 76, 44, -26, 75, -142, 148, -16, -67, 65, -70, 118, -78, -15, 138, -113, 98, -102, 46, 60, -142, 116, -49, 91, -18, -134, 169, -93, 18, -30, -31, 161, -182, 68, 37, -22, 57, -137, 189, -15, -72, 50, -54, 158, -123, -18, 100, -79, 112, -90, 112, 54, -145, 125, -41, 105, -13, -106, 168, -102, 55, -50, -7, 126, -170, 73, -40, 34, 39, -139, 167, -79, -25, 37, -49, 130, -163, 24, 70, -75, 94, -141]
3624a41K77j02j52K17j95K01j99J1K51k37J45j61J03J06k76K01p8O9j9j87L32
3645A66k26N6k0n6K51l19J87Jr1J02j84K25q0r7J50j73K45k05K7J53j80J55j64
3668g7J30M1k23K07j10J05n9j10K25k12J00k0m4J72k56J62l3j6P4j92K31j10p
3691b2N8j25K25j96N0J00j78J79j83J26L7j89J72j21J41q7o9K33k07Q9l1mR0k01
3715a13J86o8K4j4j03J78r6j8P1j01J44j41L8N1q6Q0j07J33k6q5J18j24Q9m9l8
3740e7J54j60R7m6K3P3j32R5o5L4K8j02J40j01L3J3o8J11j10N9jo5Q2r3J20l8
3766B4m1L8n8J08j01lO6r0P0m4J6O1p0K5j4J7J0p9R5n7L6J8m3M3p3O0Ok6M1r2
3796e7J05l7k9M0n5P2k1l9M9k8K9k3k0J8k7K8j2J3k1j3J6mNrJ0K9l6J2%j8M2k7
$$ y = [-141, 136, 34, -118, 99, -96, 105, -94, -83, 168, -69, 76, -85, 18, 124, -152, 49, -29, 40, 21, -166, 166, -60, -4, -24, -80, 171, -148, 39, 40, -51, 51, -133, 92, 12, -85, 65, -108, 137, -68, -41, 112, -68, 87, -77, 53, 94, -129, 78, -32, 73, 14, -96, 129, -83, 17, -3, -47, 125, -131, 31, -2, -18, 56, -136, 95, -15, -22, 36, -89, 136, -60, -10, 90, -88, 91, -92, 34, 71, -118, 54, -67, 74, -13, -82, 151, -56, 33, 2, -2, 88, -113, 73, 5, 29, 15, -88, 90, -6, -24, 47, -54, 90, -51, -13, 38, -48, 32, -75, 58, 32, -53, 65, -59, 30, -19, -57, 97, -63, 34, -12, 11, 84, -48, 47, -18, 16, 44, -58, 82, -19, 14, 27, -41, 70, -40, 19, 18, -47, 35, -58, 62, 24, -17, 21, -37, 71, -30, -33, 33, -57, 13, -31, -15, 46, -24, 1, -13, 4, 14, -65, 30, -27, 9, 27, -16, 27, -46, 14, 20, -6, 35, -57, 48, 11, -18, 22, -33, 39, 18, -21, 28, 0, 29, 6, -14, 4, -23, 5, -7, 6, -15, -28, -12, -16, -11, -20, -10, 19, -17, -5, -5, -23, 19, -8]
3828hK5ml4K8k6M9m5K7J5l3J3j1L7j2l7L6n4K0K8k7K7k4L2j0k3J8olJ8l1K0l8
3860c3K8j4qRPJ9l1M9j3k6L2k3Qqk1L6m2L4j2KM0l9J7mJ3J6k9NJ4l2J7nKl1rP7
3896D5o1LQj7K1j8L4n9M0j2nM3m7K4Mk4O8q6L6j5L0K1n8L7pK4Ol5K6k2K3j8k0
3929a1J9j5M1l1j2L8o6O3j6k3N7n8J4jNJ4p6Q2o1oK3mN6n2P8o0l0O4o4O5l6%L6
3962C3p7Q2k4m9O8m8M9o2M0K8o6O5n0NQm3Q3q3P1n3l6Q9q0M8rk1O9j21J09l9J1
3993cJ9m3J32j20J1K4n0Q3q6K6N9r5J08r4P1l0o5J13n4M7n4l4R8j05L8k5L4Lo3
4022e5R3o8K2N2j15J63j33K0M1o3J25j72J31on0M2r7J38n2o0Q0o8R3p2J2P2j32
4049e9Q4o1N1N8j43J24o3L8j8r0J68j35L9J0n4J36j85J05ml7R8j45J53o8l9O5
$$ y = [-8, 17, 13, -21, 7, -19, 30, -15, 12, 27, -6, 7, -4, 33, 21, -16, 20, -34, -14, 14, -13, 14, -10, 22, 12, -11, 7, 1, -2, 16, -15, 5, -33, -5, -19, -27, -18, -11, 8, -23, 26, 13, -13, 19, -4, 4, -4, -25, 11, -31, 3, -9, -7, 33, -6, 11, 7, 20, 36, 7, 12, 26, -6, 11, 6, 8, -23, -32, 45, -16, -13, -5, -22, -1, -19, 15, -44, -4, -16, -21, 22, -25, -1, 3, -21, 47, -39, -3, -18, 12, 33, -25, 12, 5, 29, 35, 0, 26, 4, 27, 9, -11, 8, -7, 34, 3, -9, 29, -37, 26, 10, -13, 44, -14, 0, -1, 4, 18, -58, 24, -37, -43, -20, -24, 32, -20, 58, -2, -32, 32, -32, 33, -3, -3, 33, -44, 38, 14, -35, 33, -15, 34, -28, 12, 40, -26, 39, -11, -6, 2, -41, 42, -41, 30, -23, -59, 30, -50, -2, -11, -32, 37, -84, 25, -14, -3, 16, -27, 105, -15, -4, 20, -30, 53, -33, -7, 52, -43, 65, -29, 42, 12, -53, 60, 6, 53, -1, -35, 63, -42, -4, -29, 5, 8, -55, 38, -30, -8, 44, -71, 92, -41, -21, 20, -43, 82, -90, 41, 35, -15, 27, -70, 68, 16, -44, 36, -32, 61, -11, 1, 73, -59, 25, -36, 15, 73, -70, 54, -9, 29, 11, -79, 89, -46, -7, 3, -51, 85, -100, 5, 1, -36, 62, -83, 70, 2, -37, 28]
4075B8p0J09j26J6J15j47J23j10P2O0j22J09j00P1l7m0J53j41O8n3JJ07j42J13
4099E7o7L4Qj28J75j31L2L0r9J64j65M1R8q7P0j45J34kj14J46r4R6n1o5J71j34
4125b6O9o9K6J12j91J24n9N0k3j09J65o3Rj2n1J49j44M1K2o8Q6j33J32lr5J18
4151E7j11R8o2l4J33r8N8r5N0L4j20J25m6M7j5r1J45j11M2j1k0J06j32Q7ln6N6
4178C3j01J17k9o2P5j02J17p2l3R5n5M1j01P7M2j17R5p8P1l4j5P0o9M4k1k0J05
4205G3j40R5k9j5P2j24J13n1NK0n0J03r9L3M2p9P4q7O0K0q4O3n8P5m9l1Q4o8M6
4234A4m5k3J03p8K8j9KN8p5P3m9J0J6m6O4n7M2No6O1k5L6j9l8M7l9N9k7l0N7m2
4265cPj8qN2o9N1rk9L8p8J03n1JK1k4M0m5J8mk9L5Rj2J3j5J0k4M5k4k1N9n6M9
$$ y = [28, -42, 67, -59, -43, 72, -75, 48, -62, 10, 70, -52, 57, -43, 28, -9, -49, 104, -37, 31, -22, -21, 86, -56, 57, -10, 24, 32, -96, 79, -52, -20, 10, -89, 75, -90, -49, 49, -38, 32, -113, 21, 19, -95, 51, -43, 53, 2, -63, 108, -26, 43, -26, 0, 112, -79, 45, -14, 36, 13, -96, 69, 6, 15, 3, -48, 101, -43, -2, 20, -48, 38, -95, 37, 34, -61, 57, -54, 44, -18, -52, 81, -17, 41, -54, -4, 30, -90, 35, -11, 36, 21, -70, 75, -36, 6, -5, -25, 81, -51, 36, 33, -23, 33, -68, 49, 20, -42, 33, -69, 48, -24, -57, 38, -17, 24, -77, 0, 42, -75, 20, -58, 13, -21, -36, 34, -35, 9, -12, -32, 73, -67, 28, -1, -16, 56, -68, 45, -6, -1, 19, -31, 72, -27, 6, 48, -31, 43, -44, 16, 36, -48, 15, -43, 32, -17, -48, 36, -32, 14, -31, -54, 49, -29, -1, -20, -18, 40, -35, 38, -11, -1, 15, -31, 33, -24, 18, 23, -43, 18, -7, 29, 10, -28, 19, -20, 39, 12, -18, 39, -3, 4, -14, -22, 30, -39, 12, 3, -26, 12, -66, 37, -14, -13, 8, -16, 24, -21, -3, -7, -36, -1, 8, -4, 9, -6, 4, -20, 25, 1, -20, 39, -17, 32]
4298C2j8nnOL6l6jQl4M7m5K4j8j6K7j3J4J5k2L7m8L4l1mJ2j7J6mJ4J7j2j5KKq
4333ioJ5l3K9J4j4MnJ6pJRK7m0jpJ1l0K3j7MJ7k9L9m7K5J5j0LjJ9jl6K9k6L0J4
4370B5k7QkPNl1M4l6J1NpoqL4k5RK4m4L1l0oM5m7L8l0J1Mj0j6nK7oRrj5J5K2n5
4408d1M8mLk5L2J6k4jnJ8j7J4%k6K9n%J4l8K3Nm6N7l2QJ7jnl8L9l4J8Rj8K0m4
4444c4J4J3j5N2p5N5J5n3L7l2M8rk3L3l7J7pJ6Pk3M8l9rK0k7K0l2L9k8j2N9o3
4476b5K7J2k4Mj8J6J0l0L2m1P2qk6J8l5N3n5ML7k8Nl5M3K1o5P3l9M8ol0K3m1J7
4509Ij1qN2p2M3j6K9J8q6Q7l9j6J8n0O5m7j4L9k9M9o6M6%l0M6o2O6k7k5M3n9P3
4541B6l8jM7l6M3j1j6qm1Q1l6Nk1k1P1q0PL7j0L5o3O5k4k8L7o7R9o2k8O2n6M0
$$ y = [32, 14, 9, 4, 10, 46, 10, 9, 17, -17, 30, -15, 9, -9, -25, 2, -11, 3, 18, -4, 33, -15, 19, -12, -16, -4, -21, -5, -9, 5, 22, 10, -5, -3, -1, -9, -15, 0, -33, -4, 10, -4, 0, -5, 11, 4, 5, 14, 41, 1, 0, -7, 4, -26, -3, -20, -16, 1, -28, 11, -36, -11, 4, -6, -3, -4, 15, 14, -22, 7, -19, 11, 25, -2, 6, 4, 11, 16, -15, 29, -7, 4, 9, 2, -4, -12, 22, -3, 6, 30, -14, 17, -13, -19, 26, -21, 17, -13, -2, 2, -8, -24, -29, -2, -8, 1, -8, -23, -8, 14, -41, 7, 3, 6, -19, 13, 29, 5, 4, -1, 17, 0, 14, 14, -12, 17, 12, 12, 26, -12, 11, 16, -30, 27, -5, 3, 20, 19, 14, -24, 15, -19, -1, 8, -10, 10, -34, -20, -7, -22, 30, -45, 10, 25, -28, 9, -23, 25, 16, -7, 26, -11, 6, -1, 15, 22, -1, 47, 8, -1, 19, -8, 12, -20, 19, -9, -21, 38, -25, 2, 14, -10, -6, -24, -8, 2, -28, 4, -37, 35, 27, 1, 19, -16, 37, -18, -14, 23, -5, 0, -35, 8, 29, -36, 37, -2, 46, 40, 10, 33, -8, 9, -2, -10, 42, -30, 13, -3, 26, 44, -42, 45, 6, -10, 8, -42, 23, -24, -38, 1, -28, 21, -45, 1, 1, -29, 17, -45, 21, -6, -31, 12, -47, 26, -12, -13, 34, -2, 41, 30, 14, 6, -35, 46, 10, 15, -6, -27, 44, -36, -29, 8, -2, 33, -30, 35, 11, -17, 20, -47, 52, -10, -38, 24, -32, 8]
4573Hj7NM8o2N5n8M4j5l9Q6p6M0prO4q7L6K6n0M1r5J05m6qK8o8R1m4k2N9n9L1
4605El7J2M2q2P9m4O2o2j3Q1j01O7k9j2O8p0M7k0K5L7j04Q3j2m8N4l9O7o8J3L2
4635C3m7N6q3L9K2p1P6n0N1m8j2O0m5M2o8K9N2r2O3Jj1J8q4J14n4%K0k8P5n8L
4666CL2n6O7r1P5J7n3K9k2M2n6J1L6k8L0n1K1K0k5LlJ0j7k2O8o2K2ql7P0p3N3
4698Ej2QJ6n7N6Rj6J1p1O5lk1K0j7K8m4O2j5m0K2k8N0qm1Q0p9J2K3m5P5m9K5k6
4731erM5o6J6nPRpL3o4M0Kj7M6n3K5K9m3M8n9O0j7m1K5K1j6K8j8L7n4K0k1Jlj7
4766b3L5l3K3j9QJ3m8L8PrK1k8PJ2k4K3k1M3rm2M4k5L5n7L2J3l4M8nl3k2K5QJ0
4800A3pJ3J0kk4K7rl1OJ9pJ0j0pJ9j3K0k1mj4J3qk4O0l7J3j9kL5l9K3KjJjK7k9
$$ y = [8, -9, -4, 44, -18, 37, -21, 23, 8, -31, 55, -21, 19, 12, 3, 67, -20, 16, 42, -8, 33, -62, 43, -3, -11, 17, -51, 40, -4, -26, 33, -26, 5, -32, -20, 22, -60, 19, -25, 37, -25, -38, 43, -58, 9, -20, -32, 36, -34, 13, -7, 18, 55, -49, 34, 22, -26, 28, -11, 56, -12, 1, 33, -14, 42, -41, -2, 20, -51, 25, -25, 26, -22, -34, 26, -19, 23, -45, -16, 36, -56, 7, 8, -3, 15, -69, 45, -9, -9, 11, -17, 58, 0, 3, 35, -21, 46, -45, 30, 47, -6, 23, 1, 43, -13, -2, 34, 6, 36, -15, 6, 26, 1, 4, 1, 11, -6, -28, 40, -22, 0, -8, -45, 25, -48, 5, -7, 1, 17, -40, 16, 25, 9, 20, -51, 14, 11, -10, 10, -7, 21, -23, 39, 24, -16, 6, -22, 28, 20, -21, 59, -20, -8, 15, -30, 45, -4, 21, -5, -14, 31, -35, -19, -24, -17, -8, -15, 18, -46, -6, -4, -21, 25, -28, -3, 26, -17, 31, -28, 32, 15, -26, -1, 20, 4, 32, 14, 51, -3, 17, -4, -3, -6, -23, 12, -21, 2, -17, -9, 4, -44, -6, 1, -8, 13, -15, -8, 4, -20, 3, -18, 25, 16, -26, 18, -7, 28, -29, 3, 16, -18, 30, 25, -8, -30, -5, 3, 13, 6, 19, 29, 27, 3, 30, 21, -10, -4, 15, 8, 18, 8, 1, 20, 7, 27, 6, 2, -12, 1, -7, -31, 29, -8, 5, -14, -16, 19, -20, 3, 5, 4, 5, 4, 31, 2]
4837BJ2J1j0j6K1Pl7OJ3pJ3k4K6k4Lmj6M9k9k1J6rJ4J1j2K0l3J5K6k0K2l2QMj2
4872gL5l8J7J7Knj4NJ7m5K7J4Mlk0j0j7K3j0J7j4J5rkK4j9l3J5lJ2j2J3rJ6L5
4907C8l4j5K2j5K8j3nkj9N5l0J4j3MrNMJ0k9M8n0K0Mk8J3j5J4Mkj8QJk5J7J5r
4943gpJrL2l2J7j5N4j6l5J2j3M3l1kK1k6K1j0K6jlnLJ2j0l0N3l5nKj5K9qnJ3l2
4980a3J9j2KJ4k0K2m1K3KjK3m4M7m1M1k1l2O0l9K8Kk2K7m1K8Om6O9n7O2l1jKm4
5014b9N1l5J0Pk3K6J1l6M4k8Oj8J9j3k7M7m6M4jl1M2n0O1m7J9K7l5L1j1mPo1Q5
5047D2k5j7J8m%m7O3Nl2L4o2L8Nk3L4o9O3m6kL3k7J0j2J1J1l8O8m6J3L9n8K1j1
5080a1K2K4m2N0o4L8k6j2L2k7N3m5lN5n6M2k6K5K1o1M3m3OM1p4N4n0L1K4l6O2
$$ y = [2, 14, 25, 15, -1, 20, 27, -10, -4, 9, 2, 15, -9, 17, -7, -4, -8, -24, 25, -4, -25, -9, -18, -4, 7, -5, 15, -18, -3, 23, 3, 25, -7, 1, 5, -7, 28, -10, 7, 24, 26, 21, 7, 12, 29, -16, 11, 25, 29, 26, 6, -4, -21, 2, -8, 9, -5, 10, 1, -1, 23, 4, -29, -14, -17, -5, -17, -4, -13, 3, 38, 4, -11, 11, -4, 24, 11, 6, 4, -15, 40, 10, 24, 11, 15, 6, 11, 15, 25, -4, 44, -6, 14, 18, -10, 3, -12, 2, 6, 4, -14, -6, -5, -30, -13, 2, -7, -14, -13, -22, 10, -22, -5, -20, 34, 18, -17, -5, -18, 25, -6, -8, 13, -13, 8, -2, 24, 23, 20, 15, 18, 30, 20, -10, 43, 8, 3, 5, -10, 19, 11, 6, 19, -13, 6, -6, -4, 10, -10, 12, -29, -6, -4, -5, 18, -26, 21, -20, 21, 0, -32, 28, -11, 17, 19, -3, 24, -17, 11, 17, -29, 40, -17, 45, 14, 13, 15, -29, 22, -13, -3, 4, -19, 7, 18, -18, 26, -2, 4, -14, 5, -8, -35, 12, -34, 10, 9, -22, 20, -30, 31, -16, 3, 30, -5, 26, 15, 11, 18, -43, 42, 17, 0, 18, 14, 14, -33, 30, 35, 3, 37, -25, 13, 18, -5, 29, -40, 23, -23, -25, 8, -19, -9, -21, -10, 1, -37, 31, -15, -2, 37, -21, 0, -11, 11, 35, -7, 43, -21, 17, -9, -21, 11, -16, 37, -8, -11, 44, -12, 30, 4, 29, 50, -11, 32, -11, -5, 36, -38, 16, -34, -3, 21, -15, 47]
5111D7o5RJ3K0Km2L3mj1qk7P3n1m1Q5m5L2k4KRn1P8m9L6pj6L5l7K4rm2Q0o2J4
5145AplK0q7Q5%mNm7M0l2M3Lk8K3j3MK6n1M8m5L5ml0O3p2N1k6j7N1j6K1k8l0L7
5180A6l0j1L6Ppk6J7j1j0M8m2L3n2L1oj4K7j9K4l7qM2m5N6j1l1M7n2M1MmJ6l8
5213iM1j5LJ2k1K5l4%Jj7O9n3nK3k7K1m1L3Mj3j6KL5m4L8Lm3N9qk3J7o9P3l0K1
5248A2j5k2O5m8J4oj2M5k1jJ1k0K2mJ6j2Jj4pJk6qJ9%M9k7k5QKPj3J9j5mL6l2
5284eNQlJ2j7J6nrJ3j7K3KqkpJ8j3K3j5k2L8nj3opLk9K5J3qk7LJ5k1J5Pn%nj1
5324b1L5l5M7J4l3K0k4J1LnOoj5LK5j7MM3k8j7mJ8k3J0j7QJ0nkk2J6kMj7J8J2
5360A4jj2mpJ3%MJ2j2j2J0npJ3K3pQj6J8k3njJ4L0o2j2M2J4rl2K4j8j2K0l7M0
$$ y = [47, -18, -9, 4, 24, 26, -16, 17, 13, 2, -6, -33, 40, -11, -52, 33, -12, 20, -4, -2, 7, -44, 34, -15, 21, 14, -2, 33, -4, 20, 11, -31, 49, -13, 1, -6, -9, 11, -76, 9, 9, 5, 10, -37, 3, -29, 14, 17, -11, 12, -1, 3, 29, -22, 26, -19, 16, 12, -18, 45, -27, 24, -2, -19, 32, 16, 37, 9, -21, 16, -14, -25, 11, 18, 11, -15, 2, -9, -19, 29, -13, 20, -32, -1, -7, -21, 6, -13, 11, -26, -34, 8, -37, 19, 8, -23, 24, -28, 13, 17, 13, 29, -9, 32, 17, 20, 32, 11, 36, 2, 2, 3, -14, 55, 2, -3, 20, -7, 14, -27, 6, 10, -3, -19, -17, 18, -26, 12, 15, -28, 31, 23, 0, 17, -52, 21, -9, 12, -3, -25, 40, -8, 6, 0, -12, 33, 12, 11, 22, 2, 24, 20, 36, 24, 25, 11, 4, 5, -21, -29, -10, -10, 39, 12, -13, -5, -3, 4, -9, 10, -5, -9, 27, -5, 0, 8, 5, 17, 0, 16, 11, 2, 15, -2, 21, 23, 15, 13, 6, 24, 11, 34, 19, -3, 35, 30, 17, 11, 4, 7, -22, 3, 16, 8, -19, -16, -1, -22, -7, 0, -5, -5, -10, -21, 14, -21, 26, 40, 7, 27, 3, 14, 17, 12, 18, 12, -3, 0, 25, 8, 12, 55, 27, 10, 6, 24, 1, 11, -6, 2, 12, 7, 5, -17, -1, -3, 1, -16, 2, 14, 13, 1, -3, -10, 3, 3, 7, 19, 7, -5, 5, 0, -7, 6, 29, 22, 30, 14, 32, 9, 4, 3, 17, 47, -15, -27, 15, 29, 20, -12, 12, -6, -18, 2, -35, 5]
5396Ek%j7MJ7k1PmOJ1j3Nj4K1qnPj3K3J5qjMPk5J1J9n6N0J4l6RlK3k4Rj9J7j1
5435Dk2K4j8KJ8l6K1K5k8K5l6kL2lj2j3K9j2J3poL0k9L7j3j4PjjjlJ5k5PJ2oO
5472A9k4M5m3JlJ0l1J2LK9m8N2l2JL4k8lJ7rNj7PNJK3j5mMJ0Lkj1k4J7Kk1L5k3
5510cO0p5J8K0l7K1qJ7j1LNj3K4J3m9K1j7J4J4k4J7l7K0K9m5KJ0M2k9kJJ0J2l0
5544gL1ml6N7k7J7jj3Kl3K6j3k3N6n7M6j7Kj0m5N1Ol9L3l2M0K0n5O3o1J8j4K0
5577Amj6L4k4Poj8M0j%k9L1J6k9KJNj0QPK5k6J2m9L8Pk9J2J7k1j2J1%KPj2J2J4
5615B3p7O8j0J6j4l3L5l4M0oOqrK0j8J8ok1L5m1L7%mpl0N8j4j6Kk1L4j8rJ5Oj1
5651Fk9OL5m7L7k8K4J2k2RKnQk0L6k1NmnK5k3QkROj8KJrJ5l2L9j4qK7n6L1k5K7
$$ y = [5, 3, 3, -14, -10, 7, -14, -7, -11, -5, 6, -7, -2, -16, 5, -3, -8, -1, -14, 9, 24, 16, 15, 19, 26, 1, 12, 31, -25, 25, 39, 3, 12, 9, 32, 8, 17, -2, 15, 4, -18, 6, -12, -10, 8, -28, -7, 18, -10, 15, -21, -23, 9, 6, -6, -19, 10, -2, 11, 4, -2, 28, -1, 36, 23, 9, 16, 15, 14, 13, 10, 25, 0, 7, 19, 13, 19, -5, 40, -3, -2, -5, 5, -26, -14, -11, 18, -30, 22, -10, -9, 25, -3, -6, 11, 2, 7, -10, -3, 2, 3, 26, 11, 7, 11, 21, 24, 22, 11, -13, 4, 6, -15, 20, -3, 57, -18, 0, 20, -17, 4, -4, 13, 2, 5, 10, -3, 21, 34, -15, 6, -11, 3, 17, -7, 10, -27, -7, 22, -23, -21, -11, 31, 2, 0, 1, 11, 23, -7, 24, 20, -16, 41, 14, 31, 30, 17, 19, -14, 12, -1, -24, 32, -25, 21, 4, 6, -4, -49, 2, 8, -31, 2, -30, 10, 30, -25, 38, -23, -5, -19, 1, -3, -19, 15, -9, -2, -8, -26, 14, 13, 13, -16, 15, 31, 2, 4, 5, 10, 0, 8, 15, 40, 14, 26, -23, 15, 22, -7, 5, 22, 1, -11, 0, 0, 2, 9, -3, 9, 23, -54, 14, 4, 20, 6, -27, 8, -26, 14, 8, 14, 6, -3, 17, -1, 17, 11, -10, 25, -16, 21, 21, 17, 10, -20, 38, 24, 8, 10, -11, 23, 5, -4, 11, 17, 6, -23, -17, 18, -29, 8, -20, 4, 16, -6, 3, 5, 0, 8, -12, 24, 3, 8, 4, -1, 24, 1, 9, 7, 16, 22, 4, 6, 7, -2, 13, -19, 20, 6, -2, 25, -31, 0, -25, 2]
5690Bjj7K0j0K6m5J1M2n1J4MJ0K2l7N3m4J9mk8L2qPPk6M4k0Kpk5M2l6k2L1rK9
5725B7k8J9m1L9j4PrJ7k3K8l7J5j8K6j4j4M7n7L5Krpj2L2Nj6K2j5J0j4J6J1j9
5758A1LQm3N3l4K9l1M3k1l6Q%J5Rl1L0k3olPK9m0%J6jj2K8J2m1M6j1PKNj2jl6
5795b1N9l2MrOkQMjj8K9l7L6k5j9L2l4K9l0J3LKlkNJLMqQk3J9rJ1J1j0j4L6mJ7
5835C9l0k0K7jJ5k9L3kk6ljNK4l6jN2p1K7j0j2mJ3J7pPl3K6l0K2Nj7%nJ9j4J4
5871gj9K3MK3j7OkrL8j2j1Jjo%J7k8K7j7oK4k8nj2j3K3J6j7j0OJ3j3ROqJ1J3j5
5909DNk6J5j5J8Mj9J4nLJ0K5n2M2%l4J5j6L4j2k4K1j4J8Pm9N2m6J1Lkl%JJ2j5
5945a8K1nJ7oMl1nL2j3j1QRLPJ8j3k9L0l2L0l1J0K6j4OJ2j6Nj1L0l7rK9k7J9J0
$$ y = [2, 1, -16, 4, -6, 20, -25, -14, 28, -23, -9, -5, 5, 27, -10, 43, -1, 18, 14, -14, 18, 10, 17, 24, -2, 42, 22, 24, 17, -8, 34, -2, -24, 7, -2, 27, -1, 18, -23, 16, 2, 9, 0, 17, -6, 22, -15, 0, -18, 8, -6, -20, 27, -30, 5, 7, -2, -9, -21, 11, 16, 0, 22, 7, 17, 3, 19, 30, 11, 14, 22, -21, 32, -2, 27, -4, 39, 18, -18, -10, -10, 5, 14, -17, 13, -10, -16, -19, -12, 17, -23, -23, -7, -8, -20, 8, 20, -21, 25, 14, 21, 23, 28, 16, 15, -21, 38, 6, 10, 1, 7, 5, 13, 17, 16, -2, 27, -10, 26, 1, -18, 14, -20, 9, -21, -8, -5, -3, -6, -8, -3, -2, 1, 5, -3, 5, -18, 1, -8, 3, 14, 4, -10, 26, 22, 39, 9, -11, 16, 15, 30, 1, 34, 32, 6, 3, 2, 7, 31, -5, -6, 46, -25, 2, -8, -20, -24, -11, 6, -1, 6, -27, -1, -31, -9, -4, -21, -21, -26, -7, -21, -7, -26, -3, 1, 24, 7, 13, 11, 2, 40, 28, 17, 18, 17, 11, 11, 28, 0, 27, 10, 4, 28, 0, -5, -17, -30, -7, 9, -8, -18, -12, 1, -12, -3, 3, -5, 6, 19, 4, 9, -17, -2, -17, 1, 5, -14, 0, -5, -2, 8, 33, -19, 23, 23, -11, 4, -12, 22, 10, -14, 7, -7, 11, 18, -31, 21, -25, -14, -11, -13, -16, -16, -15, -3, -18, 3, -2, 15, 9, 13, -18, -23, 9, -4, -15, -7, 2, 5, 12, 30, 17, -12, 18, -14, 16, -15, -5, 21, 7, 13, 25, 9, 14, 3, 33, -4, -13, 16, -11, 8, 18]
5981A8k2Oj4K8k3j6K9j1J0Mk9L7k7J5k8L2k2J2K9m1K6Mk6J2rLK6k8KkL4k2Lk3
6015a3J2J2j3J9j9mK2k4j9L6k3J7k8K3k8QK0nK0k0pJ7k7L4l3M2l2jL1k8J7kQJ1
6049B3Qj4Mj0K5n7M3l4%J1j5N0l7jPJjj4qK5k0J1j8K2J5l3L5rKJ5n1M9k3J9j4
6084Fj5K6k5J5RqnK5j1Jk8OJ7J0j8j1J2k2J8k8L4k3J7J7k1J8k8J2Qm3L1l8N0M
6118A2m2O4lJj8k7J4mJ0mROj8KQJ5k1j0PK3m4L1joj4kmK9qk9K9J0l9L0j3K3j6
6155@K2k1qJJ2j8M0k4K1m5K3J0pJ7k9%J2kJ8m2L5J9m4K0nJj7l0O1k3MRk7L5l2
6190a4J1qJ2oJoqM2k6lK1k5JK6j3K3j9J2k2j0L4l7K4J3j4Nk4L7j8j2LjJ9j0j2
6225dN2p4K7k0J4Rk7J8qMK1k8Qk0J6%J6K2l3lLK5j4LK0j5Mj1J2l0K2J0k2qK3K0
$$ y = [18, -4, 2, -12, 16, -7, -23, 6, -5, 5, 9, -20, 17, -10, 5, -23, 9, -13, -1, 28, -13, 13, 17, -9, 3, -6, -3, 23, -5, -3, -5, 29, 7, 10, -13, -1, 11, -2, 17, -2, -6, 16, -8, -27, 9, -14, 3, -25, -2, -30, -22, -2, -7, 13, -7, -14, 3, -24, 10, -23, 19, -13, -14, 17, -11, 6, 4, 12, 23, 31, 17, 21, 11, 36, -21, 22, -12, -12, -1, -16, 34, -3, -4, 3, 4, 3, -11, -19, 6, -14, -3, -21, 1, 16, -17, 18, 9, 11, 26, -25, 24, 1, 20, 6, -9, 17, -8, 7, 16, 8, 3, 28, 17, 18, -10, -4, 13, 23, 5, -6, 6, -16, 2, -26, 8, -15, 2, 19, -2, 16, -12, 0, 8, -35, -4, -42, 8, 12, -30, 34, 31, 32, 14, -13, 1, -3, 7, 3, 12, 18, 0, 2, 10, 25, 4, -6, 1, 24, -20, 11, 10, 4, -10, -12, -16, 13, 5, -24, 5, 15, -24, 6, -7, 16, 0, 22, 1, -7, -6, 6, -12, 28, 4, 25, -20, 3, 13, 6, 23, -6, -6, 6, 4, 22, -20, 15, 34, -10, 10, 5, 6, -11, -41, 20, -3, 1, 10, -17, 18, -14, -3, -11, 1, -5, -4, -10, -18, 24, -2, -5, 16, -9, -8, 18, 5, 28, 9, 21, -1, -11, 23, -14, 10, 23, 9, 14, -10, 27, 9, -3, 0, -1, 18, 8, -4, 48, -26, 1, -19, -5, 4, -23, -5, -13, -9, 12, -16, -8, -28, -12, -12, 4, 26, -7, -10, -7, 18, 4, 7, 27, 12, 16, 5, 17, -13, 9, 19, -3, -11, 12, 32]
6261C2rrj1L4l0l0J1K0J0k4j0lJ7PqJ1k7J5%j1NJ4j9KK6k1%J2Ll5M9k0qM8nqO
6298C4J3j8lj2j8J5J3k7Q%QnjJ2l3RjK4oJ4k2Jnk7QK9k4j6K7j8K4mj2K2l0M3l0
6335hJ8%J6l7K9Jj6J9j5j3%K7k1k3M0qk6K2J9j8MJj2j0J4Nj6joJ0J4j6J0pJ6q
6371DJ6k0rM1pk2J9j9kJ6nQj2Mjk4K9j2LK9l3Rj9K0kj7L0m0K9%k5Qj3L8l7K0l5
6408c1L8ljMmmM2l2PNl5QL4pk7J9J1l8J6J6mQl7J5j7M1j1j1J0j9L5n2K0Lj4K4
6444INk9J7k1J3j%J2mOj2R%j3M2m1J1kL2k6mL5k2j5NnK4j1lj5%J7k1k0P0l2j8
6481hqM0l5Rnk4J8J6j5Rj8L7j6K0k6mL8l5JK5k5M5l3nL1m5J2K2rlL0l1Qj6l1K8
6517clJ6j8L1j7Nk6K1Jjj5l0N3l7L3rk9K7MkOj6K0qJ2kLJ4nk3K9k7J7Mk9NJ1K0
$$ y = [32, 23, 14, 3, 37, 7, -23, -12, 8, 18, -6, -16, -19, -2, 5, -3, 8, -19, -4, -4, -15, -10, 4, -15, -13, 13, -8, -8, 4, 7, -28, 21, 1, -7, 41, 36, 28, 34, 47, 29, 26, 14, -4, 11, 24, -3, 5, 5, 13, 8, 7, 19, -14, -5, -6, 18, 12, 26, 4, 5, 0, -27, -19, 10, -14, -30, -3, -21, 3, -1, -13, 9, -21, 22, -8, 10, 10, 26, -11, 18, 19, 3, 22, 7, -6, -6, 21, 0, -23, 17, 9, -17, 5, 24, 6, 10, 11, -1, -11, 3, 8, -8, -9, -15, -5, 9, -7, 3, -4, 12, 4, 20, 0, -9, 32, 25, 3, 22, 3, 1, 17, 12, 20, 8, 12, 11, -13, 16, 4, 7, 36, 3, 12, -7, 13, 11, -6, 24, -16, 13, 13, -12, -4, -17, 21, -16, 4, -31, 7, 4, 3, 7, 3, -1, 41, 9, 16, 21, -14, -6, 28, 21, -6, 13, 24, -14, 2, 18, 14, 22, -15, 0, -17, 24, 13, 2, 12, -7, 28, -24, -4, -1, -15, 9, 14, -15, 2, -19, -6, -7, -7, 5, 1, 7, -5, 4, 4, -9, 33, -8, 3, 1, 33, 7, 3, 38, 16, 1, 6, 1, 25, 14, 11, -4, -4, 13, -8, -28, 42, 10, -8, -16, 24, -11, -2, -7, -31, -13, 3, -12, -3, -21, 16, 0, 20, -6, -10, 28, -7, -6, 19, -6, 39, 6, 1, 32, -13, -1, 21, 12, 9, 39, 8, 16, 0, -31, -3, -6, 10, -8, 23, 6, 11, -15, 6, 7, 6, -9, -39, 14, -23, 10, 1, -28, -1, 3, 1, 7, -9, 11, 3, 15, 13, 16, 30, 25, 2, 31, 4, 21, 25, -4, 1, 12, 32]
6555C2k1Kk2K8mk3J6k9J0mJL2l1J8j8J2K3k0qK8k3Lj9J8JJ8J2k1Rj1j5J4okjJ
6591@J5JK2k5J1k8K6lqj2mJ4pj4J0oJ0j8lK0j4L8Lk5j0J8Kk6K0k9K8joJ0J9l5
6627gJ7j4L9rk8J6j2J9Ml0OJ6pkj1L2m3K6oj7L6o2K3Nj4N3n0RmkK7nRl5J5NJ3
6664A2lk7L2J3k2qJ7K%k1QJ2OJ1pMk8Rk5L4nj3j6J3J4lj7K0j3rj5%L0k2K4j%J
6702Gl1M3rj2K5rj2mPkPPj3jNmL4l6L5l5k1K9qMj8LJ2j8mKl0N0k7L0k2jJ2j6K5
6741DpNlLKnkLJ6k6NJ1nOQPj2J7k0J5k8kJ4J8j6%mm6N0j0nK8j4j0j3K2j3k1L5
6780Gl1J0j0M5j8nkOKLk4K7Nj1K4n5L1J0k8K4j3K7Oj4j4rJ8%Mk2JOJ1%JprJ3k5
6819a6K6k6QJ3k5K9Ojj1rJ6j5J4oM5m5oPJRLKkl4N9m2%Rj7J7j2k6kL3j1J7k7K5
$$ y = [32, 11, 13, -9, 19, 15, -8, 8, -21, -11, -15, -14, 18, -13, 5, -13, -1, 22, 2, -6, 22, -1, 2, -17, 1, 2, 20, 32, 11, 20, 9, -6, 8, 2, 0, -1, 0, 15, 16, 38, 13, 24, -4, 22, 19, 11, -1, -5, 9, 2, -12, -2, -8, 2, -16, -19, 1, -13, 25, 28, 3, -7, 11, 13, -13, 7, -22, 6, 5, -1, 9, 28, -7, 10, -4, 35, 26, -2, 14, 2, 21, 25, -5, 1, 17, 10, 8, -3, 29, -14, 12, 6, -11, 25, -37, -14, -9, -23, 30, -20, -11, -15, -17, 10, 5, 14, -21, -6, -1, 12, 9, -18, 14, 27, 5, -3, 14, 16, 16, -5, 3, 15, 21, 32, 25, 29, 1, 10, -15, 19, 14, 1, -15, -2, 12, 9, -8, 12, -1, -10, -25, -25, 5, -17, 7, 6, 6, 7, -24, 19, 10, -2, 23, 14, 2, -2, 5, 3, 10, 17, 4, 3, 8, 4, 38, 2, 37, 2, -19, 10, 2, 6, -12, -9, 3, -15, -19, -17, -47, 3, -24, 6, -16, -17, -5, -21, 4, -3, 2, -1, 2, 4, -1, -3, 0, 16, -10, -5, 6, 1, 7, 15, 22, 10, 27, 7, 22, -6, -8, 6, 24, 8, 8, 4, -42, 8, -2, -7, 21, 7, -3, -16, 6, -7, -28, 7, -24, -14, -24, 21, 3, -2, -4, 2, 4, 7, -17, 10, 15, 4, 28, -27, 4, 14, -14, 10, -3, 24, 30, 16, 2, -7, 11, 11, 15, -7, -6, 0, 11, 11, 12, 5, -4, 9, -16, 10, -16, -8, 5, -20, 9, 15, 14, 3, -6, 10, -5, 9, 3, 48, 3, -3, 4, 5, 14, 17, 19, 17, -17, 42, 0, 0, 9, -8, 9, -3, -29, -31, 2, -9, 8, -19, 6]
6857Fl0J4k3J9kK5k4j1K2j6L7k3JqJ6j5J0pK9rqJ3Pk7K0k0L1jk4j2K5kLj2OkO
6894A4j9J4l2lPK1j2J7j5lL0Mj2k9L0plj8J9J8rJ0k0K6k8J5Njn5J9L3Qkk6Kj1
6930a3M2l9L9l7J5Lj7jOJ2l2J8rmQmK5k6oJ6qK6j1j3J3Lj3K8pj1POOkk6LJ6j5
6968bK1j8KJ0j0k0L5k4K1k9L4rk8K7l8J6OnK1j4MJ5j6Mj1J4k4L4l8LkPJ1J4j4
7003cL1pk5J7Pl0K2j4J8pj5pJ6npK9l7K8l6L7k4k4K5%j4L1krk5K8J1k8J3pJ4m
7039cj4L5l4M2j1j1nOK5k4k1K8kLk8L4Lk9J2l9K4Pj5L9n7L0j8J7Pk9M5l2K2k2
7073a5j1J6J8k3K0j3Mj2J5Mj4K4J4Lk6J6rJJ9k3rJ9j8nj2J1Rj8K2k3J4Rj4J8j
7108A0olnJ2%Jj7MMm2K0KL2pl7M6qk0K9k1L8m7J8K7k0J4l6L0k5J2nrK8j8l0K2
$$ y = [6, -24, -10, -33, -14, -16, 9, -15, -26, -4, -20, 17, -6, -5, -13, 3, -12, -2, -9, 20, 11, 3, 16, 23, -4, 16, -4, 27, 26, 2, -10, 15, 13, 16, 4, 10, 8, 14, -5, 9, -23, -26, -19, 2, -10, 7, -8, -11, 19, 23, 11, -18, 12, 5, 2, -16, 3, 21, 12, 22, 2, 28, 0, 15, 20, 19, -36, -17, 16, 24, 22, -4, -2, -13, 29, -10, 29, -8, 7, 10, -7, -8, -2, 10, -22, -4, -13, -17, -9, -13, 12, -14, -20, -4, -12, 14, 3, -10, 3, 6, -7, 21, 14, 3, 10, 16, 22, 20, -6, -3, 13, -2, 19, 1, 3, 13, 3, -17, 18, -6, 15, -14, 20, 11, -17, 10, -28, -12, -6, -11, 10, -4, 0, 15, -1, 3, -8, 6, -18, 16, -22, -19, -21, -14, -3, 11, -3, 28, 21, -4, 13, 20, -10, 12, -2, 16, 9, -6, -13, 3, -2, -9, 20, -17, 11, -25, 12, -12, -36, -11, -11, -25, 6, 4, -5, -30, -2, 9, -19, -6, -13, 1, -3, -17, 18, -16, 26, 15, 4, -1, 5, 30, 6, -15, 13, 11, 14, -14, 20, 23, -6, 6, -33, -9, -2, -17, 22, -35, -5, -23, -6, 1, -28, 17, -15, 7, -15, -26, -10, 8, -15, 5, -8, -4, -16, -1, 3, -11, 13, 27, 30, 4, 20, 11, 12, 31, 8, -1, 18, 0, -5, -17, -6, 3, -15, 7, -16, -2, 7, -7, 11, 10, 4, 1, -4, 8, 8, 9, -8, -4, 0, -42, -22, -20, 12, 5, -32, 14, 6, -14, 15, -6, 32, -15, 3, 30, 10, 24, -12, 18, -7, 5, 0, -9, 19, 1, -29, -7]
7144gmL1l3k0J7OJ4j3J3J5k9J0j1J8k3K9J1o5O1rlK7l8K3j3k9K7qK3k9L7Jm5L6
7178B0Pk4JqJ0l1L9l2L4k2qJ3Jj1LPk3lK8J6k2L2l7nPlqM2j0ol5N0m1J7J6k8J2
7215bqJ2K4l2Rj1J0j2K1j0kL6m3J1J0k8K9k4jKMK6lk7j5J4j2K1PRl3M1k7J4j%
7251I%k6J6J6j1K3l1M3k8J2J3m7O0n5lJ0j7K0oLk5J5J5k1JL9k5j0j0NRnJ6l4L5
7286Fj4K2ml0L4nnj0K3QplJ5lj4%J1qk6K2l1K9K3m3K1km8N0n1M6l2J4M%K5l7J8
7323bj4LK4k2K6l1J0K8j7lJ6jrJ6Pk4Rj6J9k8K9k6K0Rj4j4K1j6J9k8nJ9l7L5k6
7358b3PLK1k1J4j2L2n0L5k4K0pkPj0N3k3k6K3k4QK7rj0mrK1poK3J0l4j2J9j5L5
7394C0l4J6j2j6MpL8k1j5K4qk0J5Qj8JL2k6nOOK7j5j5J8Qj1k0QJ5Nj0Nj4jK0j6
$$ y = [-7, -11, 20, -13, -33, -16, -10, 4, -9, 4, 19, -10, 0, -11, 7, -16, 13, 24, -41, 20, 11, 8, 35, -3, 20, 7, -22, 5, -3, 20, -9, 28, 29, -16, 20, 27, 3, 4, -4, 6, -25, 14, -18, 16, -6, -14, -1, 0, -11, -8, -1, -24, -27, 1, 17, -5, 27, -10, -15, -8, -11, -19, 23, 13, 7, -28, 22, -19, -2, 14, -14, -2, -10, 2, 26, -6, 3, -8, 2, -10, 11, 1, -1, 35, -8, 3, 13, -15, 14, -10, -11, -9, -5, 21, 18, -9, -24, -10, -22, -1, 6, 15, -18, 23, -4, 10, 9, 9, 9, -17, -1, 15, 4, 27, -4, 39, 11, 23, 36, -11, 49, -6, -9, 1, -16, 4, -2, 1, -24, -9, 6, -15, -14, 25, 0, -10, -20, -15, -6, -11, 5, -29, 6, -8, 14, 10, -20, 14, 9, 4, -6, 17, 25, 18, 15, 30, 27, 13, 13, 24, 16, -10, 12, -19, 10, 33, -10, 11, 9, -39, 11, -40, 6, -26, -12, -8, -8, 17, -20, -2, -16, -13, 11, -11, 15, -16, -6, 22, 5, 2, 18, 17, 8, 24, 31, 7, 16, 0, 19, -9, 20, -6, 14, 23, 9, -5, 16, 0, 19, -9, -14, 5, -32, 3, -23, -16, -13, 8, -13, 1, -11, 21, -29, 6, -18, 2, -5, -7, 0, -10, 43, 20, -6, 17, -7, 1, 28, 19, 9, 5, -4, 17, 10, 4, 27, 37, 3, -9, 10, -5, 30, -4, 12, 0, -16, -12, -19, 19, -2, -17, 7, -1, -21, -6, 2, -16, -15, 17, -9, -14, -8, -2, 25, 10, -5, 13, 21, 10, -10, -2, 13, 18, 8, 13, -1, -2, 18, 2]
7431BJ5jlj4kNJ5j9k0RK7J6l7J7jlj8%J3mj5%M3JKl4KpL3j0j0J2Mj8J9jNj2mK
7471IKnlJKk3j4K5J5npJ4m4J7J8l1J6j6K4kKrmL7k5Oj5K2jj4L0j1J8oj1J2m5L2
7509A1N%k0K9j8J8j4j7JQJ9j8k8K0K4ol5K1J1Kk0j1Ll4M4J3pmrL0J3l6J0jK0k9
7545eQlJ8Jk6L4m0L5j7lMQj6J0%j2K6k6jjK7l0qJ1Rq%j3L0j5l%J3oJ8J3l6PJ1
7584A4pj9QJ1j2J4rk6M5pK4mm1K9j3J2k3pK3l6L8l9%M7o3N1j4K1ok8K7j3K4l8
7618a7J2L5nk8K7n0M7k7PJ7k5K7k3L0l3K1Qk7M0l2k0J9J0oJ1j0K9l6k3NoJ0j1
7651b4MJ8qJ3J0k1%LK2l2K5jRQj8J9l9qK8J6nl3K1NpRmM2n2j2J0oK9l4J0jJ3k0
7689a1%MJ2Rk3k0K9k7K8j0%Ol8N2qj3K2J1oj3pL2k0J5mqLNj6rJ2Mk1M0k0l2L9
$$ y = [2, 17, 16, 13, -1, -3, 2, 17, -2, -22, -13, 14, 30, -7, 10, 9, 6, -12, -12, 1, -3, -18, -18, 25, 26, 28, -6, -4, -11, 22, 12, 2, 14, 18, 0, 19, 18, 23, 11, 7, 9, 11, 6, 3, 4, 6, -17, -31, -6, 9, 4, -3, 11, -33, -16, 2, -29, -13, -29, -5, -7, -5, -14, -18, 19, -6, 0, -15, 7, 6, -8, 22, 11, 29, 23, 12, 24, -21, 11, 16, 16, -4, 25, 7, 25, 11, -6, -5, 3, 22, 4, -24, -4, 20, 14, -21, 0, 11, 13, -7, -18, -15, -49, -5, 8, 1, -3, -12, 18, 31, -5, 5, 4, 24, -5, 3, 0, 18, 19, -7, 27, -13, 22, 5, 2, 6, 14, -2, 8, 8, -4, 22, -4, -5, -6, 21, -9, -17, -6, 3, -5, -5, -18, 12, -3, -6, -6, 7, 1, 19, 32, -4, 3, 14, 7, -12, -4, 7, -5, 9, 0, -26, 19, 12, 36, 32, -9, 20, 7, 19, -4, -11, 12, -24, 14, -25, -25, 22, -41, 10, -4, 17, 11, -17, 10, -3, 21, -17, -5, 30, 25, -3, 24, -26, 21, -6, 1, 18, -7, 20, -3, 27, -6, 15, 23, -4, 36, 4, -16, 3, 13, 7, 18, 8, 37, 1, -22, -17, -23, -13, -24, -20, -2, -10, 3, 13, -8, -8, -5, 17, -15, 10, 9, 18, 26, 8, 27, -12, -20, 8, 24, 19, -14, 7, 12, 5, 14, 10, 52, 0, -12, -2, -8, 21, -13, -3, -4, 9, -11, -11, -7, 5, 14, -9, -29, 0, -27, 1, -9, -9, -3, -41, 11, 3, -10, 12, 23, 17, 4, -3, 29, 9, 24, 20, 12, 15, 20, 4, -5, 7, 11, -10, 30, 10, -22, 17]
7726A7j4Opj6NJpPQrj1K8Rok2L1nk2L0l1R%k1L4j1J1Lk7K5MKQn7K5oOK9k2K9m4
7766a1MJ3kJ4k9J6j3j7RMoqJ4j2J1J5j4pL7k3qqK0mLpK7k2J9k5nK8%Lkmj7J8j9
7805hOqL6k7L0k7jjj5JmLkOpJ0QK7k5%NQl4M7l9M7k9j1J0NJ2ok6K2omj4J6NJ0
7845B0j0rJ8j8J2KmPmj4Pl2J5KqOnJ9j9MJ4OpMk5J5J3j3k4K8Rk0J2MoL2k1J0J3
7884C3l3K1l4L1PKm0JQJ3j2jJ6k4j0NL5m3J5K0j3j8J3OlPmjK5l0K3k5LQqkK9n
7922A5j7J7k5J2K2j5PKJ6j0qj2mLJ0j6Mj3J1J8k3Nk2L5j4k5K1pK2pmqJ5njj7J5
7959cK9k0%oM4l6Lkj5KJ9j4j0K4lj5J6l5J8Jl0J3K0PPk5J8n%J7l9PJ9k6%M2k0
7996B%lj1PK2k7K0NrJ7k4L2%m6MK3J0j3Jjj5K4l8K2j1LrJ8j8lMjL4k6j1mL6k8
$$ y = [17, 3, 9, 2, -14, -9, -8, -15, -8, 0, -9, -20, 8, 17, 11, -11, 20, 15, -7, 23, -8, 1, 1, -20, 14, 3, 14, 17, -10, 15, 19, 21, 29, -28, -3, -9, -3, 26, 4, 33, -11, -7, 6, 4, 18, -11, 5, -8, -25, -16, -12, -18, -26, -12, -24, -13, 2, -12, -19, 18, -5, -13, -21, -1, -5, -2, -9, 18, -4, 15, -10, -15, 13, 13, 16, 14, 10, -7, 11, -8, -2, -10, 26, -1, 29, 2, 1, 0, -15, -14, -18, -15, -17, -11, -18, -8, 0, 27, 2, 2, 7, 15, -19, 28, -11, 36, 7, -4, 6, 11, 23, 17, -9, 13, 7, 3, -11, 5, 10, 20, 10, 1, 19, 1, 13, 15, 11, 18, 14, 0, 7, -25, -10, -8, -16, -10, -15, 4, -15, -11, 3, 9, 2, 6, -19, -4, 9, -4, -28, 0, 9, -11, 1, 5, -1, 31, 10, 20, 33, 0, 21, -13, 18, 25, 27, -13, -12, -4, 9, -3, -4, 12, -12, -22, -17, 18, -25, -10, 10, -3, -21, -8, -2, -5, 2, -2, -3, 22, -8, 15, -10, -7, 1, -7, -9, 20, 15, -2, 15, -10, 2, 24, 9, 16, 18, 34, 24, 16, 4, 0, 3, 13, -3, 1, -12, -1, 17, -6, -1, -23, 12, -2, -27, -6, -13, 9, 2, -2, -10, 5, 0, -1, -18, -3, 26, 6, 6, 0, 44, 8, 11, 9, -6, -4, 15, 1, -9, 15, 12, -3, 13, -22, -4, -3, -33, -20, 0, 7, 14, -11, 7, 2, 2, 19, -20, -13, 6, -20, -20, 22, 2, 2, -1, -12, -5, 17, -10, 10, 15, 6, 23, -1, 31, 31, -15, -11, 12, 22, 9, 10, 9, -6, 18, -20, 2, -9, -6, -15, 3, -15, -18, -14, -15, 19, -7, -18, -22, 14, -14]
8034a4L2k2j8RpM6k6K2Rk0J5Jk0Nk2M5k3kJ8l5lJ2j7RJJ5j9kK7j7M6q2M0j1J2
8069DKl7RL5k7J7k9J5POj5J1kJ2Qk7K8krjOnqjK8j1j0%J7Pj9kPj2k2J4pJ6k1M7
8109B9l8K5n0K9Jl4K6Rlj2QK0l6K5J3joLjkJ8k9K4j3Pk0PmOK7k6j2NK9k7J0J4
8146B1mJ6k9nJj9ML0j2J9n9M6l0L2k5PJ1pkKPNppPJ5Nj4K6k3J5k5lj2NJ9OMk5
8185eQJ7l6mJ0J2
$$ y = [-14, 18, -4, -22, -13, -20, 26, 0, 22, 31, 11, 26, 27, 7, 12, -10, 35, 12, 10, 28, -7, -10, 2, -15, -6, -5, 10, -9, -11, 16, -1, 45, -37, 3, -8, 4, 6, -31, -22, 13, -14, 3, -26, -11, -4, 2, -13, -2, -4, 8, 16, -11, 17, 15, 6, 5, 11, 6, -2, -3, 25, 14, 4, 4, 21, 28, 9, 7, 14, 2, -20, -6, -13, 3, -18, 29, -9, 16, -34, -5, -4, -38, -12, -3, -6, -18, -10, 10, -26, -1, 12, 11, 5, 8, 7, 5, 23, -6, 18, 5, 12, -8, -1, -5, 1, 28, 2, -10, -5, 24, -3, 7, 21, 17, 33, 4, -1, 0, -19, -15, 15, 3, 22, -37, 9, -21, 11, -14, -7, 4, -3, -5, -3, 4, 9, 2, -5, 2, 17, 22, 8, 34, 11, 26, 1, -2, -14, -9, 10, 16, 20, -5, 3, 20, -16, -20, -10, 2]
8191B
$$ Imaginary data points
##PAGE= N=2
##DATA TABLE= (X++(I..I)), XYDATA
0@%%%%%%%%%%%%%Qj6J6j6J6k4L2l2M0n4O2p2Q8j04J20j36J52j76K03k27K58k96
35a58L34l76M24m74N30n92O59p33Q13q99R94j098J211j335J469j618J786j967
53a030K166k389K639k921L239l605M031m530N127n857O772p958R568j1902J5641
68H991k2960O0858r9488L3199O0776o9103Q3743r5792M2687L4760l7981k9977
80c0287K2407P5960q8364m377M0062j8741L7729p5820N6116Q281l3797R570m6113
93d7374J21161p4775o5167J22513q8374M6696p202n4175J01311o2008l3886M0040
105a240L2684l1279l6942N5662l6638L2127k2804l0041R4535q0470k151K7389
117H32k453L3976q3120N8353N134m1344M8155n7669O2515p279p1377O2708j502
$$ y = [0, 0, 0, 0, 0, 0, 0, 0, 0, 0, 0, 0, 0, 0, 8, -8, 8, -8, 8, -16, 16, -16, 24, -30, 32, -40, 48, -56, 64, -72, 80, -96, 107, -120, 138, -158, 176, -200, 224, -250, 280, -312, 347, -386, 427, -472, 522, -576, 635, -700, 769, -849, 937, -1030, 1136, -1253, 1386, -1535, 1704, -1901, 2130, -2400, 2727, -3130, 3642, -4316, 5252, -6650, 8991, -13969, 46889, -52599, -19400, 41376, -27727, 56016, -39776, 2911, 37671, -310, -30287, -7880, 68080, -20284, -24661, 15401, -3340, 34389, -41431, 14685, 22966, -10831, -1261, -47374, 73787, -988, -66155, 56358, -32016, 14680, 7478, -46697, 54614, -7394, -41280, -1240, 31444, 165, -36777, 18885, -17753, 14374, -8430, -38471, 56064, -24406, -26557, 832, -1621, 32355, -50765, 7588, 12722, -28622, 19533, -38136, 24379, 17100, -54277, 8431, 6929]
130F929j967k3947J3841J1674k0355K1634m0371N7250q211o8756P1091k4998J0432
143D246r53l1919N4944m0732O461O468N53K7304o0637L2335J4850j9184J4305
156H041k4586L1255j6342r937J4907m907K7753m9414J7399K4111l0257K8353k8722
169a2346J9457O735l5264L2437r536J2955j5774j3887L4186k4113J3054p285m62
182A57J7242l4540K3881J95q05L629k5564K9452j1857j444P872j0747J7336k4373
196i566R388J0289r099J2300k5494J7757K186j4534J8696j5095J1982r724p570
209h484J9337j1057Q720j2024o67J3430j5766J1887l414j70J12j0818J3937n379
223c56O626p905o422J6416j6465J0051K450r744J1324j5445O661P208n325K298
$$ y = [6929, 4962, -18985, -5144, 6530, -13825, 7809, -32562, 24688, 16477, -52279, 18812, -6186, 4246, 3293, -28626, 26318, -14414, -7953, -1485, -932, 26372, -34265, -1930, 12920, -6264, 8041, -16545, 14710, -1632, -11569, 3338, -1569, 26184, -23230, -5831, 18280, -11977, 16376, -12346, 7111, 13846, -21418, 11019, 1483, 14438, -1336, -15223, 18963, -5150, 7904, 619, 157, 17399, -17141, 6740, 6935, 6130, 9759, -15805, 13647, 1790, 346, 8218, -2529, 14807, -9566, -178, 10111, 1012, 13312, -12182, 5575, 7761, -6773, 11923, -3172, 8810, -914, -8484, 10853, -204, 8516, -3508, -4175, 9255, -6511, 5376, 1962, 1792, 1904, -8914, 5023, -356, 6270, -1635, -8057, 8359, -8106, 1945, 4395, -5349, 5975, -9470, -2809, 4399, -926, 1372]
237A372q538P690l474l6N490o045O105r412Q93Q122l249K673q662N378J76m370
253e887Q564o257M282l150p693J2168k008j107j232k422L771k760K689M8K122
268A128l233n881P765J046p61j006l471M602k746K08L833m08r21o018M040M244
284B421j402j038j895J985p36j497L954J317j915m541J234N001o54j128j260J176
300A022n70j921L183K769k091l885n5L943R53j637p08J037j094j979K564L103
316D634j178l616j241L309J595j739kP06j345j950J685L034L30l995j586K712
332A353J281j196M81O2q18j993p6M248L86l421j799J945O82j22J72L0rk549j289
351b632N220K4k735q87p72K661j277L05J368j133j553k186M002K275l718k02p62
$$ y = [1372, -7166, 524, -2950, -2986, 2504, -3541, 2564, -6848, -5955, 2167, -1082, 1591, -7071, -1693, -1517, -5887, 2677, -3580, 702, -2448, -10141, 2027, 19, -1088, -2320, -4742, -971, -3731, -1042, -994, 1128, -2105, -7986, -221, 825, 64, -942, -4413, 189, -2557, -2349, 1484, 1076, 155, -5863, -1823, 2421, 1019, -19, -1914, 71, -665, -2162, 1792, 3109, 1194, -3347, -2113, 2888, 2234, 1106, -154, 1022, 452, -1469, 1714, 4483, 2392, -1493, -1548, 2395, 3348, 1711, 1003, 2040, 946, -1033, 1531, 4634, 3456, -160, -1401, 1908, 3503, 1764, 1762, 2468, 1123, -827, 858, 3892, 4222, 227, -1359, 1353, 2634, 1438, 1919, 1981, 1163, -830, -906, 3342, 3728, 307, -1492, 453, 1135, 1013, 1185, 1215, 1206, -1343, -2632, 2588, 2612, -123, -1010, -1782, 879, -398, -93, 1275, 142, -1411, -3597, 405, 2680, -1038, -1240, -2002]
368b002J377l22k07J905j036n88m190M511L366n623K939k683L14K858m619N355
384A355o57l403o32R10M782m124P00j87j399L215m979N667M33m743J330k344P259
401C183m339j170M060n538N062m744K568O261r629L590j809L511J005o080P508
416C439n450J950j430p12R356j0546K407R48r79N724r600Q461j886m539M139m531
432c249J0773q479j772N597n405Q579j0510O185N234j3519R826n353O115O10j1071
447f439J0955m884K921l848P12R699j5249P543j305J459N497j5197J3274m253
461H85j217K083o524J7205j8095K042J0462j2112J4883j5169L182J1433j4473
474e415N561q85P960r378l010J0470r806J3149j4275J196J7165k2835J1551j611
$$ y = [-2002, -625, -947, -1154, 751, -285, -873, -5063, -552, 2814, -2809, 130, -2553, -2239, 619, -4000, 1355, 698, -2705, -3337, -2427, 2355, -1769, -1069, -1256, -2655, 560, -4419, 1248, 1681, -3062, -1732, -4076, 3183, -1156, -2326, 1734, -3804, 1258, -3486, -918, 5343, -4286, -696, -2505, 1006, 2011, -4069, 3439, -2011, -61, -1491, -2203, 7153, -3393, -986, -38, -1017, 4707, -4893, 3568, 1682, -2857, 1282, -3249, 7524, -955, -2727, 2870, -2535, 6044, -4466, 1719, 6953, -6566, 3260, -2093, 4022, 4632, -6439, 4516, -368, 2553, -1295, -583, 9116, -6133, 1410, 105, 1564, 7061, -8136, 5138, 885, -332, 1751, -4773, 12432, -5663, -3621, 6841, -5271, 9612, -5557, -2375, 9058, -5415, 146, -739, 7221, -2157, -5167, 5303, -4503, 8646, -5629, -4433, 12732, -10103, 1448, -163]
488a63K260L112j7752J9882q874J542L038j3879K3628j6865m838J5814p166K434
502B173r532R578k204J27J799j4280K7776k0277q133K6123k0499J2933r821l209
516g446J8537j8168Q044n727R619l35k1180K5916q656k689K586q074J6013j2179
530c739K474k543Q012L372k7850L1766r151j0521J8293k4785K4175n623j7376
543a3496K0848o931L550j3646J0128Q554j6428J2725j3400J3568O18j9699K0700
556G091n979K876j1032K839J9082k6023J6441p474j294J8995l3521K2488N726
569A0215j6802Q175p202J4797j0842q40M374m496J4766k5911J5175J0572k0241
582h260J2872j1994J4790l706j3391J7785j2728J3169j4001k627K5889k6487Q709
$$ y = [-163, 2097, 5209, -12543, 7339, -1535, 7, 3045, -10834, 12794, -4071, -8909, 6905, -261, 2173, -7359, 2219, 15, 142, 1941, -12339, 15437, -4840, -12973, 13150, -7349, 5584, -4237, -7446, 11091, -7077, 967, -4760, 4859, 4524, -16656, 9260, 604, -2085, 501, -7573, 8440, -3739, -1265, -3808, 4204, 7576, -20274, 11492, 2341, -8180, 10113, -14672, 9503, 3880, -13496, 7352, 421, 3971, -9675, 453, 9007, -7421, 5304, -8096, 5472, 6090, -13609, 7091, 1112, 3988, -7044, -4205, 14877, -11146, 5295, -2179, -3473, 15522, -17999, 4489, 10215, -6587, 1588, -5614, 9183, -1659, -2499, 1875, -2621, 12145, -13766, 1409, 11981, -8260, 4612, -7382, 7408, 3702, -9689, 8096, -4632, 8537, -5464, -8091, 17798, -8689, 20]
595B0N29j582R573j8393J3496j814M35m074p147K4426k1328K747P109r238J6124
610A0883k0888J0089P595j2369P418j1503J8045p409j1409J6675j2141J1432j0393
623c975j690J6356j6210O490n798Q203K579j7057J7168q332L924q91j0044K0724
637A1447j5587J363L412l004J0634j7838J1365J266o477O763j1809J6157p267
650D25p225J0757p959J0516j1604K082R917j2140P810p331P423J809j2748J2221
664C953o189N187l616n260J4013j2393M411o35q71Q051j3927Q973k97k628L904
679B676q889J2287o863k557O125n624Q292r324K630M992o363N481p002P322j068
694B115p277R167o564N752l392l832R361p906L667j780N51M019q506O825k129
$$ y = [20, 549, -1033, 8540, -9853, 3643, 1829, 2264, -1810, -8957, 15469, -5859, -3112, 3997, -5241, 10883, -10005, 84, 7679, -4690, 2728, -8775, 9270, 1861, -9548, 7127, -5014, 6418, -3975, -5665, 10691, -5519, 971, -4827, 3376, 5955, -11102, 6066, -2266, 1658, 767, -9277, 11447, -4140, -2777, 635, -2369, 8265, -9573, 1792, 3058, -3419, 3344, -8465, 7692, 425, -6800, 3957, -4002, 6514, -5090, -3008, 6909, -5231, 2579, -4752, 2671, 4480, -8268, 3953, -2236, 2951, -665, -5925, 8088, -4305, 106, -529, -1400, 6651, -7276, 1697, 1400, -1228, 2676, -6213, 6074, -789, -3346, 2779, -2845, 5447, -3877, -1247, 3745, -2618, 2863, -4139, 3183, 2115, -5162, 4005, -2559, 3193, -199, -4031, 5330, -2576, 1091, -689, -138, 3881, -4625, 2200, 71]
709G1K04J687o081Q226m932j16K383k965N222o689L242J651l501M238n687M905
725A858o64l851N049l846L382k537j040M187m105L002k481R40K106m745M526k256
741d75P46N75l212M547l010P87N38j550K713l382K084K34j379K025l188L073j040
758H6j166K296k363J941j352r0J655j853J457j422P28P11j916K223j466M22K64
775A55j058J570j045M42k58j95Q89j447J466m50o92J201j406J095q2n78N92m05
793b06K11k80L98R6o39P35p35M83J99o53O74m02j9R9O7J99l73K03j23j16N05n35
815b12M05p0l17K25L4P5r7Nj16J12N7j46J91K5m16M20k16J87P7l14J75K2j37Q1
839E0J63j45j60K13k26J98K35o26N94l00j50L15j50J31k05Q8j7p5M25p04N52n8
$$ y = [71, 275, 1962, -4119, 4107, -825, -941, 1442, -1523, 3699, -2990, 252, 1903, -1598, 2640, -3047, 1858, 1194, -2657, 2392, -1454, 1928, -609, -1649, 2538, -1567, 1435, -1046, -106, 2000, -2745, 1781, -475, 271, 846, -2366, 2181, -829, -42, 496, -1054, 1659, -1723, 361, 595, -784, 1241, -1947, 1126, 86, -1080, 1216, -1147, 794, -558, -648, 1007, -846, 611, -811, -83, 628, -1288, 935, -531, -109, 155, -903, 667, -378, 64, -194, -389, 500, -947, 519, 69, -623, 578, -828, 267, 185, -393, 199, -206, 5, -275, 123, 219, -420, 315, -420, 63, 262, -391, 283, -119, -138, -39, 28, 227, -146, 57, -66, -182, 323, -212, 193, 123, -194, 31, 65, 140, 43, 48, -68, 44, 101, -45, 146, 171, -245, 175, -41, 146, 223, -91, 84, 106, -31, 50, 213, 68, -92, 121, -105, 93, 328, -298, 296, -4, -154, 161, 11, 142, -63, 25, 8, -67, 358, -346, 206, 148]
861A48n82Q30n35K88j62j12L13m36O08n87K27M68j270J376o80j2N07r53J093q16
881b87L21J20m92J016j514J077J56j061J407j569J392n82o30J430j467J375j246
898e54J44J446k063J663j131N55O34k153K679j831Q30O9j689L162k739Q60N56
915D38j083J902k963K600o37j002J933l202L849k032j186K891k610K347k465J098
931a22J645l173L204l449K940L48m458N380l022P82J18j699L803l710J963j270
947g20O19K719o541O010j485k106L163m179M904k662q73J947j824M036o403L927
963E32K268n992N587m632L245Q86m985M675k251K725m104P72N553p975N484k598
979h10k41N171q601N823l46j110M9k616P236p050K228J537l951P676r005L385
$$ y = [148, -434, 396, -139, 149, -13, -125, 188, -248, 360, -227, 0, 468, -802, 574, -106, -118, 389, -564, 529, -287, 34, 154, -338, 678, -836, 241, 397, -664, 743, -826, 566, -16, -646, 784, -683, 692, -554, -410, 1036, -1027, 636, -495, 60, 694, -1459, 1220, -611, 219, 288, -1401, 1761, -978, -118, 438, -645, 1257, -1706, 894, 257, -745, 1188, -2014, 1835, -197, -1383, 1508, -1102, 1245, -1220, -122, 1523, -1650, 1554, -1895, 1045, 1393, -3065, 2315, -707, 75, 193, -1506, 2297, -1413, 550, -720, -101, 2618, -3923, 2087, 602, -1504, 1659, -2520, 2384, -278, -1151, 796, -1028, 3008, -3395, 532, 2800, -3192, 2395, -2237, 1008, 1894, -3091, 1584, -667, 2058, -2046, -1274, 4279, -3696, 1788, -810, -1051, 4120, -4481, 1342, 996, -114, -65, -2681, 4555, -2495, -267, 1270, -2681, 4995, -4010, -625]
995f25M253n865L185l532N782l342k451N243n596P199o422j117R271r168L579
1010C94j258J524J748o550O604l927L577k053n291J1962r142P30L370l518N853
1025D023q055M579P35j663K061p199J1031n517m219P818o293O334n763k65O425
1040D032n983L559n703P055j06r135J0300n706L225q34n758J0468o823Q24n00
1055a085J153M511j0753Q464j517j745L633q538J0541l992l959M804l219O357
1069D655q893L498M342o372N866p813O943J368r036P971l698L862l823k485Q813
1084E198p808M150l751J804N889j1525P825j020p31J463o612J0036n576p08K162
1099G96l130P934j0067L795L895n213M450o911P197o39n826N905m458O176n532
$$ y = [-625, 3628, -2237, 948, -2584, 3198, -144, -2595, 2648, -2948, 4251, -2171, -3288, 5983, -3185, 394, -864, 660, 2408, -4142, 2462, -1465, 2112, 59, -5232, 6730, -2412, -1682, 1688, -1830, 4023, -4032, 547, 1282, -381, 1680, -5519, 5512, -5, -4224, 3594, -2699, 3635, -2128, -2393, 4032, -1951, 1608, -4095, 2960, 2854, -6281, 4019, -1687, 1538, 704, -5054, 5414, -1409, -585, -1085, 68, 4579, -6174, 2290, 773, -972, 2661, -5877, 4664, 672, -3287, 1517, -1702, 4655, -4238, -740, 3602, -2770, 3096, -4717, 2226, 3594, -5442, 2529, -1169, 2693, -1130, -3615, 5198, -2610, 1540, -2211, -407, 5482, -6043, 1782, 762, 31, 1494, -5118, 4918, -658, -1366, 796, -2334, 5600, -4467, -672, 3223, -1990, 2460, -4451, 2746, 2107, -3719, 2186, -2272, 3904, -1628]
1114a628j706Q168p256M102m038K375M281q982O480k316J685j22n799R390n624
1129i90N10N99j993O681q730M019J600k814L468o798P327j618l995M464m062N968
1145C636n474k72N382n296M014m842L362K704o984N507k937K663r82m098P261
1160C644n014J816j076q40N459p274L697L06j282K319n272N931k099j667K279
1175I27l067N438n073N59L347l760L402m104K912J337m289L689k803L160j649
1190B6k443N018l935K113j528q3L480m917K909q05K56J131l792M652k394j59J062
1207E91k083L918l737Q83J459j916K331l158K546M0k208K428k361K711j534j167
1223a257K771k463J793j439L14J797k928K125j100O79M60k248K809j789N32K18
$$ y = [-1628, -3334, 4834, -2422, 1680, -2358, 17, 4298, -4684, 1796, -520, 1165, 1043, -4756, 4634, -990, -480, 119, -1874, 4807, -3923, 96, 1696, -1118, 2350, -4448, 2879, 1261, -2734, 1730, -2332, 3636, -1838, -2110, 3272, -2024, 1990, -2852, 510, 3214, -3770, 1737, -1200, 1463, 481, -3617, 3644, -1370, 446, -630, -1470, 3989, -3285, 412, 718, -564, 1755, -3517, 2414, 315, -1352, 927, -2140, 3298, -1775, -1216, 2131, -1629, 1773, -2331, 581, 1918, -2371, 1318, -1485, 1675, 26, -2417, 2601, -1334, 779, -749, -832, 2648, -2269, 640, -165, 91, 1222, -2570, 2082, -312, -471, 591, -1492, 2426, -1311, -428, 1031, -885, 1446, -1712, 834, 874, -1334, 1094, -1267, 1444, -90, -1257, 1514, -949, 844, -595, -281, 1516, -1412, 713, -387, 292, 752, -1496, 1313, -476, 56, 274]
1239B74j049K214k316Q91L93q01J339k003J679l71q41J278j436J637j080l36J232
1256G04j212J097j005L66O32j348J333r73O93Kj097J456j024N21n5m92R73j100
1274e29O23n3k13N92j049R20l64j12M71o74O79n01OM27m75N40n89K21K26m49N66
1295B63m82K70p9k58M59l06J76p1k05L39l34L26j08j00J35l14L95j92Q5M7k53
1316b07K12j05K6K07k24J02j37J40j0m3J84k82J71n4p6K23j20k1kn0J59n2J62
1339B03k50L5M9j20K49r4p0O3j22J27l6R4o3j28J92k31K74j04p1J41k37J83L1
1362A15l8J67m06L15j86P5K14m01L82l24O6J48j28K67m15J66R8k23M18m58M07
1383B59k96j25M39n08O64o14K7N57q31P31l07j31M84q18O05j76K01j70l49Q16
$$ y = [274, -775, 1439, -877, 14, 407, -394, 945, -1058, 621, 250, -591, 687, -749, 888, -192, -528, 704, -508, 589, -416, -50, 582, -766, 567, -406, 287, 289, -808, 648, -376, 145, 90, -402, 571, -529, 94, 41, -172, 420, -629, 291, -73, -185, 286, -388, 291, -210, -204, 223, -252, 288, -301, -80, 146, -303, 263, -219, 51, -28, -286, 173, -133, 43, -28, -233, 106, -228, 98, -10, -110, 25, -289, 106, -86, -1, 46, -207, 5, -100, -74, 133, -91, 11, -126, 14, 4, -39, 145, -137, 34, -20, -96, 127, 7, -14, -16, -66, 93, 41, 203, -47, -12, 37, -83, 166, 72, 2, 65, -57, 70, 34, 128, 65, -63, 129, -102, 172, 68, -3, 138, -99, 84, 115, 77, 244, -162, 153, -33, 42, 256, -145, 237, -87, -21, 127, -1, 266, -149, 17, 115, -108, 310, -148, 259, -37, -162, 277, -231, 433, -181, -154, 403, -428, 303, -4, -135, 349, -469, 136, -40, 161, -9, -358, 458]
1403D58r30O28o1m00Q57j198P57ok25M88j105J387r33j42J090j390J328q71l67
1422f35J378j125N05m89O14k36o77J352j380J315p62r32K270j920P93m4m23J176
1440G80j964J757o15j80R07k208K600j047q63J483j103J057j325P55L94p54J210
1457H84k542K700m49k175L023k279J378m71j197K550j987R81j033N61J545l291
1473a802K757q53l71R02k068K788j470L9n8l84K480l957K577M25k210K810l485
1490a880K788K97k742K374j415J858k020K4K508k968K209k170J222J885l964K846
1506H52j109R22n94j784M090l376J241k30j262M044m826J941J255j907J624k729
1522a848L354j184j294J547j915L738l688J45L176l330K326k607K146J068l734
$$ y = [458, -472, 156, 95, -305, 552, -646, 111, 105, -120, 368, -737, 650, -283, -425, 665, -725, 603, -268, -635, 743, -382, 123, -366, 248, 12, -665, 687, -693, 622, -140, -1072, 1198, -722, 71, 27, -396, 780, -1184, 573, -42, -222, 685, -1523, 1077, 30, -833, 650, -453, 604, -721, 34, 428, -326, 884, -1658, 1042, 593, -1582, 1441, -838, 540, 69, -1128, 1422, -565, 416, -617, -56, 1489, -1802, 955, 102, -269, 633, -1435, 1353, -117, -78, -136, -520, 1960, -1997, 580, 1005, -1205, 1605, -1880, 908, 1205, -1537, 837, -578, 1280, -740, -716, 1792, -1176, 1033, -1137, 85, 1970, -1994, 852, -257, 665, 71, -1713, 2377, -999, 242, 12, -1250, 2794, -2032, -91, 1164, -743, 881, -1848, 1506, 322, -972, 575, -1340, 2398, -1290, -1145, 2031, -1299, 1027, -1580, 566, 1634, -2100]
1537b100L125k102K427j261k522N086l714J058l02m59L230m619K365j22L9P65
1553H94l622M945k322j002J795k235M125m076M79K438k362K231l540L282L36l557
1569b191L238k264K858j728k160M470l171J573j683P50K787m951L094q24O39N80
1585A017l787M884k258m30Q22j482L955m571J403J502j691K215m018L592m0k797
1601a684K686k321L369k508j366L816k881K051k496J239K266m238K850j328J497
1616I52j99l286M632k457M69j00j144L753m326J597Q30r45J657l760L558m36j835
1633a040J906k158L252k621n54K718k151J918k807J692J466l283K584j754J766
1648I34m10k641L858k171Q29p83n22K949l553J755j23k07J165l179L264q43q68
$$ y = [-2100, 1025, -1077, 1350, 89, -2433, 2653, -1061, -3, -305, -764, 2466, -2153, 212, 90, 129, 894, -2728, 2217, -105, -1107, 688, -1547, 2578, -1498, -1019, 1419, -943, 1288, -2252, 1030, 1366, -2191, 1047, -1217, 1641, -87, -2247, 2223, -948, 625, -1058, -308, 2479, -2472, 622, -202, 437, 1017, -2770, 2114, -144, -574, 248, -1234, 2721, -1850, -447, 1055, -636, 1579, -2439, 1153, 1113, -1684, 1002, -1319, 2050, -458, -1824, 1992, -889, 1162, -1334, -95, 2171, -2067, 783, -545, 952, 753, -2533, 2099, -358, 111, 11, -1133, 2620, -1706, -109, 721, -224, 1433, -2327, 1231, 795, -1040, 866, -1292, 1960, -661, -1215, 1503, -648, 1270, -1537, 155, 1621, -1662, 922, -832, 934, 524, -2117, 1741, -430, 399, -384, -906, 2043, -1510, 245, 122, -85, 1080, -2099, 1165, 322, -546]
1665e46R81j747L021k525J63J597j617J794k624J694R65k347J860j630J776o73
1681A42j545K617j784J085j152MK123k679J496n30J34Q19k297K487r39k40M15
1698A56j158K319j985L93P41r84J345k004J514L03j353J221j398J655p55p65J572
1715H17j344J059j004J99J261j731J096o55M11L99j393J623r38K48j6n82J530
1732I80j481N06J67m86R95j355J031o9o60P38q51J158o89k56P42q20Q06o73K28
1751A1N12r37P14n17M39R1p39Q85o80L69r5k77P75q35L32J0j41M89p54N98k58
1772hj13L09m28O00m60l4K88l43M87m20J12J83m30M45l14K67m0l20L72k99K45
1793I9n3j49K60l74K31k6j7J71l38K13j09K6J43k02J93j95K4J61j66J82j76J3
$$ y = [-546, 435, -1312, 1709, -816, -653, 944, -673, 1121, -1503, 191, 1156, -1191, 669, -961, 815, 142, -1403, 1214, -570, 515, -637, -633, 1490, -1189, 307, -223, -89, 730, -1567, 920, -19, -259, 156, -1002, 1317, -668, -275, 466, -518, 827, -1177, 337, 640, -713, 508, -890, 765, 10, -755, 817, -527, 532, -472, -273, 988, -743, 353, -302, 109, 508, -885, 738, -200, 48, 32, -550, 980, -501, 5, 172, -314, 681, -674, 357, 288, -372, 366, -485, 673, -16, -272, 470, -350, 456, -217, 11, 523, -414, 300, -217, 222, 313, -426, 459, -221, 148, 53, -224, 551, -284, 48, 58, -83, 406, -348, 250, -8, -121, 188, -240, 360, -100, -134, 154, -189, 298, -122, -10, 173, -257, 188, -126, 141, 101, -219, 153, -146, 99, 46, -103, 157, -217, 14, -12, -29, 142, -196, 17, -92, -66, 77, -125, 68, -127, -103, 58, -108, 74, -102, -89]
1815h9M5j01K23j76J11q7p1J94j09R3l3j37J35j34J82n1kMj33J55o9N1N5j44P3
1840a5k9K2P8p4M6j37J13j0k4J11j36M2k7QJ17j20J14j51K7J40j67K12j37o0J10
1865E3r1J36o1L3j8r9J17q0J51o0j18J66k07K65j70J9R7k55K63j69O6K19m68L06
1889I5o7p5K14k26J77j63Q8r6P0K34m32L05j03j56L88m51M06j95j71L16l19N00
1911C39n05N1M14n90M98k60K2K40m49L29j70L05l08j34N79p21N58k05k57P28r74
1932e10N49J3j83L73p01Q30n28n1M44o08Q13p56N2N42m96M27o40O66j96m78Q39
1953D01q62R20n64n16J276j020N19k49p1P02j139Q34l56K19J39j019J427p90j4
1972a63L25n47J010j183N66K60m88P36j432J422k47q92J194j032R93o44m39J279
$$ y = [-89, -44, -145, 78, -98, 13, -74, -145, 49, -60, 33, 0, -137, -2, -136, 46, -5, -7, -3, -136, 19, -50, 1, 56, -88, -15, -44, -22, 56, -18, 28, -109, 4, -6, -30, 81, -55, -13, -40, -32, 85, -35, 79, -72, -45, 95, -72, 140, 3, -57, 53, -38, 98, 37, 70, 52, -47, 70, -10, 141, 81, -37, 129, -78, 187, 17, 36, 133, -122, 141, -28, 38, 257, -211, 95, 28, -47, 167, -59, 118, -45, 43, -53, 17, 251, -181, 124, 21, -135, 253, -198, 208, 13, -158, 158, -161, 339, -166, -115, 299, -291, 207, -53, -31, 209, -240, 89, -81, 224, -84, -218, 361, -360, 198, -7, -264, 464, -510, 39, 52, -131, 242, -459, 371, -157, -208, 236, -372, 441, -315, -263, 279, -217, 210, -430, 236, 40, -438, 401, -461, 459, -105, -621, 655, -365, 154, -95, -166, 536, -603, 231, -125, 94, 233, -786, 641, -149, -163, 162, -385, 625, -558, 8, 268, -220, 516, -916, 506, 259, -633, 561, -471, 522, -122, -561, 718]
1990G18j027O89q87N58O88j608J395p30M60J8j182J776j003K17j08l75J478j956
2008h79J051J40n63R15j753J721l02q17Q36r09J514j398K1J219j282J120j460
2025h26R63P40j783J355q28Q85m12j065K000j413O29n22j42J669k225J146m3j76
2043d8O44j805K066p28m82N65r61J998j865J99J082j117J145j774J423M06j609
2060h61J309j139J516q66r77K043j505Q76r28K10J565k299J306m59L89L35j828
2077a313K250r85j42K58p73K046k083N14O23p04J106j993J719L5j271J107j135
2094g41J737j135p47J733j334J110j322N33J258k066J275p04Q05K7j662K138j106
2111b01K88j91n14J940k167Q05K28l23R24j966J760k66p35P68j068J781j329l21
$$ y = [718, -309, 380, -507, 51, 739, -869, 526, -204, 256, 274, -908, 868, -135, 82, -26, -401, 1077, -879, 172, 312, -251, 664, -1089, 632, 330, -487, 349, -560, 954, -444, -423, 796, -486, 634, -826, 137, 877, -906, 449, -379, 506, 94, -971, 1029, -384, 245, -277, -419, 1250, -975, 171, 128, -48, 596, -1209, 857, 129, -353, 212, -749, 1249, -616, -417, 665, -452, 693, -1081, 342, 748, -861, 448, -691, 825, -41, -1018, 1025, -480, 396, -532, -322, 1243, -1056, 250, -209, 180, 515, -1313, 937, -48, -190, 68, -705, 1341, -742, -228, 395, -309, 797, -1196, 523, 558, -713, 394, -741, 996, -139, -886, 847, -487, 623, -699, -166, 1092, -974, 301, -403, 402, 429, -1233, 905, -201, 87, -104, -618, 1322, -845, -40, 188, -135, 789, -1177, 583, 317, -418, 350, -718, 1063, -266, -587]
2129e87J261j076J115j452P76Q12j627J185q98J032k55j292J800j045N85n42k44
2146d52J562j858Q48j15K7N99j650J583m25l57N08r31J627j311pQ00p64R99j420
2165g37Q64M30j059Q57q77J064m47p92J329r17P02p34KJ109j386P69l22K44L27
2184D26j204J272n28j4J62o70J254j078K24L70m10O97j149Q11J04n78N92p96R67
2203D52m38m70Q84p09O35o01Q4O84q89N66l93L10J84q42R39n16J92m4m10Q80p74
2224b76K81K7j44M48p85O25p4k76L46n35P07l91j83M75m27M46m77K01K81m96M43
2245B16m28L02R0m91N95m05K30j21j64M97m61K47q9q7L00m62L94j12j10J81k94
2266a72L81k71j0J94k51K84k71J32J28k98K89k62K11jj93K69k65J79j07m2K41
$$ y = [-587, 674, -402, 713, -739, 37, 849, -778, 407, -491, 541, 286, -1006, 794, -251, 334, -208, -452, 1110, -748, 100, -15, 12, 611, -1039, 544, 119, -238, 270, -661, 966, -345, -352, 448, -316, 683, -737, 127, 557, -502, 355, -522, 542, 95, -697, 632, -285, 417, -317, -315, 794, -592, 177, -145, 99, 426, -778, 494, -34, -48, 114, -556, 698, -380, -156, 214, -196, 501, -648, 163, 267, -311, 281, -515, 452, 14, -456, 428, -281, 354, -247, -163, 521, -368, 198, -195, 115, 299, -543, 396, -120, 72, 28, -382, 498, -276, 5, 32, -112, 336, -449, 176, 102, -174, 172, -363, 344, -47, -230, 245, -182, 264, -213, -12, 269, -227, 216, -212, 90, 180, -311, 284, -121, 109, -12, -176, 321, -140, 107, 18, -69, 231, -231, 163, 51, -59, 122, -172, 209, -62, -72, 122, -129, 155, -116, 16, 144, -154, 135, -127, 84, 83, -110, 159, -106, 73, -34, -76, 165]
2287A65k92J77n5k8J85k72K26q3k6O8j47J96j43K6O4j22J60j55Q1K6j40J59j53
2310h3J24oj21J25r9R2j8p2J19j39R2oj1N2j02R2o6L6J5n9J10j07N8j0p4J12p8
2337b4L3Ml6N8p3O4k0l0M8l2J8l5QL8q0R9o9J5K2q0R8n3K4K6m9J9k6P0j0n8J01
2368G0j12Q1o7KQ4l8ml2L5K7q6J33j11K2K4r8J55q0j1K3j4L5r5Q9j0m1J14j94
2396i9J67o4q0J33j24J44j24P1L3j11J37j68Q3R4k31K39j38Q5nj17J85j87J45
2419F8j04L7J62l08K70j04p2J99l26L19j78PN1j27L31l76J43J22k54L03l05J93
2441E1K6k37K77k42K95k44p7L70m12K97j80mL54n10L28j48R8O3l49N14l76J03
2463cO0k07M91n58K30R9k52L60n26N05j42k31L53m08N09l99q7M98n05M03l83J92
$$ y = [165, -127, 50, -5, -33, 152, -120, 106, 23, -3, 65, -82, 114, -29, -3, 61, -61, 99, -56, 25, 51, -89, 70, -83, 41, 35, -86, 39, -60, 32, 14, -58, 61, -78, 14, 8, -3, 49, -53, 39, -27, 9, 24, -35, 75, -32, 26, 16, -58, 54, -24, 9, 13, -23, 35, -38, 26, 6, -24, 24, -8, 10, -25, -17, 21, -59, 40, -29, -14, 8, -72, 26, -27, -3, 23, -26, -7, -33, 37, 27, -31, 70, -42, 39, -28, -26, 58, 20, 16, -16, 19, 46, -40, 93, -18, 4, 28, -70, 85, 5, -6, 17, 3, 38, -57, 32, 22, -19, 95, -99, 68, 4, -76, 57, -67, 77, -47, 24, 57, -54, 83, -85, -2, 92, -139, 100, -38, 47, 42, -75, 110, -77, 68, -36, 1, 163, -145, 125, 21, -51, 148, -178, 141, -37, -30, 21, -106, 225, -151, -8, 114, -140, 163, -142, 51, 77, -160, 117, -125, 170, -74, -151, 219, -193, 104, -76, -80, 274, -236, 92, -56, 42, 105, -244, 270, -106, -3, 57, -150, 341, -217, 13, 112, -140, 220, -306, 199, 57, -174, 179, -229, 280, -119, -206, 292, -213, 190, -193, -1]
2485aK83o23N43l64L18o1m88P60m93J70o9j93O56p58L90j0j09L18p27P89k78k38
2507a85L78m82O86n87oM86m77M85o74M74K26p03O05m53M93k20m91Q62o06L27k86
2528a48l9P28r70N49j51PL00q36R61l83j27K22m52R05q35J21M22m81N80q48O61
2549A86J36o84N87n34O96m12m16Q64o79N16n30J32P14j047O41l00K50J27q61J046
2569D32m95M6L5l72R67r82K90K48l19N35r63Q46m5m92M70n91Q66n77k55P46o04
2590b14N69p03K64N89r47O36m40M74mp79R75n51K04j44k50R35r98L97K1j03M63
2611C94j016R29j60l13L35n71R43o78j15N67n18O02q15M49L49p20N75n35O17j69
2631A50o42R20n91L61l33r5P70r07M91j99J12K93q80Q63k95q0J84m90Q66p14N1
$$ y = [-1, 282, -341, 202, -162, 156, 95, -393, 367, -126, 44, -25, -218, 438, -320, 70, 60, -49, 269, -458, 331, 53, -185, 193, -289, 397, -190, -196, 290, -187, 298, -376, 98, 324, -379, 226, -227, 266, 46, -445, 417, -189, 138, -148, -187, 541, -429, 120, -31, -24, 276, -560, 401, 18, -109, 113, -339, 566, -269, -148, 274, -207, 373, -475, 186, 322, -362, 225, -309, 387, -25, -441, 423, -256, 260, -270, -138, 576, -471, 170, -130, 120, 247, -614, 432, -63, -17, 18, -354, 613, -369, -79, 169, -150, 385, -578, 268, 223, -269, 201, -390, 476, -101, -356, 390, -214, 355, -348, -84, 505, -442, 194, -246, 228, 224, -555, 420, -131, 73, -71, -321, 614, -384, 13, 34, -69, 394, -622, 307, 147, -166, 169, -402, 541, -137, -252, 315, -203, 399, -416, 33, 382, -338, 237, -298, 319, 150, -492, 428, -163, 198, -135, -230, 540, -367, 124, -75, 37, 330, -550, 313, 18, -62, 122, -368, 498, -216, -165]
2652a65L20l34N67q17N13J80n38N04n24O20k45m56O99n04M59m57L0N75p40M86
2672A73k89J59K17o76O70l16M9M0l27P33o39J74J22k09M57p16M80L6k95L24m28
2693b61N46l13j99M19m07M60m37J26L75n48L35k25K24R4m71N15l08J85q6k12M94
2714C06m94K05J4r0K97n08L67n8j33K15l48M45k81l7K19k54L07l26J13J77k53
2735a17K07k29K19j6k63L53k67J84r6p8K87l17J97p4KJ35k98K80j09l5J06k15
2757a44L00k01K3R3j56K10k16P1J16j78J75k14J92m2j21J71j36R4p9k1J59j81
2779h5J37j02M2P9j60J80j23K4L9q6J40j15RO4j18J58j39P4J1o4R8j24J08l5m0
2804b8Q7j05Q9q1jP7o9Q2q2K1N1j09J12n0j1K4l8O2m3L2mn2O5o0M8rl2O8o3K3
$$ y = [-165, 155, -179, 388, -429, 84, 264, -274, 230, -294, 326, 81, -375, 324, -180, 279, -178, -148, 427, -313, 173, -116, 43, 260, -416, 254, -62, -13, 27, -300, 433, -206, -32, 90, -119, 338, -378, 102, 138, -157, 167, -261, 285, -28, -227, 192, -215, 245, -192, -66, 309, -239, 96, -129, 95, 189, -282, 233, -75, 110, 24, -188, 306, -188, 17, 31, -59, 238, -270, 97, 39, -94, 121, -227, 218, -63, -100, 119, -135, 172, -154, -41, 136, -117, 90, -139, 80, 64, -199, 154, -113, 71, -25, -103, 184, -133, 64, -10, -8, 127, -171, 109, 0, -35, 71, -144, 156, -45, -22, 71, -85, 125, -91, -20, 96, -82, 93, -121, 71, 29, -92, 79, -57, 37, -42, -63, 96, -85, 52, -50, -8, 71, -89, 91, -32, -8, 31, -55, 85, -30, -21, 43, -75, 83, -56, 18, 29, -35, 63, -61, 47, 12, -28, 59, -46, 43, -38, -39, 38, -31, 51, -31, -10, 41, -68, 44, -6, -17, 7, -31, 31, -12, 20, 16, -36, 29, -31, 17, 8, -24, 44, -19, 4]
2834Dmj5O8q0N6j3j1K4m6N3m6K5oLK5o9lM0m6R2q2L5J3m6N6q7P1l7MN1o2L0Mk3
2868b2L6l1N0m3QJ8l3P0n8QJ4l7N7m8L7j7j4L7o5P0m6rO4r5Q7o7lO1p1P6n6L8
2900A6j9n1P0o6O1Qr3J56j25O3j5j6P4j05Q8n5j2Q7j44J42n6k5Q8j02J37j17K6
2927A5L0p9J17j49R3M7j41J52j53J25q7l7J54j61J35j11K9J26k10J69j03L8O2
2950F1j88K62j69N4lr7K30k54J24K4j15J94k33J96l0j29J62j95K66j98j7J78k33
2973a10K00j98J14J22k64K07j49J27l3j98L39k38J47r8o9K84l43J73k6k4J59l23
2995b01L39j35n3J43k45L32k39L0J68k21K68l59K07J09k97K86k97L08j24k24L73
3016A68k60J59j35k8L53m55K75r8RJ62m41M76k08J3O3k28M84m31Q5J37j68L02
$$ y = [4, 0, -15, 53, -27, 29, 16, 5, 29, -17, 36, -10, 15, 9, 12, 37, -32, -35, 5, -41, 51, -31, 4, 17, -29, 27, -60, 11, -26, -22, 29, -33, -3, 1, -22, 14, -17, 33, -10, -2, 16, -17, 53, -5, 3, 17, -20, 37, -11, 26, 9, -5, 32, -33, 37, -9, -18, 46, -49, 38, -29, -32, 29, -42, 34, -22, 16, -3, -54, 16, -50, 11, 19, -74, 82, -43, 20, 5, -11, 63, -42, 46, -9, -21, 66, -78, 64, 8, -17, 71, -31, 106, -11, 15, 45, -34, 83, -66, 27, 74, -67, 85, -68, 57, -30, -67, 87, -74, 61, -50, -21, 105, -105, 64, -39, -1, 61, -127, 135, -34, 20, 17, -80, 150, -104, 20, 44, -71, 123, -110, 86, 56, -73, 89, -106, 160, -38, -55, 123, -110, 90, -108, 6, 128, -136, 71, -78, 49, 16, -182, 157, -81, 66, -32, -101, 183, -160, 13, -13, -37, 122, -201, 138, 3, -50, 93, -152, 180, -59, -29, 139, -82, 186, -173, 34, 143, -154, 132, -165, 143, 19, -205, 168, -92, 67, -68, -96, 257, -198, 77, -21, -12, 150, -291, 185, -23, -10, 53, -175, 309, -122, -37, 100, -68, 234]
3038B34m60L39M0l07L00l06L97k23k16M17l40L13l02N2L34m93L19k07J79O9m43
3059c04N00k48P4l1k17N26m59J57M1j35L35n42M22m9j71K20l75N10k90j43L36
3080A57k65L34m37J89K59m44L43l01L06qm18N16l26K00j44j35M98n07K21n5mK48
3102B27n39M84j40j11J69l30N25l61m7K63k61L86n09K34K18l91L36l54L67p1l20
3123b25M28l00K48k01j04M72n15K76j42Q5K10n38M54j36LO0l15N28l96N9J14j65
3145a00L37m82L00R1k62K19l37M12j52k20L88l30L02k69ML32m14L04k34J69J02
3166A60m06M18k24R9Ok00L85l37J26J5j05K73m31K96kj40J78l06L91j77j42K44
3188A21k69L17k83O1K19k98K20k15J88L3k98L35j89J40n3j39L30l12J46q9jK02
$$ y = [234, -226, 113, 153, -154, 146, -160, 237, 14, -202, 215, -125, 188, -114, -62, 272, -221, 98, -109, 70, 139, -304, 196, -52, 22, -9, -226, 300, -159, -2, 39, -96, 239, -303, 119, 70, -101, 119, -256, 254, -36, -179, 157, -108, 226, -211, -22, 237, -207, 136, -165, 141, 133, -285, 231, -95, 105, -39, -174, 324, -183, 38, -17, -21, 227, -312, 172, 32, -79, 90, -240, 285, -76, -123, 140, -121, 265, -244, -10, 208, -183, 153, -201, 166, 95, -225, 203, -97, 151, -50, -154, 318, -197, 79, -63, 22, 232, -306, 148, 12, 15, 75, -240, 288, -108, -49, 65, -100, 237, -245, 55, 146, -116, 103, -234, 178, 26, -194, 194, -136, 166, -103, -99, 233, -181, 123, -111, 58, 160, -246, 172, -52, 47, 53, -147, 238, -99, 27, 42, -63, 210, -221, 75, 73, -67, 111, -195, 196, 19, -123, 121, -148, 169, -114, -53, 166, -132, 88, -127, 61, 94, -204, 131, -58, 82, 29, -110, 220, -92, 54, -35, -36, 166]
3210A66l26K56p0m7J53k84L00j61k1J25k00K58k48P6J13j80J75j93J49Nj70J97
3232G3j74J63r1l2J83k16J45p1k4J26j85J74q1J4N3j54K42j65JM6p6J37j58Q4
3256A4L8q8J40j86J21Jj07J33j31J28j09J1J35j82J12n0qQ6j48J18n5J5N7j13
3280f8J21q5O0Lo3J06j11O5Np8J05j12J05l1%J8o5N1k6kO7q1N3l5j7O2r7P4o0
3309c6N3Jm2P7q1N0k9m2P7l1J9J4k9Nj8K9k7LJ5n2P2j2k4M0k8L4o0M2j0k6N1m7
3341a2K4K9n3L8m0j1K7l9M2k3M8m1J5kj9K7k3k2M0l8N2j6j4mk4N8o3N5%k0J8k5
3373a6M2k5j2M4m6L0Mm5L7j7N3m9jK5rK6m1k5N8o2N5m4K8J6o5J03p7L%JJ6l9K5
3406gL4j1k5l5O8o2K3K7n3P9n0nN7n5N4p7O2Qm7N3o8P2k6k5Q8p4Lj6j0P0j01Q0
$$ y = [166, -160, 96, 26, -21, 132, -152, 148, -13, -34, 91, -109, 149, -99, -23, 90, -90, 85, -108, 41, 46, -124, 73, -101, 62, -29, -61, 122, -94, 51, -20, -44, 82, -103, 71, -10, 4, 57, -97, 145, -20, -19, 27, -49, 88, -70, 14, 52, -36, 104, -82, 39, 40, -67, 66, -65, 63, -46, -35, 100, -82, 30, -20, -28, 58, -90, 28, -27, -12, 45, -68, 53, -32, 28, 31, -32, 74, -37, 28, 33, -45, 60, -52, 53, 22, 22, 40, -25, 26, 0, -2, 65, -16, 37, 2, -15, 47, -50, 24, -36, 17, 18, -24, 53, -28, 22, -7, -49, 28, -3, 16, 30, 1, 6, -12, 17, -10, -7, 8, -44, 28, 16, -8, 32, 4, 38, -22, 20, 10, -16, 35, -12, 12, 41, -12, 26, -14, -25, 2, -37, 5, -18, 30, -11, 4, 2, -17, 10, -13, -35, 5, -33, 19, 3, -11, -15, -39, 19, -44, 11, 11, -9, 9, -16, 26, 1, -11, 33, -13, 17, 21, -24, 13, -4, 49, 0, -1, 24, 15, 41, 0, -25, 33, -29, 26, -18, 10, 26, -39, 64, -13, -10, -10, -9, 7, -32, -7, 27, 16, -9, -44, 24, -38, -15, 12, -41, 38, -12, -17, 40, -15, 39, -38, 24, 32, -15, 38, -30, 42, 16, -9, 79, 5, 8, -8, -18, 52, -49, 31]
3438C1n4J7L6r6J29q9L6Rn7J00j09M1J2j9P4j05Q9J0p3P4j10J33o7l3O7q2J21
3465H5j40N2P5j32J12j08Q2Rj24J51j09P1n8k6J39j50R1j0l5J19k09J63l8m0N3
3490B3j33J81j37J0J15j23J47j85O7J21j84J86j88J75m0j09J87j68J31j43lK00
3512A30k34J46q0L4J13k51K04p8J6K9j43K42j87L4O3j13J85k66J75L2j06J36j88
3535a07K21r2j39K13j79J51j30J2J92k69K21j32O8P3k58K46j26P7k4j44L21k62
3557f7L2J1k7J83l08K23Oj04J37k59K86j02j25J98j63K17k47O4J99k61K06j96
3579i7J68J5k39K77j86J40q2j01L05k70R0j7l2J78l10K10rq1J21k42L04j62k7
3602d7J27j60K13k73R8J36k09J74j87K07k4j94K05j53J73j32p7L11k83J66j19
$$ y = [31, -23, -6, 30, -66, 63, -26, 10, 19, -38, 62, -47, -6, 6, -13, 61, -44, 45, 55, -18, 56, -54, 79, 12, -21, 46, -36, 85, -55, -3, 72, -60, 52, -56, 26, 35, -89, 62, -47, 24, -34, -60, 79, -71, 20, 10, -25, 94, -115, 48, 10, -30, 23, -110, 71, -66, -56, 59, -64, 83, -102, -35, 86, -98, 88, -100, 75, 35, -74, 113, -55, 76, -67, -70, 130, -104, 42, -38, -4, 109, -142, 62, -16, 0, 29, -114, 128, -59, -25, 38, -75, 110, -156, 19, 51, -55, 81, -107, 114, 22, -117, 96, -83, 68, -62, -50, 142, -127, 94, -38, 30, 103, -155, 91, -35, 42, 18, -126, 195, -67, -35, -24, -51, 132, -176, 47, 53, -51, 86, -173, 113, 11, -114, 84, -79, 138, -109, -45, 154, -107, 99, -97, 71, 86, -153, 124, -62, 78, -4, -105, 200, -70, 20, 3, -29, 149, -161, 49, 40, -41, 80, -162, 142, -20, -47, 80, -80, 133, -140, -42, 94, -115, 59, -128, 79, 55, -139, 66, -87, 86, -46, -123, 188, -95, 71, -48]
3623d8M8J33l06K71r0oM4k12L19k20J8R3j36K59k98J34N4j23J22k00K03k4j60
3646a25K04j63K06j75j6J97k41J60j48J33O7k35K20j06O1oj68K72k02N0O0j15
3668g0J87k62J73L6r9J03j97K37q2q4J50j57J70j64OJ31j59J39j37J06M6j95J65
3691D3q5Q0j1j51K01j40Q6n2j1J44k03J37j4m9P6j52J85n6p7Q4q7J61j65M3O6
3716E3j05J12j31Q9J5j15J30q5J17p8p9J73j65P0l3J4Q0j26Q2l6JP3j45J59j17
3741d7RL8l9J41j54M3N2m9M3j01R6J1j12J34j29J04m3m3R7q8N1m4K3L4q2N8k4
3768b1L4K4j02R9p0J6K7m1R8j06L6Rk7N8p2O4j1o4Q1o2N4m8QN8n7M8k6J4J4k8
3798GQkLK2n3M6n6K4Lk7M9m2K2k5j8L1j6K4Kk2K2k4M6m9J8L3l3K1k6J5J7l2L7
$$ y = [-48, 0, 133, -173, 98, 8, 2, 46, -166, 153, -67, -49, 44, -92, 167, -131, 3, 57, -66, 56, -144, 59, 35, -125, 79, -84, 122, -53, -69, 128, -113, 47, -101, 32, 99, -136, 84, -22, 39, 33, -135, 137, -65, -15, 45, -70, 117, -145, 28, 64, -35, 68, -129, 108, 26, -58, 92, -65, 105, -59, -53, 78, -81, 58, -79, 27, 73, -122, 43, -42, 38, 27, -124, 77, -63, 23, -29, -40, 104, -99, 38, 24, -25, 51, -101, 84, 28, -49, 35, -52, 109, -56, -13, 53, -52, 60, -71, 18, 33, -82, 48, -37, 80, 2, -77, 96, -69, 1, -32, -18, 62, -64, 18, -18, -17, 56, -89, 70, -47, -38, 0, -39, 102, -52, -9, 43, -6, 37, -64, 32, 43, -69, 65, -64, 40, -3, -46, 51, -37, 14, -30, -7, 27, -55, 3, -21, 13, 37, -65, 34, -36, -20, 7, -34, 64, -42, -6, 3, -24, 34, -38, 26, 15, -49, 32, -30, 24, -24, -16, 42, -15, 33, 7, 21, 35, 7, 15, 13, 16, 38, -15, 31, -25, -1, 2, -25, 24, -18, 4, -21, -39, -8, -24, 0, 2, -20, 2, -22, 24, -25, -7, 26, -7, 14, -12, 3, 20, -12, 25]
3831B5j2J6ok5K0l0L9j2j2L8o5L6Pj4lj4K7l4K5L1m9L5l0j5K6k7J3NLjmK3k6j0
3865b0K8k0L8m7M5nm0K9pNk1J6J4k0K1l6J9J5k5MJ9mMl9M5k4mQj8M5n7J8K0m0
3899c4M7l1L4j9l4L6k2J8j9J3Rj1K6j9qJ9oL4m5J5J1j3L9n0J5Mm3N9m9L7rLmm9
3933d6O9m7pN1n6O2n9J8K2k5O7p7J2J9l5N2n0L8%j6L2n4O0o4L3M3o0N1m3J3J9
3964B2l5L6m2L9Mn1N1n1J8J6n1P2q2Q5l3k1M9o7P1n4j4P7o3L5k4ML9n8O3o8L7
3995DJ9r5J18r0O8m2rP8q8O0kk9O6j48J33n0J4L4j05J27j08J9N6o0Q6j13M2J7
4023Bm4Q1j29J27k9o8Q2p1P3m6k0J40j51J07r4L9Q7j81J21k2%N0j05J37j05K5
4049FM4r9J18j49P7L0n2O9j10J07k9o2J08j27J22q9j5J01j12P9r8P4L7j21J25
$$ y = [25, 13, 29, 23, -2, 18, -12, 27, 15, 3, 41, -24, 12, 19, 5, 2, -12, 15, -19, 6, 37, -12, 23, -7, -22, 4, -23, -10, -5, -2, -3, -7, 16, -10, -20, 8, -12, 26, -21, 24, 19, -21, 8, 1, 6, -15, 1, 15, -5, 16, -20, -1, 14, -11, -7, 12, 8, 12, -27, 18, -6, -10, -2, -20, 25, -32, -14, 6, -34, 13, -18, 16, -3, -37, -1, -23, -5, -24, -11, -2, -13, 13, -6, -14, 5, -1, 33, -12, 3, 14, 1, 40, -10, 5, 9, -34, 25, -24, 13, 4, 7, 3, -46, 23, -24, -31, 20, -36, 26, -33, -15, 7, -18, 49, -28, -16, 3, -32, 20, -30, 8, 8, -8, 24, -30, 30, -34, -1, 42, -18, 33, -10, 3, 22, -13, 23, -19, 20, 24, -27, 24, -27, -9, 7, -44, 28, -54, 31, -2, -23, 26, -41, 30, -24, -38, 39, -24, 11, -13, -9, 30, -28, 35, -33, 4, 23, -72, 46, -44, 24, -18, -27, 51, -37, 23, 21, -8, 58, -90, 43, -7, 7, 41, -64, 63, -45, -26, 30, -30, 56, -57, -15, 2, -42, 39, -90, 37, 8, -60, 22, -49, 24, -22, -42, 98, -53, 54, -40, -1, 86, -95, 26, 4, 4, 54, -51, 86, -19, 6, 50, -49, 69, -80, -3, 27, -25, 44, -66, 41, 12, -50, 58, -69, 53, -36, -51, 50, -62, 17, -81, -7, 30, -91, 34]
4074C4o4N6l1q3J85j25M1K5o0J33j71P4J9m4Q4j36J46m7q6Q4p2J23j39K9P3j12
4100f4R1j10J22nj22J58j06O5m4p7J91j71Q1j2QP9j80J02j2k3O0j16J45q3QO6
4126E1q8J50j54L0Q5j01J12j53J01M6j13O1q0J12m2r8J32q3O3o2JR1j28P6m4K1
4152a4K2q1J41q6LL0m4P9q0M0L6q7R2j23J06J2p7P0p0Q5q7j3J08r7O5m9lP6j34
4181h0J32p8K2K6j06J56q7J7Om7Q3j01M8lm6Q9j12J20j7n0L4n2R8p9KP9p9O4q5
4210d6M6O7j12P7n4L6k1m1P2m9M3m0KP2j08O3Kk4N2r7Q8k7k8M4q7J16o1K4J2o6
4240d5P4o1M7Rp1P4m4K1J7n4P2n7M2nk6M6p5O4qj4J6n2N0k0j3K6o6N1plJ2k6N9
4273C3m4M1m0n0P0l3L5k3RK3l0L1l2KK4k1%J2k0J7j9M6m4K8Ok9J9j3MJ7k6J9l5
$$ y = [34, -30, 26, -5, -88, 97, -28, 13, 38, -22, 111, -60, 14, 33, -11, 73, -63, 83, 36, -50, 34, -38, 85, -54, -25, 48, -64, 27, -83, 39, 34, -88, 70, -36, 29, -15, -92, 99, -72, 9, -3, 5, 84, -96, 6, -6, -29, 31, -85, 60, -23, -15, 51, -37, 113, -41, -11, 74, -27, 85, -68, 33, 79, -34, 27, -53, 59, 17, -81, 51, -32, 31, -31, -30, 61, -67, 9, -35, -14, 8, -73, 68, -18, -15, 15, -29, 50, -30, 10, 46, -41, 51, -72, 34, 46, -31, 39, -31, 54, -33, -46, 62, -35, 30, -19, -22, 54, -80, 52, -26, -4, 22, -84, 72, -15, 2, 8, -39, 44, -57, -9, -12, -58, 31, -81, 39, 22, -28, 6, -46, 52, -27, -25, 54, -25, 39, -46, 0, 67, -45, 32, -22, 14, -7, -48, 24, -25, 18, -22, -20, 52, -56, 7, 9, -15, 37, -60, 28, 1, -27, 17, -70, 46, -15, 9, 21, -45, 29, -32, 15, 24, -47, 27, -17, 4, 21, -33, 39, -18, 24, 19, -7, 39, -36, 28, 20, 6, 22, -30, 20, 0, -13, 13, -53, -2, -9, -12, 0, -26, 33, -11, 30, -10, -60, 10, -23, 12, -11, -2, 21, -9, 22, -10, -8, 16, -5, -5, 7, -13, 4, -15, 31, -13, 15, 21, -8, 11, -2, 2, 19, -7, 12, -23]
4306b3J8Mk7L3mJ6j0k9K2k4M6m3%L6l9M8l3QK1k4L0n1L3Rj7J3l4J9J7l5L6l2L3
4339A7oj6J1pL3mn1L6m0L2j1LNMMJ3l2QnJ0j5jOj0N1l6j3J1k5M5k1oj1K3K8n6
4375b6O4l4mK8p0N3J5j4j1Mj2J4NPk9J6j8J2rrM0l2J0j6J5J7j5K8k7j8J2j7L9
4408A8m1M0j9j2LqK1m%K3k2L2j4oOk4L6j7j1kj5L3j6JOJ1j5lpJKqj5L6nm9L7K9
4446B2J0n9jL1j2NlqL8l5RJ6jln9O9j9Lj4%J8l6L8QMJm7M7l2j2K4qK2m2MJ7k8
4483c3N8n0J9Jm5O7m0M8j9l6O0l8MkmM5o6N7k3j1M1o7Q1n4kK4m5O9o9K1L7n4M6
4516B0n7M3J9q3R7o5M8l2m3R7o6K0rk2N7n3PRJ5Lo4Q0oj1M1p9O8o2L5L5o0N6q5
4549d7O5j7m2P4o1O2n4mQ7j07O4m7K4J0n2N1rK3j0q0J24o3J0K0l3N7q6L7M2m6
$$ y = [-23, -5, -1, -28, 5, 1, 17, 7, -22, 0, -24, 22, -21, -21, 15, -24, 24, -9, -1, 20, -4, 26, -25, 8, 17, 0, 13, -21, -2, 15, -20, 16, -16, 17, 11, -5, 6, -1, 32, 28, -23, 13, -27, 5, -6, -3, 2, 6, 10, 23, -9, -1, -6, 4, -11, -12, -6, -16, 35, -1, -14, -3, -28, 17, -4, -10, -21, 2, 30, -26, 38, 4, 0, 28, -42, 11, 26, 12, 1, 5, -7, 7, 12, 19, -10, 6, -12, 0, -9, -18, 22, -10, 0, -16, -1, 16, 1, 29, 2, -16, -4, -21, 18, -23, 17, -2, -14, -11, -19, 2, -2, -2, 21, -1, 31, 17, 11, 17, -7, 29, 12, 1, -1, -16, 17, 1, 2, 8, 19, 4, 1, -6, -5, -3, -11, -26, 10, 5, -44, -7, 22, 32, -27, -28, 3, -9, -4, -7, -15, 23, -12, -3, 13, 12, 9, -50, 19, 0, 3, -11, -11, 7, -29, 9, 17, 21, 22, -25, 22, -10, -22, 2, -6, 16, -26, -22, -5, -33, 25, -25, -6, -5, -50, 17, -23, 25, 6, -30, 30, -8, -4, -6, -10, 35, -31, 26, 3, -8, 33, -34, 47, -7, -9, 15, -30, 39, -30, -9, 28, -26, 20, -37, 6, 25, -58, 39, -26, 22, -10, -53, 44, -22, -2, -11, -33, 24, -29, -22, -13, 2, 5, -59, 21, 15, 4, 45, -34, 34, -28, 7, 42, -18, 38, -47, 18, 1, -41, 33, -28, 34, -20, -24, 63, -44, 20, -27, -3, 7, -45, 6, -3, 20, 10, -70, 54, -9, 1, 21, -12, 45, -41, -4, 38, -8]
4579hL7p6O3Km0L8m5O0n6kP5m6M2p3K6L9r2P9l4J4jo1J00n8lK4o4R4r7N6KJ1J1
4612A7p9R3m6j5N2n2O9m0l0M3m3O6o1M1K4q4P2k3J3qk7N5l5Mj7jO8p2M4j9k2M6
4644C3r6R4n8oK7pM8q2K9L6l2L2o4M2L4q1P3p1Q5k6n5P3m1M0m3J5M5q0N8j6mM1
4676D3o6N9m2Nnj4O2n4kL0m0M9p2N1Ol9N2o2O5n9MQ2j07O6l2j5M5o1N4nkL8p9
4709d5Q4o3kK0OM3p3M6qnK4m5M2l7MJ5m0N9n4K5Rk3K9k8J6L0n2L0k2K4pk3L6k
4743A3Nl4OM6n3J9k8K0L6o1N8k2k2L5j9O4n6j7M2m4L7n2L5J7l2L6o1M0k2k8M7
4774Ek0K6l0K7J6l2pQj2J1MJ8k0j2M5k5OJj1L3n8L5j7K9Qk2Mj7L4k7k8N6o6M1
4808Ckj0J9mj0lj8K6J0j3q%pOJ4j1k0N0l5K7k9J9lK9k1LJ0pk6J4Qorj0M0o9M5
$$ y = [-8, 29, -47, 16, 18, -22, 16, -29, 31, -25, -27, 48, 2, 44, -29, -3, 36, -56, 23, -11, 3, 2, -59, 41, -17, -20, 4, -60, 34, -63, -7, -5, 6, 17, -62, 31, -15, -30, 22, -30, 39, -1, -31, 12, -31, 35, -26, 15, 39, -45, 27, 4, 17, 9, -18, 37, 2, 6, -11, -12, 56, -16, 28, 9, -13, 33, -63, 31, -27, -33, -6, -13, 35, -47, -18, 18, -14, 18, -46, -4, 30, -51, 22, -49, 36, 10, -45, 28, -13, 27, -16, -1, 44, -36, 22, 6, 2, 43, -23, 36, -6, -1, -6, -20, 42, -12, -14, 16, -24, 25, -47, 4, 10, -29, 23, -39, 26, -33, -29, 53, -54, 12, -20, -35, 10, -51, 3, -2, -4, 34, -45, 39, -24, -26, -6, 0, 43, -30, 16, 8, 3, 27, -18, 24, -13, -9, 6, -34, 25, -29, -4, 5, -18, 11, -17, -1, 29, -23, 7, -15, 9, 2, -21, 15, 13, 18, -16, -10, 36, -17, 2, -26, -6, 30, -31, 27, 5, -17, 18, -1, 63, 7, -10, 32, -12, 25, -27, 8, 25, -7, 29, -32, 8, -14, -42, 5, -15, 11, -19, 8, 24, -8, -15, -7, -19, -8, -4, 14, -6, -18, 27, 2, 8, 9, -2, 31, -27, 8, -9, 20, 28, 6, 10, -7, 27, 0, -28, 28, -38, 3, 1, -9, 10, 6, -4, -7, -25, 1, 11, -2, -10, -10, -17, -11, 3, -8, -28, 22, -13, 14, -15, 4, 1, 30, 9, 12, 22, 15, -11, 3, 11, 5, -4, -14, 26, -43, 2]
4845Bj5M2k8rL9k8Pj8J3qk7L9k2oK1lOooMnMJK6j7rlJ6lRNj5mnK1l6K6k2L4J1
4885C1l0J3k0qJ5j1K1nk0J2oJ3nMj0lPj4L5m1M3k5j6LJ7mpk8N1k3J4MjpqJ9j0
4922@j4K0J2jkj6RmJ9j9j9M0n0M3j7k2mLNJ2NJ8%j3Mnk0K0Qj4OpkJ7oK1l4jL9
4961C1p3N8j3nJ1j4Qj5K4j9mM8m4J1k1ORqK8j8oj5pM2j7J1kj8L2m0K5J9lj7m2
4996c8M6j7J5J0j3J2%j7J3j6K1Oj3Nm9M6m3L7J2p2P4k3nJ7l4N4m7M5l8J6%m5N0
$$ y = [2, -13, 29, 1, -8, 31, 3, 10, -8, 5, -3, -30, 9, -13, -19, 2, -1, 5, -1, -7, -3, -8, -4, -3, 23, 6, -3, -6, 10, 7, 16, 21, 6, 2, -3, 18, -18, 8, -14, 20, 31, 1, 14, -6, -14, 1, -10, 11, 6, -14, -2, -8, 5, 0, 4, -6, -9, -2, -16, 19, -22, 21, -4, -20, -17, 0, -4, -11, -39, 12, -11, 3, 7, 6, -1, -9, 10, 0, -14, 6, 18, 17, 15, -1, 8, 4, 23, 4, -15, 25, -25, 18, 1, -21, -25, -22, -17, -5, 0, 18, 18, 5, 9, 4, -16, 4, 12, -2, 4, -3, -5, 12, 6, 27, -7, -8, 31, -42, 16, 3, -2, 9, -5, 3, -12, 12, -7, -11, 37, -7, 4, -17, -11, -2, -10, 18, 0, -6, -21, -28, 14, -3, 8, 6, -12, 20, -20, 5, 24, 21, 4, -38, 8, -9, 6, 16, 3, 15, 15, -2, 11, -5, 16, 22, 9, 14, -35, 11, -32, 5, 17, -55, 19, -4, -9, 8, -26, 28, -19, 26, -12, 4, 4, -41, 9]
$$ [...]
8191a9
##END NTUPLES=NMR FID
##END=
