##TITLE=1H_LR-761-RM3
 CCl4
 8 sc, 
 17.1.2023
##JCAMPDX= 6.0         $$ Bruker NMR JCAMP-DX V2.0
##DATA TYPE= NMR FID
##DATA CLASS= NTUPLES
##ORIGIN= UXNMR, Bruker Analytische Messtechnik GmbH
##OWNER= root
$$ XWIN-NMR		Version 3.5
$$ Tue Jan 17 13:54:23 2023 Russian Standard Time (UT+4h)  she@DPX200
##.OBSERVE FREQUENCY= 200.13135
##.OBSERVE NUCLEUS= ^1H
##.DELAY= (6, 6)
##.ACQUISITION MODE= SIMULTANEOUS
##.ACQUISITION SCHEME= undefined
##.AVERAGES= 8
##.DIGITISER RES= 18
##SPECTROMETER/DATA SYSTEM= spect
##.PULSE SEQUENCE= zg30
##.SOLVENT NAME= CDCl3
##.SHIFT REFERENCE= (INTERNAL, CDCl3, 0, 15.7039)
##AUDIT TRAIL= $$ (NUMBER, WHEN, WHO, WHERE, WHAT)
$$ ##TITLE= Audit trail, XWIN-NMR		Version 3.5
$$ ##JCAMPDX= 5.01
$$ ##ORIGIN= Bruker BioSpin GmbH
$$ ##OWNER= she
$$ F:/spectra/data/she/nmr/H-F/1/audita.txt
$$ ##AUDIT TRAIL=  $$ (NUMBER, WHEN, WHO, WHERE, WHAT)
(   1,<2023-01-17 13:52:43.92 +0400>,<she>,<DPX200>,
      <created by zg, POWCHK disabled, PULCHK disabled
       configuration hash MD5:
       00 E9 B6 7A A2 85 ED C7 34 08 36 98 17 FE 4E 26
       data hash MD5: 16K
       13 B8 75 5F 35 05 B0 A9 3F 03 CF B9 55 83 2B B3>)
$$ ##END=
$$ 
$$ hash MD5
$$ BF D2 6A 24 FA A4 C3 E6 08 04 30 00 20 EE 5D F5
##$RELAX= 
##$RELAX= 
##$RELAX= 
##$RELAX= 
##$RELAX= 
##$RELAX= 
$$ Bruker specific parameters
$$ --------------------------
##$DU= <F:/spectra>
##$EXPNO= 1
##$NAME= <H-F>
##$PROCNO= 1
##$TYPE= <nmr>
##$USER= <she>
##$AMP= (0..31)
100 100 100 100 100 100 100 100 100 100 100 100 100 100 100 100 100 100 
100 100 100 100 100 100 100 100 100 100 100 100 100 100 
##$AQSEQ= 0
##$AQ_mod= 1
##$AUNM= <au_zg>
##$AUTOPOS= <>
##$BF1= 200.13
##$BF2= 200.13
##$BF3= 200.13
##$BF4= 200.13
##$BF5= 200.13
##$BF6= 200.13
##$BF7= 200.13
##$BF8= 200.13
##$BYTORDA= 1
##$CFDGTYP= 0
##$CFRGTYP= 5
##$CHEMSTR= <none>
##$CNST= (0..31)
1 1 145 1 1 1 1 1 1 1 1 1 1 1 1 1 1 1 1 1 1 1 1 1 1 1 1 1 1 1 1 1 
##$CPDPRG= <>
##$CPDPRG1= <>
##$CPDPRG2= <>
##$CPDPRG3= <>
##$CPDPRG4= <mlev>
##$CPDPRG5= <mlev>
##$CPDPRG6= <mlev>
##$CPDPRG7= <mlev>
##$CPDPRG8= <mlev>
##$CPDPRGB= <>
##$CPDPRGT= <>
##$D= (0..31)
0 1.2 0 0 0 0 0 0 0 0.06 0 0.03 0 0 0 0 0.0002 0 0 0 0 0 0 0 0 0 0 0 0 
0 0 0 
##$DATE= 1673949163
##$DBL= (0..7)
120 120 120 120 120 120 120 120 
##$DBP= (0..7)
150 150 150 150 150 150 150 150 
##$DBP07= 0
##$DBPNAM0= <>
##$DBPNAM1= <>
##$DBPNAM2= <>
##$DBPNAM3= <>
##$DBPNAM4= <>
##$DBPNAM5= <>
##$DBPNAM6= <>
##$DBPNAM7= <>
##$DBPOAL= (0..7)
0.5 0.5 0.5 0.5 0.5 0.5 0.5 0.5 
##$DBPOFFS= (0..7)
0 0 0 0 0 0 0 0 
##$DE= 6
##$DECBNUC= <off>
##$DECIM= 32
##$DECNUC= <off>
##$DECSTAT= 4
##$DIGMOD= 1
##$DIGTYP= 9
##$DL= (0..7)
0 120 120 120 120 120 120 120 
##$DP= (0..7)
150 150 150 150 150 150 150 150 
##$DP07= 0
##$DPNAME0= <>
##$DPNAME1= <>
##$DPNAME2= <>
##$DPNAME3= <>
##$DPNAME4= <>
##$DPNAME5= <>
##$DPNAME6= <>
##$DPNAME7= <>
##$DPOAL= (0..7)
0.5 0.5 0.5 0.5 0.5 0.5 0.5 0.5 
##$DPOFFS= (0..7)
0 0 0 0 0 0 0 0 
##$DQDMODE= 0
##$DR= 18
##$DS= 0
##$DSLIST= <SSSSSSSSSSSSSSS>
$$ [...]
##$SUBNAM2= <"">
##$SUBNAM3= <"">
##$SUBNAM4= <"">
##$SUBNAM5= <"">
##$SUBNAM6= <"">
##$SUBNAM7= <"">
##$SUBNAM8= <"">
##$SUBNAM9= <"">
##$SW= 18.05172834244
##$SWIBOX= (0..15)
0 0 2 0 0 0 0 0 0 0 0 0 0 0 0 0 
##$SW_h= 3612.71676300578
##$TD= 16384
##$TD0= 1
##$TE= 0
##$TE2= 300
##$TE3= 300
##$TEG= 300
##$TL= (0..7)
0 120 120 120 120 120 120 120 
##$TP= (0..7)
150 150 150 150 150 150 150 150 
##$TP07= 0
##$TPNAME0= <>
##$TPNAME1= <>
##$TPNAME2= <>
##$TPNAME3= <>
##$TPNAME4= <>
##$TPNAME5= <>
##$TPNAME6= <>
##$TPNAME7= <>
##$TPOAL= (0..7)
0.5 0.5 0.5 0.5 0.5 0.5 0.5 0.5 
##$TPOFFS= (0..7)
0 0 0 0 0 0 0 0 
##$TUNHIN= 0
##$TUNHOUT= 0
##$TUNXOUT= 0
##$USERA1= <user>
##$USERA2= <user>
##$USERA3= <user>
##$USERA4= <user>
##$USERA5= <user>
##$V9= 5
##$VALIST= <valist>
##$VCLIST= <CCCCCCCCCCCCCCC>
##$VD= 0
##$VDLIST= <DDDDDDDDDDDDDDD>
##$VPLIST= <PPPPPPPPPPPPPPP>
##$VTLIST= <TTTTTTTTTTTTTTT>
##$WBST= 1024
##$WBSW= 4
##$XGAIN= (0..3)
0 0 0 0 
##$XL= 0
##$YL= 0
##$YMAX_a= 503354
##$YMIN_a= -750582
##$ZGOPTNS= <>
##$ZL1= 120
##$ZL2= 120
##$ZL3= 120
##$ZL4= 120
##$ABSF1= 10
##$ABSF2= 0
##$ABSG= 5
##$ABSL= 3
##$ALPHA= 0
##$AQORDER= 0
##$ASSFAC= 0
##$ASSFACI= 0
##$ASSFACX= 0
##$ASSWID= 0
##$AUNMP= <proc_1d>
##$AZFE= 0.1
##$AZFW= 0.1
##$BCFW= 1
##$BC_mod= 2
##$BYTORDP= 1
##$COROFFS= 0
##$CY= 11.3945322036743
##$DATMOD= 1
##$DC= 2
##$DFILT= <>
##$DTYPP= 0
##$F1P= 2.36226072786647
##$F2P= -0.459571619588291
##$FCOR= 0.5
##$FTSIZE= 0
##$FT_mod= 4
##$GAMMA= 1
##$GB= 0.15
##$INTBC= 1
##$INTSCL= 1
##$ISEN= 128
##$LB= 0.24
##$LEV0= 0
##$LPBIN= 0
##$MAXI= 10000
##$MC2= 0
##$MEAN= 0
##$ME_mod= 0
##$MI= 1.114404
##$NCOEF= 0
##$NC_proc= 0
##$NLEV= 6
##$NOISF1= 3.799351
##$NOISF2= 2.8
##$NSP= 1
##$NTH_PI= 0
##$NZP= 0
##$OFFSET= 15.70392
##$PC= 1
##$PHC0= -19115.5
##$PHC1= 18.40073
##$PH_mod= 1
##$PKNL= yes
##$PPARMOD= 0
##$PSCAL= 0
##$PSIGN= 0
##$REVERSE= no
##$SF= 200.130013532006
##$SI= 16384
##$SIGF1= 3
##$SIGF2= 2
##$SINO= 400
##$SIOLD= 16384
##$SREGLST= <1H.CDCl3>
##$SSB= 0
##$STSI= 0
##$STSR= 0
##$SW_p= 3612.71676300578
##$SYMM= 0
##$S_DEV= 0
##$TDeff= 0
##$TDoff= 0
##$TI= <>
##$TILT= no
##$TM1= 0
##$TM2= 0
##$TOPLEV= 0
##$USERP1= <user>
##$USERP2= <user>
##$USERP3= <user>
##$USERP4= <user>
##$USERP5= <user>
##$WDW= 1
##$XDIM= 8192
##$YMAX_p= 0
##$YMIN_p= 0
$$ End of Bruker specific parameters
$$ ---------------------------------
##NTUPLES= NMR FID
##VAR_NAME=  TIME,          FID/REAL,        FID/IMAG
##SYMBOL=    X,             R,               I
##VAR_TYPE=  INDEPENDENT,   DEPENDENT,       DEPENDENT
##VAR_FORM=  AFFN,          ASDF,            ASDF
##VAR_DIM=   8192,          8192,            8192
##UNITS=     SECONDS,       ARBITRARY UNITS, ARBITRARY UNITS
##FACTOR=    0.0002768,     1,               1
##FIRST=     0,             0,               0
##LAST=      2.2672688,     0,               0
##MIN=       0,             -750582,         0
##MAX=       2.2672688,     503354,          0
$$ Real data points
##PAGE= N=1
##DATA TABLE= (X++(R..R)), XYDATA
$$ [...]
$$ plain form
2153 -2227 232 -7 489 -2430 -2278 2335 -2035 -425 1396 1131 1603 -1115 2335 845 -2001 90
2169 90 -878 -610 -2133 -506 2154 -1879 1225 2047 1041 290 -1273 2459 -1049 -2877 267 -527 -445
2186 -445 -1640 455 2774 -1039 811 1819 858 -370 -1587 1533 -1596 -2487 -11 -416 524 -784
2202 -784 1326 2337 -955 1765 966 -651 -642 -1791 428 -1907 -1544 968 -2 376 -20 2422 1519
2219 1519 -1389 1150 106 -1124 -1917 -1359 692 -2025 -646 1648 652 865 613 2036 831 -1528
2235 -1528 269 -836 -1252 -1853 -822 1116 -1242 1109 2076 1109 1371 2 1238 -459 -2078 -185
2251 -185 -1215 -1670 -943 462 1012 -41 1429 1601 884 -266 -460 528 -1697 -2244 -262 -882 -532 -169
2269 -169 1308 1970 -27 1184 1729 -27 -1189 -706 -180 -1844 -1679 167 -44 -1 496 2354 1112
$$ packed form
2153b227K459k39M96k919J52M613m370J610J821k65M72k718L450j490k846K091
2169I0r68K68j523J627K660m033L104Q22j006p51j563L732l508j828L144p94Q2
2186d45j195K095K319l813J850J008r61j228j217L120l129q91K476m05R40j308
2202g84K110J011l292K720p99j617Rj149K219k335L63K512r70L78l96K442r03
2219A519k908K539j044j230p93N58K051k717J379K294r96K13k52J423j205k359
2235a528J797j105m16o01J031J938k358K351R67r67K62j369J236j697j619J893
2251a85j030m55P27J405N50j053J470J72p17j150j94R88k225n47J982o20L50L63
2269a69J477O62j997J211N45j756j162M83N26j664J65J846k11M3M97J858j242
$$ plain form
2286 1112 -178 840 389 -993 -1450 -1029 -182 -1373 -896 1442 1141 442 1202 1894 709 -840 184
2303 184 -326 -1568 -1625 -305 232 -1116 172 1910 1314 58 697 1313 -181 -1948 -293 -137 -2145
2320 -2145 -1418 700 651 -399 703 2271 1019 -410 485 969 -1198 -2306 54 -182 -1438 -579 1676
2337 1676 1387 -471 835 2352 -50 -1611 320 289 -2060 -2067 319 254 -1226 -78 2279 860 -922
2354 -922 848 1670 -965 -2240 -206 195 -2345 -1257 1475 807 -922 921 2441 651 -1396 656
2370 656 984 -1658 -2103 376 560 -2014 -552 2400 962 -690 1102 1979 -346 -1861 629 449
2386 449 -2236 -1686 1050 755 -1700 184 2759 547 -981 764 1633 -1320 -2372 716 155 -2618
2402 -2618 -1180 1619 1115 -1010 970 2812 277 -1098 605 765 -1782 -2127 919 -287 -1888 -164
$$ packed form
2286A112j290J018m51j382m57M21Q47j191M77K338l01o99P60O92j185j549J024
2303A84n10j242n7J320N37j348J288J738n96j256O39O16j494j767J655J56k008
2320b145P27K118m9j050J102J568j252j429Q95M84k167j108K360k36j256Q59K255
2337A676k89j858J306J517k402j561J931l1k349pK386o5j480J148K357j419j782
2354i22J770Q22k635j275K034M01k540J088K732o68j729J843J520j790k047K052
2370F56L28k642m45K479J84k574J462K952j438j652J792Q77k325j515K490j80
2386D49k685N50K736k95k455J884K575k212j528J745Q69k953j052L088n61k773
2402b618J438K799n04k125J980J842k535j375J703J60k547l45L046j206j601J724
$$ plain form
2418 -164 2231 1111 -1041 1608 2312 -1035 -1485 603 57 -2055 -1821 1302 88 -1527 819 2318
2434 2318 670 -1723 1713 1212 -1839 -1574 434 79 -2310 -851 2170 232 -314 1237 2124 490
2450 490 -1604 1269 468 -2444 -1399 9 280 -1689 -18 2611 -214 -219 1350 1300 -468 -1689 1182
2467 1182 -495 -2504 -745 568 451 -1403 777 2887 -232 -101 975 1041 -1403 -2593 740 -608
2483 -608 -1991 -30 790 961 -582 1408 2266 -757 -257 -157 174 -1555 -2179 930 -670 -870 715
2500 715 1144 1413 -249 1554 1189 -1659 -7 -262 -438 -1352 -1339 1272 -866 -191 1485 1121 932 -778
2518 -778 1130 484 -2145 -327 -807 -100 -970 -493 2078 -241 853 1098 709 977 -1077 265 -140
2535 -140 -1412 -307 -1303 178 -282 -94 2206 -545 1135 778 -189 352 -1392 238 -898 -1228 508
$$ packed form
2418a64K395j120k152K649P04l347m50K088n46k112K34L123j214j615K346J499
2434B318j648k393L436n01l051K65K008l55k389J459L021j938n46J551Q87j634
2450D90k094K873q01k912J045J408K71j969J671K629k825nJ569n0j768j221K871
2467A182j677k009J759J313j17j854K180K110l119J31J076O6k444j190L333j348
2483f08j383J961Q20J71j543J990Q58l023N00J00L31j729o24L109j600k00J585
2500G15M29K69j662J803l65k848J652k55j76r14J3K611k138O75J676l64j89j710
2518g78J908o46k629J818m80P07q70M77K571k319J094K45l89K68k054J342m05
2535a40j272J105r96J481m60J88K300k751J680l57r67N41j744J630j136l30J736
$$ plain form
2552 508 -527 1070 -155 535 2008 -598 886 -127 -492 -242 -1996 214 -566 -778 445 -482 1629
2569 1629 307 332 1396 -600 581 -1178 -446 280 -1886 225 -383 344 601 -449 1352 154 122
2586 122 511 -969 491 -1342 -492 213 -1149 1027 -24 478 956 -414 1459 -858 205 275 -1227
2603 -1227 231 -1446 -28 381 -1059 1206 22 886 219 -346 1597 -1369 -504 79 -591 216 -1395
2620 -1395 570 830 -407 1072 -131 1034 -185 -764 1038 -1164 -681 -486 -505 394 -1029 1280 318
2637 318 -285 1391 -634 482 -354 -481 787 -1591 -95 -197 -42 481 -781 1488 602 -434 661
2654 661 -449 47 -1283 -604 652 -1044 167 103 679 785 -683 1399 252 -231 83 -1133 566
2671 566 -1232 -528 563 -961 609 255 879 801 -512 1004 -597 -429 -102 -677 3 -1027 124
$$ packed form
2552E08j035J597j225O90J473k606J484j013l65K50j754K210p80k12J223r27K111
2569A629j322K5J064j996J181j759P32P26k166K111o08P27K57j050J801j198l2
2586A22L89j480J460j833Q50P05j362K176j051N02M78j370J873k317J063P0j502
2603a227J458j677J418M09j440K265j184Q64o67n65J943k966Q65N83o70Q07j611
2620a395J965K60j237J479j203J165j219n79J802k202M83J95j9Q99j423K309r62
2637C18o03J676k025J116q36j27J268k378J496j02J55N23j262K269q86j036J095
2654F61j110M96j330O79J256j696J211o4N76J06j468K082j147m83L14j216J699
2671E66j798P04J091j524J570l54O24p8j313J516j601J68L27n75O80j030J151
$$ plain form
2688 124 658 -478 725 108 802 284 -653 919 -573 -589 -212 -257 330 -678 395 721 213 663 -249
2707 -249 922 -107 -815 138 -635 -313 -467 -212 870 -603 610 790 49 385 -539 203 -498 -792
2725 -792 399 -420 -145 -184 266 1001 -430 484 521 -293 -93 -470 424 -678 -782 353 76 96 182 766
2745 766 1016 -442 40 444 -242 -395 -775 334 -636 -551 824 321 347 -44 442 617 -682 -138 46
2764 46 -547 -728 -487 612 -577 -454 769 733 -92 -29 751 112 -986 210 117 -573 -579 -50 446 -244
2784 -244 144 722 551 -69 -125 522 -57 -1356 -119 296 -469 -691 26 818 -445 133 747 118 -163
2803 -163 -360 162 -473 -1139 147 432 -348 -283 703 927 -354 -240 791 -7 -714 -436 126 -241 -687
2822 -687 168 294 114 33 927 600 -483 -105 316 -271 -546 -370 166 -64 -52 380 554 0 3 526 190
$$ packed form
2688A24N34j136J203o17O94n18r37J572j492j6L77m5N87j008J073L26n08M50r12
2707b49J171j029p08R53p73L22j54K55J082j473J213J80p41L36r24P42p01k94
2725g92J191q19K75l9M50P35j431R14L7q14K00l77Q94j102j04J135k77K0Q6N84
2745G66K50j458M82M04o86j53l80J109r70Q5J375n03K6l91M86J75j299N44J84
2764D6n93j81K41J099j189J23J223l6q25O3P80o39j098J196r3o90oN29M96o90
2784b44L88N78j71o20n6O47n79j299J237M15p65k22P17P92j263N78O14o29k81
2803a63j97N22o35o66J286K85p80O5R86K24j281J14J031p98p07K78N62l67m46
2822f87Q55J26j80q1Q94l27j083L78M21n87k75J76N36k30J2M32J74n54LN23l36
$$ plain form
2843 190 -455 -131 -19 -361 -634 -67 410 -98 92 770 651 197 22 481 -213 -611 -377 -100 -255 -243
2863 -243 109 496 142 79 702 12 -25 -287 -145 30 -355 -408 -199 -122 264 358 512 308 166 201 179 -243
2885 -243 -467 -332 -600 -366 176 240 320 364 78 284 23 -69 -157 -329 -261 -306 -338 -17 78 -127 116 425 319
2908 319 -58 288 347 -259 -344 -334 118 -476 -117 512 434 59 85 792 57 -622 208 -44 -450 -967 -250 30
2930 30 -690 -19 758 401 97 -48 846 -159 -748 433 108 -697 -505 524 451 -481 -86 956 232
2949 232 -392 -268 767 -594 -1074 648 237 -465 -471 748 863 -661 288 748 96 -639 25 732 -837
2968 -837 -673 552 136 -89 -74 972 258 -748 823 478 -371 -869 -208 819 -1059 -653 785 311
2986 311 -193 -18 1228 335 -979 315 409 -381 -781 -29 457 -894 -77 1087 16 -71 -190 840
$$ packed form
2843A90o45L24J12l42k73N67M77n08J90O78j19m54j75M59o94l98K34K77j55J2
2863b43L52L87l54o3O23o90l7k62J42J75l85n3K09P7L86R4J54k04j42L5k2m22
2885b43k24J35k68K34N42O4Q0M4k86K06k61r2q8j72O8m5l2L21R5k05K43L09j06
2908C19l77L46N9o06q5J0M52n94L59O29p8l75K6P07p35o79Q30k52m06n17P17K80
2930C0p20O71P77l57l04j45Q94j005n89J181l25q05J92J029p3r32L95J042p24
2949B32o24J24J035j361m80J722m11p02oJ219J15j524R49M60o52p35O64P07j569
2968h37J64J225m16k25J5J046p14j006J571l45q49m98O61J027j878M06J438m74
2986C11n04J75J246q93j314J294R4p90m00P52M86j351Q17J164j071q7j19J030
$$ plain form
3004 840 -198 -1108 710 167 -727 -977 654 502 -819 94 1218 197 -154 34 1049 -815 -1276
3021 -1276 805 -287 -586 -528 674 924 -1035 547 1021 -313 -275 -48 894 -998 -858 999 29 -342
3039 -342 -591 805 561 -989 506 685 -375 -352 -402 661 -800 -758 615 -191 16 -382 885 253
3057 253 -1035 710 216 -219 -472 -40 649 -959 -199 715 -297 126 -247 920 431 -506 782 -35
3075 -35 -495 -541 -634 503 -1027 244 818 -389 538 -308 777 -314 -696 621 -491 -272 -248 -284 922
3094 922 -777 281 610 -187 359 -509 721 -493 -862 164 -598 -74 -282 -78 843 -499 552 562
3112 562 -81 118 -571 644 -165 -652 45 -304 458 -198 308 1069 -481 469 139 -341 -141 -488 477
3131 477 -312 -374 389 -473 376 -131 330 439 -715 460 -362 -342 -86 -666 353 -240 -198 527 -4 282
$$ packed form
3004H40j038r10J818n43q94k50J631j52j321R13J124j021l51J88J015j864m61
3021a276K081j092k99N8J202K50j959J582M74j334L8K27R42j892J40J857r70l71
3039c42k49J396k44j550J495J79j060K3n0J063j461M2J373q06K07l98J267o32
3057B53j288J745m94m35k53M32O89j608P60R14j012M23l73J167m89r37J288q17
3075c5m60m6r3J137j530J271N74j207R27q46J085j091l82J317j112K19K4l6J206
3094I22j699J058L29p97N46q68J230j214l69J026p62N24k08K04R21j342J051J0
3112E62o43J99o89J215q09m87O97l49P62o56N06P61j550R50l30m80K00l47R65
3131D77p89o2P63q62Q49n07M61J09j154J175q22K0K56n80J019n93M2P25n31K86
$$ plain form
3151 282 -146 174 271 -538 -74 -431 2 -53 -804 752 -223 90 415 -31 521 -386 109 -213 -458 232
3171 232 -47 119 276 -180 881 -159 64 422 203 285 -608 24 36 -409 199 -59 266 42 -79 734
3191 734 -352 229 198 -172 92 -846 217 -238 -442 236 -54 475 76 -68 180 -89 123 -253 -66 328
3211 328 -411 234 -300 -204 43 -467 559 -127 203 294 -149 -25 -192 -230 281 -522 179 57 -89 381 -16
3232 -16 708 -36 19 187 -42 26 -192 -33 -74 -375 305 77 408 81 32 686 -214 -235 -126 25 181 -624
3254 -624 34 300 -89 -76 68 547 25 -57 545 -37 -155 -39 54 -278 -480 228 440 -238 71 205 238
3275 238 -108 -314 81 -154 -375 45 8 173 -507 401 656 -297 -128 363 343 -502 -148 329 -149 -370 -71
3296 -71 401 -175 -428 413 123 -554 -98 67 146 -622 -247 407 -450 -463 328 616 -205 -99 429 549 -595
$$ packed form
3151B82m28L20R7q09M64l57M33n5p51J556r75L13L25m46N52r07M95l22k45O90
3171B32k79J66J57m56J061j040K23L58k19Q2q93O32J2m45O08k58L25k24j21Q13
3191G34j086N81l1l70K64r38J063m55k04O78k90N29l99j44K48k69K12l76J87L94
3211C28p39O45n34R6K47n10J026o86L30R1m43J24j67l8N11q03P01j22j46M70l97
3232a6P24p44N5J68k29O8k18J59m1l01O80k28L31l27m9O54r00k1J09J51J56q05
3254f24O58K66l89J3J44M79n22q2O02n82j18J16R3l32k02P08K12o78L09J34L3
3275B38l46k06L95k35k21M20l7J65o80R08K55r53J69M91k0q45L54M77m78k21K99
3296g1M72n76k53Q41k90o77M56J65P9p68L75O54q57j3P91K88q21J06N28J20j144
$$ plain form
3317 -595 -98 481 -108 -664 -69 562 -284 -459 376 575 -277 -438 845 98 -484 -42 635 -205 -638 255
3337 255 871 -320 -642 397 473 -461 -560 394 67 -960 69 636 -174 -727 413 558 -465 -288 831
3356 831 183 -638 -74 561 -302 -871 6 425 -240 -599 430 578 -145 -161 647 105 -710 59 940 -167
3376 -167 -821 387 480 -442 -265 483 311 -757 -127 586 22 -537 6 823 -397 -602 607 469 -576
3395 -576 -457 630 59 -479 7 563 165 -649 246 597 -419 -185 515 200 -266 -321 398 -218 -606 122
3415 122 434 -230 -595 300 411 -540 -311 461 87 -480 115 349 -231 -465 252 671 -235 -313 396 -118
3435 -118 -424 111 270 245 -476 -91 558 -375 -450 222 190 -215 -107 602 191 -431 -152 246 -286 -543 -81
3456 -81 330 -298 -165 367 121 -37 -176 270 223 -380 229 111 -322 -349 175 526 -466 -1 71 -56 93
$$ packed form
3317e95M97N79n89n56N95O31q46j75Q35J99q52j61J283p47n82M42O77q40m33Q93
3337B55O16j191l22J039P6r34r9R54l27j027J029N67q10n53J140J45j023J77J119
3356H31o48q21N64O35q63n69Q77M19o65l59J029J48p23j6Q08n42q15P69Q81j107
3376a67o54J208R3r22J77P48j72j068O30P13n64n59N43Q17j220k05J209j38j045
3395e76J19J087n71n38M86N56l98q14Q95L51j016K34P00l15m66n5P19o16l88P28
3415A22L12o64l65Q95J11r51K29P72l74n67N95K34n80k34P17M19r06p8P09n14
3435a18l06N35J59k5p21L85O49r33p5O72l2m05J08P09m11o22K79L98n32k57M62
3456h1M11o28J33N32k46j58j39M46m7o03O09j18m33k7N24L51r92M65P2j27J49
$$ plain form
3477 93 -3 147 -218 -332 133 56 0 -193 -183 197 -89 151 357 -207 22 -140 279 -40 -534 188 106 136
3499 136 214 311 340 -286 154 -10 -206 136 -189 358 -178 -274 190 -397 196 4 101 -84 -203 344 -170 -81
3521 -81 81 -250 257 -409 -74 490 -149 398 212 -98 303 -257 255 -608 66 -83 -285 301 -239 331
3541 331 -6 -261 175 -379 -49 44 -378 334 -538 -329 191 -113 612 -224 450 188 -150 227 51 -29 -186
3562 -186 -205 346 -636 116 215 -108 327 -155 612 -71 -290 156 -5 210 -82 -33 1 -361 343 70 165 250
3584 250 -1 528 -310 -79 291 -335 -143 -347 -75 12 -454 615 258 -192 -140 -259 556 -604 -245 -13
3604 -13 -327 -280 -191 402 294 -495 676 107 110 213 -84 388 -508 -253 422 141 -182 -394 287 156 -398
3625 -398 470 129 126 -216 121 352 -705 34 465 154 27 -253 458 303 -314 321 -98 -193 -397 -105 442
$$ packed form
3477I3r6J50l65j14M65p7n6j93J0L80k86K40K06n64K29j62M19l19m94P22q2L0
3499A36P8R7K9o26M40j64j96L42l25N47n36r6M64n87N93j92R7j85j19N47n14Q9
3521h1J62l31N07o66L35N64o39N47j86l10M01n60N12q63O74j49k02N86n40N70
3541C31l37k55M36n54L30R3m22P12q72K09N20l04P25q36O74k62l38L77j76q0j57
3562a86j9N51r82P52R9l23M35m82P67o83k19M46j61K15k92M9L4l62P04k73R5Q5
3584B50k51N29q38K31L70o26J92k04K72Q7m66J069l57m50N2j19Q15j160L59K32
3604a3l14M7Q9N93j08p89J171n69LJ03k97M72q96K55O75k81l23k12O81j31n54
3625c98Q68l41ll42L37K31j057P39M31l11j27k80P11j55o17O35m19r5k04K92N47
$$ plain form
3646 442 -653 -117 455 -317 64 -247 496 -61 -482 194 -52 -95 -263 218 244 -441 199 350 -32 -12 -59
3667 -59 383 -255 -482 309 -74 -86 -394 230 339 -569 106 465 -93 -406 -168 640 -404 -616 448 98
3687 98 -75 -75 407 450 -557 27 471 -187 -370 -360 289 -645 -346 590 -171 -286 -244 524 296 -571 180 366
3709 366 -257 -576 2 449 -565 -386 323 132 -344 -89 499 -37 -440 321 314 -273 -291 149 517 -713
3729 -713 -101 496 -54 -385 -81 404 -199 -721 480 305 -502 -351 228 320 -834 158 712 -59 -410 -24
3749 -24 360 -124 -371 533 355 -723 -119 630 368 -318 174 588 -50 -412 153 467 -365 -454 324 141
3769 141 -408 -184 514 106 -365 243 373 -161 -502 292 3 -446 -132 184 185 -253 -29 417 69 -339 209
3790 209 227 -141 -117 56 256 -351 -28 511 107 -88 98 642 108 -471 275 53 -317 206 154 312 -519
$$ packed form
3646D42j095N36N72p72L81l11P43n57m21O76k46m3j68M81K6o85O40J51l82K0m7
3667e9M42o38k27P91l83j2l08O24J09r08O75L59n58l13K38Q08j044k12J064l50
3687I8j73%M82M3j007N84M44o58j83J0O49r34K99R36p61j15M2P68k28q67P51J86
3709C66o23l19N78M47j014J79P09j91m76K55N88n36m03P61pn87j8M40L68j230
3729g13O12N97n50l31L04M85o03n22J201j75q07J51N79R2j154R92N54p71l51L86
3749b4L84m84k47R04j78j078O04P49k62o86M92M14o38l62N65L14q32q9P78j83
3769A41n49K24O98m08m71O08J30n34l41P94k89m49L14L16Jm38K24M46l48m08N48
3790B09J8l68K4J73K00o07L23N39m04j95J86N44n34n79P46k22l70N23n2J58q31
$$ plain form
3811 -519 215 329 -432 83 185 207 -102 -432 -18 -22 -245 -216 258 82 -555 229 123 -67 -101 87 -103 -288
3833 -288 -51 28 -165 -24 12 94 216 -268 -15 263 -187 24 254 9 -118 30 417 1 78 -90 157
3854 157 -196 -38 0 124 -11 39 -122 -26 -84 274 92 -92 71 -39 -43 239 -93 0 21 -25 16 86 10 -87
3878 -87 115 -3 8 83 95 93 -27 35 -234 138 -17 -37 -203 -46 183 178 -7 -203 248 126 -63 142 30
3901 30 -50 -70 61 124 196 109 11 102 13 -119 289 -1 -88 14 43 125 -110 231 -197 142 126 77 -50 -217 112
3926 112 282 -117 -83 209 136 51 -100 200 65 -50 122 -20 -147 -77 -22 -21 -222 -205 48 37 215 -36 286
3949 286 310 -77 109 169 -91 53 424 -132 -192 34 215 88 -88 -46 277 -45 -386 337 -29 5 -143 42
3971 42 95 -338 -59 -112 -27 -100 -72 297 -323 -266 -93 -18 -156 -28 124 112 -130 134 183 79 -95 -450 -4
$$ packed form
3811e19P34J14p61N15J02K2l09l30M14mk23K9M74j76o37P84j06j90l4J88j90j85
3833b88K37P9j93J41L6Q2J22m84K53K78m50K11K30k45j27J48L87m16P7j68K47
3854A57l53J58L8J24j35N0j61R6n8L58j82j84J63j10mK82l32R3K1m6M1P0p6r7
3878h7K02j18J1P5J2kj20O2k69L72j55k0j66J57K29nj85j96M51j22j89K05j12
3901C0q0k0J31O3P2q7r8R1q9j32M08k90q7J02K9Q2k35L41m28L39j6m9j27j67L29
3926A12J70l99L4K92p3q5j51L00j35j15J72j42j27P0N5Jk01J7K53j1J78k51L22
3949B86K4l87J86O0k60J44L71n56o0K26J81j27j76M2L23l22l41P23l66L4j48J85
3971D2N3m33K79n3Q5p3K8L69o20N7J73P5j38J28J52j2k42K64M9j04j74l55M46
$$ plain form
3994 -4 -150 -275 163 -97 -26 -272 133 -206 -153 77 23 75 -415 -31 369 -307 -175 -165 265 187 -175 275 60
4017 60 -355 60 284 -96 -25 -278 413 -36 101 219 121 -96 -168 442 -4 -198 -222 52 72 -276 -50 309
4039 309 -353 -106 102 -171 -113 -287 268 -134 -129 -26 -208 236 -151 50 237 -114 47 258 218 -88 -606
4060 -606 325 -168 -303 112 -278 231 -579 341 537 -347 -104 -29 114 5 -243 429 -50 -71 52 -296 282
4081 282 -538 -140 207 -513 1 54 222 -31 -277 366 -68 -18 317 191 186 -356 314 240 -28 136 -49 80
4103 80 -256 -66 185 -73 -144 -169 137 353 -254 514 -141 -148 85 2 369 -244 38 467 -558 -10 -118 177
4125 177 -204 -206 292 -92 -324 123 -146 285 -508 179 226 -291 179 28 -46 9 -275 161 -93 -355 282 -171
4147 -171 210 -273 169 323 -391 116 -89 59 -191 -150 50 -365 -87 371 101 85 -50 145 30 -274 328
$$ packed form
3994dj46j25M38k60P1k46M05l39N3K30n4N2m90L84M00o76J32J0M30p8l62M50k15
4017F0m15M15K24l80P1k53O91m49J37J18r8k17p2O10m46j94k4K74K0l48K26L59
4039C09o62K47K08k73N8j74N55m02NJ03j82M44l87K01J87l51J61K11m0l06n18
4060f06R31m93j35M15l90N09q10R20J96q84K43P5J43j09k48O72m79k1J23l48N78
4081B82q20L98L47p20N14N3J68k53k46O43m34N0L35j26nn42O70p4k68J64j85J29
4103H0l36J90K51k58p1k5L06K16o07P68o55pK33q3L67o13K82M29j025N48j08K95
4125A77l81kM98l84k32M47k69M31p93O87M7n17M70j51p4N5k84M36k54k62O37m53
4147a71L81m83M42J54p14N07k05J48k50M1K00m15K78M58k70j6j35J95j15l04O02
$$ plain form
4168 328 -102 104 -155 -49 152 -327 128 365 103 124 -170 18 -51 -249 188 -283 -124 -73 52 -62 -246
4189 -246 48 173 63 189 -53 329 176 -278 103 -241 -50 -274 -172 271 -178 -62 21 -163 294 34
4209 34 163 -140 -143 172 -125 82 -108 -103 150 -205 42 -21 -44 167 -119 7 -138 -116 89 -3 194 39 -12
4232 -12 -156 82 388 47 -171 272 -113 34 42 38 188 -51 276 -112 -170 280 131 206 -176 -34 7 -164 141
4255 141 -46 -52 45 -93 214 -27 -168 -85 116 169 -464 -99 205 -170 56 340 62 -77 -34 219 -212 -323
4277 -323 -100 97 139 -314 223 267 -222 68 276 317 22 -89 188 -259 -76 204 98 124 -297 172 219 9
4299 9 145 138 177 -237 -130 436 28 -403 196 275 25 -247 106 279 -135 -147 86 62 -395 84 286 -170 -255
4322 -255 -35 290 -136 -198 234 -216 -238 82 308 -167 -266 138 102 -103 -98 153 202 -79 -42 350 -63 -266 28
$$ packed form
4168C28m30K06k59J06K01m79M55K37k62K1k94J88o9j98M37m71J59N1J25j14j84
4189b46K94J25j10J26k42L82j53m54L81l44J91k24J02M43m49J16Q3j84M57k60
4209C4J29l03lL15k97K07j90NK53l55K47o3k3K11k86J26j45K2K05r2J97j55n1
4232a2j44K38L06l41k18M43l85J47QmJ50k39L27l88n8M50j49P5l82J42M1j71L05
4255A41j87oR7j38L07k41j41Q3K01N3o33L65L04l75K26K84k78j39M3K53m31j11
4277c23K23J97M2m53N37M4m89K90K08M1k95j11K77m47J83K80j06K6m21M69M7k10
4299IJ36pL9m14J07N66m08m31N99P9k50k72L53J73m14j2K33k4m57M79K02m56q5
4322b55K20L25m26o2M32m50k2L20K26m75r9M04l6k05NK51M9k81L7L92m13k03K94
$$ plain form
4345 28 376 -37 -336 54 150 -243 -152 153 203 -277 -70 443 15 -494 284 436 -84 -136 181 289 -122 -30
4367 -30 122 -185 -78 -32 151 -52 61 97 356 -125 -122 186 15 -165 -309 340 41 -125 -258 -8 -95 -176
4389 -176 57 504 127 -212 166 -67 -14 -41 41 225 -376 262 37 161 -66 206 90 57 -38 109 186 -153
4411 -153 -55 -51 84 -18 449 306 -243 219 249 -88 107 -19 169 114 -214 69 -42 -69 -30 146 60 -131 -44
4434 -44 125 -37 -299 -215 -146 102 68 72 38 340 150 203 209 -20 -143 -240 -55 84 -64 235 17 89 -148 7
4458 7 -142 -189 147 223 -103 -344 36 104 -121 -83 59 32 28 -63 23 91 -255 50 23 -268 76 -280 267 166
4482 166 -129 115 -55 103 -69 -83 -31 -74 -14 135 -264 -28 -262 22 127 153 203 63 78 149 -48 29 -48
4505 -48 -77 -89 -143 114 -65 44 -212 -159 30 -154 75 -27 268 -155 -131 34 237 -271 -100 9 239 -43
$$ packed form
4345B8L48m13k99L90R6l93R1L05N0m80K07N13m28n09P78J52n20n2L17J08m11R2
4367c0J52l07J07M6J83k03J13L6K59m81LL08j71j80j44O49k99j66j33K50q7q1
4389a76K33M47l77l39L78k33N3k7Q2J84o01O38k25J24k27K72j16l3r5J47P7l39
4411a53R8MJ35j02M67j43n49M62L0l37J95j26J88n5l28K83j11k7L9J76q6j91Q7
4434d4J69j62k62Q4O9K48l4Ml4L02j90N3Ok29j23r7J85J39j48K99k18P2k37J55
4458Gj49m7L36P6l26k41L80O8k25L8J42k7mr1Q6O8l46L05k7k91L44l56N47j01
4482A66k95K44j70J58j72j4N2m3O0J49l99K36k34K84J05K6N0j40J5P1j97P7p7
4505d8k9j2n4K57j79J09k56N3J89j84K29j02K95m23K4J65K03n08J71J09K30k82
$$ plain form
4527 -43 129 -162 -190 206 37 -5 -85 -57 257 153 -205 111 -54 179 -188 -26 165 -167 227 -94 89 69
4549 69 -193 304 -217 209 85 -29 278 -140 88 81 -259 -30 -112 65 115 -64 227 -261 94 104 118 83 -172
4572 -172 203 11 -158 -81 -82 319 68 -111 120 -118 -114 69 15 57 -377 258 15 -200 229 -140 30 36 27 33
4596 33 -159 315 -86 16 -102 -38 -60 -87 -341 203 -114 159 70 247 208 -187 337 -27 39 143 -46 172
4618 172 126 -39 219 -60 158 -28 112 40 -364 295 -98 -23 162 17 295 -11 -50 183 -61 236 -35
4639 -35 -8 -168 -330 184 -183 112 190 -32 257 -214 233 29 -196 169 161 205 246 90 80 -88 92 14 -87
4662 -87 -19 -146 180 -130 -221 92 -47 -112 -85 -60 247 -115 125 93 -112 138 -352 48 8 -53 127 -38 109
4685 109 -24 101 392 -155 91 4 -123 238 -223 58 17 -70 161 -86 228 -26 -28 132 -141 265 249 -4
$$ packed form
4527d3J72k91k8L96j69m2q0K8L14j04l58L16j65K33l67J62J91l32L94l21J83k0
4549F9k62M97n21M26j24j14L07m18K28pl40K29q2J77N0j79K91m88L55J0J4l5k55
4572a72L75j92j69P7jM01k51j79K31k38MJ83n4M2m34O35k43k15M29l69J70OrO
4596C3j92M74m01J02j18O4k2k7k54N44l17K73q9J77l9l95N24l64O6J04j89K18
4618A72m6j65K58k79K18j86J40p2m04O59l93P5J85j45K78l06l9K33k44K97k71
4639c5K7j60j62N14l67K95P8k22K89m71M47k04k25L65qM4M1j56j0j68J80p8j01
4662h7O8j27L26l10r1L13j39o5K7K5L07l62K40l2k05K50m90M00m0o1J80j65J47
4685A09j33J25K91n47K46q7j27L61m61K81m1q7K31k47L14k54kJ60k73M06j6k53
$$ plain form
4707 -4 -71 -88 92 -102 71 10 -76 -177 -54 268 -57 -425 82 198 -36 43 67 368 -554 -60 84 -104 148
4730 148 -210 -221 151 -112 221 -71 -109 300 112 -109 -181 316 15 -108 -99 -140 36 -1 -175 149 -21 72 56
4753 56 -27 -45 112 -193 179 -31 -24 -328 -14 32 60 195 -43 -14 -62 -113 174 292 -115 -64 -233 -133 -343 -97
4777 -97 33 2 -109 -118 -5 245 -47 62 -33 89 -163 -98 -17 4 -22 -30 212 -28 265 196 20 -81 158 -114
4801 -114 -20 -70 -74 -42 148 -173 141 -14 -317 -141 302 160 -29 215 80 324 -84 -84 -97 146 -86 309 87
4824 87 145 -127 234 -66 -180 12 113 -191 -347 -59 -25 -570 215 379 2 -91 -136 199 -120 10 -79 -95
4846 -95 -215 -41 171 -225 153 244 238 -118 158 -37 -24 -95 -297 -40 143 -278 43 340 -26 -123 -136 196 -6
4869 -6 26 136 57 -301 46 287 -12 -154 19 73 -178 -73 330 223 -160 122 16 94 -351 -9 190 17
$$ packed form
4707do7j7J80j94J73o1q6j01J23L22l25l68N07J16k34P9K4L01r22M94J44j88K52
4730A48l58j1L72k63L33k92l8M09j88k21p2M97l01j23Rm1J76l7j74L24j70R3j6
4753E6q3j8J57l05L72k10Pl04L14M6K8J35k38K9m8n1K87J18m07N1j69J00k10K46
4777i7J30l1j11rJ13K50k92J09r5J22k52O5Q1K1k6qK42k40K93o9j76j01K39k72
4801a14R4n0mL2J90l21L14j55l03J76M43j42j89K44j35K44m08%j3K43k32L95k22
4824H7N8k72L61l00j14J92J01l04j56K88L4n45P85J64l77r3m5L35l19J30q9j6
4846i5j20J74K12l96L78R1ol56K76j95J3p1k02K57J83m21L21K97l66r7j3L32k02
4869fL2J10p9l58L47K41k99j42J73N4k51J05M03j07l83K82j06P8m45L42J99j73
$$ plain form
4891 17 -169 179 182 -38 -343 156 -4 -53 -46 95 -91 -141 46 89 -203 -59 141 -50 -45 -142 -111 190 103 -39
4915 -39 78 -52 -212 333 6 -197 -140 182 188 -64 -150 76 103 -29 9 21 72 68 10 233 125 71 251 46
4939 46 13 176 100 -49 -61 -122 -87 -121 40 217 187 -141 339 210 -8 -75 -19 -193 35 207 -168 55 -114
4962 -114 116 162 261 32 -357 -59 24 -305 80 137 158 -159 41 128 -99 -87 251 -93 -8 -119 -193 83 -283
4985 -283 -36 70 -167 13 61 242 -218 -160 -17 -37 -110 -74 116 -2 -148 -101 240 -11 -173 -75 -104 -46 78
5008 78 -69 13 -40 -234 193 -158 22 143 -180 135 -192 -43 260 19 70 28 -123 208 -209 130 -69 -252
5030 -252 88 137 -171 -188 70 278 -271 133 186 132 364 35 96 110 -17 -86 -31 64 102 -236 253 -121 243
5053 243 47 39 -11 -17 179 -161 55 93 -48 67 -70 72 71 94 -14 -58 31 -68 -102 396 -452 -141 -178 -152 -66
$$ packed form
4891A7j86L48Lk20l05M99j60m9PJ41j86n0J87M3k92J44K00j91Nr7L1L01q7j42
4915c9J17j30j60N45l27k03N7L22Ok52q6K26K7j32L8J2N1mn8K23j08n4J80k05
4939D6l3J63p6j49j2o1L5l4J61J77l0l28M80j29k18o7N6j74K28J72l75K23j69
4962a14K30M6R9k29l89K98Q3l29L85N7K1l17K00Q7k27J2L38l44Q5j11p4K76l66
4985b83K47J06k37J80M8J81m60N8J43k0p3L6J90j18j46M7L41k51j62R8k9N8J24
5008G8j47Q2n3j94M27l51J80J21l23L15l27J49L03k41N1m2j51L31m17L39j99j83
5030b52L40M9l08j7K58K08n49M04N3n4K32l29O1J4j27o9N5R5L8l38M89l74L64
5053B43j96qn0oJ96l40K16L8j41J15j37J42jK3j08m4Q9r9l4M98q48L11l7K6Q6
$$ plain form
5078 -66 -232 30 104 -209 226 -229 27 -107 45 244 -138 17 -17 -79 -152 -7 132 65 -327 212 92 -51
5100 -51 32 -8 59 -380 139 -22 -41 198 -271 79 133 -207 154 -259 -372 -125 -60 130 -264 222 135 -326 211
5123 211 188 40 -279 16 181 -173 -80 -20 166 -200 -404 261 170 -67 -139 -118 113 -190 91 95 -73 -385 -40
5146 -40 29 -7 -238 152 -192 -31 274 -145 334 -434 -88 238 -265 51 -130 175 93 -284 111 -99 -174 170
5168 170 46 205 -263 -79 165 -151 79 -210 33 -178 39 362 -248 -294 201 249 37 -217 178 156 -270
5189 -270 91 -100 68 -25 112 324 -209 65 174 72 -68 -16 401 -223 -48 138 -155 85 -275 148 26
5210 26 -117 -203 268 15 -451 -148 193 -208 -121 -78 106 -32 193 167 244 -398 -32 19 142 -108 -233 290
5232 290 -9 -259 111 0 -201 61 192 301 -357 98 43 156 169 -50 -85 -155 -134 327 -139 -104 -77 230
$$ packed form
5078f6j66K62P4l13M35m55K56j34J52J99l82J55l4o2p3J45J39o7l92N39j20j43
5100e1Q3m0O7m39N19j61j9K39m69L50N4l40L61m13j13K47O5J90l94M86q7m61N37
5123B11k3j48l19K95J65l54R3O0J86l66k04O65r1k37p2K1K31l03K81Mj68l12L45
5146d0O9l6k31L90l44J61L05m19M79p68L46L26n03L16j81L05q2l77L95k10p5L44
5168A70j24J59m68J84K44l16K30k89K43k11K17L23o10m6M95M8k12k54L95k2m26
5189b70L61j91J68r3J37K12n33K74J09j02j40N2M17o24J75J86k93K40l60M23j22
5210B6j43q6M71k53m66L03L41m01Q7M3J84j38K25k6P7o42L66N1J23k50j25N23
5232B90k99k50L70j11k01K62J31J09o58M55n5J13J3k19l5p0K1M61m66L5K7L07
$$ plain form
5254 230 89 65 -18 3 -12 183 155 -66 -170 71 -95 61 -146 15 49 -12 -365 24 42 -279 -153 -51 -8
5277 -8 -42 -62 52 -186 -98 0 -42 -13 -176 61 -36 -268 -94 -117 150 -269 -320 164 167 -85 213 48 -5 -142 -97
5302 -97 47 -25 52 -50 63 149 -31 -83 242 -255 -92 16 -71 87 -33 -146 -119 -106 -57 70 -216 -158 215
5325 215 159 0 -153 -19 -115 46 -68 -101 397 -10 -23 252 30 -154 21 123 116 -40 275 107 -63 -245
5347 -245 -61 -83 -242 -105 129 102 -23 -70 113 -230 -53 279 -137 -361 -62 88 42 -194 -123 -87 -113 -78 50
5370 50 -137 -231 -20 288 -244 -185 -6 31 -109 75 84 -70 -41 -18 131 -131 -207 -4 143 -79 -216 148 240
5393 240 80 -88 296 11 -13 -58 215 -188 -227 -78 139 -190 131 180 -78 117 42 -29 119 -74 127 -71
5415 -71 -312 -118 262 139 -264 183 -6 13 223 -293 251 -99 -96 255 111 126 114 363 171 -279 -106 92
$$ packed form
5254B30j41k4q3K1j5J95k8k21j04K41j66J56k07J61L4o1l53L89J8l21J26J02M3
5277hl4k0J14k38Q8R8m2K9j63K37r7k32J74k3K67m19n1M84Lk52K98j65n3j37M5
5302i7J44p2P7j02J13Q6j80n2L25m97J63J08q7J58j20j13K7J3M9J27k86N8L73
5325B15n6j59j53J34r6J61j14l3M98m07j3K75k22j84J75J02pj56L15j68j70j82
5347b45J84k2j59J37K34k7j25m7J83l43J77L32m16k24K99J50m6k36P1L6k6L5J28
5370E0j87r4K11L08n32N9J79L7j40J84Rj54K9K3J49k62p6K03J47k22j37L64R2
5393B40j60j68L84k85k4m5K73m03l9J49K17l29L21M9k58J95p5p1J48j93K01j98
5415g1k41J94L80j23m03M47j89J9K10n16N44l50LL51j44J5j2K49j92m50J73J98
$$ plain form
5437 92 -120 -131 110 92 -329 79 196 -291 -81 -168 14 101 -196 -42 153 -84 193 270 212 -87 -19 378 230
5460 230 -117 102 115 -177 -136 261 156 -163 -186 166 -6 -213 19 140 -76 38 -272 99 185 278 6 -86
5482 -86 -101 -86 21 -200 -145 7 118 188 -15 -215 109 -201 -420 131 234 -184 148 175 82 -89 103 -97
5504 -97 -398 -216 -149 100 -116 -113 138 -46 -88 86 137 -119 -186 -200 97 -95 33 9 49 11 106 301 -94 26
5528 26 310 -17 126 -179 308 -40 -53 127 -134 -10 -163 16 236 -299 -243 55 -33 -135 -371 266 -202
5549 -202 -89 160 98 -68 -141 87 -139 -255 0 -30 130 -32 -220 199 48 -226 99 137 -266 -13 -7 199
5571 199 -319 -101 -91 -14 -48 -52 280 1 -317 -349 185 -42 140 253 -17 -278 173 103 231 -206 -243 220 -101
5594 -101 -151 155 113 17 -86 11 -170 -116 40 113 54 -269 -119 130 -237 -11 -76 12 -72 -122 -38 -51 119 69 134
$$ packed form
5437I2k12j1K41j8m21M08J17m87K10q7J82Q7k97J54J95k37K77P7n8k99O8L97j48
5460B30l47K19J3k92M1L97j05l19k3L52j72k07K32J21k16J14l10L71Q6R3k72r2
5482h6j5J5J07k21N5J52J11P0k03k00L24l10k19N51J03m18L32K7r3j71J92k00
5504i7l01J82O7K49k16LK51j84m2J74N1k56o7j4K97j92J28k4M0l8R5J95l95J20
5528B6K84l27J43l05M87l48j3J80k61J24j53J79K20n35N6K98q8j02k36O37m68
5549b02J13K49o2j66p3K28k26j16K55l0J60j62j88M19j51k74L25L8m03K53OK06
5571A99n18K18J0P7l4mL32k79l18l2N34k27J82J13k70k61M51p0J28m37l7M63l21
5594a01n0L06m2r6j03R7j81N4J56P3n9l23J50K49l67K26o5Q8q4n0Q4j3J70n0O5
$$ plain form
5619 134 38 -36 -118 146 -114 14 -30 210 53 -217 327 27 -47 120 -316 152 5 -19 243 -27 33 -4 60
5642 60 -164 -380 249 85 110 -11 61 34 -228 -143 175 -17 244 -10 261 6 -201 12 -165 220 127 221
5664 221 6 -310 162 129 -172 -108 -98 222 69 -86 401 -324 125 83 -125 54 -142 6 -138 -173 -210 304
5686 304 238 -322 296 210 -169 -93 135 -271 -81 -341 70 103 -90 191 92 143 28 60 127 -360 27 -100 65
5709 65 148 -231 257 -104 -170 -73 82 -11 -246 53 428 -128 130 258 -43 -93 -127 402 -160 -119 66 9 -96
5732 -96 -384 115 174 -284 -238 213 -14 -104 67 330 -59 -350 -152 12 143 -115 95 423 -137 128 190 14
5754 14 -287 3 565 96 37 -58 19 -80 -189 213 138 -30 73 -177 193 -303 -113 136 24 -191 -26 96
5776 96 -87 -63 157 71 -274 217 314 36 -91 -11 -167 -344 -69 234 -160 -137 1 404 -157 6 229 47
$$ packed form
5619A34r6p4q2K64k60J28m4K40j57k70N44l00p4J67m36M68j47k4K62k70O0l7O4
5642F0k24k16O29j64K5j21P2k7k62Q5L18j92K61k54K71k55k07K13j77L85r3R4
5664B21k15l16M72l3l01O4J0L20j53j55M87p25M49m2k08J79j96J48j44l5l7N14
5686C04o6n60O18q6l79P6K28m06J90k60M11L3j93K81r9N1j15L2O7m87L87j27J65
5709F5Q3l79M88l61o6R7J55r3k35K99L75n56K58J28l01n0l4N29n62M1J85n7j05
5732i6k88M99N9m58M6M51k27r0J71K63l89k91J98J64J31k58K10L28n60K65O2j76
5754A4l01K90N62m69n9r5P7r9j09M02p5j68J03k50L70m96J90K49j12k15J65J22
5776I6j83K4K20q6l45M91R7k78j27Q0j56j77K75L03l94K3J38M03n61J63K23j82
$$ plain form
5798 47 -1 -257 205 386 -298 370 41 12 -247 9 347 -113 -146 136 190 -405 -2 142 62 -161 -9 71
5820 71 -58 -330 -128 148 -38 79 171 129 -117 -123 -97 -108 -200 27 65 -189 262 -21 -102 -287 -158 -60 -16 -39
5844 -39 -328 186 -145 -20 19 13 -145 -51 244 -89 -150 -154 208 72 -161 337 -19 -17 -168 246 200 -296 47 -11
5868 -11 98 -250 -214 -122 -119 57 104 177 -40 -150 232 -157 -143 -70 -51 236 -189 22 161 -410 106 50 -61 -72
5892 -72 -251 78 86 -4 -49 -104 -181 -159 6 -13 -200 -172 -128 -78 10 275 82 98 -86 -86 -121 -71 -255 205 -76 6
5918 6 8 -78 89 -96 -97 24 -33 17 5 -185 30 -70 -99 -71 -287 -142 133 6 -105 -176 271 155 -100 -125 348
5943 348 -89 27 33 -73 -302 -97 175 150 -76 137 319 65 -111 -247 -30 145 52 153 -147 232 104
5964 104 105 186 104 -82 -123 -141 -124 173 55 -132 -311 22 -142 98 -117 -39 54 2 -4 114 27 -112 -73 108 -154
$$ packed form
5798D7m8k56M62J81o84O68l29k9k59K56L38m60l3K82N4n95M03J44q0k23J52Q0
5820G1j29k72K02K76j86J17R2m2k46oK6j1r2K27L8k54M51k83q1j85J29R8M4k3
5844c9k89N14l31J25L9oj58R4K95l33o1mL62j36k33M98l56Kj51M14m6m96L43n8
5868a1J09l48L6R2LJ76M7P3k17j10L82l89J4P3J9K87m25K11J39n71N16n6j11j1
5892g2j79L29Qr0m5n5p7K2J65j9j87K8M4N0Q8K65j93J6j84%l5N0j84M60k81Q2
5918FKq6J67j85jJ21n7N0j2j90K15j00k9K8k16J45K75j27j11p1M47j16k55k5M73
5943C48m37J16Oj06k29K05K72k5k26K13J82k54j76j36K17J75r3J01l00L79j28
5964A04JQ1q2j86m1j8J7K97j18j87j79L33j64K40k15P8R3n2oJ18q7j39L9J81k62
$$ plain form
5989 -154 -36 58 -224 -117 211 -45 -42 -28 -53 -25 65 57 308 159 -277 -25 4 -4 144 -105 141 16 -3 63 -96
6014 -96 -92 -91 120 109 -184 211 106 -222 183 9 257 33 -135 192 34 -191 -182 189 15 -264 -107 55 54
6037 54 -115 49 339 -172 -7 217 -304 -55 137 369 57 -192 171 40 -182 -128 53 119 -145 39 388
6058 388 -59 -55 271 -65 -227 16 -35 407 -40 -58 149 -106 -330 -39 323 -335 -151 -28 42 -185 -111 203
6080 203 -211 -149 286 47 121 -165 96 104 -27 -70 207 83 71 -242 54 75 -89 280 -142 -15 -276 -62
6102 -62 -285 -171 -108 78 324 27 -55 -13 -93 -1 -79 6 23 -242 68 64 -88 86 91 224 -77 6 -16 -201 -166
6127 -166 109 239 -119 -281 98 200 -225 -41 -310 63 -72 6 127 -111 -70 -61 -144 276 -109 91 -49 -281
6149 -281 -24 -29 -159 -282 -92 6 24 -39 95 -54 -44 -46 145 62 76 182 -30 144 -124 -123 209 -332 -12 163
$$ packed form
5989a54J18R4k82J07L28k56LJ4k5K8R0qK51j49m36K52K9qJ48k49K46j25j9O6j59
6014i6MJK11j1k93L95j05l28M05j74K48k24j68L27j58k25RL71j74k79J57J62j
6037E4j69J64K90n11J65K24n21K49J92K32l12k49L63j31k22N4J81O6k64J84L49
6058C88m47ML26l36j62K43n1M42m47j8K07k55k24K91L62o58J84J23P0k27P4L14
6080B03m14O2M35k39P4k86K61Qj31m3K77j24j2l13K96K1j64L69m22J27k61K14
6102f2k23J14O3J86K46k97q2M2q0R2p8Q5J7k65L10mj52J74NJ33l01Q3k2j85L5
6127a66K75J30l58j62L79J02m25J84k69L73j35P8J21k38M1Rq3M20l85K00j40k32
6149b81K57nj30j23J90R8J8o3J34j49J0kJ91q3J4J06k12J74k68JL32n41L20J75
$$ plain form
6173 163 -55 -132 -18 -34 72 242 37 -187 -124 -2 50 149 149 -14 49 217 -33 -15 38 40 110 -55 -19 31 -55
6198 -55 -50 31 -98 329 311 -74 140 -284 13 -93 -87 137 -122 -155 -262 -2 91 -5 95 212 342 -78 138
6221 138 80 -54 -121 3 -93 123 -206 59 -15 -36 -17 -215 -6 -18 32 -2 -19 -86 31 216 278 -408 -270 135
6245 135 -118 39 -11 51 -76 -44 -115 148 14 34 -38 -31 -186 66 151 182 -41 130 74 -49 -180 -53 -173 -205
6269 -205 -181 288 152 -260 34 -19 21 -163 -10 -28 -122 57 202 126 -34 39 -54 -19 -141 -14 -330 -192 -99
6292 -99 -55 90 -253 -78 15 112 119 -156 -97 186 -94 91 -64 -92 -112 -104 129 -202 0 174 -78 89 -186 -38
6316 -38 -10 -172 -49 -29 -63 94 78 100 -306 -105 26 271 -11 -179 -4 -236 -130 38 -274 -302 219 -253
6338 -253 160 -4 172 0 127 -195 30 15 68 62 134 145 -178 161 2 110 -33 -7 155 -30 -82 57 45
$$ packed form
6173A63k18p7J14j6J06J70k05k24O3J22N2R9%j63O3J68k50J8N3KP0j65L6N0q6
6198e5NQ1j29M27j8l85K14m24K97j06OK24k59l3j07K60R3r6J00J17J30m20K16
6221A38n8j34o7J24r6K16l29K65p4k1J9j98K09j2N0l4j7o7J17J85O2o86J38M05
6245A35k53J57n0O2j27L2p1K63j34K0p2Pj55K52Q5L1k23J71n6j23j31J27j20l2
6269b05K4M69j36m12K94n3M0j84J53j8r4J79J45p6j60P3r3L5j22J27l16J38R3
6292i9M4J45l43J75R3R7Pk75N9K83k80J85j55k8k0QK33l31K02J74k52J67k75J48
6316c8K8j62J23K0l4J57j6K2m06K01J31K45k82j68J75k32J06J68l12k8N21m72
6338b53M13j64J76j72J27l22K25j5N3oP2J1l23L39j59J08j43K6J62j85n2J39j2
$$ plain form
6361 45 -285 -43 166 -95 119 -204 31 -15 -105 33 245 193 41 -12 226 -52 -128 171 -74 -49 -23 -355 -125
6384 -125 24 43 102 -184 234 189 171 59 61 -11 -142 11 -143 -47 159 68 16 18 -50 -192 124 319 -13 17 22
6409 22 -55 -254 15 -54 -80 109 184 0 -201 -32 87 -178 156 -48 -148 335 -76 -310 -21 -352 230 392
6431 392 86 185 -80 110 -111 -130 104 118 -220 40 17 -290 -60 24 183 164 105 -50 -24 125 -101 -79 -45
6454 -45 -119 202 -71 50 -119 -28 68 -82 -67 -326 28 146 -69 156 19 -19 73 -149 200 -178 -194 -188 21
6477 21 -198 -49 218 299 78 152 55 127 60 -93 18 36 -286 -232 -140 -237 -32 -29 -186 -206 -15 -35 -31 -43 -85 -186
6503 -186 -247 317 -254 20 58 43 215 -120 113 -76 309 46 -73 -401 -13 105 81 -113 44 24 13 -5
6525 -5 11 26 -34 28 -229 125 -43 167 107 -96 -66 -21 -28 -214 -84 -29 -55 222 -29 47 84 -136 7 42 7 -234
$$ packed form
6361D5l30K42K09k61K14l23K35m6r0J38K12n2j52n3K38k78p6K99k45K5K6l32K30
6384a25J49J9N9k86M18m5j8j12Kp2j31J53j54R6K06r1n2Ko8j42L16J95l32L0N
6409B2p7j99K69o9k6J89P5j84k01J69J19k65L34k04j00M83m11k34K89l31N82J62
6431C92l06R9k65J90k21j9K34J4l38K60k3l07K30Q4J59j9n9j55K6J49k26K2L4
6454d5p4L21k73J21j69R1R6j50J5k59L54J18k15K25j37l8R2k22L49l78j6OK09
6477B1k19J49K67Q1k21P4r7P2o7j53J11J8l22N4R2r7K05Lj57k0J91k0Mj2m2j01
6503a86o1N64n71K74L8j5J72l35K33j89L85k63j19l28L88J18k4j94J57k0j1j8
6525eJ6J5o0O2k57L54j68K10o0k03L0M5pj86J30N5k6K77k51P6L7k20J43L5l5k41
$$ plain form
6551 -234 -23 -102 -132 191 -124 -122 94 -155 -5 29 212 210 71 342 41 -54 87 -53 91 -128 316 185 50
6574 50 47 21 -256 217 -62 -15 193 -298 -28 136 -135 -227 118 197 8 373 7 -148 -64 63 154 68 -240
6597 -240 83 42 -71 -86 133 -4 -44 92 99 -25 -63 23 -46 -318 107 62 -82 -48 159 316 -11 71 -38 81
6621 81 -124 -133 -32 -196 -56 214 -173 -218 -34 -41 54 -142 -30 235 -114 -118 234 361 -217 -432 167 67 -162
6644 -162 47 -107 188 176 -250 41 95 -121 -89 17 -24 -467 260 -231 -158 -242 -40 13 -64 -18 103 34 -2 32
6668 32 347 -57 -129 -28 -233 113 184 145 -41 -113 62 55 -256 -38 191 313 190 -73 187 -115 -151 150 68
6691 68 297 -121 -9 106 -80 -43 288 43 -125 -307 165 -16 -66 -22 147 150 -401 208 81 -121 145 36
6713 36 18 -229 -55 104 114 -95 -46 83 89 -19 8 -37 -396 45 94 138 -135 42 254 -53 -150 13 -471 -67
$$ packed form
6551b34K11p9l0L23l15KK16k49J50L4J83kj39K71l01r5J41j40J44k19M44j31j35
6574E0lk6k77M73k79M7K08m91K70J64k71r2L45P9j89L65l66j55Q4J27R1q6l08
6597b40L23m1j13j5K19j37m0J36Pj24l8Q6o9k72M25m5j44L4K07J57l27Q2j09J19
6621H1k05rJ01j64J40K70l87m5J84pR5j96J12K65l49mL52J27n78k15N99j00k29
6644a62K09j54K95j2m26K91N4k16L2J06m1m43P27m91P3q4K02N3p7M6J21o9l6L4
6668C2L15m04p2J01k05L46P1l9j86p2J75pl11K18K29J22j23k63K60l02l6L01q2
6691F8K29m18J12J15j86L7L31k45j68j82M72j81n0M4J69Ln51O09j27k02K66j09
6713C6j8k47J74J59J0k09M9J29Oj08K7m5l59M41M9M4k73J77K12l07r7J63m84M04
$$ plain form
6737 -67 -201 -112 34 -243 -143 -166 3 175 3 -37 0 149 85 -116 -83 -50 -196 205 15 100 14 59 55 365
6761 365 73 -126 -1 315 160 -239 -31 58 266 -299 25 184 18 111 433 -37 3 -175 8 -7 35 -307
6783 -307 118 127 -293 -97 -39 -72 201 -41 35 11 -333 -79 196 -44 -184 243 -124 141 -36 -224 86 -175
6805 -175 -139 251 -34 -246 -97 48 193 -211 66 -42 -254 129 73 -15 -222 117 138 -181 108 2 -214
6826 -214 -17 20 -53 122 40 155 -103 -396 -102 64 157 1 81 -141 -193 -101 -50 67 239 230 -258 200 178 -274
6850 -274 179 -42 70 6 99 253 -124 -318 227 146 -67 -153 122 236 -113 -86 100 -235 297 -56 143 56
6872 56 144 113 65 -114 -111 160 261 -263 -200 81 42 -260 36 119 -140 -123 193 -186 -140 -31 34 54 -103 98
6896 98 70 19 -122 -91 -27 -218 152 226 -174 128 -306 -156 174 -311 -195 141 -67 225 19 220 -230 -62
$$ packed form
6737f7j34Q9J46k77J00k3J69J72j72m0L7J49o4k01L3L3j46M01j90Q5q6M5mL10
6761C65k92j99J25L16j55l99K08Q9K08n65L24J59j66R3L22m70M0j78J83j5M2l42
6783c07M25Rm20J96N8l3K73k42P6k4l44K54K75k40j40M27l67K65j77j88L10k61
6805a75L6L90k85k12J49J45J45m04K77j08k12L83n6q8k07L39K1l19K89j06k16
6826b14J97L7p3J75q2J15k58k93K94J66R3j56Q0k22n2R2N1J17J72rm88M58k2m52
6850b74M53k21J12o4R3J54l77j94N45q1k13q6K75J14l49K7J86l35N32l53J99q7
6872E6Q8l1m8j79LK71J01n24O3K81l9l02K96Q3k59J7L16l79M6J09O5K0j57K01
6896I8k8n1j41L1O4j91L70P4m00L02m34J50L30m85J16L36k08K92k06K01m50J68
$$ plain form
6918 -62 -80 -229 72 -28 -114 -32 -214 84 208 -137 -155 159 124 48 -180 47 129 -282 61 191 -317 -31 -14
6941 -14 -245 245 2 129 -118 -134 -349 149 163 113 93 246 12 61 -39 -184 -147 -61 -146 -227 -215 67 -157 -175
6965 -175 -63 6 -9 4 -81 211 -125 59 -40 61 -21 68 9 64 -39 -97 137 43 -188 36 -41 10 -32 22 -5
6990 -5 -43 -60 2 80 7 91 -58 23 -102 -151 -62 28 -124 78 -142 -88 1 -269 -198 157 -275 -204 69 -37 262
7015 262 86 48 264 33 186 -152 -157 74 -305 -53 -169 -93 59 117 161 139 -14 -34 -118 264 153 -308 221
7038 221 290 -87 -120 40 -76 -26 235 -133 25 91 -226 -147 133 -33 -57 118 102 -157 -91 135 200 -141 138
7061 138 22 84 -9 -220 -156 190 -138 194 107 187 -97 328 -63 39 -145 -25 198 71 96 25 243 -47
7083 -47 -35 -391 -121 -105 127 -43 -55 51 -125 -113 108 -89 94 -171 -43 -65 -13 -21 67 102 47 107 -156 -346
$$ packed form
6918f2j8j49L01j00q6Q2j82K98J24l45j8L14l5p6k28K27Q2m11L43J30n08K86J7
6941a4k31M90k43J27k47j6k15M98J4n0k0J53k34M9j00j45L7Q6q5q1J2K82k24j8
6965a75J12O9j5J3q5K92l36J84r9J01q2Q9n9N5j03n8K34r4k31K24p7N1m2N4k7
6990el8j7O2P8p3Q4j49Q1j25m9Q9R0j52K02k20N4Q9k70P1L55m32P1K73j06K99
7015B62j76l8K16k31J53l38nK31l79K52j16P6J52N8M4k2j53k0q4L82j11m61N29
7038B21O9l77l3J60j16N0K61l68J58O6l17P9K80j66k4J75j6k59O6K26O5l41K79
7061A38j16O2r3k11O4L46l28L32q7Q0k84M25l91J02j84J20K23j27K5p1K18k90
7083d7J2l56K70J6K32j70j2J06j76J2K21j97J83k65J28k2N2qQ8L5n5O0k63j90
$$ plain form
7107 -346 -54 79 174 -354 208 89 94 167 -73 -66 -26 248 68 199 -38 115 92 165 -427 -92 86 -173 -32
7130 -32 -3 137 -204 50 175 -230 83 -112 -156 48 -157 131 -206 -6 100 113 -153 -293 -92 -291 -212 -96
7152 -96 175 -92 -148 -13 91 -86 -200 -67 41 70 66 -162 -104 123 190 -105 12 -95 -16 356 140 178 -128
7175 -128 -230 7 -227 76 114 -114 -329 3 246 -40 -12 -19 -67 61 6 -117 -261 -250 140 -13 175 -50
7197 -50 -143 256 148 -61 99 -365 27 -85 142 26 -15 69 -155 -80 131 35 -41 74 -51 56 85 -152 36
7220 36 87 -17 -155 46 -50 -222 323 306 -248 -88 239 -185 -109 12 222 67 95 -89 -16 -170 -133 88 194
7243 194 46 -217 58 14 -329 8 131 51 56 146 159 -168 -33 -48 1 68 -54 327 154 -118 -197 202 126 -159
7267 -159 38 -20 -134 -225 64 -19 22 -121 37 432 -248 42 166 -85 143 -38 -40 -30 78 230 -122 134
$$ packed form
7107c46K92J33R5n28N62j19NP3k40PM0K74j80J31k37J53k3P3n92L35J78k59J41
7130c2K9J40l41K54J25m05L13j95m4K04k05K88l37K00J06J3k66j40K01j99P9J16
7152i6K71k67n6J35J04j77j14J33J08K9mk28N8K27O7k95J17j07P9L72k16L8l06
7175a28j02K37k34L03L8k28k15L32K43k86K8pm8J28n5j23j44J1L90j53J88k25
7197e0r3L99j08k09J60m64L92j12K27j16m1Q4k24P5K11r6p6J15j25J07K9k37J88
7220C6N1j04j38K01r6j72N45j7n54J60L27m24P6J21K10j55K8j84P3j54L7K21J06
7243A94j48k63K75m4l43L37J23q0NR0J3l27J35j5M9O7j22L81j73k72p9L99p6k85
7267a59J97n8j14r1K89q3M1j43J58L95o80K90J24k51K28j81kJ0J08J52l52K56
$$ plain form
7289 134 173 200 168 -69 -155 -88 -80 -62 39 83 24 367 121 -70 14 -58 -113 166 -224 144 72 -184 11 2 -158
7314 -158 156 183 -118 138 -134 -75 -98 62 296 103 122 3 -42 -34 50 22 54 61 178 -55 -53 252 165 -1 -391
7339 -391 20 -62 204 121 -133 -370 48 -3 20 56 26 217 -121 -167 -64 5 86 100 -79 262 -265 216 -27
7362 -27 197 60 145 69 -35 108 259 -99 16 -36 205 203 -15 -16 16 -12 -614 -243 129 58 -28 -62 9 -241 101
7387 101 464 -179 -37 -144 141 -23 107 -248 80 88 48 -204 -21 125 -24 -120 -44 -126 -68 2 239 -129 35
7410 35 -40 145 -141 99 -261 -166 -168 393 -323 88 -35 -116 109 -176 -101 -47 -69 2 34 -129 57 -17 71 21 -106
7435 -106 -78 -20 -179 81 -17 -212 20 383 185 -186 96 -166 168 -189 -305 -16 23 -259 55 64 74 -54
7457 -54 -9 68 -131 -147 -117 -155 50 -304 286 132 -116 -84 -11 121 22 170 2 29 -217 217 181 -295 -175 -40
$$ packed form
7289A34L9K7l2k37q6O7QJ8J01M4n9L43k46j91Q4p2n5K79l90L68p2k56J95rj60
7314a58L14K7l01K56k72N9k3J60K34j93J9j19m5QQ4k8L2PJ17k33KL05q7j66l90
7339c91M11q2K66q3k54k37M18n1K3L6l0J91l38m6J03O9Q1J4j79L41n27M81k43
7362b7K24j37Q5p6j04J43J51l58J15n2K41kk18jL2k8o02L71L72p1q6l4P1k50L42
7387A01L63o43J42j07K85j64J30l55L28Qm0k52J83J46j49r6P6q2N8P0K37l68J64
7410C5p5J85k86K40l60R5kN61p16M11j23q1K25k85P5N4k2P1L2j63J86p4Q8n0j27
7435a06K8N8j59K60r8j95K32L63j98l71K82k62L34l57j16K89L9k82L14RJ0j28
7457e4M5P7j99j6L0l8K05l54N90j54k48L2P3J32r9J48j68K7k46M34l6m76J20J35
$$ plain form
7481 -40 118 -354 -161 102 78 189 47 -197 -99 -90 -14 160 -79 -174 198 -66 -29 136 -44 -195 -221 11 60
7504 60 -160 231 48 16 32 192 109 2 21 40 85 -98 -28 -60 14 -39 44 151 -31 62 37 83 -60 71 153
7529 153 103 29 -126 -176 -233 -5 97 -426 -259 -128 -10 173 -71 -25 -69 42 206 111 54 -15 148 168 219 162
7553 162 -113 30 -150 44 -145 -25 46 99 -170 -53 92 82 88 -199 158 175 -34 -98 -364 93 47 -122 -215
7576 -215 -119 -86 -202 10 113 -37 94 109 48 229 -76 -242 64 189 -171 138 124 189 -180 174 162 -202
7598 -202 67 9 -32 -85 62 -109 316 71 -38 136 -139 -126 -53 203 -69 121 207 162 -23 -17 -90 1 -71 -114
7622 -114 -189 -250 -51 -97 46 40 16 -153 -114 153 -46 229 108 -128 -82 -4 -20 -99 -149 39 -214 -48 2 -130
7646 -130 103 42 35 -164 -48 34 -371 -50 -165 4 -240 -54 172 75 140 260 154 -43 31 -243 100 132 228
$$ packed form
7481d0J58m72J93K63k4J11j42k44R8RP6J74k39r5L72k64L7J65j80j51k6K32M9
7504F0k20L91j83l2J6J60q3j07J9J9M5j83P0l2P4n3Q3J07j82R3k5M6j43J31Q2
7529A53n0p4j55n0n7K28J02n23J67J31J18J83k44M6m4J11J64r5n7o9J63K0N1n7
7553A62k75J43j80J94j89J20P1N3k69J17J45j0Ok87L57J7k09o4k66M57m6j69r3
7576b15R6L3j16K12J03j50J31J5o1J81l05j66L06J25l60L09j4O5l69L54j2l64
7598b02K69n8m1n3J47j71M25k45j09J74k75J3P3K56k72J90Q6m5j85Op3R1p2m3
7622a14p5o1J99m6J43ok4j69L9K67j99K75j21k36M6P8j6p9n0J88k53J66N0j32
7646a30K33o1pj99J16Q2m05L21j15J69k44J86K26r7O5J20j06j97P4k74L43L2R6
$$ plain form
7669 228 112 122 -198 28 -7 75 -15 -67 -336 21 133 -7 106 189 142 78 -47 -145 26 -37 28 169 11 -92
7693 -92 -26 -268 -4 -44 -215 -53 -177 7 219 -213 117 -6 -194 -4 66 152 -13 -22 -82 32 89 114 120 -5
7717 -5 -307 0 -72 129 19 -86 37 -114 -228 -49 216 -2 -16 8 34 -171 95 -27 -7 6 -42 -45 -269 244
7741 244 54 -15 125 131 191 -227 8 171 -79 -2 218 41 -106 40 -138 34 -112 58 239 39 -20 36
7763 36 -178 116 -35 111 -31 -55 -51 88 -29 226 -48 11 175 -85 128 32 -145 -123 150 -93 208 142 42
7786 42 -101 76 106 52 28 -175 -150 182 170 30 -52 -58 139 122 -19 62 -369 170 -119 -311 -262 -146 46 9
7810 9 -130 18 -71 -151 149 77 -142 -144 -62 30 9 142 144 105 -41 -383 -31 281 -36 -129 -103 -163 -21 31 132 -162
7836 -162 286 57 32 85 88 -407 -36 -234 159 -90 173 135 82 58 -350 -43 6 -151 -139 37 -30 -43 -3 -256
$$ packed form
7669B28j16J0l20K26l5Q2r0n2k69L57J12j40J13Q3m7o4j25r8J71o3O5J41j58j03
7693i2O6k42K64m0j71J62j24J84K12m32L30j23j88J90P0Q6j65ro0J14N7K5Oj25
7717el02L07p2K01j10j05J23j51j14J79K65k18j4K4K6k05K66j22K0J3m8lk24N13
7741B44j90o9J40OO0m18K35J63k50P7K20j77j47J46j78J72j46J70J81k00n9N6
7763C6k14K94j51J46j42k4MJ39j17K55k74N9J64k60K13r6j77K2K73k43L01o6j00
7786D2j43J77L0n4k4k03K5L32j2j40q2oJ97j7j41Q1m31N39k89j92M9J16J92l7
7810Ij39J48q9q0L00p2k19kQ2R2k1J33Kl9j46l42L52L12l17r3K6o0J42N2J01k94
7836a62M48k29k5N3Lm95L71j98L93k49K63l8n3k4m08L07M9j57J2J76o7j3M0k53
$$ plain form
7860 -256 -36 -47 54 -256 -2 -37 -49 71 -211 233 136 34 -140 94 -183 -223 88 62 -64 -198 -32 16
7882 16 163 -146 -91 -53 237 25 87 -65 -169 87 172 -91 59 -41 4 194 -69 -418 157 94 -93 -19 180
7905 180 79 -67 204 192 98 99 43 347 5 -27 -78 -75 -52 208 137 -101 40 -96 -46 -30 -67 95 126 135 153 30
7931 30 -222 -137 230 -98 -63 22 -195 -143 -90 -49 -313 3 -87 22 4 31 88 -154 374 125 -136 40 -14 -43
7955 -43 -168 -329 196 130 -98 50 -5 7 -194 -182 67 -126 -123 -2 109 -243 28 118 -33 -121 -204 306 38
7978 38 57 291 93 82 -132 -23 141 -48 206 -206 -12 -304 -39 -209 -134 -359 137 112 -27 -55 -79 187
8000 187 29 220 -316 -162 -228 152 -113 -169 18 139 -306 -2 -5 -184 15 -35 -77 33 -150 2 -197 -104
8022 -104 94 253 137 52 10 -34 -170 83 -23 -55 107 154 -46 -1 -213 0 87 -120 367 138 -83 -37 -138
$$ packed form
7860b56K20j1J01l10K54l5j2J20k82M44r7j02j74K34k77m0L11k6j26j34J66M8
7882A6J47l09N5L8K90k12O2j52j04K56Q5k63J50j00M5J90k63l49N75o3j87P4J99
7905A80j01j46K71j2r4Jn6L04l42l2n1LK3K60p1k38J41j36N0J6l7J62L1RJ8j23
7931C0k52Q5L67l28L5Q5k17N2N3M1k64L16r0J09j8K7N7k42N28k49k61J76n4k9
7955d3j25j61N25o6k28J48n5J2k01J2K49j93LJ21J11l52K71R0j51q8q3N10k68
7978C8J9K34j98j1k14J09J64j89K54m12J94k92K65j70P5k25M96k5j39k8k4K66
8000A87j58J91n36J54o6L80k65n6J87J21m45L04lj79J99n0m2J10j83J52j99R3
8022a04J98J59j16q5m2m4j36K53j06l2J62M7k00M5k12K13Q7k07M87k29k21M6j01
$$ plain form
8045 -138 12 -26 216 -1 258 114 39 90 -30 157 193 -25 -73 73 -104 -123 135 324 54 0 22 -9 45
8068 45 73 -67 17 93 -98 81 -119 66 100 -56 -199 207 -235 185 -142 265 70 -30 -90 66 64 -7 -63
8091 -63 143 1 30 205 117 97 -122 225 92 -238 64 120 -105 191 116 181 -144 70 135 -138 -156 -34 49
8114 49 -278 8 -70 115 187 9 -151 -69 -221 -72 -137 -280 -89 -199 -55 -17 29 -89 -301 -186 20 254
8136 254 -105 174 -1 -10 -47 45 -24 -207 -171 139 -6 19 -70 -118 -179 4 5 237 -60 -32 -81 -44 -126 -220 -249 43
8162 43 1 -30 -4 -210 120 13 129 14 -48 -194 -60 81 -85 37 392 -224 -50 104 -91 -187 5 -52
8184 -52 -103 203 -46 -141 137 -96 139
$$ packed form
8045a38J50l8K42k17K59j44p5N1j20J87L6k18m8J46j77j9K58J89k70n4K2l1N4
8068D5K8j40Q4P6j91J79k00J85L4j56j43M06m42M20l27M07j95j00o0J56kp1n6
8091f3K06j42K9J75q8k0k19L47j33l30L02N6k25K96p5O5l25K14O5k73j8J22Q3
8114D9l27K86p8J85P2j78j60Q2j52J49o5j43J91j10J44L8M6j18k12J15K06K34
8136B54l59K79j75rl7R2o9j83L6L10j45K5q9m8o1J83JK32k97K8m9L7q2r4k9K92
8162D3m2l1K6k06L30j07J16j15o2j46J34J41j66J22L55o16J74J54j95r6J92n7
8184e2n1L06k49r5K78k33K35
8191A39
$$ Imaginary data points
##PAGE= N=2
##DATA TABLE= (X++(I..I)), XYDATA
$$ plain form
0 0 0 0 0 0 0 0 1 0 1 0 8 -8 8 -16 16 -24 24 -32 40 -48 56 -64 78 -88 104 -118 138 -161 183 -208 236 -268
32 -268 304 -341 387 -429 483 -539 600 -667 739 -820 904 -1000 1104 -1217 1340 -1476 1624
49 1624 -1789 1970 -2171 2394 -2647 2930 -3253 3622 -4057 4571 -5185 5942 -6887 8120 -9779
64 -9779 12138 -15729 21767 -33681 65374 -308384 -750582 210524 -215994 -541525 -111655
75 -111655 169644 180966 89553 276035 368162 222027 -15650 -131700 4927 -242532 -396437
86 -396437 -243881 25860 -37178 -230523 456185 389824 -201874 400741 334751 -272961 -129569
97 -129569 -34289 -190635 -365011 -166518 46514 16801 67853 104201 347593 263331 -74027
108 -74027 39212 123161 -106935 -439251 -139126 158206 -372669 -130300 350871 73297
$$ packed form
0@%%%%%%JjJjQj6J6k4L2m0M8n6P2q8J04j20J42j66J92k22K56k99L44l91M44n04
32b68N72o45P28q16R12j022J139j267J406j559J724j904K104k321K557k816L100
49A624l413L759m141M565n041N577o183O875p679Q628r756J1127j2829J5007j7899
64i779K1917k7867L7496n5448R9055l73758m42198R61106m26518l25531M29870
75a11655K81299J1322r1413J86482R2127j46135k37677j16050J36627k47459j53905
86c96437J52556K69741o3038j93345O86708o6361n91698O02615o5990o07712J43392
97a29569R5280j56346j74376J98493K13032k9713N1052L6348K43392q4262l37358
108g4027J13239Q3949k30096l32316L00125K97332n30875K42369M81171k77574
$$ plain form
118 73297 47005 199582 224619 44026 -88015 -34111 -109878 -133065 -218151 -117331 89864
129 89864 -79212 30381 224414 158536 36432 36609 205939 -95349 -250979 58742 -89038
140 -89038 -235497 -63082 74195 57607 -28335 135477 178704 82224 -3597 -39404 85540
151 85540 -104501 -228681 -19651 -13708 -86628 -74494 120721 160009 -40474 102448 151324
162 151324 -5765 -51674 -46258 -12505 -127542 -120357 -72 -20679 -603 22835 115129 109628
174 109628 -12629 76777 57034 -48030 -88603 -60964 -942 -121785 -83483 73825 30506
185 30506 1614 50345 134288 60341 -52520 42312 7682 -79820 -90581 -54531 703 -60878
197 -60878 -23511 70483 62574 45096 26612 83186 39127 -71438 -15452 -17845 -78310 -86285
$$ packed form
118G3297k6292J52577K5037j80593j32041N3904p5767k3187q5086J00820K07195
129H9864j69076J09593J94033o5878j22104J77J69330l01288j55630L09721j47780
140h9038j46459J72415J37277j6588q5942J63812M3227r6480q5821l5807J24944
151H5540j90041j24180K09030N943p2920J2134J95215L9288k00483J42922M8876
162A51324j57089m5909N416L3753j15037P185J20285k0607K0076K3438R2294n501
174A09628j22257Q9406j9743j05064m0573K7639O0022j20843L8302J57308m3319
185C0506k8892M8731Q3943p3947j12861R4832l4630q7502j0761L6050N5234o1581
197f0878L7367R3994p909j7478j8484N6574m4059j10565N5986k393o0465p975
$$ plain form
209 -86285 -9699 21128 -42465 43801 95704 27643 38997 38529 21299 -22021 -61783 -35512
221 -35512 -41430 -44823 -54113 11031 62965 -6080 33782 99752 31440 -19031 9151 14381 -71199
234 -71199 -69715 -7086 -44455 -26281 11554 26619 51076 40991 32710 37668 25587 -29199 -46087
247 -46087 -2844 -56790 -75934 10584 3755 -18387 36722 74150 25258 17596 49263 -2708
259 -2708 -35103 -22688 -45677 -41681 -28937 -25107 5610 34949 29820 22526 64635 34714 -23565
272 -23565 8789 -564 -68082 -45415 -5089 -36826 -27114 36786 27358 18689 54653 31649 13724
285 13724 9055 -18684 -33631 -28422 -39119 -42729 -4205 12806 -5415 34803 62878 14187 12014
298 12014 39947 -7934 -50143 -10842 -25214 -55910 -15839 2769 1334 24506 30917 35652 36597
$$ packed form
209h6285P6586L0827o3593Q6266N1903o8061J1354m68j7230m3320l9762K6271
221c5512n918l393r290O5144N1934o9045L9862O5970o8312n0471K8182N230q5580
234g1199J484O2629l7369J8174L7835J5065K4457j0085q281M958j2081n4786j6888
247d6087M3243n3946j9144Q6518o829k2142N5109L7428m8892p662L1667n1971
259b708l2395J2415k2989L996J2744L830L0717K9339n129p294M2109k9921n8279
272b3565L2354r353o7518K2667M0326l1737R712O3900r428q669L5964k3004j7925
285A3724m669k7739j4947N209j0697l610L8524J7011j8221M0218K8075m8691k173
298A2014K7933m7881m2209L9301j4372l0696M0071J8608j435K3172O411M735R45
$$ plain form
311 36597 13061 -4756 -1441 -16578 -52622 -31465 -3947 -26395 -19828 37693 36288 3026 35089
324 35089 48265 -5393 -14656 -2641 -24983 -35720 -36044 -14413 3310 -2055 7113 42488 40340
337 40340 4335 12190 31166 -16325 -45595 -12724 -8708 -43750 -27712 27388 14328 -2018
349 -2018 31773 44293 16260 -6888 293 7677 -32354 -47056 -7825 -131 -27939 -10056 44461
362 44461 28042 -4986 26089 41749 -5449 -31738 -2228 20 -46406 -33283 10316 6733
374 6733 -10788 7516 49943 25659 -12438 16382 25187 -23085 -42600 -5999 3430 -42450 -20384
387 -20384 33413 18766 -9394 17521 53109 5109 -28364 11566 9698 -36723 -42554 3940
399 3940 14346 -36473 -3310 49598 19727 -10370 14555 44048 -10767 -42082 6528 3426
$$ packed form
311C6597k3536j7817L315j5137l6044K1157K7518k2448O567N7521j405l3262L2063
324C5089J3176n3658r263J2015k2342j0737l24K1631J7723n365R168L5375k148
337D0340l6005P855J8976m7491k9270L2871M016l5042J6038N5100j3060j6346
349b018L3791J2520k8033k3148P181P384m0031j4702L9231P694k7808J7883N4517
362D4461j6419l3028L1075J5660m7198k6289K9510K248m6426J3123M3599l583
374F733j7521J8304M2427k4284l8097K8820Q805m8272j9515L6601R429m5880K2066
387b0384N3797j4647k8160K6915L5588m8000l3473L9930j868m6421n831M6494
399C940J0406n0819L3163N2908k9871l0097K4925K9493n4815l1315M8610l102
$$ plain form
411 3426 -40083 -32352 19800 18711 -26107 17769 47045 10139 -9612 6480 26448 -28359 -44008
424 -44008 11466 -3840 -34432 -11921 32517 24603 -22465 23319 47639 -5939 -28619 5481
436 5481 18623 -46121 -37758 20943 1414 -18042 -4544 42684 33192 -28380 19164 33261 -18924
449 -18924 -31906 -9953 12298 -35769 -28790 30934 10108 -8270 14651 40627 7738 -21759
461 -21759 20658 -2346 -27729 -24657 -8382 13767 -35258 -3636 48846 3340 -2531 16823
473 16823 35215 -3163 -45060 15647 2880 -40875 -25112 11352 20348 -21035 9473 39599
485 39599 15030 1545 -12102 23330 -5309 -50611 3584 -7076 -16575 -8105 6469 32049
497 32049 -5322 16842 30960 -7420 788 -6528 -5137 -23883 -27100 9637 -12963 -2800 5053
$$ packed form
411C426m3509P731N2152j089m4818M3876K9276l6906j9751J6092J9968n4807j5649
424d4008N5474j5306l0592K2511M4438p914m7068M5784K4320n3578k2680L4100
436E481J3142o4744Q363N8701j9529j9456J3498M7228r492o1572M7544J4097n2185
449a8924j2982K1953K2251m8067O979N9724k0826j8378K2921K5976l2889k9497
461b1759M2417k3004k5383L072J6275K2149m9025L1622N2482m5506n871J9354
473A6823J8392l8378m1897O0707j2767m3755J5763L6464Q996m1383L0508L0126
485C9599k4569j3485j3647L5432k8639m5302N4195j0660r499Q470J4574K5580
497C2049l7371K2164J4118l8380Q208p316J391j8746l217L6737k2600J0163P853
$$ plain form
510 5053 24015 32217 -19896 22074 27662 -22976 -16664 -17100 7556 -24630 -36412 25519 8136
523 8136 5478 4583 21829 36881 -14154 -5432 2581 -6734 -21324 -38706 14177 -6643 -15247 24176
537 24176 4775 30961 10050 246 21444 -16697 -5546 -16571 -23715 -5382 -18800 8401
549 8401 -327 7005 31319 10177 16393 -4839 14939 1887 -45944 -117 -11051 -16902 -7213
562 -7213 -17057 40959 12501 -9566 30024 21073 9247 -30471 -5096 10454 -35910 -24434 -7852
575 -7852 18733 -1849 -13555 44880 15700 7092 7154 -5809 17732 -36873 -21596 4669 -29017
588 -29017 -3398 1687 12945 12992 8373 35426 -268 -573 4166 -8352 -12162 -43026 6981 3431
602 3431 -32386 11281 21004 29152 -3081 -2784 50663 -9376 -32081 -2777 749 -14890 -45363
$$ packed form
510E053J8962Q202n2113M1970N588n0638O312m36K4656l2186j1782O1931j7383
523H136k658q95J7246J5052n1035Q722Q013r315j4590j7382N2883k0820q604L9423
537B4176j9401K6186k0911r804K1198l8141J1151j1025p144J8333j3418K7201
549H401q728P332K4314k1142O216k1232J9778j3052m7831M5827j0934n851R689
562g213r844N8016k8458k2067L9590q951j1826l9718K5375J5550m6364J1476J6582
575g852K6585k0582j1706N8435k9180q608O2j2963K3541n4605J5277K6265l3686
588b9017K5619N085J1258M7m619K7053l5694l05M739j2518l810l0864N0007l550
602C431l5817M3667R723Q148l2233K97N3447o0039k2705K9304L526j5639l0473
$$ plain form
615 -45363 8365 21034 -7799 3099 18053 43284 -7279 -15593 31582 -16849 -25422 -15799 -7423
628 -7423 -3485 -28907 20237 18601 -4018 23663 18395 14509 -11560 -5716 10704 -31242 -23544
641 -23544 -8655 7663 -7704 -23873 47000 25226 -16572 17423 25266 5674 -37069 -11314
653 -11314 15194 -32911 -24188 -146 19600 6027 -12140 37262 26332 -5099 -3835 6074 5525
666 5525 -42349 -17462 12939 -27909 -8502 16893 17742 6807 9002 32071 1603 -9274 -5121
679 -5121 -7404 -10032 -38824 -5084 16169 -17064 1226 25273 32194 -2529 -6320 36793 -7428
692 -7428 -35269 -6110 -2659 -17904 -25326 6252 18996 4810 7051 16969 33457 -6155 -18113
705 -18113 17629 -14260 -32424 -12987 1403 -5149 -16393 22410 26029 -2481 16231 18351 3194
$$ packed form
615d5363N3728J2669k8833J0898J4954K5231n0563q314M7175m8431q573R623Q376
628g423L938k5422M9144j636k2619K7681n268l886k6069N844J6420m1946P698
641b3544J4889J6318j5367j6169P0873k1774m1798L3995P843j9592m2743K5755
653a1314K6508m8105Q723K4042J9746j3573j8167M9402j0930l1431J264R909n49
666E525m7874K4887L0401m0848J9407K5395Q49j0935K195K3069l0468j0877M153
679e121k283k628k8792L3740K1253l3233J8290K4047O921l4723l791M3113m4221
692g428k7841K9159L451j5245p422L1578J2744j4186K241R918J6488l9612j1958
705a8113L5742l1889j8164J9437J4390o552j1244L8803L619k8510J8712K120j5157
$$ plain form
718 3194 -12255 -13198 -5218 -16218 -21425 -11972 15086 6784 -11123 30615 29593 -8199 2537 11760
732 11760 -2527 -29567 -17275 3554 -16813 -13396 7623 17684 12842 3388 17871 20161 -4817
745 -4817 -16207 -1631 -787 -34368 -15232 14543 -8564 -5919 20800 22923 5505 2765 15696
758 15696 1899 -17740 -13800 -7454 -9185 -19839 -5262 15913 8067 365 17572 26430 -1198
771 -1198 -10557 10357 -5232 -28596 -12402 -857 -7550 -10414 8816 19656 9715 5286 13747
784 13747 13722 -7177 -16265 -1666 -7409 -23901 -10997 7705 3206 -4521 16548 24327 3703 -502
798 -502 10755 627 -18191 -15445 -3760 -8896 -15725 -229 15222 7615 2130 19018 16847 -3181
812 -3181 -4573 869 -8297 -18024 -14988 -1027 -1845 -8639 9354 20178 7306 3441 14780 7982
$$ packed form
718C194j5449r43P980j1000n207R453K7058q302j7907M1738j022l7792J0736R223
732A1760j4287k7040J2292K0829k0367L417K1019J0061m842r454J4483K290k4978
745d817j1390J4576Q44l3581J9136K9775k3107K645K6719K123j7418k740J2931
758A5696j3797j9639L940O346j731j0654J4577K1175p846p702J7207Q858k7628
771a198r359K0914j5589k3364J6194J1545o693k864J9230J0840r941m429Q461
784A3747k5k0899r088J4599n743j6492J2904J8702m499p727K1069P779k0624m205
798e02J1257j0128j8818K746J1685n136o829J5496J5451p607n485J6888k171k0028
812c181j392N442r166r727L036J3961q18o794J7993J0824j2872l865J1339o798
$$ plain form
826 7982 -10496 -11691 -2503 -11467 -20140 -4260 6284 -1518 5199 16603 13085 9593 1824 1161
840 1161 2081 -15051 -18726 -985 -8078 -15691 5349 14936 3157 7401 19418 9609 -4222 -2310
854 -2310 332 -15078 -16661 -5538 -7224 -3926 4118 5614 16337 12447 1295 11911 7727 -15858
868 -15858 -9664 1179 -19108 -15713 4192 1888 -707 9741 17588 10506 1881 7743 226 -10860
882 -10860 -9157 -12959 -8567 -4840 -8593 4297 17374 2555 5510 24294 2211 -11732 7313
895 7313 -5903 -20674 -9938 -3004 -3930 -6872 8340 15397 6861 8416 8868 6183 -1553 -14054
909 -14054 -7291 -2891 -15817 -15766 10691 7209 -10054 17802 20579 -1474 3232 6514 -2062 -13997
923 -13997 -12225 -2669 -10215 -7039 174 9397 11461 -53 13024 15858 -3574 -9901 2611 -486
$$ packed form
826G982j8478j195R188q964q673J5880J0544p802O717J1404l518l492p769o63
840A161R20j7132l675J7741p093p613K1040R587j1779M244J2017r809j3831J912
854b310K642j5410j583J1123j686L298Q044J496J0723l890j1152J0616m184k3585
868a5858O194J0843k0287L395J9905k304k595J0448P847p082q625N862p517j1086
882a0860J703l802M392L727l753J2890J3077j4819K955J8784k2083j3943J9045
895G313j3216j4771J0736O934r26k942J5212P057q536J555M52k685p736j2501
909a4054O763M400j2926N1K6457l482j7263K7856K777k2053M706L282q576j1935
923a3997J772R556p546L176P213R223K064j1514J3077K834j9432o327J2512l097
$$ plain form
937 -486 -26272 -9708 12360 -11046 -5587 14676 15637 4194 -965 14588 3708 -11397 -11517 -3949
951 -3949 -567 -20308 -6663 17231 -541 -1626 12840 19308 -1534 -8956 14747 -6797 -19876
964 -19876 -4056 -2162 -6109 -10832 8047 14564 -1676 6723 11786 12186 -9528 -12769 13223 -11577
978 -11577 -23053 -1369 7886 -1645 -13079 18860 21400 -8403 3210 10056 6267 -16304 -15536
991 -15536 9651 -10832 -14950 267 10762 7360 -8013 18328 15780 -9951 2363 1939 -3316
1004 -3316 -18076 -8410 8248 -14565 -3966 11272 11521 2936 -4371 24046 4786 -20429 2009
1017 2009 1572 -7460 -23712 -1905 18330 -12890 -2166 17096 16242 875 -10006 17580 1407
1030 1407 -20438 -7478 -1949 1668 -20317 1755 20744 -6688 7262 13092 7910 -138 -8277
$$ packed form
937d86k5786J6564K2068k3406N459K0263R61j1443n159J5553j0880j5105j20P568
951c949L382j9741J3645K3894j7772j085J4466O468k0842p422K3703k1544j3079
964a9876J5820J894l947m723J8879O517j6240Q399N063M00k1714l241K5992k4800
978a1577j1476K1684R255r531j1434L1939K540k9803J1613O846l789k2571P68
991a5536K5187k0483m118J5217J0495l402j5373K6341k548k5731J2314m24n255
1004c316j4760R666J6658k2813J0599J5238K49q585p307K8417j9260k5215K2438
1017B009m37r032j6252K1807K0235l1220J0724J9262q54j5367j0881K7586j6173
1030A407k1845J2960N529L617k1985K2072J8989k7432J3950N830n182q048q139
$$ plain form
1043 -8277 8273 -12589 -16154 1306 -5998 -1047 -7696 13578 17411 -8501 9821 12962 3636
1056 3636 -15250 -12484 15125 -18233 -21819 8990 5868 2082 -7138 18487 19262 -8375 1862
1069 1862 2173 3404 -15276 -20047 9491 -7989 -9967 5386 8993 12674 -4379 15630 9713 -12075
1083 -12075 3761 -6943 -8787 -11743 -7220 7219 -10622 4295 14516 7509 7143 -4125 16643
1096 16643 -16 -21603 -816 -3412 -6448 -17166 -984 20097 -6001 3043 14585 12450 3914
1109 3914 -14329 8304 -2107 -18646 -7196 -6146 4820 -7577 -8 19770 1797 7636 6642
1122 6642 3316 511 -13488 534 -10336 -12644 43 -2942 6131 -1952 11552 18506 -6440
1135 -6440 6389 5926 -3215 -10196 -15336 5732 -9707 -12560 5567 7775 9699 -2643 10620 16656
$$ packed form
1043h277J6550k0862l565J7460p304M951o649K1274L833k5912J8322L141r326
1056C636j8886K766K7609l3358l586L0809l122l786r220K5625P75k7637J0237
1069A862L11J231j8680m771K9538j7480j978J5353L607L681j7053K0009n917k1788
1083a2075J5836j0704j844k956M523J4439j7841J4917J0221p007l66j1268K0768
1096A6643j6659k1587K0787k596l036j0718J6182K1081k6098R044J1542k135q536
1109C914j8243K2633j0411j6539J1450J050J0966j2397P569J9778j7973N839r94
1122F642l326k805j3999J4022j0870k308J2687k985R073q083J3504O954k4946
1135f440J2829m63r141o981n140K1068j5439k853J8127K208J924j2342J3263O036
$$ plain form
1149 16656 -5768 -4018 -4514 916 -11758 -19387 8885 -2575 -3983 7971 8022 12751 -92 5192
1163 5192 6312 -8699 -4992 -8984 -4689 -8012 -8275 9116 429 3832 9975 10099 7318 -7889 6783
1178 6783 1158 -19566 -4743 -3159 -3779 -6469 -1274 15404 4285 2908 8119 9014 1520 -12919
1192 -12919 -117 -1983 -14208 -7518 -1911 6620 -2972 2523 18208 2755 3069 5238 -297 -3564
1206 -3564 -11474 -4219 -5110 -9079 -973 3249 8105 1615 8199 13529 -1311 -371 -846 -2845 -9594
1221 -9594 -13557 1398 -2439 -7432 6461 8978 8049 2662 6167 8053 -4299 -6707 -5170 -3957
1235 -3957 -9887 -8927 3849 1747 1331 8270 8680 8689 26 1984 1789 -9644 -7430 -5860 -5448 -5170 -1879
1252 -1879 6947 5395 4460 8932 7224 2099 -3877 -1561 -4768 -10814 -6453 -3833 -514 -861 3716
$$ packed form
1149A6656k2424J750m96N430j2674p629K8272j1460j408J1954N1M729j2843N284
1163E192J120j5011L707l992M295l323k63J7391q687L403O143J24k781j5207J4672
1178F783n625k0724J4823J584o20k690N195J6678j1119j377N211Q95p494j4439
1192a2919J2802j866j2225O690N607Q531r592N495J5685j5453L14K169n535l267
1206c564p910P255q91l969Q106M222M856o490O584N330j4840R40m75j999o749
1221i594l963J4955l837m993J3893K517r29n387L505J886j2352k408J537J213
1235c957n930R60J2776k102m16O939M10Rq663J958j95j1433K214J570M12K78L291
1252a879Q826j552r35M472j708n125n976K316l207o046M361K620L319l47M577
$$ plain form
1267 3716 10679 6249 4568 5769 1864 -2282 -8232 -5042 -5660 -8986 -3143 1159 3169 4851 7186
1282 7186 8367 5035 1807 -107 -3135 -6356 -8331 -5454 -5023 -2949 1423 4166 7613 6235 6288 6458
1298 6458 55 -2243 -4064 -7767 -6755 -6774 -4148 264 2469 5241 7592 6870 5101 3520 -549 -3276
1314 -3276 -5738 -8211 -6298 -4874 -3337 1848 3393 6775 7943 5220 5600 2230 -2745 -4032 -6163
1329 -6163 -7659 -6011 -4722 -535 2912 4079 6627 8497 4819 2735 1407 -3103 -6008 -7719 -6185
1344 -6185 -4586 -4822 978 5452 4736 6886 7219 5380 1726 -2171 -3789 -5358 -8238 -7150 -2341 -1120
1360 -1120 -94 5908 8010 5836 5382 3963 1808 -4623 -5979 -4339 -7537 -6550 -2209 1183 3384
1375 3384 4571 7295 8064 3721 985 197 -2442 -8498 -6540 -3361 -5409 -1895 2532 5369 6135 4883
$$ packed form
1267C716O963m430j681J201l905m146n950L190o18l326N843M302K010J682K335
1282G186J181l332l228j914l028l221j975K877M31K074M372K743L447j378N3J70
1298F458o403k298j821l703J012j9K626M412K205K772K351p22j769j581m069k727
1314c276k462k473J913J424J537N185J545L382J168k723L80l370m975j287k131
1329f163j496J648J289M187L447J167K548J870l678k084j328m510k905j711J534
1344f185J599k36N800M474p16K150L33j839l654l897j618j569k880J088M809J221
1360a120J026O002K102k174m54j419k155o431j356J640l198R87M341L392K201
1375C384J187K724P69m343k736p88k639o056J958L179k048L514M427K837P66j252
$$ plain form
1391 4883 7121 4170 -1554 -1679 -4732 -5763 -7457 -5660 -996 -341 2002 5810 7758 4994 2771
1406 2771 4346 -1717 -5319 -4308 -6616 -4684 -5559 -980 3642 1501 5708 6932 5391 2471 -976
1421 -976 660 -4719 -8028 -4387 -4134 -2793 -2333 4599 5766 2729 7274 3844 1883 -402 -4162 -2395
1437 -2395 -7246 -5344 -1581 -2938 1911 2606 6759 5222 2382 6123 419 -3058 -3689 -4563 -3432 -8002
1453 -8002 -1323 2456 -446 4960 4080 7019 3456 -709 2510 -3052 -4445 -5763 -4284 -1026 -4864
1468 -4864 2715 4116 2048 7007 2830 4312 -317 -2499 -50 -7706 -4075 -2647 -2999 456 -1704
1483 -1704 7562 5343 224 5513 2563 1363 -7203 -3261 1226 -9411 -3517 555 1620 2925 -48
1498 -48 8921 4217 -90 2189 -2625 -217 -7823 -4562 537 -6168 1225 2539 3512 4060 2084 8347
$$ packed form
1391D883K238k951n724j25l053j031j694J797M664O55K343L808J948k764k223
1406B771J575o063l602J011k308J932q75M579M622k141M207J224j541k920l447
1421i76J636n379l309L641K53J341M60O932J167l037M545l430j961k285l760J767
1437b395m851J902L763j357M849O95M153j537k840L741n704l477o31q74J131m570
1453h002O679L779k902N406q80K939l563m165L219n562j393j318J479L258l838
1468d864P579J401k068M959m177J482m629k182K449p656L631J428l52L455k160
1483a704R266k219n119N289k950j200q566L942M487j0637N894M072J065J305k973
1498d8Q969m704m307K279m814K408p606L261N099o705P393J314R73N48j976O263
$$ plain form
1514 8347 -2558 -2416 2721 -6215 -4451 -5422 36 643 -4373 5461 5459 4630 1023 -729 8624 -5383
1530 -5383 -7276 727 -3395 -3469 -6499 4667 4714 -2729 6933 3693 3080 1043 -3744 1751 -6208 -3689
1546 -3689 -2510 -3634 1698 -2650 6366 3539 -1794 8744 1072 -2306 -1741 -1054 80 -10735 89
1561 89 2880 -3012 1794 1160 8549 2220 -3077 4927 -238 -1461 -7212 -2845 4490 -9045 -531
1576 -531 4774 1026 3316 -121 6467 622 -2271 1813 -5063 -1015 -3851 -2675 1633 -4135 5039
1591 5039 2378 903 4155 29 5540 -4811 -3735 4051 -6241 -3749 -1990 2277 1978 -4887 6730
1606 6730 3864 1121 303 -1921 5625 -5214 -5355 1326 -2594 2 -3856 3092 5294 -3226 4964
1621 4964 1069 1208 437 -4262 1539 -4765 -2365 -250 -3195 2889 -679 3747 2951 -2228 5894 -723
$$ packed form
1514H347j0905J42N137q936J764r71N458O07n016R834kq29l607j752R353j4007
1530e383j893Q003m122p4l030J1166M7p443R662l240o13k037m787N495p959K519
1546c689J179j124N332m348R016k827n333J0538p672l378N65O87J134j0815J0824
1561H9K791n892M806o34P389o329n297Q004n165j223n751M367P335j3535Q514
1576e31N305l748K290l437O588n845k893M084o876M048k836J176M308n768R174
1591E039k661j475L252m126N511j0351J076P786j0292K492J759M267k99o865J1617
1606F730k866k743q18k224P546j0839j41O681l920K596l858O948K202q520Q190
1621D964l895J39p71m699N801o304K400K115k945O084l568M426p96n179Q122o617
$$ plain form
1637 -723 -1851 -1436 -2245 1483 -6705 -587 3212 -1424 1934 -305 6109 2332 -4276 3707 -688 -1307
1653 -1307 -4793 -2914 3792 -4846 -387 3205 1593 3458 -1469 4382 1572 -3024 365 -3161 130
1668 130 -3933 -2131 3300 -3095 2792 3341 1346 2713 -413 3408 -2062 -4223 1079 -3081 -1771
1683 -1771 -2888 1298 3908 -2487 2805 4034 2227 -802 -2520 4213 -3266 -5902 1304 -1334 -943
1698 -943 -2120 2467 5042 -1056 2425 2293 1172 -1434 -3680 1601 -3103 -4190 599 257 963 -964
1714 -964 4582 3530 -2646 3186 1258 -2292 -2696 -2613 720 -3590 -2393 2611 2014 1192 -590 5630
1730 5630 2559 -3771 640 927 -2451 -5177 -1371 2863 -3641 -908 4702 1979 1054 477 3698 559
1746 559 -3959 -1253 -347 -2418 -4468 280 3506 -2195 1266 5538 2174 -725 173 3027 -3173 -5195
$$ packed form
1637g23j128M15q09L728q188O118L799m636L358k239O414l777o608P983m395o19
1653a307l486J879O706q638M459L592j612J865m927N851k810m596L389l526L291
1668A30m063J802N431o395N887N49j995J367l126L821n470k161N302m160J310
1683a771j117M186K610o395N292J229j807l029j718O733p479k636P206k638L91
1698i43j177M587K575o098L481j32j121k606k246N281m704j087M789l42P06j927
1714i64N546j052o176N832j928l550m04Q3L333m310J197N004n97q22j782O220
1730E630l071o330M411K87l378k726L806M234o504K733N610k723r25n77L221l139
1746E59m518K706R06k071k050M748L226n701L461M272l364k899Q98K854o200k022
$$ plain form
1762 -5195 401 -1185 -3305 -1365 2369 3411 -201 1668 4677 1394 -2928 -1117 1724 -4536 -5202
1777 -5202 1320 388 -2316 585 4774 3032 -1040 2790 2698 -2092 -3256 -1647 -587 -3701 -3122 2169
1793 2169 2223 -556 1724 5616 1935 -2629 1321 1131 -4155 -4361 -24 -256 -3285 -26 4174 2192
1809 2192 86 2764 3716 -313 -3420 -273 -640 -4605 -3288 1305 1036 -1991 2152 5758 1277 -385
1825 -385 2274 1266 -3182 -3754 -601 -1239 -3814 -912 3197 1426 -71 3188 4145 40 -1672 506
1841 506 -380 -4455 -3621 926 -688 -2111 1927 4130 1781 20 2456 3003 -2260 -3014 310 -1650
1857 -1650 -4101 -1597 2141 603 -567 3101 4045 661 -703 1543 76 -3635 -2981 -400 -1127 -2754
1873 -2754 122 3857 1102 99 3222 2943 -1323 -1847 606 -1621 -4065 -1773 212 -341 -1024 1885
$$ packed form
1762e195N596j586k120J940L734J042l612J869L009l283m322J811K841o260o66
1777e202O522r32k704K901M189j742m072L830r2m790j164J609J060l114N79N291
1793B169N4k779K280L892l681m564L950j90n286k06M337k32l029L259M200j982
1809B192k106K678R52m029l107L147l67l965J317M593k69l027M143L606m481j662
1825c85K659j008m448n72L153o38k575K902M109j771j497L259R57m105j712K178
1841E06q86m075Q34M547j614j423M038K203k349j761K436N47n263p54L324j960
1857a650k451K504L738j538j170L668R44l384j364K246j467l711O54K581p27j627
1873b754K876L735k755j003L123k79m266n24K453k227k444K292J985n53o83K909
$$ plain form
1889 1885 3847 743 800 1874 951 -1957 -2677 36 -1441 -3589 -518 1799 708 -18 3071 3585
1905 3585 -380 -224 445 -215 -3124 -3442 201 -1267 -1882 803 2905 2093 88 2332 2413 -2172 -1143
1922 -1143 -607 -1307 -2856 -1774 1170 -279 282 2296 2383 2185 -668 1458 787 -3141 -1644 -1120 -668
1939 -668 -2221 -1042 3018 247 374 2895 2312 473 -1851 538 -164 -3311 -1894 -809 874 -1646
1955 -1646 -51 4039 923 885 1210 1585 123 -3438 94 -501 -3321 -512 -365 1443 -172 1175
1971 1175 3244 238 237 378 160 -1264 -3875 932 -767 -2373 635 892 2828 -1058 1524 4278
1987 4278 -1316 -1425 -604 82 -1732 -4360 1465 675 -1251 717 1924 3539 -1951 635 2567 -2338
2003 -2338 -1196 -1783 -8 -969 -3315 2968 813 -308 1890 1807 2334 -2500 941 1310 -3737 -1558
$$ packed form
1889A885J962l104N7J074r23k908p20K713j477k148L071K317j091p26L089N14
1905C585l965J56O69o60k909l18L643j468o15K685K102q12k005K244Q1m585J029
1922a143N36p00j549J082K944j449N61K014Q7j98k853K126o71l928J497N24M52
1939f68j553J179M060k771J27K521n83j839k324K389p02l147J417J085J683k520
1955a646J595M090l116l8L25L75j462l561L532n95k820K809J47J808j615J347
1971A175K069l006jJ41k18j424k611M807j699j606L008K57J936l886K582K754
1987D278n594j09Q21O86j814k628N825p90j926J968J207J615n490K586J932m905
2003b338J142n87J775r61k346O283k155j121K198q3N27m834L441L69n047K179
$$ plain form
2019 -1558 -415 804 -1865 -1510 4942 263 -688 1538 1741 1355 -4938 738 1822 -4214 -1735 344
2035 344 2491 -1224 -1473 5066 344 -686 -31 895 401 -4771 810 325 -2964 415 174 2603 -945
2052 -945 -20 4733 -1542 -1021 374 91 -1539 -4451 2923 450 -3480 1493 2073 2389 -2399 411
2068 411 5059 -3141 -2175 56 915 -1547 -4445 3855 1148 -2089 1634 1887 2504 -2692 119 2928
2084 2928 -3729 -939 -555 348 -807 -2119 4170 -303 -1307 2602 824 694 -3191 1476 1329 -4987
2100 -4987 -129 1143 575 -1522 -669 5724 -1104 -1794 1857 1013 -213 -4372 1157 1664 -4604 -133
2116 -133 928 1746 -1064 -448 4508 -1050 -967 939 -239 -625 -3620 1437 127 -2919 2273 981
2132 981 1264 -664 845 3609 -3115 -849 1511 -1190 -1638 -2130 3234 258 -2760 2955 2081 937
$$ packed form
2019a558J143J219k669L55O452m679r51K226K03l86o293N676J084o036K479K079
2035C44K147l715k49O539m722j030O55R26m94n172N581m85l289L379k41K429l548
2052i45R25M753o275N21J395k83j630k912P374k473l930M973N80L16m788K810
2068D11M648q200R66K231Q59k462k898Q300k707l237L723K53O17n196K811K809
2084B928o657K790L84R03j155j312O289m473j004L909j778j30l885M667j47o316
2100d987M858J272n68k097Q53O393o828o90L651q44j226m159N529N07o268M471
2116a33J061Q18k810O16M956n558Q3J906j178l86k995N057j310l046N192j292
2132I81K83j928J509K764o724K266K360k701m48m92N364k976l018N715q74j144
$$ plain form
2148 937 -1623 939 2792 -3758 -1088 540 -579 -956 -2064 2864 438 -1018 2575 578 842 -1316
2164 -1316 -159 925 -3464 -310 35 -578 -419 -106 3039 -524 -79 2727 -385 -715 -1905 575
2180 575 -252 -3728 845 959 -283 246 648 3184 -425 -1121 1477 -727 -1144 -2112 481 -232 -2300
2197 -2300 1352 831 907 1026 705 2432 -1073 -586 488 -2040 -1021 -1490 315 -52 -1109 2271 962
2214 962 606 609 923 1052 -2343 -388 266 -2224 -958 -846 1531 269 -262 2933 1240 104 201 181
2232 181 -166 -2385 -662 -265 -1377 -389 255 2147 530 777 2246 74 -273 -704 -984 -846 -2319
2249 -2319 -419 364 -793 705 1249 1833 80 739 1191 -751 -1076 -1168 -389 -1383 -1963 958 759 272
2267 272 1201 1265 1845 -324 -657 686 -1510 -1891 -865 -292 -846 -676 1636 1609 577 839 1252 565 -1470
$$ packed form
2148I37k560K562J853o550K670J628j119l77j108M928k426j456L593j997K64k158
2164a316J157J084m389L154L45o13J59L13L145l563M45K806l112l30j190K480
2180E75q27l476M573J14j242N29M02K536l609o96K598k204m17r68K593p13k068
2197b300L652n21P6J19l21J727l505M87J074k528J019m69J805l67j057L380j309
2214I62l56LL14J29l395J955O54k490J266J12K377j262n31L195j693j136R7k0
2232A81l47k219J723L97j112R88O44J892j617K47J469k172l47m31k80J38j473
2249b319J900P83j157J498N44N84j753O59M52j942l25r2P79r94n80K921j99m87
2267B72R29O4N80k169l33J343k196l81J026N73n54J70K312k7j032K62M13o87k035
$$ plain form
2286 -1470 -525 -156 -1893 -1320 -158 427 -19 -139 2312 1455 -133 742 852 -535 -2038 -864 -662
2303 -662 -1532 -995 562 1444 439 588 2401 1223 -459 -342 -16 -905 -2535 -717 604 -1225 -335
2320 -335 1798 1488 -17 681 1367 21 -1583 -964 10 -1326 -2021 466 1168 -395 437 2495 1772
2337 1772 -727 225 1288 -943 -2568 -274 316 -1334 -1178 1474 1721 -157 692 2047 597 -1864
2353 -1864 -487 946 -1523 -2373 -10 1129 -602 -668 2085 1574 -756 312 1952 -36 -2323 -708
2369 -708 775 -1755 -1907 889 1411 -542 -130 2948 1109 -1300 -2 1139 -1125 -2930 -138 1011
2385 1011 -1893 -965 1763 1512 -750 193 2551 127 -1738 -182 905 -1397 -2535 608 1233 -1799
2401 -1799 -149 2538 1555 -1103 248 2204 -254 -2301 13 357 -1665 -1990 1397 1463 -1110 435
$$ packed form
2286a470R45L69j737N73J162N85m46j20K451q57j588Q75J10j387j503J174K02
2303f62q70N37J557Q82j005J49J813j178j682J17L26q89j630J818J321j829Q90
2320c35K133l10j505O98O86j346j604O19R74j336o95K487P02j563Q32K058p23
2337A772k499R52J063k231j625K294N90j650J56K652K47j878Q49J355j450k461
2353a864J377J433k469q50K363J139j731o6K753n11k330J068J640j988k287J615
2369g08J483k530j52K796N22j953M12L078j839k409J298J141k264j805K792J149
2385A011k904R28K728k51k262R43K358k424j865J556J087k302j138L143O25l032
2401a799J650K687r83k658J351J956k458k047K314L44k022l25L387O6k573J545
$$ plain form
2417 435 2550 1036 -1589 274 1727 -1778 -2402 228 291 -1457 -1092 1837 1122 -1215 998 2226
2433 2226 210 -1833 105 1022 -2470 -1974 821 538 -1356 -158 3151 1023 -1363 1162 1314 -282
2449 -282 -2439 -71 755 -2525 -900 903 928 -272 142 3046 233 -1246 1084 208 -1206 -2222
2465 -2222 447 499 -2013 207 1892 1004 -199 462 2528 -643 -1350 444 -277 -1500 -2325 1091 810
2482 810 -1275 1328 1735 892 -356 74 1750 -1229 -1498 89 -800 -715 -1687 1275 909 -570 1958
2499 1958 1364 579 -507 -134 870 -2344 -1054 185 -739 -260 -512 2180 708 -481 1722 430
2515 430 53 -1279 -650 709 -2472 -560 449 6 303 -242 2288 469 -570 1250 -502 -253 -1258
2532 -1258 -864 413 -1832 388 373 317 1148 -406 2099 -218 -700 635 -1232 -533 -896 -257 440 -1061
$$ packed form
2417D35K115j514k625J863J453l505o24K630O3j748L65K929p15k337K213J228
2433B226k016k043J938R17l492M96K795k83j894J198L309k128k386K525J52j596
2449b82k157K368Q26l280J625J803K5j200M14K904k813j479K330q76j414j016
2465b222K669N2k512K220J685q88j203O61K066l171p07J794p21j223q25L416k81
2482H10k085K603M07q43j248M30J676k979k69J587q89Q5r72K962l66j479K528
2499A958n94p85j086L73J004l214J290J239r24M79k52K692j472j189K203j292
2515D30l77j332O29J359l181J912J009m43K97n45K530j819j039J820j752K49j005
2532a258L94J277k245K220j5n6Q31j554K505k317m82J335j867O99l63O39O97j501
$$ plain form
2550 -1061 1378 504 720 1026 -402 1634 -811 -730 91 -1016 -179 -1310 92 788 -673 1207 307
2567 307 819 664 -1186 752 -992 -566 -549 -1377 909 -746 155 1004 -137 1577 -410 862 599
2584 599 -1131 170 -1295 102 -299 -960 1142 -579 903 909 -157 1254 -660 424 -663 -1260 669
2601 669 -1217 -40 38 -62 1601 -884 1015 878 68 447 -877 888 -713 -1360 742 -511 522
2618 522 -243 382 1962 -828 872 225 -308 124 -1751 504 -625 -725 834 -415 1139 -431 668
2635 668 1203 -866 591 -118 -700 38 -1003 496 -939 -285 1070 -255 867 -306 618 1043 -1643
2652 -1643 344 -561 -749 -475 -969 1275 -282 72 1049 158 924 -590 391 536 -1435 -43 -414 -243
2670 -243 -120 -626 1485 -81 479 569 -64 408 -717 -8 -378 -1407 131 -399 266 136 -124 1461
$$ packed form
2550a061K439q74K16L06j428K036k445Q1Q21j107Q37j131J402O96j461J880r00
2567C07N12j55j850J938j744M26J7q28K286j655R01Q49j141J714j987J272k63
2584E99j730J301j465J397m01o61K102j721J482Oj066J411j914J084j087n97J929
2601F69j886J177P8j00J663k485J899j37q10L79j324J765j601o47K102j253J033
2618E22p65O25J580k790J700o47n33M32j875K255j129j00J559j249J554j570J099
2635F68N35k069J457p09n82P38j041J499j435O54J355j325J122j173R24M25k686
2652a643J987r05j88K74m94K244j557L54R77q91P66j514R81J45j971J392l71J71
2670b43J23n06K111j566N60R0o33M72j125P09l70j029J538n30O65j30k60J585
$$ plain form
2688 1461 -141 253 537 -308 94 -1335 191 -163 -1195 570 -34 421 590 132 1318 -169 14
2705 14 88 -277 155 -1269 94 283 -405 520 281 1037 5 -117 976 -383 -74 -386 -668 -129 -1024
2724 -1024 496 490 -33 269 275 889 -403 -87 553 -844 -212 -271 15 -189 -731 947 229 -63 242 336
2744 336 519 -804 -516 378 -901 -317 -311 576 378 -594 965 552 -12 -72 347 -40 -873 -369 -44 -455
2764 -455 -492 41 825 482 -60 759 395 -79 -123 171 89 -1252 -475 264 -134 -330 490 600 6 -274 884
2785 884 541 -617 -400 74 -177 -1056 -221 410 -113 -238 740 990 -138 -219 495 -434 -779 -784 177 -54
2805 -54 -754 316 914 181 -81 530 764 -499 -477 477 -235 -698 -55 203 -214 -354 524 798 162 112
2825 112 590 505 -592 -602 159 -284 -829 -230 303 156 134 820 413 -151 -361 -129 -116 -629 -301 21 -175
$$ packed form
2688A461j602L94K84q45M02j429J526l54j032J765o04M55J69m58J186j487J83
2705A4P4l65M32j424J363J89o88R25k39P56j032j22J093j359L09l12k82N39q95
2724a024J520on23L02OO14j292L16O40j397O32n9K86k04n42J678p18k92L05R4
2744C36J83j323K88Q94j279N84OQ87j98r72J559m13n64o0M19l87q33N04L25m11
2764d55l7N33P84l43n42Q19l64m74m4K94q2j341P77P39l98j96Q20J10n94k80J158
2785H84l43j158K17M74k51q79Q35O31n23j25R78K50j128q1P14r29l45nR61k31
2805e4p00J070N98p33k62O11K34j263K2R54p12m63O43K58m17j40Q78K74o36n0
2825A12M78q5j097j0P61m43n45N99N33j47k2O86m07n64k10K32J3n13L28L22j96
$$ plain form
2846 -175 -413 102 496 130 -89 446 318 -363 -405 64 -238 -794 -304 311 36 197 461 564 171 -105
2866 -105 377 -167 -720 -206 -427 -57 -287 -12 385 331 4 390 346 18 -34 -113 -399 -347 -202 -401 160 35
2888 35 246 372 291 239 135 -6 114 -139 -473 -334 198 5 -88 380 260 67 146 437 183 -438 -382 -178
2910 -178 -595 -554 -101 471 102 -248 647 256 -131 -267 237 2 -727 -152 -4 -207 -240 21 504 -177 -61
2931 -61 531 266 -85 -115 262 -402 -1049 -125 267 -380 -157 533 754 -344 -97 764 -72 -480 -350 461
2951 461 -525 -995 320 405 -400 41 814 789 -735 -244 822 -652 -544 -166 873 -528 -1008 874
2969 874 465 -144 -170 652 707 -1139 -188 425 -775 -866 56 596 -235 -716 1156 188 -516 -226 645 157
2989 157 -1762 5 402 -660 -565 311 929 -199 -366 1150 234 -346 -22 553 -77 -1548 686 499
$$ packed form
2846a75k38N15L94l66k19N35j28o81m2M69l02n56M90O15k75J61K64J03l93k76
2866a05M82n44n53N14k21L70k30K75L97n4l27L86m4l28n2p9k86N2J45j99N61j25
2888C5K11J26q1n2j04j41J20k53l34J39N32j93r3M68j20j93P9K91k54o21N6K04
2910a78m17M1M53N72l69l50Q95l91l87j36N04k35p29N75J48k03l3K61M83o81J16
2931f1N92k65l51l0L77o64o47R24L92o47K23O90K21j098K47Q61q36m08J30Q11
2951D61r86m70J315Q5q05M41P73k5j524M91J066j474J08L78J039j401m80J882
2969H74m09o09k6Q22N5j846R51O13j200r1R22N40q31m81J872r68p04K90Q71m88
2989A57j919J767L97j062R5Q76O18j128j67J516r16n80L24N75o30j471K234j87
$$ plain form
3007 499 -635 -298 383 974 -462 -136 1365 -189 -416 -307 451 -452 -1147 795 285 -242 18 532
3025 532 1015 -961 202 1276 -559 -319 -189 793 -338 -1148 782 190 -529 94 347 748 -745 -169
3043 -169 644 -610 -403 -332 760 -42 -682 1222 120 -254 -96 301 600 -1322 134 460 -767 -601
3061 -601 -216 507 -231 -538 1367 -57 -25 -74 -48 709 -942 334 437 -702 -46 -502 554 11 -659
3080 -659 1469 -230 -237 -262 57 106 -1255 490 247 -348 384 -316 986 -261 -281 963 -637 42 -360
3099 -360 43 -46 -1120 363 196 -475 138 169 911 -436 -393 610 -437 -48 -661 74 255 -987 538
3118 538 192 192 267 340 647 -474 -141 423 -452 183 -596 -55 220 -403 884 -79 89 114 -149 589 -299
3139 -299 -48 86 -603 85 -651 466 290 -363 513 -162 142 -113 -567 631 -972 -335 -45 -398 204
$$ packed form
3007D99j134L37O81N91j436L26J501j554k27J09P58r03o95J942n10n27K60N14
3025E32M83j976J163J074j835K40J30R82j131q10J930n92p19O23K53M01j493N76
3043a69Q13j254K07P1J092q02o40J904j102l74J58L97K99j922J456L26j227J66
3061f01L85P23p38l07J905j424L2m9K6P57j651J276J03j139O56m56J056n43o70
3080f59K128j699pk5L19M9j361J745k43n95P32p00J302j247k0J244j600O79m02
3099c60M03q9j074J483j67o71O13L1P42j347M3J003j047L89o13P35J81j242J525
3118E38l46%P5P3L07j121L33N64q75O35p79N41K75o23J287r63J68K5k63P38q88
3139b99K51J34o89O88p36J117j76o53Q76o75L04k55m54J198j603O37K90l53O02
$$ plain form
3158 204 -547 614 535 -223 596 -189 224 -287 -443 436 -622 -115 -28 -282 401 -263 423 39 -527 293
3178 293 -80 -140 -493 -277 110 -718 309 29 126 551 -283 422 161 -79 56 -285 22 -109 101 360
3198 360 -609 281 30 199 412 -143 432 -192 -94 33 -193 143 49 134 364 -225 303 291 90 150 -361 392
3220 392 -333 -176 94 -302 300 -294 99 293 -139 375 174 28 143 -428 204 -246 -41 -170 117 399
3240 399 -282 298 361 94 135 -251 139 -56 -358 85 66 83 -148 219 428 -37 61 291 -188 109 -455 1
3262 1 -57 -273 -56 99 -134 -251 -64 602 -140 -142 10 74 62 -257 107 -52 -434 152 127 300 -298 -43 575
3285 575 -361 -124 425 -66 -402 -374 532 193 -472 193 363 -98 -462 210 491 -410 -373 142 152 -357 -206
3306 -206 660 158 -295 401 381 -200 -355 11 150 -642 -377 215 7 -505 -53 419 -353 -608 422 572
$$ packed form
3158B04p51J161p9p58Q19p85M13n11j56Q79j058N07Q7k54O83o64O86l84n66Q20
3178B93l73o0l53K16L87q28J027k80R7M25q34P05k61k40J35l41L07j31K10K59
3198C60r69Q90k51J69K13n55N75o24R8J27k26L36r4Q5K30n89N28j2k01O0n11P53
3220C92p25J57K70l96O02n94L93J94m32N14k01j46J15n71O32m50K05j29K87K82
3240C99o81N80O3k67M1l86L90j95l02M43j9J7k31L67K09m65R8K30m79K97n64M56
3262An8k16K17J55k33j17J87O66p42kJ52O4j2l19L64j59l82N86k5J73n98K55O18
3285E75r36K37N49m91l36K8R06l39o65O65J70m61l64O72K81r01L7N15J0n09J51
3306b06Q66n02m53O96k0n81j55L66J39p92K65N92k08n12M52M72p72k55J030J50
$$ plain form
3326 572 -359 -405 602 508 -802 -17 438 159 -697 -47 621 -184 -631 463 452 -460 -312 455 288 -808
3346 -808 -132 600 -183 -720 334 680 -474 -556 295 451 -756 -231 640 16 -540 195 594 -514 -394
3365 -394 402 624 -644 -315 488 193 -731 -245 549 -62 -646 231 569 -392 -445 519 390 -862 -294 441
3385 441 4 -568 -11 514 -138 -538 513 393 -461 -355 602 60 -727 47 295 -134 -210 141 610 -96
3405 -96 -455 470 181 -421 -605 636 -236 -775 338 423 -206 -445 376 610 -261 -562 734 104 -556 -140
3425 -140 518 -16 -488 169 695 -203 -195 445 484 -420 -228 450 147 -487 -97 432 -66 -416 386 293 -124
3446 -124 -290 309 258 -449 255 345 187 -171 -26 510 -320 -326 693 142 -217 43 185 62 -509 -39 13
3467 13 -177 -194 -25 456 -542 15 315 -151 202 -206 223 -149 -294 256 -55 -187 80 261 492 -158 -84
$$ packed form
3326E72r31m6J007r4j310P85M55k79q56O50O68q05m47J094j1r12J48P67j67j096
3346h08O76P32p83n37J054L46j154q2Q51J56j207N25Q71o24n56P35L99j108J20
3365c94P96K22j268L29Q03k95r24M86P94o11n84Q77L38r61n3R64j29j252N68P35
3385D41m37n72N57N25o52m00J051j20q54J06R57n42p87P74K48m29p6L51M69p06
3405i6l59R25k89o02j84J241q72n39J113Q5o29k39Q21K34q71l01J296o30o60M16
3425a40O58n34m72O57N26q98QO40L9r04J92O78l03o34L90N29m98l50Q02r3m17
3446a24j66N99n1p07P04R0j58l58J45N36q30oJ019n51l59K60J42j23n71M70N2
3467A3j90j7J69M81r98N57L00m66L53m08M29l72j45N50l11j32K67J81K31o50P4
$$ plain form
3488 -84 275 -388 -12 -269 -2 -66 -246 127 -136 -92 409 -249 25 -185 16 -51 -309 187 -174 24 23 -9
3510 -9 411 -149 110 136 112 334 -106 242 -120 -381 273 -66 121 18 -76 292 -92 322 -188 53 51 -263
3532 -263 -77 -175 -672 306 -229 288 -7 213 317 -255 290 33 -50 122 -469 360 -109 -105 320 -162 289
3553 289 47 59 255 -230 277 69 -223 -44 22 87 -108 -64 476 -294 -94 -143 -64 -100 -264 463 -51 -159
3575 -159 471 16 81 -389 -172 462 -316 297 89 271 -169 -555 321 -112 166 268 81 342 -119 202
3595 202 292 -386 163 -326 163 -157 -336 417 -296 -41 -40 66 444 -290 172 212 -456 -36 -76 569 -147 -269
3617 -269 488 32 152 -3 186 220 -481 77 196 -176 -53 -96 445 -303 -267 452 -11 5 -84 291 394 -863
3639 -863 211 206 -302 -50 -23 195 -425 -310 575 -319 -146 -273 133 94 -874 410 -254 -549 110 124 217
$$ packed form
3488h4L59o63L76k57K67o4j80L73k63M4N01o58K74k10K01o7k58M96l61J98jl2
3510iM20n60K59K6k4K22m40L48l62k61O54l39J87j03r4L68l84M14n10K41kl14
3532b63J86r8m97R78n35N17k95K20J04n72N45k57q3J72n91Q29m69MM25m82M51
3553B89k42J2J96m85N07k08k92J79O6O5j95M4N40p70K00m9P9l6j64P27n14j08
3575a59O30m55O5m70K17O34p78O13k08J82m40l86Q76m33K78J02j87K61m61L21
3595B02R0o78N49m89M89l20j79P53p13K55JJ06L78p34M62M0o68M20m0O45p16j22
3617b69P57m56J20j55J89L4p01N58J19l72J23m3N41p48L6P19m63J6q9L75J03j257
3639h63J074nn08K52K7K18o20J15Q85q94J73j27M06l9r68J284o64k95O59J4R3
$$ plain form
3660 217 -559 -123 521 -472 -140 -222 357 -162 -596 503 -1 -190 -184 116 636 -300 -147 543 -161 -251 -232
3681 -232 518 -235 -728 607 312 -117 61 360 393 -790 21 454 -163 -393 -44 274 -279 -433 621
3700 621 130 -206 -101 341 287 -555 167 533 -234 -279 -43 530 -420 -249 400 42 -338 13 284 39 -793
3721 -793 -8 274 -397 -230 410 263 -192 -247 914 164 -233 -259 283 -303 -892 224 253 -254 -45 122
3741 122 436 -472 -233 619 -507 -387 -65 397 -128 -752 495 391 -419 42 356 349 -623 186 450 -163
3761 -163 -440 -116 545 -172 -573 602 81 -406 148 261 24 -412 125 446 -183 -55 357 199 -542 -113
3781 -113 484 388 -169 -80 494 57 -576 -92 234 -388 -182 478 362 -203 -131 95 60 -360 53 307 -26
3802 -26 -715 10 335 -14 -38 216 93 -293 203 128 111 -223 408 85 -332 -159 458 -27 -316 7 230
$$ packed form
3660B17p76M36O44r93L32q2N79n19m34J099n04j89OL00N20r36J53O90p04r0J9
3681b32P50p53m93J335k95m29J78K99L3j183Q11M33o17k30L49L18n53j54J054
3700F21m91l36J05M42n4q42P22L66p67m5K36N73r50J71O49l58l80L51K71k45q32
3721g93P85K82o71J67O40j47m55n5J161p50l97k6N42n86n89J116K9n07K09J67
3741A22L14r08K39Q52j126J20L22M62n25o24J247j04q10M61L14pr72Q09K64o13
3761a63k77L24O61p17m01J175n21m87N54J13k37m36N37L21o29J28M12j58p41M29
3781a13N97r6n57Q9N74m37o33M84L26o22K06O60j16n65P2K26l5m20M13K54l33
3802b6o89P25L25l49k4K54j23l86M96p5j7l34O31l23m17J73O17m85k89L23K23
$$ plain form
3823 230 13 -112 -141 367 -149 -207 27 -70 -323 -233 347 -46 -90 177 158 -83 121 -95 174 -101 -377 227
3845 227 218 -332 -112 220 223 4 290 301 -227 -262 89 95 -326 -138 238 432 -181 -176 201 -69 -13 413 193 -216
3869 -216 16 -39 -239 -105 -156 133 17 211 126 294 -264 -31 -52 -289 84 -180 -154 80 209 328 -100 -66
3891 -66 402 127 113 -70 277 88 -165 -14 208 52 -247 323 89 190 -9 154 146 117 -245 -108 -186 -109
3913 -109 326 -151 -180 22 7 108 147 129 279 84 8 -82 -64 -196 -109 142 7 17 -21 229 57 -130 102
3936 102 222 -36 -118 -150 64 -75 -261 393 27 -103 -78 33 48 -3 26 250 254 -158 -75 426 -120 -46 79
3959 79 60 83 127 261 80 -300 48 226 52 -247 310 281 -397 228 223 -455 -56 -96 285 -68 -266 116 189
3982 189 -123 110 86 145 -257 -132 130 -225 -213 -218 341 128 -279 240 98 109 159 99 309 -3 -162 84 -148
$$ packed form
3823B30k17j25k9N08n16n8K34r7k53R0N80l93m4K67j9k41K04k16K69k75k76O04
3845B27rn50K20L32Lk19K86J1n28l5L51Om21J88L76J94o13NL77k70N6M26k20m09
3869b16K32n5k00J34n1K89j16J94q5J68n58K33k1k37L73k64K6K34J29J19m28L4
3891f6M68k75j4j83L47j89k53J51K22j56k99N70k34J01j99J63qk9l62J37p8P7
3913a09M35m77k9K02j5J01L9j8J50j95p6r0J8j32Q7K51j35J0l8K50j72j87K32
3936A02J20k58q2l2K14j39j86O54l66j30K5J11J5n1K9K24Mm12Q3N01n46P4J25
3959G9j9K3M4J34j81l80L48J78j74k99N57k9o78O25no78L99m0L81l53j98L82P3
3982A89l12K33k4N9m02J25K62l55J2nN59k13m07N19j42J1N0o0K10l12j59K46k32
$$ plain form
4005 -148 -110 -283 179 128 2 287 -51 -147 -211 10 201 -283 23 123 -159 3 -327 99 -74 -107 412 132
4027 132 -36 -91 96 211 -334 106 131 -81 165 64 328 184 18 177 -123 -135 -144 97 215 -285 130 -98
4049 -98 99 -52 -157 491 -73 -145 104 -116 135 -164 -24 196 -452 180 85 213 -134 -181 295 -351 -127
4070 -127 77 24 -318 -222 509 235 -335 151 207 -115 -113 -25 449 -434 -130 -135 -93 237 -78 340 -85 -152 403
4093 403 199 -140 -354 -144 318 -543 -65 -193 25 -120 -273 505 -57 -120 315 -5 -37 -146 -53 226 -348
4114 -348 93 339 92 -43 -181 334 -4 -193 306 -40 164 -276 435 324 -435 -41 36 0 -62 -59 335 -322
4136 -322 -6 338 118 -114 -116 213 36 -176 112 81 -60 -88 -53 282 -332 -329 167 -105 -242 -99 -77 118 -177
4159 -177 153 72 -276 -346 -141 506 -463 -178 105 -82 38 -387 304 -122 -319 454 137 -45 -113 -124 254
$$ packed form
4005a48L8j73M62n1j26K85l38r6o4K21J91m84L06J00k82J62l30M26j73l3N19k80
4027A32j68n5J87J15n45M40K5k12K46j01K64j44j66J59l00j2rK41J18n00M15k28
4049i8J97j51j05O48n64p2K49k20K51k99J40K20o48O32r5J28l47m7M76o46K24
4070a27K04n3l42R6P31k74n70M86N6l22KQ8M74q83L04nM2L30l15M18m25o7N55
4093D03k04l39k14K10M62q61M78j28K18j45j53P78n62o3M35l20l2j09R3K79n74
4114c48M41K46k47j35j38N15l38j89M99l46K04m40P11j11p59L94P7l6o2LL94o57
4136c22L16L44k20k32kL29j77k12K88l1j41k8L5L35o14LM96k72j37J43K2J95k95
4159a77L30q1l48p0K05O47r69K85K83j87J20m25O91m26j97P73l17j82o8j1L78
$$ plain form
4180 254 -279 -74 113 -227 202 39 59 30 -70 32 -94 -28 47 -100 119 -270 145 127 -236 44 -332 209
4202 209 -44 205 278 -142 81 -502 -24 81 -357 263 -68 -19 -126 -68 183 -173 270 -37 -273 134 197
4223 197 -17 -46 -205 243 -227 70 -10 17 93 -89 153 -210 -194 -14 -160 -152 20 -165 231 -381 249 191 -253
4246 -253 6 -56 61 -82 -242 -161 -231 86 34 158 -79 -14 -94 176 -228 -138 2 161 -132 -312 327 -350
4268 -350 14 -42 68 69 -206 164 1 -172 160 153 -99 -77 233 68 7 74 335 246 -52 64 143 164 -340 164
4292 164 219 -47 -105 36 -77 52 -97 -7 104 -172 189 185 -18 -250 -35 136 -320 -215 32 -30 -170 -223
4314 -223 202 179 -85 -116 184 197 -116 -44 239 18 -285 327 21 -161 70 227 -53 -7 -4 118 -68 -43 217
4337 217 -21 -322 19 117 -19 -203 204 191 110 -73 185 207 -66 57 112 79 -44 -152 207 -249 -106 2
$$ packed form
4180B54n33K05J87l40M29j63K0k9j00J02j26O6P5j47K19l89M15j8l63K80l76N41
4202B09k53K49P3m20K23n83M78J05m38O20l31M9j07N8K51l56M43l07k36M07O3
4223A97k14k9j59M48m70K97q0K7P6j82K42l63J6J80j46QJ72j85L96o12O30n8m44
4246b53K59o2J17j43j60Q1p0L17n2J24k37O5q0K70m04R0J40J59k93j80O39o77
4268c50L64n6J10Jk75L70j63j73L32pk52K2L10j65o1O7K61q9k98J16P9K1n04N04
4292A64N5k66n8J41j13J29j49R0J11k76L61mk03k32K15J71m56J05K47o2j40n3
4314b23M25k3k64l1L00J3l13P2K83k21l03O12l06j82K31J57k80M6LJ22j86K5K60
4337B17k38l01L41R8j36j84M07j3q1j83K58K2k73J23N5l3j23j08L59m56J43J08
$$ plain form
4359 2 245 -182 -251 -34 444 -142 -126 76 171 28 -240 307 -46 -115 -272 -17 -19 -110 17 44 -278 -293 -154 189
4383 189 45 -223 332 219 61 65 -4 176 47 257 253 66 -113 -199 139 -159 -188 -118 -315 -16 78 -86 38
4406 38 -199 167 160 -138 -4 -4 -53 -161 105 155 135 -30 -125 45 -196 96 -67 254 -148 -22 167 56 97
4429 97 -64 254 -304 51 82 -54 163 -6 236 -31 39 -51 -96 -84 -122 34 289 -12 82 -10 -23 112 5
4452 5 116 -8 -77 62 59 182 134 -122 176 -91 -93 130 -62 21 -237 305 112 -5 -199 -139 -124 -315 -165 373
4476 373 -224 -300 -68 26 81 -308 158 10 -92 48 100 473 84 99 54 -132 40 12 87 -153 -76 247 50
4499 50 -201 70 -15 63 90 -8 315 14 42 -206 58 0 -172 291 51 69 168 -75 -11 -181 -57 75 -105
4522 -105 73 -45 145 66 -204 -53 -221 -51 20 212 34 -247 -82 127 -54 226 -281 107 -29 13 217
$$ packed form
4359BK43m27o9K17M78n86J6K02R5j43k68N47l53o9j57K55kr1J27K7l22j5J39L43
4383A89j44k68N55j13j58Mo9J80j29K10mj87j79q6L38k98k9P0j97K99R4j64J24
4406C8k37L66pk98J34%m9j08K66N0k0j65r5J70k41K92j63L21m02J26J89j11M1
4429I7j61L18n58L55L1j36K17j69K42k67P0r0m5J2l8J56K55l01R4r2j3J35j07
4452EJ11j24o9J39lJ23m8k56K98k67kK23j92Q3k58N42j93j17j94O0J5j91J50N38
4476C73n97p6K32R4N5l89M66j48j02J40N2L73l89J5m5j86J72k8P5k40P7L23j97
4499E0k51K71q5P8K7r8L23l01K8k48K64n8j72M63k40J8R9k43O4j70J24J32j80
4522a05J78j18J90p9k70J51j68J70P1J92j78k81J65K09j81K80n07L88j36M2K04
$$ plain form
4543 217 -251 -231 73 27 -36 -64 -37 32 -164 -11 -108 324 -247 -366 259 -152 351 19 -351 40 -322 292
4565 292 124 -94 109 65 2 -126 181 46 -144 209 -64 -168 -143 -13 277 15 219 179 -84 249 31
4586 31 -97 -3 -247 197 -160 64 -14 -275 323 -108 81 47 -290 66 116 -37 -60 -106 544 -7 -66 93 -300
4609 -300 404 -488 167 51 -90 451 23 17 50 -106 -36 -74 21 393 -97 129 -51 27 143 32 257 144
4631 144 -95 -84 81 133 -144 -254 200 -126 121 -63 207 -63 128 83 -231 151 -339 46 258 -128 -10
4652 -10 -26 -51 186 -207 304 -201 11 140 -72 94 66 -145 22 -151 -23 -120 102 26 -122 55 -317 -177
4674 -177 409 -93 -14 -183 234 -8 -171 322 46 -113 17 -6 -36 -86 176 361 -285 -334 -29 -7 -110 -340
4696 -340 181 -300 -146 -247 -45 -30 -317 28 64 -57 -4 -101 41 -171 -29 193 72 310 12 169 -71
$$ packed form
4543B17m68K0L04m6o3k8K7O9j96J53r7M32n71j19O25m11N03l32l70L91l62O14
4565B92j68k18K03m4o3j28L07j35j90L53k73j04K5J30K90k62K04m0k63L33k18
4586C1j28R4k44M44l57K24p8k61N98m31J89l4l37L56N0j53k3m6O50n51n9J59l93
4609c00P04q92O55j16j41N41m28oL3j56P0l8R5L72m90K26j80P8J16j11K25j13
4631A44k39J1J65N2k77j10M54l26K47j84K70k70J91m5l14L82m90L85K12l86J18
4652a0j6k5K37l93N11n05K12J29k12J66k8k11J67j73J28r7K22p6j48J77l72J40
4674a77N86n02P9j69M17k42j63M93k76j59J30k3l0n0K62J85o46m9L05K2j03k30
4696c40N21m81J54j01K02J5k87L45L6j21N3r7J42k12J42K22j21K38k98J57k40
$$ plain form
4717 -71 -117 29 160 -158 218 198 232 10 19 280 -54 70 -24 -218 -146 -74 59 -53 -211 146 -58 188 -100
4740 -100 68 175 -89 69 60 -147 -30 68 152 -2 185 42 -74 131 -142 101 96 -193 73 -182 -62 -184
4762 -184 91 -25 34 96 174 121 244 40 72 113 -104 212 -35 26 19 13 -140 -187 117 101 -33 32 -60 -132 -124 -127 245
4789 245 -30 -45 -68 -106 144 -321 68 -96 -159 -51 -100 -118 -167 126 9 -229 -96 18 -93 -296 127 -11
4811 -11 -40 129 127 72 -186 169 -42 49 -70 259 13 -93 72 -98 -18 -236 68 29 144 -123 123 316 15
4834 15 -282 65 142 -462 -232 -268 13 -9 11 296 46 19 177 93 -31 75 194 132 10 -9 67 17 -279 -32
4858 -32 97 21 -244 -46 81 -117 24 -66 -25 -87 -8 2 29 -12 201 -52 -80 -177 30 75 -75 -69 -75 -57 -101 51
4884 51 -116 -36 92 -183 54 -183 -224 242 381 -139 -183 179 24 67 16 89 13 -168 17 146 -197 24 279
$$ packed form
4717g1m6J46J31l18L76k0L4k22RK61l34J24r4j94P2P2J33j12j58L57k04K46k88
4740a00J68J07k64J58rk07J17R8Q4j54J87j43j16K05k73K43nk89K66k55J20j22
4762a84K75j16N9O2P8n3J23k04L2M1k17L16k47O1poj53m7L04j6j34O5r2p2QlL72
4789B45k75j5k3l8K50m65L89j64o3J08m9j8m9K93j17k38J33J14j11k03M23j38
4811a1k9J69kn5k58L55k11R1j19L29k46j06J65j70Q0k18L04l9J15k67K46J93l01
4834A5k97L47P7o04K30l6K81k2K0K85k50k7J58q4j24J06J19o2j22j9P6n0k96K47
4858c2J29p6k65J98J27j98J41r0M1o2P9J0K7m1K13k53k8r7K07M5j50OoJ8m4J52
4884E1j67Q0J28k75K37k37m1M66J39n20m4L62j55M3n1P3p6j81J85J29l43K21K55
$$ plain form
4907 279 -41 -104 47 -103 142 -110 -88 183 -34 21 -8 195 67 83 340 14 5 -162 249 -224 54 -143
4929 -143 -198 -102 -139 117 -136 -142 -213 -277 23 -122 150 229 -10 336 -140 128 -26 -447 295 99 -270 51 -27
4952 -27 39 -202 -42 65 -16 183 228 -83 114 -273 36 10 -275 -29 123 -190 -326 333 45 59 -105 279
4974 279 89 20 144 -46 -97 87 69 -42 32 -9 16 132 -101 -21 -122 -14 -146 -54 306 -116 -8 50 -21
4997 -21 308 167 -1 -4 148 120 67 -191 32 -78 72 83 29 -114 -180 102 -111 -181 293 -121 114 9 79
5020 79 -272 71 295 -255 213 245 -10 328 -187 57 -106 -39 315 -306 158 23 8 218 -4 219 -11
$$ packed form
4907B79l20o3J51j50K45k52K2K71k17N5k9K03j28J6K57l26rj67M11m73K78j97
4929a43n5R6l7K56k53op1o4L00j45K72P9k39L46m76K68j54m21P42j96l69L21p8
4952b7O6k41J60J07q1J99M5l11J97l87L09k6k85K46J52l13j36O59k88J4j64L84
4974B79j90o9J24j90n1J84j8j11P4m1K5J16k33Q0j01J08j32R2L60m22J08N8p1
4997b1L29j41j68lJ52k8n3k58K23j10J50J1n4j43o6K82k13p0M74m14K35j05P0
5020G9l51L43K24n50M68L2k55L38n15K44j63O7L54o21M64j35j5K10k22K23k30
$$ [...]
8191d1
##END NTUPLES=NMR FID
##END=
