##TITLE=1H_LR-761-C2-M2
 CDCl3
 8 sc, 
 28.6.2024
##JCAMPDX= 6.0         $$ Bruker NMR JCAMP-DX V2.0
##DATA TYPE= NMR FID
##DATA CLASS= NTUPLES
##ORIGIN= UXNMR, Bruker Analytische Messtechnik GmbH
##OWNER= root
$$ XWIN-NMR		Version 3.5
$$ Fri Jun 28 13:46:48 2024 Russian Standard Time (UT+4h)  she@DPX200
##.OBSERVE FREQUENCY= 200.1313
##.OBSERVE NUCLEUS= ^1H
##.DELAY= (6, 6)
##.ACQUISITION MODE= SIMULTANEOUS
##.ACQUISITION SCHEME= undefined
##.AVERAGES= 8
##.DIGITISER RES= 18
##SPECTROMETER/DATA SYSTEM= spect
##.PULSE SEQUENCE= zg30
##.SOLVENT NAME= CDCl3
##.SHIFT REFERENCE= (INTERNAL, CDCl3, 0, 15.7039)
##AUDIT TRAIL= $$ (NUMBER, WHEN, WHO, WHERE, WHAT)
$$ ##TITLE= Audit trail, XWIN-NMR		Version 3.5
$$ ##JCAMPDX= 5.01
$$ ##ORIGIN= Bruker BioSpin GmbH
$$ ##OWNER= she
$$ F:/spectra/data/she/nmr/H-F/1/audita.txt
$$ ##AUDIT TRAIL=  $$ (NUMBER, WHEN, WHO, WHERE, WHAT)
(   1,<2024-06-28 13:45:37.23 +0400>,<she>,<DPX200>,
      <created by zg, POWCHK disabled, PULCHK disabled
       configuration hash MD5:
       00 E9 B6 7A A2 85 ED C7 34 08 36 98 17 FE 4E 26
       data hash MD5: 16K
       FD 91 56 4F A8 6D CB 5F 09 4F 88 E1 75 C0 9B 1D>)
$$ ##END=
$$ 
$$ hash MD5
$$ EE BA CD DC B1 8E 46 13 F1 A4 EF A9 8F 21 A6 CD
##$RELAX= 
##$RELAX= 
##$RELAX= 
##$RELAX= 
##$RELAX= 
##$RELAX= 
$$ Bruker specific parameters
$$ --------------------------
##$DU= <F:/spectra>
##$EXPNO= 1
##$NAME= <H-F>
##$PROCNO= 1
##$TYPE= <nmr>
##$USER= <she>
##$AMP= (0..31)
100 100 100 100 100 100 100 100 100 100 100 100 100 100 100 100 100 100 
100 100 100 100 100 100 100 100 100 100 100 100 100 100 
##$AQSEQ= 0
##$AQ_mod= 1
##$AUNM= <au_zg>
##$AUTOPOS= <>
##$BF1= 200.13
##$BF2= 200.13
##$BF3= 200.13
##$BF4= 200.13
##$BF5= 200.13
##$BF6= 200.13
##$BF7= 200.13
##$BF8= 200.13
##$BYTORDA= 1
##$CFDGTYP= 0
##$CFRGTYP= 5
##$CHEMSTR= <none>
##$CNST= (0..31)
1 1 145 1 1 1 1 1 1 1 1 1 1 1 1 1 1 1 1 1 1 1 1 1 1 1 1 1 1 1 1 1 
##$CPDPRG= <>
##$CPDPRG1= <>
##$CPDPRG2= <>
##$CPDPRG3= <>
##$CPDPRG4= <mlev>
##$CPDPRG5= <mlev>
##$CPDPRG6= <mlev>
##$CPDPRG7= <mlev>
##$CPDPRG8= <mlev>
##$CPDPRGB= <>
##$CPDPRGT= <>
##$D= (0..31)
0 1.2 0 0 0 0 0 0 0 0.06 0 0.03 0 0 0 0 0.0002 0 0 0 0 0 0 0 0 0 0 0 0 
0 0 0 
##$DATE= 1719567936
##$DBL= (0..7)
120 120 120 120 120 120 120 120 
##$DBP= (0..7)
150 150 150 150 150 150 150 150 
##$DBP07= 0
##$DBPNAM0= <>
##$DBPNAM1= <>
##$DBPNAM2= <>
##$DBPNAM3= <>
##$DBPNAM4= <>
##$DBPNAM5= <>
##$DBPNAM6= <>
##$DBPNAM7= <>
##$DBPOAL= (0..7)
0.5 0.5 0.5 0.5 0.5 0.5 0.5 0.5 
##$DBPOFFS= (0..7)
0 0 0 0 0 0 0 0 
##$DE= 6
##$DECBNUC= <off>
##$DECIM= 32
##$DECNUC= <off>
##$DECSTAT= 4
##$DIGMOD= 1
##$DIGTYP= 9
##$DL= (0..7)
0 120 120 120 120 120 120 120 
##$DP= (0..7)
150 150 150 150 150 150 150 150 
##$DP07= 0
##$DPNAME0= <>
##$DPNAME1= <>
##$DPNAME2= <>
##$DPNAME3= <>
##$DPNAME4= <>
##$DPNAME5= <>
##$DPNAME6= <>
##$DPNAME7= <>
##$DPOAL= (0..7)
0.5 0.5 0.5 0.5 0.5 0.5 0.5 0.5 
##$DPOFFS= (0..7)
0 0 0 0 0 0 0 0 
##$DQDMODE= 0
##$DR= 18
##$DS= 0
##$DSLIST= <SSSSSSSSSSSSSSS>
$$ [...]
##$SUBNAM2= <"">
##$SUBNAM3= <"">
##$SUBNAM4= <"">
##$SUBNAM5= <"">
##$SUBNAM6= <"">
##$SUBNAM7= <"">
##$SUBNAM8= <"">
##$SUBNAM9= <"">
##$SW= 18.0517328524113
##$SWIBOX= (0..15)
0 0 2 0 0 0 0 0 0 0 0 0 0 0 0 0 
##$SW_h= 3612.71676300578
##$TD= 16384
##$TD0= 1
##$TE= 0
##$TE2= 300
##$TE3= 300
##$TEG= 300
##$TL= (0..7)
0 120 120 120 120 120 120 120 
##$TP= (0..7)
150 150 150 150 150 150 150 150 
##$TP07= 0
##$TPNAME0= <>
##$TPNAME1= <>
##$TPNAME2= <>
##$TPNAME3= <>
##$TPNAME4= <>
##$TPNAME5= <>
##$TPNAME6= <>
##$TPNAME7= <>
##$TPOAL= (0..7)
0.5 0.5 0.5 0.5 0.5 0.5 0.5 0.5 
##$TPOFFS= (0..7)
0 0 0 0 0 0 0 0 
##$TUNHIN= 0
##$TUNHOUT= 0
##$TUNXOUT= 0
##$USERA1= <user>
##$USERA2= <user>
##$USERA3= <user>
##$USERA4= <user>
##$USERA5= <user>
##$V9= 5
##$VALIST= <valist>
##$VCLIST= <CCCCCCCCCCCCCCC>
##$VD= 0
##$VDLIST= <DDDDDDDDDDDDDDD>
##$VPLIST= <PPPPPPPPPPPPPPP>
##$VTLIST= <TTTTTTTTTTTTTTT>
##$WBST= 1024
##$WBSW= 4
##$XGAIN= (0..3)
0 0 0 0 
##$XL= 0
##$YL= 0
##$YMAX_a= 363661
##$YMIN_a= -408487
##$ZGOPTNS= <>
##$ZL1= 120
##$ZL2= 120
##$ZL3= 120
##$ZL4= 120
##$ABSF1= 10
##$ABSF2= 0
##$ABSG= 5
##$ABSL= 3
##$ALPHA= 0
##$AQORDER= 0
##$ASSFAC= 0
##$ASSFACI= 0
##$ASSFACX= 0
##$ASSWID= 0
##$AUNMP= <proc_1d>
##$AZFE= 0.1
##$AZFW= 0.1
##$BCFW= 1
##$BC_mod= 2
##$BYTORDP= 1
##$COROFFS= 0
##$CY= 11.3945322036743
##$DATMOD= 1
##$DC= 2
##$DFILT= <>
##$DTYPP= 0
##$F1P= 15.6554695791079
##$F2P= 12.8336369535428
##$FCOR= 0.5
##$FTSIZE= 0
##$FT_mod= 4
##$GAMMA= 1
##$GB= 0.15
##$INTBC= 1
##$INTSCL= 1
##$ISEN= 128
##$LB= 0.24
##$LEV0= 0
##$LPBIN= 0
##$MAXI= 10000
##$MC2= 0
##$MEAN= 0
##$ME_mod= 0
##$MI= 1.114404
##$NCOEF= 0
##$NC_proc= 0
##$NLEV= 6
##$NOISF1= 3.799351
##$NOISF2= 2.8
##$NSP= 1
##$NTH_PI= 0
##$NZP= 0
##$OFFSET= 15.70392
##$PC= 1
##$PHC0= -25315.4
##$PHC1= 9.38748
##$PH_mod= 1
##$PKNL= yes
##$PPARMOD= 0
##$PSCAL= 0
##$PSIGN= 0
##$REVERSE= no
##$SF= 200.130013532006
##$SI= 16384
##$SIGF1= 3
##$SIGF2= 2
##$SINO= 400
##$SIOLD= 16384
##$SREGLST= <1H.CDCl3>
##$SSB= 0
##$STSI= 0
##$STSR= 0
##$SW_p= 3612.71676300578
##$SYMM= 0
##$S_DEV= 0
##$TDeff= 0
##$TDoff= 0
##$TI= <>
##$TILT= no
##$TM1= 0
##$TM2= 0
##$TOPLEV= 0
##$USERP1= <user>
##$USERP2= <user>
##$USERP3= <user>
##$USERP4= <user>
##$USERP5= <user>
##$WDW= 1
##$XDIM= 8192
##$YMAX_p= 0
##$YMIN_p= 0
$$ End of Bruker specific parameters
$$ ---------------------------------
##NTUPLES= NMR FID
##VAR_NAME=  TIME,          FID/REAL,        FID/IMAG
##SYMBOL=    X,             R,               I
##VAR_TYPE=  INDEPENDENT,   DEPENDENT,       DEPENDENT
##VAR_FORM=  AFFN,          ASDF,            ASDF
##VAR_DIM=   8192,          8192,            8192
##UNITS=     SECONDS,       ARBITRARY UNITS, ARBITRARY UNITS
##FACTOR=    0.0002768,     1,               1
##FIRST=     0,             0,               0
##LAST=      2.2672688,     0,               0
##MIN=       0,             -408487,         0
##MAX=       2.2672688,     363661,          0
$$ Real data points
##PAGE= N=1
##DATA TABLE= (X++(R..R)), XYDATA
$$ [...]
2024c98kN54J046M79k39o97j155l42N63M13L39l05j396o54jR85Q50L64l62o30
2044e88l70N35R70O57J65l10p68m35J34P28M36n63r83r64kN68N82L51n31p12J25
2065i75j8J316O66l5j64m96m27M24M81P45n91o49q14k38M23M66j4m01n43m06K22
2086a028K15J158R7m31k80j98N52P91N19K2m10q24k37pN19K01o32r06l86J51N8
2107a056O96J17m1j26q9L47N63K84K90k65j09l75J4K57K10J36q78m12l27K59K14
2128b91j32j36l19o3K57K55O38R3J23m07J96R8N19R6j40J8o34k16j67M3p2Ln69
2151h07j20K13L44n5J77K24l1r9M45L05J69rl08L0k32J60m57K41m22J29k17l81
2173g01K24m3K95j17O7n8L97L1L04o1K63q9K13k29M2M6o66M3M81m48j8p70J29
$$ y = [-398, -400, 154, 1200, 1679, 1440, 743, -412, -754, -191, 222, 561, 256, -1140, -1794, -1795, -810, 40, 404, 42, -588, -958, -423, 547, 1204, 1369, 1059, 291, -144, -10, 718, 1154, 591, -392, -1356, -1358, -790, -208, 143, -388, -1100, -975, -993, 323, 989, 954, 790, 294, -133, 291, 772, 1517, 926, 277, -537, -775, -352, 114, 100, -301, -844, -1250, -1028, -813, 345, 442, 11, -269, -467, 85, 876, 1395, 1417, 1007, 183, -54, -61, 458, 659, 27, -879, -1265, -1114, -1056, -360, -243, -284, -410, -499, -152, 411, 695, 985, 720, 611, 236, 250, 507, 717, 853, -25, -437, -764, -505, -291, -423, -559, -878, -941, -684, -429, 209, 302, 425, 18, 214, 312, 831, 927, 787, 805, 171, -45, -212, -169, -241, -238, -807, -927, -714, -370, -425, -248, -24, -55, -154, 291, 596, 765, 756, 448, 478, 246, 406, -51, 190, -232, -103, -320, -701, -477, -520, -225, -342, -275, -333, 64, 95, 399, 338, 601, 512, 725, 496, 538, 584, -82, -39, 442, -6, -24, -794, -665]
2196f65n3L94K68k73j32K57K92K21J05K03K07m53R7k10j00L50l67j66m17k01J79
2217d64j76O13j92l04J23j28N20J59J70N2q1r0ML69J6K36l81j65p36J51J71M7
2239h6jl40l28L8O0M58pL27J31m74P8K99M90K76l05l52l99j91L34M7J00l79m43
2262f67m06M18J16P23j01k5m48n3K27P31M90l73j66m57o5n8Q11j48J20r04o44
2283h79k9L29N90L8k44l54l39M49N73Q48k42n20j66k35L65L85K90k68n45m91l93
2304h38N21L28j7o6p79k30M22L80N71J64j34k96N5j45O72M26L7o60p70J46Q4J60
2326C1J53k24p52k73J85N49K69O76p31O3l84L41O81K43K70n17k12m44L03K11K40
2347F78m65k38p97O2M5L25O37m87j65m76L32O76N73J88j90m42l09K98O04k27r6
$$ y = [-665, -718, -324, -56, -329, -461, -204, 88, 309, 414, 617, 824, 371, 468, 258, 158, 508, 141, -25, -442, -643, -464, -640, -27, -219, -523, -400, -528, -8, 151, 321, 373, 292, 202, 206, 575, 591, 827, 446, 281, -455, -304, -133, -86, -87, -427, -755, -717, -657, -199, -206, 121, 252, -222, -144, 155, 645, 921, 616, 264, -135, -326, 8, 55, 155, -224, -667, -1073, -655, -539, 184, 83, 58, -390, -443, -216, 515, 1005, 632, 466, 9, -56, -114, 697, 549, 669, -235, -879, -908, -579, 11, 49, -195, -549, -888, -439, 134, 982, 740, 220, 54, -181, 184, 569, 859, 591, 46, -445, -838, -317, 11, -6, -72, -851, -1081, -659, -279, 292, 456, 322, 26, 81, -64, 608, 1034, 1071, 411, -359, -213, -129, 31, 184, -40, -792, -1065, -880, -331, -62, 614, -117, -54, -438, -97, 584, 827, 1097, 580, 368, -76, 227, 438, 678, 213, -25, -822, -760, -715, -390, 247, -240, -405, -881, -549, 127, 700, 888, 698, 256, -53, 245, 849, 622, 526]
2368E26k88p43k49M63N4M63l72n36k56rM77O72J88o1k07m59O52J73N23k39m56
2389C16j71l93L39k23L82j69q13k65m15O52M32L09l16k2L2N8O64M96K78n99n10
2410F2m6K08J67L08j50p04l73j88L46M35n2k65j03k37k0N54N49mj45K1l10L00
2432C53K54L9o6j52o06l58k1J67K88l03j49m13K10N80J9L21K90l14j2k4N60j26
2454E37M37m20k84k12Qj9o1j47k47o6l70O53R4R1L5j31Pm7K67L23j8m8n3l5R5
2479C89Jj71l42K59q07L71r0j13j73J15J69j5o1L58J10L43J05l02M72j19k23M53
2501G29j94n38J61m9m07j73J50j94q8K22R9k93J87L33p4K13K67J35oJ46j16P3
2523E83l30L23l33k93j03k96k1M2J29k35j52n1K76K24K13K78k97M53l6n9M66l06
$$ y = [526, 238, -505, -754, -291, -237, 226, -146, -682, -938, -947, -470, 202, 390, 329, 122, -337, 315, 488, 1011, 772, 316, 145, -248, 91, -132, 250, 81, -732, -997, -1412, -760, -328, -19, -335, -357, -325, -267, 397, 893, 1171, 572, 62, 16, 224, 391, 699, 549, -155, -528, -716, -370, 65, 13, -252, -355, -592, -612, -58, 491, 487, 342, 363, 53, 353, 607, 646, 580, 428, -178, -536, -557, -390, -102, -405, -554, -967, -757, -177, -158, 163, 453, 139, 127, 103, 663, 537, 974, 554, 270, 58, 66, 47, -14, -161, -408, -474, -844, -191, -97, -6, 29, -102, -95, -142, 125, 448, 430, 382, 329, 294, 389, 390, 219, -123, 136, -671, -300, -390, -503, -676, -561, -392, -407, -468, -110, 0, 343, 448, 146, 618, 499, 276, 729, 535, -3, 158, 109, -298, -471, -321, -515, -603, -381, -282, -575, -388, -55, -129, 84, 351, 486, 480, 626, 510, 583, 253, 576, 243, -50, -153, -449, -470, -428, -299, -534, -686, -737, -461, -237, -24, 254, -43, 410, 374, 315, 781, 475]
2545D75J69j12m74K00l71Q4k3p4n80j63M09J21NM74j11j85J97K74J19J49L0j21
2567D92k28k07P8M90n36J86m78l26m16J83N99m6J48l88p3J61N37N34J17k77l20
2588B30j63K94J17n2r4m21k63j88L6L00J73l40k83l89O48K21M57N63o54l01K07
2609I8K28L29L73o4o60l63k99J28K80l38K63o42J00k14N32m7L42J04k28j56M13
2630A79L43J03O1k32k96j75K63o8K12j41o61k42k55L14M43J7L44p76k74O42K48
2651D9O21l92K97k64l58L28N37l24r8l52m52j36K61PL9K7m15M2j98N18O71k83
2673A25K67j50j01rN21J64k1l09k91k58r2N5M12n53k94l37O9O07J32J56l68L94
2695A19m29M91L60K17k6m83k11K3J94q5j19J02l97m38k19M38K42J64K0k15p3j10
$$ y = [475, 644, 532, 58, 258, -113, -29, -52, -126, -706, -869, -460, -339, -334, 140, 29, -156, 41, 315, 434, 583, 613, 492, 264, 57, 135, 625, 89, 275, -203, -529, -945, -762, -163, -209, -61, -449, -522, -361, 176, 710, 827, 550, 230, 67, 361, 478, 426, 332, -89, -352, -540, -504, -204, -31, -371, -654, -1043, -395, -174, 283, 846, 192, -109, 98, 326, 655, 1028, 964, 304, -59, -358, -230, 50, -288, -25, -667, -567, -781, -249, -296, 46, 150, -78, -234, 179, 522, 625, 686, 454, 158, -17, 246, 178, 390, 249, -412, -654, -909, -595, -152, -135, 209, -567, -841, -199, 49, 670, 278, 575, 311, -47, 281, 818, 494, 396, 44, -408, -544, -283, -276, -237, -210, -625, -583, -781, -263, 408, 125, 392, 242, 141, 132, 653, 817, 796, 487, 196, -62, -154, -99, 313, -240, -534, -871, -802, -195, -63, 93, -275, 119, -310, 181, 541, 758, 732, 249, 38, 61, 255, 170, 51, 153, -244, -682, -901, -463, -221, -57, -37, -252, -325, -435]
2717d35M85M34J3l5j66j40J05K06R5r5q9l80l04j00P6K08o9k90k01J99K81J35
2739f7M0K75j25j46J13O83o8j17k99J95n69MJ78mk16k86j49p3K10l7L23J93P7
2762A35m44L27J69L61q5n0K60n87n1r1L30k31m0k43l04K93k56J99j13O2p2L55
2784g6j44O49k67J20r6j02L03j19L9j21kl10J38m62Q1K13J79l74k28J53L56L8
2806c2j32N47n3Kj17M73m83J17J05j42k28K3j91q8k4l38J56k03J85L24m90M03
2828a86J47j1J26n5O83m92O0P5K54o56J96J63k41j44j79J7K1m09m3L39J00J94
2850d1q8j30K56R3p0M88l5j52J97n53R1j86K02j40k30l24K26nk59O05j69Q6Oj04
2874b36J45J45M20K57n80J36J38j51k14L69J4m02n78J46j39k7M08k26J32m7n3
$$ y = [-435, 50, 484, 497, 462, 296, 156, 261, 467, 562, 467, 378, -2, -306, -406, -330, -122, -191, -481, -682, -483, -202, -67, -27, 248, 123, -23, 90, 773, 705, 588, 289, 484, -85, -81, 97, 93, -123, -409, -558, -631, -421, -458, -135, 58, 135, -309, 18, 187, 548, 463, 413, 673, 86, 35, -56, 274, 43, 3, -240, -544, -251, -507, -308, -421, -359, -431, -76, -220, 429, 162, 282, 186, 84, 387, 268, 307, 186, 184, -126, 12, -450, -369, -156, 23, -351, -579, -426, -70, -32, -164, 383, 330, 332, 215, 688, 205, 322, 427, 285, 57, 80, -111, -199, -223, -561, -405, -608, -423, -99, -589, -186, -39, -50, 76, 21, 704, 212, 272, 347, 601, -55, 141, 304, 63, -81, -260, -243, -222, -631, -674, -335, -235, -41, -129, -259, -3, 90, 20, 508, 473, 321, 518, -35, 56, -130, 72, -68, -298, -622, -396, -401, -660, -55, -224, -138, -132, -236, -91, 54, 474, 731, 151, 287, 425, 274, 60, 429, 443, 41, -537, -391, -530, -557, -149, -375, -243, -290, -343]
2895c43K68R3J78K15l5k37J13R5L51l76Qk84L3l31k64K13Nl3n6r3J55K02K87J6
2919A80l47K04J10P9N01k06K12m23r1k42M00k07j41k39n29N0J12M11LL19o22J99
2941b67M25n10P37N70m68j03l69K96K08m8j78j65l69o5N2l24L51J77n24j24L77
2962c21J63L10L82n49L05k04M0K82K86j98j46l66k97K51j42J95k24k18K7j4J66
2983b72K82k58L06n8j95J11N08P6j4P0k22J4k35J32o1j61j54j54k52P6L61j4N7
3006e7j55M3k22O13N4J58j10j41M7K36j11K41r2m62J9n69K00o8K68J8j61j87j16
3029e54M02J46J38J76j70o0L20j3J89J74m70k60J93l82Q5j16K98l67j43q6J93
3050c07J89J06K48k47p8K10L02m4l7K00p5o11J77l54J41L19k98Oj94k23L8J54
$$ y = [-343, -75, 18, 196, 411, 376, 139, 252, 347, 698, 322, 330, 46, 79, -252, -516, -303, -298, -331, -387, -480, -325, -123, 164, 180, -167, 37, 147, 226, 727, 521, 733, 310, 219, -23, 377, 170, 29, -210, -739, -689, -577, -166, -163, 156, -466, -267, 158, -352, 385, 955, 487, 384, 15, 311, 519, 471, 293, 128, -241, -306, -254, -578, -227, -50, -574, -698, -321, -158, 152, 534, -15, 290, 86, 126, 408, 694, 496, 350, -16, -313, -62, -204, -9, -233, -451, -424, -438, -272, 10, -248, 58, 0, -195, -84, 424, 500, 486, 556, 334, 348, 113, 245, 184, 23, -131, -285, -537, -461, -100, -114, -57, -212, -169, -391, 222, 276, 434, 324, 183, 230, 466, 355, 596, 504, 42, 61, -508, -308, -376, -108, -90, -251, -438, -554, -152, -6, 132, 308, 138, 78, 398, 385, 574, 748, 278, 18, 211, -171, -86, -202, 96, -271, -414, -500, -307, -118, -12, 236, -11, -89, 121, 423, 379, 342, 542, 467, -144, 33, -321, -180, 139, -159, -153, -347, -570, -532, -378]
3072c78J93L47m05OK84J89N5N69n08n6r9J93L1l75R1j44l28J71r3n0M1j21Q1j36
3096d42M57LJ92J17K1k71J42q9K51K1k06q9k09o7R6j64k4l11L31l93L38N7R8J64
3120B3K8k2J12J31L8K61l26Q0P1j46l16J27j10r4o3j9k78J99J41l94J41K02M31
3143B17L0l46L18k4k23K88L25m54P9kk42k61o6J55k36L55k8q5l2P0K2K5l8L31
3167A78n4o8K85k5J39k04j48L44o45M24m32j06L25l72Q1k24J61L24l71K14M69
3188B95j50r0K29K62l48J74O9pl9l78j3K0j06K37m7k84J5n66L98j60K35J89K58
3211A93Pk3R9r7L72l13J15k10k34J10J59l41K61j24k96J04l43M12J8J64k17J82
3233bp5K21L36p4k80j4J80k35J09j67L36o48J25k43J71j29K79k69k1j08M90l9
$$ y = [-378, -185, 162, -243, -237, 47, 236, 291, 860, 352, 296, 197, 390, 421, 46, 137, -7, -335, -164, -257, -307, -266, -387, -306, -442, 15, 18, 210, 327, 348, 77, 219, 130, 381, 402, 196, 107, -102, -169, -73, -237, -261, -572, -241, -634, -296, -239, -141, 23, 51, 29, 141, 272, 310, 571, 245, 325, 396, 250, -66, 61, -49, -143, -206, -225, -503, -304, -163, -557, -416, -214, 217, 247, -99, 219, 195, -28, 260, 585, 131, 210, 208, -34, -295, -361, -206, -442, -87, -115, -200, -232, -162, -140, -115, -153, 178, 124, 56, 341, 316, 455, 251, 103, 447, -198, 226, -206, -312, 13, -359, -278, -502, -341, -17, -388, -174, 295, 145, 55, 284, 546, 198, 372, 441, 434, 395, 17, 4, 24, -82, 155, 108, -176, -161, -727, -329, -489, -254, -65, 193, 200, 177, 276, 179, 551, 238, 353, 143, -91, 19, 178, -163, 98, -26, -322, -218, -561, -149, -131, 33, -184, -2, -77, 144, 480, 406, 126, 112, 292, 57, 166, -1, 335, -313, -188, -431, -260, -389, -110, -379, -400, -508, -18, -57]
3255e7P8L80l3j15j44K04ml5j4l4k87k33K13l26N46k07m8Kj47j12J89L13k31m9
3279a51L19k39L83k3J78O2j92l12k66K39j2J60k26j77l37K26J61k3K37j92j20
3300c05L1L57J8M6K47%j73J19n57K95N8l33R4k20J36L9J12R0j56Mj48K59L15P
3324C35J32o34K09J50J45lJ28j0m55M3l70M35j00K15k69n72M64k73L47k7M16n21
3346b15L74j56p0L53j54J75r1m50O3L89k66J03j20L18o87r9M34R8k42J14O0J49
3368H0P4K86l08J30n9M9k87J99J89l61k1n3j73J2R2L6j75N5j8Q3j44L26K2J86
3392B20j82L05j67K16q3n8j6o2l61N0J55M5l49j5K37l69N13k26L40k08L8J1K59
3415B93k37K57J6J80l97j14l45O44l66j1O8l18J17L00k21O5o3Rr1L07m7rK74j92
$$ y = [-57, 21, 401, 368, 253, 109, 313, 309, 274, 260, 226, -61, -294, -81, -407, 139, -68, -116, -114, -261, -373, -184, 129, -102, -151, 168, -71, 312, 289, 467, 529, 337, 25, -241, -2, -14, 146, -80, -257, -594, -368, -207, -230, 7, -185, -305, -274, 83, 101, 147, 394, 394, 221, 340, -217, 78, 136, -197, -103, -323, -187, -148, -36, 54, -102, -98, -246, 13, 328, 335, 467, -167, 42, 192, 337, 334, 462, 452, -3, 40, -330, 105, 5, 220, -49, -621, -157, -430, -83, -110, 306, -215, 159, 3, -67, 286, 132, 307, 216, -234, -171, 218, -48, 55, -65, 253, -434, -533, -99, -1, -243, -129, -69, 80, 154, 440, 132, 262, 203, 252, -35, 164, 353, -8, -29, -82, -255, -243, -151, -115, -290, -235, -253, -170, -314, 12, 34, 220, 38, 343, 176, 392, 309, 251, 235, 173, -188, -138, 17, 62, -287, -302, -65, -434, 79, -147, 193, -15, 23, 34, 293, 56, 313, 329, 509, 112, -2, -347, 297, -69, -80, -12, -330, -213, 87, -134, -69, -132, -123, -214, 93, 46, 37, 311, 119]
3439A19P9p6k79K97L47j76k19K2j88k54j5L4K6L2l5j9M1J95N6J98j3J7L31m66
3463E4K57J78l38r6r5k37L42j76K41m64l2N7p1L92J0j07P6L7r7Q4N4J49k3o2L
3488A36Q0J26j17j66j20j01q9R3k11L6K05q8qK78jR0m1Rj39L59k36j77J89J96
3512C03j39j33L38l64j62P5j25j26K83O6Q9j81j13K19K74rQ2O1l82K87j32K43
3534D54n38J00p6J54k01k36J97k06K48Q1k82l1L04J2K30K44m66J86K25k37M75
3555F37m83j37P6k90J12J5j4l94L72L6j49o5J03L39k75J56k55M77n5j13L70l06
3577A57j47lJ29k63J53J81m61K13j29J75k47K1J88p3K9O3J75j5J6j09l5P4k18
3600a26L45j96j9K90n68M13n41M88J4j18j97J00k96L27K01NJ30j09J9k78K85l6
$$ y = [119, 198, 122, -157, 140, 487, 311, 92, 114, -74, -328, -343, -309, -283, -251, -286, -305, -264, -69, -13, 185, 172, 189, 520, 54, 311, 489, 151, 55, -40, -277, 65, -111, 130, -334, -366, -309, -380, 12, 22, -85, -9, 28, -69, 15, 69, 218, 195, 133, 136, 216, 342, 225, 59, -61, -162, -251, -158, -369, -333, -128, -216, -224, 54, 53, 143, 102, 111, -28, 331, 95, -82, 107, 303, 164, 31, 369, 5, -157, -82, -207, -333, -50, 16, 105, -76, -189, 30, 304, 295, 377, 438, 56, 343, 211, 454, -84, 16, -60, 94, -107, -343, -146, -352, -104, -23, -305, -336, -32, -20, 210, 454, -12, 174, 399, 162, 637, 154, 17, 93, -197, -85, -70, -84, -478, -106, -70, -219, -284, -181, 158, -117, 39, -216, 261, 206, 93, 463, 157, 10, 7, 136, -127, 26, 207, -254, -41, -170, 5, -242, -221, -33, -106, -77, -14, 161, 146, 162, 53, 18, 92, -126, 219, 23, 4, 294, -274, 139, -402, 86, 100, -18, -215, -115, -411, -84, 117, 122, 252, 143, 162, -116, 169, 133]
3622A33J43j44M4k99Q7k61K42P2l07K17J16j42j14K6K35j64J32R1K09m24Q18m29
3644B81j34k74K1J51J26j21j68J44j54k42M01l4m9J75ol15l8K44J84o1n1n6J11
3667A35j4k2o7j57m6J15k19J36K63j09j99j31R5K85Q3l6k10O9J18p5J19L8J98
3690C69j67n5l05J44k74J84k54k2K50n6J2k87O70j07Nj47J55L05m29J85J31j56
3712A51q3j95o3M85K6l07l2l40J47J00r6K25J3Q0j65qK31n5k7j37L22r2J74n61
3736b07j05K15K82j98k2j76J4J82k77N0J41q1M65l66O9J25j98L35J62j89j52K20
3758B89o44K95l23J28K4K44Q4l90N8j07J73J27K39j73L2j42J67l2J26P1j9k80
3780e3j46qO2M59l24k01R4j06rJ37J15J07k57R2n7J85k46M03p1K8j00Q1j38j83
$$ y = [133, 276, 132, 176, -123, -36, -297, -55, 17, -290, -73, 43, -99, -213, -187, 48, -116, 16, 107, 316, -108, 710, 281, 147, -127, -106, 45, 171, 50, -118, 26, -128, -370, 31, -3, -52, 123, 117, -198, -236, 8, 192, 131, 80, 24, 135, 121, 99, 32, -125, -171, -56, -275, -139, 124, 15, -184, -315, -220, 65, 148, 112, -98, -29, 89, 14, 133, 171, 369, 202, 147, -158, -14, -288, -104, -358, -380, -130, -186, -174, -461, 209, 102, 107, -40, 115, 420, -9, 176, 307, 151, 68, -127, -190, 295, 321, 14, -18, -358, -211, -111, -207, 18, 31, 111, -54, -62, 169, 114, 87, -50, 272, 180, 354, -207, -312, -97, 185, -13, -35, -211, -197, -15, -292, -242, -101, -182, 283, -83, -14, 111, -87, 248, 410, 221, 69, 289, -355, -60, -383, -255, -231, 13, 97, -293, -235, -342, -169, -42, 197, 24, 56, -86, 81, 49, 175, 246, 227, -53, -199, -207, -145, 314, -10, -211, -117, -223, -232, -95, 20, 127, -130, -38, -95, 90, -156, 247, 176, 204, 104, 185, 47, -136]
3804a36M92k88l6j54j29j6K40j39j94K31K65m51M48J15l0k41J05K48j38rJ8k32
3826c1l8k06O9P9j56J60j9J88j76J37L9o8J2K15J8q8j44J86J3k6j92L5k75K78
3850A0j76l3jK5j6L08m25K40L7k2L05m3Jk3n6j57J9L55k04r6k48L55j43J28j82
3875d2j84q0J25J40r9J23P0k12J70K78M3l31k6P2o8J01m8M65n08J71l42J72j72
3898a82J68j13K5o7p7J31l3Q6J18k5K70q7L3k40M23k34m23L63k38p2P1j76L47
3921F8j70k09K97k05o3J79j55K16J67R8m09K19J72o9r9j34J33l10J66l6M21j40
3943A37k40P3j77Q5k4O6l2L41j30j5J88Jo01L47l83M04N8q9J5m1j86J85j63p9
3967b60M71k89j70M16n03K43P2K93J9j89n9m7p2NJ74K6%j63q7M9J29j41m1j3j54
$$ y = [-136, 356, 68, 32, -122, -251, -267, -27, -166, -360, -129, 136, -315, 133, 248, 218, -23, 82, 330, 192, 183, 201, -31, -69, -275, -206, -127, -283, -123, -142, 46, -130, 7, 46, -22, -10, 205, 223, 135, -9, 177, 190, 164, -28, 7, -268, 10, -166, -199, -200, -175, -191, 117, -308, -68, -31, -53, 252, 209, 210, 187, 131, -26, -7, 348, 144, 48, -200, 155, 12, 140, -42, -226, -306, -181, -41, -140, -17, 53, -159, 11, 289, 332, 1, -25, 47, -21, 80, 32, 497, -11, 160, -182, -10, -182, -14, -127, -102, -169, -246, -115, -148, -62, 56, 31, 301, 214, 247, 7, 430, 196, -227, 136, -102, -174, -103, -279, 68, -102, -311, -14, -219, -282, -103, -258, -42, 125, 223, -186, 33, 205, 136, 37, -97, 36, -274, -108, -144, 277, 137, -103, -30, -207, -122, -146, -80, -112, 229, 99, 84, 272, 273, -328, 19, -364, 40, 98, 9, 24, -17, -203, -18, -181, -260, 211, -78, -248, 168, -335, -92, -20, 273, 292, 103, 44, -3, -75, -70, 104, 130, 130, -33, -120, -71, 58, -83, -124, -137, -291]
3992b91K26L33k88L43%m2k81J36j37J16k14K34j10l9L3K7o5k75k9J99N7j10K50
4015G3p8n7M0K17R8l15Q1QJ28P6j70N2n0m4L8l5q0P8m66K20qJ05k82M53j49P4
4041GL56k65J27Qj31K14j62j32L06l98j64Q4j32R3K36j57k47j10L69Qj82M74j66
4064C6K31j36K4P1l78K34K08r9j46J36k94r4N1L87n17K45L9j98J52K25k1q3P3
4087A46L0r7j26o4Q4L52J2o03L59k10J6j54p1J75J93j2m0Q0j66l0Q6l5K20K22
4111C67k37J46j98P1q7j35j06J85J24l3k65Q2k57J60K68l27J63M87o79M49l75
4132a97L76k85J46J34N1k28O9o9q2P2j8k2j14J19P8j61K18k23K2J89J9o1K98k21
4156A10n8k6m7K98j22j78o5k8M5n3J90l31L20j91j77J90K4mR9K66n54K86J05K9
$$ y = [-291, -65, 268, -20, 323, 323, 281, 0, 136, -1, 115, -99, 135, 25, -14, 19, 46, -19, -294, -323, -124, -67, -177, 73, -5, -62, -22, 195, 293, -22, 59, 67, 195, 271, 101, 153, 103, 59, 97, 62, -18, 60, -406, -186, -194, -89, -371, 82, -67, 7, 363, 98, 225, 233, 102, 316, 154, 22, 328, -70, -234, -150, -282, -189, 47, -110, -357, -467, -98, -90, -272, 202, 36, 267, 131, 155, 226, -152, 82, 290, 191, 45, 181, -113, -207, -156, 231, -286, -41, -2, -200, -48, 177, 156, 73, 146, 176, 79, -47, -111, -27, 325, 337, -266, 93, -117, -101, -255, -326, -151, 42, 30, -10, 70, -96, -126, -40, -75, 145, 367, 130, 276, 78, 149, 62, -73, -179, 6, 130, 97, -168, -86, -343, -183, 85, -242, -79, 408, -271, 178, -197, 179, -106, 40, 174, 225, -3, 66, -3, -85, -13, -31, -53, -167, -48, 30, -131, 87, -136, -114, 75, 94, 33, 331, 110, 52, 26, -21, 277, 155, -23, -88, -116, -71, -124, 66, -265, 55, -136, -313, -123, -99, -103, -4, 262, -292, -6, 99, 128]
4180A28J50k54j26M3J73j57j2J60l29L87j29m23M39K5j36O0j38J95P4j55K83l86
4202a28N2R3K32j23j47j37JJ01q8j38J85O0jP8j69L42k36l6M2LQ1r8o1J97l7O6
4228A34o4j26k57J96J09M0o4n5R9k05J31q5O76n21M9K67k63J60k08M8j69K31J01
4251B24k77J17M2l18J43l22L35k09N1M38l2j98k38L20J00Kj96J32O4O7r8R2k00
4274C9k64K21o0k2j53j05q3K06K10n1k43M17J30J99k90j68J24M1M95n64K31k89
4296B1j46o4K29L03m29p8L36k95K02m4j4K19r6k52o0K37n3K38o1J87l3m95L61
4319B13k78K15j39K1J7k29J46j23J15OL1J35rJ23q9j1Q8l02L07k02k0J8q2N7J24
4344A32j59J81n6m08L26j80L6j69O4N13n5j49j92K10L31j88k92J96j94O8k4j84
$$ y = [128, 278, 24, -102, -59, 114, -43, -55, 105, -224, 163, 34, -389, 50, 75, -61, -1, -139, 56, 130, -25, 258, -128, -76, 17, 249, 126, -21, -158, -157, -56, -144, -282, -97, -37, -38, 40, -129, 213, -23, -59, -17, -14, 67, -31, -92, 105, 68, 134, 70, -56, -313, -117, -8, 32, -32, -87, 12, -193, -62, -147, 529, 8, 57, 324, 61, 221, 13, 61, -108, 123, 224, -53, 64, 106, -212, -69, -391, -56, -265, -214, 224, 192, -6, -244, 76, 176, 178, -18, 114, 178, 245, 147, 239, 39, -225, -4, -64, -86, -239, -344, -427, -221, -11, -62, -305, 112, 242, 441, 151, -17, 107, 148, 643, 79, 310, 21, -125, -189, 40, 343, -86, -164, 172, -123, 79, 35, 21, 240, 144, -108, -168, 69, 16, 254, 193, 380, 347, -148, 213, -65, 150, 11, 32, 49, -180, -34, -157, -42, -36, -5, 130, 121, 244, 155, 144, 232, -70, 237, 35, 15, 33, -49, 8, 132, -27, 154, 98, -310, 16, -164, -128, -297, -233, 280, 225, 76, -116, 94, 425, 237, -55, 141, -53, 15, -9, -193]
4366a93L2J19l8o4j56J31k8L94qk82R5j2j42L18N1m8n6k33J51j64p5j07L96j94
4390a13l3P2j65J34pJ9N9j80K76j09j16L84l14L58j29j20k90M04j15l56J12J03
4412a26j77J17j79L40J18l5J06k3l04J00N7k1P5N5N7P0M8k29n7m10M99k02j43
4435b64M70k71K53k85M3K92J3j86R9k42n7K0K51K28l50K59k85lj55J70K0Q3m9
4458E4k4k09j59J80K77P2l09J37j00M06m64M79k96R0l59K09K46m00Q5n5r4K51
4480A7N3m12M50jk73%J07Q0j54K57j24J0M0K7K27k17k52J4J03N3qj69J74j82J68
4505a2p9J92p5j06J62K30k78q8N3m6K97l22Q8k50P4J46J02j66p0J58k24O0J07
4528d7j12j28M59nj12j63J73J65j70m0J45J49j60j84J73o3k04r8M7N7K09l00k0
$$ y = [-193, -161, -42, -80, -144, -300, -169, -197, 197, 189, -93, 2, -10, -152, 166, 217, 169, 113, -120, 31, -133, -208, -315, 81, -113, -146, -74, -239, -105, -112, -93, -34, -214, 62, -47, -163, 221, -93, 265, 136, 16, -274, 130, 15, -341, -229, -126, -303, -186, -365, -25, 93, 58, 164, 141, -163, -63, -6, -27, 48, 103, 160, 230, 278, 49, -8, -418, 81, -121, -264, 206, -65, 188, -97, -54, 238, 251, 65, 164, -78, -135, -115, 136, 364, 14, 273, -12, -15, -170, 0, 20, 103, 54, 30, -179, -338, -158, 119, 191, -118, 19, -81, 325, -139, 340, 44, 134, -225, -16, 230, -170, -85, -140, -234, 17, 70, -342, 108, 107, -166, -166, -59, 21, -133, 124, 0, 10, 50, 77, 304, 87, -165, -151, -48, 5, -3, -172, 2, -180, -12, -91, 101, 26, -80, 82, 312, 34, -54, -1, -47, 250, -72, 16, -234, -160, -14, 88, -78, -148, 10, -214, -154, -47, -159, -287, 172, 167, 55, -108, 65, 230, 60, 20, 165, 314, 154, -30, 143, 80, -124, -222, -175, -118, 91, -209, -229]
4551b29l2J25k9K40m3M5%N9J90k55p1k0K37k97R7k8K6P6k9K3P4l41J19L63l16
4576a6j73M7K21k02K31o3O3L4q5p7K29k67j74K34j78J53Q4q3L6K1m51M06K15k86
4600h1R0o7QL24q4j77J25L4j05n6j32J64j88L07n12p1M1K78rL71k14j74m8J69
4624gR9J50k8j16j05k10J26J96j51J30n1j02K34j46l0K81J3m14K32p7pn1K01k64
4648i7K64j42o7J91j79j35J45j47L0O1j54K44n88O72M2l69J65K12k7r4l3J27P8
4671A99j30l3R5k22j07K68Q2k02K24j97j17J12r5r1J00R0%Nj9J72k90J29nJ73
4695A41oj62M1o0M3k76k25L04L96r8r9kq6j33K68K0o0J39j91K75k41qj04K55M2
4720A73m38L53j09L1p3j24l07K35J98J29j56j31M13j91J44P8l02M59k83k92K42
$$ y = [-229, -261, -136, -165, 75, 32, 77, 77, 136, 326, 71, 0, -20, 217, -80, 17, -11, 15, 91, 62, 85, 159, -182, -63, 300, -16, -189, -142, 79, -123, 108, 45, 108, 142, 57, -20, 209, -58, -232, 2, -176, -23, 61, -22, 14, 35, -416, -10, 205, -81, 9, -58, -50, 274, 190, 13, 138, 172, 67, 11, -121, 43, -145, 162, -350, -421, -380, -102, -111, 260, 46, -128, -176, -7, 92, 242, 214, 98, -7, -217, -91, 105, -46, 84, 33, -69, 165, 19, -11, 270, 283, -131, 101, 24, 17, -34, 167, -97, 167, 25, -42, 149, -30, -165, -20, -167, -137, -76, -230, 14, -574, 98, 140, -229, -64, 148, 121, 27, -6, 121, 199, 69, 36, 131, -91, -198, 70, 152, -50, 174, -23, -140, -28, -123, -214, -114, -24, -24, -19, -38, 134, -156, -27, -32, 141, 135, -27, 14, -46, -3, -279, -504, -200, 196, 98, -1, -3, -89, -222, 46, 66, 6, 145, -46, 229, -12, -20, -124, 131, 173, -265, 88, -21, 10, -63, -187, -494, -259, -61, 68, -88, -219, 194, 3, 147, 225, -77, 382, 99, -193, 49]
4741D9K44l63n2K97j52N8k34m7J89R2l60L49L4j58p0J74j52K86k24o3j33M62o5
4764A61j92K01j92j32J84K9l47R5j57R7L60J29j57j01J12k69M1J45J38k08J78
4785A15Q7J13j07j96j71K33j88O3J09k8kj43K64j80j2Q8J27q4k29L48K4R6l53
4808b6P2L76l56J33j85np9L9J10nj66M4o3J46N3j01M4J48q7q7j21K30L0k03Q4
4833B5j65J11k7j64K20k36K94l52j92M87j87K18J51k38n0J3k1K27L2L9l26K60
4855A19K1j46j8K12k34n8N6j7J7Q9j58L46n06J05J17L35j35N9k47oj06K79m6m7
4879C1J00J12j36k40J29j50j21J9L51m58L36q1o1P6M29l01J34r8k06L38j30m5
4901B8j40O8m7j82J35J86k24J34M9N0k25L40k58j11K39k25M81k28L37m79K3O0
$$ y = [49, 293, -70, -122, 175, 23, 81, -153, -200, -11, 81, -279, 70, 104, -54, -124, 50, -102, 184, -40, -103, -236, 226, 161, -31, 170, -22, -154, 30, 59, -288, -193, -350, -253, 107, 236, 79, -22, 90, -179, -138, 7, 145, -63, 115, 202, 315, 208, 12, -159, 74, -114, -51, 58, 30, 28, -115, 149, -31, -43, 45, 172, 88, -141, 207, 231, 327, -26, 46, 422, 66, 199, 14, 9, -70, -31, 79, 74, -92, -48, -111, 35, 88, -13, 31, 179, 92, 5, -116, 114, 144, -59, 25, -140, -29, -56, -220, 0, -236, 58, -294, -486, 1, -186, 32, 183, -55, -105, -92, -113, 114, 146, 185, -141, 119, 140, -6, -24, 188, -46, -104, -48, -65, -48, 41, -117, 229, -277, -172, -55, 280, 145, 204, -43, -49, -155, 124, 78, 31, 131, 243, 107, -133, -4, -154, -275, -256, 95, -363, -27, -108, -169, -93, 336, 35, 169, 71, -135, 203, 73, 28, -112, -44, -91, -273, -138, 48, -176, -42, 7, 57, -168, 172, -86, -197, 42, -183, 298, 70, 407, -72, -49, 11]
4923A1q5n3J41K59j15k22j93L75j14P9k15n5N9K60k57J88O8n8l4J44l48K94R2
4946B21m18J96k79O0L7J86N8l20L38j94j6J31j52K75j94K60k2j29p6J97j08Q9
4968A40k72j13K73j3M3k25J58j35K74k43J57J34j83J14j61o8L28l1O4k56J38j37
4990a4K4j45J34k06O8rL24R0l08q0O5o7K02J12j8j47o6j45J97k5O3n0qK19n20
5015c10J05J66o2J84J29k20r8J97o1m3K81n35J40K48k12K0J77J24n40J82PJ31
5037A0k49M92l28J15q4P9R5k29K76j36j22K85j67j56J57N9J55j45J48l34J22L
5059D6j4j51j9K10j59oK30p5N3k6k37J00P3k1k5J47k97L93j7j08M7j90J08k63
5083b01M8J18n6j49J12JJ71k26J64K33k63j18N70l60k60N37l19K50r1l31K01j11
$$ y = [11, -74, -127, 14, 273, 158, -64, -257, 118, 4, 83, -132, -187, -128, 132, -125, 63, 131, 73, 39, 183, -165, 129, 221, -197, -1, -280, -220, -183, 3, 61, -259, 79, -115, -131, 0, -152, 123, -71, 189, 167, 38, -38, 159, 51, 140, -132, -245, 28, 15, 58, -167, -9, -144, 130, -113, 44, 178, -5, 109, -52, -120, 208, 177, 241, -15, 123, -14, 10, -135, -1, -207, -139, -148, 176, 266, -42, -122, -57, -124, 78, 190, 172, 25, -41, -186, 11, -14, 49, -1, -9, 210, -310, -205, -39, -101, 83, 212, -8, -106, 91, 30, -13, 268, -267, -127, 121, -91, -71, 106, 230, -310, -128, -121, 10, -239, 253, -75, 40, -44, 35, 130, -99, 177, 41, -81, 204, 37, -119, 38, 97, 252, 107, 255, -79, 43, 46, 32, -119, -138, 72, -87, -93, 137, 62, 115, 89, -148, -48, 25, 4, -21, 126, -171, 222, 205, 97, 144, -46, 62, -201, -153, -35, -91, -240, -128, -127, 44, -182, -18, 215, -48, -166, 404, 44, -216, 321, 2, 252, 161, -170, 31, -80]
5105h0J9P7O1o0l1n5J66l16K27J62j76L02j70k42K18K01m07L54l35J41k01K33
5127H8p0K2n6O1l40L07j34oK26p9J57j65j36K10k3Mm5J99j22j30j48m3L29k65
5151a59J70j90J24o1o3J55j26K82l3k38J88Ql28L98P5n3j1J22k37j68Q4r1J12
5174d0j63Q5%l9K60j60K51k83J26Q9k24J22N4J83oj28j14P1k26k21M41j79J34
5197C3K3k08j25K22P5J04m5q7N0j31J69n5j38J28K57l09q8j29M84j97j01o5M98
5220C65m75K0j1J01K41m78J37O9P1L4K03o8l62L59j59o2L0k11J42P2j2k41L52
5243A17l67M6P8j19R2O3L37l24L7Q1p2j46L70k6q1l11M75m77K20J10l65K43l0
5266d9K3l01O46m60J51n1J99J14j57K09k42L3l01M67l66m9j5J14R2l07K66k18
$$ y = [-80, -61, 16, 77, 17, -14, -69, 97, -219, 8, 170, -6, 296, 126, -116, 102, 303, -104, 250, -85, 56, -145, 88, 18, 40, -16, 45, -295, 12, -122, -128, 98, 19, 176, 11, -125, 85, 62, 66, 21, 220, 98, -32, -180, -223, 106, -159, 11, -179, -55, -116, -179, -24, -150, 132, 99, -139, 49, 57, -271, 127, 202, 149, 138, 260, 23, -145, -61, -152, -40, -203, -118, -118, -157, 103, -57, 194, -89, 37, 126, -98, 24, 78, 261, 255, 127, 13, 84, -142, -363, 78, -101, 33, 56, -152, -277, -55, 20, 124, 79, -8, 42, -89, 80, 25, -113, 15, 272, -37, -125, -254, 230, 33, -68, -133, 365, -110, -90, -101, 0, 241, -237, -100, -31, 40, 74, 277, 209, -153, 206, 47, -15, 15, -196, -54, 18, 6, -235, 117, -250, -204, -126, -245, -153, -90, 247, -77, -40, 41, -31, -177, 193, 167, 86, -225, 250, -227, -7, 103, -262, -19, -49, -26, -327, 319, -141, 10, -41, 158, 272, 115, 324, 82, 115, -186, 281, -85, -134, -149, -35, 57, -250, 16, -202]
5288b02K68J68l11J7R0Q1j23o5n7L11j23k1o7k08K30K70r7k41K18m59L78J94j23
5311A28k42K45k40J9J14k08o0L29l5J22k60J21j14K13j7J38k13k06k5J34m1j11
5333b09J49l9J1J5L05k52q6J80j63j27L14j28K70k25M3M9O3m3r4K8q5j84K8J74
5357fM8k9j9j1J69j36J11k22J47l77K45K95j18j49M09j83l70J41j67J15K30L4
5379A57j79j79J22OL13O1Q1j59k91K38j67m6j02K85K61k07l15l0Q2K03j32J58
5401A60j33lj49P9k01k0N26j70j13J43j67N0j97K51M9j84K15J3l28J50M3N2j54
5424h8J44nj42p9K2L65l81L06N1j41o4Q3q3j73N54l95j81L10k90K58k67L5L13
5447A52j71l62K95p9L02k71R0J28k02J70K30j77J08r9j75l7o6k10L08j23K80j37
$$ y = [-202, 66, 234, -77, -60, 30, 111, -12, -77, -134, 177, 54, 33, -34, -242, -12, 258, 161, -80, 138, -321, 57, 251, 128, -114, 131, -109, -90, 24, -184, -244, 85, 50, 172, -88, 33, -81, 132, 115, 253, 40, -166, -191, -57, -98, -209, -60, -99, -88, -73, 232, -20, -106, 74, -89, -216, 98, -30, 240, 15, 58, 107, 170, 127, 33, 61, -24, -208, -180, -6, 42, 13, -6, -17, 152, 16, 127, -95, 52, -325, -80, 215, 97, -52, 357, 174, -196, -55, -222, -107, 123, 157, -22, -201, -79, -73, 240, 301, 382, 223, -68, 170, 3, -43, -145, 140, 401, 194, -121, -151, -69, 134, 2, 160, 27, 24, -125, -46, -247, -267, 259, 89, -24, 119, -48, 2, -195, 56, 105, -79, 136, 149, -179, -29, 14, 66, -88, 56, 51, -91, -170, -148, 217, -164, 142, 193, 52, -12, 71, -12, -185, 369, -26, -207, 103, -187, 71, -196, -161, 152, -19, -381, -86, -165, 137, -134, -44, 84, -118, 52, 282, 105, 213, 114, -61, -98, -164, -374, -66, -189, 91, -46]
5469d6j51K14l04J40K34L2j45O1K24l89J05L46m81L00J01m13L07j60J5K03k81
5490h8M6m4p5M4J58K69l09K59k32P6p4K09q2j19Q6j50J62j54l39M19j83K41l46
5513b26K06p7J30J74k28L15j94j6Q9l1n67O30j52J30l02Q6R5K01j49J07l62J28
5535a3k17N34l32l4J71j18l50N19k98L09j56j8p8k3q4K95j65L16m44P3P0q0R4
5558b9q1M1kM1L2o3Q3J76j17L7j4R3k48Q0M5n0J57k00k18r6L68n33N92l30J08
5583a28L2J5J49J00j04l86K22L64k80Q8N1l15p0L26j33K9n8n0m3K50k10J31o7
5606h7m3l7P2j9j18M38j43j43j69J21L20l73K39J42n02L11J1k4L5p5O1j32K2n2
5630a45O3j5M05p24L32J73l27K31K2n6J95J22k39P0k17M0j05K88j06l85N06j38
$$ y = [-46, -197, 17, -287, -147, 87, 119, -26, 35, 259, -130, -25, 321, -160, 140, 241, -172, 135, -25, -10, 193, -88, -42, -86, -161, -117, 41, 310, 1, 260, 28, 104, 30, 239, 157, 38, 124, -26, 136, -18, -357, 62, -121, 120, -226, -20, -97, 33, 207, -21, 294, 100, 84, 173, 142, -425, 205, 53, 183, -119, -33, 62, 263, 114, 221, -141, -13, -230, 304, -28, -62, 109, -9, -359, 160, -138, 171, 15, -3, -81, -104, -188, 107, -58, 258, -186, -113, -43, -123, -29, -110, -69, -71, -30, 2, -61, 22, 198, 81, 118, 104, 197, -51, 29, 74, 24, 181, -19, -237, -333, 35, -498, 94, -236, -128, -96, -81, 68, 168, 64, -322, -100, 264, -16, 72, 123, -192, -262, 64, -69, -40, -98, -148, -191, 59, -151, -20, -87, -130, -167, -95, -114, -232, 206, 63, -80, -249, -128, 192, -181, 58, 200, -302, 9, 20, -4, 31, -44, 17, -115, -93, -145, -82, -97, 308, -416, -84, 89, -238, -7, 15, -41, 154, 276, 37, 107, -110, -70, -175, 113, 7, -378, 128, -10]
5652a0K76m01o1M19j70K31m17K5j17K1J47J27j56j02J77j08Q2l42L35j45q5L12
5674C8J52j83J58l5j59J26m9K1r0J61j71K38k73K4J17J3nk30J71n7K32k57j03
5697a61K04J5J21j38J92m10M61j95Op0J18K00j88l72L09k66K61O1m01K25j1RJ0
5720b0j01j68L90j30O1o5Mk4lL4K98l36J87K7j64k47K42J55k46r8J41M9j7p7j09
5745b17K95k6K22k97j64M96p9j54j40J09O5m0J06l62K74j77J20K10j19lRJ18j11
5768A35M9j39nR8L7k37K50k11K04j74m09L57P1k13K03K10m19L44K9k71P4k34K87
5791C6J97j33k28J86l01J21K32m64M33k25J81j64L5K58j97k34K93k10J36J91k13
5812g0J5r7N7J82K8l16J28J29k00J06M0J54j60j75L27j53m6m0L73k60M7l0P5j93
$$ y = [-10, 266, -135, -196, 223, 53, 284, -133, -108, -225, -204, -57, 70, -86, -188, -11, -119, -37, -379, -44, -189, -274, 38, 190, 7, 165, 130, -29, 97, 48, 69, -21, 140, -31, 207, -66, -42, 75, 88, 83, -147, 24, -33, 199, -58, -161, 43, 58, 179, 41, 233, -177, 284, 89, 95, 25, 143, 343, 155, -217, 92, -174, 87, 148, -253, -28, -39, -30, -20, -121, -289, 101, -29, 32, -33, -29, -53, -56, -22, 276, -60, 127, 154, -10, -257, -15, 140, -106, -204, -63, -14, -31, -108, -217, 78, 52, 274, -23, -187, 309, 230, 76, -64, 45, 110, 70, 176, -186, 88, -89, 31, 241, 122, 119, 128, 246, 135, 184, 45, 40, 138, 175, -62, 188, -23, 181, 7, -402, -45, 26, -187, 16, 226, -193, 151, 180, -91, -17, -251, 36, 233, 100, -128, 58, -243, -122, 110, -354, 79, -146, 35, -129, -94, 164, -33, -267, 26, -184, -48, 143, -70, -55, -152, -95, 87, 115, -201, -73, 56, -144, -38, 2, 156, -4, -179, 148, -5, -51, -91, 282, 22, 69, 39, 114, -79]
5836g9n8K34Q5j99l5j13J67o2R1q9r7j31L69j21j9L20j28j11k44M53p1j9r7j30
5860h4N2J90l95L96J5l8k67K58l12RK32j76J44j48j69L96k29J97j20K88k45m0
5882d6J20J22k11K17jj96Q6l0j72J40J7K7O8j92q3L5L21k08L04k07q9n4K16j45
5906C9L5mQ9Jk89L77l71o6J69J12k56J81J78K3O2l35L12k3l15K23Q4k97k8P5L
5931b1J46k09m0L01k87l43L38M3l9J07j45K51j51J90j66L8q6J34n8Q4j51R2j18
5954i0P6k41K44K1k03L42p6L06l56J94n5qN9l19j36J66K39O1k64K43j89P9l58
5977b65M46j61J93j57k60m6J57o0L55J2l22O6J60j14m5M6n0J2j04J13j62K64L1
6000A09k8k69M37o16M41l04P8J43j86L11l69M67l65J94k63L10j3J9R1k24J99j65
$$ y = [-79, -137, 97, 182, -17, -52, -165, 2, -60, 31, -58, -155, -286, 83, -38, -57, 263, 135, 24, -220, 233, 162, 143, 46, -84, -32, 158, -237, 159, 174, 136, -131, 127, -185, -176, 56, -120, 24, -124, -293, 103, -126, 71, -49, 239, -6, -46, 74, 196, -15, 202, 201, 5, 91, 61, -111, 29, 46, 73, 141, -51, -134, -99, 222, 14, 318, 111, 22, -32, 184, 39, 74, 70, 159, 160, -129, 248, -123, -189, -20, 92, -164, 17, 195, 218, 280, -55, 257, 234, -81, 142, 226, -71, -99, -24, -21, 125, -84, -124, 177, -110, -453, -115, -72, -111, -4, -149, 102, -49, 141, -25, 13, -73, 61, 3, 87, -64, 28, -90, -14, -255, -11, 10, -193, 149, 73, 379, 23, 217, 162, 154, 213, -106, -242, -76, 163, 224, -40, 203, 14, 93, -265, 181, 20, 213, 56, -204, -250, -93, -153, 202, 214, -108, -42, 118, 4, -41, 5, -45, -33, -137, -24, -186, 78, 109, 81, -188, 249, -367, 74, -230, -152, -9, -195, 116, -253, 214, -151, 43, -220, 90, 77, 96, 187, -37, 162, -3]
6022cj76L14j26q7r2J97m9q1L50l33nL01m06L30m6RJ68k46N1j15q3JJ86m03M37
6047I3m5J99k69l63M02r6K28n9l50L66j0P8l1j30n0j09M58j30j48m2J14N8j79
6070a5j16J36O4J3k06J87m1j85k15J52L69k78LK76j34J03o7l0j10J74J4m50N65
6093B09j38l92L78O8j49N3n2L4J30j67P1M3l28N8K95J01n8j85L53k68j71Q7J53
6116A25l12K93r6p9K78j35K4k17J08J00j70K62l61K17PJ57j76p7j3o2J69R0mm3
6140H5k37K34p3j4J27k33M2oJ58l2lJ14k03J55k64N55j66k05m8R6L0K4j60q9L3
6165h0j73l0K75J02k68N62m11Q3K8K2q8j53J41l3L8j70M04k19j25L31k90k7l6
6188a17K01m14N31j93o2K10r1k08L47l81L28j13k37K60r7j3r7L69j78j53L51m10
$$ y = [-3, -179, 135, 9, -78, -170, 27, -22, -103, 247, -86, -91, 210, -196, 134, 88, 97, 265, 19, 70, -45, -128, -127, 59, -344, 93, 48, 247, -22, -385, 17, -79, 149, 90, -260, 106, 96, 174, 143, 13, -37, -146, 312, 182, 34, -8, 106, 164, -15, -131, 5, 69, 82, -124, 63, 22, -163, -378, -226, 143, -135, -132, 144, 10, 113, 46, 16, -94, 80, 94, -356, 209, 71, -321, 57, 125, -24, 29, -23, 11, 141, -26, 45, 88, -240, -182, 113, 214, 156, -29, 324, 56, -115, -28, 125, -187, 106, 10, -69, 209, 74, 98, -119, -11, 89, -81, 181, -180, 37, 44, 201, 25, -52, -65, -127, 42, 132, 128, 85, -152, 82, 9, -5, 122, -111, -69, -75, 83, 51, 48, 162, -41, 114, -150, 405, 239, 34, -14, 82, 112, 136, -24, -113, -80, -253, -283, -8, 94, -174, 388, -23, 60, 88, 110, 22, -131, 10, -23, 15, -155, 249, 30, -95, 236, -54, -81, -117, 84, -330, 201, 8, -54, 156, 65, -143, 204, -177, 151, 38, -199, 61, -36, -49, -146, 223, 45, -108, 243, -167]
6210a67m4M1L91k38PN6J29j63k87L77j18J43k52J49On8k3n6pNL03k49j68L27n8
6235D6o9J71q8Q6o5j66R5k22l9M11j90k77L08L7j16q2r8L60l20M40k63J20j95
6258a16L43j8k50K05j69J46l12n0J67p3j17j38M14J81m15L31q0J8j56K14m74L84
6280C5L5j62J72j12j74K55Ol91N80l51O2r4J02j28R4J08j66J4J07l1l2Q1J49o7
6304I2J37j85m0qj62O4K31j88Q3kmk45J72j33O9k60J06L04j67n7L05j40n5K5N1
6329gJ12n9Nm5J9KQp7j01l0J12J40j90L86n72M29k30J47J44j10q2L6q4L0j22K36
6355I7L0j94J48k05L71p22P10j09L8q7J19p89N81M0k55K04K04n4l36L69j9J40
6377B81j65p2k75K20J31q4o5J08m4n8o4l5Q9K32j34R5l82J76K23j50k02Q5K2K45
$$ y = [-167, -211, -170, 221, -17, -10, 46, 175, 12, -275, 102, -16, 127, -125, 24, 30, -28, -51, -107, -114, -109, 194, -55, -223, 104, 46, -23, 148, 60, 146, 81, -85, 10, -212, -251, 160, -30, -307, 1, 38, -78, -160, -258, 102, -218, 222, -41, 79, -116, 227, 209, -41, 164, -5, 141, -171, -221, -54, -127, -244, -382, 32, 213, -202, 129, 49, 67, -89, 125, -349, 35, 70, -92, 80, -32, -206, 49, 55, -336, 244, -107, -45, -139, -37, -165, -71, 37, -129, -115, -8, -39, -71, 10, 159, 92, 229, 44, 4, -4, -166, -102, 129, -59, 24, 22, 18, -227, -55, -188, -119, -379, -273, 31, -136, -193, 112, -28, -83, -58, -7, 105, 46, 51, 6, 25, 27, 35, -42, -143, -173, -61, 79, -111, 275, -297, 132, -98, 49, 193, 83, 1, 37, -47, -17, -139, 97, 127, -67, 81, -124, 247, -475, 235, 126, 164, 77, 196, -593, -12, 28, -227, -23, 181, 127, -209, 160, 141, 281, 116, 44, -231, -11, 120, 36, -29, 79, 35, -23, -87, -122, -33, 199, 65, 160, -222, -46, 177, 27, -175, -90, -68, 177]
6401A77j32l7N3n6o6k20K16j03J54J97k41K54n3k10J04j21K69k22O7l74N19k34
6423e9Q5K26k6j79j25j82R4J31K98m59J19p3m7R1M3K5J52k87O1J6K82k5j52j8
6447il09K49O1q4q4KL88l87L08l8l97N89m32J90J86l70L81l3k71j1J19Q3k64L10
6471A77l71M19l08L1r8K33o5M4k07K22J56k56K5l8Q2R6j76J39k93J8K97k55O7
6494f1P6j42L7Q6o2K18O1n09K93L25l02J89Lk36J88k82L37j35K11n65M06m1pR
6518I7j53R0J00k55N3k00J72L93k28K08k9j85j44j30J68J69k47pR3l33M76K6q7
6541D7r8L5k04L54k77J91j75K91j36o1M6l9j3J04j91J60Q9j82P6k01K61j10j78
6564b11J66k17o6M18j54o7mK39j9j60K76K0l05L70l53q4K27p6p3j36J02K57k56
$$ y = [177, 45, 8, 61, 5, -61, -281, -65, -168, -14, 183, -58, 196, 143, -67, 37, -84, 185, -37, 30, -344, 175, -59, 26, 252, 226, 47, -78, -260, -166, -35, 263, -196, -77, -150, -197, -106, -63, -38, 114, -173, -112, -96, 186, 161, 9, -9, -318, -69, -8, -92, -176, -174, 214, -173, 135, 97, -300, 289, -143, 47, 233, -137, 244, 211, -60, -71, 48, 131, -133, 177, -194, 225, -83, -52, -150, 83, 18, 62, -145, 77, 233, -23, 2, -36, 46, 142, -34, 105, -188, -170, 127, -128, -61, 15, -127, -90, -4, -66, 152, 213, -296, -3, 322, 20, 209, 212, -24, 164, -118, 219, 84, 295, -270, 136, 95, 88, 97, -56, 34, 134, -121, -68, -268, -96, 297, 69, 277, 248, 63, -81, -211, -43, 126, -121, -128, -35, -368, 108, 134, 47, -51, -16, -220, 134, -143, 48, -127, 164, 28, -33, 13, -26, -39, 65, -126, 34, 123, -59, 17, -184, 77, -33, -211, -45, -262, -328, 90, -64, -131, -135, 104, 85, -75, 201, 221, -84, 286, -67, -151, 76, 0, -73, -209, -107, 150, -106]
6587a06J78J13k50k8j8J2J6J39l4k20K44k24K46j07jp2J73Pn1j69K88O7l35L62
6611B30l22j00J55R8m15J87K50j94n6L20k53N24p33J12J88j17J58n0l42J90J09
6632f1k1J12J01j08n3Kl1O6j48r9L14m1N2o8q3K25j65J7P2k99L71k30P4m5J71
6657A25j92J68k33O9J79k13L05k28J65o8j52K2J95k46Q9k35L49j47L24n17R8K22
6679G9j42rJ20k40nJ41J36R3l14K13m9j76K58j91K22k44K58j93M34k54r0q8l26
6702c67L03K88j10j75j5K25p1Rj66L48k30J91j88n6l5K3K06j11o1j52NJ33J16
6725A10k61M76j34m5m7k42n3N05j38J63k51q9J24n7k54m8r1J41J56J67K6j62K11
6748B07k80j12L85j43j67j21K29P3J1Q5k26K16p4j93J99k26N4K08O7j40rl01L32
$$ y = [-106, 72, 185, -65, -93, -111, -99, -83, 56, 22, -198, 46, -178, 68, -39, -40, -112, 61, 68, 17, -152, 136, 203, -132, 230, -92, -192, -37, 61, -354, -167, 83, -111, -167, 153, -100, 424, -309, -197, -9, -126, 32, -18, -360, -170, -61, -82, 30, 131, 23, -30, -28, -59, 7, -141, -240, 74, 33, 85, 17, -66, 159, -6, 11, 83, -216, 155, -75, -1, -46, 125, -67, 101, -132, -63, 116, -97, 208, -20, 145, 77, -75, -53, 142, -104, -15, -250, 99, -48, 276, -241, -143, 79, -63, -72, 48, -192, -197, -56, 80, 173, -141, 72, 23, -153, 105, -86, 136, -108, 150, -43, 391, 137, 47, -41, -367, -64, 224, 114, -61, -76, 149, 78, 87, -79, 269, 39, 230, 42, -14, -49, -26, 180, 69, 8, -144, -139, -6, 110, -151, 325, 191, 146, 99, -143, -196, 309, 171, 334, 83, -6, 118, 61, -193, -241, -332, -191, -35, 132, 158, -4, 207, -73, -185, 200, 57, -110, -231, -2, 71, 82, 167, -59, 157, 83, -110, 89, -137, -83, 125, 192, 52, 43, -258, 74]
6771G4k25K27q6J05j06J67l34L45k83Q6M5n3MJ66j78J80j83J2K17j99r1O6l29
6794c73L28J85j54R5p3j3Q8k6k71K63m2M30l57j15j18J73P0lk47L01j55nK6M4
6818E1k59J83N2n4q7L24ll20L48l14K59n0j87J51J26k63j50J19QL8P9p3p3N9K45
6843B09Q4k68J99nl80K70k43L68m41L31j44l08M53R1j22k88K80j14k18O8J39N2
6865A3K9k68N9J20l5K08k5M0r3j40O5po1n6L3J22L0j10J87n1k2J47m98N45k62
6890c0rJ36oj17J07J1r2R0O7j53j89r5L45j19%oP5J05k05L6Mm9k0N3j18L14j56
6917b1NM9J65k06K09l31K0j5l6J32R7r9K12J07k15j82J00k97J69J5J22n7K11k45
6941i1J9M5m0q6KN3q9L51l97K83j56R9K70j42j10j20K22j70P8j29POL0M48m46
$$ y = [74, -151, 76, -10, 95, -11, 156, -178, 167, -116, -30, 15, -38, -34, 132, -46, 134, -49, -37, 180, -19, -110, -44, -373, -45, 140, -14, 81, 8, -5, 83, 57, -214, 49, 7, 437, 80, -35, -153, 20, 90, 87, -160, 141, -14, -19, 7, 51, -208, -25, 27, -27, -114, 210, 207, -113, 235, -79, 180, 130, -57, 94, 220, -43, -193, -74, -66, -28, 51, -22, -95, -36, 209, 293, 25, 224, 219, -161, 109, -134, 234, -207, 124, -20, -328, 125, 216, 94, -194, 86, -28, -246, -178, -39, 13, 42, -226, -167, -47, -82, 126, 101, 141, 48, -92, -27, -34, -95, -151, -118, 4, 34, -76, 111, 60, 38, 185, -313, 232, -30, -39, 97, 91, -26, 81, 92, 0, 90, 157, 4, -185, -280, 65, -54, -54, -60, 15, 120, -85, -49, -45, -94, -114, -61, -179, 135, -21, -16, 33, 198, -8, 201, -130, -110, -125, -161, -29, 68, -31, 181, 288, 73, -109, -9, -306, -137, -122, 0, -57, 154, -91, -72, -27, -67, -153, -151, -98, -187, 164, -233, 50, -106, -7, 263, 121, 11, -109, 113, -57, 21, -108, -101, -95, -65, 383, -63]
6966f3J87jk11M4M2n3k64J50o1L71j47J48Nk43J33l3k04L64j91j35M2J65k46J83
6990a8J67j51k13K87k2K13k19m4J24l5J4J79j06m79M90P6k80k0P4j23M5J46K93
7013C98m27J4k04L23k59K18l3j59J69r4K58L8n2j3m81L01p7K81m96J23R0R3o5
7036e4l7j04k3K16p0nL7R4r5Q2j34K40m9J83j62l34K71%k02L14k09j73K16k11
7060b09L42J31r8k49O9k95K70P0j46J17p7Q3J17L4k75K2O4o1L87j45k28J02J72
7083A97j86l2m8j29L49j88j75J86P1j16j06o5K23K68j49j86J54J47o1M8l60M36
7105B78k27J06j74J4K96k32j33P6J27k10k9M7L0mJ14j14p9J63M9j00J01N1J28
7128B78k69Q0Rj65J35r2Q4j5q9k32M37j05o6K59l71q1O1j2L86k36j29K0l8j01
$$ y = [-63, 124, 123, -88, -44, -2, -55, -319, -169, -230, 141, -6, 142, 147, -96, 37, 4, -200, 164, -27, -162, -120, 45, -201, -18, 149, -2, -215, 72, 50, 263, 44, 0, 124, 89, 103, 282, 176, -303, 187, 263, -17, -37, 37, -86, -41, 105, 398, -29, -15, -219, 104, -155, 63, 30, -129, 40, -54, 204, 242, 190, 177, -304, -3, -80, 201, -295, -172, -82, 11, -54, -91, -195, -218, -2, -72, -77, -40, 54, -41, 41, -93, 147, 98, 281, 119, -215, 56, 56, -146, 168, -41, -214, 2, -209, 133, 264, 166, -83, -14, -309, -39, 31, -115, 2, -75, 8, 125, 159, -116, -94, -30, -91, 296, 151, -77, 25, 197, 11, -21, -69, -198, 151, -37, -212, -26, 45, -71, -177, -242, -19, 249, 100, -86, 68, 215, 154, 202, -158, 278, 51, 157, -17, -3, 293, 61, -72, 4, 131, -79, -108, -61, -31, -35, 79, -35, -114, 49, 98, -2, 99, 150, 278, 9, 89, 98, -67, 68, -24, 60, 45, -44, -276, 161, 56, -10, 249, -122, -203, -142, -154, 232, -4, -133, -113, -151, -252]
7152b52m0K68j98Q2N0K16r8n8J07P9lk03Q2j54K15m4j96J21r7J57p8K2K00k87
7176a09L86J1k07n7j45j33K45J39N1K31m00m8j61J41J32j11j75J32kO3mJ69n7
7199I1K51j64k84J73k39L54k42jK40J44k58J8P0j43j33P8j32K41l77L06K28j59
7221F2O9j31j73J00j76L00K6o0r0L14k69r4nO8j54k2K70J68l83J65j60K01K22
7244B48j02k25J60m44N00l02P3L28k30L67o11K18j6q9k8J69M1n6R7k10k9J00J43
7267A02l12K18j02M15j84n0k46p2L42m5J80m60L28j07k28o8K60j48M6K59M8j12
7289F4L8r7k6O1J40k08m0Q4j70K67l75J00J43j22j8N2J48J8J28l70K8J67q1K56
7313A87k28J23k36N3j25L15k7m8K9l5j30pK00J17K0k48j46O3M04l64M2L60m7m00
$$ y = [-252, -292, -24, -222, -140, -90, 126, 28, -30, 77, 156, 153, -50, 32, -122, 93, 49, -147, -26, -123, 34, -44, -22, 178, -109, 277, 288, 81, 24, -121, -254, -9, 130, 181, 412, 12, -36, -197, -56, 76, -35, -210, -78, -80, -17, -21, 148, 91, 342, 178, -106, 67, -172, 182, -60, -61, 179, 323, 65, 83, 153, 10, -123, -45, -177, 64, -313, -7, 221, 62, 131, 0, -173, -73, -249, 51, 77, 17, -73, 241, -28, -122, -127, -59, -213, -235, 35, 203, -180, -15, -175, 26, 248, 146, -79, 81, -363, 137, -165, -92, 236, 6, 373, -238, -20, -36, -125, -153, 16, 57, 1, 98, -112, -141, -41, 102, -210, 8, -94, 321, 137, 87, -159, -231, 111, 66, 246, -214, 114, 7, -221, -289, -29, -177, -131, 128, 176, 64, 102, 5, -21, 40, 180, -28, -68, 16, -154, 113, -262, -162, -19, -141, -159, -107, 41, 59, 187, -183, -155, 12, -69, 187, -41, 82, -154, -101, -226, 89, 62, 14, 43, 8, -122, -129, 71, 188, 208, -40, -186, -123, 281, -83, -41, 319, 272, -128]
7337a28pr0M6L09l88N67l12k22K25J12M6k50J92j93P7Kj14J71k89K34J43K38k23
7360A46N6l71R2K24n9k24m7O0p0K75k63N1P7J14k23L05j28j13P0o8K5K54k57L89
7384C15j24n56L85J03j30l4K86l11j38n9J46pK73l46J02M5N45m14J3ol23M03k11
7407d3L53l34o5J01OJ76j81J3j05O9Q1J45o6o4n0P5j51k1p0l1L7J4O8N9k51K28
7433gM4k4M29p40K8M42k44K64j80r7L20l48mJ56j21kM5%J61m02K76m3l9Op0L00
7459A50ql05J51k07N21k85j56J60j01R0K65k39m7J44o1j02J89Pk75J76j02J07
7481G2J91r0k78K1J6j09J47k04L49J61q9l26p4K81p5K18k13J48k17M1o2J08l50
7504c34K46j68J54K03l37L53k45l4J62M02j83ok82J35J33k22M1q2J4o2M9k8N0
$$ y = [-128, -135, -225, -179, 130, -258, 309, -3, -225, 0, 112, 158, -92, 100, -93, -16, -14, -128, 43, -246, -12, 131, 369, 146, 202, -169, -77, 147, 88, -136, -183, -123, -193, 82, -181, -130, -53, 61, -162, 143, 15, -98, -28, -96, -71, 183, -74, 315, 191, -365, 20, 123, -7, -41, 245, -66, -204, -263, -117, -124, 149, -197, -95, -50, 495, 81, 94, 88, -235, 168, -43, 310, -24, -89, 12, 18, 194, 13, 26, -79, -10, 71, 216, 150, 86, 36, 111, -40, -61, -131, -162, -125, -111, -43, 16, -235, -7, 37, 13, 442, -298, -270, 172, -72, 192, 12, -85, 235, -113, -117, 39, -82, -84, -39, -39, 122, -280, -4, -47, -86, -80, -150, 150, 142, -163, -12, -219, 302, 17, -139, 21, -80, 10, 275, 36, -11, 133, 72, -30, 159, 166, -109, 67, -35, 72, 263, 173, -105, -84, -68, -177, -30, -234, 115, 276, 187, -139, -213, 68, -7, 211, -2, 146, -71, -30, -92, 16, -334, -88, -256, -102, 101, -236, 117, -128, -162, 0, 402, 219, 213, -69, 66, 199, -23, 18, -64, -50, -112, -63, -91, -41]
7527d1nk17N29j02k07R5rj27N0o5lL6J68k06L6l25K18L59j67l4J68J29q9m51K15
7552d5r8Lj51M36l05q7J54K16j42j03K26l44L4R6J73j30M69k19l86k5L18j8O6
7575A38j80Q7j60o5L41k52k58M40j79j00K74O5n3j63K08j60J32K24j78m25J84
7596h0k00M44k09o7k2k74O31l73J73k31K70k0k08M23l53J28m2J88k03J29k46K65
7618A23j65J27lL24m17K58Qk62J57j73J90k97J75J68n33L47j06J3j57L96j67J20
7640A26n3J5k53NK36k6M9k62K66l34M55p2j9l34L74j46K12m66K90k35K89j40K08
7663A85j13l6j41j7J09n2J22k09J23J02k74J12K39l62R0M02j88n7O0Qj86J0j47
7686b20M3L25j5k13O9r8K49n8J34j72n4N9l13J40K43l50K22j28P3M1K40o2l43
$$ y = [-41, -46, -263, 266, 164, -43, 52, 43, -84, -34, -99, -102, -66, 102, -104, -68, -393, -175, 184, 17, -17, 151, 280, 191, -260, -45, -143, -140, -291, 145, -160, -247, -93, 123, -19, -122, 104, -240, -206, -110, 63, -67, 402, 183, -203, -228, 90, 72, 138, -42, 45, -115, -180, 161, -91, -349, 91, -88, -188, 86, 151, 98, -65, 143, -17, 115, 339, 161, -264, -80, -280, 164, -45, -112, -134, -408, 223, -150, 23, -208, 62, 42, -166, 257, -96, 32, -10, 178, -25, 104, -142, 123, -42, 85, 82, 406, -11, 247, 255, -7, 150, -23, 167, -130, 45, 213, -320, 27, -79, -66, -223, 173, 6, 126, 73, 88, -165, -160, 76, 50, 99, -163, 103, -231, 224, 152, 133, -201, 173, 27, 239, -227, 63, -172, 117, -23, 185, 72, 36, -105, -122, -13, -65, 57, -152, -29, 73, -201, -89, 150, -212, -122, 280, 92, 35, 95, 103, -83, -73, -220, -177, 148, 133, -80, -11, -109, 140, 82, 216, 44, -10, 49, -264, -124, 119, -231, -9, -137, -64, -23, 217, 155, -188]
7709a88J97J10l26K47jo4p7p9M84m48K01L05k93j31Nj04K74J5j05j11J6J50j31
7732e4J97j05j74L02k69J24k22K56j86J42j46j25J30R0K67l69J97l55M44k94K01
7753E1Q6j16L1k13M08k77l75L31O8J73J7lo1j6p1j84J13N40p35J5J71J69q6k25
7777a89K83j07N3K7J39j3l35N5K91j07j67J35p6J89r4k3j6J16k56K8N4j43J01
7800e5j67L36m7K6k72L21j52R2k73Q5L28k73J09j36J32j44L0q8R0Q7P3k6l15K10
7824b9J21Pj88L29j61k66J24m2L25m51N58m50K97m1k35J04n7p8J11J51k34K2j2
7847i5J33J1m4j63L19j45k7J3n1J7k29J80K69j10k58J39K7m9J06l2j28Q5k2L13
7871B59k86j59L87M1k71K13k84K46k43L17o0k24l5qK00j99J03l26L04L95l82k38
$$ y = [-188, 9, 119, -207, 40, 39, -25, -102, -181, 303, -145, 56, 361, 68, -63, -58, -162, 112, 127, 22, -89, -73, 77, -54, 143, 38, -136, 166, -103, 21, -201, 55, -131, 11, -135, -260, -130, -40, 227, -142, 55, -300, 144, -150, 51, 137, 21, 52, -161, 247, -30, -405, -74, -6, 167, 184, 181, 120, 104, 33, -151, -38, 502, -233, -218, -47, 122, 36, -189, 94, -13, 40, 67, 206, 193, -142, -87, 204, 97, -70, 65, -11, 178, 84, 61, 45, 161, -95, -67, -13, -156, -55, -222, 114, 67, 93, -179, 142, -10, 82, -191, -106, 222, -51, 58, -78, 54, -90, -60, -148, -58, 29, 102, 76, -239, -29, 92, 99, -89, 240, 79, -187, -63, -105, 220, -231, 327, -123, 174, 133, -102, 2, -55, -133, -22, 129, -105, -83, -95, 38, 49, 5, -158, 161, 16, -11, 2, -49, -32, -261, -81, 188, 78, -180, -41, -14, -63, 43, 11, -117, -32, -54, 259, -27, -186, 201, 242, -29, 184, -100, 146, -97, 220, 160, -64, -99, -107, 93, -106, -3, -329, -25, 370, -12, -250]
7893b50p1L06J27k11Q8k3k0L41o3j28j35j69K37j64J54j74L11j80q6J09R0j85
7915i6K19lk23N6k4K37N2j44L5j56J36p8m8L5J66l19M72l76j6K74k68L4J1K04
7939A80j55J62j22L41k46l46Q3r3R6j89L14k13M9k4J61K75k24k38J76J32p7l2
7961A0q9r7J72J34k49K61r5J80j7N7m22L35m8k16P0j32l7J71k71L83k36J23J50
7984A37l90M42j57P5k55J22q0J58k06OJ45o4OJ7K57M8j31j53J73k69j15L26l00
8007b08J01j4M69n49L63O2j42q1l31M35Rk14l4J30j50j8O1K67k44p5J84j2J6l
8031B2j10K06j41K61n0j02J15k14p2R9j59J75k82J22k1J41r3J45l33L00J4l7L
8054a1J68j62j9j6O4L62n12K60k20J38j57Q5J66j81p1P0j09o8K72J3l44M35K9
$$ y = [-250, -321, -15, 112, -99, -11, -34, -54, 287, 224, 96, -39, -208, 29, -135, 19, -155, 156, -24, -110, -1, 89, -96, 123, 120, -103, -47, -71, 166, 218, 74, 109, -47, 89, 11, -37, -2, 164, -155, 317, -59, -75, 199, -69, -35, -24, 180, 25, 187, 65, 406, 160, -186, -103, -196, -100, -289, 25, -188, -139, -163, -2, 273, 49, -189, -13, 119, 42, 10, -79, -176, -4, 130, -119, 142, 47, 227, 210, 267, -155, 180, 132, -84, -14, -146, -183, -12, -283, 100, -136, -13, 137, -253, 189, 32, 107, -148, -26, -106, 52, -154, -148, -3, -67, -61, -44, 213, 261, 130, -23, 150, -119, -234, 92, -208, -107, -121, 348, -201, 162, 224, 82, 1, -330, 105, 114, -100, -134, -4, -154, -172, -111, 156, -88, -163, 21, 9, 25, 22, -88, 118, -23, 238, 188, 86, 201, -13, -85, 14, -145, 30, -252, -130, -151, -10, -103, 42, -291, 9, 23, -14, -11, 157, -5, -24, -40, 24, 386, -126, 134, -86, 52, -105, -20, 146, -35, -106, -36, -145, -213, 59, 72, -272, 163, 192]
8077A92k9l49L54L0l51N7J81j7j44j20k4L78k79O7Ql82J72L64l15M60Q6k57P4
8100A56O0j26j97K12K16l12M2j45M11m03N3J99k16L42j10l80M32k56J2K63k12
8121D1j25L2J78j68j68J04q5K57J61j63j93J75o5j97L70k98j1J79ML7m7K77k37
8144E8j71K80j14j63K12L3k01J50K5K50k31m3L2k98J58n5RJ77k13J87l5K2k05
8167a36J78j35lj20L29k52K11J5n8j07j26J34r9J3R3o9r1L34k27K27K8q8K45l80
$$ y = [192, 163, -186, 168, 198, -153, -96, 85, 68, -76, -196, -220, 158, -121, -54, -46, -428, -256, 108, -207, 253, 339, 82, 156, 216, 90, -107, 105, 321, 9, 51, -94, 317, -86, -33, 166, -50, 292, 182, -198, 234, -22, -10, 253, 41, -84, -52, 126, -42, -210, -106, -191, 66, 227, 64, -129, 46, -19, -216, 154, -144, -155, 24, 28, 65, 18, 295, 58, -113, 167, 53, -110, 102, 135, -66, 84, 109, 359, 128, 85, 117, -181, -23, -78, -69, 108, -105, 82, 47, 69, -136, 42, -93, -96, -216, 113, -139, 72, 87, 29, -78, -204, -70, -169, -156, -63, -132, -223, 111, -116, 111, 139, 51, 296, -84]
8191h4
$$ Imaginary data points
##PAGE= N=2
##DATA TABLE= (X++(I..I)), XYDATA
0@%%%%%%%%%qJ6j6K4l2L8m6N6p2Q8j04J28j53J77k14K54k96L45l99M60n28O08
31C26o93P87q93J008j137J281j438J606j793J998k222K466k734L026l345L695
47A938m074M490m949N452o004O618p300Q060q916R886j0995J2279j3783J5573
61H275j7750K0464k3958K8646l5311M5612o3814J05576l83311r2916N50268j39057
73B724k81753r9980K59419J94014O9600m2673O5389R3059L4100r3152m6073j794
85A52880J5103N884l759j74012k58355n5164K26766J36508j62962k48667j2291
96c78069J99974J90478J9148p2882O903J22775P4149k6552J29P7793L7603n0280
108B01169q7116r4308p2362K7699Q3517k3150j62912j47143n455J24670J32286
$$ y = [0, 0, 0, 0, 0, 0, 0, 0, 0, 0, -8, 8, -8, 16, -16, 22, -24, 32, -40, 48, -56, 72, -81, 96, -118, 136, -160, 185, -214, 246, -282, 326, -367, 420, -473, 535, -602, 679, -759, 847, -946, 1052, -1170, 1296, -1438, 1588, -1757, 1938, -2136, 2354, -2595, 2857, -3147, 3471, -3829, 4231, -4685, 5201, -5794, 6485, -7298, 8275, -9475, 10989, -12969, 15677, -19634, 25978, -37836, 67740, -315571, -408487, 141781, 2724, -279029, -379009, -119590, 74424, 144024, 101351, 166740, 259799, 293899, 200747, 154674, 152880, 167983, 173867, 170108, -3904, -262259, -317423, -90657, 45851, -117111, -365778, -378069, -178095, 12383, 31531, -41351, -34448, 88327, 162476, 135924, 136053, 213846, 251449, 201169, 114053, 19745, -52617, -24918, 58599, 35449, -127463, -274606, -280061, -155391, -23105]
119b3105L306j07719l1142J18317J12522k43j2564N9495N9330j7517p0257n2152
131C8271J9306O4401m62j10814j15646k3627L8912L7363R559l8845o5535n235
143a52352Q2734P5580O595o334K4783K7199N554l014Q424L2202K8775l3903q8046
156H197m7486K8525L1455j7259l8419l8638l0593N584L9867K7016J071L399R836
169a7445O316J5120K6602K1842J5099N518k1509l4152J53K8719K734l2795l2838
182a6636j6539m313O012N204q208p007O209L683l692J1674K9116J8044p25p005
196A5817o589N455K2862J5679j6351k7765q506N928L71o555j1703j1811J044R371
210a2753n153j4556M010K0970J2503l092q145k584J2798K0978L810j8959j2102
$$ y = [-23105, -19799, -127518, -158660, -40343, 72179, 71936, 59372, 118867, 178197, 160680, 90423, 38271, 57577, 121978, 121516, 10702, -104944, -128571, -89659, -52296, -42737, -81582, -147117, -152352, -69618, 5962, 12557, 6223, 31006, 58205, 63759, 60745, 69169, 101371, 130146, 96243, 8197, -39289, -10764, 20691, 3432, -34987, -73625, -104218, -98634, -58767, -31751, -30680, -27281, -17445, -11129, 3991, 30593, 52435, 67534, 73052, 51543, 17391, 17544, 46263, 48997, 16202, -16636, -33175, -37488, -31476, -26272, -34480, -41487, -35278, -31595, -35287, -23613, 5503, 23547, 22822, 15817, 9228, 14683, 37545, 53224, 36873, 9108, 602, 6530, 6901, 346, -11357, -23168, -22124, -12753, -17906, -32462, -28452, -7482, 5021, 1929, -6216, -8800, 3998, 24976, 28786, 9827, -2275]
223b275J1642J4474m330j7326j4721J664J6153P187j7498k1610K523K0873J1316
236H072p516j3178l695J3028J6835j614j5645k371J5381J0373q959j6885o244
249a2418J2263J8756M15k5272k1337R046K6857J2270j3295k2890o011J7802J8513
262A4699m286j6380q32J3720L902j2996j1459M830J7957J2024j2095k6418r869
275b7203J9857K8152O293k1921k5579k165K3862K1270p937k1442m019J2321M212
288E701j1008p693R776J7310J784k1220k1717N459L0419K0650j0108k7245j7162
301b5054R406K6415J7288j0514k2294q351Q184P660j379k552L786M952o694j9428
315a8575j0290J8625L0806P256k4677k8122j493K5413K7547M779j9528k2110m835
$$ y = [-2275, 9367, 23841, 19511, 2185, -12536, -10872, 5281, 12468, -5030, -26640, -24117, -3244, 8072, 556, -12622, -16317, -3289, 13546, 11932, -3713, -6084, 9297, 19670, 10711, -6174, -12418, -155, 18601, 19016, -6256, -27593, -18547, 8310, 20580, 7285, -15605, -21616, -3814, 14699, 10413, -5967, -6799, 6921, 10823, -2173, -13632, -8802, 9155, 21179, 9084, -17334, -27203, -7346, 20806, 27099, 5178, -20401, -22566, 1296, 22566, 14629, -6813, -10832, 1489, 5701, -5307, -13000, -3224, 14086, 15870, -5350, -27067, -21608, 8811, 29461, 19353, -7892, -25054, -15648, 10767, 28055, 17541, -4753, -13104, -4920, 2740, 1361, -1191, 2595, 7547, 853, -18575, -28865, -10240, 20566, 27822, 3145, -24977, -26470, -1057, 26490, 31269, 11741, -10369, -15204]
328a5204J0518J2533N411l671r000r197o513m079O364J8462J3710r561k6430j5031
342c1688J5031L1685J9362j0767k7300j5883Q353J9327J3394N61j1697j8148j2274
355b0044J363J2841J4497N543j1099k2144j2175R413K3889K0638K686j9451k3292
368a7335l187K1182K5850P885j3219k3868j6857K225J6649J4761K245j2898k3321
381a9888j5870Q331K5992J9125k055j7245j6706k337J5789K2886J2770m406j8370
394H016k1022m084J8856K2814K752j8564k3877j4286L784K0089J9031q65j9187
407f543j9721l336J6874K4382J1796p057j2408r182l239Q737K0189J3154j0474
420B3172k5809j9176k66J8250J9977N13k1587k2144n340J2827K1631J4809m603
$$ y = [-15204, -4686, 7847, 13258, 9587, 587, -8610, -15123, -19202, -12838, 5624, 19334, 9773, -16657, -31688, -16657, 15028, 34390, 23623, -3677, -19560, -11207, 8120, 21514, 22075, 10378, -7770, -20044, -18681, -5840, 8657, 14200, 3101, -19043, -31218, -21805, 2084, 22722, 25408, 5957, -17335, -20522, 660, 26510, 34395, 21176, -2692, -19549, -17324, -675, 14086, 16331, 3433, -19888, -35758, -27427, -1435, 17690, 15635, -1610, -18316, -20653, -4864, 18022, 30792, 26386, 8016, -13006, -17090, 1766, 24580, 27332, 8768, -15109, -29395, -25611, -5522, 13509, 12644, -6543, -26264, -29600, -12726, 11656, 23452, 16395, 3987, -5195, -8434, 303, 20492, 33646, 23172, -2637, -21813, -22079, -3829, 16148, 16661, -4926, -27070, -32410, -19583, 2048, 16857, 12254]
433A2254j6878r140M694J0709J2702J1123j127j6194j5875m271R265J7048J0193
446B4503j4439k8290j4481J1154K1302J2254m892j8530j2577P022J6924R826M202
459A3978R53o953j0473j417Q663J0202O962l364j8802k0769k01J7561J5680j042
473A0978j7922k0503j579J9744J7816j42p352k510n32L27N736P811N235Q61n701
488A2267j4739p831Q453J3859J231j1099j6215j0259O274J8823P376j2090j2609
501a6559J340J0003Q882M069j362r71L621O49o718j102J0892P055q963j4019q012
516a1195m29P896R121m187j4483p858N351J0536P175l7o126n26R896N562o088
531D608k494Q690O054n635q770l604K155M711o88q687q901R90N252J293j009k662
$$ y = [12254, -4624, -13764, -9070, 1639, 14341, 25464, 24337, 8143, -7732, -12003, -2738, 14310, 24503, 10064, -18226, -32707, -21553, -251, 12003, 7111, -11419, -23996, -16974, -50, 9776, 13978, 14931, 7978, -2495, -3912, 4751, 14953, 21915, 18551, -251, -21020, -21221, -3660, 12020, 10978, -6944, -27447, -29026, -9282, 8534, 8392, 1040, -1470, -2002, -1675, 4061, 11872, 17107, 17968, 12267, -2472, -10303, -1850, 12009, 13240, 2141, -14074, -24333, -18059, 764, 8140, -3950, -16559, -15219, -5216, 3666, 7735, 6373, 5402, 9023, 9672, 2954, 1852, 12744, 19799, 10836, -3183, -11195, -11624, -3728, 5393, 1206, -13277, -21135, -15784, -5248, 1927, 1890, -4236, -4762, 5134, 10696, 4608, 2114, 10804, 16858, 11223, 2453, -1151, 1004, 5715, 5027, -3660, -12561, -11571, -6319, -5026, -6035, -8697]
547h697l611K810J1288N528m962l184N597O290J55l085k071k01K860j810q791
562a884n435M091K376m849m461m13P11L804M504q33l366K142P408M464J112j023
578H348l573j603L502K918k499l432j928m504n010n66K761J667O09j631n614k894
594a3449P191R337L194j348j569j857N03M302M605R34k381o499p730n21O647L089
610D448n819o220k567j684K378O811N043j115m365k847J984P529P991O52m469
625G750l798m754k974N582J0372Q1j2772j1938j085O830P625K325m205n900k058
640h919K62L638Q775P540k776q362l512K027M067O793M335o028j1961o896K911
655h106R612P594m130j3069o300M943P626L789K697P00n623o482P50O961Q564
$$ y = [-8697, -12308, -9498, 1790, 7318, 2356, -828, 4769, 11059, 11214, 8129, 6058, 5857, 8717, 6907, -1884, -7319, -3228, -852, -5701, -10162, -10575, -9864, -6060, -1556, -2389, -5755, -3613, 3795, 8259, 9371, 8348, 4775, 3172, 6674, 9592, 7093, 3661, 1733, -2771, -7781, -8347, -5586, -3919, -3310, -4941, -10555, -13449, -6258, 3079, 6273, 4925, 3356, 1499, 2002, 6304, 10909, 11843, 9462, 2963, -4767, -5288, 1359, 4448, -1371, -7591, -10158, -11842, -9464, -2653, 2390, 1275, -3090, -5937, -3953, 3576, 11567, 12219, 7750, 3952, -802, -3776, 1806, 12178, 12259, -513, -12451, -13536, -6706, 919, 3244, -961, -6861, -8919, -8657, -5019, 3756, 11296, 8520, 158, -3354, -1327, 2740, 9533, 13868, 7840, -4121, -11017, -8106, 1506, 9100, 4970, -8099, -14399, -9456, -1830, 1959, 4656, 5356, -267, -6749, -5999, 962, 9526]
670I526M226m958j1725p067L557Q736P500J092r777j4035l003J1044J1769R54
684G839n183o593m572J398O385O743M384j550q521r464J109J0480Q000j15p038
699C302j0623o772O260J2721N801n805r417o253J612Q121Q679J279m227o407m543
714f272j97P023Q133J546n460q744o891J214J0730J0449k298j1345q385K69O909
729c319R347L729m502p960n019R10O545Q020J908n911p343l304J140M436P720
744F397L632o823j1356m079O591J0829M965m358r236m657K446N858N571L304l741
759E343q820m752L856O182L040J58l025n554m941J180P074Q612P17q757q811M81
775h017Q776O170l27l107m587m182n43N236N691P33m529n509j880K177L152L929
$$ y = [9526, 13752, 8794, -2931, -9998, -6441, 2295, 9795, 10887, 1110, -12925, -15928, -4884, 6885, 7839, 2656, -3937, -8509, -7111, -726, 6017, 10401, 8851, 330, -9134, -8025, 2455, 10455, 10340, 3302, -7321, -14093, -7833, 4888, 10689, 4884, -4533, -10786, -9174, -1053, 7626, 8905, 4678, -1729, -6272, -6469, 554, 8687, 10233, 4773, -3971, -10862, -9648, 1082, 11531, 9233, -2112, -10497, -10228, -3319, 6028, 9757, 5255, -2705, -7724, -6814, -269, 7751, 9659, 3748, -3595, -6899, -5759, -1323, 6397, 10029, 3206, -8150, -12229, -5638, 5191, 10156, 5798, -3438, -8095, -5649, 209, 5780, 9084, 5343, -3477, -8229, -4373, 1809, 4849, 5007, 1982, -3572, -8513, -7333, -259, 8353, 9070, 313, -8498, -8017, 759, 6929, 6602, 3495, -1092, -5274, -5817, -581, 5110, 5843, 1314, -4195, -6075, -3898, -746, 3183]
791C183K098k028o341n373L768R734M810m978p189k887K137L792K751O25j848
806B254m036l921N37M692L796o46l016k087j158L9L265N567J501m324o057o80
822d274N077M361k08m343k567j148K48Q48K209K054k070l225j104K188K090J823
838A959R67m57j946j866K41L365K851j059m149k691R46K022j8j1o27j805j485
855c763M16J618J780L63N8m89o5O85O67J146J623m78k394j757P17J104l18q29
873H4k097j345L91Q62L56k61L95P25K87P63M27P6Q97J199P36j183o14k37k16M20
893A665o04j350j714L28L21j129p13K59J280J045o4p00m67J788K532J617j034
910C060j462m01N11J298M69j472j836j019q65j042l00J376L68q06j113p54N04
$$ y = [3183, 5281, 3253, -3088, -8461, -4693, 5041, 9851, 4873, -2316, -5203, -3066, 726, 3477, 4102, 2254, -1782, -5703, -5166, -474, 3322, 2676, -340, -2427, -3585, -3546, -281, 5286, 6787, 2463, -3594, -4274, 803, 5164, 4956, 613, -1954, -3102, -2854, -2006, 203, 2257, 187, -3038, -4142, -1954, 136, 1959, 2926, 2469, 523, -1343, -1102, 2263, 5114, 4055, -94, -2785, -1839, 183, 165, 154, -473, -2278, -3763, -3347, -1729, 51, 414, 472, -17, -82, 603, 1270, 2416, 4039, 3561, 1167, -590, 127, 1231, 913, 84, -2013, -3358, -2967, -2105, -1749, -2010, -1615, -890, -603, 160, 587, 663, 1560, 2759, 3495, 2312, 1698, 1461, 1245, 1665, 1061, -289, -2003, -1675, -1354, -2483, -3196, -2937, -1657, -612, -676, -1376, -1843, -55, 2477, 4094, 3060, 1598, 1197, 1708, 3006, 3475, 2003, 167, -852, -1717, -2759, -3059, -1683, -1315, -2121, -3234, -3988, -3484]
927c484L409L373J22k447k021R23L046L026m79l255l175J90J83M03Q09Oj722k813
945c906j286P77K176L287J358k445l204l16K882M530K775j576m811j746J484K181
961B160P26pj717l418k047L9J613K700J659k196l721j624K963M632L285m1l876
978A130m102N60M235L265M47k399m118l310O52K891K914N75j978m491l181K049
994d861N420L575J70l037m636j439L913N977J628k451m127m078J55L677L759K41
1010C886k751m157l447Q77N480M183n07l292l495j440K561N831L349k161m694
1025B23m137o41M115M908Q47l821m592l013J20M575O028N54m794m871p45K635
1041b609M994L860o57m651l916j178K182N586K792k998o498k901R02L414L883
$$ y = [-3484, -75, 3298, 3420, 973, -1048, -125, 2921, 5947, 5468, 2213, -962, -772, -589, -186, 623, 629, -1093, -3906, -5192, -4415, -2239, 1048, 2406, -39, -3243, -3559, -677, 3853, 6628, 5052, 241, -1505, -21, 2160, 2886, 2879, 1162, -2256, -4303, -4264, -2651, 49, 1708, -488, -4209, -5833, -2870, 1762, 5047, 5006, 1130, -2972, -2412, 1823, 5088, 5535, 3136, -982, -4292, -3640, -749, 2165, 2740, 762, -3729, -6910, -4861, 559, 4134, 4304, 1267, -3369, -4808, -895, 5082, 6710, 4259, 132, -3946, -3791, -114, 3645, 3886, 1135, -3022, -6469, -5592, -112, 4071, 3564, 272, -3223, -4663, -2102, 3729, 7078, 4917, 223, -3914, -4555, -440, 4468, 5315, 1494, -3098, -6111, -5991, -1416, 4612, 5166, 372, -4499, -5244, -2609, 2385, 6245, 5588, 937, -2979, -4157, -1975, 3611, 6403, 3405, -3093, -5994, -5092, -1678, 2205]
1056B205J936l157n668j344K973N090M059p73m668l712J062K580K402K598m74
1071E109n900n597N50M478L760Q66k957n121k494L226M505L488J304l109m675
1086b567j067M247L928Q25r20k890l799j722K144L530J396j902m267l999J375
1101e688M754K746k85j148j955k302K306N252K910j828k770k616q29K000K676
1116C223K16k209k490l582j336K843M485J12l246k156J59J557L225L361L91k409
1132B144j402o44J122L012J039k356l232j291n50k75J350J435j664k811n21Q16
1148c828K117K507R81j523p40P78J475J296J841k43k739j814L83Q85l31n71j356
1165h82j599j393J40L97P98J694j3j380J91K253J706Q16Q30k96j273j78P08J32
$$ y = [2205, 4141, 984, -4684, -6028, -3055, 2035, 6094, 5321, 653, -3059, -1997, 583, 2985, 5583, 5109, -791, -6388, -5838, -1360, 2400, 3266, 309, -4812, -7306, -4080, 425, 3913, 5217, 2108, -2567, -3634, 613, 4541, 5366, 4446, 1556, -2243, -3965, -1821, 1709, 3105, 1203, -3064, -7063, -5688, -934, 1812, 1527, 379, -1576, -3878, -1572, 3680, 6590, 4762, 1992, -624, -1453, 547, 3223, 3439, 1230, -1260, -4842, -6178, -3335, 1150, 1262, -1984, -4140, -3981, -2424, 801, 4162, 4553, 2144, 742, 98, 1220, 4232, 5271, 2915, -317, -1608, -2158, -2433, -1083, 352, -1312, -4123, -4644, -3828, -1711, 796, 1777, 254, -486, 292, 1767, 3063, 4904, 4661, 1922, 108, 491, 1376, 1045, 474, -882, -2481, -3874, -3734, -3337, -2539, -845, -858, -2238, -2047, 206, 1912, 2728, 3558, 3262, 1989, 1811, 2519, 2651]
1183B651q13j186r93j074n29n0r95l61P77O48m90M28J019J020P58N38M61L48M98
1202B655P53m63j150Om5q42q29j120j588k27O49J99n43o68M55J056R94J299O99
1221A290K34M27L30r4L40J133l94j400j527j146r43P22N66q20j405j362K23J410
1239b416J418J239j42m80L62P54R95J487Q74q62j892q33k56N04M08n89j399k152
1257b980q22K87J623J387j73j172m35Q62J856J832J361m93j058j006p0J034R85
1274C018k55k085k037j491lR79J119L27r87j955l77J665K806J640n0j207q61L05
1292E51J591J079O11j026k262j875n54J179N98N6j384j463j332L79K219K636Q72
1309A875j493k029M05K480K497J093j163j930j662k64L69J487P8j464k960j892
$$ y = [2651, 1838, 652, -341, -1415, -1944, -1994, -2989, -3350, -2573, -1925, -2415, -1987, -968, 52, 810, 1348, 1809, 2157, 2655, 3408, 2945, 1795, 1801, 1756, 914, 85, -1035, -2623, -2850, -2201, -2002, -2545, -3213, -2758, -1702, -708, 591, 1290, 1524, 1951, 2281, 2187, 2527, 3660, 3266, 1866, 339, -807, -1750, -1028, -462, -1282, -2687, -4049, -3826, -2416, -998, 241, 99, -381, -19, 735, 1730, 3217, 4091, 3229, 1337, 504, 248, 752, 1160, 571, -828, -2980, -3802, -3515, -1892, -505, -678, -1850, -2285, -1423, 433, 2265, 3626, 3133, 2075, 1069, 999, 2033, 3018, 2763, 678, -1359, -2850, -2853, -1874, -755, -428, -1415, -3370, -3747, -2082, 724, 2364, 2314, 1107, 246, 551, 2142, 3221, 3832, 2806, 544, -1331, -1885, -706, -108, -52, -1436, -2899, -4231, -3852, -1633, 1003, 1875, 382, -1647, -1242, 1238, 3735, 4828, 3665, 1735, 73, -191, 178, 1665, 1743, 279, -2681, -4573]
1325d573L9K031K318Q06p02j940q65J776L244K488j95k603k228M57J473R23O60
1342C109j175k432k634q93J350K218J007j380k417r47J296K634K839J120j818
1357A877k533k09K421K263J052j680k656k057m98M60J255P73o77k828k156N02
1373d691L047K614Q09o84j892k85J263L117K058n20k669k706o40J263J539k43
1389A380j156k113j897j200J728K814J411q81k333q65J697K932K538J58j473j932
1405H08j127Q91K371P33j450k595k559p10P92J589R07n63j700j594O15L211K846
1422B465P72j228j654l35J503K157P24o22k334k587j175Q52J454L52j406k000
1438c062j519K70K092K562R72n70j139p17J473K216J808m40j547j359j216M63
$$ y = [-4573, -4534, -2503, -185, 621, -81, -2021, -2886, -1110, 2134, 4622, 4427, 1824, -404, 53, 1526, 2449, 3109, 1934, -498, -3132, -4025, -2675, -457, 550, -830, -3247, -4194, -2898, -264, 2575, 3695, 1877, -656, -865, 1556, 3819, 4871, 3191, 535, -1522, -2020, -1560, -305, 468, -209, -3037, -5193, -4691, -1644, 970, 1779, 1095, -797, -1082, 181, 3298, 5356, 4836, 2167, -539, -1179, 84, 1623, 1380, 224, -1889, -3786, -4986, -3258, -444, 967, 86, -2247, -3112, -1415, 1517, 4055, 4213, 2740, 808, -319, 572, 2943, 3676, 2226, -369, -2928, -3638, -2846, -1257, -350, -913, -2613, -4207, -3592, -381, 2465, 3237, 2009, 355, 20, 1523, 3680, 4404, 3782, 1448, -1139, -2314, -1462, -8, 344, -1062, -3062, -4581, -4311, -2219, 343, 1315, 745, -394, -1111, 362, 2578, 4386, 3946, 2399, 1040, -176, 287]
1454B87Q93L62j401j789j787m73J067J482P90n25j014J2J141K153J576J97n44
1471B427j057R3L3P72n8l32k029j693n40J83N20N31j61j484o59J386J748J380
1489A060N20m68l31P59P69k03K12M31m19j991p18k97n0p2m59j037m60M22P90L85
1509a157M12L27J94K69J649J020n93o28N85K44n55q63k05p78k08p47j214j64N05
1528a907M35k00k8M69Q14J6J347O33n09J98Q38P68j003p28q01N8K98m21j236r56
1548a915J96M3m14l9J076O55O2q1mL00J493J197P6j059m80k55p7M81Q3j591j255
1569a508k03pm26L18N05J75k21k7P36R18J295P61p57r80O30N47N16J25q28j644
1589g5j487Q9Q13J7km98j082l70R46P52J432Q65m31q41l28J288J336N41k15j290
$$ y = [287, 1180, 1542, 141, -1648, -3435, -3908, -2841, -1359, -569, -1094, -2108, -2096, -955, 1198, 2774, 2971, 2427, 1370, 1463, 1496, 2268, 2210, 1878, -151, -1844, -2384, -2201, -1681, -1150, -1311, -2795, -3454, -2068, -320, 1060, 1580, 1112, 781, 1540, 2309, 2106, 2318, 2749, 2330, 339, -379, -676, -726, -798, -1257, -2294, -2754, -2332, -1542, -1157, -745, -418, -224, 45, 1694, 2714, 2121, 1493, 2078, 2322, 1767, 904, 699, -79, -287, -1034, -2248, -2412, -1907, -1472, -1672, -1700, -1231, -417, -401, 946, 1579, 1070, 1268, 2106, 2874, 1871, 1143, 342, 400, 698, 277, -959, -1915, -1719, -1676, -2090, -2129, -1053, -398, -336, -417, -421, -121, 1372, 2569, 2645, 1586, 1106, 851, 774, 1255, 1338, -253, -1508, -1711, -1718, -2144, -1826, -1321, -1146, -1367, -1394, -658, 260, 1555, 2316, 1559, 579, 1209, 1756, 2272, 2397, 1569, -75, -1562, -1473, -660, -643, -645, -1143, -2225, -2595, -1649, -897, 535, 1400, 969, 128, -200, 1088, 2424, 2965, 2750, 1460]
1609A460j827l72P40N32m85p74j202r52q5J325J054L93L8p58j23J073J957J295
1627C289p72o67j186o14R75R49j33j661j611j138k80J348Q56L39q06r49m10O07
1645a864K072J986O03j412r55K32K55J234J185j163j843j220p41K79J089K89j270
1662a244j494o37P81J323J735N11k89j122L8J224J699J071m96j708j211m22M69
1679B28O67J31j079j660j650L99J216J356L48p46o62m90J274J608J166N19n61
1696B064j697p9P98M73M75n68j406j964m27N95J229K74r63q11q51R70J199K027
1714A338J72m50q33l09J233J010J053j055j203j190q65M00O60M33p40j565r54
1731b865L5J589J736K78n19r31k44R88J309J058j4j040j295P9k25R70M26p51j553
$$ y = [1460, -367, -739, 1, 533, 48, -726, -1928, -2880, -2965, -1640, -586, -193, -155, -913, -1036, 37, 1994, 3289, 2517, 1850, 664, 50, 1025, 1974, 1841, 180, -1431, -2569, -2849, -1501, -645, -306, -1112, -2061, -2471, -1864, 208, 2194, 2797, 1385, 430, 662, 917, 2151, 3336, 2173, 330, -890, -1631, -1352, -263, 26, -1244, -2738, -3375, -2594, -1271, 464, 975, 686, -436, -398, 826, 2525, 3596, 3100, 1392, 181, -241, 228, 895, 1026, -53, -1713, -3363, -2964, -1748, -392, -44, -790, -1452, -1942, -668, 940, 2106, 2625, 2064, 367, 288, 1086, 1559, 2034, 1466, 60, -1904, -2331, -1736, -507, -233, -1196, -2007, -2858, -1888, -689, 1338, 1510, 1060, 227, -82, 1151, 2161, 3214, 2159, 956, -234, -1099, -699, -39, 394, -346, -1911, -2865, -2830, -1241, 495, 773, 254, -677, -921, 67, 1376, 2434, 2420, 1380, 85, 164, -61, 909, 1335, 584, -969]
1750i69q88m44P29J263M39m29j031k72O38J184J351K13o27o61k51Q36K56P01n36
1769A502j549r55k31O1O97L13m36n45q90L04J168J053O84k81r03J25L91M42Q73
1788A823k85n56j040l55K88O9J20k39o15o61k99Q39M63O97k52l82j1L01J188M56
1808A549j96m01l6n13k76M43J04l76p63n88K9k24O07K18rm89JO10K77P92q5m7
1830F27K11K0J15j83n4L57n25o86m79j53K71k29J60k58j24n03R07M6O42J78k3
1851C17L06j43L36R7k45K07j16k26k42j37k63n35R5n65K48l2k04M29O5K13N63
1872A68k3P21l22P4M34m8j42j00o67k05j18J5p7q1j49j37k88m7M05N73j31R2l70
1895d23J8O78O72MN2k84m39P7K39j55P6m77n86m03j46N83pK45K46q44K18N25O73
$$ y = [-969, -1857, -2301, -1572, -309, 130, -299, -1330, -1602, -964, 220, 1571, 1784, 1157, 496, 245, 1081, 1337, 2038, 1502, -47, -1002, -1233, -1172, -475, -162, -598, -1143, -2033, -1729, -561, 492, 1176, 895, -8, 117, 508, 950, 1823, 1538, 982, -58, -413, -125, -56, 64, -175, -790, -1451, -1750, -911, -448, 249, -3, -385, -396, -95, 1093, 1549, 1353, 952, 916, 403, 127, 570, 674, 298, -465, -1053, -1024, -1248, -641, -423, -432, -921, -920, -310, -33, 759, 674, 627, 838, 858, 973, 790, 736, 1093, 568, -118, -597, -750, -479, -708, -548, -806, -930, -1433, -526, -480, 162, 340, 317, 623, 480, 816, 913, 668, 875, 759, 533, 291, 154, -109, -644, -549, -1114, -866, -898, -1102, -673, -608, -395, 168, 145, 866, 544, 618, 1052, 1004, 862, 762, 95, -110, -228, -213, -290, -371, -520, -657, -945, -992, -587, -14, -145, -53, -423, -405, 273, 945, 949, 1001, 717, 278, 355, 594, 439, 515, 38, -548, -951, -1097, -514, -521, -276, -30, -874, -656, -131, 542]
1918E42K94O9j26q02P1M99L90p3k84n72p44l45N85O61j28l22o52l70N08P43P34
1939F78J81p34j29l30L13J216K96m04q42q00pN28N04No09j016J5K1N43R40K94
1960F63n37n16m06Q92R58M79k96n39r31k19M95N04J87p67p11m87k3N76P20K95
1980C37l20p67m13P51R27O83L90q94p54k40M92R16J1m97r03o97m15R45P88k01
2000A39p5j084l22K78J108Q02J28j48r59l26M39J140L93l87r15j107p8L93N47
2019c4L56m91r76l08J53M92J108M21j8q79m92M80J145Q72l86n33r75n04M66Q03
2039G00r4p39n48o68l60J087O07M16l45j016M2L58R88J116P5o08o87m88L88N15
2059G39M98o22n02p63o92N92L26K79j23n59j77J37O42R30J98k50k47k65J98R21
$$ y = [542, 836, 905, 779, -23, 48, 547, 937, 864, 580, 8, -736, -1081, -496, 165, 37, -285, -937, -1307, -799, -56, 678, 859, 125, -4, -334, -21, 1195, 1491, 1087, 245, -555, -562, -34, 470, 475, -134, -1150, -1135, -1114, -571, 369, 663, 126, -390, -796, 96, 1054, 1533, 1237, 698, -233, -452, 43, 547, 734, -33, -744, -1231, -1254, -678, 42, 337, 17, -750, -1163, -412, 515, 1198, 1588, 694, -60, -300, 192, 1108, 1119, 622, -281, -978, -1393, -448, 340, 139, 64, -1020, -1342, -1064, 44, 846, 974, 826, -133, -459, -20, 1120, 1513, 1126, 211, -896, -974, -581, -34, 322, -169, -1145, -1453, -1300, -808, 300, 721, 703, -176, -668, -188, 957, 1829, 1443, 910, -65, -569, -103, 700, 606, -133, -681, -1349, -1709, -622, -15, 401, 56, -960, -918, -560, 428, 1544, 1619, 1011, 324, -164, 224, 739, 1237, 615, 113, -650, -1342, -750, -424, -145, -268, -827, -1004, -867, -225, 705, 903, 653, 406, 141, 339, 1260]
2079A260K43m82q38n18m4k52Q66K6n89r22k94J05O87O57L97m22j89MM38M70N66
2100A169L20p75m71J68q2M2K16j25p74n85j67J81N41j71K40m35L1L27L01O59L70
2121I80J2n94l24K45O09K4l17n18k48o18M15J64l06R8n32l52M87L40N27K31p1
2142B52J59k31O7K57L57l20J09l32l52Ok51N6l63l2J5j86Q1J49N56j35o2K24P3
2165I7L35j28M55j11o1P5r3k72j9m33j3k9k55Kj34J29K84l69J66K95m8J85P8M2
2189A78N68n9l25O5j58lk61K73k89m9m35Pp9l5K00J53p6j47J64J91O14k4J47Q4
2213G04n61R0K52N4k88r2m54m46K78j10L57J38k94m06K84K41L44L24J13j00m15
2234A3j38M11M33k04J4n78k9o9J45K18k14m36j57n47L98M57M39k0j80Q1k44L87
$$ y = [1260, 1503, 1021, 183, -335, -379, -631, 235, 261, -328, -1250, -1544, -1439, -752, -95, 302, -120, -309, -305, 133, 603, 1169, 1489, 714, 243, 411, 329, 371, 587, 462, -312, -897, -1064, -883, -342, -513, -273, -708, -677, -350, -49, 610, 980, 992, 398, 74, 319, 928, 952, 635, 117, -131, -749, -334, -170, -476, -378, -910, -1262, -775, -435, 92, 323, 252, 411, 180, 247, 504, 861, 541, 650, 318, -34, -28, -279, -223, -586, -618, -603, -789, -708, -559, -3, -138, -200, 24, 97, 432, 304, 759, 648, 587, 662, 569, 297, 278, -155, -168, -197, -452, -450, -584, -455, -171, -540, -374, -79, -127, 58, 136, 178, 746, 687, 362, 427, 269, 266, 5, 278, -11, -60, -495, -488, -567, -602, -402, -249, -325, -472, -308, -117, 497, 473, 620, 704, 143, 233, 485, 539, 251, 159, -295, -741, -463, -573, -216, -78, -372, -778, -494, -253, 91, 415, 528, 428, 13, -125, 286, 719, 515, 529, -49, -78, -147, -2, 216, 2, -434, -591, -1138, -740, -283, 156, 136, -44, 37, -207, 180]
2256A80N37M23k93k60n88R3N1j1K45j6r38k83k13M80M87j47J04l06J76J34P37
2277E92J21J67l32m33r8L33K68K24n26o14n92L14J39M50j03j21n53lP23J20P53
2298H29k59j67m49P1M15J90K83K2o75n36n50M47J58J15n6n71l87J77O15M73NK45
2320C95l23k14N94J4O07j79k32o90k52M22l05L44j34o58m47j7O01L41J42j33J9
2341a05l45M62N09N13O9l20k65l84l9L47M04l63o59n00n79M88M74N99l58n83k60
2362h95jJ031O34lq5l82J65o4M72J26k00k59p18l94O0M81j57J44o05o52L91N53
2384c58M47K99l74J86n38J70N16P45pn97k25l59l0K01J16j37o33k82J08J14L73
2405b65qM0l06k42N98M61Q17k07m06j56j17L07K4N0j63n79j56l93K66N1L60l57
$$ y = [180, 717, 1140, 847, 587, -1, 92, 143, 132, 377, 361, -577, -860, -1073, -593, -106, -253, -149, -455, -279, -145, 592, 713, 880, 548, 115, 17, 350, 618, 842, 316, -298, -890, -576, -437, 13, -90, -211, -764, -767, -44, 76, 829, 570, 403, -46, 25, 440, 630, 913, 935, 260, -276, -826, -379, -221, -106, -162, -733, -1120, -943, -328, 145, 150, 395, 72, -142, 452, 466, 1073, 894, 662, -28, -280, 142, -163, 181, 47, -611, -1058, -1075, -474, -133, 9, -124, -105, -450, 12, 521, 1034, 1103, 783, 518, 134, 95, 442, 846, 483, -176, -676, -1255, -767, -293, 306, -52, -635, -895, -896, 135, 769, 766, 681, 299, 464, 400, 872, 998, 798, 539, -179, -573, -513, -32, -189, -45, -650, -1302, -911, -358, 89, 388, 14, 200, -338, -168, 348, 1093, 1086, 489, 264, -95, -125, 76, 192, 55, -578, -860, -752, -638, -265, -273, -233, -539, -781, -183, 278, 1095, 888, 482, 326, 209, 516, 540, 590, 427, -152, -308, -701, -435, -384, -24, -381]
2427c81l65k16K60N76L90L31j48o4J33o12P00K25m4m59k78m76K09n5J19Ml88l67
2449i06j4N22L28K21k16j31J81K05L3O08j45J3l32l56K47J55m04m4m11l31r4M05
2471d66p9K98R1l48R6K37M79L50N0k52k52K06m1k20L82k5o08j43K0r7P3l45J72
2494d22M2j31L59R1J96P8J03J7J72j2K0Mk76m7J29k58K1k73m52J13L01k46j56
2517f27K79p0J79n5K99L90p6J76k01M35n42J04K64k51o4o99J10Qj96K47P5k60
2539d75o8j5L42j66N69K45l87P1P0M69j5r8j73j14o00M25J21l36j00n13K54l71
2561h65M69P3J77N0j4j41M52K3N19%r3k38l1l60L45J11m76l94k76J23J7L21J1
2584a97k9m06L40N4J39O12j11q7j98J72Q4P8K5O7m43o13J12J20j2K65l69l68m7
$$ y = [-381, -746, -962, -702, -126, 264, 595, 447, 383, 516, -96, 604, 829, 785, 326, 48, -428, -219, -274, -155, -151, -539, -906, -920, -398, -70, 151, -65, -196, -15, 190, 223, 831, 686, 699, 367, 11, 258, 413, 9, -35, -446, -777, -871, -466, -545, -247, -156, -504, -408, -171, 308, 658, 708, 456, 204, 410, 369, 149, 531, 506, -102, -245, -225, -322, -249, -594, -422, -380, -511, -152, -61, 135, 213, 316, 333, 505, 493, 513, 517, 241, 194, 323, 65, 86, -187, -639, -526, -225, -471, -627, -348, -418, -239, -294, 5, 395, 319, 495, 294, 729, 187, 291, 555, 304, 240, -459, -349, -341, -537, -290, -215, -475, -543, -558, -216, -382, 187, 432, 45, 116, 186, 655, 640, 542, 369, 255, -345, 80, 201, -135, -235, -748, -494, -865, -396, -323, -146, -96, -110, -251, 201, 224, 743, 743, 650, 412, 381, 21, 366, 477, 1, -393, -669, -546, -529, -208, -197, -226, -632, -292, -238, -99, 513, 402, 315, 117, 289, 373, 451, 476, 543, 100, -513, -401, -281, -293, -28, -397, -765, -812]
2607h12O8L37N78R6j09k53L9M65M91j54n0l25m70L7j22M72l29l1l64l21M1L80
2629c36k48M64J62j09k22O36j56L33R1l9J39p19J26K17J16m30k99l06R9K29K75
2650B3q1l53n0j63j4O12K79J93l4j31q2k03N58o9Nn73J36n71l4L75K86j62n93
2673f46m2m3O98p4L58p5j39J86k40K46O01J07q8o23l32K0J58j49J13m95k83j76
2695i18K83L36M56l48%m04K20M46O02mJ54m39k36L8J56k74M90n10n81l56R9K73
2717e17N40k17k69p4r9O19M23Q9qo5j85J50J40k9q6j41m09k54J45k3K86k35j73
2740c92K7l46K97N57J19L8M0m12L77J81N6j9o4pk39m28L77p8k53l2l78j75K12
2763e42K66K14L0n1J41K7P2K47K99j32j53j27M0m7q7J41n05N2m00j5J32L5K82
$$ y = [-812, -744, -407, 171, 267, 158, -95, -56, 409, 900, 746, 696, 371, -99, -62, -184, 288, -41, -72, -436, -757, -716, -336, -584, -120, 42, -67, -289, 347, 191, 524, 615, 576, 715, -4, 122, 339, 455, 25, -274, -580, -481, -252, 23, -58, -411, -461, -624, -638, -26, 253, 446, 412, 281, 199, -4, 554, 485, 490, -83, 53, -518, -552, -177, 109, -53, -646, -688, -731, -33, -107, 251, 176, 37, 223, -17, 229, 830, 937, 849, 226, -106, -86, 72, -77, 36, -459, -742, -918, -635, -299, 157, -191, -191, -595, -375, 71, 673, 669, 823, 384, 148, 186, 342, 68, 558, 48, -533, -889, -790, -517, 23, -194, -463, -537, -636, -17, 406, 495, 487, 422, 237, 387, 527, 498, 412, 271, -138, -392, -247, -270, 16, -219, -392, -365, -711, -414, 143, 262, 300, 340, -72, 305, 486, 542, 523, 459, 452, 213, -215, 162, 84, -169, -201, -579, -754, -542, -276, -62, -32, -83, 58, 85, 157, 404, 703, 571, 418, 291, 331, 284, 197, 338, -167, -115, -515, -530, -398, -363, -81]
2786h1k28Q6q6L41K48k9qj4J9kK86P6k41R9l67j01l76J00n8K84l74l46M01j22
2810d93N2K96J19L37j62J64pJ04L6R8j60j22k57K6J24m22j67N1j39J0J82j44K09
2833b65J28L44J6K02j68K00j6j95J23J55k20j94m9l0j36p5m8L5j71j6L01q3j45
2856c07L38Q2j51L70J03J57Q3l24K07k87k3o0m50p6J63p4Kk73N7P0J83r6R3K16
2880CK24j67N77l68j82K72p9n1J9j08k85k06J6o7J80J41l31R5m7p4K03L89N5k41
2904c2K74K59j75QJ59J13m97L3m13nJ06Q5K04o03k20J75K81k42K74L09j15N0m5
2927a7N79K42l22n0q6l94J4L16l9o2m81l04J64j10K74J22J8J72k35k31O38K69
2949D77L3j56J52l52k6M70J4j86j49n47k82L23R8J30n27J50m02K85K78Q7L98Q1
$$ y = [-81, -309, -223, -309, 32, 280, 251, 243, 229, 248, 246, 532, 608, 367, 466, 99, -2, -378, -278, -336, -52, -426, -772, -371, -493, -441, -145, -26, 311, 149, 313, 306, 410, 446, 544, 384, 262, 5, 31, 155, -267, -434, -383, -522, -512, -330, -474, -265, -137, 207, 223, 425, 257, 457, 441, 246, 369, 524, 304, 110, 61, 31, -105, -180, -228, -193, -364, -380, -79, -162, -307, 31, 113, -38, 332, 435, 592, 675, 351, 558, 271, 248, 188, -262, -338, -175, -249, -247, -520, -463, -393, -210, -306, -213, 3, 227, 60, 637, 269, 87, 359, 280, 229, 248, 140, -145, -351, -335, -402, -222, -81, -412, -317, -364, -438, -235, 154, 209, -32, 242, 501, 326, 334, 493, 606, 109, 142, -271, -276, -170, -85, 119, -484, -704, -529, -248, -490, -216, 93, -22, 28, -17, 562, 804, 482, 432, 346, -48, -34, 282, 243, 181, -300, -604, -440, -550, -276, -154, -136, 36, -199, -430, 208, 477, 510, 354, 506, 154, 128, 598, 612, 426, 277, -270, -552, -229, -131, -1, -528, -378, -780, -495, -217, -130, 268, 349]
2971C49l56K14K1K54J9J25l01j68k32O7q2k44L62j07n61M2M24n8L17k12J11j36
2993a52L26L1M64k44K74o07k6l50M05L02l40k43M2l11j71L94J61J59l80k67M59
3014g4p1M23L39l57r5K65k23J34Rk05j90l40k6n4P7J30K04j05m46J81K88J23K44
3037B31J30k16m7J12l7K53R2q9j82k76m5P3M8j47k19j10N4K15K15l34M49k68O
3060i2j72L53J61L45r0k13q1Q9K7o3l35k5k84k04j0M58k64L46k05O4j38K81K34
3083A82J16J17l51J58p9n4J61n6j36p0k08r3K2K39M7o45K49L41k79LN31n9o8K95
3107C63n6m1J03p0Q3l89J90l27l1J59K7k89r4M0O6k15J90L20l26J88M15l17J33
3130A22K55q7J78j09j78k50J40k36k19K29J28j88j09j35L26K61l66J72r6L32r7
$$ y = [349, -7, 207, 228, 482, 501, 626, 325, 157, -75, -8, -90, -334, 28, -79, -640, -598, -174, -232, 85, -127, -16, -152, 174, 205, 669, 425, 699, 92, 66, -284, 121, 423, 83, -160, -118, -429, -600, -206, -45, 114, -266, -533, -74, -145, 278, 617, 260, 165, 430, 207, 341, 350, 145, -45, -385, -411, -465, -388, -258, -54, -159, -605, -424, -136, -13, 231, 361, 145, 98, 210, 173, 426, 518, 429, 247, -29, -74, -1, 47, -100, -319, -429, -375, -160, 55, -279, 170, -98, -92, -264, 89, 250, 595, 505, 292, 211, 300, 327, 264, -71, -96, -380, -584, -594, -136, -400, -54, -259, -195, -333, -52, 182, 298, 415, 64, 222, 143, 89, 250, 194, 58, -12, -220, -313, -291, -52, -5, -650, -401, -60, -339, -336, 195, 136, 68, 363, 307, 266, 369, 299, 382, -7, 183, -144, -175, -16, 11, -278, -372, -332, -266, -481, -291, 29, -297, -109, 306, -11, 122, 377, 290, 468, 359, 181, -69, 71, -165, -384, -155, -27, -215, -324, -459, -133, 128, -238, -66, -162, 170, 73]
3151G3R5L24k89J32m8n4j61K27j21j14m00P9N7k08J26J64j18j62P5J66J26M02
3173C71j62J50m1k29j10L80k78J28j18j79o0q4j80K90j03J64j81jj87M0L70J63
3195A43l11L14J58j63K32n4j61L2k74k91K60o4L27l97K6L18j01m01L05P8J56J48
3217B80m9Jj02M9q2L05j60N8j36j42l1k43L88m49o0J83RK28l34Q0Q7P8M1K06J63
3242C68qm98L49j4j64M9QQ0l78j63r3M82k95K44k17m0j23L06J81qK49L9m37L25
3266B42k42M23n9Q4k48n12L68k30j22L95l43j18r6O0L35P4J4j23j8lK61q2J97
3289B57P3J3m74j8K05J77q0m12j00L7M3N8j89L67q5K0L5J52J32N4k6Q4K33m56
3313A00j22K4Q5o3r7j48j30J70N7J27p9l98N7J72N48r2R7o9j26k07N50l0J03k98
$$ y = [73, 168, 492, 203, 335, 287, 233, 72, 299, 178, 64, -336, -257, -200, -408, -282, -118, -236, -398, -323, -157, -31, 371, 209, 359, 318, 89, -21, 359, 81, 209, 91, -88, -148, -232, -412, -122, -225, -61, -242, -243, -430, -390, -20, 143, -168, 146, 304, 141, 373, 319, 158, 190, -84, -375, -115, -179, 148, -249, -223, 95, -6, -407, -102, -24, 132, 280, 231, 232, 130, 179, 97, 402, 242, 300, 164, 22, -9, -252, 136, -313, -373, -190, -181, 47, -287, -207, -120, -42, -1, 205, 368, 360, -138, 211, 197, 33, 82, 90, 170, -208, -371, -464, 18, -277, -33, -250, -290, -413, -107, 74, 66, 315, 354, -83, 242, 0, 423, 364, 448, 200, -312, 56, -174, -296, 99, -244, -362, -458, -398, -63, 11, 25, -98, -116, -119, 142, 60, 257, 330, 343, -131, -149, 56, 233, 153, -259, -359, -322, -279, -221, -410, -43, -128, -108, -73, 79, 211, 265, 239, 323, 556, 100, -22, 2, 87, 24, -73, -221, -351, -181, -124, 3, -76, -474, -417, -245, 303, 211, 308, 239, 113, -94, 456, 426, 529, 231]
3337B31l61J47Mk50k8J0O1j18k7n7N2L45L43k44j61n9J62L58%k70J26k3k09K4
3361E6K32k96l7l7k07j97j39M33K00j69J97m24N46q3J89j93K74l30N8J69J14k72
3383H4k57L60m47K3J13q8j13J45Lj80K20J28K16P0j5l4j81J56P8j72J14j05l6
3406H2k66K14l26L45m33J34o2J55m1J08L6J21J03o0jl7K8K64j58J08j95k30M81
3429C70m69j60K7j19j33K78R0K17j92j75M04j88L99n63M22j51J06K38k3r9n7j59
3451F3J13k98j76K2J72k38j13M10l17j85M80K8K90j09p9J82o0j71R8J95m15J07
3473aK2p5J1m6Q3M7l17Q6M1j30J19L6r5N25l04L5M84n27P9R4kN9L1m81N5n9J03
3500a27O7k31K12J96j97K24l12J80m2J67J56j03l3K68j26n23O47m33O1Q5N4j20
$$ y = [231, -130, 17, 21, -229, -257, -247, -186, -304, -331, -388, -336, 9, 352, 108, -53, -112, 50, 408, 408, 138, 264, 241, 32, 56, 288, -8, -45, -82, -289, -486, -625, -192, 8, -161, 36, -388, 158, 75, 264, 71, 345, 15, 73, 242, 356, 84, -173, 187, -260, -237, -124, -212, -325, -180, -177, -357, -137, -9, 207, 277, 262, 228, 47, 203, 281, 109, 223, 118, 82, -184, 30, -296, 49, -384, -250, -312, -157, -198, -90, -54, 67, 170, 110, 109, 72, 100, 364, 206, 314, 119, -111, 370, -99, -259, -232, -351, -484, -206, -116, 101, -91, -266, 138, -50, 349, -214, 208, 57, 163, 401, 378, 279, 222, 63, 176, -122, -298, -276, -104, -342, -455, -45, -362, -547, -67, -39, 251, 142, 63, 245, 185, 14, 112, 307, -108, -1, 21, -54, -43, -89, -6, 41, -276, -190, -149, -279, -160, -124, -219, 306, 2, 37, 521, -6, 73, 167, 165, 224, 255, -226, -171, -230, -127, -60, -291, -79, 117, -80, 144, -168, 12, -30, 137, 293, 190, 157, 425, 299, -224, 423, -10, 51, 136, 190, 70]
3522G0j70j39J5j07L22j21k29J31O7K90N2j8r6J58R9j43k91M7J33M8l29Q9o7m2
3546b31J35K1R0j69q2M27k98J60J27j96J57J7m6p2J45J8j74j79J77n80J85L02
3568f6k54n1K24P0p4R4p3K2P2J3K72j9J00j71k34J44K8j43J10k65P7j3R4J5m45
3593d73L29L26n56K22N2j50K98NJ66o9j05%oK92m28M23l92k6k71J42K41R2m20
3616c08K74l9L18qj18J7q1K10j49k5R9O0m56QJ29jJ5R8j79n9j9J44j99j0J74N1
3642e4P7ln8K54L4r9P4l35J40LQ0j06k63M45o06l3M58J19l04k19J10L81k2J05
3666A78l89M36nk02K13r6j48Q1J43j35O8l97RP8j62J48M64l13L1r6L07k06M88
3689D95n50N2n6L24k26l9N7qL8k36J76Oq1k25J06r4j2J98L1L01j42j30k17J74
$$ y = [70, -100, -239, -224, -331, -9, -130, -359, -228, -161, 129, 181, 163, 67, 225, 324, 181, -110, -63, 70, 118, -211, -122, -189, -231, -96, -75, 15, -154, -236, 191, -107, 53, 180, -16, 141, 158, 112, 40, 185, 203, 29, -150, 27, -553, -368, -66, -320, -371, -147, -77, -151, -57, -130, -108, -36, -23, 249, 230, 330, 159, -75, 69, 97, -46, 64, -201, -124, -137, -43, -28, -473, -144, 182, -374, -152, -100, -250, 48, 53, 219, 150, 45, 45, 39, 331, -97, 326, -66, -92, -363, -221, 20, 112, -308, -34, -73, 245, 237, 119, 136, 55, 265, 116, 91, 190, 250, -206, -198, -69, -70, -55, 43, -136, -195, -214, -70, -269, -279, -105, -54, 23, 20, -38, 216, 250, 151, 225, -110, 30, 33, 113, 7, -256, 189, -417, -450, 8, 127, -177, -396, -286, 95, 73, 178, -211, 225, 220, 18, 231, 135, -13, 68, 211, 76, 144, -253, -244, -166, -328, -180, 284, -29, 2, -94, 213, 7, 495, -55, -3, -59, 265, 39, 0, 57, 49, 87, -149, 27, 33, -48, -273, -167, -261, -273, -75, -44, 257, 115, -15, -232, -58]
3713e8J14K08P7l6j53j72j21Q2J03j11K4j89K15l14J32K3K03j34K00n8n9J84L0
3736A90K43M7n51J66L6j41K20l62m2J12j87j08J71O8o6n8J69p7L03j10l0Jn2J50
3760I2r6J77P7k77n3rJ23l61J98p8L38l56j05K01J70n0J04j77J26K36r2J80k56
3783A12L5j7J08l47O7q2P3j42R8j02k4L41m38K29j93R5K55L81j57o9j37k67N24
3806C43n7l18l9P0q8j21K76j49n8j10R4M7J32j05r0J41j51N81k56P9k0J36Kj99
3830A40r0j21K06j46j15L0N5L1m1l45K01k8j24L50J23K0k9K2K90l32R3K86k72
3853B04j1l56j15%J99P9jN7k58K78N6k06K04K65m49L85l6l21K89j63k7J37m28
3876b18K19O9l58r6K58J40k42K2p3R6K14j92K37n4O0L5n9L32j77j38L32j99J02
$$ y = [-58, 56, 264, 341, 305, 152, -20, -141, -59, 44, -67, -43, -232, -17, -331, -199, -176, 27, -107, 93, 35, -24, 160, 190, 433, 480, -71, 95, 131, -10, 210, -152, -194, -82, -269, -377, -206, -138, -204, -262, -93, -170, 133, 23, -7, -6, -58, 92, -4, 173, 250, -27, -80, -89, 34, -327, -129, -207, 131, -225, -330, -129, 41, -9, 95, -82, 44, 280, 188, 368, 112, 147, 130, 238, -109, -42, -124, -51, -193, -95, -197, -221, 120, -318, -89, -282, -187, 68, 449, 292, 223, 86, -181, 343, 286, -32, -71, -1, -89, -210, 66, -83, -141, -251, -157, -110, 22, -83, -173, -32, -183, 398, 142, 221, 201, 337, 339, 140, 50, -71, 135, -11, -126, -96, -41, -10, -51, -396, -195, -223, -347, 3, 126, 146, 117, 139, 429, 97, 190, 476, 204, 193, -163, -278, -278, -79, 0, -1, 56, -202, 76, 132, -74, 130, 395, -54, 331, 295, -26, 263, 100, 73, 210, -218, 1, 70, -288, -384, -126, 14, -228, -206, -279, -183, 31, -161, 76, 22, 82, 117, 58, 390, 213, 75, 407, 208, 310]
3899C10k05p0j76J9M9k5K35L6l05j13L03j31J60J4p7J81j94J43j13M73k63l20
3921f9J03r6M3j95O5J49J87n23JK66Q0N2J4L3J89j59m4l0q5O6pJ2j66J47n9rJ33
3948I8k04k11p4N02J16p2J39k76n9J36L87l80J43j54j63M4lKQ7j47j43Qj60L20
3972f4j67L36j84j9R3J14J67l03L85O2m88j02K00r8L35k4j91k66K7K47k12r3K07
3995c8j36r1k14L57J99m4j88J90l0j87N12R4k76Q6l08N0r3K92l80K56k61k14J3
4018d11K70J5J23N3MO8j27qK27r3j89K30Nk26M26l76J5j88J15o8O7k11J97j31
4042b13q5N9J82Q4J08J63n60L69K59k72j17J93on2k11J13k8k1J91l7n29J23K44
4065d3K09j61Nj19K12p4J11o4j31L73k12J32k43N8j59J1O4k00K35n2r5J99j15
$$ y = [310, 105, 35, -141, -122, -73, -98, 137, 173, -132, -245, 58, -73, 87, 101, 24, 205, 11, 154, 41, 514, 251, -69, 34, -62, -19, -214, -149, 0, 187, -336, -335, -69, 11, 63, 77, 110, 299, 140, 96, 66, -19, 47, 40, 52, -114, 33, -26, -35, 98, -106, -317, -391, 111, 227, 155, 294, 18, -41, 95, 482, 102, 245, 91, -72, -28, -31, -29, 58, -89, -232, -224, -384, -64, -231, 105, -79, -98, -5, 109, 276, -27, 358, 420, -68, -170, 30, -68, 267, 243, 52, -214, -187, 60, -152, -245, -38, -174, -265, -479, -122, 77, 33, -155, 35, 5, -182, 330, 424, 148, 234, -74, -24, -117, 175, -205, 51, -210, -424, -411, -141, -126, -3, 50, 54, 122, -5, -13, 214, 121, -68, 162, 167, -59, 367, -9, 6, -182, -67, -135, -68, -279, -82, -213, -298, -239, -57, 27, 135, 298, -262, 107, 366, 94, -23, 170, 164, 112, -99, 14, -14, -35, 156, 119, -410, -287, -43, 166, 5, 10, -109, 103, 29, 140, 76, -55, 318, 106, 238, -5, 53, -106, -95, -31, -231, 4, -48, -143, 56, -59]
4088e9K66l61P5L85K7j30j40J13j10J08j58J77j86l37L07J10r7m6m6K45j69q9
4110a15N8J00N7R7J50l35N6M24m85Q4j34r4K55j63j0J67Kk28O5j26J32O1q1J01
4134C8K22p1k99J29J52K2j64J81l2o10L50K72J28k20j49j04K24k83K20k72Q9J86
4156Il4J1q7J72j39K71j36Q8n7K68k55k9j25r1P4j87J04J55l99J60K19m7k89J48
4180a96J23K61J1k13q0K36k53L26k93L98k23j86m6J34j30j9r3J35K4LQ1K07l35
4203a28K24o8J33j47J29K46j08l43j3rj9J70o5J2j55Q8m06N28k25L65m07J5K38
4226E5k22L36j37j48K45j2l7K52k56l1l39K17j04J70n8j73K83j04J38o6j51K47
4248A05j63P4M3J84l6k82NK5j75N53l02j52jk95N65j05q6j27o7J32J81R1L9R5
$$ y = [-59, 207, -154, -79, 306, 333, 203, 63, 176, 66, 174, 16, 193, 7, -330, -23, 87, -10, -56, -102, 143, -26, -115, -57, 43, 100, 197, 347, 12, 68, 492, 7, 91, -43, -137, 118, -45, -55, 112, 114, -114, -49, -175, -43, 18, -63, 38, 260, 189, -110, 19, 171, 193, 29, 210, 178, -432, -82, 190, 318, 98, -51, -155, 69, -214, 6, -266, -177, 9, -25, -14, -101, 71, -68, 203, 67, 155, 98, 366, 111, 82, -43, -134, -60, -247, -143, 12, -387, -227, -8, -55, -344, -196, -73, 188, 199, -14, -94, 142, -111, 215, -78, 320, 97, -89, -135, -1, -131, -150, -243, -108, -84, -81, 0, 207, -128, 96, 28, 161, 14, 143, 389, 281, -62, -75, -84, -103, 67, 2, 14, -141, -53, -459, 69, -156, 209, -198, -183, 55, -167, 169, 32, -116, 129, 117, 80, 332, 76, 45, -294, -77, -181, -11, -69, -242, 41, -63, 75, 9, -142, 105, -58, 16, 59, 243, 207, -75, -70, -45, -220, 333, 31, -121, -122, -417, 148, 43, -43, -170, -237, -105, 76, 167, 206, 301]
4272C01l4j89j10m0QK71j84J44k80j20J61o4KP7K07Kn15L33q8J54m6N4j75L24
4296A93m6o2k15N81n69Q3p6j89M02k93L20j75j73q9L13q7J5M0J19l52K66J23Q4
4319B13p9N1j67M7n3Q6j52kL7O5l59j00K34p2L78k52j41N30k85J83M2j28N2j70
4343d2l3r0M12q2j04r3J39o8k23K77J0k71M2k8J72K30q0N5j91K91k24J43j87j51
4367i6L2K41k04k75K91J15m04L4K37J19j81j50J97J02J12l83L70j28j83m0J96
4388BN8k21kr7J21J95l01K87J6p2l63J89j84M82j23n9n8K21n1k4oJ28j79K35j94
4413@k74O93o59K72r7L4j2J18k48L14k65J02j51K47J54L5l73K72l20M29k67J20
4435A24K24k11J16m42m6J87k6j15L04j46L3k30J32M22l55k3J71m2n9k7j06N6K59
$$ y = [301, 267, 78, -32, -72, -64, 207, 23, 167, -113, -233, -72, -136, -134, -57, 150, 152, -363, -30, -118, 36, -10, 44, -131, 193, 147, 85, -130, 451, -118, -35, -111, -300, 102, -191, 129, -46, -219, -308, 5, -82, -67, -27, 92, -260, 6, 129, 213, 134, 185, 18, 65, 12, 98, -54, -56, -19, 46, -313, -413, -179, -251, 127, -125, -266, 264, -21, 162, 204, 76, 128, -42, -75, -165, 247, 165, 61, -32, 107, 39, -184, 93, 103, -168, -126, -154, 18, 248, 168, 223, 32, 323, 99, 242, 55, -96, -64, 177, -27, -302, -11, 104, -300, -266, -29, 90, -91, -241, -44, 58, 170, -213, 157, 29, -154, -194, 2, 60, -161, -163, -260, -139, 56, -245, 42, 58, -14, -377, -188, -372, 110, -13, -72, -130, 91, 40, 16, 10, 138, -41, 194, 0, -274, 419, -240, 32, -65, -31, -43, 75, -173, 141, -124, -22, -173, 74, 228, 263, -110, 162, -158, 271, 4, 124, 348, 137, 253, -189, -235, -48, -74, -189, 115, -31, 2, -228, -96, 326, -29, -52, 119, 77, 18, -9, -115, -59, 200]
4458B00k91K7J41j29j08J25j5K20m69Q2L01j23j29J53r9J15l7j6J42K03k29k33
4480a69L35q6j38R5r4o9J24O6k63J17j9R2l0k1K04r5N2j20J77k00J48J00k63O6
4504IN9R1j94J2j10K08j82N7K10k2j56K64l35Q7J89k40J90K8m7k60K23j73l28
4527d20J57M26k20J44j1k21j6j93J36J67k17K00J7O7j06M80m32L7NP3k73L20l39
4550b19P3J40j01k5j1J13j42P0k4J72R1j37Q2%K0mJ8L24l50n0j25J22K1Q1j68
4575b9p4J8j45r1J69J26K26l04Q9J51P3J6l62m9K01J12m42M31q7k10K64l2q9j60
4599a98J02Q5k64M39m05L36m5j95L84j82Oj86K77o4J36m37R3K59r6r8r6P6J69
4622I6k88J84N1j70K31l14K65j60NK13K15k06PM04m99K12j95p2rj72kJ88k86N72
$$ y = [200, -91, -64, 77, -52, -160, -35, -50, 170, -299, -217, 84, -39, -168, -15, -114, 1, -36, -52, 90, 293, 64, -169, 166, 80, -58, 37, -57, -126, -2, 64, -199, -82, -101, -9, -39, -60, 144, 49, 101, -19, 158, -42, 106, 206, -57, 9, 68, 159, -35, -23, -133, 75, -107, -50, 160, 138, -18, 246, -89, -2, 187, -53, 137, 165, 118, -142, 81, -92, -420, -263, 163, -57, 87, 76, -145, -161, -354, -218, -51, -268, -68, -51, 16, -90, 390, -42, -5, 0, 73, -200, 120, -219, -146, -6, -107, -132, -143, -30, -172, -102, -126, 46, 137, 0, 82, 82, 102, 98, 116, 440, 90, 40, -85, 37, 58, 139, -29, -103, -85, -230, -321, -152, -26, 200, -104, -15, 136, 209, 225, -137, -186, 15, 127, -315, 116, 29, -181, 83, 51, -38, -198, -96, -11, -275, 164, -241, 95, 50, -145, 239, 57, 63, -123, 154, 90, 226, -211, -118, 141, 45, -53, -149, -73, 96, -192, -8, 43, -127, 104, -210, 55, -105, -100, 113, 328, 122, 129, 533, 34, 246, 51, -21, -30, -202, -204, -16, -302, 270]
4646B70j95k93J36r2K86j50r2K54K7n12L03L37O0l45j79R5lM8k37j12N70l83J12
4669i5Oo6O1J37o8l14O0M89l61O11n76J2J43j4l44K28R4j95K94n59L69K24j14
4692B2j26Q2k76L83j9K15j27j07K5J80k29J9j67O3o2R5p4Q5j14L2R2J15j31k2
4716d6R9J04Q1l43M23k95J2j18J72N4k59qL56l85J95l01K78j66L2J5q4L10l87
4739b61J73L39j52L8L4j31R2O1m9l31J39J71j40N9J4k50J65j1j40J95K1p0M7J38
4763A51N0j76q6P4M5j16K80l02K39j64j84J02J58n9J90l31J76j68J89L6m68M98
4785A34k22n0K16j5k52J43P6J27k63M6J58nk58N7K7l4N1j45K74q9L3J71l64K83
4809I9l16k03L92O4n7L49j10k98J30K6J8k61K85l46L02l33L82N7j6k90J70j65
$$ y = [270, 75, -218, -82, -174, 112, -38, -130, 124, 151, -361, -58, 279, 339, -6, -185, -90, -93, -45, -282, -394, 176, -207, -95, -89, -155, -94, 43, -25, -339, -279, 210, -151, 460, -116, -104, 39, 25, -319, -91, 3, -192, 102, -457, -88, 136, 22, -104, -22, -298, 85, 66, 281, 154, 47, 72, 252, 23, 42, -125, -62, -124, -29, -103, -18, -132, -100, -8, 107, -24, -46, 53, 157, 238, -105, 318, 23, 35, -83, 89, 143, -116, -124, 232, -153, 42, -259, 19, -147, -115, -100, -184, 126, -261, -88, 251, 99, 137, 171, 40, 132, 193, 144, -187, -48, 123, -17, 42, 56, -194, -29, -40, -180, 15, 36, -34, 13, 151, 201, 25, -61, 13, 58, -58, 222, -80, 159, -5, -189, -87, 71, 12, 202, -129, 47, -121, 68, 104, -364, 134, -88, -138, 78, 63, -189, -46, 30, 157, -106, -60, 98, 93, -165, -108, -81, -115, -64, -209, 65, -24, 9, 180, -184, 99, -217, -420, -28, 36, -21, 328, 218, -80, 50, 76, 94, -167, 118, -228, 74, -259, 123, 180, 164, -126, 44, -121]
4831a21L18j12J01k72m1J60j39Q0J8J17l84K51m5j33K17j94L37j81M9K3K26j06
4853A69j9r7J0J56l38j25J90J18k3P6Mp9K1k44K05j45J8J25m0J72O2l44O3J08
4877D3J9j52L9L62q2k96k0J72M2k58m9M19l10j35K00k10r8K53Q8J80j26q7l29
4900c35K55J14j4Q8k02K30j34n7J69j59j47Q1J93n35M87j84J27j2RJ11j52M54
4922C87n70L05j81l7L57j00k39M98m28k16nL3J50q8O1J37N1O8j62m0jj03M39l51
4946c5J19j33L65j37j03K10n42oN93l14n4j47J49m3M7j1J1J20n2J10n2K40k81
4969E4n1K89j23k40J00J88l90M09j32p2j28o4K44l5K16m21K51j70J15j26J41k81
4991b26L83k02K4R0N8r8j04j32J82n1j46K7L31l86j2K5L08m41M26r3K1J43oJ12
$$ y = [-121, 197, 85, 186, -86, -127, 33, -106, -26, -8, 109, -275, -24, -69, -202, 15, -179, 158, -23, 26, 49, 275, 169, 150, 53, 63, 219, -119, -244, -54, 64, 41, 117, 121, 42, 63, -181, 24, -121, -103, 22, -18, 154, 216, -128, -65, 43, 62, -90, -51, 311, 229, -67, -87, 85, 127, -131, -180, 239, -71, -206, -6, -216, -314, -61, 27, 207, 81, -6, -335, -80, 34, 20, 108, -94, 136, 2, -55, 114, -45, -192, -111, 82, -453, 34, -150, -23, -35, -26, 85, -67, 387, -183, 122, -59, -96, 261, 161, -78, 420, -8, -224, -229, -196, -46, -134, -73, 64, 115, 183, 21, -19, -20, -123, 316, -35, 84, -49, 316, 179, 76, 286, -256, -262, 331, 17, -37, -184, -35, -78, -31, -42, -31, 89, 37, 147, 95, 335, 54, 3, 292, 169, -71, 29, 217, -173, 236, 104, 32, -96, -160, 84, 49, 265, -156, 95, -75, 40, -86, 55, -226, 157, -45, -21, 69, 127, 29, -75, -207, -25, -76, -222, -195, 136, -250, -262, -237, 71, -370, 56, -37, -16, 127, 121, 233]
5015B33n11N51m30K19k61K39p0J0R3J8m00L67j34K82k48J01j9l0R0k37L88R6l98
5038e1J99j41j34R4q7k3N7J26j76J08o6j61L85M9j39J4l90K30J87R9o1l53M21
5061A87j32J56j07k14J03L73l66J3m0K25j99j94K39l68L88J49l06Q8M11k77J65
5082B94j53J08m30K26j26P0m6p0Q9n7l2k70J40O0J82P3oj02j75K63J55k94J82
5105H1K8k12o8J05Q2k11K51P8k55J95l50M17j51O2m5J33k15J34l2j08J15P8J63
5128B75m57L45j48Q3q1j77K81j58nk84L17M8R4k17M4K17L3k45K7M13m43Qo6J11
5152A5J21r4L5j39J49k44N1RJ30j37k0k03L15j06K8n8L55k13m2n6J09r6r7J56
5176c2j4J19q8n3R8j20j0k56L08j4J05p7J80j30q6L03r5l75L72n03L90J85j38
$$ y = [233, -278, 273, -157, 62, -199, 40, -30, -20, 73, 91, -309, 58, -76, 206, -42, 59, 40, 10, 100, -137, 251, 347, -51, 148, 7, -127, -33, -120, -143, -86, 40, -136, -28, -94, -255, 130, 179, 40, 54, -336, -106, 81, 180, 119, -234, 187, 55, 211, 104, -110, -7, 366, 0, 13, -27, 198, -1, -195, 44, -324, 64, 213, -93, -5, 406, 129, 294, 141, 249, -181, 45, -81, -11, -57, -127, -38, -95, -127, -397, -257, -197, -15, 58, 52, -50, -225, 38, 193, -101, 81, 109, -103, -171, -66, 16, -195, 56, 134, -121, 74, -276, 141, -10, 52, 7, 140, -75, 59, 27, -81, 34, 112, 275, -182, 163, 15, 98, 17, -160, 121, -37, -42, -326, -9, 39, 133, -84, -40, 177, 210, -35, -8, 405, -38, -30, -96, 15, 136, 42, 77, -62, 87, -157, -106, -97, 33, -104, -124, -327, -12, -118, -90, -148, 207, -6, -48, -104, 5, -91, -188, -32, -46, 73, -15, -68, 30, -90, -100, -356, -48, -62, 43, -34, 146, 16, -70, 233, 138, -237, 135, -368, 22, 207, 69]
5199F9r3O5j48k7K96m11L26k53L43k37j44P5L14k97K07K6o5Q5k42l5K16k01j0
5222a41J43K7n5o5r1m7J8L10k22K3J18j46K40l8J8q5O1O7k99K71l50K54K59l10
5246d0J50k76K30l5J06j99L6j10J85J20nl59K38K6OJ3k5k78K39o6j66J05j14K95
5270G6K6K00m61K26j19l0M6L27k3k24m0j4P4q4k77N19k53j84O4K35k7L21m13K88
5294B53k60J36o7j41J48j40J57l2J8o7K40J4j28n8k53J70j36k33L56o6m0M2k53
5317c40J95q1o2K07j19K42j25J93m6j34L52m64K44o3L6J94j91J32l19k22L05j04
5339a70K61j23J64j92J00p7J12o0L32k05P7j92M9k60%J89J48J62m38O1N3j08K71
5362A54k52N1j64K79M1j98N6k36M89l16N4L59q1l21J44j99K28k6r2k27J22j02
$$ y = [69, -24, 41, -107, -134, 162, -249, 77, -176, 167, -70, -214, -139, 175, -122, 85, 111, 46, 131, -111, -146, 70, -131, -141, 2, 29, -26, -91, -182, -229, -211, 99, -123, -100, 18, -128, 112, 74, 92, 7, 68, 135, -164, 107, -243, 11, 270, -40, 110, -166, 64, 29, 135, -64, -28, -138, 47, 167, 162, -197, 41, 67, 73, 86, 61, -217, 22, -44, -210, -105, -219, 76, 102, 302, -159, 67, -52, -82, -36, 291, 268, 44, 4, -10, 64, -20, -297, 222, -31, -215, -151, 84, 57, 378, -35, 253, -7, 129, 62, -79, 69, -71, 86, 54, 72, 5, 245, 259, 131, 73, -180, -10, -146, -379, -23, -89, -129, -87, -340, -145, -226, -288, -81, -200, 42, -83, 110, 64, -70, 282, -182, 62, -1, 35, 229, 38, 170, -149, -371, -66, -170, 91, -32, 132, -60, 40, -37, 75, 15, 347, 142, 219, 27, 76, -184, -184, 5, 153, 315, -123, -62, -9, -117, 154, -98, -47, -211, 68, 109, -89, -33, -269, 220, -96, -42, 317, 236, -85, 59, -140, 88, 62, -30, -257, -135, -237]
5384b37K61L6j79K04j81J15n6k35L06J07j78J85l01J12n2J66q8k5n9jJ89l09L1
5407a89L25m7k28J28l64M1N47j78p3M8L05l37O2r1%K7r1J13K3j69J00K12q8o3
5431A3Q2j98J2J13k42K83m5J5K7n2j08L24o7l15J44P1k32L57j16q2j3J0K56o23
5455c86N08j6j80M26J5j35k32J02K87n64P0l0P0J68k7j7J90k91j00Q4k16J14J10
5478e0p2pL52j21j41K9J44m4Q3l02Q1P6R1l03K3p2J28K40k08J31j82K69l24N26
5502C47J07m69j1J53j52K13p2q0j29M84q2o11K48N2l5K0m39O21j5l33J23J71j65
5525e4mq3K47j52O5K71k17k60N2j18K92k34n2J63kj12j65L83j69M10k27o1n7K25
5549A41j0k84K09q2J47j12K25j83Lp4J66j66j8q7K05k03M2K1j2K06l58J6K30N2
$$ y = [-237, 24, 60, -119, 85, -96, 19, -37, -272, 34, 141, -37, 148, -153, -41, -93, 73, -15, -40, -99, -100, 89, -220, -189, 136, 89, -139, -11, -375, -334, 213, 35, -38, 10, 315, -22, 40, -51, -51, -24, -115, -2, 21, -148, -48, 164, 76, 13, 95, -103, -91, 22, -220, 63, 18, 33, 60, 8, -100, 224, 157, -158, -14, 57, -175, 182, 66, -16, -29, -19, 237, -386, 122, 106, -74, 352, 367, 232, 0, 102, 389, -175, -105, -135, -65, 103, 76, 59, 249, -42, -142, -58, -274, -160, -50, -122, -129, 223, 102, -39, -10, 134, 90, 173, -129, -48, 28, 119, -184, -161, -233, -105, 135, -73, 58, -124, 145, -179, 347, 454, -15, -26, 127, -25, 188, 116, 36, -93, 391, 309, -302, -54, -2, -37, -17, -456, 165, 150, -183, -60, 111, -54, -58, -141, 106, -46, 19, 290, 73, -187, -135, -253, 39, -195, -247, -84, -86, -198, -363, 20, -149, 261, 34, -27, -84, 141, 131, -153, 56, -26, 121, 9, 234, 51, 54, -20, 146, -20, -38, -125, 80, -123, -81, -60, -72, 134, -224, -208, 22, 74]
5573G4j58J65j67M5ML1P7j23O8K2J63k58J07K4k24L90l62J06J2j13K81l4p8K47
5597B99k60J00J05p1k67k9L68m46O9J83l31L24J13k94Q3j77M20l48nK32L62m30
5619@j65K85j46J0O9J4J54k62r5J84j33j40J68o1L5O9J79p3M1K7j21K89m70J77
5643C5J46j00j07J04p7j69J64k01P2n15N74J15J12k68Q8J3R1l1P3m44O3N32l3
5666B37l88r3L40j41J84k41R0j66J72K4j59K2L2j49J28J19J66K92o11K32p8r0
5688g8K03m6l4k4k93M56k00j58J02J40j23K69n12K49J23k6L2J44m02K26J2J1r3
$$ y = [74, -84, 81, -86, -41, -37, -6, 71, -52, 16, 38, 201, -57, 50, 74, -150, 240, -122, -16, -4, -117, 164, 130, 52, 299, 39, 139, 244, 173, -94, -123, 245, -201, -132, 51, -280, 44, 157, -137, -54, -231, 189, -159, -164, 68, 430, 0, -165, 120, -26, -16, 53, 67, 221, -41, -136, 48, -85, -225, -57, -118, -83, -14, 165, 92, 133, 160, 39, 328, -142, 35, 181, 81, -26, 78, 1, -168, -4, -205, -133, -648, -74, 41, 153, -115, -27, -14, 77, 46, 119, -325, -262, 270, 237, -151, -244, 96, -45, 139, -102, -12, -178, -6, 18, -141, -119, -87, -236, -108, 11, 177, 469, -142, 90, 12, -78, 125, 79, 45, 21, -272, 184, -16, -174, -72, 68, -55, 214, -298, -49, 74, 48, 80, 224, -178, 48, 60, 71, -22]
$$ [...]
8191a65
##END NTUPLES=NMR FID
##END=
