##TITLE=1H_LR-761-C1-M
 CDCl3
 8 sc, 
 27.6.2024
##JCAMPDX= 6.0         $$ Bruker NMR JCAMP-DX V2.0
##DATA TYPE= NMR FID
##DATA CLASS= NTUPLES
##ORIGIN= UXNMR, Bruker Analytische Messtechnik GmbH
##OWNER= root
$$ XWIN-NMR		Version 3.5
$$ Thu Jun 27 16:25:20 2024 Russian Standard Time (UT+4h)  she@DPX200
##.OBSERVE FREQUENCY= 200.1313
##.OBSERVE NUCLEUS= ^1H
##.DELAY= (6, 6)
##.ACQUISITION MODE= SIMULTANEOUS
##.ACQUISITION SCHEME= undefined
##.AVERAGES= 9
##.DIGITISER RES= 18
##SPECTROMETER/DATA SYSTEM= spect
##.PULSE SEQUENCE= zg30
##.SOLVENT NAME= CDCl3
##.SHIFT REFERENCE= (INTERNAL, CDCl3, 0, 15.7039)
##AUDIT TRAIL= $$ (NUMBER, WHEN, WHO, WHERE, WHAT)
$$ ##TITLE= Audit trail, XWIN-NMR		Version 3.5
$$ ##JCAMPDX= 5.01
$$ ##ORIGIN= Bruker BioSpin GmbH
$$ ##OWNER= she
$$ F:/spectra/data/she/nmr/H-F/1/audita.txt
$$ ##AUDIT TRAIL=  $$ (NUMBER, WHEN, WHO, WHERE, WHAT)
(   1,<2024-06-27 16:24:07.15 +0400>,<she>,<DPX200>,
      <created by zg, POWCHK disabled, PULCHK disabled
       terminated by command 'halt'
       configuration hash MD5:
       00 E9 B6 7A A2 85 ED C7 34 08 36 98 17 FE 4E 26
       data hash MD5: 16K
       79 C4 9E D5 23 8D FD C7 E0 80 FD 6D C4 4F 87 E8>)
$$ ##END=
$$ 
$$ hash MD5
$$ F1 0D 59 C0 3C EF 9C 06 89 DC 07 7A 05 E5 AA EB
##$RELAX= 
##$RELAX= 
##$RELAX= 
##$RELAX= 
##$RELAX= 
##$RELAX= 
$$ Bruker specific parameters
$$ --------------------------
##$DU= <F:/spectra>
##$EXPNO= 1
##$NAME= <H-F>
##$PROCNO= 1
##$TYPE= <nmr>
##$USER= <she>
##$AMP= (0..31)
100 100 100 100 100 100 100 100 100 100 100 100 100 100 100 100 100 100 
100 100 100 100 100 100 100 100 100 100 100 100 100 100 
##$AQSEQ= 0
##$AQ_mod= 1
##$AUNM= <au_zg>
##$AUTOPOS= <>
##$BF1= 200.13
##$BF2= 200.13
##$BF3= 200.13
##$BF4= 200.13
##$BF5= 200.13
##$BF6= 200.13
##$BF7= 200.13
##$BF8= 200.13
##$BYTORDA= 1
##$CFDGTYP= 0
##$CFRGTYP= 5
##$CHEMSTR= <none>
##$CNST= (0..31)
1 1 145 1 1 1 1 1 1 1 1 1 1 1 1 1 1 1 1 1 1 1 1 1 1 1 1 1 1 1 1 1 
##$CPDPRG= <>
##$CPDPRG1= <>
##$CPDPRG2= <>
##$CPDPRG3= <>
##$CPDPRG4= <mlev>
##$CPDPRG5= <mlev>
##$CPDPRG6= <mlev>
##$CPDPRG7= <mlev>
##$CPDPRG8= <mlev>
##$CPDPRGB= <>
##$CPDPRGT= <>
##$D= (0..31)
0 1.2 0 0 0 0 0 0 0 0.06 0 0.03 0 0 0 0 0.0002 0 0 0 0 0 0 0 0 0 0 0 0 
0 0 0 
##$DATE= 1719491046
##$DBL= (0..7)
120 120 120 120 120 120 120 120 
##$DBP= (0..7)
150 150 150 150 150 150 150 150 
##$DBP07= 0
##$DBPNAM0= <>
##$DBPNAM1= <>
##$DBPNAM2= <>
##$DBPNAM3= <>
##$DBPNAM4= <>
##$DBPNAM5= <>
##$DBPNAM6= <>
##$DBPNAM7= <>
##$DBPOAL= (0..7)
0.5 0.5 0.5 0.5 0.5 0.5 0.5 0.5 
##$DBPOFFS= (0..7)
0 0 0 0 0 0 0 0 
##$DE= 6
##$DECBNUC= <off>
##$DECIM= 32
##$DECNUC= <off>
##$DECSTAT= 4
##$DIGMOD= 1
##$DIGTYP= 9
##$DL= (0..7)
0 120 120 120 120 120 120 120 
##$DP= (0..7)
150 150 150 150 150 150 150 150 
##$DP07= 0
##$DPNAME0= <>
##$DPNAME1= <>
##$DPNAME2= <>
##$DPNAME3= <>
##$DPNAME4= <>
##$DPNAME5= <>
##$DPNAME6= <>
##$DPNAME7= <>
##$DPOAL= (0..7)
0.5 0.5 0.5 0.5 0.5 0.5 0.5 0.5 
##$DPOFFS= (0..7)
0 0 0 0 0 0 0 0 
##$DQDMODE= 0
##$DR= 18
##$DS= 0
$$ [...]
##$SUBNAM2= <"">
##$SUBNAM3= <"">
##$SUBNAM4= <"">
##$SUBNAM5= <"">
##$SUBNAM6= <"">
##$SUBNAM7= <"">
##$SUBNAM8= <"">
##$SUBNAM9= <"">
##$SW= 18.0517328524113
##$SWIBOX= (0..15)
0 0 2 0 0 0 0 0 0 0 0 0 0 0 0 0 
##$SW_h= 3612.71676300578
##$TD= 16384
##$TD0= 1
##$TE= 0
##$TE2= 300
##$TE3= 300
##$TEG= 300
##$TL= (0..7)
0 120 120 120 120 120 120 120 
##$TP= (0..7)
150 150 150 150 150 150 150 150 
##$TP07= 0
##$TPNAME0= <>
##$TPNAME1= <>
##$TPNAME2= <>
##$TPNAME3= <>
##$TPNAME4= <>
##$TPNAME5= <>
##$TPNAME6= <>
##$TPNAME7= <>
##$TPOAL= (0..7)
0.5 0.5 0.5 0.5 0.5 0.5 0.5 0.5 
##$TPOFFS= (0..7)
0 0 0 0 0 0 0 0 
##$TUNHIN= 0
##$TUNHOUT= 0
##$TUNXOUT= 0
##$USERA1= <user>
##$USERA2= <user>
##$USERA3= <user>
##$USERA4= <user>
##$USERA5= <user>
##$V9= 5
##$VALIST= <valist>
##$VCLIST= <CCCCCCCCCCCCCCC>
##$VD= 0
##$VDLIST= <DDDDDDDDDDDDDDD>
##$VPLIST= <PPPPPPPPPPPPPPP>
##$VTLIST= <TTTTTTTTTTTTTTT>
##$WBST= 1024
##$WBSW= 4
##$XGAIN= (0..3)
0 0 0 0 
##$XL= 0
##$YL= 0
##$YMAX_a= 484311
##$YMIN_a= -662770
##$ZGOPTNS= <>
##$ZL1= 120
##$ZL2= 120
##$ZL3= 120
##$ZL4= 120
##$ABSF1= 10
##$ABSF2= 0
##$ABSG= 5
##$ABSL= 3
##$ALPHA= 0
##$AQORDER= 0
##$ASSFAC= 0
##$ASSFACI= 0
##$ASSFACX= 0
##$ASSWID= 0
##$AUNMP= <proc_1d>
##$AZFE= 0.1
##$AZFW= 0.1
##$BCFW= 1
##$BC_mod= 2
##$BYTORDP= 1
##$COROFFS= 0
##$CY= 11.3945322036743
##$DATMOD= 1
##$DC= 2
##$DFILT= <>
##$DTYPP= 0
##$F1P= 15.6554695791079
##$F2P= 12.8336369535428
##$FCOR= 0.5
##$FTSIZE= 0
##$FT_mod= 4
##$GAMMA= 1
##$GB= 0.15
##$INTBC= 1
##$INTSCL= 1
##$ISEN= 128
##$LB= 0.24
##$LEV0= 0
##$LPBIN= 0
##$MAXI= 10000
##$MC2= 0
##$MEAN= 0
##$ME_mod= 0
##$MI= 1.114404
##$NCOEF= 0
##$NC_proc= 0
##$NLEV= 6
##$NOISF1= 3.799351
##$NOISF2= 2.8
##$NSP= 1
##$NTH_PI= 0
##$NZP= 0
##$OFFSET= 15.70392
##$PC= 1
##$PHC0= -25316.13
##$PHC1= 9.38748
##$PH_mod= 1
##$PKNL= yes
##$PPARMOD= 0
##$PSCAL= 0
##$PSIGN= 0
##$REVERSE= no
##$SF= 200.130013532006
##$SI= 16384
##$SIGF1= 3
##$SIGF2= 2
##$SINO= 400
##$SIOLD= 16384
##$SREGLST= <1H.CDCl3>
##$SSB= 0
##$STSI= 0
##$STSR= 0
##$SW_p= 3612.71676300578
##$SYMM= 0
##$S_DEV= 0
##$TDeff= 0
##$TDoff= 0
##$TI= <>
##$TILT= no
##$TM1= 0
##$TM2= 0
##$TOPLEV= 0
##$USERP1= <user>
##$USERP2= <user>
##$USERP3= <user>
##$USERP4= <user>
##$USERP5= <user>
##$WDW= 1
##$XDIM= 8192
##$YMAX_p= 0
##$YMIN_p= 0
$$ End of Bruker specific parameters
$$ ---------------------------------
##NTUPLES= NMR FID
##VAR_NAME=  TIME,          FID/REAL,        FID/IMAG
##SYMBOL=    X,             R,               I
##VAR_TYPE=  INDEPENDENT,   DEPENDENT,       DEPENDENT
##VAR_FORM=  AFFN,          ASDF,            ASDF
##VAR_DIM=   8192,          8192,            8192
##UNITS=     SECONDS,       ARBITRARY UNITS, ARBITRARY UNITS
##FACTOR=    0.0002768,     1,               1
##FIRST=     0,             0,               0
##LAST=      2.2672688,     0,               0
##MIN=       0,             -662770,         0
##MAX=       2.2672688,     484311,          0
$$ Real data points
##PAGE= N=1
##DATA TABLE= (X++(R..R)), XYDATA
$$ [...]
$$ plain form
2180 488 -194 470 1878 150 -1413 -186 1236 602 408 1402 292 -1613 -660 568 9 277 1183
2197 1183 -697 -2419 -351 1474 803 229 631 -762 -999 1238 1853 -29 -49 760 -641 -1371 328
2214 328 677 -281 -216 375 -1286 -1451 836 1341 -439 -341 -95 -127 303 1552 1007 -543 -508 903 251
2233 251 -158 629 534 -728 -775 -148 -413 -17 1333 676 -1051 -740 357 642 859 1038 -138 -735 183
2252 183 1446 202 -144 308 -47 -987 97 294 -94 34 346 -624 -1001 197 1380 832 332 -306
2270 -306 -388 -479 1014 1373 211 -142 257 -214 -167 300 422 2 -172 -194 -964 -838 827 1260 775 -551
2290 -551 -683 121 808 1456 1155 26 -145 151 -40 -186 426 301 -451 -796 -1066 -599 -99 751 867 -200
2310 -200 -790 -274 775 1363 929 364 -386 -135 76 437 792 754 440 -691 -1142 -239 96 742 306 -638
$$ packed form
2180D88o82O64J408j728j563J227J422o34j94R94j110j905R53J228n59K68R06
2197A183j880j722K068J825o71n74M02j393k37K237O15j882k0Q09j401p30J699
2214C28L49r58O5N91j661j65K287N05j780R8K46l2M30J249n45j550L5J411o52
2233B51m09P87r5j262m7O27k65L96J350o57j727L11J097K85K17J79j176n97R18
2252A83J263j244l46M52l55r40J084J97l88J28L12r70l77J198J183n48n00o38
2270c06q2r1J493L59j162l53L99m71M7M67J22m20j74k2p70J26J665M33m85j326
2290e51j32Q04O87O48l01j129j71K96j91j46O12j25p52l45k70M67N00Q50J16j067
2310b00n90N16J049N88m34n65p50K51K11L61L55l8l14j131m51R03L35O46m36r44
$$ plain form
2330 -638 -1364 -1082 108 1442 1227 273 -426 -402 351 1249 1018 1201 465 -582 -844 -481 614 1151 436
2349 436 -361 -1253 -1653 -290 794 1405 336 -705 -975 -262 925 1869 853 478 -351 -803 -352 933
2367 933 1591 1299 -352 -1660 -1776 -611 1092 1530 -156 -1338 -1372 -598 825 1764 1438 -17 -746 -511
2385 -511 104 810 1842 1376 -310 -1332 -1143 6 1116 1344 228 -1483 -1909 -779 541 1037 1096
2402 1096 44 -865 -1138 311 1457 1548 1703 184 -1177 -646 567 1450 1446 691 -1351 -2019 -919 608
2420 608 1162 709 172 -1303 -1524 17 1458 1523 981 100 -937 -903 641 2011 1475 676 -764 -1296
2438 -1296 -1240 981 1809 575 -745 -965 -1219 -427 1000 1397 345 -513 -545 -920 -11 2014 1680 173
2456 173 -950 -569 -430 565 1738 1257 -905 -1329 -387 -269 369 1260 464 -1395 -1227 -280 89 533 1657
$$ packed form
2330f38p26K82J190J334k15r54o99K4P53Q98k31J83p36j047k62L63J095N37p15
2349D36p97q92m00J363J084O11j069j041k70P13J187R44j016l75q29m52M51J285
2367I33O58k92j651j308j16J165J703M38j686j182l4P74J423R39l26j455p29K35
2385e11O15P06J032m66j686j022J89J149J110K28j116j711m26J130J320M96N9
2402A096j052r09k73J449J146R1J55j519j361N31J213Q83mp55k042o68J100J527
2420F08N54m53n37j475k21J541J441O5n42q81j037L4J544J370n36p99j440n32
2438a296N6K221Q28j234j320k20k54P92J427L97j052q58l2l75R09K025l34j507
2456A73j123L81J39R95J173m81k162m24R42J18O38Q91p96j859J68R47L69M44J124
$$ plain form
2475 1657 938 -1162 -982 225 529 1258 1562 -208 -1632 -434 995 721 273 466 -536 -1397 -394
2492 -394 1060 348 20 629 -500 -1633 74 1695 660 76 221 -856 -853 632 1764 35 -313
2509 -313 84 -755 -607 501 1251 -319 -672 374 -529 -680 840 1386 -236 -662 371 -81 -137 1652
2527 1652 1188 -942 -465 678 122 -102 638 220 -1327 -588 613 -195 -137 908 361 -1413 -579 916
2545 916 308 27 981 194 -1208 111 1379 218 -350 600 402 -669 396 1209 -553 -893 396
2562 396 6 -1135 519 1580 -387 -708 623 -74 -413 1196 1597 -332 -866 601 181 -160 817
2579 817 925 -1015 -940 363 -207 -810 556 955 -971 -704 811 544 -264 1008 794 -661 -253 1398
2597 1398 698 -260 623 393 -1083 -410 1284 9 -904 261 169 -1294 102 1495 160 -780 393
$$ packed form
2475A657p19k100J80J207L04P29L04j770j424J198J429k74m48J93j002q61J003
2492c94J454p12l28O09j129j133J707J621j035n84J45j077LJ485J132j729l48
2509c13L97q39J48J108P50j570l53J046r03j51J520N46j622m26J033m52n6J789
2527A652m64k130M77J143n56k24P40m18j547P39J201q08N8J045n47j774Q34J495
2545I16o08k81R54p87j402J319J268j161n68R50j98j071J065Q13j762l40J289
2562C96l90j141J654J061j967l21J331o97l39J609M01j929n34J467m20l41R77
2579H17J08j940P5J303n70o03J366L99j926K67J515k67q08J272k14j455M08J651
2597A398p00r58Q83k30j476O73J694j275r13J165r2j463J396J393j335r40J173
$$ plain form
2614 393 272 -925 633 1975 553 -734 314 -193 -752 235 1350 -184 -950 42 90 -974 135
2631 135 1201 -298 -605 363 323 -143 735 1303 -311 -669 969 711 -593 407 1302 -825 -1124 649
2649 649 337 -750 305 863 -1013 -922 522 763 -160 491 981 -948 -598 1184 386 -395 783 687
2667 687 -722 -555 770 177 -561 263 579 -546 -469 635 553 -613 526 737 -536 -82 1392 -116
2685 -116 -974 425 424 -279 -239 264 9 -592 320 522 -540 -88 669 313 -200 456 489 -382 224 802 -65
2706 -65 -418 1051 584 -703 -87 195 -121 -324 599 68 -456 -127 760 -13 -117 560 442 -306 382 554
2726 554 288 99 850 397 -643 -146 272 37 -79 327 -129 -728 55 778 -83 -44 85 -98 -59 669
2746 669 884 306 11 129 -193 -278 489 691 -145 -512 -557 -113 -264 850 718 -79 -520 41 65 599 955
$$ packed form
2614C93j21j197J558J342j422j287J048n07n59R87J115j534p66R92M8j064J109
2631A35J066j499l07R68m0m66Q78N68j614l58J638k58j304J000Q95k127k99J773
2649F49l12j087J055N58j876R1J444K41r23O51M90j929L50J782p98p81J178r6
2667F87j409J67J325n93p38Q24L16j125P7J104q2j166J139K11j273M54J474j508
2685a16q58J399jp03M0N03k55o01R12K02j062M52P57l56n13O56L3q71O06N78q67
2706f5l53J469m67j287O16K82l16k03R23n31n24L29Q87p73j04O77j18p48O88J72
2726E54k66j89P51m53j040M97M18k35j16M06m56n99P83P23q61L9J29j83L9P28
2746F69K15n78k95J18l22q5P67K02q36l67m5M44j51J114j32p97m41N61K4N34L56
$$ plain form
2767 955 620 -98 -183 139 286 80 685 491 -426 -441 -152 14 174 638 -36 -390 -408 -120 643 614 140
2788 140 114 -87 154 381 289 604 535 -165 -470 -142 328 166 106 -64 -324 -477 90 528 450 176 194 -248
2810 -248 3 421 392 493 457 -75 -246 -328 147 313 91 30 -526 -484 -149 334 333 207 -118 -186 158 322 409
2833 409 576 431 174 192 218 228 143 337 -8 -194 -58 -80 -193 93 120 57 -57 117 -53 309 452 613
2855 613 488 189 370 290 76 289 116 -265 -334 255 -64 -79 137 -283 -122 -121 126 158 293 327 422 637 413
2878 413 390 266 241 220 104 -13 53 326 -245 -125 -163 -380 -11 30 -294 -134 121 315 427 152 261 487
2900 487 325 515 811 491 237 -85 95 8 -379 222 -214 -264 -142 21 -414 74 445 49 -273 26 338
2921 338 577 451 622 179 30 118 400 209 129 537 -164 -684 -359 -31 -26 -109 285 -264 -465 275 395 210
$$ packed form
2767I55l35p18q5L22J47k06O05j94r17j5K89J66J60M64o74l54j8K88P63k9m74
2788A40k6k01K41K27r2L15o9p00l05L28M70j62o0j70k60j53N67M38p8k74J8m42
2810b48K51M18k9J01l6n32j71q2M75J66k22o1n56M2L35M83jj26l25o8L44J64Q7
2833D09J67j45k57J8K6J0q5J94l45j86J36k2j13K86K7o3j14J74j70L62J43J61
2855F13j25k99J81q0k14K13j73l81o9N89l19j5K16m20J61JK47L2J35L4R5K15k24
2878D13k3j24k5k1j16j17O6K73n71J20l8k17L69M1l24J60K55J94J12k75J09K26
2900D87j62J90K96l20k54l22J80q7l87O01m36n0J22J63m35M88L71l96l22K99L12
2921C38K39j26J71m43j49Q8K82j91q0M08p01n20L25L28Nq3L94n49k01P40J20j85
$$ plain form
2943 210 450 525 -73 141 718 553 293 223 374 -482 -242 457 632 -34 -21 -495 -584 -224 203 730 118
2964 118 59 147 -217 378 833 731 -158 113 366 -125 176 90 199 -322 -215 -134 -241 96 486 -12 -876
2985 -876 -3 217 86 628 1042 203 -524 -21 605 234 433 629 -206 -713 58 480 -309 136 388 -133
3005 -133 -775 194 743 -26 396 627 -157 -317 896 778 25 89 308 -414 -176 679 556 -338 -119 -175
3025 -175 -342 -467 563 -68 -260 -71 -157 -79 -127 972 607 -371 1 504 355 23 662 473 -559 -23
3045 -23 315 33 2 698 -66 -976 -166 600 43 343 760 77 -415 314 807 -67 230 499 -357 -839 397
3066 397 1092 -222 -409 280 -432 -624 405 776 -41 -98 555 -191 -396 489 1015 -52 -122 385 120 -274
3086 -274 924 1191 -659 -549 251 91 -137 592 493 -757 -458 576 310 -77 775 496 -780 -174 442
$$ packed form
2943B10K40P5n98K14N77j65k60p0J51q56K40O99J75o66J3m74q9L60M27N27o12
2964A18n9Q8l64N95M55j02q89K71K53m91L01q6J09n21J07Q1j07L37L90m98q64
2985h76Q73K20j31N42M14q39p27N03O26l71J99J96q35n07P71M22p89M45K52n21
3005a33o42R69N49p69M22K31p84j60J213j18p53O4K19p22K38Q55j23q94K19n6
3025a75j67j25J030o31j92J89q6P8m8J099l65r78L72N03j49l32O39j89j032N36
3045b3L38k82l1O96p64r10Q10P66n57L00M17o83m92P29M93q74K97K69q56m82J236
3066C97O95j314j87O89p12j92J029L71q17n7O53p46k05Q85N26j067p0N07k65l94
3086b74J198K67j850J10Q00j60k28P29r9j250K99J034k66l87Q52k79j276O06O16
$$ plain form
3105 442 191 -89 445 275 -670 -288 402 266 -123 657 175 -860 -347 961 471 -235 752 -84 -566
3124 -566 161 940 455 4 488 245 -688 456 914 334 -123 64 -358 -566 296 946 -86 -609 14
3143 14 -83 -607 672 970 -193 -293 487 -109 -141 700 1074 -507 -563 201 -173 -293 430 387 -518 -446 316
3164 316 9 -108 560 355 -352 -302 453 140 -74 693 274 -601 -240 837 -89 86 493 54 -687 -258
3184 -258 338 73 -328 174 71 -463 541 858 -45 -107 203 187 -247 297 425 214 -113 191 235 -97 323
3205 323 528 -68 -29 351 239 -30 196 426 -211 -111 183 132 -151 206 475 41 -332 346 259 35 -28
3226 -28 339 -93 -247 260 253 -203 -184 107 -192 -56 570 228 -43 36 270 104 -53 512 364 -187 212 344
3248 344 80 7 213 -11 -444 -174 312 218 257 347 104 -40 353 107 304 294 270 -135 -316 206 195 311
$$ packed form
3105D42k51k80N34j70r45L82O90j36l89P80m82j035N13J308m90p06R87q36m82
3124e66P27P79m85m51M84k43r33J144M58n80m57J87m22k08Q62O50j032n23O23
3143A4r7n24J279K98j163j00P80n96l2Q41L74j581n6P64l74j20P23m3r05P2P62
3164C16l07j17O68k05p07N0P55l13k14P67m19q75L61J077r26J75M07m39p41M29
3184b58N96k65m01N02j03n34J004L17r03o2L10j6m34N44J28k11l27L04M4l32M20
3205C23K05n96L9L80j12k69K26K30o37J00K94n1k83L57K69m34l73O78q7k24o3
3226b8L67m32j54N07pm56J9K91k99J36O26l42k71P9K34j66j57N65j48n51L99J32
3248C44k64p3K06k24m33K70M86r4L9R0k43j44L93k46J97j0k4m05j81N22j1J16
$$ plain form
3270 311 42 273 -25 68 74 56 -141 110 -17 -191 99 22 262 123 105 119 24 -186 105 264 -4 -96 70
3293 70 359 -43 269 208 -300 -161 94 -12 56 541 335 -37 -50 41 206 289 59 -73 167 -88 207 170
3315 170 349 90 98 57 -23 245 577 152 -125 -63 -163 355 264 9 377 305 222 227 -135 117 145 -90 -2 30
3339 30 65 215 79 -15 -27 303 239 412 124 219 393 -69 265 398 154 215 135 -70 110 91 -54 100 116
3362 116 8 -135 21 312 -16 245 12 94 326 60 516 198 154 178 140 173 229 234 -28 -336 -88 -216 -89
3385 -89 103 323 112 14 -28 48 -46 123 442 231 -10 162 408 412 503 255 -35 -338 47 302 249 47 37
3408 37 -169 -186 -212 73 152 517 86 -52 4 287 464 350 268 64 -35 -37 258 256 -30 -16 -129 -273 108 -104
3432 -104 469 190 64 -16 57 445 683 395 67 191 443 126 296 461 216 -81 20 -549 -204 193 325
$$ packed form
3270C11k69K31k98R3Oj8j97K51j27j74K90p7K40j39j8J4r5k10K91J59k68r2J66
3293G0K89m02L12o1n08J39K55j06O8M85k06l72j3R1J65Q3k30j32K40k55K95l7
3315A70J79k59Qm1q0K68L32m25k77O2j00N18r1k55L68p2q3Nl62K52K8k35Q8L2
3339C0L5J50j36r4j2L30o4J73k88R5J74m62L34J33k44O1q0k05J80j9j45J54J6
3362A16j08j43J56K91l28K61k33Q2K32k66M56l18m4K4l8L3N6Nk62l08K48j28J27
3385h9J92K20k11r8m2P6r4J69L19k11k41J72K46MR1k48k90l03L85K55n3k02j0
3408C7k06j7k6K85P9L65m31j38N6K83J77j14q2k04r9kK95kk86J4j13j44L81k12
3432a04N73k79j26q0P3L88K38k88l28J24K52l17J70J65k45k97J01n69L45L97J32
$$ plain form
3453 325 -260 -38 204 -125 29 350 349 162 21 24 -47 357 547 369 23 -315 -64 30 246 130 46 -204
3475 -204 -236 192 156 -124 427 33 56 -35 331 658 204 280 128 -237 195 337 244 64 330 -208 -438 -185
3497 -185 308 -7 -27 169 242 -414 9 638 597 -60 120 456 -291 50 346 127 -19 263 -12 -268 -279
3518 -279 406 -92 -500 70 57 -314 156 315 -68 263 76 395 -139 509 484 142 8 341 77 -150 -239
3539 -239 18 -205 -505 429 -121 -395 -41 450 67 107 149 189 -20 417 488 203 20 310 -34 -316 390
3560 390 496 -60 -340 108 -257 -538 8 190 171 154 472 143 -113 697 720 300 128 428 278 -159 162
3581 162 296 -131 -393 -82 -357 -474 376 385 -359 36 270 -38 10 446 953 112 193 307 99 180 488 195
3603 195 -503 -292 200 -115 112 751 377 -485 -404 196 -81 316 598 412 -512 -254 318 270 64 684 -105
$$ packed form
3453C25n85K22K42l29J54L21jj87j41Lp1M04J90j78l46l38K51R4K16j16q4k50
3475b04l2M28l6k80N51l94K3r1L66L27m54P6j52l65M32J42r3j80K66n38k30K53
3497a85M93l15k0J96P3o56M23O29m1o57J80L36p47L41K96k19j46K82k75k56j1
3518b79O85m98m08N70j3l71M70J59l83L31j87L19n34O48k5l42j34L33k64k27q9
3539b39K57k23l00R34n50k74L54M91l83M0M2M0k09M37P1k85j83K90l44k82P06
3560C90J06n56k80M48l65k81N46J82j9j7L18l29k56Q10K3m20j72L00j50m37L21
3581A62J34m27k62L11k75j17Q50Rp44L95K34l08M8M36N07q41Q1J14k08Q1L08k93
3603A95o98K11M92l15K27O39l74q62Q1O00k77L97K82j86r24K58N72m8k06O20p89
$$ plain form
3624 -105 -508 -65 112 -64 200 54 -49 -617 -273 637 637 -70 371 -54 -114 177 306 549 -7 353 39
3645 39 -379 146 948 188 -264 193 68 -332 199 500 -68 -182 -250 1 -381 357 591 107 -210 189 56
3666 56 131 720 441 -44 -354 -121 -87 95 304 357 -195 -99 163 385 129 471 331 -268 -258 186 311 -98
3688 -98 225 386 -391 -123 -95 247 -1 235 293 -514 29 380 369 -52 175 108 -198 -68 313 154 -13 247
3710 247 -72 -215 -6 310 157 72 152 -274 23 19 257 148 -36 -37 -202 294 339 348 -54 216 -195 160 -141
3733 -141 -4 57 -140 -12 82 82 -69 316 111 105 -195 -86 268 96 338 237 15 -241 187 216 -350 144
3755 144 159 14 44 410 211 31 -184 110 -412 518 479 152 99 339 161 54 365 450 157 -125 13 95
3777 95 245 339 258 207 -229 -13 243 -229 271 4 166 -277 -72 259 311 252 187 -24 15 41 314 227 230 229 108
$$ packed form
3624a05m03M43J77j76K64j46j03n68L44R10%p07M41m25o0K91J29K43n56L60l14
3645C9m18N25Q02p60m52M57j25m00N31L01n68j14o8K51l82P38K34m84l17L99j33
3666E6P5N89k79m85l10K33L4J82K09N3n52R6K62K22k56L42j40n99J0M44J25m09
3688i8L23J61p77K68K8L42k48K36N8q07N43L51j1m21K27o7l06J30L81j59j67K60
3710B47l19j43K09L16j53q5Q0m26K97mK38j09j84jj65M96M5Rm02K70m11L55l01
3733a41J37O1j97J28R4%j51L85k05ol00J09L54j72K42j01k22k56M28K9n66M94
3755A44J5j45L0L66j99j80k15K94n22R30l9l27n3K40j78j07L11Q5k93k82J38Q2
3777I5J50R4q1n1m36K16K56m72N00k67J62m43K05L31N2n9o5k11L9K6K73q7Ljj21
$$ plain form
3802 108 -293 235 324 342 247 -202 -285 63 249 266 -83 312 259 -276 332 292 566 406 -72 -55 -130 451 644
3825 644 412 151 -170 -78 189 -19 -66 147 290 179 -162 49 -252 374 389 -275 -103 154 360 331 429 265
3847 265 305 -24 -178 62 253 161 4 -91 -227 -59 106 355 329 -280 -82 20 -96 298 406 28 195
3868 195 168 -94 -128 94 489 202 -245 -175 223 114 174 -46 150 -235 -100 -121 321 63 47 522 -216 -56
3890 -56 332 44 395 223 69 -369 -184 -139 -91 407 79 21 -26 124 138 320 299 202 -138 -187 -194 148 179 344
3914 344 275 9 -226 -3 160 330 385 186 202 55 -59 153 524 43 309 57 -87 351 139 332 220
3935 220 67 -257 -227 18 581 102 -23 -247 -133 61 198 487 244 -147 295 109 -5 -28 566 463 -260
3956 -260 -165 -100 88 251 434 68 -270 -115 98 379 387 86 -16 -434 -195 288 306 693 281 127 130 -70
$$ packed form
3802A08m01N28Q9J8r5m49q3L48J86J7l49L95n3n35O08m0K74j60m78J7p5N81J93
3825F44k32k61l21R2K67k08m7K13J43j11l41K11l01O26J5o64J72K57K06k9R8j64
3847B65M0l29j54K40J91r2j57r5j36J68J65K49k6o09J98J02j16L94J08l78J67
3868A95k7k62l4K22L95k87m47P0L98j09O0k20J96l85J35k1M42k58j6M75p38J60
3890e6L88k88L51j72j54m38J85M5M8M98l28n8m7J50J4J82k1r7l40m9pL42L1J65
3914C44o9k66k35K23J63J70N5j99J6j47j14K12L71m81K66k52j44M38k12J93j12
3935B20j53l24L0K45N63m79j25k24J14J94J37K89k43l91M42j86j14k3N94j03p23
3956b60R5O5J88J63J83l66l38J55K13K81Ql01j02m18K39M83J8L87m12j54Lk00
$$ plain form
3978 -70 363 271 685 250 -379 -319 77 252 183 430 49 -98 -389 102 444 161 565 365 -155 -313 465
3999 465 474 447 80 101 -300 -177 567 290 318 -207 -31 -501 -13 555 241 169 268 197 -148 -27 288 397 11
4022 11 190 -313 -90 155 453 228 -261 91 -8 -30 227 442 139 -168 -338 -243 94 364 619 26 -375
4043 -375 -153 78 25 513 618 -69 -448 -54 -5 11 438 132 41 -248 -206 279 226 223 283 -151 -308 460 489
4066 489 -55 142 377 -215 -222 436 120 3 143 143 -111 -101 347 234 -145 419 220 -115 149 331 635 66
4088 66 433 162 184 213 457 253 -169 116 333 -378 159 181 174 -300 163 257 -51 215 378 136 -386 138
4110 138 242 123 139 159 92 -420 256 357 218 7 192 -164 -216 276 205 -9 49 64 -105 -58 423 217 21
4133 21 17 442 84 17 229 409 -342 -261 376 45 -113 142 266 -297 -191 634 209 16 680 136 -135 169
$$ packed form
3978g0M33r2M14m35o29O0L96J75o9K47l81j47k91M91L42k83M04k00n20j58P78
3999D65Rk7l67K1m01J23P44k77K8n25J76m70M88N68l14p2R9p1l45J21L15J09l86
4022A1J79n03K23K45K98k25m89L52r9k2K57K15l03l07j70R5L37K70K55n93m01
4043c75K22K31n3M88J05o87l79L94M9J6M27l06r1k89M2M85n3lO0m34j57P68K9
4066D89n44J97K35n92pO58l16j17J40%k54J0M48j13l79N64j99l35K64J82L04n69
4088F6L67k71K2K9K44k04m22K85K17p11N37K2pm74M63R4l08K66J63k42n22N24
4110A38J04j19J6K0o7n12O76J01j39k11J85l56n2M92p1k14N8J5j69M7M81k06j96
4133B1mM25l58o7K12J80p51Q1O37l31j58K55J24n63J06Q25m25j93O64n44k71L04
$$ plain form
4155 169 533 148 248 370 35 -168 -190 416 290 -4 163 92 -408 173 220 20 70 385 -68 57 190
4176 190 364 70 -63 504 60 -106 444 222 41 -161 188 -146 -260 311 656 192 -61 112 -19 -91
4196 -91 474 459 178 -260 96 174 -156 251 641 58 -407 60 -110 77 253 451 109 -35 177 120 -208
4217 -208 102 302 -130 -395 179 -7 230 564 342 -213 -337 254 -90 173 393 195 -98 -308 78 288
4237 288 -45 382 255 54 163 178 378 219 488 143 -37 -38 67 108 114 499 127 -309 -195 352 292 334 149
4260 149 190 -325 121 254 91 277 250 -60 -242 -45 404 162 31 -132 37 -65 -51 107 247 379 315
4281 315 26 -347 15 437 -69 278 233 57 -462 186 698 291 84 13 -2 -130 297 111 -107 -103 -169 -334
4303 -334 -51 314 558 288 418 -232 38 79 487 225 -214 397 105 -50 119 408 243 -295 -61 -475
$$ packed form
4155A69L64l85J00J22l35k03k2O06j26k94J67p1n00N81M7k00N0L15m53J25J33
4176A90J74k94j33N67m44j66N50k22j81k02L49l34j14N71L45m64k53J73j31p2
4196i1N65j5k81m38L56P8l30M07L90n83m65M67j70J87J76J98l42j44K12n7l28
4217b08L10K00m32k65N74j86K37L34k22n55j24N91l44K63K20j98k93k10L86K10
4237B88l33M27j27k01J09J5K00j59K69l45j80jJ05M1OL85l72m36J14N47o0M2j85
4260A49M1n15M46J33j63J86k7l10j82J97M49k42j31j63J69j02J4J58J40J32o4
4281C15k89l73L62M22n06L47m5j76n19O48N12m07k07p1j5j28M27j86k18Mo6j65
4303c34K83L65K44k70J30o50K70M1M08k62m39O11k92j55J69K89j65n38K34m14
$$ plain form
4323 -475 -271 177 399 64 40 -384 147 -106 376 627 310 -6 -83 -162 207 544 553 141 2 -350 -76 100
4345 100 363 409 196 -508 -200 75 598 322 400 -17 -448 -125 -47 319 723 -41 -345 -348 -352 295 352 593 25
4368 25 -212 -466 -146 294 704 70 -107 -83 -1 21 752 435 203 -223 -432 -61 354 653 469 -115 -173 -176
4390 -176 -354 424 407 367 -305 -176 -582 4 378 227 194 -151 -291 -142 152 297 271 -2 -165 -319 -259 217
4412 217 536 120 -74 -295 -220 63 578 372 358 -103 -216 222 227 455 239 33 -11 -9 -100 272 292 640 216
4435 216 -167 -177 32 89 268 202 -46 105 464 279 310 433 241 109 -75 -124 355 470 72 125 -350 118
4457 118 280 138 -236 324 74 -271 -4 502 106 91 -117 -176 236 -258 177 144 82 75 142 -279 -239 329 207
4480 207 -167 67 315 -46 144 356 284 93 259 243 206 43 225 278 -69 294 341 123 481 283 117 -1
$$ packed form
4323d75K04M48K22l35k4m24N31k53M82K51l17l16p7p9L69L37Rm12j39l52K74J76
4345A00K63M6k13p04L08K75N23k76P8m17m31L23P8L66M04p64l04lmO47N7K41n68
4368B5k37k54L20M40M10o34j77K4Q2K2P31l17k32m26k09L71M15K99j84n84n8l
4390a76j78P78j7m0o72J29m06N86L74j51l3l45j40J49K94J45k6k73j63j54O0M76
4412B17L19m16j94k21P5K83N15k06j4m61j13M38NK28k16k06m4Kr1L72K0L48m24
4435B16l83j0K09N7J79o6k48J51L59j85L1J23j92j32j84m9M79J15l98N3m75M68
4457A18J62j42l74N60k50l45K67N06l96j5k08n9M12m94M35l3o2pO7m21M0N68j22
4480B07l74K34K48l61J90K12p2j91J66j6l7j63J82N3l47L63M7k18L58j98j66j18
$$ plain form
4502 -1 380 252 -176 -87 39 143 102 120 239 -92 -220 316 68 -129 297 172 71 -251 70 167 29 125
4524 125 108 -216 72 25 97 513 346 -61 193 288 507 297 186 518 250 -14 138 299 180 213 220 -35
4546 -35 -476 85 360 57 -188 171 139 -185 454 396 168 15 58 -271 -115 256 429 148 -186 117 -160
4567 -160 -180 276 524 145 60 18 38 -43 285 496 66 177 98 186 9 282 412 10 -112 202 -252 136
4589 136 616 437 8 55 -11 -1 -66 721 411 -45 171 54 130 239 433 620 -113 -180 276 -16 163 259
4611 259 66 -416 -225 66 148 25 279 691 -526 11 94 -139 274 756 80 -333 -44 57 65 167 628
4632 628 -271 -431 -365 240 163 303 344 -99 -324 -298 423 275 424 547 -301 -277 261 444 168 114 293 -93
4654 -93 -523 103 536 317 334 -29 -284 -344 170 636 331 104 109 -266 -302 363 596 193 200 159 -393 -337 404
$$ packed form
4502aL81j28m28Q9J26J04m1J8J19l31j28N36k48j97M26j25j01l22L21R7j38R6
4524A25j7l24K88m7P2M16j67m07K54R5K19k10j11L32k68k64J52J61j19L3Pk55
4546c5m41N61K75l03k45L59l2l24O39n8k28j53M3l29J56L71J73k81l34L03k77
4567a60k0M56K48l79q5m2K0q1L28K11m30J11p9Q8j77K73J30m02j22L14m54L88
4589A36M80j79m29M7o6J0o5P87l10m56K16j17P6J09J94J87p33o7M56k92J79R6
4611B59j93m82J91K91Q2j23K54M12j217N37Q3k33M13M82o76m13K89J01QJ02M61
4632F28q99j60O6O05p7J40M1m43k25K6P21j48J49J23q48K4N38J83k76n4J79l86
4654i3m30O26M33k19J7l63k55o0N14M66l05k27Nl75l6O65K33m03Pm1n52N6P41
$$ plain form
4677 404 861 231 134 -199 -503 -193 772 633 92 -32 -101 8 280 742 657 281 -316 -232 49 434 793
4698 793 735 -185 -518 -95 176 377 770 368 -581 -479 -35 329 754 813 135 -228 -162 97 635 731 503
4719 503 -20 -591 -174 -73 650 475 615 -272 -590 -253 303 883 161 336 -711 -352 100 502 588 407
4739 407 269 -372 -564 346 411 162 -112 -170 -205 -403 266 893 540 0 -21 -323 -145 538 732 680 80 -172
4761 -172 -238 306 845 771 207 -142 -343 -106 230 661 495 71 -194 -144 -299 194 581 80 -39 -144 -150 471
4783 471 529 216 104 -142 -358 91 481 402 526 -173 -428 -219 101 501 377 463 -444 -586 344 163 480
4804 480 281 504 -31 -303 185 343 346 9 -59 -194 -239 -123 295 -150 117 101 -277 147 269 196 185 -69
4826 -69 75 158 234 382 565 45 -37 -131 29 18 92 329 -124 -92 61 23 398 146 186 -339 75 197 -3
$$ packed form
4677D04M57o30r7l33l04L10R65j39n41j24o9J09K72M62q5l76n97Q4K81L85L59
4698G93n8r20l33M23K71K01L93m02r49J02M44L64M25N9o78l63O6K59N38R6k28
4719E03n23n71M17J01P23j75J40q87l18L37N56N80p22J75j047L59M52M02Q6j81
4739D07j38o41j92R10O5k49k74n8l5j98O69O27l53n40k1l02J78O83J94n2o00k52
4761a72o6N44N39p4n64l49k01K37L36M31j66m24k65N0j55M93L87n01j19j05oO21
4783D71N8l13j12k46k16M49L90p9J24o99k55K09L20M00j24Q6r07j42R30j81L17
4804D80j99K23n35k72M88J58Ll37o8j35m5J16M18m45K67j6l78M24J22p3j1k54
4826f9J44Q3P6J48J83n20q2r4J60j1P4K37m53L2J53l8L75k52M0n25M14J22k00
$$ plain form
4849 -3 251 253 50 69 174 243 179 185 -51 -112 -20 85 232 66 52 -1 -60 153 292 122 276 -67 4 8 147 737
4875 737 256 253 111 59 236 -6 -206 574 -18 -483 -236 234 188 629 327 124 -440 40 75 462 317 257
4897 257 12 -278 46 2 447 239 271 -409 -324 -90 89 241 302 398 -298 -108 247 600 796 245 -370 -273
4919 -273 204 381 287 309 400 -264 23 120 272 328 196 -109 -422 59 448 362 688 274 49 -320 -91 227
4941 227 563 261 -65 -158 -92 -82 357 437 -40 -197 -467 -11 97 385 535 350 92 -65 40 -71 443
4962 443 380 13 -470 -177 252 293 354 97 75 -390 -211 -140 383 624 243 -339 -292 -212 328 338 554 743 -220
4985 -220 -362 172 205 231 418 37 -404 -171 178 315 559 28 -19 -264 -234 215 513 498 284 -131 -275 -64
5007 -64 324 418 437 48 -231 -321 198 653 386 155 230 -53 77 141 477 455 276 339 -272 -386 354 754 423
$$ packed form
4849cK54Kk03J9J05O9o4Ok36o1R2J05J47j66j4n3n9K13J39j70J54l43P1MJ39N90
4875G37m81lj42n2J77k42k00P80n92m65K47M70m6M41l02k03n64M80L5L87j45o0
4897B57k45k90L24m4M45k08L2o80Q5K34J79J52O1R6o96J90L55L53J96n51o15R7
4919b73M77J77r4K2R1o64K87R7J52N6j32l05l13M81L89q6L26m14k25l69K29L18
4941B27L36l02l26r3O6J0M39Q0m77j57k70M56J08K88J50j85k58j57J05j11N14
4962D43o3l67m83K93M29M1O1k57k2m65J79P1N23K41l81n82M7Q0N40J0K16J89r63
4985b20j42N34L3K6J87l81m41K33L49J37K44n31m7k45L0M49K98j5k14m15j44K11
5007f4L88R4J9l89k79r0N19M55k67k31P5k83J30O4L36k2j79O3o11j14P40M00l31
$$ plain form
5030 423 -106 -255 -188 -160 252 593 132 -86 -353 -522 -7 402 684 363 -127 -64 -251 105 621 655 94
5051 94 91 -153 46 117 578 456 -216 -525 39 43 480 350 183 -311 -232 -71 470 255 493 227 -109 -97 153
5074 153 287 451 812 -122 -465 -328 23 429 501 677 -115 -549 -603 539 364 617 481 51 -424 -35
5094 -35 628 334 117 323 -135 -572 356 746 282 124 195 -213 -477 -114 792 553 -187 -30 -140 -292 310
5115 310 817 287 -186 -86 -296 -174 656 581 40 -170 204 -2 27 672 637 -510 -386 -161 -39 67 495
5136 495 533 -315 -353 43 56 70 269 164 -162 -5 251 516 -33 290 277 -313 -157 134 142 -79 203 -132
5158 -132 -371 78 42 251 118 214 -84 -252 334 557 91 80 153 102 -398 304 44 71 -224 -118 -211 159
5180 159 245 612 57 -141 135 31 103 350 370 -485 -61 360 378 280 72 18 -163 -113 283 435 105 204 -47
$$ packed form
5030D23n29j49O7K8M12L41m61k18k67j69N15M09K82l21m90O3j87L56N16L4n61
5051I4lk44J99P1M61j22o72l09N64MM37j30j67m94P9J61N41k15K38k66l36J2K50
5074A53J34J64L61r34l43J37L51M06P2J76p92m34n4J142j75K53j36m30m75L89
5094c5O63k94k17K06m58m37R28L90m64j58P1m08k64L63R06k39p40J57j10j52O02
5115C10N07n30m73J00k10J22Q30p5n41k10L74k06K9O45l5j147J24K25J22J06M28
5136D95L8q48l8L96J3J4J99j05l26J57K56K65n49L23j3n90J56K91Qk21K82l35
5158a32k39M49l6K09j33R6k98j68N86K23m66j1P3n1n00P02k60K7k95J06r3L70
5180A59Q6L67n55j98K76j04P2K47K0q55M24M21J8r8k08n4j81N0L96J52l30R9k51
$$ plain form
5203 -47 -229 80 322 710 -25 146 58 -289 205 430 398 165 -68 -4 -270 307 460 156 -67 -13 -417 93
5225 93 477 424 209 -316 147 -174 476 633 841 360 -414 -212 137 23 375 603 15 -188 -182 -91 379 498
5247 498 698 -330 -339 91 154 455 446 57 -243 -476 -149 378 439 203 84 -368 -356 167 323 392 175 -394
5269 -394 -676 -266 200 623 209 57 -424 -298 11 806 613 407 -83 -456 -340 -207 398 433 -37 -310
5289 -310 -14 -205 34 567 37 -209 -421 -231 -79 475 636 443 -301 -394 -185 -148 654 587 13 -442 -158
5310 -158 0 334 674 466 -174 -468 -322 -106 193 481 332 -321 -18 -210 109 390 532 452 -403 -537
5330 -537 -174 88 546 563 -9 -417 -238 7 576 438 268 -46 -363 -177 132 341 492 365 -118 -376
5350 -376 -191 269 671 355 21 10 -344 46 234 463 504 -172 -99 43 54 221 745 457 -56 -237 -216 38
$$ packed form
5203d7j82L09K42L88p35J71q8l47M94K25l2k33k33O4k66N77J53l04k23N4m04N10
5225I3L84n3k15n25M63l21O50J57K08m81p74K02L49j14L52K28n88k03OR1M70J19
5247D98K00j028rM30O3L01rl89l00k33L27N27O1k36j19m52J2N23J56O9k17n69
5269c94k82M10M66M23m14j52m81J26L09P95j93k06m90l73J16J33O05L5m70k73
5289c10K96j91K39N33n30k46k12J90J52N54J61j93p44r3K09L7Q02o7n74m55K84
5310a58J58L34L40k08o40k94J46K16K99K88j49o53L03j92L19K81J42q0q55j34
5330e37L63K62M58J7n72m08J79K45N69j38j70l14l17J86L09K09J51j27m83k58
5350c76J85M60M02l16l34j1l54L90J88K29M1o76P3J42J1J67N24k88n13j81K1K54
$$ plain form
5372 38 592 309 8 103 -250 -307 315 351 360 20 -135 -201 -19 271 388 122 129 -151 144 105 433 458 150 -83
5396 -83 -13 -15 -31 233 478 415 -28 -177 295 75 135 446 221 -58 274 -49 158 530 133 21 -182 30
5418 30 347 173 254 363 -74 128 205 -222 226 46 183 206 -275 127 436 137 63 212 -87 96 -49 270
5440 270 538 123 54 44 -38 201 239 310 -13 -335 -81 -119 316 575 298 40 159 -129 -178 449 -17 173
5462 173 193 18 -262 133 200 -13 165 -24 218 -108 407 -47 60 -105 76 105 -226 384 -88 135 17
5483 17 -56 312 -34 10 382 107 90 5 131 6 -18 431 24 203 328 183 -44 -152 86 -170 327 236
5505 236 -46 -211 -46 -83 102 237 374 -49 -49 230 308 211 212 413 -16 44 202 347 218 16 366 -362 -230
5528 -230 88 180 397 403 147 -336 -363 62 440 263 326 416 -106 -164 243 445 432 538 -243 -137 -108 663 274
$$ packed form
5372C8N54k83l01R5l53n7O22L6Rl40j55o6J82K90J17k66Pk80K95l9L28K5l08k33
5396h3P0kj6K64K45o3m43j49M72k20O0L11k25k79L32l23K07L72l97j12k03K12
5418C0L17j74Q1J09m37K02P7m27M48j80J37K3m81M02L09k99p4J49k99J83j45L19
5440B70K68m15o9j0q2K39L8P1l23l22K54l8M35K59k77k58J19k88m9O27m66J90
5462A73K0j75k80L95O7k13J78j89K42l26N15m54J07j65J81K9l31O10m72K23j18
5483A7p3L68l46M4L72k75j7q5J26j25k4M49m07J79J25j45k27j08K38k56M97r1
5505B36k82j65J65l7J85J35J37m23%K79P8r7JK01m29O0J58J45j29k02L50p28J32
5528b30L18R2K17Ok56m83k7M25L78j77O3R0n22n8M07K02j3J06p81J06K9P71l89
$$ plain form
5551 274 239 47 -335 -169 -96 440 347 16 118 -54 -107 113 553 551 -85 -159 -256 13 17 745 425 -529 -62
5574 -62 -414 129 483 619 289 -408 -265 -14 300 377 452 -13 -387 -256 135 408 661 583 -120 -476 -29
5595 -29 170 372 467 477 34 -765 -42 291 217 605 276 -308 -456 289 387 421 606 24 -420 -333 469 791
5617 791 276 144 133 -773 -545 413 521 639 -96 -209 -309 -294 591 790 332 -54 -301 -322 -26 735 698
5638 698 40 -269 -470 -265 125 575 686 -332 -463 -241 -245 326 724 529 29 -593 -31 -63 666 835 364
5659 364 -397 -361 195 381 391 669 -390 -694 -395 103 377 633 766 -375 -590 -122 255 524 472 335
5679 335 -200 -532 -69 233 344 204 202 -114 -550 42 544 670 240 83 -253 -261 357 655 344 77 -8 -583
5701 -583 -95 606 645 196 -118 -398 -262 -160 369 150 76 -14 -247 -363 288 667 678 127 117 105 -22 279
$$ packed form
5551B74l5j92l82J66P3N36r3l31J02j72n3K20M40ko36p4r7K69MP28l20r54M67
5574f2l52N43L54J36l30o97J43K51L14P7P5m65l74J31L91K73K53p8p03l56M47
5595b9J99K02R5J0m43p99P23L33p4L88l29n84j48P45R8L4J85n82m44Q7Q02L22
5617G91n15j32j1r06K28R58J08J18p35j13j00J5Q85J99m58l86k47k1K96P61l7
5638F98o58l09k01K05L90M50J11j018j31K22mN71L98j95n00o22N62l2P29J69m71
5659C64p61L6N56J86J0K78j059l04K99M98K74K56J33j141k15M68L77K69n2j37
5679C35n35l32M63L02J11j40kl16m36N92N02J26m30j57l36qO18K98l11k67q5n75
5701e83M88P01L9m49l14k80J36J02N29k19p4r0k33j16O51L79J1n51j0j2j27L01
$$ plain form
5723 279 536 542 -205 -271 325 -39 269 338 193 -317 -126 39 316 391 452 -57 -300 219 290 125 136 214 -148
5746 -148 -178 34 173 445 134 -170 -131 -207 181 181 151 -95 43 266 -146 131 128 87 86 129 101 -5 232 308 -95
5771 -95 -182 93 -106 218 377 -46 -81 -235 11 131 264 125 64 -277 -60 107 342 204 490 158 29
5792 29 170 385 204 415 188 65 -245 90 412 332 281 -156 -203 -73 58 457 232 83 -232 30 13 214
5814 214 423 398 41 -144 -108 -69 240 498 174 119 -265 -146 35 48 286 58 64 -248 268 193 677 162 -68
5837 -68 -152 -160 136 464 481 513 -30 -130 -312 103 261 286 145 -244 88 -79 277 414 100 -210 -211 -157 58
5860 58 445 531 458 11 -126 -218 -6 209 269 376 -222 -387 -219 217 530 341 72 12 -146 -48 168 361
5882 361 215 -55 -463 -376 276 389 56 191 -173 -573 -278 126 625 591 247 -542 -204 45 244 483 64
$$ packed form
5723B79K57Op47o6N96l64L08O9j45n10J91J65K77P5O1n09k43N19P1j65J1P8l62
5746a48l0K12J39K72l11l04L9p6L88%l0k46J38K23m12K77lm1jM3k8j06K37P6m03
5771i5q7K75j99L24J59m23l5j54K46J20J33j39o1l41K17J67K35j38K86l32j29
5792B9J41K15j81K11k27j23l10L35L22q0n1m37m7J30J31L99k25j49l15K62j7K01
5814B14K09k5l57j85L6L9L09K58l24n5l84J19J81J3K38k28Ol12N16p5M84n15k30
5837f8q4qK96L28J7L2n43j00j82M15J58K5j41l89L32j67L56J37l14l10jN4K15
5860E8L87Q6p3m47j37r2K12K15O0J07n98j65J68M36L13j89k69o0j58R8K16J93
5882C61j46k70m08Q7O52J13l33J35l64m00K95M04M99l4l44p89L38K49J99K39m19
$$ plain form
5903 64 107 -185 -452 87 802 545 300 -181 -210 209 -82 236 466 -46 -208 -170 137 563 567 628 -252 -390
5925 -390 -321 43 270 785 440 152 -264 -388 192 643 513 173 -377 -404 -176 295 611 242 -207 -402 -529
5946 -529 78 691 667 447 -316 -602 -84 131 353 519 -107 -419 -459 -236 335 481 223 23 -342 -468 -39
5967 -39 452 899 389 36 -549 189 270 834 672 -81 -330 -455 -270 377 736 373 -91 -176 -445 -83 376
5988 376 696 340 -204 -88 -268 32 700 740 178 -193 -329 -230 -55 683 35 28 -92 -139 -182 213 354 370
6010 370 37 -106 -262 507 391 704 236 -318 -470 28 354 325 475 51 -301 -396 17 242 429 70 -281
6031 -281 -161 -10 272 112 517 392 73 -210 22 296 307 404 217 -340 -313 114 138 413 348 -16 -209 -137
6053 -137 139 255 442 -103 -85 -388 -298 245 251 219 -28 -201 -359 -60 301 420 206 -215 -4 -262 -10 515
$$ packed form
5903F4M3k92k67N39P15k57k45m81k9M19k91L18K30n12j62L8L07M26MO1q80j38
5925c90O9L64K27N15l45k88m16j24N80M51j30l40n50k7K28M71L16l69m49j95j27
5946e29O07O13k4k20p63k86N18K15K22J66o26l12m0K23N71J46k58k00l65j26M29
5967c9M91M47n10l53n85P38Q1N64j62p53k49j25J85O47L59l63m64q5k69L62M59
5988C76L20l56n44J16j80L00O68M0n62l71j36R9J75P38o48pj20m7m3L95J41J6
6010C70l33j43j56P69j16L13m68n54j52M98L26k9J50m24l52r5M13K25J87l59l51
6031b81J20J51K82j60M05j25l19k83K32K74J1R7j87n57K7M27K4K75o5l64j93P2
6053a37K76J16J87n45J8l03R0N43Ol2k47j73j58K99L61J19k14m21K11k58K52N25
$$ plain form
6075 515 219 95 -118 38 43 208 609 321 -106 311 394 371 241 329 124 -168 145 187 245 134 202 -236 -225
6098 -225 -24 241 -74 357 156 142 -9 11 348 115 286 22 27 -149 168 672 -37 -4 -208 -142 -4 243
6120 243 130 -30 -59 165 0 469 738 358 -398 76 421 218 303 435 -65 -150 -213 266 169 -8 571 -246
6142 -246 -227 -338 174 36 315 553 212 -115 -111 583 745 158 42 -5 -405 -19 312 590 176 -230 -18
6163 -18 -280 506 523 143 53 55 -55 196 115 601 351 -3 -53 -434 -42 18 583 121 126 -408 -401 -122 205 461
6187 461 116 -28 -52 156 306 547 632 -56 -322 77 447 222 852 191 -185 -238 159 97 161 253 158 -223
6209 -223 -603 -2 223 543 472 132 -38 -200 241 328 355 341 216 -161 -141 250 510 395 -147 -91 -219 -324
6231 -324 456 581 339 160 -222 -184 221 371 647 310 -117 -170 -230 266 748 447 96 -79 -43 132 484
$$ packed form
6075E15k96j24k13J56NJ65M01k88m27M17Q3k3j30Q8k05k92L13M2N8j11O8m38J1
6098b25K01K65l15M31k01j4j51K0L37k33J71k64Nj76L17N04p09L3k04O6J38K47
6120B43j13j60k9K24j65M69K69l80p56M74L45k03Q5J32n00q5o3M79r7j77N79q17
6142b46J9j11N12j38K79K38l41l27MO94J62n87j16m7m00L86L31K78m14m06K12
6163a8k62P86J7l80r0Kj10K51q1M86k50l54n0l81L92O0N65m62Nn34PK79L27K56
6187D61l45j44k4K08J50K41Q5o88k66L99L70k25O30o61l76n3L97o2O4R2r5l81
6209b23l80O01K25L20p1l40j70j62M41Q7K7j4j25l77K0L91K60j15n42N6j28j05
6231c24P80J25k42j79l82L8M05J50K76l37m27n3o0M96M82l01l51j75L6J75L52
$$ plain form
6252 484 467 85 144 -98 -131 413 422 379 409 139 -149 -364 -81 441 468 -18 3 -69 -225 392 495 702 173
6275 173 -58 -204 -30 248 355 306 58 -103 -154 317 280 407 496 -243 -113 -88 454 312 350 -3 -331 -373
6297 -373 131 156 362 365 -339 -374 -352 368 313 648 448 390 -244 -215 -112 304 442 233 -125 -279 -61 321 365
6320 365 372 142 -494 -175 66 123 424 273 51 -46 197 123 524 268 98 -4 -298 -193 76 238 478 -77
6342 -77 -316 6 -245 219 224 304 209 -61 -110 221 488 354 134 -181 -360 -115 119 311 236 18 77 -90 6
6365 6 224 305 306 11 -278 -129 315 389 721 188 -117 138 119 195 361 553 -79 8 -74 332 -6 672 302
6388 302 -61 -182 38 242 475 337 79 323 -193 -13 412 293 220 168 -299 37 -145 -138 59 -138 61
6409 61 -243 110 245 223 72 250 36 -97 39 16 346 -174 171 152 -70 66 -211 109 120 97 297 -119
$$ packed form
6252D84j7l82N9k42l3N44Rm3L0k70k88k15K83N22K7m86K1p2j56O17J03K07n29
6275A73k31j46J74K78J07m9k48j61n1M71l7J27Q9p39J30K5N42j42L8l53l28m2
6297c73N04K5K06Lp04l5K2P20n5L35k00n8o34K9J03M16J38k09l58j54K18L82M4
6320C65Pk30o36L19K41N7L01j51k22r7K43p4M01k56j70j02k94J05K69J62K40n55
6342g7k39L22k51M64NQ0r5k70m9L31K67j34k20l15j79K45K34J92p5k18N9j67R6
6365FK18Q1Jk95k89J49M44P4L32n33l05K55j9P6J66J92o32Q7q2M06l38O78l70
6388C02l63j21K20K04K33j38k58K44n16J80M25j19p3n2m67L36j82PJ97j97J99
6409F1l04L53J35k2j51J78k14j33J36k3L30n20L45j9k22J36k77L20J1k3K00m16
$$ plain form
6431 -119 48 184 257 55 236 -14 -125 264 369 60 30 -83 57 241 417 180 226 -62 -174 503 -101
6452 -101 -40 57 345 -16 176 62 250 -41 115 204 417 245 413 148 366 -27 -101 177 83 234 72 -213
6474 -213 67 -18 74 50 189 -134 -74 -1 211 372 172 393 -130 -4 76 192 415 201 -359 -45 33 -189
6496 -189 57 -37 120 -169 -269 -230 402 425 255 204 107 -20 16 133 354 168 124 42 -55 77 213 318 241
6519 241 -499 -65 -42 -89 374 237 277 -106 -271 221 443 300 478 108 -79 142 92 281 378 77 183 -200
6541 -200 13 -178 476 701 66 11 73 84 101 567 366 -15 -158 -188 13 316 291 -29 -528 -53 -61 -93 525
6564 525 301 148 -313 -204 292 242 296 351 68 -142 -249 193 239 165 451 82 -159 -454 158 484 166 65
6586 65 -240 -146 -205 192 230 196 45 -1 -124 218 353 477 -353 99 -112 -386 -30 643 173 46 -62 -226
$$ packed form
6431a19J67J36P3k02J81k50j11L89J05l09l0j13J40J84J76k37M6k88j12O77o04
6452a01O1R7K88l61J92j14J88k91J56Q9K13j72J68k65K18l93p4K78r4J51j62k85
6474b13K80q5R2k4J39l23O0P3K12J61k00K21n23J26Q0J16K23k14n60L14P8k22
6496a89K46r4J57k89j00L9O32K3j70n1r7j27L6J17K21j86m4q2r7J32J36J05p7
6519B41p40M34K3m7M63j37M0l83j65M92K22j43J78l70j87K21n0J89R7l01J06l83
6541b00K13j91O54K25o35n5O2J1J7M66k01l81j43l0K01L03k5l20m99M75ql2O18
6564E25k24j53m61J09M96n0N4N5k83k10j07M42M6p4K86l69k41k95O12L26l18j01
6586F5l05R4n9L97L8l4j51m6j23L42J35J24q30M52k11k74L56O73m70j27j08j64
$$ plain form
6608 -226 -86 100 130 274 165 -92 -355 -185 374 680 321 -103 -190 41 104 160 345 138 -50 109 -118
6629 -118 27 595 24 254 -241 -201 -67 -55 243 78 186 -22 24 3 249 508 161 158 -102 23 357 -139
6651 -139 479 415 -156 -133 -118 -12 259 193 446 -93 -51 147 172 491 293 115 288 350 87 -9 230 275 435
6674 435 40 160 -110 228 168 209 124 -93 -11 73 33 240 318 51 -6 -74 230 482 31 313 -111 -215 317
6697 317 218 292 206 109 -78 -25 62 170 273 -74 30 118 -76 310 142 75 -52 -180 107 -268 -130 367 135
6720 135 -40 87 -70 -1 541 256 165 88 -77 -12 304 293 167 254 -190 -53 -61 78 217 190 36 43 -65 29
6744 29 -34 72 33 184 -100 -232 274 151 69 36 291 158 65 199 65 87 494 -60 -179 164 -109 49
6766 49 157 -74 -354 205 127 484 458 37 -48 -186 185 140 350 306 419 -171 143 -52 186 74 22 92 -150
$$ packed form
6608b26J40J86L0J44j09k57k63J70N59L06l59m24q7K31O3N6J85k07j88J59k27
6629a18J45N68n71K30m95M0J34J2K98j65J08k08M6k1K46K59l47lk60J25L34m96
6651a39O18o4n71K3J5J06K71o6K53n39M2J98K5L19j98j78J73O2k63r6K39M5J60
6674D35l95J20k70L38o0M1q5k17Q2Q4m0K07P8k67n7o8L04K52m51K82m24j04N32
6697C17r9P4q6r7j87N3Q7J08J03l47J04Q8j94L86j68o7j27j28K87l75J38M97k32
6720A35j75J27j57O9N42k85r1p7j65O5L16j1j26Q7m44J37qJ39J39k7j54Pj08R4
6744B9o3J06l9J51k84j32N06j23q2l3K55j33r3J34j34K2M07n54j19L43k73J58
6766D9J08k31k80N59p8L57k6m21q5j38L71m5K10m4J13n90L14j95K38j12n2P0k42
$$ plain form
6789 -150 97 106 375 44 4 -2 -86 -161 210 260 150 -28 -227 -8 -128 117 43 78 -17 199 83 209 217 26
6813 26 79 52 28 213 309 184 337 109 57 -68 9 301 26 55 152 -129 9 -21 247 51 320 251 -197 -91
6837 -91 253 117 91 95 279 559 104 349 -85 193 81 -226 200 52 -127 -40 89 98 147 125 39 -115 -269
6860 -269 238 201 248 -33 139 141 214 356 117 71 88 247 -114 -243 215 69 155 84 -262 59 9 192 128 22
6884 22 -113 50 33 112 96 286 291 214 192 74 -126 605 143 -216 -87 187 402 68 177 57 20 -119 347
6907 347 162 626 308 348 154 -2 88 121 372 368 129 -25 -66 33 343 151 -69 -51 237 327 264 107 265
6930 265 232 106 35 137 237 328 195 383 -65 204 179 -138 17 105 -79 145 -24 50 177 195 96 118 -14
6953 -14 -75 124 308 134 69 310 -70 83 38 261 517 45 -82 40 142 318 -22 215 69 29 122 168
$$ packed form
6789a50K47RK69l31m0oq4p5L71N0j10j78j99K19j20K45p4L5r5K16j16J26Qj91
6813B6N3k7k4J85R6j25J53k28n2j25P7K92k75K9R7k81J38l0K68j96K69o9m48J06
6837i1L44j36k6MJ84K80m55K45m34K78j12l07M26j48j79Q7J29RM9k2q6j54j54
6860b69N07l7M7k81J72KP3J42k39m6J7J59l61j29M58j46Q6p1l46L21n0J83o4j06
6884B2j35J63j7P9j6J90Np7k2j18k00P31m62l59J29K74K15l34J09j20l7j39M66
6907C47j85M64l18M0j94j56R0L3K51mk39j54m1R9L10j92k20J8K88R0o3j57J58
6930B65l3j26p1J02J00R1j33J88m48K69k5l17J55Q8j84K24j69P4J27J8r9K2j32
6953a4o1J99J84j74o5K41l80J53m5K23K56m72j27J22J02J76l40K37j46m0R3M6
$$ plain form
6975 168 365 -74 -93 204 137 -3 -59 365 314 115 230 180 258 391 213 174 -75 -100 -87 1 326 255 305 -294
6999 -294 -36 156 96 336 265 156 63 172 -28 0 79 -94 -238 217 130 233 -103 45 -74 71 -40 -132
7021 -132 -22 141 -59 236 145 51 69 -339 335 388 -22 51 -27 -133 78 207 84 1 192 4 214 38
7043 38 276 471 431 -45 155 122 36 160 182 -1 149 -64 192 167 213 455 -22 19 94 71 94 -180 334 7
7067 7 -194 269 313 321 345 168 57 -18 196 167 348 297 -103 10 -222 61 380 -69 173 271 286 -250 369 498
7091 498 43 336 -193 -118 31 143 501 247 90 383 214 99 67 375 -36 -318 195 -34 302 -5 477
7112 477 209 132 359 -33 342 361 355 18 45 173 193 -213 71 31 -130 -33 -218 59 206 340 -82 -191 -124
7135 -124 -120 -78 289 442 60 -52 -217 223 -48 85 280 106 -273 -205 161 71 70 269 118 178 10 42 -108
$$ packed form
6975A68J97m39j9K97o7j40n6M24n1j99J15n0P8J33j78l9k49k5J3Q8L25p1N0n99
6999b94K58J92o0K40p1j09r3J09k00K8P9j73j44M55q7J03l36J48j19J45j11r2
7021a32J10J63k00K95r1r4J8m08O74N3m10P3p8j06K11J29j23q3J91j88K10j76
7043C8K38J95m0m76K00l3q6J24K2j83J50k13K56k5M6K42m77M1P5k3K3k74N14l27
7067Gk01M63M4QK4j77j11p5K14k9J81n1m00J13k32K83L19m49K42R8J5n36O19J29
7091D98m55K93n29P5J49J12L58k54j57K93j69j15l2L08m11k82N13k29L36l07M82
7112D77k68p7K27l92L75J9ol37K7J28K0m06K84m0j61R7j85K77J47J34m22j09O7
7135a24MM2L67J53l82j12j65M40k71J33J95j74l79O8L66r0jJ99j51O0j68L2j50
$$ plain form
7158 -108 433 218 23 206 433 512 434 2 151 -42 -123 219 255 -90 182 -20 296 336 279 264 -208 181
7180 181 28 64 86 -98 106 67 82 334 99 139 -9 138 136 -310 60 36 -169 134 151 115 109 226 172 23
7204 23 -100 221 121 98 78 261 83 199 265 187 288 252 29 130 57 181 343 292 3 177 -125 215 356
7227 356 101 245 46 79 -55 37 101 137 -28 -91 -21 11 141 158 264 -50 162 277 -81 290 506 252 -40
7250 -40 100 131 302 184 162 137 28 265 35 179 152 74 49 -1 54 65 197 185 -126 120 -220 -155 327 404
7274 404 415 281 -33 -170 288 166 262 217 -194 -134 32 126 266 130 231 83 -300 203 -70 73 362 435
7296 435 -51 -68 263 56 110 207 150 -5 -50 -33 1 71 304 44 -60 -78 134 270 356 -79 -299 198 11
7319 11 163 252 132 152 -41 32 -192 0 75 -68 353 -6 74 266 98 245 436 288 -42 313 94 261
$$ packed form
7158a08N41k15j95J83K27P9p8m32J49j93q1L42L6l45K72k02L16M0n7j5m72L89
7180A81j53L6K2j84K04l9J5K52k35M0j48J47km46L70k4k05L03J7l6oJ17n4j49
7204B3j23L21j00k3k0J83j78J16O6p8J01l6k23J01p3J24J62n1k89J74l02L40J41
7227C56k55J44j99L3j34R2O4L6j65o3P0L2J30J7J06l14K12J15l58L71K16k54k92
7250d0J40L1J71j18k2k5j09K37k30J44k7p8k5n0N5J1J32j2l11K46l40O5M82P7
7274D04J1j34l14j37M58j22R6m5m11O0J66R4J40j36J01j48l83N03k73J43K89P3
7296D35m86j7L31k07N4R7n7j55m5J7L4P0K33k60j04j8K12J36Q6m35k20M97j87
7319A1J52Q9j20K0j93P3k24J92P5j43M21l59Q0J92j68J47J91j48l30L55k19J67
$$ plain form
7341 261 205 -136 167 113 -130 -134 -50 107 -15 122 -76 172 -170 -84 232 169 152 83 225 100 -172 50 45 -42
7365 -42 325 299 17 78 154 219 -99 122 174 -157 -93 228 -55 231 19 33 19 79 58 110 147 298 317 169 435
7390 435 -42 122 84 24 116 201 170 39 192 237 -154 80 -144 197 79 60 360 532 163 196 26 -74 195
7413 195 -266 61 -169 316 386 178 235 232 242 311 464 102 34 2 201 77 105 5 104 80 -66 187 395 126
7437 126 125 101 -124 -149 257 234 251 68 305 185 -53 0 -117 254 331 83 116 -120 -8 -108 130 235 -142
7460 -142 -177 -6 82 22 238 -104 -113 187 319 139 79 310 87 286 439 150 -47 119 20 103 140 -44 1
7483 1 75 86 83 21 139 -110 300 222 -19 106 324 -61 178 247 168 -94 140 -232 39 216 75 127 6 60
7507 60 -59 114 -65 441 5 -4 105 -16 -21 -138 93 266 159 -268 -6 55 -200 -86 -6 -98 -147 95 429
$$ packed form
7341B61n6l41L03n4k43mQ4J57j22J37j98K48l42Q6L16o3j7o9J42j25k72K22nq7
7365d2L67k6k82O1P6O5l18K21N2l31O4L21k83K86k12J4j4O0k1N2L7J51J9j48K66
7390D35m77J64l8o0R2Q5l1j31J53M5l91K34k24L41j18j9L00J72l69L3j70j00K69
7413A95m61L27k30M85P0k08N7lJ0O9J53l62o8l2J99j24K8j00R9k4j46K53K08k69
7437A26jk4k25k5M06k3J7j83K37j20k38N3j17L71P7k48L3k36J12j00K38J05l77
7460a42l5J71Q8o0K16l42rL00J32j80o0K31k23J99J53k89j97J66r9Q3L7j84M5
7483AP4J1lo2J18k49M10p8k41J25K18l85K39O9p9k62K34l72K71J77j41N2j21N4
7507F0j19J73j79N06m36rJ09j21nj17K31J73j07m27K62O1k55J14Q0r2m9K42L34
$$ plain form
7530 429 -98 87 88 -9 141 -41 41 255 124 252 210 202 454 302 164 201 236 154 100 56 78 157 83 241 254
7555 254 14 199 61 277 16 -252 180 132 145 173 -14 150 105 -242 326 291 283 332 321 48 96 57 221 294
7579 294 223 52 -115 182 133 98 -159 175 133 -82 -103 11 325 5 216 -87 267 -87 85 457 217 331
7601 331 -51 63 279 304 114 279 85 15 66 104 465 278 -76 -15 93 121 16 -13 23 23 0 8 69 200 285
7626 285 20 -120 47 245 189 247 145 28 -311 -17 -29 -11 436 350 -33 -23 266 44 493 190 -14 333
7648 333 -168 318 108 307 200 253 334 -80 276 238 407 84 -34 23 -56 41 56 275 -94 -1 -328 173 223
7671 223 185 -172 188 -30 -356 403 163 297 -127 188 31 -11 235 155 273 -106 46 267 284 203 168 305
7693 305 63 -38 380 46 -21 139 162 -223 209 234 144 328 202 127 166 165 138 22 76 153 -47 281 47 412
$$ packed form
7530D29n27J85Jr7J50j82Q2K14j31J28m2qK52j52j38L7L5q2n4m4K2P9p4J58J3
7555B54k40J85j38K16k61k68M32m8J3K8j87J64m5l47N68l5qM9j1k73M8l9J64P3
7579B94p1j71j67K97m9l5k57L34m2k15k1J14L14l20K11l03L54l54J72L72k40J14
7601C31l82J14K16K5j90J65j94p0N1L8L61j87l54O1J08K8j05k9L6%k3QO1J31Q5
7626B85k65j40J67J98n6N8j02j17l39K94j2J8M47q6l83J0K89k22M49l03k04L47
7648C33n01M86k10J99j07N3Q1m14L56l8J69l23j18N7p9R7J5K19l69R3l27N01N0
7671B23l8l57L60k18l26P59k40J34m24L15j57m2K46q0J18l79J52K21J7q1l5J37
7693C05k42j01M18l34o7J60K3l85M32K5r0J84j26p5L9jk7j16N4P7k00L28k34L65
$$ plain form
7717 412 397 234 265 573 -34 4 410 222 48 -58 43 75 65 266 182 283 135 178 -80 49 122 172 145
7740 145 97 209 141 -17 37 -150 156 -120 165 248 313 62 8 145 146 184 -115 -36 -15 -223 -322 88 338 -85
7764 -85 274 138 -108 120 200 231 41 269 -9 486 -201 276 262 179 174 318 249 176 45 22 173 347 247
7787 247 -136 168 343 56 -125 106 270 -211 204 251 251 155 33 59 102 231 14 45 -96 65 31 84 108
7810 108 221 4 54 165 54 345 -117 -155 69 -41 -132 191 51 148 -42 154 296 83 17 552 76 8
7832 8 -96 467 255 265 221 50 -45 200 -51 226 -269 388 -221 64 230 247 -83 394 280 -61 -18 -114 122
7855 122 321 73 -9 161 365 73 368 186 148 212 -79 355 214 313 136 185 119 -90 106 364 155 47
7877 47 313 -120 144 318 -14 286 120 -134 217 248 355 144 149 498 107 75 260 8 259 3 19 49
$$ packed form
7717D12j5j63L1L08o07L8M06j88j74j06J01L2j0K01q4J01j48M3k58J29P3N0k7
7740A45m8J12o8j58N4j87L06k76K85Q3O5k51n4J37JL8k99P9K1k08r9M10K50m23
7764h5L59j36k46K28Q0L1j90K28k78M95o87M77j4q3nJ44o9p3j31k3J51J74j00
7787B47l83L04J75k87j81K31J64m81M15M7%r6j22K6M3J29k17L1j41J61l4N3K4
7810A08J13k17N0J11j11K91m62l8K24j10r1L23j40R7j90J96J42k13o6N35m76o8
7832Hj04N63k12J0m4j71r5K45k51K77m95O57o09K85J66J7l30M77j14l41M3r6K36
7855A22J99k48q2J70K04k92K95j82l8O4k91M34j41R9j77M9o6k09J96K58k09j08
7877D7K66m33K64J74l32L00j66k54L51L1J07k11NL49l91l2J85k52K51k56J6L0
$$ plain form
7899 49 -36 34 235 98 215 73 192 168 24 149 246 327 150 -75 -175 195 90 169 0 -78 10 444 175
7922 175 59 -185 57 -24 208 191 -99 286 245 103 154 68 228 -27 219 -23 209 265 -52 552 2 256
7944 256 -96 158 1 388 242 -66 266 134 83 159 222 230 331 198 70 -174 275 -76 147 -68 336 -106
7966 -106 67 124 173 299 170 48 -80 29 243 0 190 104 -17 66 -108 90 294 -17 200 154 88 -85
7988 -85 -152 477 458 53 -108 35 554 52 285 73 189 -180 112 262 375 443 33 37 129 -57 223 161 160
8011 160 342 -216 186 87 313 2 -55 -155 -2 -54 198 168 160 -5 246 157 26 -131 -82 -106 -192 77 370
8034 370 390 240 365 -4 12 48 337 262 217 161 238 43 309 2 174 -14 370 -47 376 149 -276 228
8056 228 -305 223 132 92 194 116 221 139 -40 -13 203 212 184 174 66 -2 68 69 145 106 -118 358 -174 352 4
$$ packed form
7899D9q5P0K01j37J17j42J19k4j44J25R7Q1j77k25j00L70j05P9j69p8Q8M34k69
7922A75j16k44K42q1K32j7k90L85m1j42N1q6J60k55K46k42K32N6l17O04n50K54
7944B56l52K54j57L87j46l08L32j32n1P6O3QJ01j33j28k44M49l51K23k15M04m42
7966a06J73N7M9J26j29j22j28J09K14k43J90q6j21Q3j74J98K04l11K17m6o6j73
7988h5o7O29j9m05j61J43N19n02K33k12J16l69K92J50J13O8m10MR2j86K80o2j
8011A60J82n58M02r9K26l11n7j00J53n2K52l0qj65K51q9j31j57M9k4q6K69K93
8034C70K0j50J25l69J6L6K89p5m5n6P7j95K66l07J72j88L84m17M23k27m25N04
8056B28n33N28r1m0J02p8J05q2j79K7K16Rk8j0j08o8P0JP6l9k24M76n32N26l48
$$ plain form
8081 4 377 253 75 -148 67 71 147 -89 302 160 -86 117 25 -96 249 10 -48 -42 265 213 183 69 65 -82
8105 -82 141 -114 252 10 27 129 133 221 8 287 53 213 -165 304 531 234 268 593 182 -64 -38 426
8127 426 97 203 354 58 -8 272 389 177 78 -123 146 58 286 81 314 192 188 100 230 74 387 161
8149 161 140 43 296 38 464 174 -43 95 250 192 5 258 220 247 27 137 66 170 73 61 -18 -4 47 187
8173 187 102 181 -36 -144 133 259 341 164 290 38 58 123 120 411 307 -35 408 -222
$$ packed form
8081DL73j24j78k23K15MP6k36L91j42k46K03r2j21L45k39n8OL07n2l0j14mj47
8105h2K23k55L66k42J7J02MQ8k13K79k34J60l78M69K27k97L4L25m11k46K6M64
8127D26l29J06J51k96o6K80J17k12r9k01K69q8K28k05K33j22mq8J30j56L13k26
8149A61k1r7K53k58M26k90k17J38J55n8j87K53l8K7k20J10p1J04r7j2p9J4N1J40
8173A87q5P9k17j08K77J26Q2j77J26k52K0O5lK91j04l42M43o30
8191b22
$$ Imaginary data points
##PAGE= N=2
##DATA TABLE= (X++(I..I)), XYDATA
$$ plain form
0 0 0 0 0 0 0 0 0 0 0 -9 9 -9 18 -18 27 -36 36 -54 63 -72 90 -108 126 -145 172 -199 235 -271 311 -359 412
31 412 -466 530 -601 677 -764 857 -960 1074 -1199 1333 -1482 1643 -1821 2013 -2224 2456
47 2456 -2707 2981 -3286 3621 -3987 4397 -4852 5361 -5936 6590 -7338 8211 -9240 10476
61 10476 -11991 13899 -16393 19801 -24765 32698 -47449 84325 -384717 -423772 269741 44269
73 44269 -239758 -334815 -198925 -107488 104107 217825 284503 304513 269819 103426 102889 217514
85 217514 236318 177195 203227 10573 -377560 -412314 22721 187762 -173264 -509077 -429522
96 -429522 -168041 47158 110155 11280 -68843 31258 114818 96754 186055 361481 324979
107 324979 133436 33590 -36839 -121497 5762 236291 131522 -258176 -441834 -301979
$$ packed form
0@%%%%%%%%%rJ8j8K7l6M5o3P2r0J17j35J62j98K34k71L17l71M34n06N82o70P71
31D12q78R96j131J278j441J621j817K034k273K532k815L125l464L834m237M680
47B456n163N688o267O907p608Q384r249J0213j1297J2526j3928J5549j7451J9716
61A0476k2467K5890l0292L6194m4566N7463q0147J31774m69042l9055O93513k25472
73D4269k84027r5057J35890R1437K11595J13718O6678K0010l4694j66393n37J14625
85B17514J8804n9123K6032j92654l88133l4754M35035J65041l61026l35813P9555
96d29522K61481K15199O2997r8875q0123J00101Q3560j8064Q9301J75426l6502
107C24979j91543r9846p0429q4658J27259K30529j04769l89698j83658J39855
$$ plain form
117 -301979 -87771 41190 11798 -148822 -196230 -39653 63537 31373 92560 225937 188907
128 188907 57342 48729 91392 93767 138020 149059 -20981 -201982 -161814 -17227 32648
139 32648 -12939 -126344 -248967 -204510 -3649 84592 13699 3551 52150 9859 -30574
150 -30574 58748 155917 159231 130604 64446 -55604 -86234 20809 86711 35761 -30685 -94959
162 -94959 -159596 -117449 4345 22135 -54036 -61035 -21420 -28371 -15343 59473 86546 45828
174 45828 28678 24858 7511 42796 104787 71545 -21953 -48467 -29682 -29161 -5286 30553 -6361
187 -6361 -78307 -83127 -51184 -33308 9640 52588 15820 -46999 -35423 12662 35307 56355
199 56355 65308 20460 -21789 2088 32338 19047 11267 16480 -7784 -34744 -26257 -14824 -13754
$$ packed form
117c01979K14208J28961k9392j60620m7408J56577J03190l2164O1187J33377l7030
128A88907j31565q613M2663K375M4253J1039j70040j81001M0168J44587M9875
139C2648m5587j13405j22623M4457K00861Q8241p0893j0148M8599m2291m0433
150c0574Q9322R7169L314k8627o6158j20050l0630J07043O5902n0950o6446o4274
162i4959o4637M2147J21794J7790p6171o999L9615o951J3028P4816K7073m0718
174D5828j7150l820j7347L5285O1991l3242r3498k6514J8785N21K3875L5839l6914
187f361p1946m820L1943J7876M2948M2948l6768o2819J1576M8085K2645K1048
199E6355Q953m4848m2249K3877L0250j3291p780N213k4264k6960Q487J1433J070
$$ plain form
212 -13754 3416 6171 -39243 -65095 -15474 39665 35876 4241 -21442 -30262 1319 52995 53483
225 53483 7519 -12423 1420 5032 766 6688 7463 1386 1348 -13659 -45702 -37837 15441 39429
239 39429 2883 -40971 -47271 -13506 37028 53784 9083 -39153 -24721 23884 40391 22533
251 22533 1809 -7217 -3002 3860 -4571 -14564 2650 27022 8814 -38509 -54607 -18970 30617
264 30617 47848 13232 -43374 -56283 -4773 51212 51450 8143 -25953 -20986 5364 20346 11965
277 11965 2858 10224 10445 -17950 -43982 -25197 24352 47174 13720 -42245 -62492 -24206 36545
290 36545 60291 24510 -31794 -48460 -12262 33869 42375 16995 -4723 -6589 -8773 -17765 -13565
303 -13565 16289 42401 21374 -36415 -67964 -34013 30016 58182 27788 -27853 -57984 -35574
$$ packed form
212a3754J7170K755m5414k5852M9621N5139l789l1635k5683q820L1581N1676M88
225E3483m5964j9942J3843L612m266N922P75o077l8j5007l2043P865N3278K3988
239C9429l6546m3854o300L3765N0534J6756m4701m8236J4432M8605J6507j7858
251B2533k0724r026M215O862q431r993J7214K4372j8208m7323j6098L5637M9587
264C0617J7231l4616n6606j2909N1510N5985K38m3307l4096M967K6350J4982q381
277A1965r107P366K21k8395k6032J8785M9549K2822l3454n5965k0247L8286O0751
290C6545K3746l5781n6304j6666L6198M6131Q506k5380k1718j866k184q992M200
303a3565K9854K6112k1027n7789l1549L3951O4029K8166l0394n5641l0131K2410
$$ plain form
315 -35574 20369 55724 38746 -3039 -26714 -21532 -4355 11547 24810 30794 16386 -21277
327 -21277 -53570 -40524 16209 58058 35499 -25503 -63734 -46408 6647 49737 48273 7606
339 7606 -33558 -39221 -10828 24435 42783 35823 6121 -27141 -40649 -23115 16295 46969 36590
352 36590 -13923 -62181 -58761 -4487 47660 51415 9015 -39032 -52785 -22099 26900 53793
364 53793 41487 3944 -31755 -41791 -13930 33088 53653 29018 -16451 -48860 -48081 -12215
376 -12215 34864 49180 14080 -36072 -56827 -34530 15462 54163 46131 767 -35629 -38654
388 -38654 -12132 30433 59227 38381 -18743 -51613 -35093 1834 31576 39834 13292 -32573
400 -32573 -54835 -36150 5599 45329 50945 5456 -48530 -52090 -7473 36942 56790 42489
$$ packed form
315c5574N5943L5355j6978m1785k3675N182J7177J5902J3263N984j4408l7663
327b1277l2293J3046N6733M1849k2559o1002l8231J7326N3055M3090j464m0667
339G606m1164n663K8393L5263J8348o960k9702l3262j3508J7534L9410L0674j0379
352C6590n0513m8258L420N4274N2147L755m2400m8047j3753L0686M8999K6893
364E3793j2306l7543l5699j0036K7861M7018K0565k4635m5469l2409P79L5866
376a2215M7079J4316l5100n0152k0755K2297M9992L8701q032m5364l6396l025
388c8654K6522M2565K8794k0846n7124l2870J6520L6927K9742Q258k6542m5865
400c2573k2262J8685M1749L9730N616m5489n3986l560M4617M4415J9848j4301
$$ plain form
412 42489 -9971 -56924 -42618 12673 45131 37932 9357 -28520 -49363 -30021 6484 27310
424 27310 30870 13161 -30543 -56002 -20811 34467 50087 29067 -5454 -40098 -37832 14102
436 14102 54735 37165 -2698 -26354 -35841 -22056 17237 36095 13681 -11047 -23632 -40010
448 -40010 -32177 17558 52348 29585 -13568 -39847 -43670 -4767 56113 60425 3053 -33377 -22391
461 -22391 -8677 7382 34426 28943 -10348 -26226 -15785 -15099 -7567 21055 21257 -15033 -31887
474 -31887 -21248 -9386 18234 45396 13929 -43325 -35055 19375 37758 26706 18344 -5201
486 -5201 -29998 -12357 17639 13895 8216 15349 -7422 -43595 -33642 -1931 5490 13385 21355 -13526
500 -13526 -52276 -21161 32040 32399 11888 7589 -2548 -5896 20202 28221 -2192 -8276 15118
$$ packed form
412D2489n2460m6953J4306N5291L2458p199k8575l7877k0843J9342L6505K0826
424B7310L560j7709m3704k5459L5191N5278J5620k1020l4521l4644K266N1934
436A4102M0633j7570l9863k3656r487J3785L9293J8858k2414k4728j2585j6378
448d0010P833M9735L4790k2763m3153k6279l823L8903O0880M312n7372l6430J0986
461b2391J3714J6059K7044n483l9291j5878J0441O86P532K8622K02l6290j6854
474c1887J0639J1862K7620K7162l1467n7254Q270N4430J8383j1052q362k3545
486e201k4797J7641K9996l744n679P133k2771l6173R953L1711P421P895P970l4881
500a3526l8750L1115N3201L59k0511m299j0137l348K6098Q019l0413o084K3394
$$ plain form
513 15118 4224 -20804 -5651 8053 -15372 -24186 -8697 -18448 -25716 10315 30878 -3006 -25720
526 -25720 -10653 3950 21895 49490 34382 -13354 -12918 18798 9802 -8775 10722 15133 -18806
539 -18806 -28195 -12084 -22469 -29973 -2898 5808 -19019 -15999 8538 7339 5528 22321 11885
552 11885 -7878 24039 59268 27578 -12917 -6272 -1274 -14639 1436 19194 -9601 -37357
564 -37357 -29198 -30442 -38887 -7562 23538 5563 -12175 647 -880 -4964 32795 58815 24878
577 24878 -1990 14174 16938 2282 12674 13310 -22930 -36614 -11333 -9261 -25235 -14857 -12302
590 -12302 -40046 -37839 5314 22582 16018 24444 17708 -12225 -4600 38281 48581 32671 28177
603 28177 6551 -36073 -34468 6773 14961 -5374 -14150 -31117 -56284 -39701 2851 10861 -355
$$ packed form
513A5118j0894k5028J5153J3704k3425q814J5489r751p268L6031K0563l3884k2714
526b5720J5067J4603J7945K7595j5108m7736M36L1716q996j8577J9497M411l3939
539a8806r389J6111j0385p504K7075Q706k4827L020K4537j199j811J6793j0436
552A1885j9763L1917L5229l1690m0495O645M998j3365J6075J7758k8795k7756
564c7357Q159j244q445L1325L1100j7975j7738J2822j527m084L7759K6020l3937
577B4878k6868J6164K764j4656J0392O36l6240j3684K5281K072j5974J0378K555
590a2302k7744K207M3153J7268o564Q426o736k9933P625M2881J0300j5910m494
603B8177k1626m2624J605M1241Q188k0335q776j6967k5167J6583M2552Q010j1216
$$ plain form
616 -355 3301 -1464 -12309 12241 45892 34358 13257 20472 16440 -4704 5938 30318 13493
629 13493 -21878 -33329 -34910 -29546 -311 15567 -14861 -41925 -30658 -15438 -482 33140
641 33140 46821 12573 -10980 5334 16496 13735 31494 43371 14572 -20688 -28027 -23658 -9740
654 -9740 13808 7418 -32457 -47355 -24275 -8526 -2482 13912 13007 -11123 -9620 20215 28346
667 28346 18268 24045 25464 3824 -8945 591 8687 12860 12729 -12846 -47464 -40993 -3947 9571
681 9571 866 -5254 -18480 -31033 -11100 22491 27033 16475 18139 12797 -4584 -3665 15446 23747
695 23747 20260 10367 -16336 -37404 -20401 9293 9071 -8953 -20524 -26834 -22473 1718 19009
708 19009 7979 -3258 3813 7334 2448 10956 24214 22529 10016 -1658 -14372 -14232 7495
$$ packed form
616c55L656m765j0845K4550L3651j1534k1101P215m032k1144J0642K4380j6825
629A3493l5371j1451j581N364K9235J5878l0428k7064J1267J5220J4956L3622
641C3140J3681l4248k3553J6314J1162k761J7759J1877k8799l5260p339M369J3918
654i740K3548o390l9875j4898K3080J5749O044J6394r05k4130J503K9835Q131
667B8346j0078N777J419k1640j2769R536Q096M173j31k5575l4618O471L7046J3518
681I571q705o120j3226j2553J9933L3591M542j0558J664n342j7381R19J9111Q301
695B3747l487r893k6703k1068J7003K9694k22j8024j1571o310M361K4191J7291
708A9009j1030j1237P071L521m886Q508J3258j685j2513j1674j2714J40K1727
$$ plain form
721 7495 19954 3194 -20829 -28572 -24127 -10048 11231 13751 -5734 -16554 -6450 2647 5499
734 5499 13860 21238 16047 4109 -5695 -8532 2586 20936 18707 -6570 -23325 -19603 -8767 1831
748 1831 8530 461 -16968 -19890 -5058 7261 9532 8854 6900 3077 157 -490 2786 14245 21191
763 21191 7483 -14957 -19053 -3875 7572 6945 5 -10126 -18504 -14266 -814 8338 7171 487
777 487 -4401 -3231 1431 4758 7584 12826 12881 615 -12697 -8096 7500 13190 4384 -7470 -12697
792 -12697 -10843 -4328 2691 5722 1840 -6749 -9804 -4140 4810 8037 5720 4071 2386 -2024 -4209
807 -4209 1307 9876 10141 45 -9755 -9270 -1933 3261 2984 52 -4055 -7740 -6849 -42 5759 4697
823 4697 -209 -2495 -903 1072 1865 3081 4700 4662 536 -3658 -3485 2068 5170 2428 -1960 -4262
$$ packed form
721G495J2459j6760k4023p743M445J4079K1279K520j9485j0820J0104R097K852
734E499Q361P378n191j1938r804k837J1118J8350k229k5277j6755L722J0836J0598
748A831O699q069j7429k922J4832J2319K271o78j954l823k920o47L276J1459O946
763B1191j3708k2440m096J5178J1447o27o940j0131q378M238J3452R152j167o684
777D87m888J170M662L327K826N242N5j2266j3312M601J5596N690q806j1854n227
792a2697J854O515P019L031l882q589l055N664Q950L227k317j649j685m410k185
807d209N516Q569K65j0096r800M85P337N194k77k932m107l685Q91O807N801j062
823D697m906k286J592J975P93J216J619l8m126m194J73N553L102k742m388k302
$$ plain form
839 -4262 -4376 -1668 1550 2198 -1143 -3332 -2271 186 539 246 -345 -9 1965 2588 322 -2724 -972
856 -972 3702 4782 516 -2316 -921 1422 1575 -756 -2468 -303 2570 648 -4822 -5422 -1208 2293
872 2293 2771 1770 -1496 -6324 -3648 5598 8963 2528 -3486 -2469 1259 2749 2813 2132 2771 2206 -3605
889 -3605 -8820 -3865 6062 6595 -1485 -6916 -8362 -7512 809 10548 8701 -2890 -9475 -4482 3380
904 3380 8671 8836 4197 -527 -2120 -4427 -4317 4164 11752 4641 -9463 -12744 -6967 -452 6707
919 6707 8492 -1895 -13033 -9705 766 8269 10823 6615 -3537 -7728 -1191 5451 6976 9781
933 9781 7723 -5535 -15211 -8347 3737 9188 8521 -1333 -16216 -17801 -2479 9315 9437 6507
947 6507 -623 -11555 -10869 4826 14086 10821 6810 632 -9180 -8641 4127 11243 7233 1111 -8309
$$ packed form
839d262j14K708L218O48l341k189J061K457L53k93n91L36J974O23k266l046J752
856i72M674J080m266k832J395K343J53k331j712K165K873j922n470o00M214L501
872B293M78j001l266m828K676R246L365o435o014J017L728J490O4o81O39n65n811
889c605n215M955R927N33q080n431j446Q50Q321R739j847j1591o585M993P862
904C380N291J65m639m724j593k307J10Q481P588p111j4104l281N777O515P159
919F707J785j0387j1138L328J0471P503K554m208j0152m191O537O642J525K805
933I781k058j3258r676O864J2084N451o67r854j4883j585J5322J1794J22k930
947F507p130j0932O86J5695R260l265m011o178r812N39J2768P116m010o122r420
$$ plain form
962 -8309 -17187 -9194 8636 10686 -1774 -7266 -8584 -10519 -973 14995 13997 180 -6133 -6099 -5352
977 -5352 6386 19508 13027 -3509 -9332 -10265 -8740 4185 17579 7000 -12023 -15220 -11041 -7000
991 -7000 5137 15909 5580 -9616 -8158 -2179 608 10485 17653 4972 -8177 -3605 2455 2132
1005 2132 7308 9756 -5110 -16139 -6805 1861 641 3704 3132 -11601 -17173 -2474 8590 7802
1019 7802 9514 5705 -10008 -13024 5081 14722 10669 9618 4111 -12875 -15385 2004 8907 2535
1033 2535 2058 -1243 -15250 -15875 490 6580 1448 2567 916 -9035 -4537 11466 10486 -123 2851
1048 2851 4977 -3576 -160 11808 5585 -8390 -6165 -1636 -7242 -3047 7406 1580 -10030 -7734
1062 -7734 -4837 -7319 3897 16418 6742 -7393 -1730 2774 -2430 5345 16752 7334 -5987 -2693
$$ packed form
962h309q878P993J7830K050j2460n492j318j935R546J5968r98j3817o313L4P47
977e352J1738J3122o481j6536n823r33J525J2925J3394j0579j9023l197M179M041
991g000J2137J0772j0329j5196J458N979K787R877P168j2681j3149M572O060l23
1005B132N176K448j4866j1029R334Q666j220L063n72j4733n572J4699J1064p88
1019G802J712l809j5713l016J8105R641m053j051n507j6986k510J7389O903o372
1033B535m77l301j4007o25J6365O090n132J119j651r951M498J6003r80j0609K974
1048B851K126q553L416J1968o223j3975K225M529n606M195J0453n826j1610K296
1062g734K897k482J1216J2521r676j4135N663M504n204P775J1407r418j3321L294
$$ plain form
1076 -2693 -387 -6770 -2714 6273 -279 -7572 -2415 -3459 -10980 -1596 8331 -812 -6800 5920 8846
1091 8846 -1117 444 7993 997 -2647 7535 8342 -1708 -1624 551 -7690 -7426 3106 522 -7818
1106 -7818 -1677 3412 -7564 -10347 2971 6330 -606 3532 8241 325 -2272 4793 3423 -1019
1120 -1019 5501 8043 -2263 -5355 153 -5863 -10460 1155 7745 -3408 -8297 -1667 -2548 -5583
1134 -5583 3432 8876 2032 968 5165 -46 -2941 6308 8432 -1075 -933 3511 -3765 -7934 1786
1149 1786 3315 -7637 -8356 85 -601 -2384 3167 1436 -6404 -2513 6050 4692 3222 8636 4822
1164 4822 -5959 -3087 4855 2244 764 5828 363 -11435 -10356 -935 453 457 3429 -2132 -9538
1179 -9538 -3751 5313 3167 2916 7465 3168 -3847 638 6210 2583 1330 4062 -1144 -8441 -3597
$$ packed form
1076b693K306o383M056Q987o552p293N157j044p521R384R927r143n988J2720K926
1091H846r963J561P549o996l644J0182Q07j0050Q4K175q241K64J0532k584q340
1106g818O141N089j0976k783J3318L359o936M138M709p916k597P065j370m442
1120a019O520K542j0306l092N508o016m597J1615O590j1153m889O630q81l035
1134e583R015N444o844j064M197n211k895R249K124r507J42M444p276m169R720
1149A786J529j0952p19Q441o86j783N551j731p840L891Q563j358j470N414l814
1164D822j0781K872P942k611j480N064n465j1798J079R421J388MK972n561p406
1179i538N787R064k146k51M549m297p015M485N572l627j253K732n206p297M844
$$ plain form
1194 -3597 3064 -51 -3310 -2589 -6066 -7605 1005 6618 1756 -1085 1008 -916 -1620 5570 9328
1209 9328 3777 894 1046 -3097 -5328 1747 6231 678 -4248 -5073 -7376 -5784 1978 5057 -577
1224 -577 -2694 -725 -1764 -488 5537 7685 3430 687 791 -1511 -1023 4691 4644 -1432 -5022 -4713
1240 -4713 -4609 -2104 2516 1772 -3797 -5063 -2432 -615 2313 6491 5281 432 -1643 -711 1199 4386
1256 4386 6915 3319 -3640 -5186 -3678 -1943 888 3661 -386 -6292 -7053 -3008 703 3370 4518
1271 4518 1764 -2471 -3098 14 4521 7349 5553 -582 -5165 -2990 381 1640 1987 1010 -3394 -7618
1287 -7618 -6225 -393 4173 4030 1175 -2828 -4244 -1326 3795 7718 7209 1613 -4287 -4547 455 4299
1303 4299 4481 1288 -2832 -6231 -7084 -2711 2413 4779 1445 -3805 -6749 -3499 2774 7352 7225 1855
$$ packed form
1194c597O661l115l259P21l477j539Q610N613m862k841K093j924p04P190L758
1209I328n551k883J52m143k231P075M484n553m926q25k303J592P762L079n634
1224e77k117J969j039J276O025K148m255k743J04k302M88N714m7o076l590L09
1240d713J04K505M620p44n569j266K631J817K928M178j210m849k075R32J910L187
1256D386K529l596o959j546J508J735K831K773m047n906p61M045L711K667J148
1271D518k754m235o27L112M507K828j796o135m583K175L371J259L47r77m404m224
1287g618J393N832M566j43k855m003j416K918N121L923n09n596n900k60N002L844
1303D299J82l193m120l399q53M373N124K366l334n250k944L250O273M578j27n370
$$ plain form
1319 1855 -3086 -4724 -469 5516 7164 3024 -2703 -6015 -5092 -1644 1369 2966 1685 -2765 -7269
1334 -7269 -6028 549 7342 7125 1077 -3698 -3795 -24 4950 7400 5004 -882 -5476 -5321 -1359 2916
1350 2916 3013 -230 -3560 -5455 -5592 -2394 4309 7632 2529 -4446 -5696 -14 5981 7822 4998 -32
1366 -32 -4078 -3778 -599 3346 4213 967 -4321 -6526 -4106 -1223 1100 3207 2310 -2627 -6122 -2226
1382 -2226 4663 7522 5035 45 -3090 -1841 2057 3779 2618 720 -2119 -4927 -4441 -784 1397
1397 1397 269 -790 -1738 -3871 -3569 1606 5607 4387 1076 -1585 -1638 1764 5453 3729 -73 -912
1413 -912 -899 -2573 -2551 510 812 -1322 -2142 -2324 -3196 -1485 2032 2781 877 216 256 152 3195 4185 1375
1432 1375 -1419 1111 1813 -1028 -2192 -102 -910 -2517 -1355 -1128 -2954 -1509 1444 540 -1183 884
$$ packed form
1319A855m941j638M255N985J648m140n727l312R23L448L013J597j281m450m504
1334g269J241O577O793k17o048m775r7L771M974K450k396n886m594J55L962M275
1350B916R7l243l330j895j37L198O703L323n103o975j250N682N995J841k824n030
1366c2m046L00L179L945Q67l246n288k205K420K883K323K107q97m937l495L896
1382b226O889K859k487m990l135J249L898J722j161j898k839k808M86L657K181
1397A397j128j059r48k133L02N175M001j220l311k661n3L402L689j724l802q39
1413i12J3j674K2L061L02k134q20j82q72J711L517P49j904o61M0j04L043R90k810
1432A375k794K530P02k841j164K090q08j607J162K27j826J445K953r04j723K067
$$ plain form
1448 884 1137 430 1803 4070 1695 46 2494 1652 -2529 -1283 2537 794 -2077 -1808 -3074 -4823
1464 -4823 -1121 3313 483 -2132 -25 -362 -2108 1585 5566 2521 578 2216 31 -3253 745
1479 745 4821 1036 -2991 -1142 -2011 -4043 -66 2361 -2237 -3625 460 -165 -2011 2684 5055 -10
1495 -10 -2273 1657 2011 244 4373 4998 -2487 -5454 -744 654 -451 2289 1544 -5774 -5869 -656 -539
1512 -539 -941 4689 4963 -3224 -4784 1391 2556 1225 5409 4539 -3299 -3843 1876 1198 -1001 1368
1528 1368 110 -5250 -2693 2192 -1512 -3539 2517 1782 -4708 -1855 5180 4078 -736 1511 563
1543 563 -3816 588 6727 2503 -2106 -502 -2148 -5941 -774 4807 -333 -3620 1299 -1074 -7078
1558 -7078 -1841 6247 3138 -562 1427 -407 -3800 1974 6457 745 -1617 2477 1011 -4056 -564
$$ packed form
1448H84K53p07J373K267k375j649K448q42m181J246L820j743k871K69j266j749
1464d823L702M434k830k615K107l37j746L693L981l045j943J638k185l284L998
1479G45M076l785m027J849q69k032L977K427m598j388M085o25j846M695K371n065
1495a0k263L930L54j767M129O25p485k967M710J398j105K740p45p318r5N213J17
1512e39m02N630K74q187j560O175J165j331M184q70p838n44N719o78k199K369
1528A368j258n360K557M885l704k027O056p35o490K853P035j102m814K247r48
1543E63m379M404O139m224m609J604j646l793N167N581n140l287M919k373o004
1558g078N237Q088l109l700J989j834l393N774M483n712k362M094j466n067L492
$$ plain form
1573 -564 2772 -2852 -2975 2481 74 -5305 -619 3676 -1146 -2951 1424 1007 -833 3945 4568 -3014
1589 -3014 -3347 3461 2184 -2000 2167 3871 -2548 -3383 388 -1360 -3927 2383 4649 -1948 -3944
1604 -3944 -234 -1322 -1731 4702 4937 -1824 -1259 3372 -260 -3966 2415 4507 -343 -961 1256 -2882
1620 -2882 -3700 2159 3282 -2434 -2022 1382 -1468 -2230 2471 2024 -3201 -441 3835 54 -1914 3024
1636 3024 2565 -2843 -1578 982 -626 284 4706 924 -5217 -3323 1099 408 1049 4464 575 -5340
1652 -5340 -2638 1533 -298 1157 4933 1708 -4819 -3051 647 168 2181 4684 -192 -5831 -1866
1667 -1866 2173 482 1031 2927 -763 -4661 -916 2677 729 896 2452 -2186 -5058 -283 3771
1682 3771 1859 924 249 -4220 -4621 1757 5458 2534 -113 -802 -4156 -3546 2587 5516 2319 202
$$ packed form
1573e64L336n624j23N456k407n379M686M295m822j805M375m17j840M778O23p582
1589c014l33O808j277m184M167J704o419q35L771j748k567O310K266o597j996
1604c944L710j088m09O433K35o761N65M631l632l706O381K092m850o18K217m138
1620b882q18N859J123n716M12L404k850p62M701m47n225K760M276l781j968M938
1636C024m59n408J265K560j608R10M422l782o141J894M422o91O41L415l889n915
1652e340K702M171j831J455L776l225o527J768L698m79K013K503m876n639L965
1667a866M039j691N49J896l690l898L745L593j948J67J556m638k872M775M054
1682C771j912r35o75m469m01O378L701k924k647o89l354O10O133K929l197k117
$$ plain form
1698 202 -1748 -5289 -3987 3161 5688 1207 -2008 -3205 -3942 -1336 4176 4791 -65 -2393 -2070 -2218
1714 -2218 218 4892 4530 -558 -2678 -2314 -1985 1325 5292 2963 -3521 -5032 -2279 396 2960 4202
1730 4202 591 -4164 -3579 -908 977 2919 4114 1182 -3375 -3497 -774 2003 3868 4175 -1015 -5446
1746 -5446 -3722 995 3234 2894 813 -2890 -4148 -1666 1573 2085 1804 879 -1797 -2924 -833 1910
1762 1910 3331 2936 508 -3634 -3641 554 4143 2832 -31 -2525 -3219 -1619 1347 2299 761 -609
1778 -609 -1755 -2195 -1600 1268 2779 2371 224 -1755 -2919 -15 3271 3798 455 -2181 -2299 -921
1794 -921 695 1945 823 -921 -1546 -1358 -1046 -292 1207 1590 373 -1257 -2170 -1054 1849 3490 1655
1811 1655 -947 -1872 -543 1573 2097 1234 -250 -1310 -1176 -532 -424 97 478 24 -1130 -1942 -1035 242
$$ packed form
1698B02j950l541J302P148K527m481l215j197p37K606N512O15m856k328L23j48
1714b218K436M674l62n088k120L64L29L310L967k329o484j511K753K675K564J242
1730D202l611m755N85K671J885J942J195k932m557j22K723K777J865L07n190m431
1746e446J724M717K239l40k081l703j258K482L239N12k81r25k676j127K091K743
1762A910J421l95k428m142pM195L589j311k863k494o94J600K966R52j538j370
1778f09j146m40N95K868J511m08k147j979j164K904L286N27l343k636j18J378
1794i21J616J250j122j744o25J88L12P54J499L83j217j630r13J116K903J641j835
1811A655k602r25J329K116N24q63j484j060J34O44J08N21L81m54j154q12R07J277
$$ plain form
1829 242 2183 1738 -421 -1479 -643 1279 2115 1770 477 -381 -142 -92 -113 -6 197 305 -903 -1641 -1598
1848 -1598 -798 729 1270 90 -1209 -1316 799 1881 1405 925 257 241 872 601 541 -10 266 89 -926
1867 -926 -1474 -817 274 36 -222 -958 -1647 -648 1056 1387 466 226 734 925 915 733 1119 709 515 157
1887 157 -995 -1071 33 -36 -902 -1455 -1175 -1257 -403 732 432 -779 -110 1083 923 724 1187 920 726
1906 726 1136 714 -255 -25 601 -168 -1427 -838 -464 -336 -631 -467 -1085 -1144 644 861 171 147 1012 531
1926 531 830 1553 1151 -168 272 934 -530 -1263 -88 486 -1045 -1478 -1131 -1556 -277 1237 308 -1305
1944 -1305 -475 1213 996 768 1895 764 -904 136 1117 208 -81 1474 50 -2718 -2381 -557 91
1961 91 833 1289 -1073 -3267 -525 2221 1537 1096 1459 -129 -1591 699 2271 705 618 743 -1044
$$ packed form
1829B42J941m45k159j058Q36J922Q36l45j293q58K39N0k1J07K03J08j208p38M3
1848a598Q00J527N41j180j299j07K115J082m76m80o68j6O31k71o0n51K76j77j015
1867i26n48O57J091k38k58p36o89R99J704L31r21k40N08J91j0j82L86m10j94l58
1887A57j152p6J104o9q66n53K80q2Q54J135l00j211O69J193j60j99M63k67j94
1906G26M10m22r69K30O26p69j259N89L74J28k95J64o18n9J788K17o90k4Q65m81
1926E31K99P23m02j319M40O62j464p33J175N74j531m33L47m25J279J514r29j613
1944a305Q30J688k17k28J127j131j668J040R81r09k89J555j424k768L37J824O48
1961I1P42M56k362k194K742K746o84m41L63j588j462K290J572j566q7J25j787
$$ plain form
1978 -1044 -3345 -443 2246 391 -413 -870 -2936 -2510 2045 3579 226 -1282 -356 -1067 -443 3393
1994 3393 4192 -22 -1164 -601 -2242 -1788 2583 3334 -504 -2850 -2434 -2472 -286 3758 3154 -2040 -3065
2011 -3065 -555 22 1316 3950 2556 -1849 -1750 648 147 445 3692 1027 -4056 -3703 -34 1037
2027 1037 1804 2872 -1302 -5702 -2226 2924 2971 2330 2006 -907 -4023 -889 3200 2965 2081 1932 -2080
2044 -2080 -5571 -1892 2649 2080 886 -199 -3768 -5272 219 4311 1823 -161 151 -1682 -2103 2182
2060 2182 4722 1372 -244 -169 -1879 -2547 2434 4478 13 -3395 -2795 -3343 -1493 3849 4374 -1570
2076 -1570 -3846 -1605 -817 617 4890 4230 -931 -2689 -880 -1193 819 4988 3173 -2556 -4293 -1834
2092 -1834 -883 661 3194 958 -4128 -3481 700 924 1368 2865 960 -2931 -1258 1974 1826 1531
$$ packed form
1978a044k301K902K689j855q04m57k066M26M555J534l353j508R26p11O24L836
1994C393P99m214j142N63j641M54M371P51l838k346M16l8K186M044o04n194j025
2011c065K510N77J294K634j394m405R9K398n01K98L247k665n083L53L669J071
2027A037P67J068m174m400L476N150M7o41l24k913l116L134M089k35q84j49m012
2044b080l491L679M541n69j194j085l569j504N491M092k488j984L12j833m21M285
2060B182K540l350j616P5j710o68M981K044m465l408O00n48J850N342N25n944
2076a570k276K241P88J434M273o60n161j758J809l13K012M169j815n729j737K459
2092a834R51J544K533k236n086O47M181K24M44J497j905l891J673L232j48k95
$$ plain form
2108 1531 2972 -695 -4680 -2238 2372 2014 779 463 -2728 -5136 -1119 3184 1799 490 373 -1815
2124 -1815 -3247 518 3848 2122 1146 1179 -1907 -3216 862 3491 1329 -993 -756 -2212 -2580 1217
2140 1217 2606 -409 -1330 -144 -1079 -1186 2426 2904 -374 -1125 16 -749 -639 2476 2615 -1421 -2460
2157 -2460 -701 -527 158 2365 1228 -2491 -2122 332 188 237 2496 1336 -1460 -1206 509 93 498
2174 498 2392 1038 -2372 -1882 629 589 -262 996 -527 -2267 -355 1620 241 -199 1218 -17
2190 -17 -1399 144 1611 679 221 815 -644 -2213 421 1780 333 -881 -603 -943 -1416 1189 1719
2207 1719 -370 -738 590 179 -817 630 1589 245 -186 137 -631 -1017 1045 1200 -732 -1249 -175
2224 -175 48 134 902 575 -1250 -559 1339 552 87 710 830 -567 -513 413 291 138 861 132 -1348
$$ packed form
2108A531J441l667l985K442M610l58j235l16l191k408M017M303j385j309j17k188
2124a815j432L765L330j726r76L3l086j309M078K629k162k322K37j456l68L797
2140A217J389l015r21J186r35j07L612M78l278p51J141p65J10L115J39m036j039
2157b460J759J74O85K207j137l719L69K454j44M9K259j160k796K54J715m16M05
2174D98J894j354l410M90K511m0q51J258j523j740J912J975j379m40J417j235
2190a7j382J543J467r32m58N94j459j569K634J359j447j214K78l40m73K605N30
2207A719k089l68J328m11r96J447R59j344m31L23p68l86K062J55j932n17J074
2224a75K23Q6P68l27j825O91J898p87m65O23J20j397N4R26j22j53P23p29j480
$$ plain form
2243 -1348 -917 570 594 -178 148 -764 -1061 314 1726 198 -155 358 290 14 431 806 426 -156 103
2262 103 -431 -1191 -21 829 190 -982 -877 -610 11 1214 1103 20 -592 384 276 397 929 860 97
2281 97 -198 -298 -705 -198 501 1015 -657 -1273 -975 -171 475 839 171 -545 -353 327 593 647 733 736 227
2302 227 -342 -424 -77 591 752 387 -1242 -1014 -347 565 996 145 -914 -1079 -476 668 855 450 505 389
2322 389 -497 -587 518 965 829 -65 -647 -1237 -653 456 837 384 -553 -1565 -727 376 705 840 364
2341 364 133 -518 -568 206 1342 1534 257 -798 -1180 -849 559 1133 375 -533 -1786 -1204 -178 992
2359 992 832 49 -618 -946 -343 338 1244 1452 203 -545 -888 -138 1024 1682 1165 -518 -1524 -1545 -239
2378 -239 835 1066 135 -1395 -1591 -694 462 1022 1404 610 -937 -1351 -13 1235 1808 1888 -145 -1809
$$ packed form
2243a348M31J487K4p72L26r12k97J375J412j528l53N13o8k76M17L75l80n82K59
2262A03n34p60J170Q50o39j172J05K67O21J203j11j083o12R76j08J21N32o9p63
2281I7k95j00m07N07O99N14j672o16K98Q04O46L64o68p16J92O80K66N4Q6Ln09
2302B27n69q2L47O68J61l65j629K28O67R12M31q51j059j65O03J144J87m05N5j16
2322C89q86r0J105M47j36q94n82n90N84J109L81m53r37j012Q38J103L29J35m76
2341C64k31o51n0P74J136J92j277j055l82L31J408N74p58r08j253N82J026J170
2359I92j60p83o67l28O03O81R06K08j249p48l43P50J162O58n17j683j006k1J306
2378b39J074K31r31j530j96Q97J156N60L82p94j547m14J338J248N73Q0k033j664
$$ plain form
2396 -1809 -1301 425 990 1104 303 -1361 -1691 -782 567 1142 591 50 -1025 -1551 -230 1426 1957 1062
2414 1062 -96 -1232 -1364 622 2126 1041 -266 -1279 -1450 -1167 420 1372 752 -606 -840 -1457 -691
2431 -691 986 1856 970 -507 -1090 -556 58 1830 1787 176 -1248 -799 -459 484 1226 776 -425 -1444
2449 -1444 -735 -454 174 1288 979 -959 -1583 -561 425 1106 1686 595 -1472 -1234 603 616 861 798
2467 798 3 -1474 -1632 311 276 337 640 -250 -1816 -1063 921 1366 696 434 -669 -1504 218 1924
2485 1924 1006 -42 -69 -345 -1366 119 1479 198 -569 -238 -899 -1247 288 1933 243 -854 -544
2502 -544 -773 -653 1019 1734 -299 -1104 44 196 -320 924 1184 -413 -837 199 -176 -971 539 1050
2520 1050 -690 -1214 100 487 -88 722 796 -1059 -637 1226 878 -127 480 517 -878 -172 1140 215
$$ packed form
2396a809N08J726N65J14q01j664l30R09J349N75n51n41j075n26J321J656N31q95
2414A062j158j136j32J986J504j085j307j013j71K83J587R52o20j358k34o17P66
2431f91J677Q70q86j477n83N34O14J772m3j611j424M49L40R43P42m50j201j019
2449a444P09K81O28J114l09j938o24J022R86O81N80j091k067K38J837J3K45o3
2467G98p95j477j58J943l5O1L03q90j566P53J984M45o70k62j103q35J722J706
2485A924r18j048k7k76j021J485J360j281p67L31o61l48J535J645j690j097L10
2502e44k29J20J672P15k033q05J148J52n16J244K60j597m24J036l75p95J510N11
2520A050j740n24J314L87n75Q10P4j855M22J863l48j005O07L7j395P06J312r25
$$ plain form
2538 215 -661 290 71 -1407 -803 1146 368 -549 55 -152 -1066 152 1388 298 -685 526 698 -612
2556 -612 362 1353 -112 -955 463 447 -1103 -119 671 -681 -1192 517 152 -529 263 1037 -559 -1426
2574 -1426 882 1042 38 465 971 -495 -956 1019 664 -13 220 808 -1119 -1122 744 388 -971 418
2592 418 650 -1022 -761 1226 892 -662 307 815 -400 271 1424 441 -1120 37 628 -776 39
2609 39 1182 210 -1474 -379 92 -769 -164 1230 267 -1372 -35 402 -293 621 1283 -225 -840 228
2627 228 568 -648 46 912 -393 -1288 176 282 -870 357 797 -788 -834 648 874 -194 199 918
2645 918 -477 -549 569 602 -372 -98 680 -1010 -993 684 625 -670 -67 235 -838 -482 1099 434 -842
2664 -842 541 827 -413 -332 1148 505 -545 242 679 -363 -499 716 -83 -806 -241 339 -372 -357 844
$$ packed form
2538B15q76R51k19j478O04J949p78r17O04k07r14J218J236j090r83J211J72j310
2556f12R74R91j465q43J418j6j550R84P90j352n11J709l65o81P92P74j596q67
2574a426K308J60j004M27N06j466m61J975l55o77K33N88j927lJ866l56j359J389
2592D18K32j672K61J987l34j554R69N08j215O71J153r83j561J157N91j404Q15
2609C9J143r72j684J095M71q61O05J394r63j639J337M37o95R14O62j508o15J068
2627B28L40j216O94Q66j305q95J464J06j152J227M40j585m6J482K26j068L93P19
2645I18j395p2J118L3r74K74P78j690J7J677n9j295O03L02j073L56J581o65j276
2664h42J383K86j240Q1J480o43j050P87M37j042j36J215p99p23N65N80p11J5J201
$$ plain form
2683 844 -37 -665 461 685 -368 -135 704 137 -619 278 232 -451 -148 669 -169 -881 -169 266 -533 146
2703 146 612 -34 -283 744 477 -468 -105 760 187 -124 533 212 -601 -234 580 50 -351 -75 -85 -746
2723 -746 182 497 124 -3 704 221 -193 163 1175 235 -305 -44 -342 -324 366 695 115 -475 -425 160
2743 160 -317 194 673 -3 -314 128 128 -266 435 797 -60 -198 31 80 157 695 451 -579 -576 -85 -37 -162
2765 -162 171 146 -88 -256 139 354 253 452 226 -49 -157 375 556 396 157 -174 -665 -691 389 221
2785 221 11 -261 -217 -571 -89 610 652 84 -19 66 -146 104 908 326 165 -148 -264 -551 38 99 162 -18
2807 -18 -480 -250 -289 242 346 301 -163 -281 15 367 370 590 129 -28 0 113 -59 205 71 -82 -425 -212
2829 -212 -331 -110 71 -87 -295 -127 100 412 657 176 360 76 102 125 151 474 -56 -264 -289 -199 165 -141
$$ packed form
2683H44q81o28J126K24j053K33Q39n67p56Q97m6o83L03Q17q38p12P12M35p99O79
2703A46M66o46k49J027k67r45L63Q65n73l11O57l21q13L67Q14n30m01K76j0o61
2723g46R28L15l73j27P07m83m14L56J012r40n40K61k98J8O90L29n80n90N0N85
2743A60m77N11M79o76l11M42%l94P01L62q57j38K29M9P7N38k44j030LM91M8j25
2765a62L33k5k34j68L95K15j01J99k26k75j08N32J81j60k39l31m91k6J080j68
2785B21k10k72M4l54M82O99M2n68j03Q5k12K50Q04n82j61l13j16k87N89O1O3j80
2807a8m62K30l9N31J04m5m64j18K96L52LK20m61j57K8J13j72K64j34j53l43K13
2829b12j19K21J81j58k08J68K27L12K45m81J84k84K6K3K6L23n30k08k5R0L64l06
$$ plain form
2851 -141 153 -17 -389 -292 -336 17 381 15 256 571 382 257 590 364 113 66 -197 -58 -25 51 -617 14
2873 14 -31 -213 -97 75 28 67 118 37 347 252 253 314 255 127 105 195 -39 -289 74 -238 -225 -47 -333 -87 -419
2898 -419 -355 -130 123 408 376 73 83 397 173 470 387 343 119 -345 151 29 35 -8 73 -593 -400 119 -2
2921 -2 76 194 -179 -328 389 553 273 318 442 106 -160 546 307 350 -159 -59 -488 -576 -294 136 159 -280
2943 -280 -174 -249 62 700 586 214 4 281 269 321 956 306 -158 -90 46 41 -353 376 308 -394 -542 -150
2965 -150 -343 -69 319 84 -236 10 567 103 428 796 231 -666 -55 258 59 -61 355 -124 -801 -489
2985 -489 -14 -8 90 268 -57 -531 -129 567 61 250 662 -23 -358 129 542 45 100 306 -294 -649 250
3006 250 718 -153 4 -39 -122 -483 483 621 -408 -364 108 -28 134 664 687 -213 -393 294 248 -210 572
$$ packed form
2851a41K94j70l72R7m4L53L64l66K41L15j89j25L33k26k51m7k63J39L3P6o68O31
2873A4m5j82J16J72m7L9N1q1L10r5JO1n9j28k2R0k34k50L63l12J3J78k86K46l32
2898d19O4K25K53K85l2l03J0L14k24K97q3m4k24m64M96j22Om3Q1o66J93N19j21
2921bP8J18l73j49P17J64k80M5J24l36k66P06k39M3n09J00m29q8K82M30K3m39
2943b80J06p5L11O38j14l72k10K77j2N2O35o50m64O8J36nl94P29o8p02j48L92
2965a50j93K74L88k35l20K46N57m64L25L68n65q97O11L13j99j20M16m79o77L12
2985d89M75OR8J78l25m74M02O96n06J89M12o85l35M87M13m97N5K06o00l55Q99
3006B50M68q71J57m3q3l61R66J38j029M4M72j36J62N30K3r00j80O87m6m58P82
$$ plain form
3027 572 385 -728 -484 190 -155 -389 222 100 -732 -268 769 360 86 650 323 -842 -317 657 588
3046 588 -86 464 -83 -723 -165 924 7 -491 -100 -78 -1111 13 731 17 -286 101 -3 -912 358
3065 358 902 -16 -612 -84 59 -521 261 808 -424 -645 -202 102 -450 141 618 -676 -495 505 61
3084 61 63 765 584 -554 -519 536 380 23 351 371 -618 -473 675 275 128 461 56 -922 -673 651
3104 651 137 -275 343 388 -792 -320 965 676 49 244 -176 -992 -94 755 260 -612 103 -27 -969 145
3124 145 955 37 -412 216 27 -366 281 1089 -33 -274 279 241 -141 418 693 -24 -818 197 300 -151
3144 -151 352 782 -510 -475 -72 426 163 549 684 -392 -885 498 227 -131 588 348 -346 -559 456
3163 456 676 21 -9 118 -513 -519 338 226 -102 17 299 -500 -397 760 310 32 88 416 -422 -237 326
$$ packed form
3027E72j87j113K44O74l45k34O11j22q32M64J037m09k74N64l27j165N25R74o9
3046E88o74N50n47o40N58J089r17m98L91K2j033J124P18p14l03L87j04r09J270
3065C58N44r18n96N28J43n80P82N47j232k21M43L04n52N91M77j294J81J000m44
3084F1KP02j81j138L5J055j56l57L28K0r89J45J148m00j47L33m05r78K49J324
3104F51n14m12O18M5j180M72J285k89o27J95m20q16Q98Q49m95q72P15j30r42J114
3124A45Q10r18m49O28j89l93O47Q08j122k41N53l8l82N59K75p17p94J015J03m51
3144a51N03M30j292L5M03M98k63L86J35j076m93J383k71l58P19k40o94k13J015
3163D56K20o55l0J27o31oQ57j12l28J19K82p99J03J157m50k78N6L28q38J85N63
$$ plain form
3184 326 146 -117 126 173 -280 21 652 -123 -488 2 247 -460 6 475 72 -244 123 165 -241 305 729
3205 729 -187 -195 260 -39 -132 3 399 -113 -358 400 373 -123 113 146 -367 -413 328 431 239 37 210 17
3227 17 142 500 257 -106 -46 -10 99 -83 231 11 -214 137 -64 -141 -67 334 5 -518 -35 347 13 -31
3249 -31 315 -50 46 -100 232 156 -95 56 -63 -211 169 -5 16 -129 -143 20 17 418 688 -86 -118 21 -58
3272 -58 -17 23 578 231 61 -76 -11 142 79 76 158 108 119 67 -81 229 22 -70 328 247 75 -30 368 157
3296 157 -603 -300 118 -49 -36 167 -195 -336 22 -76 84 -80 387 -122 -289 -70 84 171 139 102 -190 -298
3318 -298 246 243 108 -135 -153 -51 197 -42 309 112 -188 -95 24 16 102 290 -31 -351 108 -79 300 389 111
3341 111 70 -10 91 241 114 166 -120 -174 -441 68 96 235 222 162 160 7 174 434 286 188 31 -117 92
$$ packed form
3184C26j80k63K43M7m53L01O31p75l65M90K45p07M66M69m03l16L67M2m06N46M24
3205G29r16qM55k99r3J35L96n12k45P58k7m96K36L3n13m6P41J03j92k02J73j93
3227A7J25L58k43l63O0L6J09j82L14k20k25L51k01p7P4M01l29n23M83L82l34m4
3249c1L46l65R6j46L32p6k51J51j19j48L80j74K1j45j4J63lM01K70p74l2J39p9
3272e8M1M0N55l47j70j37O5J53o3lQ2n0J1n2j48L10k07r2L98q1j72j05L98k11
3296A57p60L03M18j67J3K03l62j41L58r8J60j64M67n09j67K19J54Q7l2l7k92j08
3318b98N44lj35k43j8J02K48k39L51j97l00R3J19qQ6J88l21l20M59j87L79Q9k78
3341A11m1q0J01J50j27N2k86n4k67N09K8J39j3o0kj53J67K60j48r8j57j48K09
$$ plain form
3364 92 257 356 -143 -9 -118 -380 235 334 182 -60 -43 321 122 -40 115 -140 39 -135 -354 16 41 155
3386 155 -124 -360 -225 76 -55 276 -76 193 -87 -16 220 248 155 71 161 -100 28 474 21 -129 45 -205
3408 -205 -148 26 230 105 -209 -42 -262 -35 480 338 59 86 -183 -94 324 390 311 -276 -83 -90 71 114 -105
3431 -105 84 -91 -160 67 -155 172 324 38 -193 -46 379 111 215 368 145 -132 -59 266 301 24 446
3452 446 0 -374 47 78 218 352 34 95 -193 -71 81 75 9 81 -234 -152 559 120 159 186 148 -197 -126 102
3476 102 232 -152 -127 70 -221 -198 279 157 -28 376 187 -146 -144 392 252 -79 115 204 18 62 481 502
3498 502 -439 -329 397 -266 37 33 -174 -285 76 227 -105 318 476 398 140 174 226 -249 27 300 -222 -160
3520 -160 315 198 -436 -32 354 186 -172 312 559 -321 -118 341 -36 -153 402 139 24 141 502 118
$$ packed form
3364I2J65R9m99J34j09k62O15R9j52k42J7L64j99j62J55k55J79j74k19L70K5J14
3386A55k79k36J35L01j31L31l52K69k80P1K36K8r3q4R0k61J28M46m53j50J74k50
3408b05N7J74K04j25l14J67k20K27N15j42k79K7k69Q9M18O6p9n87J93pJ61M3k19
3431a05J89j75o9K27k22L27J52k86k31J47M25k68J04J53k23k77P3L25L5k77M22
3452D46m46l74M21L1J40J34l18O1k88J22J52oo6P2l15Q2P11m39L9K7l8l45P1K28
3476A02J30l84K5J97k91K3M77j22j85M04j89l33KN36j40l31J94Q9j86M4M19K1
3498E02r41J10P26o63L03mk07j11L61J51l32M23J58p8k58L4N2m75K76K73n22O2
3520a60M75j17o34M04L86j68l58M84K47q80K03M59l77j17N55k63j15J17L61l84
$$ plain form
3540 118 -314 156 367 54 -240 259 -97 -163 174 157 -101 -259 539 -90 -198 -13 84 -269 452 589 112
3561 112 7 407 147 -499 -1 303 153 -300 59 28 -625 106 458 -107 -417 151 411 -74 499 625
3581 625 -184 12 143 31 -112 596 15 -182 -360 292 -77 125 384 398 -184 -417 367 37 273 607
3601 607 496 -196 -431 370 234 66 503 -43 -607 -454 143 113 -91 -71 44 -396 -138 194 284 77 183
3622 183 -141 -229 -138 572 451 -26 -58 -160 -210 -106 393 -76 -161 99 -237 -514 117 424 228 -243 -230 -155
3644 -155 -373 345 537 -301 -297 172 -282 64 213 766 -188 -609 209 -99 172 91 398 -249 -569 39 293
3665 293 113 554 455 -201 -440 397 134 201 267 93 -108 -96 193 -77 96 140 212 -367 -107 234 -9 158
3687 158 -88 285 -142 -122 630 448 -469 84 66 -354 -81 214 67 -222 -110 -277 -313 -56 297 370 9
$$ packed form
3540A18m32M70K11l13k94M99l56o6L37j7k58j58P98o29j08J85R7l53P21J37m77
3561A12j05M00k60o46M98L04j50m53L59l1o53P31L52n65l10N68K60m85N73J26
3581F25q09J96J31j12j43P08n81j97j78O52l69K02K59J4n82k33P84l30K36L34
3601F07j11o92k35Q01j36j68M37n46n64J53N97l0k04K0J15m40K58L32R0k07J06
3622A83l24q8R1P10j21m77l2j02n0J04M99m69q5K60l36k77O31L07j96m71J3P5
3644a55k18P18J92q38MM69m54L46J49N53r54m21Q18l08K71q1L07o47l20O08K54
3665B93j80M41r9o56k39Q37k63O7O6j74k01J2K89k70J73M4P2n79K60L41k43J67
3687A58k46L73m27K0P52j82r17N53j8m20K73K95j47k89J12j67l6K57L53P3l61
$$ plain form
3708 9 -29 215 -142 35 139 80 -55 160 171 -192 401 399 -188 -186 72 287 -190 119 214 -180 -355 -30 138
3731 138 276 127 292 -12 -475 -29 213 53 -71 293 -5 -174 -9 36 -106 27 -14 -327 198 379 100
3752 100 -141 5 179 -276 157 330 53 205 -26 213 7 254 169 293 -275 -187 -83 -217 76 343 332
3773 332 -335 3 113 281 55 179 132 -279 31 130 132 83 89 -238 -88 -21 290 -54 37 126 -131 23 511
3796 511 211 82 109 127 -29 148 415 230 53 11 -204 -48 -61 383 544 193 117 -136 -94 96 406 0
3818 0 -102 41 39 -85 141 -23 145 -192 -55 -111 -77 449 314 211 -25 58 -208 370 7 154 21 28 109
3841 109 -102 22 174 127 -2 56 -158 -22 252 361 279 -133 -168 84 -146 409 25 247 -186 -199 -398 -202
3863 -202 118 51 95 -112 -6 -133 399 194 165 -291 76 -223 16 -120 -111 -43 -84 -163 -29 63 103 10 -84 -123
$$ packed form
3708Il8K44l57J77J04n9j35K15J1l63N93kn87KK58K15m77L09R5l94j75L25J68
3731A38J38j49J65l04m63M46K42j60j24L64k98j69J65M5j42J33m1l13N25J81k79
3752A00k41J46J74m55M33J73k77J52k31K39k06K47q5J24n68Q8J04j34K93K67j1
3773C32o67L38J10J68k26J24m7m11L10R9Km9Ol27J50O7L11l44R1Q9k57J54M88
3796E11l00j29K7J8j56J77K67j85j77m2k15J56j3M44J61l51p6k53M2J90L10m06
3818@j02J43kj24K26j64J68l37J37n6L4N26j35j03k36Q3k66N78l63J47j33PQ1
3841A09k11J24J52m7j29N8k14J36K74J09q2m12l5K52k30N55l84K22m33j3j99J96
3863b02L20o7M4k07J06j27N32k05k9m56L67k99K39j36RO8m1p9J34R2M0r3r4l9
$$ plain form
3887 -123 -63 -17 -2 246 301 -106 71 -214 -8 227 191 49 -219 -1 -199 32 59 283 -258 -5 -63 92
3909 92 -341 78 316 246 79 -72 -81 263 -47 276 30 -391 14 -230 -118 379 359 -336 -232 -199 188 240
3931 240 136 226 -175 -199 -17 166 277 439 119 -255 -237 134 -259 209 138 141 -179 -116 -15 23 392 596 -157
3954 -157 -399 -235 195 192 274 229 -334 -518 -227 121 166 353 164 -234 -275 274 293 291 119 179 -223 -524 41
3977 41 468 146 427 -262 -386 -244 404 234 35 54 107 -412 -204 210 197 385 171 -24 -373 70 187
3998 187 372 9 -45 -185 -147 77 692 540 -164 -171 -421 -287 163 234 329 70 -197 57 -199 240 503 172
4020 172 87 -103 -228 23 344 735 340 -378 -221 2 -80 361 527 -258 -598 -552 89 158 292 99 -119
4041 -119 -434 -138 148 131 243 389 -234 -461 95 615 272 146 -44 40 -172 -6 312 -116 -26 66 -100
$$ packed form
3887a23O0M6J5K48N5m07J77k85K06K35l6j42k68K18j98K31K7K24n41K53n8J55
3909I2m33M19K38p0j67j51rL44l10L23k46m21M05k44J12M97k0o95J04L3L87N2
3931B40j04R0m01k4J82J83J11J62l20l74J8L71l93M68p1Ll20O3J01L8L69K04p53
3954a57k42J64M30lQ2m5n63j84K91L48M5J87j89l98m1N49J9kj72O0m02l01N65
3977D1M27l22K81o89j24J42O48j70j99J9N3n19K08M14j3J88k14j95l49M43J17
3998A87J85l63n4j40L8K24O15j52p04pk50J34M50P1R5k59k67K54k56M39K63l31
4020A72q5j90j25K51L21L91l95p18J57K23q2M41J66p85l40M6O41O9J34j93k18
4041a19l15K96K86j7J12J46o23k27N56N20l43j26j90Q4k12J66L18m28R0R2j66
$$ plain form
4062 -100 -85 326 387 -33 -4 11 -272 -39 383 451 9 50 388 -75 -244 181 275 44 -29 212 77 -65 240
4085 240 285 -138 82 26 166 -57 457 3 -29 -284 353 -74 173 190 -38 -222 -163 389 -84 -390 -102 -339
4107 -339 -664 204 76 168 80 117 -123 -36 427 400 -219 -214 237 192 -24 91 300 -195 -119 264 -56 -69 185
4130 185 47 -222 -156 256 260 12 432 271 -257 28 319 2 121 263 201 -497 -219 298 -129 -184 208 -89
4152 -89 -452 -175 515 128 349 542 56 -185 186 384 245 -22 51 118 -217 -102 532 -267 -220 56 -92
4173 -92 -222 265 621 -206 -130 128 -168 -122 355 388 -63 -391 75 -424 -166 345 348 -22 -270 -223 -59 -55 418
4196 418 336 -160 -152 -17 364 205 393 395 -49 -454 254 205 244 391 -16 -407 -476 160 -37 289 22 -19 -603
4219 -603 -120 -78 234 32 449 189 -433 202 197 415 -11 5 35 -212 -187 112 159 107 124 72 -434 -120 233
$$ packed form
4062a00J5M11O1m20K9J5k83K33M22O8m42M1L38m63j69M25R4k31p3K41j35j42L05
4085B40M5m23K20n6J40k23N14m54l2k55O37m27K47J7k28j84N9N52m73l06K88k37
4107c39l25Q68j28R2q8L7k40Q7M63k7o19NM51m5k16J15K09m95P6L83l20j3K54
4130A85j38k69O6M12Mk48M20j61n28K85K91l17J19J42o2o98K78N17m27n5L92k97
4152h9l63K77O90l87K21J93m86k41L71J98j39k67P3O7l35J15O34p99M7K76j48
4173i2j30M87L56q27P6K58k96M6M77L3m51l28M66m99K58N11Ll70k48M7J64MM73
4196D18q2m96QJ35L81j59J88Km44m05P08m9L9J47m07l91o9O36j97L26k67m1n84
4219f03M83M2L12k02M17k60o22O35nK18m26J6L0k47K5K99M7n2J7n2n06L14L53
$$ plain form
4242 233 113 311 -78 210 -128 198 177 111 107 677 77 -305 -43 496 267 -59 111 45 -299 198 187 355
4264 355 184 85 -21 -80 355 314 440 195 -102 263 -48 255 309 224 139 152 -427 132 238 154 -69 -95 -304
4287 -304 -486 138 347 586 261 105 -144 -61 -114 492 281 84 -203 -245 -114 -194 172 259 9 -547 -347 -201
4309 -201 -179 265 210 -34 -322 -202 32 446 539 363 40 -110 -320 149 468 275 185 -192 -516 151 379
4330 379 316 285 -115 -143 -263 198 108 485 266 44 -400 -6 70 375 563 204 -183 -238 -15 6 430 -62
4352 -62 -75 -499 -477 -313 189 511 250 14 -101 -45 11 651 573 250 -295 -451 -359 180 501 72 -317 -309 -93
4375 -93 -142 286 464 0 -271 -629 -58 -114 708 308 119 -186 -155 -88 288 267 478 -389 -498 -425 114 135 275
4398 275 395 -350 -399 -139 -8 207 345 35 -344 -353 -153 137 439 376 -119 -307 92 -100 273 509 183
$$ packed form
4242B33j20J98l89K88l38L26k1o6mN70o00l82K62N39k29l26J70o6l44M97j1J68
4264C55j71r9j06n9M35m1J26k45k97L65l11L03N4q5q5J3n79N59J06q4k23k6k09
4287c04j82O24K09K39l25j56k49Q3n3O06k11j97k87m2J31q0L66Q7k50n56K00J46
4309b01K2M44n5k44k88J20K34M14R3j76l23j50k10M69L19j93r0l77l24O67K28
4330C79o3l1m00k8j20M61r0L77k19k22m44L94P6L05J88l59l87n5K23K1M24m92
4352f2j3m24K2J64N02L22k61k36j15N6N6O40p8l23n45j56R2N39L21m29l89QK16
4375i3m9M28J78m64k71l58N71n6Q22m00j89l05L1O7L76k1K11q67j09P3N39K1J40
4398B75J20p45m9K60J31K15J38l10l79rK00K90L02o3m95j88L99j92L73K36l26
$$ plain form
4419 183 -125 -197 -193 213 378 221 106 106 -153 20 363 119 91 34 -157 -534 -133 445 11 22 -34 -604 -283
4442 -283 60 -122 -51 67 -96 -121 -10 146 299 64 191 -362 -243 -159 8 -84 -66 -91 272 55 174 416
4464 416 107 111 -2 86 -121 375 -117 10 -288 144 365 -83 62 525 11 156 173 380 -75 -155 -88 21
4486 21 27 212 240 34 250 56 242 195 188 177 191 101 209 205 -173 40 97 -225 -14 193 -93 -173 113 501 -175
4511 -175 -261 438 575 91 229 302 -129 -115 257 385 79 2 -192 -470 -167 334 316 -267 147 57 -286 59
4533 59 236 146 272 306 -1 -246 -7 573 348 -22 183 -92 -209 72 231 -121 -170 59 -70 -160 -74 213
4555 213 9 -325 -103 -55 -279 33 468 -145 -118 -96 259 -240 -91 353 5 153 -44 308 -53 357 467
4576 467 -304 -439 240 102 210 371 320 -156 -144 27 51 -44 44 303 -206 -190 365 -27 143 78 399 -394
$$ packed form
4419A83l08p2MM06J65j57j15%k59J73L43k44k8n7j91l77M01N78m34J1n6n70L21
4442b83L43j82P1J18j63k5J11J56J53k35J27n53J19Q4J67r2J8k5L63k17J19K42
4464D16l09Mj13Q8k07M96m92J27k98M32K21m48J45M63n14J45J7K07m55q0O7J09
4486B1OJ85K8k06K16j94J86m7pj1J4r0J08ml78K13N7l22K11K07k86q0K86L88o76
4511a75q6O99J37m84J38P3m31J4L72J28l06p7j94k78L03N01j8n83M14r0l43L45
4533E9J77r0J26L4l07k45K39N80k25l70K05k75j17K81J59l52m9K29j29r0Q6K87
4555B13k04l34K22M8k24L12M35o13K7K2L55m99J49M44l48J48j97L52l61M10J10
4576D67p71j35O79j38J08J61n1m76J2J71K4r5Q8K59n09J6N55l92J70o5L21p93
$$ plain form
4598 -394 -202 118 212 -117 116 104 -174 -226 213 -73 27 378 175 -150 -2 319 306 -288 404 202 -723
4619 -723 -163 242 383 123 363 64 -559 -58 321 125 503 162 -70 -812 149 600 497 152 182 -292
4639 -292 -359 -148 463 150 -273 58 -415 -513 232 599 706 -98 -106 -287 -235 527 670 -59 -170 -59 -518 -123
4661 -123 212 641 164 -171 -4 -356 -79 503 764 -9 -389 -36 -367 -109 451 707 -407 -236 -259 -52
4681 -52 207 484 189 -464 -463 -223 -236 324 636 321 -218 -353 277 186 612 587 259 -448 -404 -4 419 394 615
4704 615 -320 -601 -669 39 371 415 251 -170 -872 -441 481 633 818 390 -212 -502 -212 593 645 198 -52
4725 -52 -548 -768 -123 555 487 7 -119 -799 -473 191 670 661 -101 -190 -479 -104 275 764 447 -339 -342 -242
4747 -242 -211 416 596 230 -488 -596 -292 113 569 512 -445 -219 -187 -105 187 516 792 -318 -463 112 197
$$ packed form
4598c94J92L20R4l29K33j2k78n2M39k86J00L51k03l25J48L21j3n94O92k02r25
4619g23N60M05J41k60K40k99o23N01L79j96L78l41k32p42R61M51j03l45L0m74
4639b92o7K11O11l13m23L31m73r8P45L67J07q04qj81N2P62J43p29j11J11m59L95
4661a23L35M29m77l35J67l52K77N82K61p73l80L53l31K58N60K56j114J71k3K07
4681e2K59K77k95o53JK40j3N60L12l15n39j35O30r1M26k5l28p07M4M00M23k5K21
4704F15r35k81o8P08L32M4j64m21p02M31R22J52J85m28o02k90K90Q05N2m47k50
4725e2m96k20O45O78o8m80j26o80L26O64M79rp62q9k89L75L79M89l17p86lJ00
4747b42L1O27J80l66p18j08L04M05M56n7r57K26L2Q2K92L29K76j110j45N75Q5
$$ plain form
4768 197 308 696 -7 -190 -490 -270 105 292 455 115 -425 -310 -4 248 325 147 -147 -405 -120 386
4788 386 586 163 128 -293 -340 -61 390 371 232 61 -461 -246 245 294 332 295 -135 -98 -195 -43 435 241 55
4811 55 156 -281 -92 590 -35 135 -72 -343 -240 -190 23 192 137 -297 -186 -120 114 424 322 225 -29 -171
4833 -171 24 17 -219 433 -255 -105 -55 108 -174 18 54 -94 -221 -5 275 128 125 27 -387 75 178 431
4855 431 320 -110 75 -65 4 467 173 -303 -78 -14 200 96 -5 -39 -239 -234 171 100 307 207 259 -233
4877 -233 -289 207 202 375 267 -42 -387 17 47 29 272 -119 -129 -462 -140 89 192 178 -104 -141 -204 398 313
4900 313 403 158 -52 -253 -268 412 359 193 -174 -431 -334 -3 468 198 381 -139 -62 -7 113 302 515 179
4922 179 -52 -164 -353 324 182 107 -34 -271 -301 -64 -34 225 95 -263 -280 -115 395 632 442 6 -246
$$ packed form
4768A97J11L88p03j83l00K20L75J87J63l40n40J15L06K52P7j78k94k58K85N06
4788C86K00m23l5m21m7K79M51j9j39j71n22K15M91M9L8l7m30L7r7J52M78j94j86
4811E5J01m37J89O82o25J70k07k71J03N0K13J69n5m34J11O6K34L10j02r7k54j42
4833a71J95pk36O52o88J50N0J63k82J92L6j48j27K16K80j47lr8m14M62J03K53
4855D31j11m30J85j40O9M63k94m76K25O4K14j04j01l4k00NM05p1K07j00N2m92
4877b33n6M96nJ73j08l09l45M04L0j8K43l91j0l33L22K29J03j4k82l7o3O02q5
4900C13R0k45k10k01j5O80n3j66l67k57R7L31M71k70J83n20P7N5J20J89K13l36
4922A79k31j12j89O77j42p5j41k37l0K37L0K59j30l58j7J65N10K37j90m36k52
$$ plain form
4943 -246 -556 45 7 374 437 71 -241 -171 211 338 508 158 -193 -232 -101 0 616 86 179 -308 -518 -309
4965 -309 277 583 452 202 -80 -429 -127 214 313 272 -186 -425 -184 -66 103 315 293 -440 -351 -60 191
4986 191 633 275 86 -200 -498 -212 329 485 298 223 -247 -662 -250 503 464 366 71 -240 -383 69 583
5007 583 481 142 -102 -392 -265 433 682 409 14 -183 -523 -277 215 542 168 -153 -62 -383 132 592
5027 592 583 144 -433 -565 -352 -183 417 766 -106 -315 -298 -329 -12 539 538 -222 -483 -6 82 599 827 618
5049 618 -118 -105 -86 134 533 634 505 -568 -554 193 276 379 335 -171 -792 -607 118 339 237 101 -345
5070 -345 -748 -291 126 383 374 446 -35 -351 -383 551 537 415 -10 -309 -762 -238 538 545 164 -114 -200 -532 229
5093 229 579 230 10 -12 -38 -252 592 567 250 19 -326 -83 -67 623 623 -22 -381 -166 -227 -142 647 810 -37
$$ packed form
4943b46l10O01l8L67O3l66l12P0L82J27J70l50l51l9J31J01O16n30R3m87k10K09
4965c09N86L06j31k50k82l49L02L41R9m1m58k39K41J18J69K12k2p33Q9K91K51
4986A91M42l58j89k86k98K86N41J56j87p5m70m15M12P53l9r8k95l11j43M52N14
5007E83j02l39k44k90J27O98K49k73l95j97l40K46M92L27l74l21R1l21N15M60
5027E92rm39n77j32K13J69O00L49q72k09J7l1L17N51jp60k61M77Q8N17K28k09
5049F18p36J3J9K20L99J01j29j073J4P47Q3J03m4n06o21J85P25K21j02j36m46
5070c45m03M57M17K57rP2m81l16l2R34j4j22m25k99m53N24P76Pl81k78q6l32P61
5093B29L50l49k20k2k6k14Q44k5l17k31l45K43J6O90%o45l59K15o1Q5P89J63q47
$$ plain form
5116 -37 -493 -14 -87 -23 533 654 -9 -202 -63 38 107 526 451 -423 -414 170 292 117 546 354 -246 -214 109
5139 109 189 329 404 -13 -691 -100 639 373 112 45 94 -414 -181 340 291 -153 -5 -421 -486 -183 350 310
5161 310 -222 204 -232 -429 190 516 150 -79 -266 120 -249 393 530 136 -279 -61 -61 37 370 64 -62
5182 -62 -242 218 221 99 18 135 -325 -63 651 337 113 123 204 -165 180 271 150 133 -60 47 -144 -250 734
5205 734 196 -26 -155 110 -50 152 533 505 -135 85 -174 -75 382 474 153 -164 -230 -14 303 264 255 209 -245
5228 -245 -117 166 524 179 300 -77 -224 21 337 25 401 71 -393 -192 -120 498 469 241 -37 -483 -626
5249 -626 -7 187 127 107 -82 -374 162 133 692 548 48 -157 -249 203 446 606 147 -93 -57 -570 6 379
$$ packed form
5116c7m56M79p3O4N56J21o63j93J39J01O9M19p5q74RN84J22j75M29j92o00L2L23
5139A09Q0J40P5m17o78N91P39k66k61o7M9n08K33N21m9m44J48m16o5L03N33m0
5161C10n32M26m36j97O19L26l66k29j87L86l69O42J37l94m15K18%R8L33l06j26
5182f2j80M60Lj22q1J17m60K62P14l14k24J0Q1l69L45R1j21j7j93J07j91j06R84
5205G34n38k22j29K65j60K02L81k8o40K20k59R9M57R2l21l17o6K16L17l9rm6m54
5228b45J28K83L58l45J21l77j47K45L16l12L76l30m64K01P2O18k9k28k78m46j43
5249f26O19J94o0k0j89k92N36k9N59j44n00k05r2M52K43J60m59k40L6n13N76L73
$$ [...]
8191B59
##END NTUPLES=NMR FID
##END=
