##TITLE=1H_LR-760-1-C2
 CCl4
 8 sc, 
 20.1.2023
##JCAMPDX= 6.0         $$ Bruker NMR JCAMP-DX V2.0
##DATA TYPE= NMR FID
##DATA CLASS= NTUPLES
##ORIGIN= UXNMR, Bruker Analytische Messtechnik GmbH
##OWNER= root
$$ XWIN-NMR		Version 3.5
$$ Fri Jan 20 15:33:43 2023 Russian Standard Time (UT+4h)  she@DPX200
##.OBSERVE FREQUENCY= 200.13135
##.OBSERVE NUCLEUS= ^1H
##.DELAY= (6, 6)
##.ACQUISITION MODE= SIMULTANEOUS
##.ACQUISITION SCHEME= undefined
##.AVERAGES= 8
##.DIGITISER RES= 18
##SPECTROMETER/DATA SYSTEM= spect
##.PULSE SEQUENCE= zg30
##.SOLVENT NAME= D2O
##.SHIFT REFERENCE= (INTERNAL, D2O, 0, 15.7039)
##AUDIT TRAIL= $$ (NUMBER, WHEN, WHO, WHERE, WHAT)
$$ ##TITLE= Audit trail, XWIN-NMR		Version 3.5
$$ ##JCAMPDX= 5.01
$$ ##ORIGIN= Bruker BioSpin GmbH
$$ ##OWNER= she
$$ F:/spectra/data/she/nmr/H-F/1/audita.txt
$$ ##AUDIT TRAIL=  $$ (NUMBER, WHEN, WHO, WHERE, WHAT)
(   1,<2023-01-20 15:32:28.37 +0400>,<she>,<DPX200>,
      <created by zg, POWCHK disabled, PULCHK disabled
       configuration hash MD5:
       00 E9 B6 7A A2 85 ED C7 34 08 36 98 17 FE 4E 26
       data hash MD5: 16K
       72 46 F5 2A CF 82 06 CD 53 2B 47 F3 FD D2 FF 36>)
$$ ##END=
$$ 
$$ hash MD5
$$ 93 84 73 BD 7E CB C7 FC E9 D4 E7 06 50 DE A0 71
##$RELAX= 
##$RELAX= 
##$RELAX= 
##$RELAX= 
##$RELAX= 
##$RELAX= 
$$ Bruker specific parameters
$$ --------------------------
##$DU= <F:/spectra>
##$EXPNO= 1
##$NAME= <H-F>
##$PROCNO= 1
##$TYPE= <nmr>
##$USER= <she>
##$AMP= (0..31)
100 100 100 100 100 100 100 100 100 100 100 100 100 100 100 100 100 100 
100 100 100 100 100 100 100 100 100 100 100 100 100 100 
##$AQSEQ= 0
##$AQ_mod= 1
##$AUNM= <au_zg>
##$AUTOPOS= <>
##$BF1= 200.13
##$BF2= 200.13
##$BF3= 200.13
##$BF4= 200.13
##$BF5= 200.13
##$BF6= 200.13
##$BF7= 200.13
##$BF8= 200.13
##$BYTORDA= 1
##$CFDGTYP= 0
##$CFRGTYP= 5
##$CHEMSTR= <none>
##$CNST= (0..31)
1 1 145 1 1 1 1 1 1 1 1 1 1 1 1 1 1 1 1 1 1 1 1 1 1 1 1 1 1 1 1 1 
##$CPDPRG= <>
##$CPDPRG1= <>
##$CPDPRG2= <>
##$CPDPRG3= <>
##$CPDPRG4= <mlev>
##$CPDPRG5= <mlev>
##$CPDPRG6= <mlev>
##$CPDPRG7= <mlev>
##$CPDPRG8= <mlev>
##$CPDPRGB= <>
##$CPDPRGT= <>
##$D= (0..31)
0 1.2 0 0 0 0 0 0 0 0.06 0 0.03 0 0 0 0 0.0002 0 0 0 0 0 0 0 0 0 0 0 0 
0 0 0 
##$DATE= 1674214347
##$DBL= (0..7)
120 120 120 120 120 120 120 120 
##$DBP= (0..7)
150 150 150 150 150 150 150 150 
##$DBP07= 0
##$DBPNAM0= <>
##$DBPNAM1= <>
##$DBPNAM2= <>
##$DBPNAM3= <>
##$DBPNAM4= <>
##$DBPNAM5= <>
##$DBPNAM6= <>
##$DBPNAM7= <>
##$DBPOAL= (0..7)
0.5 0.5 0.5 0.5 0.5 0.5 0.5 0.5 
##$DBPOFFS= (0..7)
0 0 0 0 0 0 0 0 
##$DE= 6
##$DECBNUC= <off>
##$DECIM= 32
##$DECNUC= <off>
##$DECSTAT= 4
##$DIGMOD= 1
##$DIGTYP= 9
##$DL= (0..7)
0 120 120 120 120 120 120 120 
##$DP= (0..7)
150 150 150 150 150 150 150 150 
##$DP07= 0
##$DPNAME0= <>
##$DPNAME1= <>
##$DPNAME2= <>
##$DPNAME3= <>
##$DPNAME4= <>
##$DPNAME5= <>
##$DPNAME6= <>
##$DPNAME7= <>
##$DPOAL= (0..7)
0.5 0.5 0.5 0.5 0.5 0.5 0.5 0.5 
##$DPOFFS= (0..7)
0 0 0 0 0 0 0 0 
##$DQDMODE= 0
##$DR= 18
##$DS= 0
##$DSLIST= <SSSSSSSSSSSSSSS>
$$ [...]
##$SUBNAM2= <"">
##$SUBNAM3= <"">
##$SUBNAM4= <"">
##$SUBNAM5= <"">
##$SUBNAM6= <"">
##$SUBNAM7= <"">
##$SUBNAM8= <"">
##$SUBNAM9= <"">
##$SW= 18.05172834244
##$SWIBOX= (0..15)
0 0 2 0 0 0 0 0 0 0 0 0 0 0 0 0 
##$SW_h= 3612.71676300578
##$TD= 16384
##$TD0= 1
##$TE= 0
##$TE2= 300
##$TE3= 300
##$TEG= 300
##$TL= (0..7)
0 120 120 120 120 120 120 120 
##$TP= (0..7)
150 150 150 150 150 150 150 150 
##$TP07= 0
##$TPNAME0= <>
##$TPNAME1= <>
##$TPNAME2= <>
##$TPNAME3= <>
##$TPNAME4= <>
##$TPNAME5= <>
##$TPNAME6= <>
##$TPNAME7= <>
##$TPOAL= (0..7)
0.5 0.5 0.5 0.5 0.5 0.5 0.5 0.5 
##$TPOFFS= (0..7)
0 0 0 0 0 0 0 0 
##$TUNHIN= 0
##$TUNHOUT= 0
##$TUNXOUT= 0
##$USERA1= <user>
##$USERA2= <user>
##$USERA3= <user>
##$USERA4= <user>
##$USERA5= <user>
##$V9= 5
##$VALIST= <valist>
##$VCLIST= <CCCCCCCCCCCCCCC>
##$VD= 0
##$VDLIST= <DDDDDDDDDDDDDDD>
##$VPLIST= <PPPPPPPPPPPPPPP>
##$VTLIST= <TTTTTTTTTTTTTTT>
##$WBST= 1024
##$WBSW= 4
##$XGAIN= (0..3)
0 0 0 0 
##$XL= 0
##$YL= 0
##$YMAX_a= 211211
##$YMIN_a= -271939
##$ZGOPTNS= <>
##$ZL1= 120
##$ZL2= 120
##$ZL3= 120
##$ZL4= 120
##$ABSF1= 10
##$ABSF2= 0
##$ABSG= 5
##$ABSL= 3
##$ALPHA= 0
##$AQORDER= 0
##$ASSFAC= 0
##$ASSFACI= 0
##$ASSFACX= 0
##$ASSWID= 0
##$AUNMP= <proc_1d>
##$AZFE= 0.1
##$AZFW= 0.1
##$BCFW= 1
##$BC_mod= 2
##$BYTORDP= 1
##$COROFFS= 0
##$CY= 11.3945322036743
##$DATMOD= 1
##$DC= 2
##$DFILT= <>
##$DTYPP= 0
##$F1P= 2.36226072786647
##$F2P= -0.459571619588291
##$FCOR= 0.5
##$FTSIZE= 0
##$FT_mod= 4
##$GAMMA= 1
##$GB= 0.15
##$INTBC= 1
##$INTSCL= 1
##$ISEN= 128
##$LB= 0.24
##$LEV0= 0
##$LPBIN= 0
##$MAXI= 10000
##$MC2= 0
##$MEAN= 0
##$ME_mod= 0
##$MI= 1.114404
##$NCOEF= 0
##$NC_proc= 0
##$NLEV= 6
##$NOISF1= 3.799351
##$NOISF2= 2.8
##$NSP= 1
##$NTH_PI= 0
##$NZP= 0
##$OFFSET= 15.70392
##$PC= 1
##$PHC0= -19110.47
##$PHC1= 9.20079
##$PH_mod= 1
##$PKNL= yes
##$PPARMOD= 0
##$PSCAL= 0
##$PSIGN= 0
##$REVERSE= no
##$SF= 200.130013532006
##$SI= 16384
##$SIGF1= 3
##$SIGF2= 2
##$SINO= 400
##$SIOLD= 16384
##$SREGLST= <1H.CDCl3>
##$SSB= 0
##$STSI= 0
##$STSR= 0
##$SW_p= 3612.71676300578
##$SYMM= 0
##$S_DEV= 0
##$TDeff= 0
##$TDoff= 0
##$TI= <>
##$TILT= no
##$TM1= 0
##$TM2= 0
##$TOPLEV= 0
##$USERP1= <user>
##$USERP2= <user>
##$USERP3= <user>
##$USERP4= <user>
##$USERP5= <user>
##$WDW= 1
##$XDIM= 8192
##$YMAX_p= 0
##$YMIN_p= 0
$$ End of Bruker specific parameters
$$ ---------------------------------
##NTUPLES= NMR FID
##VAR_NAME=  TIME,          FID/REAL,        FID/IMAG
##SYMBOL=    X,             R,               I
##VAR_TYPE=  INDEPENDENT,   DEPENDENT,       DEPENDENT
##VAR_FORM=  AFFN,          ASDF,            ASDF
##VAR_DIM=   8192,          8192,            8192
##UNITS=     SECONDS,       ARBITRARY UNITS, ARBITRARY UNITS
##FACTOR=    0.0002768,     1,               1
##FIRST=     0,             0,               0
##LAST=      2.2672688,     0,               0
##MIN=       0,             -271939,         0
##MAX=       2.2672688,     211211,          0
$$ Real data points
##PAGE= N=1
##DATA TABLE= (X++(R..R)), XYDATA
$$ [...]
1787A3R5l10K41R5K9l6l35K01l64N06l39J66J61k78k5M60l97L13k85jl18L02J18
1810A2k33m1J64K57p8J74j85m0P6q3j05K47k73K27l87L11J42J27L6k01k12M4r0
1833a11J1J44J26k80K16q5j75L48n86N06k9J4j67J5j20L15k84K51p3mJ8J61q5
1856A26q4K54m62K17j94K35k70K52k60M28l59Q1n6P1J40l24J93k03J42J94j08
1877A3j97L81k61J10n4K92m45K51n06M27j19K46k72l6K92k60K46j65J38j56L77
1898C02m45N5k59K35q6L10m0J02j7k35%R1L19j95k71j00N10m12O2P9K2j22M60
1921C65l70l5r7L80n52P9k0J41J9J79j21K22j67l6J35k15N1k08J35r9K37j51J06
1944b2n4J88k56O7R7J96k73j37K8L0J20n4L15l04J48l94M24j18P6k11O2k37K81
$$ y = [13, 108, -202, 39, 134, 163, 127, -208, -7, -371, 135, -204, -38, 123, -155, -180, 280, -117, 196, -89, -90, -408, -106, 12, -221, -262, -98, 159, 81, 255, 70, 30, 106, 23, -82, 165, -108, 119, -268, 43, 185, 312, 348, 147, -65, -21, -111, -100, 44, 170, -110, 106, 21, -154, 194, -392, 114, 85, 99, -68, -53, -173, 142, -142, 109, 36, 32, 50, 211, 126, 42, 296, -166, 51, -143, 92, -178, 74, -186, 242, -117, -36, -92, -21, 119, -205, -12, -215, -73, 121, 13, -184, 197, -64, 46, -8, 284, -161, 90, -416, 11, -108, 138, -134, -170, 122, -138, 108, -57, 81, -75, 302, -143, -88, -347, -112, -198, 112, 72, 174, 157, -78, -78, 13, 332, 137, -134, -234, 276, -136, -74, 5, 27, -95, 365, -5, -40, -137, 243, -309, -230, -250, -109, -90, 89, -32, 190, 23, -13, 122, -93, -42, -250, -115, -214, 23, -128, -22, -76, 112, -144, -77, 20, 216, -57, -194, -166, -136, -16, -70, 245, -59, 89, -305, 119, 1, 77, -134, -72, -309, -28]
1967b8q8J07QK0J70j76K3Jl9K5M4l35K40k5J23j39R5p7J01Q7l6j07n8L07k06l1
1993Fk52K81L35k5m71J92j52J06j47K41m07M71j21j98L69k74l7j01L48j55J45
2014A54k73ok82L77j53L94n77L67l0K00j34J08J60l42j62K3J51k13N10n26M42
2035A88k65K35k29J74j74K09j87L94m31Oo1K68j82J57p1r9J49o1L06m20K57m38
2057b75J29k0L72m20J37J40j09K5l52M00l6m8J04q2Q8J28l32L94m4j62P9K02j24
2080A94j84j8J28j63q3K48J7k1m03N48l73K78k96J07j34K00l04Q7J64k30K90j8
2102C4rNN0J2k94K56l12R0J49j35L34j98L68m81J80Kk5l16K16j73L81l19R2K72
2126A79o9P4j09O2j29J74m10M20o56O02j52m03K00M64m45K48m8J38j92M4L65m53
$$ y = [-28, -116, -9, -1, 19, 189, 13, 36, 37, -2, 23, 67, -268, -28, -53, 70, -69, 26, -51, 50, 137, 101, -6, -64, 243, 37, 6, -246, 35, 370, 345, -126, 66, -86, 20, -127, 114, -293, 178, 57, -141, 228, -46, -83, -184, 164, 9, 154, -119, -125, -407, -30, -183, 211, -366, 1, -29, 171, 37, 145, 305, -37, -199, -176, -25, -238, 272, -254, 188, -77, 158, -71, 103, -71, 138, -49, 345, -86, -80, -141, 127, -55, 102, 31, -68, 81, 20, 326, -94, 163, -275, -146, -166, 206, -214, -77, 63, -46, -21, -373, 27, -9, -57, 47, -35, 53, 181, -151, 243, 199, 37, 116, 318, 194, 10, -8, 120, -43, -126, 122, 139, 118, -285, 263, -110, 168, -128, -21, -155, 45, -259, -172, -8, -238, 52, 34, 25, 30, 80, 92, -202, 54, -258, -168, -19, -154, 180, -18, 350, -131, 49, 51, 26, -290, -74, -247, 134, -185, -93, 179, 110, 184, 75, 137, 8, 182, -228, 192, -464, 138, -14, -417, -217, 247, -198, 50, 2, 140, -52, -8, 357, -96]
2148i6k29K58J46k15L50k67J98j30LJ83j30p3k13K38j14J01k7j00J88J01l61J41
2170d8k72J86J06O3j16J67k93J36J56k9K86l25nk7J41k39K52m73M45j73K52l41
2192a51M55k90J48k69L53m11pR6J75P7l60J17k16L11j02K32j49m9J10J97k76j48
2214a57J09Q8j54L60j01l26K96L1ok01j01oL34n26L92K0O4l48K06J67j70q6J37
2237B2j55K00o7k05j2N1K12L8m5k10M90n41M91m86J46J50k39J6K16n6J89l50R
2260a36J44j13J35k43M19j99p6K19J71n12K52j05L41j75l26J35K30k02J0K23k54
2281f2L28j58j25o5J85m08L42j47J06j56p1P6K86j98N9O3j27L7K37k85j82L61
2303I6j55J38j4Q2K5r4j94J90mj70O1L7l9N7k09R7K23l6k42K84J53l62L48k71
$$ y = [-96, -325, -67, 79, -136, 214, -53, 145, 15, 18, 201, 71, -2, -215, 23, -91, 10, -17, -117, 71, 172, -189, -48, -320, -134, -28, 35, -81, 86, -207, -71, 85, 56, 342, 17, 12, -15, 126, -113, 139, -334, 111, -62, 190, -151, 304, 14, 162, -107, 246, -165, -172, -76, 99, 176, -184, -67, -283, 28, -74, 158, 9, -40, 70, 267, -9, -157, -48, 40, -114, 246, 145, -181, 115, 146, 140, -61, -162, -168, 166, -360, 32, 52, 116, -232, -26, 141, -29, -115, 22, -133, 67, 0, -205, -217, -166, 46, 84, 39, -171, 319, -222, 269, -217, -71, 79, -160, -144, 72, 16, 205, -145, -136, 8, -105, 30, -213, 206, 7, -69, 150, 321, -191, 61, -44, 297, 122, -204, -69, 161, -41, -31, 192, -62, 266, 108, -17, -82, 103, -305, 37, -110, -4, -160, -231, -155, 131, -67, -8, 55, -72, -35, 202, -83, -265, 96, -59, 79, 65, 147, 172, 78, -116, 74, 70, -100, -39, -2, -41, 16, -193, -96, 127, 91, -151, 133, 286, -76, 272, 1]
2327AP6m23O53l94k35J75K32j63R9J15j11Q1k22J23J18K08m30q0J48N8K52J8k57
2350D2O9m6J61l52J24J47j36J38m7k46L89k73J47l32k1L56k45L48k46j05N45l71
2372D6l25J53n0L54k41J15ol09N04k51J21m04J91m8O21p29N16j95Pqk98J53J41
2395E8n5r9L55j48R3J9k03j46o2%K21k09qP9J35p1N6K07J27n02O3p5r7M74j56
2420E6K10k93m9J78j82l9P2R9J61k72K07m1p1J16j69k4N5K9M3M6j92J45l22J87
2444e0L2Q3j87J32k6K14j09j54k6L69m82K4J90j49L58m10J78j56j6M62J3l90K30
2467A30k26K43j47L92n27J16q9K69l77j28M09j00K45p8j08j20L64l66K65k29J42
2488H0k62J75J37k55J02pP3p9J18k56K18k34K49k4k25J08R2J9L9l02L3J82j67
$$ y = [1, 77, -346, 307, -87, -322, -147, 85, -78, 21, 136, 25, 106, -116, 7, 125, 333, -97, -177, -29, 29, 281, 299, 42, 111, 65, 226, -126, -2, 145, 9, 147, 100, -146, 243, -30, 117, -215, -236, 120, -125, 223, -23, -128, 417, 46, -279, -126, -176, 178, -63, 52, 46, -263, 241, -10, 111, -293, -102, -150, 471, -258, 258, 63, 70, 62, -236, -83, 58, 3, -96, 259, 111, 204, 223, 20, -126, -188, -188, 33, -176, -184, -105, 30, -41, 15, 222, 349, -153, -90, -165, -262, 212, 56, 266, -27, -76, 102, -80, -119, -47, 52, 213, -59, 148, 107, 36, 152, -17, -41, 14, 43, 86, 132, -60, 85, -237, -50, -18, 65, -122, 10, -16, 198, 89, -65, -91, 278, -204, -180, 10, -139, 219, -191, -13, -169, -185, 277, 290, -100, 130, -96, 147, 0, 392, -135, -19, -108, 161, -216, -344, 65, -35, 210, 132, 24, -96, 268, -98, 167, -62, 80, -182, -7, 130, -125, -23, -30, 43, -36, 82, -174, 44, -190, 59, 35, -190, -82, 10, 29, 68, -234, -201, -19, -186]
2511a86K89mj0k02J19J71l3k84K47o6j11j65N4J77Q1j99N7L6K17k24J31R0k45
2534f0P5k49J56p8K92k82J77n9L19k96l3R4j25J75q7m0k2m0J53o7q1J43l50N57
2558B72j56J9j77J18l31J47R5K14j57o7k5K19l50L88l53R2J28k28MJ49N2j5M1
2581G9k58r1K43Lq4O06o21J3N7J2N2p8O5%pJ01l9J6K9r7J27j71lR7L3j60K33j40
2609A7Nn0O9m4o1L99k64r0j90J39j0K19k60J57J02r9j20j03o3K84k70K04K89m43
2633a83M79j70j49l6K84j37l45J38M39l20P1j97K87J02q4k93K8N9Q3j19K18j4
2655A41j15Lj92K78J5j94n9J13j2%o0P9M8j96J77k1k4J81l15n2L20k34R5J27k67
2680a64J65M9O2J02l42NK0K25J69l83J55l38M73k19Q5j37r1J00J22k44M00k8m8
$$ y = [-186, 103, 99, 89, -113, 6, 177, 144, -140, 107, 41, -70, -235, -181, -4, 77, -122, -65, -29, 188, -36, 95, 185, -60, 15, -234, -78, -156, 136, -146, 31, -28, 291, -5, -38, 56, -69, 106, 19, -21, -43, -83, 70, 3, -78, 65, -285, 272, 116, 135, -42, 76, -255, -108, -13, 201, 44, -23, -48, 171, -179, 209, -144, -52, 76, -152, -148, 1, 53, 38, 79, -179, -270, -27, -24, -108, 498, -123, -110, -53, -41, 11, -67, -2, -2, -9, 92, 53, 69, 98, 1, 128, -43, -46, 51, 84, -76, 157, 17, 22, -28, 41, -3, -64, 335, 71, -19, -209, -70, -80, 139, -121, 36, 138, 39, -81, -184, -247, 37, -233, -29, 260, -183, 296, 126, -23, -59, 225, 88, -257, -119, 320, 0, 71, -126, 161, 263, 179, -114, -86, -27, 56, -63, 155, 141, 26, 29, -163, 115, 130, -64, -123, -10, -22, -22, -82, -3, 45, -151, 26, 5, -19, 162, -153, -205, 115, -119, -24, 103, -164, 1, 50, 112, 214, -128, -123, -103, 122, 291, -92, 63, -275, 198, -21, 64, -73, -164, -64, 58, -186, 214, 186, 138]
2703A38o6k68K62P5k14K74k89N0R8K00k09j56P9m2j37K58J00l10J43L0j46N1M4
2726c5K31K0m74L85J58k67j21J14j85J85K17k82J02m0ORj22M4N8l20K26N67m22
2749E4n3K2k02J41J79r8J25j34k36J03L13j96o5j57kK70j50J89k40j08J60L9k01
2772b47K75l14P32l08N5p8j11M13n53q5K95j61j48K04J26j14J54j00N8J13l82
2793a76K74M7l4J1j52j74N67n09K9K35l30Q7J76nm8Oj86L49m09J04J52N3O7J32
2817B66j66j03J15K07l67j37N34k35N1j50J64k14K48l99K2L90m51J52K8k34L86
2838A07n7K15l60L55l64QL8J04o3J04J42n08L68k49J63L5J59m8p9k4l1j77K93
2861A31j51J62j10Q4j52L1j90L23J78j62k39p7K72J99o09L11J46k21K55j33k25
$$ y = [138, 72, -196, 66, 141, -73, 201, -88, -38, 60, 260, 51, -105, -26, -68, -205, 53, 153, -157, -14, 16, -130, -79, -35, 196, 216, -258, 127, 285, 18, -103, 11, -174, 11, 228, -54, 48, 8, 14, 23, -99, -55, 3, -317, -91, 476, 54, 1, 23, -179, -38, 141, 43, 168, 34, -202, -99, 214, 18, -47, -204, -206, 64, -86, 103, -137, -245, -85, -46, -247, 28, -286, 446, 138, 193, 115, 4, 417, -136, -221, 74, -87, -235, -31, 95, -19, 135, 35, 93, 206, -176, 98, 145, 111, 122, -30, -204, 363, -146, -117, 118, -212, -125, 51, 46, -2, 4, -182, 167, -242, -138, 14, 67, 134, 266, 100, -3, 112, 319, -48, -185, 349, 114, 165, 15, 179, -35, 213, -186, -164, 226, -225, -73, -45, -279, 107, 50, 265, -95, 260, -104, -96, -58, 46, -17, 87, 229, -279, 89, -160, 3, 38, 197, 149, 70, 46, 15, -162, 131, -20, 142, 32, 116, -36, -5, -195, 128, 306, 144, -95, -172, 100, 299, -310, 1, 147, -74, 181, 48, -177]
2882a77K19l23M68j95O6j77K53j54P3l8n6R0j01J21j69J01j30M2P9p4k17L34l23
2905b88J18J52J22j14l3j51L60J48m11M7k6k1L78j10j30KQ5m5j78P7r0J1Oj30
2929b21J3N46n74K29j41J21k56K59K23l87J37J51L8q8q8l7J0J15k9M0kj19M3j61
2953a78K61J50j83l08L03M7q8J37J5j78j41L8J89M8o6O3k05J30j7l5%J3n6J55
2977I4j53J05j60K40j14k4j57K69J60l03O8j32L37j81Q2l3j53O0R2plm27L34K80
3001B74k67o4k9l0j18m1L21p2N4q8k00L06j56J54M7l45J78m6K51m0k85N34k58
3024H0L1j2k26l8K81j01j38N6n3L02j88k73K60k4K63j04l46L63n0j58J04j93J93
3047B9Q2q7kQ1r3m8p4J48j66j10l2K18Oo2L59k56J00l4j09k26K89r6J24l32M56
$$ y = [-177, 42, -281, 187, -8, 58, -119, 134, -20, 53, 15, -41, 49, -52, 69, -100, 1, -129, -87, -8, -82, -299, 35, -288, -170, -18, 104, -10, -43, -194, 166, 314, -97, -50, -76, -97, 281, 171, 41, 43, 128, 83, -95, -18, -108, -97, -91, -221, -208, 338, -236, -7, -148, -27, -283, -24, 199, -188, -51, 100, 138, 50, -38, -75, -65, 50, 21, 61, 59, -60, -17, -178, 83, 233, 50, -258, 45, 92, 4, 141, 156, -22, -163, -125, 64, 112, 46, 109, -96, 34, 17, -18, -18, -5, -61, 94, -59, 46, -114, 126, 12, -12, -169, 100, 260, -43, 25, -107, 230, 49, 131, 98, -55, 5, 97, 90, 87, -340, -6, 274, 7, -57, -86, -116, -234, -275, 46, -26, 28, -60, -260, 46, -110, 44, 91, -254, -76, -122, 129, 89, -196, 338, 80, 111, 99, -127, -165, 116, 15, -123, -67, -120, 182, -6, -279, -19, -43, 220, 116, -230, 133, 83, -75, 29, -164, 29, 111, 24, 22, 103, 10, -38, -112, 36, -130, -240, -272, -54, -48, -110, 249, -7, 93, 59, -50, -276, 13, -83, 41, -291, 165]
3072A65mj52Po8K5p7J31k07Q7J23j08l9j4K71l58O3Q7k3K49j94m4q8R4j44K28
3097A0k33R9K71r1j90J13K30m13L40j92O8J55l29P7R4J68k51J51Pk27L05l23J10
3120e1J96k61L00l23M53l55j12Q4J40Kk40K37j23L02mj49O7r2j42P6K24l93J75
3143A1p8J93J88l91K30r4j32K11j37J36k88J38qK16n7l9Q2J59m64K28j23J01k32
3166a50J72Ll9J9J00j33p8K60j85j02Q7k9M0K07K3j84J58m29J32K45MM0k86J03
3190b2RL6q4J47k76K36m0l35L80n0J33m6k84P3M08m34J88k1k71L14q6n2Lj26L99
3215A99l17N6q1j4L90j21k38k16L67n2j26J9K35O1j94J13J6j32K91j79j26j53
3237b02O9K3k4K33j24q6p5p7L65J60l93K70K0j90K63k69J84m02J72l8K03j78K38
$$ y = [165, 161, 9, 16, -52, -27, -104, 27, -180, -93, 30, -78, -117, -131, 140, -218, -155, -68, -91, 158, -36, -80, -168, -74, -218, 10, -223, -124, 147, 56, -134, -21, 209, -204, 136, -56, 12, 167, -162, -85, 9, 177, -74, 77, 84, -143, 162, -161, -51, 145, -116, 184, -139, 314, -41, -153, -69, 71, 73, -167, 70, -53, 249, 245, 96, 163, 71, -71, 5, 229, -164, 11, -67, 126, 314, -77, 153, 59, -73, 138, 1, 137, -151, -13, -21, 195, 138, 99, 181, 340, -124, 104, -19, 82, -150, 22, 25, -14, 5, 105, -28, -106, 154, -31, -133, -46, -75, -35, 172, 195, 11, 169, -260, -128, 117, 121, 161, -125, -22, -13, 23, -61, 86, -190, 46, 6, -329, 51, 1, 134, 88, -196, -123, 285, -149, 39, 18, -253, 61, -25, -77, -74, -200, 199, -118, -62, -143, -157, 233, 112, -126, -342, 25, -27, -153, -134, 101, 162, -32, 81, 97, -35, 256, 77, -49, -202, -133, -110, -134, 99, -25, -111, -186, -263, 102, 262, -131, 139, 159, -31, 232, -37, 147, -255, -83, -121, 82, -96, 142]
3260A42J32r3m53L39n7R6l5k09Kk6J06K18p7q9n9O1J63j87P9p6k38K97J16l38
3284a86M67l94j00K81j07J44J9k33K24j13K7j83k67L50R5J8m9q3J49K6N3J26m92
3307b28KK43p7m8k4J95J9l9j17l9R1N9J72K3m46J17J49p5l8O3j25J77n4p0K00
3332A30j11j33j40L95j3m7j03M7J76j23l0o6j64j1K28n8O8L2j44K20j23j04q0
3355a54Q6M6J18J70l01J11j71P2j39L93l36J18J45m0l46K69L4l09K61j83J43j66
3377a79J14L18m27M31k63k84L19j04j77J50N5j71L22j65k9J89J00k09l2J74l42
3398b10Q1K23m44M05j76n4J55j82K89m5q5mO1j46kK38j57m2J48J15j24K02l05
3421e9K1m7L30j11l08J80J5M2k96M63j86j75Q9K76k37N4k58J24k4J77J55l36j1
$$ y = [142, 274, 181, -272, 67, 10, 106, 71, -138, -136, -162, -56, 162, 85, -4, -63, -2, 161, -26, 53, -23, -261, 36, 152, -186, 281, -113, -213, 68, -39, 105, 124, -109, 115, 2, 29, -154, -421, -71, 24, 42, -7, -90, 59, 85, 138, 264, -228, -226, 17, -60, -108, -132, 63, 82, 43, -74, -113, -22, 37, 209, 232, -214, -97, 52, -23, -61, 2, -123, 54, 0, -70, 130, 19, -114, -254, 141, 128, 81, -22, 25, 201, 78, 48, -18, -182, -193, 35, -23, 45, 77, -67, 153, 30, -74, -154, -68, -22, 96, 266, -35, 76, -95, -23, -162, 231, -105, 13, 158, 118, -228, 41, 75, -234, 27, -156, -13, -179, -65, 253, -174, 257, -6, -290, 29, -75, -252, -102, -47, -218, 104, -61, -90, 99, 199, -10, -42, 132, -210, -129, 94, -350, 55, -121, -175, -20, -202, 87, 42, -43, -47, 14, -132, -134, 104, -53, -95, 53, 168, 44, 246, -59, -38, -85, 245, 134, -174, 6, 21, 63, -233, 230, 44, -131, -42, 234, -3, 51, -207, -83, -107, 70, 225, -111, -122]
3444a22L01k42L42j94j45J02j30N4j47J01J50K8L3R2j53rj14mK21j6l00K04m9
3467CJ33j96q9J8j6PK14L9k85J62q3L63k32L09m65J7Q3%j6o3Q4j63L24n6r8rJ77
3494A62j07p9o4L30j23L01n75K69N3j91J29r1J51k17K01j59PjOo2p0K94j16J44
3518A92k19J9p5J10J6j01J95L9q6n9l70K30j14M0J25Kj50K61k77J13J9M21l24
3541GK3O3J71k98Q7Pj20L15m09K93k51K92j39Rq7J35j93J21n6l0j22L24p5K7p0
3566B4K9j1k47K03j15M36j51j82j5J64n3r0J54k8j0J42k34N3j54K85k20m7J64
3589I7p9j26j85J19k9J67k81M4J58M12m40L8Q6j2P0j58J15J54k40O6j67J83QO6
3613F6o3K4K06m23P6J71j55K14J13k08J69j48q6J35L43m31k15K98j40j24L2K57
$$ y = [-122, 179, -63, 279, 85, -60, 42, -88, -34, -181, -80, 70, 98, 131, 223, 70, 61, -53, -57, 164, 148, -152, 52, 3, 136, -60, -149, -131, -147, -140, 74, 113, -172, -10, -93, 270, 38, 347, -118, -101, -18, -18, -34, -97, -13, -176, 148, 92, -6, -15, 162, 55, -24, -88, 242, 119, 420, -155, 114, 167, -24, 105, 14, 165, -52, 149, -10, -3, -4, 2, -60, -130, 164, 48, 192, -27, -8, -83, 27, 43, -58, 137, 176, 90, 31, -339, -109, -223, -183, -58, -56, -206, 55, -222, -109, -90, 331, 7, 30, 93, 264, -34, 53, 60, -60, 255, -154, 139, -112, 180, 41, 50, -37, 98, -95, 26, -30, -60, -182, 142, 67, 94, 24, 53, 42, -205, -2, -117, 319, 168, -14, -29, 135, 82, -8, 146, 118, 108, 250, 16, 69, -85, 200, -20, -67, 97, 18, -108, -293, -174, -203, -36, -317, -273, -115, 297, -143, -105, -19, -31, 39, -119, -4, 150, -90, -24, -191, -8, 0, 66, 3, 27, 233, -190, -114, 57, -98, 116, 229, 21, 190, 42, -44, 91, 434, 3, -212, 86, -54, -178, -146, 111]
3635A11j47J42K8k39j89N37j7l33J70k6q2M3Kk30J79J85k22J13J4k3r1J55J10
3658A90n9n3l4j50K15P1j47o5K47r2n3lj03J3pj6n1k47M28l60K60O8n6J10l16
3683b10L60j34K70k58J68l16K97k65J38J06j29J13Rn5j00m07M19R2p7k07K7L49
3705A90k81K8k2n0K83J74n35K91k32J45J43k42K2K45R6k28j29K5J67j44L3J03
3727H2j38J12n1k23L34j54J95k94L37j09j34K88q8j77j40L17r1n5j21OK08L6J52
3750B92k46L4K1J27l32K08nm8j87J92j84m7M28k69L1j39J28r1J84m18K07K58j93
3773d9J38Mp2p5j72J37K84n6j57J31j10kK78k05j01j17J34J10K8o8l4L1M9k14
3797a08J2J77k38J37l4j15P2J79q6j08j5o9K20j03L79l88J04r1L0q3M33l52J96
$$ y = [111, -36, 106, 134, -105, -294, 243, 226, -107, 63, 37, -45, -2, 0, -230, -51, 134, -88, 25, 39, 16, -75, 80, 190, 131, 78, 44, -106, 109, 180, 33, -32, 215, 123, 70, 67, -36, -23, -30, -46, -97, -344, 84, -276, -16, 52, -4, 106, -210, 150, 16, 286, 28, 196, -120, 177, -88, 50, 156, 27, 140, 149, 94, -6, -413, 6, 98, 21, -186, -159, 190, -91, -63, -85, -135, 148, 322, -213, 78, -154, -9, 134, -108, -86, 159, 255, 27, -102, -77, 90, -54, -21, 82, -56, 56, 5, -218, 116, -38, 157, -137, 200, 91, -43, 245, 157, -20, -160, 157, 66, 11, -110, -104, 104, 140, 292, 46, 80, 101, 228, -104, 104, 99, 51, -136, 56, -128, -175, 253, -16, 15, -124, 4, -87, 97, -321, -114, 144, -49, 89, 93, 21, -54, -226, -89, 195, 139, -18, 113, 3, 1, 279, 74, -27, -144, -10, 100, 128, 60, 26, 57, 106, -108, -96, 81, -157, -20, -54, -169, -97, 82, -4, -112, -127, -196, 24, -79, 300, -88, 16, -75, -45, -128, 305, -47, 149]
3820A49k29O8Oj73M63k74j8j79K07j17K10k70K18l6K65l96K35r7P3l0p5J91l37
3843a46J15p0K15j6j13J40j11j4m8j10R4o0J61p4j41M42l23j50j0J44n8O7P2r6
3867i0J79j25Q7K6q2j6n6K18k79J56l2k9oN1n6J59J28n0o1l46L42j63Q9k55M2
3892a69J30j53J03L5o0K70j01J86j32l30K68K2j10k27J65K06Nj9o8K28l38K07
3914A18m1j82j04J37q8L9K40m4k15K50k08J52q7Q4k61L08n2j46K58l08J10M6j4
3937hm9K79k74Q3p0m9N4q0k60L41l6K29l66K44J1Lk81K87L3J21m25Q5K66j81J29
3962H6j27J06k23K25r6J54q6nk22K6J99N0K63m69j00Q5r4K32k00K45l85L84Q2
3985A30r4k0m4M10l26k06K13L1j57j70K62K2J10k58OK84l7k07j96L50K4j33J5
$$ y = [149, -80, -12, -6, -179, 284, 10, -8, -187, 20, -97, 113, -157, 61, 25, 290, -106, 129, 32, 105, 75, 0, 191, -146, -31, -101, 114, 98, -15, 125, 14, 0, -48, -158, -64, -124, 37, -37, -178, 264, -59, -209, -219, -75, -133, -66, 6, -90, 89, -36, 51, 77, -5, -21, -77, 141, -138, 18, -14, -43, -49, 2, -54, 105, 233, 183, 122, -224, 118, -45, 44, -211, -169, -39, -192, -89, -54, -114, 156, 55, 241, 109, -221, 47, 69, -41, -268, -103, 103, 108, 89, 21, 249, -89, 118, 77, -105, -209, -72, -160, -121, 119, 75, -140, 110, -98, 54, -33, 51, -210, 98, 46, -100, 158, -150, -40, 6, -8, -57, 222, -52, 31, -39, -88, -34, -114, -374, -33, -69, 160, -206, 38, 49, 52, -229, 58, 91, 212, -213, -128, 138, -43, 86, -41, 65, -158, 67, -29, 125, 39, 34, -188, -162, 37, 87, 350, -119, -219, -134, -228, 4, -196, 49, -336, 48, 130, 36, 16, -28, 382, 56, -150, 63, 94, -63, -233, 29, 51, 161, -97, -91, 193, 156, -51, -247, 103, 127, -6, 9]
4008Ik05P7k05J18J80J67l10K50j63L1M8K01j63j70J76Jm8n8J14j61k8L36j06
4031I1p9L9K83j08j72j42j07R9R7J17Q3l60J38J82j16l3r8K14k65M26j66j34J20
4054A09j2j13k20J49J30j10J78j04J74j42r8J14J12j53m5j3j81K59J58r4k37J86
4076D7K7r2j43J78o3R5m14N91K8m18J34L0j87J29R4on6j26K37K10l44O6Q1M9j31
4101A6J41m68L27N2k67M03l50k7J81j24M0L49j74M7l27l5L92qk16M0M9j26l3O5
4125e3J66k86K02p5R8K34l48J37j18J95r4k11K12Q1j91%J21m11O49l26j82J51
4147d9j87M0L56O3l72K18Q8k60k9M3J08k66K00J23N7J1j14j64j6J35j38M71j35
4170A83L2k10O9k5m4N9J09l60K3J84j52J41lNK54k29K2j75J72M7k24K58m6k00
$$ y = [9, -196, -119, -324, -206, -26, 141, -169, 81, -82, -51, -3, 198, 35, -135, 41, 42, -6, -64, 50, -111, -139, 197, 91, 12, 51, 334, 226, 54, -88, -195, -96, 1, 118, 201, -159, -21, 161, 45, 12, -86, 128, -137, 289, 123, -11, 109, 97, -16, -236, -87, 43, -67, 111, 7, 181, 39, -59, 55, 167, 14, -31, -44, -225, 34, 192, 98, -139, 47, 74, -18, -161, 17, -46, 49, -365, 226, 254, -164, -30, 0, -187, -58, 36, 30, -26, -152, 85, 295, -49, 17, 98, 147, 16, 157, -311, 16, 68, -199, 204, -146, -173, 8, -116, -76, 273, 99, 146, -181, -216, 176, 168, -48, -8, 41, -85, -118, -53, 113, -173, 29, -46, 52, 286, -62, 75, -43, 152, 58, -153, 59, 140, -51, -51, 70, -341, 308, -18, -200, -49, -236, -196, 160, 223, -149, 69, 157, -103, -132, -89, 19, -247, -47, 76, 133, 144, 30, -134, -150, -15, -153, 318, 183, 215, 5, 74, 49, 5, 64, 173, -187, -164, 20, -132, 9, 6, 11, 265, 36, 58, -117, 55, 102, -122, 136, 90, -110]
4194a10r8J71J19m5PO0j12K9J5J20o6R5j81m3pJ74N3p7j67m0K15j92L27m47K11
4219A1n7k39L54p5K0j61K26j19K51k90k3Oj17M51j85j18J31j94J92n1l8KJ31k28
4243a20L2J7K87m44K98k89K84j90J00J96l2j94O2P5j60L91l96K92k09L1j12nK20
4266A34O5j23Q7k08j63J80p0N5K09p9pR4k41m5R7Q7p5j54J22R2j68p3K19J24l81
4291b22K70l5R8N8m05J64Q8q5J32J7r1J32j12Qj66K74k48K25l6n5m8K01n79L96
4315a9J70J75l87j9M43l65K31j46j28p8K26J3k53pJ87j02Kk12J49m6K91r9j31
4338a05K68J58k74L4k54L74l05K03j01OO2J5k34J67J78k09J47l9k47J37P3J2j90
4361a24J79r4j2J00R7j56m7J30O4k64J18o8J53p4P9m9l1J30l3j07rj65L00k67
$$ y = [-110, -208, -37, 82, 37, 44, 104, -8, 21, 36, 156, 90, 185, 4, -39, -46, 128, 181, 104, -63, -103, 112, -80, 247, -200, 11, -46, -285, 69, -6, 14, -147, 79, -40, 211, -79, -102, -96, -213, 238, 53, -65, 66, -128, 64, 13, -25, -23, 108, -120, -88, -71, 216, -228, 70, -219, 65, -125, -25, 171, 139, -55, 7, 82, -78, 313, -83, 209, 0, 31, -81, -86, 134, 199, 76, 163, -45, -208, -28, -98, -43, 166, 87, 80, 174, -67, -112, -15, 72, -3, -157, -35, 57, -111, -184, 35, 159, -222, 48, 13, 111, 169, -236, -72, 16, -69, 63, 80, -11, 121, 9, 17, -149, 125, -123, 102, 66, 11, -37, 164, -415, -19, 151, 326, -61, -80, 363, -2, 229, 83, -45, -123, 103, 116, -137, -144, 43, -59, -57, -269, -120, -166, 125, 26, -105, 163, 321, 47, 81, -173, 201, -104, 99, -2, 4, 66, 81, -153, 14, 192, -17, 130, 91, -156, -19, 54, 66, -124, 55, -39, -51, 49, 146, -10, -57, 73, 137, -127, -9, -77, 76, 2, 81, 32, 1, 131, 98, -9, -18, -183, 117, -150]
4385a50R8k1K03k88R9K6m2J65KR2k15J51j52K66j04n6J56j93K0r8p3KJ99j83p5
4410a71nR3R8Kj13MJ84Q4Q0k70M6K49n63N20k23j05N7q7J13l49M14Mj77j5O0K84
4436B14j01j66K83k70K8pM8r5L97l45J6K36l43mK69q2L1J14L1l70j51M68k29q3
4460a11N0k35J75K24k3J1J19o3k46k3Q8K69k80nJ86j10K15k08j54J43J02K32l49
4483GK32l30L0J37L4r8j8J06k26L56l40J93l31K89l6M1R1j76p8K08J97n00L53
4506A41Lk05r2K69l29P8K42k88L61k38J52l2q4k35J09o8M19j41j07N1PO0p1L5
4530C7n7%J27k98K3j06K57j34j7J48M1J61m55L22l4j40J51j56J10k06L38J14j61
4553F5J4j56p7M01k43n1o2m4J37J45k09J80j08Q0K8q4n2J26p0mJ50n8o9m0K0j1
$$ y = [-150, -52, -73, 130, -158, -59, -33, -75, 90, 92, 184, -31, 120, -32, 234, 130, 74, 230, 37, 57, -41, -114, -112, 87, -96, -171, -176, -83, 15, 17, -96, -92, 92, 176, 256, -14, 32, 281, -282, 238, 15, -90, -33, -120, -7, -356, 58, 62, -115, -130, -70, 214, 113, -53, 230, -40, -12, -19, 29, -66, 331, -14, 2, 238, -105, -109, 160, 78, 109, 223, 254, -116, -267, 201, -28, -111, -61, -296, -121, 103, 80, 91, 210, 147, -99, -122, -34, 235, -45, -50, 136, 26, 241, 33, -121, 22, 124, 356, 7, 239, -91, -61, 76, 110, 12, -6, 100, -126, 230, -110, 83, -248, 41, 5, 46, 137, -39, -117, 91, 288, -212, 141, 144, -61, -153, 116, -213, -135, 107, -181, 180, -58, 94, 62, -22, -257, -148, -216, 203, 62, -45, 6, 13, 73, 2, 37, -20, -20, 107, -191, -168, -274, -17, -151, -168, -20, 21, 182, -273, 49, 15, -125, 26, -130, -20, -226, 112, 226, 65, 79, -77, -154, 247, 4, -47, -109, -153, -16, 129, -80, 100, -8, 72, 100, 16, -36, 90, 20, 16, 166, 108, 39, -1, 19, 8]
4579Hn4q6Q3mP3l07J77J24J25J01l78N4J8j53Q7n1L62k7j0J36j13k95m0J13j44
4604b01L96l07M3o2L5p7j1M35k41j70J46Q0J00o8r5l4j47J8j45L51r1j17J09k32
4628b85K35M9j04N9K50j61j33J36Q4j26j4r7M5k10J66J40r2J15mr9J26O7k24M6
4652c1J69l13m5K21k4J28q5K0J30J70o20M30k19o7J93L5J56k68J41k40l4J03K71
4675B21r9n5k46J57k27j23L66r8K80J9m9p2J26M6l51O9J46j5j64K2o5J73L5j93
4699i7r2Q0K19j68k4K7N3K0o0l2j84L50j7j87K1L5o7L12k30m1J43J22l02J00j2
4724c1J1O3o5R7Kj95L8p6Q2rL1j62L52q5n9j71q0J26J05O6k7R5j68M2J99J98m06
4751b7J12l67K31k91L02J87j72p4J96k86K30L1j33k40J59J14N8r5K8k8K00k58
$$ y = [8, -46, -132, -49, -53, 20, -287, -110, 14, 139, 240, -138, -84, -66, -219, -132, -183, 179, 152, 142, 278, 165, -130, -170, -57, -201, 195, -112, -69, -131, -96, -173, -184, 251, 10, -160, -14, 66, 166, 98, 3, -31, -178, -160, -305, 46, -45, -162, -53, -285, -50, -1, -105, -46, 204, 43, -90, 46, 130, 4, -10, -107, -62, -272, -106, 34, -58, 57, 53, -46, 80, 147, -77, -31, 138, -175, -220, 1, -23, 105, 20, 40, 170, 340, -280, 150, -69, -136, 57, 92, 248, -20, 121, -119, -153, -50, 221, 122, 67, -179, -22, -249, -372, -6, -104, 176, 195, 146, 74, 200, 246, -105, -36, 110, 95, -69, -47, -112, 61, 96, -97, -189, -109, 110, -58, -82, -55, -2, 18, -42, -74, -258, 92, 75, -112, -91, -56, -123, 189, -41, -82, 61, 183, -119, -19, -31, -20, 43, -22, 75, 77, -118, -80, -156, -74, -83, -52, -214, 138, 53, -6, -177, -257, -131, -26, 40, 13, 108, -60, -18, 181, 379, -27, 85, -282, -51, -342, -40, 147, -25, -99, 97, -189, 41, 72, -61, -301, -142, -28, 30, -65, -37, -65, 135, -123]
4773a23nj35M69j9j60K59n94J93J49k6K1J53k67N6m5m9K95j12j69O2J47n0j82
4796a32L48l25K20j50J23j76J24o4O2j79R1j47l9M4O9J34m9J11O3J5k11l4K33
4819A31l4p9J3j64M09j32n5k63K93k18M30m71rJ96r7j79L17Q8o4j71l01L53n8
4842f5M6n2K5jJ97k41L15k7k17K9K49k03j0J04k93J71j37k8J98j48J84j9L6m09
4866b96L86l4P6l1p0k78K24k5k02L54j29P8o1j97J64P3K28m42M59l06k36J81L16
4889B32k09r2K69n7k10L01m94J35J93Lm2J57j41l62K78J79j06k38J47L4M52l72
4911E7j87K86Rp2j4j43J5K95l11o9L21k44L5J44ol25K78j68K30k29JN1Q4o5K1
4936fJ27n1J15k63J18r8m3J71r0j21J53K07k66j7J06Jk11K72p0P5J07o8k99K66
$$ y = [-123, -128, -263, 206, 187, 27, 286, -308, -115, 34, 8, 29, 182, -85, -29, -74, -123, 172, 60, -109, -47, 100, 50, -132, 216, -109, 111, -39, 84, -92, 32, -32, 30, -149, -58, -205, -244, -200, -131, 3, -46, 65, 128, 143, -68, -102, 131, 97, 18, 31, -133, 276, 144, 89, -174, 119, -99, 331, -140, -149, 47, -50, -229, 88, 176, 112, -59, -360, -7, -65, -19, -71, -46, -47, 150, -91, 224, 197, -20, 9, 258, 55, 45, 149, -144, 27, -110, -138, 60, -88, 96, 77, 113, -296, 90, 56, 132, 101, 31, -247, -23, -48, -250, 104, -25, 53, -8, -205, -41, 32, 260, -182, 277, -29, -265, -84, 232, 23, -69, 200, 143, -67, 234, -260, -125, 68, 71, 29, 186, 45, -317, -39, 140, 34, -204, -57, -23, 429, 57, -130, 156, 165, 93, 79, -64, -49, 246, -65, -134, 187, -57, -22, 122, 116, -209, 69, -99, 131, -98, -97, -46, 38, -27, -6, 121, 70, 185, -78, 40, -58, -101, 70, -20, -141, 12, 219, -47, -64, 42, 43, -168, 104, 34, 109, 216, 148, -151, 115]
4960A15l5j5j00J19R1q6J4k30p6K43k66J21p2L00j54K47l30J26j62K07J20l02
4982a25Q6K51n70K37K50j4P1k93k00K86K03k71Q8j79L7O8J94K15k49J2k11p7N39
5005C48k52o8K43l21J25k50K63k96K13K80l63J17k44K20J2N5j8PR2o1Q5j65J21
5028A43j36o3J24k47J9K89k30m4J91M55m69k91K91j31L64l80p3J29J70k1L7j11
5050A6k71N86m94K9L17j20N3j77P8K63l76L32k32l9mm6K83l84Q9J69k03J37p1
5073f5J32o4j89K93m8j47J27M9j46J53k71o8L14J11k12J70o5n1n5n6J54l8P4k00
5097i8Q8J82k30j48L32o6j38K0O9j48M3RN6j6K46k83j85K26N6j15K2j66K46j56
5121a54M87j36k88L07j45J17K6j79j62l09N36m9j33J56o3pl7K17l1m3J25N4k53
$$ y = [115, 80, 65, -35, 84, 175, 89, 103, -127, -203, 40, -226, -105, -177, 123, -31, 216, -114, 12, -150, 57, 177, -125, -39, 212, -358, -121, 129, 115, 186, -107, -307, -21, 182, -89, -1, -180, -143, -75, 119, 334, 85, 97, -114, -191, 348, 96, 28, 271, -50, 75, -175, 88, -208, 5, 285, -78, 39, -205, 15, 27, 82, 64, 71, 163, 102, 187, 22, 143, 7, -56, 68, -179, -160, 129, -101, -145, 46, 501, 32, -259, 32, -99, 265, -115, -188, -59, 111, 90, 127, 16, -255, 331, -163, -134, 183, 63, 116, -61, 17, 280, -96, 236, 4, -35, -39, -85, 198, -186, -97, 72, -131, 6, -65, 67, 3, -186, 107, 59, -88, 39, 88, -58, 95, -176, -244, 70, 181, -31, 139, 74, 23, -32, -88, 66, 28, 102, -98, -10, 172, -58, -206, 126, 60, -78, -58, 11, -137, -94, -85, -29, -45, 201, -82, -267, -41, 15, -100, -78, -244, 2, -154, 333, 197, -91, 216, 71, 188, 214, 35, -127, -436, 100, 51, -82, 74, 11, 4, -33, 184, 153, 110, 235, 289, 36]
5144C6j25p1K43j80J04k69J40L29k71q6J87j42J94k36j9J50p4O2N3r5J53j61N8
5167b0k67J03J81O5j28mJ33p8j04j20K60J77k60P2j60L5J15r4j43N31n30J6L79
5190A59j74J08L52l05P8j63n0J02j72J45j74M9j31J88j29J55K3k01L38r3j18P4
5212F1J57l26J18J08k75K61r4J44L1k96K6j26N53l08j58m5K91P9j59Q5Lm5m12
5235c27L47k41M16k61K08n9j83R5k32K55J89j40j0K14k14K19l24L7j09J82r7P5
5257D0n0M2j86O1L61k80j7JJ7n7j08L34k85J49j23Kp2R0j27K28J55j25P9l5j86
5282i2n6J07J6o4J50j81L02k76J39j24r2L76j77K10m71L75n59P67k73O3K3k47
5304h4P3L5J63l19m2J20J00K42n03K2L00q9l8L00l32o4L4p6L51J23k13k29J82
$$ y = [36, -89, -160, 83, -97, 7, -262, -122, 207, -64, -150, 37, -105, 89, -147, -166, -16, -90, -28, 25, -70, 83, -78, -20, -287, -184, -3, 62, -66, -70, 63, -15, -119, -239, 21, 198, -62, 10, -150, -115, 0, -94, -237, 294, -236, -220, 159, -15, 93, 445, 140, 218, 55, 5, 107, -65, 80, -94, -45, -176, 12, -117, 38, 61, -140, 198, 105, -13, 61, 218, -108, 10, 118, -157, 104, 10, 154, 185, -111, -85, -211, 342, 34, -124, -169, 122, 201, 42, 127, 130, 85, -327, 20, -221, 195, -66, 142, 83, -100, -5, -237, 18, 207, 67, 57, 271, 57, 276, -48, -11, -120, 62, -35, 40, -10, 32, -154, -93, 268, -12, -29, -28, -11, -68, -176, 158, -127, 22, -101, -99, -171, -81, -208, 20, 175, 50, 129, 94, -92, -148, -41, -25, -89, 61, -120, 182, -94, 45, -79, -171, 205, 28, 238, -233, 142, -417, 350, 77, 140, 163, -84, -11, 24, 187, -132, -174, -54, 46, 288, -215, -193, 107, 18, -20, 280, -52, -116, -82, -158, 193, 316, 103, -126, 56]
5327E6j19L04j27j8rO6k75L09k89J41kPJ4l6l45J80L6q1M41m23J35q7J79J40Q5
5352B82k99j96J54K4K5r1Q3Lq5L32j07j84J06Q4o8j66J15J17r2j1k95K57j00L3
5376g9j44J41J21o4N1k15K31q9M9J80l22K47l34L41M0k17K69l74J41k72L53r9
5398d5N7j42k7K69k36j2J81N0k13J90r9N9m2K39j67p1J9l4P3k8j13K28j0k87J27
5423c4M3j08K50M7k52J04j05J55l27O1J82J32k52J45j36J19k0J01j18L1Q5k35
5445a32J69r6K5J9j14J60K30k81J44m9Q6l10M28m91M31l57J07o8J57J04l81K51
5467C2J94k23J23j24k32K50k33N08pl46L8K83l54L14k38jK8R8kk30K24l40M30
5490A92j19K6k3k90L08k45J15m7J0K8J99j56N9j3O6J38j59j14l7QLK7k3k58M88
$$ y = [56, -63, 241, 114, 96, 87, 153, -122, 187, -102, 39, 37, 44, 58, 22, -323, -143, -107, -188, 253, -170, -35, -122, 57, 197, 282, -17, -213, -59, -35, -10, -101, -18, -15, -100, 232, 125, -59, 47, 131, 63, -103, 12, 129, 37, 26, -269, -12, -112, -79, -223, -82, 39, -25, 26, -189, 42, -47, 2, 182, -140, 107, -227, 114, 154, -63, 206, -168, -27, -299, 54, -45, 12, -130, -157, 112, -124, -136, 45, 95, -118, 72, -27, 32, -10, 229, 62, -9, 10, -24, 49, 21, -92, 136, 126, -161, -34, 9, -99, 151, 198, -54, 50, -55, 100, -227, -166, 16, 148, -104, 41, -95, 24, 4, 105, -13, 18, 103, -132, 37, -59, -34, -15, -129, 31, 261, -20, 124, 75, 161, -149, 279, -212, 219, -138, -31, -99, 58, 162, -219, 32, 226, 3, 126, 2, -230, 20, -213, 295, 288, -58, -20, 263, -91, 223, -15, -16, 12, 110, 108, -122, 102, -238, 192, 73, 99, 76, -214, 94, -151, -36, -83, -73, -45, 154, -2, 57, 44, 110, 248, 89, -25, -62, -54, -51, -24, -47, -305, 183]
5515A83r2j69K7J28J7K54j51j85l0J19k8rL0M3k27L9K75P7j85j13Mk32K67j57
5539a15P5K5o6J38j98j00lJ37K9kR8L88l66j69j26J57J11j45K66q1j35k55M66
5562A29j27q0r8J65M2j45K02J18j75Q2j3r3n3r4J14L01k91k4RJ40J42k67J59j02
5586D1P8j09N7M7j93j88J37K69r6k38J35J1O9l58L28Lk52K21K04j69k19O0L19
5609A57k29R0R0J27p2R1K6k43k10K08j34M30n71K68J06m52M56l43J79J29q0R9
5631A22l95J06K88j77J44q8N9l8j41R0R2j81J50J4j37L11J03m51ON6L9l3j86L95
5655A48j33K29k13l8r7K57j34j14m3N4K55q9j07J89k40O0L2Kj08J36Ok42J68J25
5679A03m1q2r4K3K36k12K49j10K28m14L2kL5o4K08j9n8L10l54J3k2J54l20K53
$$ y = [183, 91, -78, -51, 77, 94, 348, 197, 12, -18, 101, 73, 64, 94, 137, -90, -51, 224, 301, 116, 3, 7, -225, 42, -115, -40, -15, -81, 57, -141, -241, -244, -107, -78, -80, 18, 406, 40, -129, -255, -98, 13, -132, 134, 53, -82, -337, 129, 2, -78, -176, -11, 31, -114, 88, 206, 31, 113, 100, 7, -46, -140, -26, 275, -16, -40, -31, 109, 251, -16, 143, 41, 119, 10, 67, 114, -79, -267, -130, 139, 43, -195, -60, -49, 20, -338, -10, -7, -259, -38, 166, -3, -222, -162, 157, -72, 18, 108, 235, 163, 254, 280, 37, -173, 35, -99, 331, -240, 28, 134, -318, 138, -205, -26, 103, 23, 122, -273, -167, 121, -56, 88, 0, 59, 21, -120, -30, 62, -119, 31, 45, -92, 219, 322, -129, -123, -67, -28, -61, -247, 148, 15, 244, 31, -7, -104, 153, 19, -95, -138, -84, 171, 82, -25, 164, -76, -16, 16, 18, -90, 46, 52, -190, -22, 103, 62, -20, -114, -91, 145, -67, 182, 72, 300, -114, -82, -84, -49, -113, 95, 76, 18, 328, -26, -13, -35, 119, -201, 52]
5703E2kj18N2J28j36j43K01K11p1j30k28K90O6j34k07K62p7O3k35K83j31k90L44
5726E0l56K37lJ38P9N8l13Q3N1j88L08LJ9j30r5K2K18j14J64k29K6j01J98m3j61
5751g9R0k90N53p9o1J19j04l21K75j52o2J32n6r1M04j67J3k59K27k53P3L1Q3p3
5775d7l4K00l35j48K51K14j78J70k95J24n2p4J49j81j5K49n9J55o5r6n3jq6K09
5799Bj8l65K90j1n7R2K00J51k54L3j24j92M11J46k93k06P2J15n8K31k10j28J81
5822HO7j32r3L21k82K35k4j48R9L4j2k47j6L07J02k15j28J71K24m74L21k76K50
5845I2m3k2q2j41J34R9j17J81k29L40k43o2K07k98M7j16J32jL41m05L80j58m5
5868iL9J24k82J52q6O7r1K88k01J97l79K35Jo7r1J01K46k66O8k4l22L52M3j37
$$ y = [52, 50, -68, -16, 112, -24, -167, 34, 245, 174, 44, -184, 106, 172, 38, -169, 93, 16, 79, -156, 127, -4, -294, 50, -306, -69, -72, 66, 145, 203, -110, -27, 24, -164, 144, 147, 166, 36, -59, -37, 181, 67, 231, 2, 28, -73, 125, 82, -79, 11, -279, 274, 195, 134, 253, 149, -172, 103, -49, -111, 21, -35, -126, 278, 111, 124, -135, 92, -161, -88, -57, 26, -47, -81, 119, -216, -364, -113, 101, -77, 93, -202, -78, -130, -204, -55, -236, -251, -2, -61, 94, 29, -67, -120, -121, -207, 2, -16, -381, -91, -102, -159, -67, 133, 284, 30, 63, -61, -253, 158, 304, 11, -195, -123, -8, -66, 165, -45, -173, 8, 75, -57, -150, 171, -111, 124, 100, -48, 51, 85, 73, -174, -190, 117, 219, 4, -124, 47, 271, -203, 118, -158, 92, 49, 27, -55, -196, -62, 37, -80, 101, -128, 212, -31, -93, 114, -184, -137, -253, -121, -122, 219, -186, 194, 36, -9, 30, 154, -128, 24, -62, 5, -86, 202, 1, 198, -181, 54, 55, -12, -103, -2, 244, -22, 46, 22, -300, 52, 95, -42]
5892d2Nk11J83K55k93k17N11j98J10m53Q15p31J89L80j50j41k1J43k19l62L58
5913h9k1K36m12M41j05k19oJ63rL4K0o7L9l0J82m95K65J12N7j10mj51K60Q7k31
5938e3J01j46J6j28J86j45L69k06j46J21j80L75L5j05o0j4K2J4o0j51M02j86J39
5961B00J0k57P8m8N9m1J23k82L5K50j49K3K05k11K34J7l36J96j92K7J45n5J00
5984A31j20j79K74j9j57K32l3J72o06L38l8k23M51k24L5p2K94j66k44J42q8L3
6006f7rJ07J1r9Q3L45k65l75L73n8P0k43K05J1l56K63N4j38K31o2j79P6J72l36
6030a86K83N9j78n2j75L76k32R8M1L9O3L6o1n6K1J43j96J9j02R3r1k35M65k47
6054g5k5K19j55m3P2NP3N0l60K70K81n09K27m3nl39N36j96k22K47N9j29J55J10
$$ y = [-42, -37, -248, -65, 190, -103, -320, 191, -7, 103, -350, 465, -266, -77, 303, 153, 12, -9, 134, -85, -447, -89, -110, 126, -286, 155, 50, -169, -175, -12, -21, 13, 33, -34, 5, -25, 157, -338, -73, 39, 96, -14, -18, -169, 91, 178, -53, 48, -98, -82, -210, -24, -169, 200, -6, -152, -31, -211, 164, 199, 94, 34, 20, 42, 56, -4, -155, 247, 61, 200, 210, -47, 31, -17, 42, 1, 124, -158, -123, 127, -22, 1, 206, -5, 229, 246, -90, 106, -86, -59, 86, 31, 131, 11, -168, 106, 87, -70, 162, 129, 301, -305, 33, -5, -228, 223, -1, 34, -38, 256, 90, -154, -12, -100, -67, -76, 31, 42, -57, 26, 371, 106, -269, 104, 46, 116, -127, 78, 89, -267, -4, 50, -88, 143, 81, -98, -22, 150, -186, 97, 156, -22, -74, -249, 127, -105, -7, 34, 73, 136, 172, 111, 55, 76, 219, 23, 42, -60, 33, -58, -293, 172, -75, -100, 119, -36, -79, -7, -2, 71, 121, -239, 31, 312, -197, 30, -13, -18, -357, 179, -17, -239, 8, 67, -62, 93, 203]
6078B03J06n00R0K47j43n8J66R8m26K69r8K23j96K3O7L4Ok6K1l90K76o4P2J3k33
6103b20M45l03n9J17N0j09k0K64j55P8j51K9m74M08K1Kr0R9J86p1l14J30K15j18
6127d0L06m63J75J32R8l92J61J90j34K14l25J97j0M6J9k33K9J94l32K54k25K0
6149a19J79j62J11orl0J51j03NJ11l20K87k02K06Nj83J12K05m64K10p8k6O1N7
6173bj8k36L52k36J6L8K84k18r7J08N4Oj1j32o6K80j41K73k67K53k18j71J71j3
6197IM1k47K41q2J37o4n4J19K8J25j89L8q0J29K18n20K45j09K55l7k55K42m38
6220b48K76j68K30k50j4o5M19j61L3j27j43j0R3J98M9J32k50k8N6L8k29J67P2
6243G0P0Km9J23j4l09Lp%k9K19j31N1O0J08r8k1m26M24j43N0Q1l60N27J8j08l8
$$ y = [203, 309, -191, -101, 146, 3, -55, 111, 209, -217, 52, -46, 177, -19, 4, 71, 105, 111, 85, 106, -284, -8, -72, 0, 13, -220, 225, -78, -137, -20, 30, -79, -99, 165, 10, 88, -63, -34, -508, -100, -79, -77, -167, -68, 118, 47, -267, -137, 78, -40, 266, -197, -22, 110, 208, -184, -23, 167, 33, 247, -78, 119, 109, 155, 174, -59, -30, 164, -168, 86, -139, -119, 60, -102, 9, 3, -6, -36, 115, 12, 17, 128, -192, 95, -107, 99, 104, -79, 33, 238, -226, -16, -94, -120, -59, -2, -20, -256, 96, -140, -124, -86, 198, -20, -117, -9, 45, 51, 40, -92, -158, 122, -19, 254, -13, 240, 22, -149, 22, 9, 50, -197, 44, -38, 99, 35, -19, 100, 128, 253, 64, 102, 22, 151, 369, -151, 94, -15, 240, 203, -52, 190, -248, 28, -140, 90, -160, -174, -239, 180, 19, 52, -75, -218, -228, -135, 63, 112, 244, -6, -34, 22, 60, -169, -2, 70, 140, 142, 93, 216, 202, -107, -104, -111, -111, -140, 79, -52, -1, 59, 167, 69, 48, -378, 46, -97, -47, 34, -326, 201, 219, 111, 73]
6270G3j78P1L8O8O4q2j73k26K85l2Q6L22m11Q4O6n0%J12j22K4q9l0R7J64j54r
6296bL21k39L1pl34K45k21J7K22m4n1j01J18J15k06J92j02n3K31l26M58n33L93
6319A24k02j72L7K14L24k09L2j19j86l17M51j0n7j4M6k52O41l59J50j11K0%l27
6342b96K94J38k3L3j36o4J33k8j45j05J16J97k41J35J56k61K31l25Q3J63k22K07
6364D0j7%N6j04J1K03o7k51j25L94Nj62K11k17P0qN5k9P8l42M04l16Q6J32k14
6389a07K7K15l52J52j61K31R9j91L53n62N06k37p0j0K13k15P2J14j4k8N5l7o7
6412a4N2l85L23n6KJ62J27k07r4p0K46J15j70O5L39o23k12Q8K47K02N7r7M4J22
6436B63M1r9k88N3J68j43R3k60rM0l0L00k57J16N9k07J41K6J1J02j31j25K80r7
$$ y = [73, -105, -34, 4, 72, 136, 54, -119, -345, -60, -92, -6, 316, -95, -11, 55, 5, 5, 117, -5, 19, -70, -100, -3, 161, 7, -2, 319, 80, 111, 104, -230, 15, -206, -189, 33, -11, -62, -163, -45, 70, -136, 56, -46, -99, 132, -194, 264, -269, 124, -78, -250, -213, 1, 325, 116, 148, 29, -157, -474, -23, -33, -90, -104, -58, -310, 331, -28, 122, 11, 31, 31, -296, -2, 136, 113, 146, 10, -54, 79, 51, -94, -199, -83, 114, -127, 8, 164, -97, 134, -191, -108, 55, -167, 40, 23, 23, 79, -25, -14, 189, 122, -129, -254, 140, 145, -17, 194, -23, 47, 39, 94, 65, 143, -199, 205, -111, -25, 107, -107, -80, 135, -217, -65, -226, 5, 104, -87, 266, -296, 210, -27, -97, -107, 106, -109, -37, 77, 63, 35, 90, 53, -14, 38, -347, -24, -80, -78, 84, 211, 4, -90, -160, 86, 201, 31, 96, 435, -188, -400, -312, -65, 137, 194, 97, 141, 263, 304, 205, -83, -30, 138, -5, 88, -172, -181, -141, -171, 129, -128, -12, 47, -160, -19, 7, 18, 120, -11, -136, 144, 47]
6460D7J37j81m61M91j02J22M8J8j87K9q0j19L96k04J63P7j71n8L3j05L71l90J38
6483A2J26k85K50q8N3o7J33l10l2M24j33J0q9m8K77j02r8k76K21m0o7K29k10J9
6507i1K16k96K82l4j03k4J58o5R4j68K27M0k46O3k2K3k64K54J79k6j60j42NK89
6531A89l94M57l82K67m4m9j36p2K78m00L90Q6k29r2J1J68j26J65m06N59j83J37
6553A94j87j13J15P0rj91L8Q6j00Q3Oo5J71k23q9K41J69k08j69K24q6J71j41M0
6577B7J59j43r7l1PM7Q4r3p0K20j80kK7l3M1j75J21j02K10j90L39k74J34k29J62
6602d1Pk95K73J2K25l80J29Q9j12L53k22Np8J69o9j91M2jp0J97L4k60K41J2k63
6627a94J29J70o0J28j02J41k17j96L32NK8k63L15j61J18k40n9J42J52l82L70q5
$$ y = [47, 184, 3, -458, 33, -69, 53, 101, 119, -68, -39, -119, -238, 158, -46, 117, 194, 23, -35, -2, -107, 264, -126, 12, 138, -147, 103, 15, 68, 1, 134, -176, -208, 216, 83, 93, 4, -44, 233, 131, 33, -243, -22, -62, -129, 100, -110, -91, 125, -171, 111, 77, -26, -50, 108, 43, 137, -31, 196, 236, -10, 53, 31, 54, -210, 44, 223, 197, 37, -105, -100, 189, -205, 252, -130, 137, 93, 44, -92, -164, 114, -286, 104, 190, -39, -131, -120, 48, -78, 87, -319, 240, 57, 194, 7, -106, 9, 79, 70, -121, -83, 3, -97, -14, -8, -73, 98, -125, -214, 27, 196, -12, -181, 43, -43, 128, -13, 27, 186, 43, -54, -85, -78, -31, 53, -40, -110, 110, -70, -72, -45, -78, -37, -212, -91, -193, 17, -173, 166, -108, 26, -203, -41, -34, -329, -56, -44, 181, -199, -70, 19, -93, 260, 38, 43, -35, 134, 65, -126, -84, -85, -155, 42, 76, -184, 57, 69, -194, -65, 105, 45, 173, 71, 212, -5, -201, 131, 136, 164, -99, 216, 55, 173, -67, -126, 16, 168, -214, 156, 71]
6649G1j90K66l8Ll71L36k4j98J78k9pq5J78k79J90K79k30j97K63p1j8n4K7Kj66
6674a64J59m6q3j27J22K40k15J15J26p3p6k56K59L0j11J45j2j20J15o7j18K96
6696A39k8q3k19J63J64r1j33J07K9n1J67r9M1l69M54j33m7O8k13J8K58p1L3k30
6720a26J76R5k69O9J79p2p3J34K6k86K28o8j56L8j12K09j75K26o7M7L8k21Q3J07
6744C0j5p5L6J70m2l15M0J01P8J64j15P2P4k05M6K23l64Q0J27K2o0l03K96Lk5
6769D3k49K32Q0m7K58l34j02K07Q0j81l2k58L01o1K48m9j36k05J35pJ07m4K73
6792B59n35K50j3k33J03K0K68J5j75J67j07k7J08j14r4j55J64J41p9j52M96l08
6814aj07M33l64j89J74J12P3k65J73j28O8N9o8J71j5R5j65m7Q4j57n8K3kK6J28
$$ y = [71, -119, 147, 109, 112, -259, 77, 53, -145, 33, 4, -3, -88, 90, -189, 1, 280, 50, -147, 116, 45, 27, -27, 0, 2, -164, -5, -51, -134, -261, -139, 101, -114, 1, 127, 54, -22, -278, -19, 11, -100, 45, 33, -87, 28, -39, -157, 139, 111, 28, -191, -28, 136, 45, -88, 19, 48, -3, 164, 65, 106, -263, 191, 58, 11, 79, -134, -116, 142, 71, 104, -126, 50, 145, -124, -55, 124, 52, -21, 113, 139, -147, 81, 13, -143, -105, -217, -8, -183, 43, -24, 23, 61, -160, -77, 30, 15, -60, -24, 146, 104, -211, -171, -70, 8, 172, 57, 129, 203, -2, 44, 267, -97, -17, 110, 132, 72, -231, 65, 68, 43, -206, 26, 106, 59, 317, -17, -119, 88, 168, -13, -45, -303, -2, -63, 185, 136, 0, -205, -70, -77, 30, -14, 259, -276, -26, -39, -272, -169, -149, 119, 134, -41, 126, 19, -8, 100, -14, -108, -263, -99, 42, -37, -189, 307, -1, -108, 325, -39, -228, -54, 58, 131, -134, 39, -89, -21, 38, -30, 141, 126, 221, 56, 9, 93, -64, -122, -99, -101, -75, 53]
6839E3p6J9m8j3O2R1r5K13Jp5k65L46l15O3k07J76M6J31k71L00P3l00J24Rq8j48
6865a94K31K08j5l51L51k11N6P3M9j61K9q3O0r5Q0J34j33m8K3K14m06J00J49J28
6889A88j53rJ75nl83J00k6L75j9j63j01J6J18l54L93J45j67l25L39j12R4j54L3
6912Ek90L53J70k85N3O9moj5ql7l0k1p7p6K06m4N9l8j04L42o7j62K39k08m62J46
6939b92J49J0K66q7k40K15n6K77j65N0k09j04l6K56J02j80K8M15n77K41j49M9
6961c7J79k49J75J15j15j22O3N4j56K3k3oJ38J34k04J5j13m4L37l31J47n4J32
6984E8K6l86L77J40k11N9o7j89K29k35M06l19J4n4K61L54m17k95K02L70l47Q1
7006E7N0l52L5J22K10Q5r3J7m9j66K12Qj15j12L44l71J3J47l6Ql1o2J82j05l0
$$ y = [53, -23, -4, -52, -65, -3, 88, -7, 206, 207, 132, -133, 213, -102, -39, -246, -70, -24, 107, -164, 136, 209, -91, 33, 42, -46, -194, 37, 245, 230, -121, 230, 19, 75, 148, 197, 36, 65, -18, 42, -53, 27, 161, 28, -20, 3, 217, -189, -89, 60, 188, 35, 26, 201, 196, -187, -87, -113, 262, 243, 80, -21, -5, 113, -241, 152, 297, 130, -195, 144, 32, 126, -28, 5, -285, 68, 238, -47, 6, 75, 71, 65, 50, 42, 5, -25, -46, -123, -199, 7, -37, 22, -16, -120, 222, 155, -7, 232, 24, -438, -292, -143, -133, 133, 46, -194, 21, -35, 242, 77, 127, -82, -186, -222, 34, 136, -44, -16, 399, -178, 63, -86, -37, 142, -107, 68, 183, 68, -54, 9, 63, -93, -70, -93, -99, 39, 173, -31, -16, -129, -173, 164, -167, -20, -74, 58, 84, -302, 75, 215, 4, 63, -4, -193, 36, -199, 207, -112, -98, -152, 109, 463, 46, -249, -47, 323, -24, 57, 107, -245, -210, -88, 122, 207, 114, 131, 82, -84, 128, 136, 21, -91, 253, -118, -105, 42, 6, 14, -17, -79, 103, -2, -32]
7031c2K60k44J32M5L8m14K62KJ56ko3j98J2O4M9r4j7q6J03j67M16k92j24J39K39
7056A84j54K14j34j60J20kk06q3L09P4rk42q5L39k59L51m56J66k6n9J83j51L05
7079B19j34L9k96M8K18p2K2k0K4j94L96k20J73o9p0j49J11j04J60J54m6j72R3
7102A11l56O12k19k2j47p8J14j28qJ76J44q9k0j24j9J06K55l01q8l2K03m08K53
7125f5N7R5%n6L4lL12k86p3j41J36j01J15K97k95k41L02j83K50m9j14R9r1J81
7149A80k55O5O2j91K00n9j98N7r2J88J78J3k12mJ01J67p3j36P7j32o0K64Rk99
7173a50J30O3o6j11K86o8k69m0J3L79q2J82l12J00k82K46J82m88J01L46j78m4
7195f2M80l67j9j54j02J96j69P0l7J77J3J98l42l8K49j22Q1K32k15L9j6K4k93
$$ y = [-32, 228, -16, 116, 161, 199, -215, 47, 49, 205, 203, 140, -58, -46, 18, 67, -27, -44, -130, -27, -194, 222, -70, -194, -55, 184, 30, 244, 110, -50, 70, 68, -138, -221, 88, 162, 153, -89, -174, 165, -94, 257, -199, -33, -59, -118, 65, -86, 219, 85, 124, -172, -124, 94, 22, 44, 24, 48, -146, 250, 30, 203, 134, 64, -85, 26, -78, 82, 236, 190, 18, 111, -245, 367, 148, 126, -21, -99, 15, -113, -121, 55, 199, 110, 90, -34, -53, 53, 308, 7, -81, -113, 90, -318, -65, -8, 87, 87, 31, 65, 62, 374, 88, 15, -126, 10, -91, 24, 321, 26, -215, 87, -96, 154, 105, -9, 90, -1, 180, -75, -10, 52, -139, 61, 2, -196, -139, -231, -43, 135, 148, -64, -68, 33, 200, 127, -9, 68, -64, -124, 140, 149, -150, -20, 43, -23, -134, 152, 84, -185, -225, -212, 167, 85, 267, -45, 55, -227, 19, 201, -287, -186, 160, -18, -62, 418, 51, 32, -122, -224, -28, -197, -127, -164, 13, 26, 224, -118, -156, 93, -29, 52, 284, 69, 108, 92, 116, -177]
7218a77K49M2J91m81P7R9m5p2r5J83P4k53L77j56j30J90%n1R2k03K83l29P3K24
7242A62j76oQ7N4j92K08KJ8k39j00K70k68lK81l53K56K15j80R1j49R0j55L0J08
7266E1J0R3l19J33j2R4j66K95JN0M5k79p9K08j76j62mK35n8O0Op3R7j89M4K30
7292A35k22J03j41O4Pk62K55J9M3o0J4J21op2l1m1k2K85k40K72l32J24k0p9K16
7317A30j56N57m50j12J30k03J69k27M17l57L8Oj43L45l09J22P4J7O6m57M99n9
7339I7l81L81K46k34j03J32j4j0l11M17q8j84p5O0R1ok52J34J47r0p1J85N4j30
7363eO6k52K95o0N4j07J14r2J25k37PJ25k16L69j27J36l1k1k28J96r3k6o7M8M5
7388A8j70l6O1J90j4M4k42J02K22k61K69j94L18k97J72Ml00L31k53J91j12M7j61
$$ y = [-177, 72, 114, 305, -176, -99, 0, -45, -117, -212, -29, 45, -208, 169, 13, -117, 73, 73, 22, 114, -89, 194, -135, -62, 162, -14, -20, 67, 121, -71, 137, 139, 157, -82, -182, 88, -180, -183, 98, -255, 1, 216, 36, 127, -22, 68, -87, -57, 51, 61, 154, -165, -32, -44, 50, -116, 179, 180, 230, 275, -4, -83, 125, -51, -213, -217, 18, -40, 20, 26, -47, 50, -139, -95, 135, -87, 16, -125, -61, -54, -316, -61, -42, 1, -59, -45, 76, 70, -2, -33, -74, -96, 189, -51, 221, -111, 13, -7, -86, 130, -26, 531, 81, -31, 99, -104, 65, -162, 255, -102, -64, -58, -201, 144, -165, -43, 31, 48, 114, -343, 156, 97, -284, 97, 343, 109, 6, 138, 124, 114, -197, 220, 132, -52, -127, -67, 24, 18, -234, -100, 47, -43, -114, 71, 125, -5, 61, -191, 104, 44, 98, -9, 105, 13, 138, -99, -92, 33, -183, 186, 59, 195, 164, 143, -85, 111, 18, -8, -75, -27, 18, -152, -188, -127, 63, 49, 93, -149, -47, 175, -86, 183, -11, 307, 10, 182, 186, -114, 217, -36, 155, 43, 90, -71]
7411g1J28j41J04Qp0Q9o8J01k78N4L64j54r1o1J57p8J4lK31j65L3K2J00j40N8
7436A43k86J70L5M86m66j56K3k63M11j35N0j49J94n3j13J91J42l92K61l9m35J21
7458b60L17l53K35P1O6O9K3j81r0J51l8q5J97j64J95j67K75m81P2K35j73j12K62
7481F4j9r3p9K87j97J67J25k82J12K09k40j84n6j29M91k57K73lj77k5J86l24j5
7504a66j8K40q2j2J5o1R6l3J46K12p96K23J5J65J95L5o5j39J84N2l05K8N8J28
7528A15r2K92m29M4J59p5R2m2j21K68l53J13L73j65O1j78L6o1P7l48J16L63k97
7551e2R8j98K5N73n80L6M0j35P4Mk1r0K72k06K86k69M87m07j17L53k05J35j32
7574b9qq1k8K84j27k71K01J55L8R6l19P6l9K13k54J94j65k3r2L54q6n4O9P6R1
$$ y = [-71, 57, -84, 20, 28, -42, 47, -21, 80, -198, -144, 220, 66, -25, -86, 71, -7, 7, 4, 235, 70, 103, 125, 225, 85, 143, -143, 27, 62, 548, 82, -74, -51, -314, 97, -38, 12, -137, 57, 4, -109, 82, 224, -168, 93, 54, -381, -260, 57, -296, -61, 10, 76, 145, 168, -13, -103, 48, 10, -75, 122, -42, 153, -14, 261, -220, -148, 87, -86, -198, 64, 45, -48, -127, 160, -37, 130, 255, -27, 85, 294, 54, -130, -186, -315, 176, -81, 192, 189, 12, -13, 173, -151, -166, -184, 56, -26, -38, -23, -84, 12, -21, 125, 337, -459, -236, -221, -56, 139, 174, 109, -30, 154, 206, -99, -71, -13, 115, 23, 315, -114, -70, 89, 14, 106, 64, -57, 211, -142, -29, 344, 179, 240, 62, 98, 37, 114, -234, -118, 245, -52, 46, -152, -127, 446, -134, -98, -58, -193, -119, -115, -136, -226, 46, -160, 126, -143, 344, -63, -180, 173, -32, 103, -29, -37, -118, -146, 138, 11, -260, -59, 96, 134, 230, -89, -13, -52, 161, -93, 101, -64, -87, -179, 175, 89, 35, 104, 180, 271]
7599B71l52J23j69R8J0j2l22L89k24J42J93l3N4o6L91m05n1J71l74K59K21m37
7621a23J77M0p9k09K12MQ9r8k88K87J25k5k52J81o3K6K5J15k67K35m8j37K6j19
7645a66J90M4j11J01n4R4J32j34k01J02m9L20m2l16K83j48j07M18j81k71J70p3
7667AJ4QK1j42K51k33l1J88R0l06J77j90mP6l1L06r5Kk52J34j13K42j07j58J48
7692dm2mJ99j52Q3k65r7L99l52N8J83K8j47k94P70m22J97j91K8J43l9k30N3Q8
7716a0K00q9l0l6P3O6l5Oj30o2K08K9k46K14l10L15rk90L07l55L5k2J76J54k72
7741a13N2J9M0k39K43J16K3Q1j63j01J33k36Q0K55k25K23j64j54j11J92j02K44
7763I3j40K12k44K59j17k31J76k27J06j3K04k57J57Q0j15r3J51J46k69M9K06j32
$$ y = [271, -81, 42, -127, -29, -19, -31, -353, 36, -188, -46, 147, 114, 168, 102, 493, 88, 37, 208, -166, 93, 314, -123, 54, 94, 15, -194, 18, 22, 111, 13, -275, 12, 137, 112, -140, 41, -22, 4, 29, 144, -123, 112, 64, -73, -47, -166, 24, 68, -43, 58, 4, 98, 230, 96, -105, -3, -52, 268, 226, -90, 193, 45, -62, 356, 175, -96, 74, 1, 15, 23, 44, -98, 153, -80, -111, 77, 167, -139, 38, -152, -156, -80, -111, 195, 100, 102, -150, -16, -129, 113, 6, -152, -4, -46, -50, 149, -3, 80, -185, -282, 117, -235, -177, 6, 34, -113, -407, 363, -59, 138, -53, -25, 118, 79, -151, -98, -10, 190, 101, 71, 35, 108, 174, 139, 145, 15, -47, 161, 190, -56, 158, -152, 163, 154, -136, 171, -184, -149, -171, 5, 159, -113, -61, -42, -2, -241, 2, 118, 141, 222, 59, -42, 91, -145, -65, 190, -35, 188, 24, -130, -241, -49, -151, 93, -47, 165, -79, 180, 63, -168, 8, -219, -113, -126, 78, -179, -22, 58, -57, -150, 1, 147, -122, -73, 133, 1]
7785Aq5L4J70k16J14J2J32j31j02J19n9j28K1J03Q0L1J81n03Q7J32J08j45N6j45
7809a33K19l3k40L02J78j63p9q0Q5l3K1j8r3J03k0l3O6j07JJ49j16L5j33R9K08
7834A85n00M25m6k27j20N46j96j68L15k61J9K78r1l45J17M1Rl38K92j14N75n75
7856a79K31j60O6n0J77k43K34J12J5l75M31k1k44J26l22O2kL48l20J21J29o1j02
7879b7J55m04J47l0L92j95Q3m40M48j39m1k39L22P6k24n3Q5O1k3j37J10K86k79
7902f6KP3l5J93j69M2l5j01J74kl28K26J92j15j80K06l13Q7J15J27n8j8j86K65
7926I6k55K20q2mJ91k10O7K5j10J25l5j55L8O9j42J1K07N1j73m6K69l23J3K3J64
7951C4M8L8j70m7j4L08j85J21k2jk95K4K73k43L77k93j08M01l38j10K69m7j00
$$ y = [1, -84, -50, 120, -96, 18, 30, 162, 31, -71, 48, -11, -139, -118, -15, 65, 96, 277, -226, -139, -7, 101, -44, 12, -133, 86, 53, -187, 115, 293, 130, 51, -29, 56, 23, 44, 26, -67, 36, 16, -17, 49, -58, -57, 92, -24, 11, -122, -23, 185, -315, 110, 64, -163, -283, 263, 67, -101, 214, -47, -28, 250, 159, -186, -69, -28, -19, -357, -65, -179, 396, -179, 52, -108, -42, -92, 85, -158, 76, 188, 203, -172, 259, 238, -6, 120, -202, -140, -142, 206, -114, 7, 136, 75, -27, 128, -276, -129, -159, 233, 38, 121, -319, 129, -10, -51, -290, 32, 108, -116, -169, -84, -23, -46, -183, -73, 213, -66, -64, 9, -26, 167, -2, 40, 5, -96, 78, 76, -252, -26, 166, 51, -129, 77, -236, -149, -34, 93, 35, 17, -169, 96, -159, 61, -21, -25, 166, -44, 23, 48, -62, 63, 28, -127, -89, -20, -162, -151, 56, 107, -66, -112, 157, -166, -153, -130, 34, 82, 120, -50, -97, -111, 197, 12, 133, 111, 110, -185, -161, 112, -131, 246, -47, -155, 246, -92, -202, 67, 20, -80]
7974h0Q8l3K30l03J76o3j59N17n39K74Oj23k18J76J19k44n9O7L36J9l67K5J26
7997b9Ko7M3J37Pk20P2k9k5j99N00l93L56L0p1j68J44J68m15J21J08j33J40r5
8021a6P7j22L0Q8n0O6J57P4l58l03L88Qq6J85l89L34j11L6j18L2l9J77mQ5J09
8046B50k10K6J05m4l51N11p9j23j56J57J01l79J06L9J7q8L77l99K12Km0k5J10
8069A19j04J97l54L60j61jq4K4J81k00K54j97p9r3L79k75O0j44j3J34j39O2K91
8092B17l29k42N48l23m1j3L08l18L83k9j92Nj2K14m10M34k24k6J07J5j8l19L76
8115A11J97k61k66J96L7j09L18m19K10j86K79n9k0J02k53n9K03q9r6J19J18N0
8137A23k85J75j51M00l72J00q9J75L6j1J25m13L68m6j38J43n3m3J7l20M04J34
$$ y = [-80, 8, -25, 205, -98, 78, 15, -144, 373, -166, 108, 114, -9, -227, -51, 68, -176, -235, -168, 168, 187, -180, -155, -29, -27, -94, -51, 86, 93, -127, -55, -84, -109, -308, 192, -201, 155, 185, 114, -54, 90, 258, -157, -36, 72, -61, 79, -16, 61, -61, -31, 57, 7, 73, 230, 304, -54, -357, 31, 39, -47, 138, -251, 83, -28, 8, -110, -78, -117, 60, 56, 141, 250, 40, 66, 171, 127, -224, 287, 208, 85, -71, 86, 187, -192, -86, -47, -30, -118, 259, -140, 72, 74, 34, 9, 119, 15, 212, -142, 218, 57, 56, -28, -4, 177, -23, 231, 34, -45, -138, 241, -34, 26, -118, -131, 3, -136, -74, 217, -112, -354, 194, -129, -170, -183, 125, -193, 190, 161, -31, -26, -38, 176, -234, 200, -24, -50, 57, 72, 54, -265, 111, 308, 47, -219, -23, 14, -95, 223, -196, 14, -172, 107, 48, 28, 130, -123, -182, 21, -68, -164, -45, 73, 123, -162, 13, -138, 262, -110, -10, -99, 76, 112, 101, 226, -187, 181, 135, -3, 140, 87, 44, 61, -259, 145, 279]
8159B79j38L5J8l25J75k12J3L8O2p9K97n1j31r4n1P5J56k35K42J20j94J43qj99
8183f4o8J85j80K87j23l85M09R4
$$ y = [279, 141, 176, 194, -131, 44, -168, -155, -117, -55, -134, 163, 112, -19, -113, -164, -89, 67, -168, 74, 194, 0, 143, 135, -64, -132, 53, -127, 160, 37, -348, 61, 155]
8191A55
$$ Imaginary data points
##PAGE= N=2
##DATA TABLE= (X++(I..I)), XYDATA
0@%%%%%%%%%%%qJ6j6J6j9K7l2M0m8N6o7P5q8J04j22J44j66J91k19K49k83L20l61
34a91M05m55N10n69O35p06P83q68R60j061J173j292J421j565J721j894K083k293
52a203K527k787L079l410L791m229M742n353O091p004Q165r694J1795j4853J9691
67A1348k8422M8628j66340j17039K84075l04189J73270J13759p161J82372k2854
78A67447q8739K9914n5146j80719L2259j8035o2127J69255o5700J64232O2380
89A55021j26449J10020p0791o9107o4321k2063J5605l4615P9544P913P2233L4878
101H7868o4172P9641p2737k5225n0610j1635L9309o5642N6598L2957J5767J0496
113C2615r427L7134m2014k5567m96j4567J5338m8321N6251j0314J7079Q693l3678
$$ y = [0, 0, 0, 0, 0, 0, 0, 0, 0, 0, 0, 0, -8, 8, -8, 8, -11, 16, -16, 24, -24, 32, -35, 40, -48, 56, -66, 78, -88, 103, -116, 133, -150, 170, -191, 214, -241, 269, -300, 335, -371, 412, -456, 504, -557, 616, -676, 745, -820, 901, -993, 1090, -1203, 1324, -1463, 1616, -1794, 1997, -2232, 2510, -2843, 3248, -3756, 4409, -5285, 6510, -8343, 11348, -17074, 31554, -134786, -251825, 32250, -271939, -98669, 15090, 7929, 190301, 167447, 78708, 108622, 53476, -127243, -94984, -113019, -175146, -5891, -71591, 92641, 155021, 28572, 138592, 67801, -1306, -65627, -87690, -72085, -106700, -27156, -19243, 52990, 87868, 23696, 103337, 30600, 5375, -45235, -56870, -17561, -83203, -26605, 6352, 22119, 32615, 23188, 60322, 18308, -7259, -7755, -22322, -6984, -55305, 946, -9368, 7711, 16404, -17274]
126a7274P3106n7661j5346M3774l3330J054q825J7269o139k982j143o510M3097
139B9090n8115M0063P329k1788K9340l7750K3950j705l9676J9155L083k655j3037
152b2716L5779J007q932K8571m0467L6979l6077j9221K1319k1626J2892n997K3824
165E335J1945p967J5744j5507J5263l5465o919J9372l6365K7880j0179K0961Q611
178A2709n987J4083r393M222k3430k329J2387l0381K4562p706J1092J2238j6741
191d674K5852j6963M294j2454L477K83j5062J5384o755M795P567j5558K4175j5571
205a210J896N332p078Q439j4432J1816r151K259k059n104J2825p890K540J2779
219A0962j0769J3087j2539L692l739q632J590n009Q935n724J0622N326r14N795
$$ y = [-17274, 55832, -1829, -17175, 26599, -6731, -5677, -14502, 2767, -3372, -6354, -7497, -14007, 29090, -29025, 11038, 18367, -3421, 25919, -11831, 12119, 10414, -29262, -10107, -7024, -9679, -22716, 13063, 14070, 5138, 33709, -6758, 30221, -5856, -25077, -3758, -25384, -12492, -18489, 5335, 17280, 9313, 25057, 9550, 24813, -10652, -17571, 1801, -34564, -6684, -16863, 4098, 12709, 6722, 20805, 11412, 15634, -7796, -10125, 2262, -28119, -3557, -11263, -171, 12067, -4674, 21178, 4215, 8509, -3945, -468, -185, -15247, 137, -6618, -1823, 5744, -9814, 14361, -1210, 686, 6018, -1060, 7379, -7053, 4763, -4388, -2129, -4188, -9292, 3533, -4357, -1817, 10962, 193, 13280, 741, 4433, 694, -7938, -6348, -11357, -2422, -8146, 2476, 7802, 6888, 12683]
233A2683o109l225j40j5326O625p883O913J89P023P341m41M976m946k777m784
248A19p871j548L02j781P751K063R118k152O694o315r06n161o532j915P79k699
264a0054O299M876Q59P031r21j944j171l384p960M060p054K312M194J975J592
279G10P791n251L314r05p280J641m310k544K653Q96L90N895p39K584q66J080n971
296i12L233o650J194K67j791L788L87J398K933j924J199q58l003J873m778K537
312a107k493K812j496L855j724K139M55j658O01M44m657M061l296j023M047m615
328c655M355p35J512r07K568k594J257j471n96j793K117m872N005j574L51M129
344C097k776L431j507p05j243p89k457M33j456K914j424N182k021M301j752o23
$$ y = [12683, 6574, 3349, 3209, -12117, -5492, -13375, -6462, -6273, 750, 8091, 7650, 12626, 7680, 4903, 119, -7752, -9300, -8998, -10779, -3028, -965, 8153, 6001, 12695, 6380, 5474, 313, -6219, -8134, -7355, -10054, -3755, 1121, 1980, 9011, 8090, 6146, 4975, 1591, -6369, -2309, -9363, -7051, -2857, -882, 710, 8501, 3250, 6564, 5659, -1621, 20, -4290, -6834, -4181, -3285, -2895, 3000, 2261, 4845, 3979, 5059, -912, 2321, -4329, -3135, -2868, -4659, -871, -484, 914, 3847, 1923, 3122, 2264, -739, 1134, -3644, -1107, -3600, -788, -2284, 1571, -153, 1986, 2441, 783, 1384, 1828, -2829, 1232, -2064, -3087, 960, -3655, 700, -35, 1477, 570, 3138, 544, 1801, 330, -266, -2059, 58, -4814, 191, -1383, -1032, 3097, 321, 3752, 2245, 1540, 297, -492, -2949, -2516, -3972, -1058, -2482, 2700, 679, 4980, 3228, 2605]
360B605q04l727k3k643K39J101J243L128K386j0K622m370K160o499N36l286P99
377d543O98J488L487J808J910L27j566q14l731l039O80l669M594j333N657N08
393B462K966j661J362m503j515j421k771J001Q33R12M023J481n84K990l577j89
409A809l784J046l675L426k978M453N32J31J226J00o58p14j295Mq60m21O65m81
427a474L304m935N903l775K334j064M32J011j407m87Q58j920J468l688K820M74
443a46k141M832k996N637m967K024q70k282q12k408J963M08k216P708l967O220
459E987l450r43L793r354M022n929L457j713M81O213j626M184j189j368M416j2163
475e182N952n992O42J610l323J0057m415N817j510J165N74r020M795m995j984
$$ y = [2605, 1801, -1926, -1949, -4592, -4353, -3252, -2009, 1119, 3505, 3495, 6117, 1747, 3907, -2592, -2056, -5342, -4543, -3845, -2357, 1130, 2938, 4848, 5175, 3609, 2795, -936, -3975, -3295, -6964, -2370, -3703, 1954, 2462, 5428, 3767, 5129, 626, -889, -2310, -5081, -4080, -3247, -2335, 1688, 3169, 2585, 5575, 1998, 1809, -1975, -929, -4604, -1178, -4156, 297, 829, 960, 2186, 2286, 1628, 914, -381, -377, -1237, -1658, -993, -1474, 1830, -3105, 2798, -977, 1357, 293, 725, 1736, 329, -158, 700, -1220, 248, -3440, -620, -146, -2287, 2545, -451, 5186, 219, 2243, 1373, -909, -1721, -4129, -2166, -1758, -3974, 3734, -233, 5987, 2537, 1594, 5387, -3967, 55, -5874, -2417, -4130, -3649, 2564, 938, 5122, 3933, 2565, 6981, -5182, 770, -5222, -4580, -2970, -6293, 3764, -651, 5166, 3656, 4821, 5395, -3625, 1170, -3825, -5809]
490e809L873n535J2122o417N543J272j440J591q329O144o896j52M71j157O758
505B039m396L500N046n022M196p479O418o606j506K299k726N071n282N562K486
520C600l335K704j764K790l537l343M719n648M557o772O363J43k904N137j386
535A324L166k650j528L099n315m46k513J716K277n294J0278l280N637l499R2K536
551E600p858p52j975N90j36j109Q422n39L625o79j000L594j2703M273n590R75
567e262o86J92Q741q62K763J393p20K83j0052L741m983j385K676k820J1994n650
583f37O349j73j20j375p288L188m149j881K573j097Q072m693N205J644l541K447
599D524q145O442o990M7K021q22M676k973L193K647m961L958n722M559m836r29
$$ y = [-5809, -1936, -7471, 4651, -1766, 3777, 5049, 3609, 5200, -3129, 3015, -3881, -4033, -3562, -4719, 2039, -2357, 1143, 6189, 1167, 5363, -2116, 4302, -2304, -3810, -1511, -4237, 834, -4448, 1114, 3600, 265, 2969, 1205, 3995, 458, -2885, 1834, -3814, 743, -6029, 334, 477, -2427, 2710, 1324, 4490, 1840, 312, 3411, -1904, -2350, -4863, -3147, -870, -6164, 4114, 834, 6471, 2972, 3064, 5600, -2258, -3010, -4985, -4395, -4531, -5640, 2782, 2243, 5868, 5189, 4189, 7783, -4920, -647, -6237, -5262, -5948, -5756, 2985, 2123, 4886, 6279, 5559, 5842, -4210, -469, -5452, -6837, -4161, -6981, 5013, -637, 5712, 5539, 5419, 4044, -3244, -56, -4205, -6086, -3513, -4610, 3462, -1231, 3974, 5618, 2077, 4524, -3621, 2821, -4169, -4122, -2101, -2923, 1753, -1220, 1973, 4620, -341, 3617, -2105, 2454, -2382, -3311]
615c311M469m538N257m859N205p12k166K593k134J549j560j989M779n267L863
630A179l567K900L78l818N652l686K812j926N25K051l376O77o81o33J850l984
646c647N603k848K219j99O2J950m327J524j297m56k32o11K598j44k21K637k023
663E88K732m392K408k070q09j31l89K554j282J459R18l06N51j812O44m86k269
680b092J822k389L497k927L007K33N3J26j061R03j245q81J75r0P97j162R49J456
698A171j370K146k669K977l012J021p31j92M34j018J267K29o06J442n42P83p73
715E57q03J040k641K443k713K471j205R68M62J33L68o07k07M03j802Q28q21K70
733h56Q92j262K965k009K021j223O2o11o34l96J82m53J707j289K325q78L44L08
$$ y = [-3311, 1158, -3380, 1877, -2982, 2223, 1511, -655, 1938, -196, 1353, -207, -2196, 2583, -2684, 1179, -2388, 512, 890, -2928, 2724, -962, 1850, -76, 449, 2500, -876, -199, -880, -1513, 337, -3647, 1956, -892, 1327, 1128, 1190, 3140, -1187, 337, -960, -1416, -1648, -2259, 339, 195, -26, 2611, 588, 3320, -1072, 1336, -734, -1543, -1674, -2063, 491, -791, 668, 1586, 1280, 1831, 19, 663, 177, -2092, -270, -2659, 838, -2089, 918, 1151, 1204, 1330, 269, 1172, -73, -954, -779, -869, -72, -1234, -285, 1171, -199, 1947, -722, 2255, -757, 264, -467, -659, -225, -1243, 24, 253, -353, 1089, 547, 1330, 557, -246, 794, -1847, 596, -2117, 354, -851, 117, 579, 712, 1080, 473, 266, 669, -1133, -305, -1126, -856, 36, -1226, 1739, -270, 1751, 528, 590, -21, -655, -1051, -869, -1322, 385, -904, 1421, 543, 887, 1195]
751A195j331J068k329J488j462Q32k41J062P1M26n10J280j927J256j739N07m69
768h23l95J149o59J556r30J180m17j62o00J13j063J206j693J525q61J391j22M43
786H38O9o87q8k38j61k70k9l1Q54q38J359j168J768j352O69p68J35n60K65l71
806f04J72m9L87M46l1P88j266J129j384N19q89N67q38Q47n51J407n22Q35m88L65
826H40l24n53Q4p24L30n43N48J45Q79p24R11q49J200j298N77j421M72l12M2O3
846f57M15N55L16J65k81N29p95R2j231Q85j254J255o71Q85k50P63k3K63o51J01
866D11n22m48l00j20O43o11J539n95J143m80M21n59O5j033K21j116Q87p27J058
885a23J88M17J009p91P10j330L68r46l53m02M36J28R61n15J730j419J468r17o39
$$ y = [1195, -136, 932, -1397, 91, -1371, -539, -780, 282, 353, 779, 269, 1549, -378, 878, -861, -354, -823, -1218, -69, -728, 828, -102, 1078, 661, 499, -101, 12, -1051, 155, -1538, -13, -874, 517, 395, 838, 907, 220, 132, -106, -267, -537, -566, -597, 257, -581, 778, -390, 1378, 26, 695, -73, 62, -498, -233, -604, -432, -481, -94, 352, 321, 1109, -157, 972, -412, 107, -782, -215, -1053, -206, -757, 650, 128, 963, 475, 840, 516, -37, 47, -677, -347, -890, -342, -197, 682, -42, 869, 20, 1220, -78, 499, -922, -450, -762, -720, -657, -242, 313, 629, 794, 513, 1042, 247, 339, -892, -7, -1261, -6, -677, 208, -42, 721, 698, 961, 310, 411, -111, -559, -859, -979, -336, -947, 592, -3, 1140, 660, 1081, 522, 587, -446, -225, -1341, -454, -1181, -123, 65, 482, 1491, 700, 1410, 80, 448, -498, -851, -1253, -817, -689, 272, -243, 1487, 68, 1536, 619, -20]
904b0lq92N87r78P78J90N57M60L26m87N85j157Q25j928R16r30M81p8Q42L27K16
925F17L06k74j09j54l83o67N84r69R79j064J586o13P40l57O95m70l60L9m20k56
945e50P0nJ9K53K21P48p93J002r48Q36j116K08m71J84k8L03k19O85j99P8L2L85
967F95l04j003N98p19R31j390J068n26P28J03M18J19l9n43n6m65J60n61J70M56
987a60o55J444o13J161j008Q14n15l73l11n71k4M26o00J122l64J199m03K6N37
1006A132j573J251j812R61j167L85O75m5O58L15l83R60j744J163j353K74k89r26
1024a518J561p96J543o14P87j69m92J92l90o22M46j370J535j204J191J56J82O67
1042A085r32J047j276K7o58J03K56l75J59J377q44J122j232J214r06j60j79l54
$$ y = [-20, -23, -915, -328, -1306, -528, -338, 219, 679, 1005, 518, 1103, -54, 771, -1157, -241, -1171, -690, -768, 74, 401, 617, 923, 649, 540, 386, 3, -664, -80, -1049, -70, -1134, 452, -161, 579, 222, 917, 447, 87, 126, -294, -550, -480, -485, -466, -213, 8, 756, -37, 965, 17, 853, -263, -55, -526, -342, -370, -67, -286, 399, 200, 278, 310, 695, 391, -612, -14, -733, 198, -1192, -124, -650, 78, 181, 599, 718, 679, 136, 80, -385, -225, -786, -616, -160, -815, 629, 16, 1177, 169, 983, 468, 95, -216, -787, -811, -385, -985, 137, -227, 972, 569, 595, 1132, -441, 810, -1002, -41, -1208, -823, -148, -193, 465, 780, 397, 1357, -387, 776, -577, -303, -592, -1518, 43, -753, 790, 176, 963, 794, 302, 494, 104, -518, -72, -1442, 93, -1111, 80, 236, 418, 1085, 153, 1200, -76, -49, -707, -604, -348, -723, -564, 813, -31, 1091, -141, 1073, 167, 7, -172, -526]
1060e26N69r23P59M04j40K08R5Q6J54j299J180j336J095j378O46J25j56O75o8
1079A70J13k67O0L52l63j90j12M8M64j053J319r38R37p57O20j01m72K74l06L41
1099A39j90l39N50l06M25o5k58Q43j461J207r55Q04o54Q6J61j78K23k03J31N07
1119D67q69N88j4j73L33o12J027j507J065q14N09j40o0J71J84j45L40m22M23r15
1139e64N83k97j21L95r63J620j096P51o6J65K0k55o36M40n05P44p64P93l20n6
1159a32P14o34O72r67N27n92L29m61N42l18P67r33J216q77P51p29M4J83m67L00
1179f5l03M69j46K80j13j71K57J88m55M41r25R10p20M76k28J70J87j38K7LJ84
1200C28n25L71j75J82m42P06o90N92m73K09l22J94k70N54k29L39q8r4j39j50J65
$$ y = [-526, 43, -880, -121, 283, 143, 351, 446, 532, 686, -613, 567, -769, 326, -1052, -406, -281, -437, 238, 170, 283, 16, 76, 428, 65, -125, -237, -189, 275, -778, 541, -397, 540, -217, 403, 302, -170, 104, -202, 139, -51, -390, 160, -146, 279, 214, -44, 799, -662, 545, -410, 394, -260, -174, -13, -191, 32, -171, -40, 467, -402, 186, 172, -1, 332, -280, 747, -760, 305, -509, 0, -140, -200, -29, 155, 10, 350, -72, 351, -564, 19, -278, -399, -4, -967, 653, -443, 308, 242, 407, 427, 172, -464, -24, -529, 215, -549, 244, -76, -132, 582, -52, 620, -347, 180, -412, -83, -544, -2, -320, 447, -486, 730, -147, 604, -125, -81, 102, -365, -65, -368, 101, -45, 235, 122, -49, 208, 396, -59, 382, -543, 367, -353, 123, -105, 65, 252, 114, 141, 144, 328, -197, 174, -1, 181, -261, 445, -245, 347, -126, 83, -239, -45, -315, 239, 10, 349, 261, 167, 28, -122, 43]
1221D3r3K3n36O57m23Q85q27P67l49K19m58L21l73J9m31K43K97J36J85l06N53
1242E52l73L85j111O80m34O9l68P19l55O33k47L34n39M9o6k00K80k77K74n11Q26
1263C20m10M13m70O66m23L83n73l17K93K22k50Q8n4M51k37j64N44o93M48l67L29
1284A99m14N07p48L51K6L06L4J25l55K88k45j92Q2l23N57n07j23L98K14jL18m99
1306bO06q38N79p69K72l24K51K67j26L54j23M8J41J17n11K64m29J55m43M38o52
1327g25N79J75N18l77L20l82k24K36m19P7j6m9K7R5j86P95m95K61J27p0n71L67
1349F3l70K90l19J30K6L54K65l4j32l37K08o8k27j39j59j00N22k41P03m94O31
1370E72k7k81j55k57J27k79M4j10Q06n73K83j2M32l95J23j71k14j75K4k74K35
$$ y = [43, -50, -27, -563, 94, -329, 556, -271, 496, 147, 366, -92, 229, -144, -125, -556, -313, -16, 120, 305, -1, 552, 179, 564, -547, 133, -301, -232, -600, 119, -236, 397, 150, 484, -55, -6, -72, -272, 8, -269, 5, -506, 320, -90, 323, -147, 519, 96, 479, -94, -411, -118, 104, -146, -58, -112, 339, 102, -62, 482, -211, 237, -130, 199, -215, 292, -456, -105, -79, 227, 261, 386, 31, 319, 74, -118, -36, -359, 198, -309, -432, -34, 180, 179, 497, -2, 604, -234, 345, -424, -152, -476, -225, 42, -84, 270, 147, 195, 336, 453, -58, 206, -223, -68, -511, -73, -725, -146, 29, 547, 170, 490, 108, -116, 120, -299, -222, -238, -287, -260, -165, -351, 444, -51, 210, 337, 267, -304, 63, -307, -17, -336, -206, -180, 174, 439, 405, 273, -64, 144, 76, -151, -290, -449, -549, -27, -268, 435, -59, 572, 545, 264, 109, -148, -21, -300, -256, -366, 440, -133, 150, 138, 570, 175, 298, 127, -87, -262, -238, -512, -277]
1391b77rL46k0K28Qj16N9k35K74n10M19m57L23j95M12k62N08m25J94k34J45m8
1413A28l53J22k10N13j73K58j52M76m62J80k77J48m08J46m80N13j97N83l55J05
1433A05L52m46L45o45K33j63j16J71j33RP20m90M96o10J23M11l74L03m38J64k4
1454gk14J43K14j63L66k51L10o86L21k18L6k2J0j92M38k06K7L50J98l45M4K2k28
1477e3J75m98L49m99M84o8J01p5K80l3N3m94L03j04j92pr8K79j02K59q8K57j00
1500A29K24k75K04m53Q0l15N70j37O8j6KL97k33K8n02K91m46N62m49L17j32L27
1522B41k81J74J20J06m34R4k38K6K61k74L33l75O12m71L57k17M05m20Q8k04J93
1543I6l58K47m12N08l40K24K31k5j56r3L98n40M14m29O7M2L86l15J81n93R24n98
$$ y = [-277, -286, 60, 40, 268, 276, 160, 219, -16, 258, -252, 167, -290, 33, -162, 250, -12, 496, 71, 265, 31, 176, 128, -225, -103, -313, 200, 27, 285, 133, 609, 147, 327, 50, 198, -210, -64, -544, -31, -228, 355, 0, 105, 457, 11, 356, -289, -56, -219, -335, -164, -297, -288, 432, -58, 438, -172, -49, 362, -12, 291, -147, 17, -7, -221, -78, 136, -27, 339, 88, 398, -288, 33, -185, -149, -171, -161, -353, 85, -121, -94, 256, 454, 109, 153, 175, -53, 122, -376, -27, -526, -42, -110, -9, -84, 196, 163, 216, -278, 25, -79, -271, -278, -376, -97, -199, 60, -28, 229, 129, 353, 78, 282, -171, -91, -406, 164, 27, 95, 79, 81, 478, 245, 273, -229, 62, -384, 178, -271, 46, -86, 241, -40, 134, 254, 360, -74, 20, -218, -192, 69, -205, 128, -247, 365, -106, 251, 34, 439, 19, 107, -97, 96, -262, -15, -427, 81, -259, -35, 196, 171, 15, -78, 320, -220, 194, -235, -168, -126, 260, -55, 126, -467, 457, -141]
1565a41K04l1J4K35l40RJl7J9K5M9L82l38K28m78M41m00L91l50k02J66Q7m6K48
1589A36o8K2R1j63K60l93J56m33N87n76P35n53P80l47l13J87j05o4K00j36J36
1610A39l83J79K08l66N75q23P47n18L77l68K62N9p4o3J52l91L16J31k34O5j13
1631a23L39m03L71n00M84m44M1N7M90m05K18j60J57M5k88J4p5P6m5%K14J3m08
1654c32L82J35j16k11K48l16K86l16K33J22R8j86K02j23L3L6k58J45l8P5j88K74
1676A85k06m0Q2j10L2K84j01k73J58J1r0j21K32k31K02k29L03k45K66p3K23j84
1698G5K07l66L47m86N13j52k58J7q0K10o9J18j31J20j82M1l74M64j31k5L2m4J14
1721d0J50m5o6K00l22K19O0k52j8k25L57j24m27R07q6j11j10q9K28j40l66N4P7
$$ y = [-141, 63, 32, 46, 281, -59, -50, -49, -86, -67, -42, 7, 389, 51, 279, -199, 242, -158, 233, -117, -319, -153, -66, -112, 136, 68, 90, 181, 18, 278, -115, 41, -392, 195, -381, 354, -199, 581, 234, -79, 108, 3, -61, 139, 3, 139, -244, -65, 143, -223, 352, -471, 276, -242, 135, -233, 29, 88, 14, -49, 103, -288, 28, 159, -75, -10, -123, 216, -187, 184, -316, 168, -276, -235, -178, 312, -93, 125, -35, 122, 167, -121, -107, -182, -106, -151, -151, 63, 76, -332, 50, 185, 69, -142, 106, -210, 76, -240, -7, 115, 213, 27, 229, 106, 139, 175, -83, 62, 24, 99, -89, 185, -21, -61, 21, -89, -57, 227, 126, -147, 11, 22, -68, -189, 43, -188, 14, -215, 88, -157, 109, 36, 259, 75, 282, -84, 263, -223, 290, 138, -120, -103, -183, 27, -42, 76, -55, 65, -117, -76, -450, 14, -117, -142, -110, -154, -40, 110, 65, -1, 199, -123, 96, 156, -96, -114, -339, 18, -106, -533, 374, 288, 177, 67, -22, 206, 66, -300, -246, -169]
1744a69M84l69L6L23J5j28l25NJ17M44p46N13m59J96N6N01p00N16k96O5l04P9
1766a46Ko4K61k07L95j62J60m6p5l64L57k30J69K3Q8k79M03j34k30n1K45qQk05
1790i0j67N05m80K88m40N55j92j1J70j71J32Q8l28M84m38j64L40l58K91k36O75
1811D53p12N21k99L70m40J75j67J18j93N3R3k1K99n7O9j28pJ03k15k45K91j76
1833a15J14q2R4J08j95P9L2K00k95k4k28K85l5O8j89K00q3M94n00K04l26K26j02
1856g0R2R4m16M66m61J83J25K11k53R9Kl9l71L82j45K80k35Q3p0L43m24P5r0K25
1880H6j13l12J99J10Q2k13J4M5J53J52K16m08J62m50L66k47M0P5L8K47l31N7K8
1903dj02N1J86j10j62q4J54N2L73p29P41m40J06j21M29n18J70j48q8K67j95J71
$$ y = [-169, 315, -54, -18, 305, 320, 192, -133, -128, -11, 433, -313, 200, -259, -63, -7, 494, -206, 310, 14, 79, -225, -146, -144, -208, 53, -154, 241, 79, 239, 193, 118, -246, 111, -119, 50, 73, 161, -118, 285, 151, -79, -130, 115, 107, 115, -90, -257, 248, -232, 56, -384, 171, -21, -32, 138, -33, 99, 187, -141, 343, -95, -259, 81, -277, 14, -222, 453, -259, 262, -37, 333, -107, 68, -99, 19, -174, -121, -28, -49, 250, 193, 262, 134, 127, 230, 15, -230, 61, -115, -1, -83, 11, 119, -76, 3, 35, 235, -60, -84, -312, -27, -62, 6, -183, 17, -66, 428, -72, 132, -194, 32, -70, 22, 116, -300, 166, -295, -112, 13, 224, -29, 70, 72, 33, -338, 44, -101, 179, -56, 27, -43, 300, -124, -49, -139, 86, -27, -339, -140, -30, 52, -161, -147, -102, 51, 203, 419, 11, 173, -277, 89, -158, -118, -43, -5, 242, -89, -32, -4, -106, -55, 131, 21, -141, -225, -71, -19, 354, -375, 366, -74, 32, -89, 340, -178, -8, -156, -244, 23, -172, -1]
1925al98N32l28P43n85J46k99K30k48pL03k26K1K02l8J24l10J53j1j96O42n63
1947a14K06l00J90l32M05j84K17p1K97j80R1M4j69K6k49L26k59j0o4L14n16M25
1969I3p9K01n73K18kj13K43j28J55j00J91M4j08j67K11k65L34m99M17k91K15n0
1991e3K02j46L57l36j47Q3r7K27k42J16j22P3K25j40p9K86m13J49P5q7j89L66
2013A08j75r8K77J70j14n4J89j98l9m6J35m16K18j86J85Nk7oL13l45P9P4L2k5
2037E6l52M75j86nkM8j86J39q0K46l58M46l51N4M4N8l4J42n39L33M45l76R1j20
2061a2kk92N11k44M01o64L63j58K99j26M5k08K32r0j03J23l9j3k20K42j10P7j31
2084a19K75n5L33l95K35l48J33O0o4j24PM0LK20P5k2k85K37j97J48n36L51p2J67
$$ y = [-1, -399, 133, -195, 548, -37, 109, -190, 40, -208, -215, 88, -138, -117, 85, 47, 171, -139, 14, 3, -193, 449, -114, 92, -208, -18, -350, 55, -129, 88, 17, 314, 134, 225, 269, 100, 126, -123, 203, -56, -66, -130, 184, -332, 93, 14, 215, -358, -140, -142, -255, -12, -140, 15, -85, 106, 150, 42, -125, 86, -179, 155, -344, 73, -218, -3, -53, 149, 3, 360, 24, -123, -40, -137, 90, -152, -36, -158, -85, 140, 0, -79, 207, -206, -57, 18, -69, -258, 108, -67, -165, 112, 282, 168, 114, 303, 105, 66, 20, 155, -261, -43, -229, -44, -39, -66, -72, 241, -104, -25, 49, 81, 56, -296, 179, -7, -12, -14, 34, -152, -13, -93, 153, -205, 241, -110, -56, -12, 46, 12, 154, -385, -52, 393, 17, 108, -12, -14, -306, 205, -39, 362, -302, 61, -97, 202, 76, 121, -87, 145, 55, -48, 75, 36, 23, -197, 45, -65, 12, -119, 156, 101, 434, 39, 274, -74, 59, 119, 55, -69, -62, -22, -19, 201, 276, 254, -31, 206, 9, 157, -379, -28, -100, 67]
2108F7j72L31k91K28l97K23m0K4J41l68j7K92R3j95k5l7J24k7P2k14K10j86K12
2131D8K6j93j0o1J84r1J0J67j92o8J38j25K40n6k66L84k5k54Q6J92j35o7J51j93
2155a10Q4N6k16K01j40R5R7q6M2J59j81K89k52r0m9j29K72m15M41J0k23j02N65
2178C18m29K15k40K96n4j38O4k7j08L12J42q7j65k1J25l46K28l4M0p7J43k36L30
2201B51l37L16l45L67l08J74k17qj9k4l61M17M71m88M94k22k8j09j78j39M11j20
2223bm9r5K94l52M97n21P4RK2O7K31j33k67J85l0J09q5L21j29J6j82L19m76J56
2247b1N7j76J66rQ7j20J1r1L13j94o2j57J49k34N28o77M54k80K42j01J63j84J36
2270@k4JR1j74K15k48J81l75O56m95K80j07K60l30o7J20j23L13j64j15L21j19
$$ y = [67, -105, 226, -65, 163, -234, -11, -51, -27, 114, -254, -271, 21, 114, -81, -106, -143, -19, -46, 26, -188, 22, -164, 48, 74, -119, -129, -190, -6, -97, -87, 80, -112, -180, -42, -167, 73, 17, -249, 135, 110, -144, -58, 134, -1, -68, 83, -110, -26, 30, -186, 15, -125, -30, 67, -19, 23, 182, 1, 290, 38, -52, -101, -230, 42, -373, 68, 78, -145, -247, 318, -111, 104, -136, 160, 106, -32, 32, 5, -103, 209, 351, 264, 99, 78, 203, -143, 85, 51, 91, 14, 157, -79, 251, -86, 230, -115, 252, -56, 118, -99, -107, -126, -150, -511, -94, 377, -111, 383, 161, 133, 24, -154, -293, 118, -2, -51, -146, 148, -204, 293, -228, -154, -145, -123, -56, 175, 42, -225, -40, -70, 39, -46, 275, 146, 162, -20, 299, -177, -21, 36, -140, 26, 17, 104, -16, -5, -96, 217, 23, -39, -196, -47, -281, 247, -430, 24, -256, -14, -115, 48, -136, 0, -24, -23, 68, -106, 109, -139, 42, -333, 323, -172, 108, 1, 261, -69, -136, -16, -139, 174, 10, -105, 216, 97]
2292I7R1n4k38K46q4J73m34j21M42L03l65P3K2j40K5j66M14l84K40l46L67l06
2314a45J69J35k8j98K94j55j11l6J61k51M43j65kk83P0Q7K31k04J63l50M3J55
2336B3k93M31j51J30o3j22n5J30Q1J17k05K94m37J31J42k35K71l17K57q1K43m78
2358a87M17l35R4J24j24j32J48j32O1j7j94L42j55M06k55o3MJ92r1k27l7K26N6
2381A21kl86L61m21K23M9j04J45q9l5LQ3p4K9k81P47l43L18q7k33k8K24j48Nk13
2406a36K34j55P1Q8j24L62k95P4k5O0j75L9l57M37j40L10m26M35j40q4J11l59
2428a95L34l47J90p9j15nL50K21k40N4J54k90R9J29j80k05L41l77P5N17n35L15
2450B11k96K23j92O5o5M2j65Q1J50J83k62KJ83m07qm3M63m43K30l14K34J45p1
$$ y = [97, 188, 134, -104, 142, 58, 231, -203, -324, 118, 421, 56, 129, 151, 11, 36, -130, 284, -100, 140, -206, 161, -145, 24, 159, 131, -67, 227, 72, -39, -75, 86, -165, 278, 113, 111, -172, -102, -15, 216, 12, 175, -175, -132, 23, -270, 161, 10, 140, 77, -45, -100, 30, 111, 228, 23, 317, -120, 11, 153, -82, 189, -128, 129, 48, 291, -187, 230, -105, -11, 113, -11, -143, 5, -127, -66, -83, -277, 65, -90, 316, 61, -2, 2, 194, 103, -124, -161, 65, 121, 119, -267, 94, -327, -104, -55, -159, -14, -103, -138, -135, -52, -126, -97, -378, 369, 26, 344, 257, 24, -4, 220, 72, 77, -136, 98, -57, 14, 102, -22, 340, 45, 119, 94, 154, -21, 18, -339, 98, -42, 268, -158, 277, 137, 53, 164, -195, 139, -208, -18, -97, -212, -217, 133, 354, 114, 168, 322, 32, 131, 260, 80, -125, 216, -161, -86, 431, -104, 211, -85, 138, -54, 11, -54, -12, -177, -96, 54, 237, -25, -23, 160, -247, -255, -298, 165, -278, -48, -362, -128, 17, -54]
2473e4J41r5L3j9OJ14J09j67k8k68K40r8K53l42J04j4j50k7M80l39J08K0J72j37
2497D2j76q1l8J44p7L79m37J83J06j76p7L95L8q8l04O1K4mJ45j5O6k10L9J06P
2522E2m9j9j11R7j56J23O2O8j91L8j47J02J01m1n9J06mJ01L0J90l61j54L44O0
2546A82L6k63J46j06k2j22K52k90L73l78J67j4L41n03O05m71P0N6j31J08j12K19
2568A43k46L07l33J88j25K47k17P1k41J40j86J16M3K81j4p1n9O9j27j23P2K32
2590A67j64J08n9j62L26m85L51j40R3j16J35k81K19P7l13M32n4l00J95R5k49L16
2612A91j22j54j50R3K90j86R8N1k40J26j45M07l14K03k33q9J49j43K19j27K15
2633A39j41K4K4J10j45l1jn6K88j82J45j37j22L96j41o4j80j5K20l50K87m23L36
$$ y = [-54, 87, -8, 25, 6, 12, 126, 235, 68, 40, -228, 12, -86, 167, -175, -71, -85, -235, -262, 218, -121, -13, 7, 179, 42, -134, -215, -253, -109, -186, 193, -244, -61, 45, -131, -208, 187, 225, 137, -167, -106, -82, -86, 59, 44, 110, -100, -61, 45, 52, 3, -16, -127, -30, -186, -63, -1, 67, -124, -86, -233, -131, -30, -71, -130, -24, -28, 73, 103, 293, -68, -222, 122, 182, 218, -45, 101, -5, -27, -149, 103, -187, 186, -192, -25, -39, 302, -201, 404, -67, 3, 59, -72, 36, -76, 143, -103, 204, -129, 59, -66, 181, -36, 35, -206, -66, -252, -136, -93, 188, 174, 103, 44, 113, -14, -137, -65, 167, 3, 111, 52, -110, 216, -269, 82, -58, 35, -81, 54, -227, -8, 69, -244, 188, 134, -166, 29, 124, -125, 191, 69, -85, -235, -142, 148, -38, 60, 111, -129, -3, -148, 259, -55, 148, -85, -174, -25, -168, 51, -76, 139, -2, 22, 46, 156, 11, -20, -21, -77, 211, 29, 174, 37, -85, 311, 170, 106, -74, -89, 131, -219, 68, -355, -19]
2656a9n0J58K2k24J39k74J15J99r8O9k9%L22n84M78m15L80l73R1K27k57K54j57
2679b6j77J77J19k54R5l0J36q5j21j56M06m24K70Q7n1P6k0J69l25J46J64j54j49
2702a27l9j00L24Nj6l5L4p2j64J39p2j03L17j99j16K22k45J57L3k26N55l53j25
2725b06N05n22N87m82J40J3j83K76l3K2k76J48mr0krk1Q1J30ll48K78n6K24k33
2750f4P8l00L53R9k15J23l24L38j46M1K06j94k23N18k61p8L8p9p4K92j3k41K74
2773A48p5k62J65Q9NL63j67o74L67L6k20J11J8M03n34J51K01l74J39J60n7K9K01
2796B23n1k12j40M72m46M37n04M18j52M3j51j07J00n1P9Lj2P4J71J19m06O9j27
2819a51j16L94K78l67N1j61M40k11q9j36K6P6k2l4l17L98j6k81L20r1l6m6R5J31
$$ y = [-19, -69, 89, 111, -113, 26, -248, -133, 66, -32, 37, 8, 8, 330, -254, 224, -191, 189, -184, -93, 134, -123, 131, -26, -203, -26, 93, -161, -66, -96, 40, -45, -166, -322, 84, -340, -70, 17, -34, 42, 22, 191, -134, 12, 176, 22, -127, -166, -266, 58, 63, 47, 12, 46, -26, -190, -51, -123, -226, 91, -108, -224, -2, -247, -90, -57, -283, 272, -81, -206, 299, -223, 364, -118, 22, 35, -148, 128, 95, 117, -159, -11, -15, -105, -107, -116, -137, -56, 74, 71, -277, 1, -55, 169, -64, 14, -286, 67, 166, -49, 74, -250, 88, -58, -17, 189, -5, -228, 290, 29, -49, -11, -90, -164, 128, 115, -126, 148, 73, -189, -24, 65, 70, 433, 266, -408, -41, -5, -225, -114, -96, 307, -227, -76, 125, -249, -110, 50, -7, 22, 223, 172, -40, -180, 292, -154, 283, -221, 197, 45, 88, -63, -170, -70, -121, -42, -39, -51, 23, 194, 313, -93, -24, -151, -267, 127, 405, 38, 89, -72, 368, 157, 68, -68, -42, 34, 12, -22, -339, 59, 43, -238, 82, -9, -45, -91, 4, 135]
2843A35k66M4K10l96L18P2r9N3j03J39N1J24k40mj60J36j81J56P1j39m4L32%l12
2867a03L7J26M3j8r4J06p0k7k2l8L00k07n4j12O8N2m7K93l28k13K91n0J02J02
2891A37k29O1%L39l21J74j68R4L8k96P0J89k01M84j62j31p6j09J65J00O0r8M1
2914A61J45n47M75k06J66l15j61M50j34R3m36K01L62m2j79j89K77o7j14O7R3J08
2936B08k28Lj67j92K67l5K34p5J8r3O7p0K3K25r9K45m68L38KQ6q7K0j87k5n7J91
2962A44j72M3J64l5Q1j37k1j8J32l04L94l07J80l07L41q4K42l38J29l35K37J12
2984A41Qj53jk5J1Q4k24K73j93K18j88K01Q0k49L6J02j20K05j36j26J38n3J10
3007A39l09J34Q5j11k96Q8M36l02J18O9j50M13k26NJ25k17mN8k3k9K1N3J26r6
$$ y = [135, -131, -87, 123, -273, 45, 117, 18, 71, -32, 107, 158, 282, 42, 38, -122, 14, -167, -11, 60, -79, -123, 209, 209, -103, -66, 60, 103, 85, -9, 97, 27, 0, -22, -60, 240, 33, -21, -133, -65, -13, -60, 233, -95, -308, -17, -67, 35, 137, -92, -31, -31, 308, -13, 161, -7, 87, 125, -171, -101, 88, -113, 371, 209, 78, 2, -107, 58, 158, 218, 120, 161, 306, -241, 234, 28, 194, -121, -282, 168, 34, 127, -309, -108, 254, 212, 33, -156, 121, 54, -60, 7, 100, 208, -20, -17, -184, -376, -109, -144, 90, 15, 33, -60, 7, -63, -40, 185, 86, 331, -137, 201, 203, 289, 202, 222, 35, 10, -47, 144, -28, 15, 179, 144, 225, 88, 67, 49, 181, -123, 271, -36, 144, -163, 178, 94, 336, -2, 127, -208, 29, 141, 149, -4, -5, -30, -19, 65, -159, 114, -79, 139, -49, 152, 232, -17, 19, 121, 1, 206, 70, -56, 82, 29, 139, -170, -36, 49, -62, -358, -270, 166, -136, -18, 51, -99, 314, 88, 93, 218, 1, -3, 55, 32, 3, 24, 77, 203, 107]
3031A07j87J75o8K79l12R5M2k17O1k4L31l05K91l71L19j93j22J24j53O4j19L18
3053A35j36k7j20j79M30k9l2K63m25R6j77K51R5l70L40j9j46k1N1j2K23l18K59
3076A32m3k0j57J29r4N9q6L2j00K72k1K06k89J8J80j75j02J5K24k06J0j30M00
3099B54m6k19nJ43k26K83l48L4K40m15J44J81K40k08r1J84l57O5L7L9J45K00l04
3122c0j79K18lJ42m8j05O7M7MJ38k08j05J96k50N6J48J44j01r8k4P4K88l39j02
3146g0q3nJ13N5j29J52k68M93j34J4k2j94j7j17J52J04k09J51j91J46J5R0N0k59
3170a63p7J80J22j42j77K70r8J55j62O8J99j60k11J11L27j26j84J59J46k15J52
3191A74k5k93O5j81M52j19k52K24K76k77n%j28M4k05M26q6l12R0J2N7J97k12R3
$$ y = [107, -80, 95, 27, 306, -6, 89, 131, -86, -25, -49, 282, -23, 268, -103, 216, 23, -99, 25, -128, -64, -183, 135, -1, -28, -148, -327, 103, 74, 42, 305, -120, -24, -201, 50, 145, -225, 115, 96, -50, -71, -20, -32, 191, -127, 132, 89, 69, -88, 41, -53, 6, -80, -48, -148, 124, 103, 309, 20, 38, 218, 43, -59, -44, 180, -26, -16, -146, 254, 208, -11, -16, 127, -99, 184, -164, -130, 110, -305, -161, 20, 260, 52, -39, 145, -212, -147, -110, -71, 74, 274, -30, -209, 9, 6, 148, 100, -5, 62, 109, 113, 251, 43, -62, 134, -116, -60, 88, 232, 131, 33, 9, 83, 371, 32, -70, -153, -158, -45, 10, -119, 33, -235, 258, 124, 138, 116, -78, -95, -212, -60, 44, -165, -14, -205, -59, -44, 46, 96, -163, -240, -60, 62, -80, -257, 13, -85, 70, -92, -24, 175, 15, -196, -85, 242, 116, -68, 91, 237, 22, 174, 149, -144, -79, -260, 192, 73, -179, 45, 321, 44, 39, 39, -89, -45, -250, 176, 90, -222, -132, -120, -63, 134, -78, 15]
3215A5k2J17j48p3K33m1k34R3l3j14K15m7J39pK31k58k7%P4k00Qj21J84j07K52
3240A29l28R7K06j76J48k59L93l17J92j53k3m1%o6K63l04M7J56K67k94Mj81L13
3263G3j5l08K52j25n1K35R5o85K47M25r5J73l97J75m9K50p8k19j72J23K31L7J32
3286B54k84j98J28k2j24P2m0j40K45m2L17J9k31J79k99K6L70q0p5q1j40K25l8
3309D1m3Jl9Q9l53J11K13j74J24O4r1m1M1L8j78L40k09K7k02K85pj56l4K45K6
3334A18j33J87j55oj73o1K06JL2Q1k71L43k40J8n0M2J73k47M1K59j30J90k83J42
3358H4j80P1q8P6J23j39j58N9m8J73J2K9Q5m5o0j27K54K90l47k05J85j9J18m12
3382b69L05k3J48j82k3J09l03J17R5L5l7mK72l43J66j38k8L2R6Q0j27Qj65Q5l3
$$ y = [15, -7, 110, -38, -111, 122, 81, -153, -60, -93, -207, 8, -39, 100, 93, 324, 66, 39, 39, 113, -87, -79, -200, -16, -123, 129, -199, -102, 104, -72, 76, -183, 210, -107, 85, -68, -91, -132, -132, -198, 65, -239, -192, -36, 231, -63, -59, -240, 73, 58, -250, 2, -123, -174, 61, 156, -529, -282, 143, 48, 221, -176, -1, -50, 200, 122, -97, -269, -146, 85, 122, 254, -30, -228, -100, -122, -246, -174, -214, -354, -109, -151, 166, 185, -46, 133, -166, -140, 230, 150, 75, -6, -146, 79, 41, -2, -1, -40, 49, -304, -193, 20, -154, -30, 34, -57, -98, -57, -19, -197, 143, -66, -39, -241, 44, 37, -119, -153, 92, 118, -15, 172, 17, 11, -162, -223, -17, -16, 16, 97, -174, 169, -71, -53, -103, -61, 112, -135, -94, 165, 35, 225, -58, 84, -96, -25, -113, -37, 86, -53, -211, -152, -200, -27, -15, 14, 99, 54, -6, -133, 121, 411, 64, -141, 44, 25, 143, -269, 36, 13, 161, -21, -44, 65, -238, -121, -26, 9, -28, -32, 240, -103, 63, -75, -103, -71, 25, 105, -22, -14, -179, -94, -127]
3407a27J69k08R2J41K40l22J09L2j63K58j13q1k36m8K75R1o2j8j46q8M06l62K77
3430A16j90l0K55P8n63M98j13K8J82n38K47j58K35j26J67j23J9p1J76j49Q4J00
3452A24L1J81j70j33o4j24J77j77l6J78R4j79J2M4K32j60j67J76k33L06j06j75
3474a69L08P1n1j48J3J46Q5j10j47J21k57n8J81k42M50q7J13l96J02M93l19k4
3496G5l5O6q9lO3J05j33J17k55K50l27J64j14n5K12k11J79M0N7j14L5J2j5K4l7
3521A1J56l42o2J80k2J71j11n0K65m03K79q3N9r3J44j5p9l0N4Q1J1j39J19j80
3545g9L96l06O9k14J36m6j82R9R0P1j26P2j10L01k25J24Q7O2l68L08j24J80k63
3568d8R2k6k46J32q7J4J75m1j59%Q2J53k28M85j20j93P9n9Q5P0k30K32k17J31
$$ y = [-127, 42, -166, -74, 67, 307, -15, 94, 126, -37, 221, 108, 27, -209, -257, 18, 109, 47, 29, -117, -205, 201, -161, 116, -74, -104, 151, 229, -334, 164, 51, 79, 261, -277, -30, -188, 47, -79, 88, -35, -16, -87, 89, -60, 24, 124, 155, 336, 166, 33, -31, -155, 22, -155, -191, -13, 81, -98, -86, -42, 190, 30, -137, 39, -194, 112, 6, -169, 139, 210, 159, 11, 24, 170, 255, 145, -2, 119, -138, -196, -15, -257, 193, 106, 219, -177, -75, 418, 99, 75, 40, 106, 17, 14, 77, 182, 49, 166, -89, 161, -166, -2, -116, -171, 41, -170, 9, 49, 106, -8, 27, 39, 24, 48, 11, 167, -175, -237, -57, -79, 92, -19, -69, 196, -207, 72, -11, 48, -45, 99, 84, 5, -25, 29, 110, 121, -18, 101, -79, 317, 11, 80, -134, 2, -44, -226, -127, -37, 34, -92, -20, -130, 171, -54, 70, 157, 219, -149, 159, 35, 215, -48, 44, 18, -228, -96, -183, -169, 6, -35, -194, -194, -112, 41, -187, 298, 178, -15, 64, 5, 90, 160, -70, 162, -55, 76]
3592G6k02J65LPJ78j62R8j76K06j27J86m69L70j47J96m91L47k35L77j59J05k27
3614h1J95l30K90J82k96N5q8R3J58P1m88K98J33l9k63K2J12O5K8k30Q7n0L19l07
3638f4k35J93mO7Ko0J63nj03P7j57J23m1K27j05k60J90J8p8o8L08J29k95o7L2
3663a3J18j02N4j59J19k81K53p0J36j36M4Q9k85L93j29J94j37L75p1m55j5J61
3685H3k4j62J55K46k82n6J04j11oR3j41lK15k98L17L4J47l29K8o5J66j43J13o
3709G5o1J47j93N2k04J74K11J42m18J91ML6L5k04r9J59K64k07j08k77L67p6p5
3732f5L28l04o4L02j03k37J17j49J23j27N2l2M6J64k5J60m44K75k83L52k67KJ99
3755B0m5J83l15J57j2K88l60N0J03j48J12J24k72J26J47k40J2m3K39k46K13p7
$$ y = [76, -126, 39, 42, 49, 227, 65, 163, -13, 193, 66, 252, -217, 153, 6, 202, -289, 58, -177, 200, 41, 146, -81, 114, -216, 74, 256, -40, 15, -73, 20, 178, 249, -239, 59, 192, 153, -110, -88, 24, 89, 117, -113, -26, -76, 243, -64, -299, -106, -110, -43, -41, -101, 62, 57, -46, 31, -126, -3, -44, 183, 78, -182, 8, 26, -52, -120, 188, 317, 22, -45, -13, 105, 3, 57, -102, 17, -264, -11, -81, 55, -81, -37, 52, -233, 160, 31, 225, 88, 463, 392, -63, -78, 83, 59, -103, 52, 298, 16, -40, 64, -47, -53, 40, -101, -104, 111, -187, 130, 164, 311, -18, 10, -55, 111, -32, 81, 75, 14, 161, -32, 20, -184, -10, 201, 343, -75, 116, 120, 156, 191, -13, -112, 47, 311, 104, -4, -281, 86, 10, -65, 263, -41, -105, 197, 94, -143, -26, -175, -52, -179, -127, -159, -113, 51, 26, 186, -258, 17, -266, 86, -181, -179, 20, -25, 158, -157, 0, -12, 276, -84, -34, 69, -79, 33, 157, -115, 11, 158, -82, -70, -113, 126, -120, 93, 16]
3777A6J68m17Q0K33R7j41K7O5J82k33j52J9J48OO9k3r5k2O7k01k38M55k7J4KR2
3803A91j53m5k3Q2l71L37O6j3p0K4m8J98j11l48R7j06J74M9m5K14q2q7K14j31
3827A3K85k90q3J74k78K21M6k27K3j68L39J16n13K67JJ06j30L39l57J82P2j1k93
3850a66L68j10J12l5l57P9j09K84q4J26k07L03l18j83K08J46k45K40k20K45K63
3871C40l78j49K62m5R5M6l95L69mm33M03k6r7p2J4J10l09K76P9k28j7KK79n6O3
3896A29j24j04K37l5j15q6O4j33O6M2m6J1L08j62p9J69J4j95j98R3pL46j01n2
3920D2J22k14M1N1K05k38J17J36j87j66J17J08j45j83K70j13J47N1k40k9J05K2
3942A9J73l90J50k93p7N41l4k34R8o1J43r1K60k68J19L2j72j8L69j97J57k10j02
$$ y = [16, 184, -233, -153, 80, 177, 36, 63, 128, 310, 77, -75, -56, 92, 98, 167, 144, 49, 27, 94, -107, -345, 110, 83, 97, 99, 191, 38, -7, -30, 52, -319, 18, 84, 71, 1, 25, -23, 175, 64, -284, -187, -293, -119, -70, -115, 99, 17, -70, 144, 13, 298, 8, -75, 99, -179, 42, 88, -139, -116, -284, 55, 171, -342, -75, -74, 32, -98, 241, -116, 66, 138, 127, -166, 202, 92, 204, 169, -188, -109, -218, 66, -18, 108, -99, 204, -114, -297, -89, 57, -188, 52, -168, 77, 340, -38, -187, 75, 30, 125, 171, -224, 145, 141, -292, 111, 85, -12, -84, -70, 40, -269, 7, 86, -142, -159, -157, 122, 66, 129, 5, -99, 138, 103, -12, -98, -34, -167, -101, -59, -105, -94, 214, 52, -27, 142, 156, -39, -237, -144, -151, 195, 94, 42, 164, -50, -9, 42, 247, 9, 126, 262, 75, -91, 26, 134, -11, -194, 76, -37, 110, 161, -79, -108, -3, 19, 192, -198, -48, -341, -418, 123, 89, -145, -47, -108, 35, -56, 204, -64, 55, 87, -85, -103, 266, 69, 226, 16, -86]
3965h6L86m10J20O5k16q5J86j75L21k17O9j03K71l73L3j14K65r1J10O0J05K14
3987C35m73O6j18K55n7Q8q8q2O1J78J12k74K9J8p5O4K23m47J16J15j34P5o8K11
4011A30k53l7L70j40j15l1m8M30l52k62K97j6j48M7K07l0o6m4J13j39O5J39l67
4034b50j32J97J59PQ8q1Qn5l9R1j8j58K47K3p4r6p3J80kq7j3J59j67N5j9j71j5
4061b36m7K55N6O0k77p9M98k65j67QK43n2O9p3Q0kj24j3j00K29j54J84op0j7j84
4087a84L53j99J02m92M17r4M8p4L24m2k41K20kj37J6k04K9o8O7oQ8N8l8P3m3J82
4113A53q6j92OK79j53K6P0j38J64J36l76N9j7n9J45Pk34j0L34j29Q8m1M8k93l2
4138b45L7J28n6R7K74n05R4J97rK24j37r0J33rJ03l27J48j01J04j02j48Q6L13
$$ y = [-86, 300, -110, 10, 75, -141, -226, -40, -215, 106, -111, -42, -145, 126, -247, -214, -328, -63, -154, -44, 16, 121, 335, -138, -72, -190, 65, 8, 96, 8, -74, -13, 165, 277, 3, 32, 50, -25, 39, 262, -185, -69, 46, -88, -13, -81, 130, -123, -160, 210, 70, -45, -76, -124, 306, -46, -308, -11, -27, -175, -128, 79, 49, -17, -61, 52, -87, -22, 117, -250, -382, -185, -26, -19, 69, -12, -4, -59, -98, -7, -25, -183, 64, 87, 13, -83, -156, 24, 22, -65, -78, 81, -86, -31, -50, -221, -236, -283, -28, 28, 88, -189, -268, 230, -35, -202, -194, 49, -3, 66, -7, 73, 71, -53, -66, -166, 63, -91, 93, 87, 17, 0, -184, 169, -30, 72, -420, -3, -97, -49, -123, 201, 159, -82, 138, 136, -1, 15, -189, -160, -228, -161, -167, -79, -21, -59, 14, -29, 153, 67, -125, -119, 160, 7, 33, 103, -35, 129, 265, -111, -52, -69, -128, 17, 24, -210, -220, 114, -15, 73, 32, 80, -213, -245, -208, -80, -136, -39, 235, -270, -176, 21, 12, 236, 99, 9, 142, 133, 236, -91, 57, -44, 60, -42, -190, -104, 209]
4161B09m4l75K9O9L46j84MM9K33m32M2K31k78O4J24l4j7k1K82j96k60J95R3m41
4185c12K10N0L02l72L65j77l94M28k91K03K02r9k01M8Q2m8J83k69O4J10k4J01
4207A61k08L30n43J73K32N7J4l47K86m04K54j66K02J32Pj67j25L51l06R7o2P0
4229C8K11lj19j13NJ1k3k7M28l76n2J76j9R7k43R6j26J91J06j99p2L13n39L71
4253A32l41L27J45k91K3j87K25J36j61K3k4pK33k43k14J43p7J46j83L32m03L3
4275b33J44j21J51r9L89k73O0j46K1K03j5k44M51n5p4q9RK14m42N01j45j05M7
4298A49m9j10J30j52m8j21L70J27l32J48N1j67j15L5MP5J21j58J54k18K63k35
4320g8Ko1L58l60J7J63k49M90l7l32r6QJ41K0N5N4q1J36q4K48j14j74J10kJ25
$$ y = [209, 165, -210, -181, -112, 234, 50, 54, 103, 336, -96, -54, 177, -101, -37, 87, 53, 36, 15, 297, 101, -159, 36, 129, -312, -102, -52, 250, -122, 243, 66, -328, 100, -191, 12, 214, 115, -86, -38, 44, -4, 179, -90, -26, 84, 60, 161, -47, 283, -260, -87, 145, 202, 216, -131, 155, -249, 5, -161, 41, 173, 180, 13, -112, 239, -67, 30, -32, 38, 249, 246, 127, 14, 19, 30, 7, -20, 408, 32, -20, 156, 137, 234, -9, 87, -39, 152, 258, 59, -13, 300, -239, 132, -209, 118, 263, -28, -5, -192, 33, 169, 8, 31, 7, 0, 233, -10, -224, -81, -158, -12, -195, 137, -266, -233, -89, -210, -59, -158, 231, -42, 18, -128, -107, 96, 81, -163, 288, 233, 159, 70, 79, 293, -149, 352, 207, 102, 149, 100, -10, 120, -32, -80, -201, 169, 296, -36, 112, 163, -4, -119, -84, -80, -5, 116, -42, 112, -106, 157, -78, -76, -137, 221, -139, -122, 41, -208, 282, 245, -87, -183, -175, -34, -14, 41, 95, 14, 150, 66, 314, 200, 26, 136, 134, 259]
4345B59l09k48J68K57j3J16j77K6Qj67J95k17K88l62J99k19M28m31J07J96r8k06
4367b00K5o9R0j18L07p0J71j14K19p2j22N1k39K66p7Q2l98J75k0K23j64J87N1
4390A84j35j48K2J26J61R5j63j44j02L7j94M46r4j77J85k37K24K42j47k89M06
4411B98l38N2J39k30j6J90k19L1O1j8j55J19J83pk11L1J92j92J33p5kj14K10o5
4435cP5k25R2K21l33K45n7j32j71J35L33o0j61o3J31m3J08j95J09k2j04J28j75
4458a67L65j22m4J79k06K04j01q8r4m2J17n7K1J99k58K42o0k15J49j52J25K96
4480B91j37k80J91n3P1j90j00L54r5j3O7k27Q2O9L1j02J82j83k8L21n8m01L54
4503A46j38J80k36P3J47j76P3k75L65j32jl9J34j5j30J67K26n11MJ58R0k87M53
$$ y = [259, -50, -298, -130, 127, 114, 230, 53, 79, 87, -80, 115, -102, 186, -176, 23, -196, 232, -199, -92, 104, 6, -200, -175, -244, -154, -272, 35, -35, 136, 22, 241, 169, 47, 98, -141, 125, 48, 130, -268, -93, -113, 110, -54, 133, 184, 49, -99, -77, 49, 210, 305, 142, -2, -104, -67, -261, 185, 91, -86, 99, -138, 86, 328, 181, -108, 298, -40, 12, 151, -79, -95, 95, -124, -93, -32, -50, -205, -86, 97, 90, -121, -90, 102, -90, 43, -32, -34, -148, 62, -3, 72, -153, -61, 160, -173, 72, 15, -117, -288, -153, 180, 120, -41, -104, 27, -16, 92, -103, 6, -16, -120, 8, -167, 198, 76, 32, 211, 5, 209, 108, 20, -74, -116, 1, -56, -35, 164, -94, 148, 88, -127, 22, -130, -5, 291, 154, -126, 65, 12, 83, -107, -207, 147, 52, 39, 106, -121, -39, 30, 61, -41, 141, -42, -70, 251, 193, -208, 146, 8, 188, -48, 25, 172, -4, 69, -206, 159, 27, 26, -13, 121, 106, -24, 143, 369, -142, -138, 20, 110, -177, 276]
4526B76k44j03O7R1k15K39R3l92J09J32j23kj44J32O8J94m16J78P0j75R9J53j34
4549d7k2M8nJ46k37K37J54l13j2k50L89n4l27P6J57O2j42N68m83Rj30K44m2K10
4573B36k81M6k7j13J25j56K16Qj21j72L25k39J54Q3Nj16O8J24p2m12K44L96m10
4596h9L4J82l19J85N1r4O7J24j1l33J09M8K10k61K35j22k21K38k58M11L2k15q6
4619h3j9P9l4J26k9P4J39k98j01k5J70m7L3K0L72k91O8k17qL70l94M23k03j55
4643c0K11Lj11j50J12k45K81j45K06j31M5l27J55K63j44N3J4Q4m9J0J55K0j81
4666I9j50j05K18j41j34J79R6j61k5J58N1j5J46r1j91P9K70k94k62J77K91l85
4688a90R4P3k6m4n4L99q7j2q5J00j19j15L2J55j35j01J89p1l9l8J80L9R0k93P9
$$ y = [276, 32, -71, -4, 87, -128, 111, 204, -188, -79, 53, -70, -72, -216, -84, -16, 178, -238, -60, 10, -165, -66, 87, -47, -69, -21, -26, 120, -117, 120, 274, -39, -51, -301, 88, 34, -293, -217, -60, 2, -140, 428, -55, -46, -176, 68, 26, 236, -45, 1, -26, -139, -14, -170, 46, 54, -67, -239, 86, -153, 1, 84, 89, -27, 41, 165, 93, -319, -75, 321, -89, -55, 127, -192, -7, 44, -50, 17, 141, 130, -203, -94, -46, 164, -97, 138, 16, -205, 33, -225, 186, 218, 3, -83, -102, -23, -57, 69, 40, 114, 253, -45, -146, -171, -1, -48, -15, 5, 377, 86, 154, -63, -71, 299, -95, 328, 125, -30, 181, 184, 73, -77, 35, -210, 71, -74, 132, 1, 46, -281, -126, 137, -7, 46, 60, 144, 95, 105, 260, 280, 99, -51, -156, 62, -79, -213, -34, 62, -99, -124, 34, 85, 70, 216, 125, -66, 13, 283, -11, -273, -96, 195, -190, -96, -23, -49, -93, -147, 252, 165, 153, 68, 168, 49, -66, -34, 121, -14, -115, 74, 3, -36, -74, 106, 145, 235, -58, 21]
4713B1j81K27j96K66J26k89J55k22jJ20k41Q1m9K06J61k32K43n4m5p2NJ09k58
4736a20J78mo2K0l0LO4j26r4J85R2n8N1J02k84M4p7J07NJ61l41K43J08k9j45j9
4762b6J67l58l0J44K06j70K37l88J42J02n3J08o8J57k90J44o7K89k55J14k52k75
4784d22L74j2O5m5j56P9N5K72k83J72J60n9j42m6mk76L43k25p8L68j77K06m9k31
4808a11k55K64J33J62j64J5k30J01L0J47J27j52j2j00j9J33j38J58l36J98J22
4829G3l51K08K09k59J52J03pm8j21n4J85J11j56r0m6K93l38J99n0j52J57k9j15
4852a26r8K30j44Q7q3L9R6J86j22L3j71k1n3%J13J81P4l42j88K71M0l9k04R8L07
4877A64k99J94o2r0J92p5j06K11o5n8j61K78j04k01L9K06L0p8j71K42j2j18n8
$$ y = [21, -160, 67, -129, 137, 263, -26, 129, -93, -94, 26, -215, -134, -183, 23, 184, -48, 195, 141, 96, 24, 29, 138, -120, 58, 54, -8, 12, -18, -15, 49, -77, -171, 14, 106, 48, 99, 201, -83, -39, -116, -9, -4, 157, -184, 59, 167, 138, -7, -26, 141, -217, -247, -103, 103, -67, 170, -218, -76, 26, -27, 81, 13, 170, -120, 24, -43, 246, -9, 105, -147, -422, -48, -60, 5, -40, -196, -117, -62, 210, -73, 99, 259, 200, 58, 12, 8, -268, 75, -150, -228, 140, -37, 169, 120, -111, -366, -102, 31, 193, 29, 44, -186, -85, -55, 92, 219, 67, 55, -45, -64, 69, -69, 89, -247, -49, 73, -278, -70, 139, -120, 32, 135, 128, 80, -41, -95, 90, 201, 45, -45, -91, 202, -136, 63, 13, -139, 18, -11, -126, -224, 6, -138, -51, -134, -95, 1, 187, 65, 98, -73, -94, -147, -147, -34, 147, 221, -121, -309, -38, 2, -37, -241, -143, 164, -135, 59, -3, -93, 99, 24, -82, 129, 64, 6, -155, 123, 19, -182, -143, 63, 93, 15, -156, 86, 74, -44, -102]
4900a02J9K45l02J85l25M59R0l40K39%j50lk18J79K4Q5r8J09k44M29m23L11k15
4923d6o6J01q3J42m6N6j32K09j82r6Q0N8l0K8O4N3J11k91R8J39k14j5o4j45L78
4948A07j94o2K89j57P9l64K40J8J77m52L49o1j09K91j19K85k99J3Jl5m42L70L45
4971B70l65k6J82Q3j26j70K19J41l51P0J0n5K8K13K2k71J99R6o2k36J10J26j60
4994e3k04M71l19J82l66K55J7lj6lJ19L5k68J84q1J67K9r0q3k8J61n2j07l6k7
5019a16K49j93J51q1l9J5q7K75j93N1j66L2J44k61M43l1j81k8Q3j91q6K02j47
5042a55J27QOrP8j04L0J84l41J22p9K98j87Kj73L13Q7k33R7j44N5l34J98k8K13
5067C1J39n4k69P8K03j27q6J59j37K46m05L41l57Q0K0j3K97j78J04k9R1k37k4
$$ y = [-102, -83, 162, -140, 45, -280, 179, 269, -71, 168, 168, 18, 15, -203, -24, 0, 85, -13, 96, -148, 281, -142, 169, -46, -112, -11, -94, 48, 2, 58, -74, 135, -47, -143, -63, -5, -35, -7, 57, 110, 221, -70, 28, 167, -47, -62, -126, -271, 107, -87, -149, 140, -17, 62, -302, -62, -44, 133, -319, 30, -31, -140, 151, 32, 317, 18, 31, 32, -3, -445, -75, 270, -95, -121, 61, 144, 18, -152, 67, 208, -143, -73, -63, -118, -90, 123, 145, -126, 73, 169, 107, -129, -19, 107, -53, -257, 214, -105, 77, -289, -34, -17, -20, -36, -39, 80, 115, -153, 31, -50, 117, 146, 56, -27, -55, 106, 54, -53, -89, -116, 133, -60, 91, 10, -29, -14, -101, 174, -19, 32, -134, -102, 42, -219, 224, 193, 12, -16, 67, -124, -210, -8, -155, -28, -20, -14, -23, 55, -49, -19, 165, -176, -54, -133, 165, -22, -20, -193, 120, 207, -26, 71, -73, -18, -352, -154, -182, 31, 170, 116, -153, -75, 128, 1, -85, 74, -63, 183, -222, 119, -238, -158, -138, -151, 146, -32, 72, 43, 134, -103, -127]
5090a27J14J88j16M5rn9k20L08q0J90l63L1p6K05l85M35j40l3r1J14p9O4K01l05
5114a88J69j8R7q4j64J58J85j45j24q6L03j96N0J3J71l40L54k26P1r7J56J90m18
5137a69N4J38p1R1%Q5P5k59K03r3q4jK30k95J63J21k19j10L07j52m8L0J76k07
5161c5j11J88j69M56k02j57M00l40p9J61J05k81J25J28L9j90P8j7q6P2r6n1K94
5184B32m0j54j76J18j26L19j96L9O4j18M9J47m8k60P0K1O8J32k49l2N1J23j13
5207g9K94l85j82J93P2N1j78Q9L67l21K0rJ17K6j4N6J1l85L44M7J13k63J01J4
5231I9j14l5K86l21l0R4q3K4M6J72p9j36kK95r0o7p7J32j72M1j3jjK2J72l05J49
5258FK29j32Rl98N25n91L48J25k93P7O6j58J52J14j43J63k7oj6J70j14j35J12
$$ y = [-127, -13, 175, 59, 104, 95, 36, -184, 124, 44, 234, -129, -98, -174, 31, -354, 81, -59, -92, -183, -69, -148, -84, 117, -188, -19, -37, 60, -24, -188, -30, 155, 10, -114, -200, 103, -93, -43, -30, 141, -199, 155, -71, 0, -97, 59, 249, -169, -115, 23, -48, 43, 43, 128, 203, -56, 147, 54, -30, -31, 199, -96, 67, 188, -31, -141, 166, 14, -34, -4, 172, -35, -146, 42, -127, 329, 127, -30, 370, 30, -49, 112, 217, -64, 61, 189, 228, 38, 116, 99, 13, 85, -11, -62, 232, 192, 38, -138, -20, -146, 173, -23, 16, 80, -38, 11, 158, 110, -150, -80, -59, 9, 141, -108, -140, -89, 34, -79, 215, -170, -352, -159, -87, -36, -214, -125, 242, -79, -59, -68, 49, 75, 61, 117, 128, -257, 87, 134, 247, -16, 85, 99, -15, -50, 236, -85, -115, -21, -104, -80, -34, 138, 59, -77, -79, 216, 126, 59, -18, 114, -58, -17, -30, -31, -32, -10, 162, -143, 6, 235, 103, 112, -286, 239, -352, -4, 121, -172, -95, -29, -187, -35, 79, -64, 99, 72, 66, 50, 220, 106, -29, 83]
5281H3j98K06J8k32r9K81K31j44Lj3k5j86nN7L11l36K01j22q8q7P1L24l00j00
5305a49J51R9mk6J3l20J89L33k98M6p8l3J64N3j92j82M36k73P6j10J26j74J36
5328a7j08J18K62k32j00J21J5l22K12PJ59N2l5k39nJ17M0m6N9j09K80j35L7k26
5352i5J21r7P1j51L38j93M6l17M84l42K21l6j06J54n1j79J87j77J4J4j82J36j7
5375a57J40J47k64k57M17j00K09j5r8k5J8r6q9k9P5q6J06KK07j64J84k30J88J8
5399A01k28J86O8K02j95j38m2jJ45Qk05Q3R2j0Rk16k7J61r8p8J95k73L02p4K63
5424B30l60JN29n94L15k00k0J22J59k98J54m54K79J6K44j96J66m36L05M41l10
5445I3J1R1j63L3m9O4n81P39Rl47O8J97k77L6q5K20r2q0K25k64J58J37l22K25
$$ y = [83, -115, 91, 109, -123, -222, 59, 290, 146, 149, 136, 111, -75, -80, -23, 288, -48, 153, 31, -57, -144, -73, 251, -49, -149, 2, 101, 97, 71, 84, -236, -47, 286, -12, 34, -44, -77, 87, 140, -52, -234, 202, -71, 5, -105, 21, -153, -17, -125, -7, 255, 23, -77, 44, 59, -263, -51, -44, 115, 167, 132, -107, -112, 5, 45, -1, 58, -51, 229, 94, 131, -95, 26, -71, 0, -151, 187, -6, 40, -277, 207, -135, 86, 50, -56, 98, 47, -132, 55, -122, -108, -94, -276, -140, -157, -17, 130, -134, -391, 26, -74, 135, 120, 22, -3, 15, -81, -170, -199, -124, -210, -104, -102, 105, -59, 125, -105, 83, 101, -127, 59, 127, 329, 134, -4, -46, -47, 98, 106, -99, -16, 76, 66, 75, -141, -168, -7, -105, -183, 12, -261, 41, -33, 230, -130, -129, 400, -194, 121, -79, -99, 23, 182, -116, 38, -416, -137, -121, 123, -73, 93, -343, -38, 403, 93, 104, 195, 32, 65, 16, 80, -501, 238, 247, -100, -32, 165, -112, -76, -161, 59, -33, -113, 112, -152, 6, 143, -179, 46]
5469D6L3N3q2J10j68J00q1R7l97QL03J2K26m59M63k11J6k41K06k37K80j38j52
5492b13K43k65J26N8j86N0qL03jJ4j09j95J20K05j2j33k8p7J9n3K79j62Jq2J12
5517FL5k61J81j56J80M0J80l19J76k83L15k10l4K91j36J13r0k17K77k18J98j71
5539a03r5L49k15k0J66k02o4K17K7K70m80K39l0j82j87J92N6k3O0J07k2PJ5Ok22
5564a34Q6K12k56K94l08J44K5m4j59J39K59j88M7k01L2%k0o5N59n49J41K47k23
5587C8J26k90M00k66j20J13m7L04m9j64l1r2j2L45l58J77r2J03j1j20J82q1j51
5610i6J44M1o5r0J02P4k31q0L88l73M07j79L1j45J92Q0j57k34J47k3J48J98k11
5633F8k04K5Q5k32J28J27j71L47k48J48k05M09k02p6L7j5j56P5Pj0P3N4l10J42
$$ y = [46, 79, 132, 50, 160, -8, 92, 11, 108, -289, -281, 22, 34, 260, -199, 264, 53, 69, -172, 34, -203, 77, -61, -213, 30, -235, -109, -51, -237, -187, -195, 108, 107, 121, 12, -183, -63, 142, 130, -3, -31, -108, -89, -142, 137, -25, -24, -106, 6, 41, -220, -39, -195, -15, 25, 205, -114, 62, -221, 94, -116, -150, 141, 5, 118, 28, -189, 88, -130, 68, -103, -198, 151, -64, -84, 82, -120, -184, 33, 60, 330, -150, 89, 59, -123, -310, -118, -62, -85, -25, 82, 60, 67, 82, 88, -134, -48, 164, -92, 202, -106, 38, 63, 19, -140, -1, 258, 70, 117, -84, -52, -52, -72, -137, 422, -127, 14, 261, 38, 164, -126, 274, 8, -112, 1, -46, 258, 209, 45, 14, -78, -90, 255, -103, 74, -18, 85, 74, -46, 136, 55, -96, 48, 89, 24, -66, 36, 110, -121, -201, 187, -186, 221, 42, 73, -72, 120, 200, 43, -191, -44, -67, 81, 279, 68, -136, -111, -26, -258, -130, -3, -174, 173, -75, 73, -132, 277, 75, -1, 36, 21, -135, -60, -53, -63, 10, 64, -246, -104]
5657a04J52n3r9J92p3r6P8J4j99J81L5J23k3j13L0L7J11j31m0j15m1m0K57m81
5681c98N91k90KJ88l58O0K6L2J55o1Q9k29N21k79N6m96O12k18O1J07l46J55O9
5704D9kj80J85Jk76K51l2m3P4p9j95K15j68J67L80m94J35j49L68l82J37R1J15
5727A68m00K98r2m5Q3J6J42kl82J47J62l6pL4R6l49K09K0q0j72L17k27J27m08
5751c81J32M71k11l5j36n3L79p3J08j71Lj25K24m41K86J59N2K82o06KJ81J21k48
5774h0P1R9q2P9j27j32P7M2J0M0j20r0K84J04k21r6K62n3j9l5k17R7K83k15R4
5799E5r4l7L82l30J35j63m0l4kL43k48q7p9K28n4j86L04m17L11m8J03L1l40L2
5823b35N9L60l01q9K10o2l2L0J46k7J7l41K90o4P1k9p4k00J79N18l83j95K83l82
$$ y = [-104, 48, -5, -104, 88, 15, -81, -3, 11, -188, -7, 28, 151, 128, 15, 45, 82, 193, 62, 22, -93, -134, -174, 83, -398, 193, -97, -95, 93, -265, -205, -179, -147, 8, -53, 36, -193, 328, 49, 105, -391, 221, 3, 64, 171, -175, -20, 49, 47, -133, 52, 53, -223, 28, -4, -47, 27, -52, -247, -32, -200, -33, 347, -147, -12, -161, 207, -175, -38, 53, 168, -232, 66, -26, -71, 12, 28, 170, 168, -214, -67, 95, 59, 52, 86, 182, -167, 42, 62, -18, -190, 127, -100, 27, -381, -249, 222, 11, -24, -160, -213, 166, 93, 201, 30, 33, -92, 132, -309, -23, 136, 188, 470, -136, -134, 47, 168, -80, -9, 90, 8, 87, -40, -172, -95, -53, -43, -3, -123, -213, 71, 175, -46, -142, 120, 67, 48, 13, -204, -107, 176, -39, 55, -39, -76, 306, -24, 111, -52, -92, -126, -128, 215, -33, -120, -199, 29, -25, -211, 93, -324, -13, -61, 42, 73, -267, -235, -176, 184, -117, -206, 4, -58, -90, -60, 86, 59, 76, -265, 25, -39, 32, 3, -71, -271, -92, 426, 43, -152, 131, -251]
5847b51K68J17p7P5L8l9k8j69M3p8J85O2j32J6k3K8l1R9k03K42n5k25J07N2K9
5872E0j10N89n44j6J71m18K84J75lq3j73K39l87P7K2R7O6Q5k15O2O9P1q1r3M40
5897C74k51j8o2J19r9j5j75Rl6J63jJ85l59K04N5Qk28k04K62J68q7L2M8o8J3J78
5923B15l60N5l6J80k9L7Jj40M8O4j02j0J91l62J54L9r9K55O1k69J2K89k27lJ77
5948A41o2j12j37K40k14mL93l26k02M99o3o5j15J07J03m33L56k72K8J12M05m38
5970e9j18L3L47k5qj09J6N7m1j72j40J27J8P1J31r3m2j53J2J42n0K9P5J44l59
5995a67M5l2K82j87N7K79m32K55k33P1J85p4K9l4n8Q8j39j48N07l13j02j8M3L11
6019B15k88J75k38J57k46L21J93k54J85M0k29J02k11O0k12K54R1P5q8k52M65m17
$$ y = [-251, 17, 134, 57, 132, 170, 131, 103, -66, -23, -101, 84, 146, 14, 30, 7, 35, 4, 103, -100, 142, 87, -138, -31, 21, 50, -60, 529, -15, -31, 140, -278, 6, 181, 178, 95, -78, 161, -226, -149, -127, -30, 36, 121, -94, -32, 37, 108, 27, -66, 374, 123, 105, 43, 162, 63, 48, -127, -118, -154, 9, 8, 193, -166, 38, 93, 101, -127, -331, -69, 99, 12, 44, 92, 24, 37, 215, -145, -90, -126, 54, 25, 62, 63, -77, -29, 35, -67, -77, 114, -248, -94, -55, -154, 101, 162, -107, -95, 194, -33, -36, 141, 79, -33, -170, 70, -144, -148, 245, -81, -283, 216, 153, 88, -27, 80, 183, -250, 106, -166, -138, -26, 379, -59, -177, -144, 203, 178, 170, 61, 77, 134, 93, -79, -219, -92, -74, -3, 128, 35, -7, -160, -148, -6, -56, -27, 48, 192, -167, -122, -154, 128, -59, -2, 277, -155, 100, -133, -62, 123, 49, 78, 44, -14, 74, -65, -213, 294, -19, -121, -139, -96, 215, -73, 102, -136, 21, -225, 96, 289, 35, 220, 260, 31, 133, -78, -18, -230, 24, 115, 190, 102, -150, 315, -102]
6041a02K10j47L10j59Nj07rp7J39M9J31r4k6m61L20K2k94K45N8o0k38M93k87J63
6065H4K8p4n0l7j0K96k33P0j68K83n2l30J99r9L14n84M62l11L32R8m34J31J49
6088F4l59J56P0n9K59k58L12j97L6j43J76m7N5j70P2L54j63k9J1j56J09p6k93
6111b76K07j89J38o9J69l08L91k2j45Q3K2j5J23M9k30n1K25k2k7r5k28qL80J99
6135C01l81J05q6K0P9L01m74M92k84k30J44J6j07P5j88J13pj01L00l03K37j11
6157h9j30L14K51k27m03J93J09o9r2J97M3Q9k79P7K8n6J36o4J4M6j31J39k5j00
6181b9M2j12N8J2L03j52j06k0J06L5j17P0j26K65n8j92Q1n5J06P2j08j53J05j92
$$ y = [-102, 108, -39, 271, 112, 117, 10, 1, -76, 63, 112, 243, 149, 123, -338, -18, 4, -290, -45, 13, -47, -285, 208, -79, 84, 112, 38, -12, -49, -59, 237, 4, 74, -94, 189, 137, -193, 6, -93, 221, -363, 99, -212, 120, 218, -216, -85, 64, -295, -139, -69, -128, 131, -127, 185, -12, 24, -119, 57, 10, 65, -105, -33, 321, 158, 129, 140, -16, 93, 17, -276, -69, -258, -120, -189, -20, -328, 63, 41, -104, -21, 1, -14, 109, 158, -72, -123, 102, 80, 53, -42, -270, -278, 102, 301, -80, 25, -61, -41, 38, 339, -135, 357, 73, -157, -13, 3, -104, -29, -217, -104, -111, -212, 88, -215, 22, -89, -219, 95, 346, 119, -284, -91, 18, -51, -143, 54, 97, 186, -93, -16, 12, -44, 92, 28, 42, 88, -43, 96, 71, -29, 13, -99, -41, -29, 274, 122, 16, -4, 102, 137, 20, 90, -36, 229, 171, -21, 60, 5, 111, 183, 75, -78, 27, -165]
$$ [...]
8191E4
##END NTUPLES=NMR FID
##END=
