##TITLE=1H_LR-760-1-C2-B20
 CCl4
 8 sc, 
 27.1.2023
##JCAMPDX= 6.0         $$ Bruker NMR JCAMP-DX V2.0
##DATA TYPE= NMR FID
##DATA CLASS= NTUPLES
##ORIGIN= UXNMR, Bruker Analytische Messtechnik GmbH
##OWNER= root
$$ XWIN-NMR		Version 3.5
$$ Fri Jan 27 14:18:02 2023 Russian Standard Time (UT+4h)  she@DPX200
##.OBSERVE FREQUENCY= 200.13135
##.OBSERVE NUCLEUS= ^1H
##.DELAY= (6, 6)
##.ACQUISITION MODE= SIMULTANEOUS
##.ACQUISITION SCHEME= undefined
##.AVERAGES= 8
##.DIGITISER RES= 18
##SPECTROMETER/DATA SYSTEM= spect
##.PULSE SEQUENCE= zg30
##.SOLVENT NAME= CDCl3
##.SHIFT REFERENCE= (INTERNAL, CDCl3, 0, 15.7039)
##AUDIT TRAIL= $$ (NUMBER, WHEN, WHO, WHERE, WHAT)
$$ ##TITLE= Audit trail, XWIN-NMR		Version 3.5
$$ ##JCAMPDX= 5.01
$$ ##ORIGIN= Bruker BioSpin GmbH
$$ ##OWNER= she
$$ F:/spectra/data/she/nmr/H-F/1/audita.txt
$$ ##AUDIT TRAIL=  $$ (NUMBER, WHEN, WHO, WHERE, WHAT)
(   1,<2023-01-27 14:16:26.34 +0400>,<she>,<DPX200>,
      <created by zg, POWCHK disabled, PULCHK disabled
       configuration hash MD5:
       00 E9 B6 7A A2 85 ED C7 34 08 36 98 17 FE 4E 26
       data hash MD5: 16K
       64 90 92 36 48 DE 81 69 37 8B 8E 94 B0 FB F5 29>)
$$ ##END=
$$ 
$$ hash MD5
$$ 73 01 CA 03 74 AF 0A E0 FD 18 B9 D7 5B A6 69 16
##$RELAX= 
##$RELAX= 
##$RELAX= 
##$RELAX= 
##$RELAX= 
##$RELAX= 
$$ Bruker specific parameters
$$ --------------------------
##$DU= <F:/spectra>
##$EXPNO= 1
##$NAME= <H-F>
##$PROCNO= 1
##$TYPE= <nmr>
##$USER= <she>
##$AMP= (0..31)
100 100 100 100 100 100 100 100 100 100 100 100 100 100 100 100 100 100 
100 100 100 100 100 100 100 100 100 100 100 100 100 100 
##$AQSEQ= 0
##$AQ_mod= 1
##$AUNM= <au_zg>
##$AUTOPOS= <>
##$BF1= 200.13
##$BF2= 200.13
##$BF3= 200.13
##$BF4= 200.13
##$BF5= 200.13
##$BF6= 200.13
##$BF7= 200.13
##$BF8= 200.13
##$BYTORDA= 1
##$CFDGTYP= 0
##$CFRGTYP= 5
##$CHEMSTR= <none>
##$CNST= (0..31)
1 1 145 1 1 1 1 1 1 1 1 1 1 1 1 1 1 1 1 1 1 1 1 1 1 1 1 1 1 1 1 1 
##$CPDPRG= <>
##$CPDPRG1= <>
##$CPDPRG2= <>
##$CPDPRG3= <>
##$CPDPRG4= <mlev>
##$CPDPRG5= <mlev>
##$CPDPRG6= <mlev>
##$CPDPRG7= <mlev>
##$CPDPRG8= <mlev>
##$CPDPRGB= <>
##$CPDPRGT= <>
##$D= (0..31)
0 1.2 0 0 0 0 0 0 0 0.06 0 0.03 0 0 0 0 0.0002 0 0 0 0 0 0 0 0 0 0 0 0 
0 0 0 
##$DATE= 1674814585
##$DBL= (0..7)
120 120 120 120 120 120 120 120 
##$DBP= (0..7)
150 150 150 150 150 150 150 150 
##$DBP07= 0
##$DBPNAM0= <>
##$DBPNAM1= <>
##$DBPNAM2= <>
##$DBPNAM3= <>
##$DBPNAM4= <>
##$DBPNAM5= <>
##$DBPNAM6= <>
##$DBPNAM7= <>
##$DBPOAL= (0..7)
0.5 0.5 0.5 0.5 0.5 0.5 0.5 0.5 
##$DBPOFFS= (0..7)
0 0 0 0 0 0 0 0 
##$DE= 6
##$DECBNUC= <off>
##$DECIM= 32
##$DECNUC= <off>
##$DECSTAT= 4
##$DIGMOD= 1
##$DIGTYP= 9
##$DL= (0..7)
0 120 120 120 120 120 120 120 
##$DP= (0..7)
150 150 150 150 150 150 150 150 
##$DP07= 0
##$DPNAME0= <>
##$DPNAME1= <>
##$DPNAME2= <>
##$DPNAME3= <>
##$DPNAME4= <>
##$DPNAME5= <>
##$DPNAME6= <>
##$DPNAME7= <>
##$DPOAL= (0..7)
0.5 0.5 0.5 0.5 0.5 0.5 0.5 0.5 
##$DPOFFS= (0..7)
0 0 0 0 0 0 0 0 
##$DQDMODE= 0
##$DR= 18
##$DS= 0
##$DSLIST= <SSSSSSSSSSSSSSS>
$$ [...]
##$SUBNAM2= <"">
##$SUBNAM3= <"">
##$SUBNAM4= <"">
##$SUBNAM5= <"">
##$SUBNAM6= <"">
##$SUBNAM7= <"">
##$SUBNAM8= <"">
##$SUBNAM9= <"">
##$SW= 18.05172834244
##$SWIBOX= (0..15)
0 0 2 0 0 0 0 0 0 0 0 0 0 0 0 0 
##$SW_h= 3612.71676300578
##$TD= 16384
##$TD0= 1
##$TE= 0
##$TE2= 300
##$TE3= 300
##$TEG= 300
##$TL= (0..7)
0 120 120 120 120 120 120 120 
##$TP= (0..7)
150 150 150 150 150 150 150 150 
##$TP07= 0
##$TPNAME0= <>
##$TPNAME1= <>
##$TPNAME2= <>
##$TPNAME3= <>
##$TPNAME4= <>
##$TPNAME5= <>
##$TPNAME6= <>
##$TPNAME7= <>
##$TPOAL= (0..7)
0.5 0.5 0.5 0.5 0.5 0.5 0.5 0.5 
##$TPOFFS= (0..7)
0 0 0 0 0 0 0 0 
##$TUNHIN= 0
##$TUNHOUT= 0
##$TUNXOUT= 0
##$USERA1= <user>
##$USERA2= <user>
##$USERA3= <user>
##$USERA4= <user>
##$USERA5= <user>
##$V9= 5
##$VALIST= <valist>
##$VCLIST= <CCCCCCCCCCCCCCC>
##$VD= 0
##$VDLIST= <DDDDDDDDDDDDDDD>
##$VPLIST= <PPPPPPPPPPPPPPP>
##$VTLIST= <TTTTTTTTTTTTTTT>
##$WBST= 1024
##$WBSW= 4
##$XGAIN= (0..3)
0 0 0 0 
##$XL= 0
##$YL= 0
##$YMAX_a= 130463
##$YMIN_a= -144247
##$ZGOPTNS= <>
##$ZL1= 120
##$ZL2= 120
##$ZL3= 120
##$ZL4= 120
##$ABSF1= 10
##$ABSF2= 0
##$ABSG= 5
##$ABSL= 3
##$ALPHA= 0
##$AQORDER= 0
##$ASSFAC= 0
##$ASSFACI= 0
##$ASSFACX= 0
##$ASSWID= 0
##$AUNMP= <proc_1d>
##$AZFE= 0.1
##$AZFW= 0.1
##$BCFW= 1
##$BC_mod= 2
##$BYTORDP= 1
##$COROFFS= 0
##$CY= 11.3945322036743
##$DATMOD= 1
##$DC= 2
##$DFILT= <>
##$DTYPP= 0
##$F1P= 2.36226072786647
##$F2P= -0.459571619588291
##$FCOR= 0.5
##$FTSIZE= 0
##$FT_mod= 4
##$GAMMA= 1
##$GB= 0.15
##$INTBC= 1
##$INTSCL= 1
##$ISEN= 128
##$LB= 0.24
##$LEV0= 0
##$LPBIN= 0
##$MAXI= 10000
##$MC2= 0
##$MEAN= 0
##$ME_mod= 0
##$MI= 1.114404
##$NCOEF= 0
##$NC_proc= 0
##$NLEV= 6
##$NOISF1= 3.799351
##$NOISF2= 2.8
##$NSP= 1
##$NTH_PI= 0
##$NZP= 0
##$OFFSET= 15.70392
##$PC= 1
##$PHC0= -19105.08
##$PHC1= -3.399211
##$PH_mod= 1
##$PKNL= yes
##$PPARMOD= 0
##$PSCAL= 0
##$PSIGN= 0
##$REVERSE= no
##$SF= 200.130013532006
##$SI= 16384
##$SIGF1= 3
##$SIGF2= 2
##$SINO= 400
##$SIOLD= 16384
##$SREGLST= <1H.CDCl3>
##$SSB= 0
##$STSI= 0
##$STSR= 0
##$SW_p= 3612.71676300578
##$SYMM= 0
##$S_DEV= 0
##$TDeff= 0
##$TDoff= 0
##$TI= <>
##$TILT= no
##$TM1= 0
##$TM2= 0
##$TOPLEV= 0
##$USERP1= <user>
##$USERP2= <user>
##$USERP3= <user>
##$USERP4= <user>
##$USERP5= <user>
##$WDW= 1
##$XDIM= 8192
##$YMAX_p= 0
##$YMIN_p= 0
$$ End of Bruker specific parameters
$$ ---------------------------------
##NTUPLES= NMR FID
##VAR_NAME=  TIME,          FID/REAL,        FID/IMAG
##SYMBOL=    X,             R,               I
##VAR_TYPE=  INDEPENDENT,   DEPENDENT,       DEPENDENT
##VAR_FORM=  AFFN,          ASDF,            ASDF
##VAR_DIM=   8192,          8192,            8192
##UNITS=     SECONDS,       ARBITRARY UNITS, ARBITRARY UNITS
##FACTOR=    0.0002768,     1,               1
##FIRST=     0,             0,               0
##LAST=      2.2672688,     0,               0
##MIN=       0,             -144247,         0
##MAX=       2.2672688,     130463,          0
$$ Real data points
##PAGE= N=1
##DATA TABLE= (X++(R..R)), XYDATA
$$ [...]
1813b02R8K18q2r2k2mMK40l82L36r7J77L1l65J01O3o2JK91n13K33K89m22O9Q8
$$ -202 -104 114 32 -60 -82 -86 -82 158 -224 112 15 192 223 -142 -41 22 -40 -39 252 -261 -28 261 -161 -92 -4
1838dK29k45L3k2k36O2J38N3k95M48k19J33j47J5j12J78M3n2j72n4K47J8j88m
$$ -4 225 -20 13 -9 -245 -183 -45 8 -287 161 -58 75 -72 -57 -169 9 52 0 -172 -226 21 39 -149 -153
1862a53L34R7l58L6k3q8L41l87J37P4k19J97O7l36K56J22j23j66P3J82j82P0q1
$$ -153 181 278 -80 -44 -67 -155 186 -201 -64 10 -209 -12 55 -281 -25 97 -26 -192 -119 63 -119 -49 -130
1885a30J21o3k32L39N9j43j02j53J93J12p3K9K4K2L7j73N9J51J42l48K83k37Q6
$$ -130 -9 -72 -304 35 94 -49 -151 -304 -111 1 -72 -43 -19 3 40 -133 -74 77 219 -129 154 -83 3
1908CLP9O9n2j78J34m4Q5n1N0l65L41p4Q1l7k17K40j46k9K11O3QO6k22JK72k57
$$ 3 6 85 154 102 -76 58 14 99 48 98 -267 74 0 81 44 -173 67 -79 -108 103 166 174 240 18 19 291 34
1935C4l8K02r7l0r7J67K51j92j55nj04L24m5o0k32K83j23P4k07J35J9j40K30k3
$$ 34 -4 198 101 71 -26 141 392 200 45 40 -64 260 215 155 -77 206 83 157 -50 85 104 -36 194 171
1959A71l25L2K25O9r8j61L53k5k67J95l28M05j23j64J42r3J65j14k11J86r6J94
$$ 171 -154 -122 103 172 74 -87 266 241 -26 169 -159 246 123 -41 101 8 173 59 -152 34 -62 132
1981A32J05j83k1K54m7j46r6O0n6M6J5j90J78N6j49L2J74J64k54j74J47J62j29
$$ 132 237 54 33 287 240 94 -2 58 2 48 63 -127 51 107 -42 -10 164 328 74 -100 47 209 80
2004H0p7K10L7m08K63n6K2kJ2J42r9j18J16k97K91r5k68M79mk18n9K62k21J10
$$ 80 3 213 250 -158 105 49 71 69 81 223 124 6 122 -175 116 21 -247 232 228 10 -49 213 -8 102
2028A02k14K37m4k89M20k59O2K7j39J50j34N7j02q6K67K7K63n04J17j7M1k8L5
$$ 102 -112 125 81 -208 212 -47 15 42 -97 53 -81 -24 -126 -212 55 82 345 -159 -42 -59 -18 -46 -11
2051a1j78Q6K6N8k6KJ67k08K19j09j54p1N4L3j82K35O4m7j0j92N5J63K58k32J5
$$ -11 -189 -103 -77 -19 -45 -43 124 -84 135 26 -128 -199 -145 -112 -294 -59 5 -42 -52 -244 -189 -26 232 0 15
2076A5N8l86L38j29K00L4k25j97L12j15k87L00O6j22m3L47m75K69K5k5k53K68
$$ 15 73 -313 25 -104 96 130 -95 -292 20 -95 -382 -82 -16 -138 -181 166 -309 -40 -15 -40 -293 -25
2098b5o4L2q7M5J63nl1o1J07k64J37j57J76J8k42M89m03P5K94k96o2K12k44K49
$$ -25 -89 -57 -144 -99 64 59 28 -33 74 -190 -53 -210 -34 -16 -258 231 -172 -97 197 -99 -161 51 -193 56
2122E6M5l54J94oQ1R8j49J00k28r8K77K04k27k03K17p5k22J84Rn0J30j4J1K12
$$ 56 101 -253 -59 -65 16 114 -35 65 -163 -261 16 220 -7 -210 7 -68 -290 -106 -97 -147 -17 -31 -20 192
2146A92Q4j62j58J62l24M00k57J21P2k03J78J77k51j60K98q8M3J28n7k47K80k03
$$ 192 276 114 -44 118 -206 194 -63 58 130 -73 105 282 31 -129 169 81 124 252 195 -52 228 25
2168B5J11n3RL04l95Q8J4j46Q2j07l2J07J12j93K18k23K85j18j2k84J28j02K83
$$ 25 136 83 92 396 1 89 103 -43 39 -68 -100 7 119 -74 144 -79 206 88 76 -208 -80 -182 101
2191A01k16nJ26L94o63L15l15J66R9K59m64J9K3J89l67K20K66k64J37j71L50k47
$$ 101 -115 -120 6 400 -263 52 -263 -97 2 261 -203 -184 -161 28 -339 -119 147 -117 20 -151 199 -48
2213d8L78l84k57M65o6j77K20k7m05N21l67J56j8j74O4K61l24O8L23k73K44k08
$$ -48 330 -54 -311 154 88 -89 131 104 -301 220 -147 9 -9 -183 -119 142 -182 -114 209 -64 180 -28
2235b8J89k41L37m41j36N64j98o1J52k23J94l22K5K01J99j54k89J8J84k70J70
$$ -28 161 -80 257 -184 -320 244 46 -15 137 -86 108 -214 -189 12 211 57 -232 -214 -30 -300 -130
2256a30L7R5j68O3M0j37J39P5N4l76M23o0j82K85r0j09N7j1q6K6Q3k60R1J86K08
$$ -130 -93 2 -166 -103 -63 -200 -61 14 68 -308 115 55 -127 158 68 -41 16 5 -81 -55 28 -232 -141 45 253
2281B53m03J41j65N6K4k74L64r4P2L9O2j80J68J34k75L1k06J81o0m6L70j99K6
$$ 253 -150 -9 -174 -118 -94 -368 -4 -98 -26 13 75 -105 63 197 -78 -47 -253 -72 -132 -178 192 -7 19
2304A9k93M33k47o8K82l43P7L39j50N3r7K84k30k44M45l98J17j92L35k89L23J62
$$ 19 -274 159 -88 -156 126 -217 -140 199 49 102 5 289 59 -185 260 -138 -21 -213 122 -167 156 318
2326C18l72o9K03j77J9k4L3j00Q2J64k67N3R5J38k86K37pj78k7J28n6j50M29k70
$$ 318 -54 -123 80 -97 -78 -102 -69 -169 -87 77 -190 -137 -42 96 -190 47 40 -138 -165 -37 -93 -243 186 -84
2350h4Q6l6o5mJ38K07k15j0K9J70m6j40p1L30l34K06l60J66J98k89M7L63k01j99
$$ -84 2 -34 -99 -103 35 242 27 17 46 216 170 30 -41 289 -45 161 -199 -33 165 -124 -77 286 85 -114
2374a14K55O3j44j09k14L98K54k69p3rO5k92M25j25o8q5k76M38Q5o6k35m8K38
$$ -114 141 204 60 -49 -263 135 389 120 47 38 103 -189 236 111 43 -42 -318 120 205 139 -96 -144 94
2397I4j96rJ17q7L56l40K55p2j7j79J95Rj77oj05J0M44j56M9k28O7J34k89J87
$$ 94 -102 -111 6 -81 275 -65 190 118 101 -78 117 126 -51 -57 -162 -152 292 136 185 -43 24 158 -131 56
2421E6QR5r6k52L78j84l4M8J05m3j64J65o3O9J36l4k49j28J72k94K38m8K8J98
$$ 56 64 159 63 -189 189 5 -29 19 124 81 -83 82 19 88 224 190 -59 -187 -15 -309 -71 -119 -91 107
2445A07Qk24J61Ro9P6J34k58j27K27j79j89K23j59K47LJ09j20l39L62j67RJ60
$$ 107 115 -109 52 61 -8 68 202 -56 -183 44 -135 -324 -101 -260 -13 -10 99 -21 -360 2 -165 -156 4
2468Dn9n7j0J27j95J79M9m8j46k7K55r0K86k88L56k21j50J67q7j55n9K2mJ23j41
$$ 4 -55 -112 -122 5 -190 -11 38 -10 -156 -183 72 -18 268 -20 336 115 -35 132 45 -110 -169 -147 -151 -28 -169
2493a69o2l8Q7K12j59K4k7J48J5j62L47l77J22J37j60o3K4Q9J76k43j40K20q2
$$ -169 -231 -269 -182 30 -129 -105 -132 16 31 -131 216 -161 -39 98 -62 -125 -101 -12 164 -79 -219 1 -81
2516h1p9J80k91J20p4J40j06L04j02J95k06K23O4k91K03j29Q0j24k1J61p7l14
$$ -81 -160 20 -271 -151 -225 -85 -191 113 11 206 0 223 287 -4 199 70 150 26 5 166 89 -225
2538b25J53Q0p9J00L8q7o8K61l06K78l75L55k71L09o8l6lR7%pj39R6j28J41j8
$$ -225 -72 8 -71 29 67 -20 -88 173 -133 145 -230 125 -146 163 95 59 56 153 153 146 7 103 -25 116 98
2563I8M8k50l1L70l54J54m3J31j4l38R2M18m75P3J51K08q4nk93J37J27J6j95K
$$ 98 146 -104 -135 235 -119 35 -8 123 109 -229 -137 281 -194 -121 30 238 154 149 -144 -7 120 136 -59 -57
2587e7K28j53J01r1N0o8J00j04J17P0n2J85o34L56j26L16k33rP4n6p1J4j04J10
$$ -57 171 18 119 28 78 10 110 6 123 193 141 326 -308 48 -78 238 5 -4 70 14 -57 -43 -147 -37
2611c7k4K53k42l7N7KJ50k67m7M71l14L9R2Q7j57R7k34K10k3q4J65k79J00J24
$$ -37 -61 192 -50 -87 -30 -28 122 -145 -192 279 -35 4 96 183 26 123 -111 99 76 -8 157 -122 -22 102
2635A02l7k51J24L4O4p6L9J13J59j24Q6l22K11k33QJ38P0K26j86k23P5P1N3j22
$$ 102 65 -186 -62 -28 36 -40 -1 112 271 147 233 -89 122 -111 -103 35 105 331 145 -78 -3 68 121 -1
2659ak39L83p2j02Qp9R1r7J89j06J46k71L8N0k53N25l62K77Q7l4j50om6J09p6
$$ -1 -240 143 71 -31 -23 -102 -11 -108 81 -25 121 -150 -112 -62 -315 210 -152 125 212 178 28 22 -24 85 9
2684Ir3r2J67J21q5j35m3J18m6N2j12K42m2n7N1j01K4J10j17K02k14J61l2j21
$$ 9 -84 -176 -9 112 27 -108 -151 -33 -79 -27 -139 103 61 4 55 -46 -22 88 -29 173 -41 120 88 -33
2708c3q7p4K2M30j26j42j05n5R1O7J5r5K08k29r7K03k6j09Q4q0K07j83j09J33
$$ -33 -120 -194 -172 258 132 -10 -115 -170 -79 -12 3 -92 116 -113 -210 -7 -33 -142 -58 -138 69 -114 -223 -90
2732i0Q9rj5O8k5m9K18j41L0J24j08J42j81j37K08l9J9j56K49k65J29k5q5j77
$$ -90 -1 -10 -25 43 18 -31 187 46 76 200 92 234 53 -84 124 85 104 -52 197 -68 61 36 -49 -226
2756b26J53K10l23L93r4k64K69J51m29K17l24L25O2p8k7R9l1j19o2l1L8J83L4
$$ -226 -73 137 -186 207 113 -151 118 269 -160 57 -267 58 120 42 15 114 83 -36 -98 -129 -91 92 126
2779A26j72N7J70k67J71j18M7J48j49k17J18J96jj25R0K03m42J79R3L6o7k57J91
$$ 126 -46 11 181 -86 85 -33 14 162 13 -204 -86 110 109 -16 74 277 -165 14 107 143 76 -181 10
2802A0J05j95J11j06q0K46r1L04k85J16K4o9j6n1k75K24Q9k1O6k90K9j07K83K2
$$ 10 115 -80 31 -75 -155 91 0 304 19 135 159 90 74 23 -252 -28 61 40 106 -184 -155 -262 21 43
2826D3j30P6K22p1m49M34J65m84K66n3J31j55l2L9m7j75j7N1K80L9k16J13k20
$$ 43 -87 -11 211 140 -309 125 290 -194 72 19 150 -5 -37 2 -45 -220 -237 -186 94 133 -83 30 -190
2849a90L33k92J75j80q0K03R1l5j68j48K02J55O1j69j53R9P6J47k22q5M1J65j97
$$ -190 143 -149 26 -154 -234 -31 60 25 -143 -291 -89 66 127 -42 -195 -96 -20 127 -95 -180 -139 26 -171
2872a71p2L72k2k70P9j24K05j41L27j34M8l64M28k03Q2k4K4j37K42m01M70m2o
$$ -171 -243 129 107 -163 -84 -208 -3 -144 183 49 97 -267 161 -42 40 16 40 -97 145 -256 214 172 166
2895A66k23j85J00q7L05k10J59O4J7k89K30L9j30p9K04k02K43j29j55L42k20J1
$$ 166 -57 -242 -142 -229 76 -134 25 89 106 -183 47 86 -44 -123 81 -121 122 -7 -162 180 -40 -29
2917b9R4o5J3J09j18j81K58k05J06j63J26j62K08N6p2J3j33K27j52K97k2k55r0
$$ -29 65 0 13 122 4 -177 81 -124 -18 -181 -55 -217 -9 47 -25 -12 -145 82 -70 227 205 -50 -140
2940a40K82m85P5L90j0l8K6j0j67jj95L16k29J39J28K3K3j64j79J04K51j29Q7
$$ -140 142 -343 -268 122 112 74 100 90 -77 -78 -273 43 -186 -47 81 104 127 -37 -216 -112 139 10 97
2963I7j77R1j30K55Nj44L6o7J47j03k9k18L50j27J78Mj35j90K07rKM6Q9k35L27
$$ 97 -80 11 -119 136 141 -3 33 -34 113 10 -19 -237 113 -14 164 168 33 -157 50 41 43 89 178 -57 270
2988B70j70j11K11m52K68q9j76M41l21M1j00P5J12N1p9L52l76RM60n25L14m60
$$ 270 100 -11 200 -252 16 -73 -249 192 -129 -88 -188 -113 -1 50 -29 323 -53 -44 416 -109 205 -255
3010b55K96j6m51K68J58M4l6K6k20K80m1j01K09J50j02p5j24N0J03o5j35l2l5
$$ -255 41 25 -426 -158 0 44 8 34 -186 94 53 -48 161 311 209 134 10 60 163 98 -37 -69 -104
3033a04J85r5m0J66k07J24o2Q5m5n6P0Q7j20k34M15k39R2r1J97j89J44r1N9O2
$$ -104 81 -14 -54 112 -95 29 -33 52 7 -49 21 108 -12 -246 169 -70 22 -69 128 -61 83 -8 51 113
3057A13k87K42K51k92j78J62J31k56J59p9J3j77K7J01j81j19K54M47n85L76l71
$$ 113 -174 68 319 27 -151 11 142 -114 45 -34 -21 -198 -171 -70 -251 -370 -116 331 -254 122 -249
3078b49L05p6M5K6j24N5J10j50Q0O8Qm33Q2M35k64L8j71J45J14PMk6q3J99J21
$$ -249 56 -20 25 51 -73 -18 92 -58 22 90 98 -335 -253 182 -82 -44 -215 -70 44 51 55 29 -54 145 266
3103B66j34k64J95j49L68k75j02l5K93j23m4k04M76j22j32k72L92j23o2O3j4n8
$$ 266 132 -132 63 -86 282 7 -95 -130 163 40 -4 -208 268 146 14 -258 134 11 -51 12 -2 -60
3125f0K06J1j15Mj29J97l96K96m3J99j90J03J1l21K06kJ64L1k56P9J46k31l7J80
$$ -60 146 157 42 46 -83 114 -282 14 -29 170 -20 83 94 -227 -21 -23 141 172 -84 -5 141 -90 -127 53
3149E3J75j45j97K50J41l21J9J67j02K27l06m2J44J99l85J79P2o3j11j87K90j95
$$ 53 228 83 -114 136 277 -44 -25 142 40 267 -39 -81 63 262 -123 56 128 65 -46 -233 57 -138
3171a38K07j05Ok3K73l46L03j23o2J06n5p9o1L02J44k32l4J93k74R2j70k09M93
$$ -138 69 -36 -30 -53 220 -126 177 54 -8 98 43 -36 -97 205 349 117 83 276 2 94 -76 -285 208
3194B08j38J93l22L2J34k31L49j83N6M5j42L2J91k71J51k13K06j19q9L20j58J26
$$ 208 70 263 -59 -27 107 -124 225 42 98 143 1 33 224 -47 104 -109 97 -22 -111 209 51 177
3216A77j93J11j17J54k78K56j31O6k06P8P1N8Mk12K23m4kj56O5L0j36K22j04N6
$$ 177 -16 95 -22 132 -146 110 -21 45 -161 -83 -12 46 50 -162 61 17 15 -141 -76 -46 -182 40 -64 -8
3240hJ50j73j80M72k42J65l90O2L17k01J89k05L03r6m37K88J59l29m6J82J40k6
$$ -8 142 -31 -211 261 19 184 -206 -144 173 -28 161 -44 259 163 -274 14 173 -156 -202 -20 120 94
3262I4j82J7j51J38K15j51O0K6q1M3P3J5j8l35L98l82J53L8N9R6p0K2l88K88j53
$$ 94 -88 -71 -222 -84 131 -20 40 66 -15 28 101 116 98 -237 161 -221 -68 -30 29 125 55 77 -311 -23 -176
3287a76R0J72j21j17J58j39j27M05M2k42n8k9P7K11o7j53J63O9r2k56L49l9O8
$$ -176 -86 86 -35 -152 6 -133 -260 145 187 -55 -113 -142 -65 146 79 -74 89 158 66 -190 159 120 188
3310A88l5j07j11k51L8n4L48K10m02J96k71L96M4j53K33m25Q6o1R8M7J24l90L62
$$ 188 153 46 -65 -316 -278 -332 16 226 -176 20 -251 145 189 36 269 -156 -70 -131 -33 14 138 -252 110
3333A10k6j90j09j7J01J7L3J03r6J86k65K74o1j30K44J7k22j19J24m2K21j96l
$$ 110 84 -106 -215 -232 -131 -114 -81 22 -74 112 -153 121 60 -70 174 191 -31 -150 -26 -68 153 -43 -46
3356d6j60J97l2j6K30k79J17j15L00pl14KK63o9j48j45J84M0q3J21Q3n0N2k72
$$ -46 -206 -9 -41 -57 173 -106 11 -104 196 189 -125 -123 140 71 -77 -222 -38 2 -81 40 123 73 125 -147
3380a47K2R1k1Kj90L16p4J58K6m2k29N8j41K49J6q5J92k0j83q1p8K62l12M8J99
$$ -147 -125 -34 -55 -53 -243 73 -1 157 183 141 -88 -30 -171 78 94 9 201 181 -2 -83 -161 101 -211 -163 36
3405C6J65m33J61J43Mjo8O0j65N4J84k14Mk07L15n6j31K68O5m33L16P1k66K35
$$ 36 201 -232 -71 72 76 75 7 67 -98 -44 140 -74 -70 -277 38 -18 -149 119 184 -249 67 138 -128 107
3429A07l21J46K12r6k21J60K2l7L37j48l06K13k57J19Q7j89J82J90n4j36L15l03
$$ 107 -214 -68 144 48 -173 -13 9 -28 309 161 -145 68 -189 -70 17 -172 10 200 146 10 325 22
3451B2j32J04L2k0K34n56M00n8j39J27J97k23J01Q1r4J7j68L23m12L17J29n75
$$ 22 -110 -6 26 6 240 -316 84 26 -113 14 211 -12 89 170 76 93 -75 248 -164 153 282 -293
3473b93O5L24k24L4o1K15J21j43k3Nk56J03nm1L90j61q2J07r3n7J04j04J83l1
$$ -293 -228 96 -128 -94 -155 60 181 38 15 20 -236 -133 -138 -179 211 50 -32 75 -18 -75 29 -75 108 77
3497G7kj4m0m34N02J9M8j8K8jj27n6m2J18p5J54lJ91l48j25J08J85k09L3L3L0
$$ 77 75 61 21 -413 89 108 156 138 166 165 38 -18 -60 58 -17 137 134 325 -23 -148 -40 145 -64 -31 2 32
3523C2q8j07p0J19N02m69j96L81o7N4j38l8n1O1J81q3Q0j24p2P3J89r4n3R3k61
$$ 32 -56 -163 -233 -114 388 -81 -277 104 37 91 -47 -85 -136 -75 106 23 103 -21 -93 -20 169 75 22 115 -146
3548a46J60p0J13m5r4j86K69J70k20j80K65k40K27l4J4j4K3j38L1k07K05J90j85
$$ -146 14 -56 57 12 -82 -268 1 171 -49 -229 36 -204 23 -11 3 -11 12 -126 -95 -302 -97 93 -92
3571i2O6K1l7k50O37l75L0k59K80p0k46K95j12J3K53q6M4N4j89Q7j37K10k19M9
$$ -92 -26 -5 -42 -292 345 -30 0 -259 21 -49 -295 0 -112 -99 154 68 112 166 -23 64 -73 137 -82 -33
3595c3j21L32p5J12k57k77L64j12k14K76J33k42J61J27j12N4q2J84k04Q8j99j30
$$ -33 -154 178 103 215 -42 -319 45 -67 -281 -5 128 -114 47 174 62 116 34 218 14 102 -97 -227
3617b27K83j06J77J08k41j19M19l98K61j86M5k03L79j31M6p4j4K33j61M0j41L3
$$ -227 56 -50 127 235 -6 -125 294 -104 157 -29 16 -187 192 61 107 33 19 252 91 131 -10 23
3639B3K4k49K45l05K31K39l26Oo2L64r8l20L31j77J75o9J10o9j37K6L6J51k11
$$ 23 47 -202 43 -262 -31 208 -118 -112 -174 190 92 -228 103 -74 101 32 142 73 -64 -38 -2 149 -62
3662f2L22q7J00k01j68J6j46M08m2m35J31K10J0O7k9k1J03k62m7J51L27l49M7
$$ -62 260 173 273 72 -96 -80 -226 182 140 -295 -164 46 56 123 94 73 176 -86 -133 18 345 -4 43
3685D3K25j05j12p3J84l8o7m56M01O8j45K23Rj2k03J11m5p1j47J62R4j06K02k1
$$ 43 268 163 51 -22 162 124 57 -399 2 70 -75 148 157 145 -58 53 8 -63 -210 -48 46 -60 142 121
3709A21q4j9j9m6J55J61j98j5L9M1O7k09q5J07k33L18k91P5K3Q8j38L74q5j86
$$ 121 37 18 -1 -47 108 269 71 56 95 136 203 -6 -91 16 -217 101 -190 -115 -92 -4 -142 232 147 -39
3733c9J8j55K05o2QJ8rq3m5K78K2q9j13n5K10k51J54R8j60j22J81k7J80m19J18
$$ -39 -21 -176 29 -33 -25 -7 -16 -99 -144 134 156 67 -46 -101 109 -142 12 110 -50 -172 9 -18 162 -257 -139
3758a39L36j21l68M01l04K41m24O15l77K76j66m9J27J60n9j19J30k12j40K66j07
$$ -139 197 76 -292 109 -195 46 -378 237 -140 136 -30 -79 48 208 149 30 160 -52 -192 74 -33
3779c3J1J52k45P8m2MJ48l2k31K28q5mK03k22L44q4j83K45l69j24K79j15J06L0
$$ -33 -22 130 -115 -37 -79 -75 73 41 -190 38 -47 -51 152 -70 274 190 7 252 -117 -241 38 -77 29 59
3803E9P3k0p0Q8k08Kj73J96K45k72K45P5k85P0Rk08Q7K68p7j36K9Ql5R1k41P6
$$ 59 132 112 42 130 -78 -76 -249 -53 192 -80 165 240 -45 25 34 -174 -87 181 104 -32 -3 5 -30 61 -180 -104
3829a04P7K2j99K61n4k11L29k2k64L26r8j61J12j7kj6K0Q2j23M2J65l84K66o8
$$ -104 -27 -5 -204 57 3 -208 121 99 -165 161 63 -98 14 -3 -5 -21 -1 81 -42 0 165 -219 47 -21
3853b1Q6j5Oj59Q1L4j9K79k25n7r6J81J4Mj73k8K76k14J27k23j8J91J1o7P2J44
$$ -21 65 50 56 -103 -22 12 -7 272 47 -10 -106 75 89 93 -80 -108 168 -46 81 -142 -160 31 42 -25 47 191
3879A91q9J80p7j46j55p1m9J68j38L16J34k19m5J47l0j80k8K44k76J97J38p2o6
$$ 191 102 282 205 59 -96 -167 -216 -48 -186 130 264 45 0 147 117 -63 -91 153 -123 74 212 140 74
3902G4K2p5J37l03p8L12j41J57k30K43q6k42M55k74k7J41k68Q4O1n5J88o3r2J02
$$ 74 96 21 158 -145 -223 89 -52 105 -125 118 32 -210 245 -29 -56 85 -183 -99 -38 -93 95 32 -60 42
3926D2l45L89j43J44j94N7O5QJ7q5k7K00k8r3k85o0N70m00J65j54J65R5n1j77
$$ 42 -303 86 -57 87 -107 -50 15 23 40 -45 -72 128 100 7 -278 -338 232 -168 -3 -157 8 103 52 -125
3950a25K08k04K87l42O9P9K51o4j70k21K86N9m06K26J57k83J08L42j90J40j39
$$ -125 83 -121 166 -176 -107 -28 223 159 -11 -232 54 113 -293 -67 90 -193 -85 257 67 207 68
3971F8lj36p7L61j2m36J84J3m1J35J06m19N6L50p0l58L62j84Oq3r7L14k14L87
$$ 68 65 -71 -148 213 201 -235 -51 -38 -79 56 162 -257 -201 149 79 -279 83 -101 -95 -178 -275 39 -175 212
3995B12k87KJ85m45K75J15r9j79J05L51m55L00J8k54K14L1j5k32J02r6J85L2j36
$$ 212 -75 -73 112 -333 -58 57 -42 -221 -116 235 -220 80 98 -156 58 89 74 -158 -56 -152 33 65 -71
4018g1N0J28j85K57l61J57K65j60R4k19J60k19Q1j7k09O6J89J39j72K5j0r1j61
$$ -71 -21 107 -78 179 -182 -25 240 80 174 -45 115 -104 -23 -40 -249 -183 6 145 -27 -2 -12 -103 -264
4041b64K94J27l34n7K86j25J05l04P1Q1J80k60L53j84%K34j86Q1k73j0l2K37P6
$$ -264 30 157 -177 -234 52 -73 32 -272 -201 -120 60 -200 153 -31 -31 203 17 98 -175 -185 -217 20 96
4064I6j60n9J31R2o9J02q8O4P5j56J35k56J82k69K27j36P7m2J33J70l90M9L39
$$ 96 -64 -123 8 100 31 133 45 109 184 28 163 -93 89 -180 47 -89 -12 -54 79 249 -141 -92 247
4087B47k35o0j6M2o7r2J82k83L08Q2m3J92k47K54l87K17L2j99j20K99j89J03J95
$$ 247 12 -48 -64 -22 -89 -181 1 -282 26 108 65 257 10 264 -123 94 126 -73 -193 106 -83 20 215
4110B15j82j01K34nk54J87j16Q9j23n1K30L7p2p0Onp2l7nL64l11J04q2k07J93
$$ 215 33 -68 166 161 -93 94 -22 67 -56 -107 123 160 88 18 24 19 -53 -90 -95 269 -42 62 -20 -227 -34
4135c4J70j76J19Q4k12L72j50k69K03J40k86q3K08p7k9J2j23J78k8kK2k80K76
$$ -34 136 -40 79 163 -49 323 173 -96 107 247 -39 -122 86 9 -20 -8 -131 47 19 17 39 -241 35
4158C5k4MJ00q1Kn53N81k04J28K20j31j43M3J41j33j15M3P8J44k50J20N9K9j04
$$ 35 11 15 115 34 36 -517 64 -140 -12 208 77 -66 -23 118 -15 -130 -87 -9 135 -115 5 64 93 -11
4182a1K18k74J73l93L11N2M9j21r1J07K8j55k3K72j29n1j05Q5J37j72J81j98L2
$$ -11 207 -67 106 -287 24 76 125 4 -87 20 48 -107 -130 142 13 -38 -143 -58 79 -93 88 -110 -78
4205g8J06j40L73n44K7K01l0m7j33L55O6O7l18J09j04J42j5j98l5L22p3l39L83
$$ -78 28 -112 261 -283 -256 -55 -85 -132 -265 90 156 223 -95 14 -90 52 37 -161 -196 126 53 -286 97
4228I7N0k03J4K92j63P6m8n1j31p9m8K48k64M9J05r7p7L16j41k06O9K70j02%K20
$$ 97 147 -56 -42 250 87 163 115 64 -67 -146 -194 54 -210 -161 -56 -153 -230 86 -55 -261 -192 78 -24 -24 196
4253A96k96K44k76K79j46k94M26m5j60K95k59J5R5j30Q3L41k87m2J21k6k51J96
$$ 196 -100 144 -132 147 1 -293 133 88 -72 223 -36 -21 74 -56 27 368 81 39 160 134 -117 79
4275G9j13J61k77K16p7j96K56m3k61lJ57m2K54p3J95l01K35k12K62k14R7l2R6
$$ 79 -34 127 -150 66 -11 -207 49 6 -255 -258 -101 -143 111 38 233 -68 167 -45 217 3 100 68 164
4298A64j05O5n77N18k51M2O1K86l16J51kn6QJ23M7j13k3O5r1j07N20l57l02L13
$$ 164 59 124 -453 65 -186 -144 -83 203 -113 38 36 -20 -12 111 158 45 22 87 -4 -111 409 52 -250 63
4322F3K08j72k10M6r4M38m72L93K15o43K73o7L9J45k86J31L8J33j19m1J58r4k08
$$ 63 271 99 -111 -65 -159 279 -193 200 415 -228 45 -22 17 162 -124 7 45 178 59 18 176 82 -126
4345a26L25k28l9j20M25o7J19k85R0m9k17O7J79n8O9J13l16M03m13K61j11k7n6
$$ -126 199 -29 -68 -188 237 170 289 4 94 45 -172 -105 74 16 85 198 -118 285 -128 133 22 -5 -61
4368f1j41J60R4j5J22k30j8K82m98L22l2j10Q2l0l31M89R3q6J00j59l34K20L62
$$ -61 -202 -42 52 37 159 -71 -89 193 -305 17 -15 -125 -43 -73 -404 85 178 92 192 33 -301 -81 281
4391B81j67K7l27K53j71J8M22n38K46k39J96j00J35N5m4J01K1n37M54N4j03k81
$$ 281 114 141 -186 67 -104 -86 336 -202 44 -195 1 -99 36 91 47 148 169 -368 86 140 37 -244
4413b44J53j81M36k7k00J93j4o8N6K9l26L16k9l08J84J33j64K93j98j19N4J89
$$ -244 -91 -272 164 137 -63 130 116 48 104 133 -193 123 94 -214 -30 103 -61 232 34 -85 -31 158
4435A58k69Q8K75j63j12J91j54J37p4l7j61j9L16n04N24k66J28q7k02K14J29P3
$$ 158 -111 -23 252 89 -23 168 14 151 77 40 -121 -140 176 -328 196 -70 58 -29 -231 -17 112 185
4457A85l19K20l3k04K38j46L64k81J25j33N7M7q8n2n1L77k92p1J64jJ5L4q5j25
$$ 185 -134 86 53 -151 87 -59 305 24 149 16 73 120 32 -20 -71 306 14 -57 107 106 121 155 70 -55
4481e5N8N1J5n6J13j27Q3j1p3n5L41r7m21N13k67j06J44r5pJ90j98P0P7j05j00
$$ -55 3 54 69 13 126 -1 82 71 -2 -57 284 187 -234 279 12 -94 50 -45 -52 138 -60 10 87 -18 -118
4506a18J99k2j7Q9R7k16OMj9L9P4j40M5j82K07M4k1j0pO8j63j00J57j68J26J53
$$ -118 81 59 42 131 228 12 18 22 3 42 116 -24 21 -161 46 90 69 59 52 120 -43 -143 14 -154 -28 125
4532A25q5q1j26L25k75K32j23J41r0R0j0k78J48Q1J66l08K36l6K05j72k93n9R4
$$ 125 40 -41 -167 158 -117 115 -8 133 43 133 123 -155 -7 74 240 -68 168 132 337 165 -128 -187 -93
4555i3J92k48l6M98j43j86L06l66J7J8n6O3k0P8l7J13M7n2N8k63j79J91k42J63
$$ -93 99 -149 -185 313 170 -16 290 -76 -59 -41 -97 -34 -54 24 -13 100 147 95 153 -110 -289 -98 -340 -177
4579a77J46n1K3p7pj0J27p2J65j68j54J67J3J37j78K87k23J27J25k69J18r3kJ75
$$ -177 -31 -82 -59 -136 -143 -153 -26 -98 67 -101 -255 -88 -75 62 -116 171 -52 75 200 -69 49 -44 -46 129
4603A29r3n6J21j8J09J32j61k03J6l49L34o6K33k84J10l1J5J16k8m1m0j36l32
$$ 129 36 -20 101 83 192 324 163 -40 -24 -373 -39 -105 128 -156 -46 -77 -62 54 26 -15 -55 -191 -523
4626e23L83O4NJ47M4l04R0Q0j6l6J6o2K71j2l96K71R8l5o3l9kk33K05j75n6J99
$$ -523 -140 -76 -71 76 120 -184 -94 -14 -30 -66 -50 -112 159 147 -249 22 120 85 22 -17 -19 -252 -47 -222 -278 -79
4652g9j5K84k88L35j42k68o3K24L8o2J36l05J85j07J35J65j33lj2P6o1kk7J06
$$ -79 -94 190 -98 237 95 -173 -236 -12 26 -36 100 -205 -20 -127 8 173 40 37 25 101 40 38 11 117
4676A17J1j23K1k08J48j3O8J60k04k24Q5j79J78J89Rq2J88r9q1L28j73k27j49
$$ 117 128 5 26 -182 -34 -47 21 181 -23 -247 -162 -341 -163 26 35 -47 141 42 -39 289 116 -111 -260
4699b60M72k73j19q5L64l1p0M4J6J58l15P2L66k49j45J43J8j33KJ72j07kJ33m07
$$ -260 212 -61 -180 -265 99 68 -2 42 58 216 -99 -27 339 90 -55 88 106 -27 -25 147 40 38 171 -236
4723b36M05j40K7O3l51J53l9J57q6R6O8k17J2M8J73k8N4j53Q5N8j58L5k72O01
$$ -236 169 29 56 119 -232 -79 -118 39 -47 49 117 -100 -88 -40 133 105 159 6 91 149 -9 26 -246 355
4747C55l80j14Q0j5M20m73J85j41J89K29l59k78M75j42j98L49m41K11k65J89K09
$$ 355 -25 -139 -59 -74 346 -127 58 -83 106 335 -24 -302 173 31 -167 182 -259 -48 -313 -124 85
4768H5r1j33J14J52r6Q5j22j65L66n40M85l26K14K4j72J68o7K35k98J35K23j56
$$ 85 -6 -139 -25 127 31 116 -6 -171 195 -345 140 -186 28 52 -120 48 -19 216 -82 53 276 120
4790A20L5j17LPO6j73p9J87J24r4j16l1r4q8M58q8R3j52K8j50j17J78j63J79P6
$$ 120 155 38 41 48 114 -59 -138 49 173 79 -37 -68 -162 -250 208 120 213 61 89 -61 -178 0 -163 16 92
4815I2n7j55J89k75RJ46J4j50M97j01j24P5j28j33K27k86J22rl8q9L93q9k51R8
$$ 92 35 -120 69 -206 -197 -51 -37 -187 310 209 85 160 32 -101 126 -160 -38 -47 -85 -174 219 130 -121 -23
4839b3l10J79Q9j66J40J0J86N5k96MK91j03p5K3J57j23r2m0J42r9J30L2nO4j79
$$ -23 -333 -154 -65 -231 -91 -81 105 160 -136 -132 159 56 -19 4 161 38 -54 -94 48 -51 79 111 106 170 -9
4864iK99l44m2L0K88j78k16K20j07K59l13K08l9K4j48k4JpPn6j50L19L0J31j68
$$ -9 290 -54 -96 -66 222 44 -172 48 -59 200 -113 95 56 80 -68 -92 -91 -98 -91 -147 -297 22 52 183 15
4889A5j39J48j0P3q7J2M9j32J93m3k15J42o3j01O3N2K43k14J48Q2p4j64j18Q5
$$ 15 -124 24 14 87 0 12 61 -71 122 79 -136 6 -57 -158 -95 -43 200 -14 134 216 142 -22 -140 -55
4913e5Q2j71O4L4o8N7j03K54L3k80J1L55j15K8Mj64q7J73k01J0K3N2l0Q4K24l98
$$ -55 27 -144 -80 -46 -114 -57 -160 94 127 -153 -142 213 98 126 130 -34 -121 52 -149 -139 -116 -64 -94 -10 214 -184
4939a84M71l20J48O7m91N49r6nl47J0L6R9Q6k48J49J28J68j66m4j60L0Q0O7l5
$$ -184 287 -33 115 182 -309 240 144 139 -208 -198 -162 -63 23 -225 -76 52 220 54 10 -150 -120 -40 27 -8
4963hm0J64J02l58K58n1j77J03Q2M9kJ03p6M1l55K68r2J11j11j07K08l58Q5O7
$$ -8 -48 116 218 -140 118 67 -110 -7 75 124 122 225 149 190 -165 103 11 122 11 -96 112 -246 -161 -94
4987i4M4o8L97k56J68n7l21K76r7j29K09r2l05J99K54r5k00L67k99J18K78n10
$$ -94 -50 -118 279 23 191 134 -187 89 -8 -137 72 -20 -325 -126 128 33 -167 200 -99 19 297 -213
5009b13K99r2j66L43k00J21j77J62L08l56j42J04K59m96L58j67Q9Po7J49n0R9
$$ -213 86 -6 -172 171 -29 92 -85 77 385 29 -113 -9 250 -246 112 -55 34 41 -26 123 73 172
5031A72k64K01N2k49M1M2M6j41J30q7Q5Jq1K0l8m8J1R4l0L5J12l65J65M08j87
$$ 172 -92 109 161 -88 -47 -5 41 -100 30 -57 28 29 -52 -32 -70 -118 -107 -13 -43 -8 104 -261 -96 312 125
5056A25l67P24l47l8MJ70j29n39M34N9j14o0N8J00J92n96M40j32K36k68K81k70
$$ 125 -242 482 135 97 101 271 142 -397 37 96 -18 -78 -20 80 272 -324 116 -16 220 -48 233 -37
5078c7O8j82L37l0r4k74K93o2k6P8l0J01j03L7j1n3P0l7q7J03m4M7j59l1O0J09
$$ -37 31 -151 186 156 62 -212 81 19 -7 71 41 142 39 76 65 12 82 45 -42 61 17 64 -95 -126 -66 43
5104D3J01L0k03K2J26J82l59K37l16L57k86k6n6L23j98k6K89j27q8o6P0j67l7
$$ 43 144 174 -29 -7 119 301 -58 179 -137 220 -66 -92 -148 175 -23 -49 240 113 25 -41 29 -138 -175
5127a75J75M4j70L02r9j53J16j91J95J17M4k63L79k39j71N4R4k76J39M53p59L84
$$ -175 0 44 -126 176 77 -76 40 -151 44 161 205 -58 321 82 -89 -35 59 -217 -78 375 -384 0
5149@J74l2l30M14q7j31Q3o4p9Q2m1J80j89J97q1J6j32j39L75q2k95K94j77J86
$$ 0 174 142 -188 226 139 8 91 27 -52 30 -11 169 -20 177 96 112 -20 -159 216 134 -161 133 -44 142
5173A42j73O1N8j2j54J77k06J95Kk39L41k15J58k6Q9l24l3J48K17k26j1Pj49K99
$$ 142 -31 30 88 76 -78 99 -107 88 90 -149 192 -23 135 109 198 -126 -159 -11 206 -20 -31 -24 -173 126
5197A26P3l43L26j88L3j59N0j23M5J90M7l4J97m84M24q5j02L5j2O5j50J60l52
$$ 126 199 -144 182 -6 27 -132 -82 -205 -160 30 77 43 240 -244 180 95 -7 28 16 81 -69 91 -261
5220b61J89K43j51j22P8J64k61l9M9Q7J16j09J78o7m2J6j84K18k49L05j93j70
$$ -261 -72 171 20 -102 -24 140 -121 -160 -111 -24 92 -17 161 94 52 68 -116 102 -147 158 -35 -205
5242b05J48N3NN2o4L1L5l4r8J42pN9j49j73K19N5j65P1p6l6N5M7j28L07j26J0
$$ -205 -57 -4 1 53 -11 20 55 21 -77 65 58 117 -32 -205 14 69 -96 -25 -101 -137 -82 -35 -163 144 18 28
5268B8%l24M58k75J72k58J71K0L02l56L3K96j08k24K14Q6m72M11Q2l45L32l07
$$ 28 28 -296 162 -113 59 -199 -28 -8 294 -62 -29 267 159 -65 149 235 -237 174 256 -89 243 -64
5290f4K01j92J0K14P7l63L5R4O2l51K65j32J79L87p11K33J06j54J81p9j48J02
$$ -64 137 -55 -45 169 246 -117 -82 12 74 -277 -12 -144 35 422 -289 -56 50 -104 77 -2 -150 -48
5312d8P7j35P6m3K13k56O1J69k35P8p9L36k70q0O5P5k1l2N5K3j01NQ1n4O6J42
$$ -48 29 -106 -30 -73 140 -116 -55 114 -121 -43 -122 214 -56 -136 -71 4 -17 -49 6 29 -72 -67 14 -40 26 168
5338A68k42j4K00K2k10J74l3J72j92J21k9J10j2m82J97k6K99j02j3j90K61k33
$$ 168 -74 -88 112 134 -76 98 65 237 45 166 137 247 235 -247 -50 -76 223 121 108 -82 179 -54
5360e4k05M54p6k63K43j38M4j68J57k24Q4K67k48J71R2o3m3k2j08L36l74n6J66
$$ -54 -259 195 119 -144 99 -39 5 -163 -6 -230 -146 121 -127 44 136 73 30 8 -100 236 -138 -194 -28
5383b8j4J62j41j42J27J39q2l6J7M6p4K35j23m15O15k75j2j83J77j26J34r8p4
$$ -28 -42 120 -21 -163 -36 103 21 -15 2 48 -26 209 86 -329 286 11 -1 -184 -7 -133 1 -97 -171
5406a71J30r7L25k27L5J14k07J38j01M8P4k51J32R5k25K34L2j35j49N6l5K02M6
$$ -171 -41 -138 187 -40 -5 109 -98 40 -61 -13 61 -190 -58 37 -188 46 78 -57 -206 -150 -185 17 63
5429F3m0j43K08k56j9J87m3L4k33m8M16n7J6j73L22l66L47m03j15K17J69j99J09
$$ 63 23 -120 88 -168 -187 0 -43 -9 -242 -290 126 69 85 -88 234 -132 215 -188 -303 -86 83 -116 -7
5452gk07K17K42k35J13j37Q8r1j04L3L77l38R6j99J63j83L19R1k41k8J94l6l32
$$ -7 -214 3 245 10 123 -14 74 -17 -121 -88 289 -49 47 -152 11 -172 147 238 -3 -31 163 127 -205
5475b05M77j97j82K34k53K99R5l4jj16J54k23n3l4J00m3o5O3j55J06p1J11P3o7
$$ -205 272 75 -107 127 -126 173 268 234 233 117 271 48 -5 -39 61 18 -47 16 -139 -33 -104 7 80 13
5499A3j98m1J72J76L6k02m0R5j8j96J65N0K1j39J23O9L2j76k1J57l9K2m4j11M49
$$ 13 -185 -226 -54 122 158 -44 -84 11 -7 -203 -38 12 33 -106 17 86 118 -58 -79 78 39 61 17 -94 355
5524C55m32k1k0K13k15J96M8l05J30j56K18P3N4J5l76J29l5R2k31K88n2J44n03
$$ 355 -77 -98 -118 95 -120 76 124 -181 -51 -207 11 84 138 153 -223 -94 -129 -37 -268 20 -32 112 -391
5547c91P05k42j21m9M9l3r1K39L6j85J33j71M5J3K11j40J23K55o18J70j40L95
$$ -391 314 72 -49 -98 -49 -82 -173 66 102 -83 50 -121 -76 -63 148 8 131 386 -232 -62 -202 193
5569A93l35J81k19K58j55K37j95j01q9K36k8k65M90j87p4j57J81J01o9L1J51k81
$$ 193 -142 39 -180 78 -77 160 -35 -136 -225 11 -17 -282 208 21 -53 -210 -29 72 3 34 185 -96
5591i6J37n2j47k6K31j42j3QJ39L33k85j82r2l0L27K6j0j73j19N21l73J7J09o7
$$ -96 41 -11 -158 -184 47 -95 -108 -100 39 372 87 -95 -187 -217 110 136 126 -47 -166 355 -18 -1 108 41
5615D1j20Q4nj23J64n6J34k43K2m3L8K30k20J56k47K08J72l33j12J93J28j55j14
$$ 41 -79 5 0 -123 41 -15 119 -124 -102 -145 -107 123 -97 59 -188 20 192 -141 -253 -60 68 -87 -201
5638b01K0q8L31L6O9k3j29r9R3L80l08J43l23L84m34J61j49K93j96L0J8o4J1J27
$$ -201 -181 -269 62 98 167 144 15 -84 9 389 81 224 -99 285 -149 12 -137 156 -40 -10 8 -56 -45 82
5662H2j66M0P5l29K43j39J7K49Q7m6j74j32M3K09N4l8j60K13j85J0J5j96L30m6
$$ 82 -84 -44 31 -298 -55 -194 -177 72 159 113 -61 -193 -150 59 113 75 -85 128 -57 -47 -32 -228 102 56
5686E6J58k42k79j1J59J22J18k60N07m76K29j36L14j09j65J87n2K1k58L69l63
$$ 56 214 -28 -307 -318 -159 -37 81 -179 328 -148 81 -55 259 150 -15 172 120 141 -117 252 -111
5707a11R8NJ50l75O71m88n4j4Q2P4k11K20p9j7K44j6k35L5j22L79l99J27q7j09
$$ -111 -13 -8 142 -233 438 -50 -104 -118 -36 38 -173 47 -32 -49 195 179 -56 -21 -143 236 -163 -36 -123 -232
5731b32N08o09K96n6R2M9K6q9L7K7r2m4K05n2q7M2P4k2rj79M27k19k3l8j28K06
$$ -232 276 -333 -37 -93 -1 48 74 -15 22 49 -43 -87 118 66 -21 21 95 73 64 -115 312 93 70 32 -96 110
5757A10no5J24J9r6K6k9p0M3L4M4m9l9J44l75K29j67L41k51n0L15k69J45k14J44
$$ 110 105 40 164 183 87 113 84 14 57 91 135 86 47 191 -184 45 -122 219 -32 -82 233 -36 109 -105 39
5782C9mj37M37n24L61J4k45K21r7j64J13l8L4o1O2or0J40k78K72J40Ll29j4K17
$$ 39 35 -102 335 -189 172 186 -59 162 65 -99 14 -24 10 -51 11 5 -85 55 -223 49 189 192 -137 -151 66
5807F6K40m12K95Q2j12n9k47Mn1J87om6K80l04L82k41J34o10L65k1j1M7J43p2
$$ 66 306 -106 189 271 159 100 -147 -143 -194 -7 -13 -59 221 -83 299 58 192 -418 -53 -74 -85 -38 105 33
5831C3r4MK0j74J44J30k22R2o8J80Mj38J80q5O4k83Q8J08K00k90R1J32r5j67M9
$$ 33 -61 -57 -37 -211 -67 63 -159 -67 -135 45 49 -89 91 6 70 -213 -125 -17 183 -107 -16 116 21 -146 -97
5856i7K9r4J49J59L0j37l18K34N0P6Q1j26p2r7J53kj48L27k74j57Q9o5N06j26
$$ -97 -68 -162 -13 146 176 39 -279 -45 5 81 162 36 -36 -133 20 18 -130 197 -77 -234 -145 -210 296 170
5880A70j79R6k28N2R7J26k87q0K70j06L8J19n2k98L88k59J89Jj39P2q9m8M73j61
$$ 170 -9 87 -141 -89 8 134 -153 -233 37 -69 -31 88 36 -262 126 -133 56 57 -82 -10 -99 -147 326 165
5904A65k38L67k27o8o0L2p5J96l21K99k60O5j4jK55j79J32j06K09j53k0M9j86
$$ 165 -73 294 67 -1 -61 -29 -104 92 -229 70 -190 -125 -139 -140 115 -64 68 -38 171 18 -2 47 -139
5927a39N4K43N3k1j06l02K83J31n08J78R7P1Mj49m6m6K81k23J26qN0jk02J22P4
$$ -139 -85 158 211 190 84 -218 65 196 -312 -134 -37 34 38 -111 -157 -203 78 -145 -19 -27 23 22 -180 -58 16
5952A6j31r7j0L38l69J54J88K8o8N4k96J82J07J00j92k9p9K74mk69J83m6J70k54
$$ 16 -115 -212 -222 116 -253 -99 89 117 49 103 -193 -11 96 196 4 -25 -104 170 166 -103 80 34 204 -50
5976e0J77k85J43r6P5K66j39k67K72k54J61j6Q2j04j89M4J30J68M3j61K1p9J12
$$ -50 127 -158 -15 -111 -36 230 91 -176 96 -158 3 -13 69 -35 -224 -180 -50 118 161 0 21 -58 54
5999E4N0o5J0O6q0j18J76k02K44j49J6j2K91j79k23J09J96k24N7OQ8K2j56J78
$$ 54 104 39 49 115 35 -83 93 -109 135 -14 2 -10 281 102 -121 -12 184 -40 17 23 111 133 -23 155
6023A55P7j70j80o4J10N5j8Q3n0j90L55m45K75k64M32k11J27kN0j50J80j77J06
$$ 155 232 62 -118 -182 -72 -17 -35 48 -2 -192 163 -282 -7 -271 161 -50 77 75 125 -25 155 -22 84
6046H4ml25J72J68j25m6J60l82K15j22K22j3N8j0j10p1K03l20J24Q3k04M73m23
$$ 84 80 -245 -73 95 -30 -76 84 -298 -83 -205 17 4 62 52 -58 -129 74 -246 -122 -39 -243 230 -193
6069a93K59k3k42L17m9r8J34j02j15J22j5k7M1J8j22r8J78K46l3m25J19L33j75
$$ -193 66 43 -199 118 69 -29 105 3 -112 10 -5 -32 9 27 -95 -193 -15 231 198 -227 -108 225 50
6092E0k64L42k08J85l85L69n3j65J89n5k43Q7K37J49l58K97j13j56K19mR8j21
$$ 50 -214 128 -80 105 -280 89 36 -129 60 5 -238 -151 86 235 -123 174 61 -95 124 120 218 97
6114I7k5l7L5m5o7j50K27L9n1K26m82L64m21L32O9j74r2J38K77m68N7K80j27j73
$$ 97 72 35 70 25 -42 -192 35 74 23 249 -233 131 -290 42 111 -63 -155 -17 260 -208 -151 129 2 -171
6138a71J46p7L8j14L26k54r3J14J58J0r1K15k67O7j0q3R8lm6J36l5j30o3K35k6
$$ -171 -25 -102 -64 -178 148 -106 -199 -85 73 83 -8 207 -60 7 -3 -86 12 9 -37 99 64 -66 -129 106 80
6163H0R9j60J27l58j9J84J08o5Nj64J62m2L63m64M7K76m7J98l05R9k19L89k13
$$ 80 179 19 146 -212 -231 -47 61 -4 1 -163 -1 -43 320 -144 -97 179 132 330 25 124 -95 294 81
6186H1Lk19L31k30K0rj39L73l33K7M2pK91r9n8l3k40K26P1n5R3r0p8P3k12K95
$$ 81 84 -135 196 -34 -14 -23 -162 211 -122 -95 -53 -60 231 132 74 41 -199 27 98 43 136 46 -32 41 -171 124
6212A24J6p1l11Q2J06P3R9J71k06J62l34m9J39j08QK96k78J26n7k6J05j68q8k0
$$ 124 140 69 -242 -160 -54 19 118 289 83 245 -89 -138 1 -107 -99 197 -81 45 -12 -38 67 -101 -189 -209
6236b09L67R9m13K00q5n1J29j47R9R6j03L1K2p8RR6j%q5O1k08lN62l39r4j98J68
$$ -209 158 257 -156 44 -41 -92 37 -110 -11 85 -18 13 35 -43 -34 62 61 61 -24 37 -171 -174 388 49 -45 -243 -75
6263g5N1M7Q2m3r9l06M07l02K83j02J73q4n5K6J44j38r1q8K15k92K28K65l19m8
$$ -75 -24 23 105 62 -37 -343 64 -238 45 -57 116 32 -23 3 147 9 -82 -170 45 -247 -19 246 -73 -121
6287a21J39l95N79K84n54L12j31j83q3J28P2j13L0K16l85K73p3j72P5R7k32K17
$$ -121 18 -377 202 486 -68 244 113 -70 -153 -25 47 -66 -36 180 -205 68 -5 -177 -102 -5 -237 -20
6309b0K51k45K66l5j68q9j44k3J87M5k79K50M6J19j18k72L21j32j56K58j49K21
$$ -20 231 -14 252 217 49 -40 -184 -207 -20 25 -254 -4 42 161 43 -229 92 -40 -196 62 -87 134
6331A34R3l66j89L37j10P8L3J71k64K65Mp2j75ln6M6p5J13l7K17k77J96k27K88
$$ 134 227 -139 -328 9 -101 -23 10 181 -83 182 186 114 -61 -64 -120 -74 -149 -36 -73 144 -133 63 -164 124
6355A24N0j38o7N8K42o7No1j72K64k50J12j56J06n2k9k6P8l3k67N90l72m3m9M0
$$ 124 174 36 -31 27 269 202 207 146 -26 238 -12 100 -56 50 -2 -31 -57 21 -12 -279 311 -61 -104 -153 -113
6380a13L97j75o8O6J56k37L18n54K89m8l64J81J80j02m4K38j49J23j70K60j10
$$ -113 284 109 41 107 263 26 344 -210 79 31 -333 -152 28 -74 -118 120 -29 94 -76 184 74
6401G4o9j19j9L84k43O2M0J10Q6L4l06n6Q6j70q6L19k69J35O0l96L88o6Q5J55
$$ 74 5 -114 -133 251 8 70 110 220 306 340 34 -22 64 -106 -192 127 -142 -7 53 -343 45 -21 64 219
6425B19l09r0L95j65o4k07L52j45q1J54O5K8m42J97R5j06oK61l90K78k27PJ95
$$ 219 -90 -180 215 50 -14 -221 131 -14 -95 59 124 152 -290 -93 2 -104 -110 151 -239 39 -188 -181 14
6448A4N1j52J60j58L58k07N4kr1j13l4m0K41k15K55j19N1l39K25J9m0Q8j89L37
$$ 14 65 -87 73 -85 273 66 120 118 27 -86 -120 -160 81 -134 121 2 53 -286 -61 -42 -82 6 -183 154
6472A54j70m5j19K95k66K48j01O2Kj57PJ69j9J5n1k75J40K73k8j15m6J33k55K10
$$ 154 -16 -61 -180 115 -151 97 -4 58 60 -97 -90 79 60 75 24 -251 -111 162 134 19 -27 106 -149 61
6496F1q0p6L3J52j54R3k24L88j79J57j8k75m5R6J01k55L02j81J02j94K6K66K0
$$ 61 -19 -95 -62 90 -64 29 -195 193 14 171 153 -122 -167 -71 30 -225 77 -104 -2 -196 -170 96 116
6519A16l53K88l62N05k34K6O5K34l09K02j15j98J28l8k15M5J78J10l20K18P4j90
$$ 116 -237 51 -311 194 -40 -14 51 285 -24 178 63 -135 -7 -45 -260 -215 -37 73 -247 -29 45 -145
6541a45J02l2r5L17m6o8kr3J09M0j01j22j2m7K04k86L63Lk26j31L03L1j75K58
$$ -145 -43 -75 -170 147 101 33 31 -62 47 87 -14 -136 -148 -195 9 -277 86 89 -137 -268 35 66 -109 149
6565A49J43m56J75k07K71j29K45m86L61l88oL13o1K27l6k47L87j37j35j3K21o7
$$ 149 292 -164 11 -196 75 -54 191 -295 66 -322 -328 -15 -76 151 115 -132 255 118 -17 -30 191 124
6587A24k8k94J65R0N1j41J54j66q7J42O8j33L0o4J18KJ8O1J27l40q5K11Q6M4j14
$$ 124 96 -198 -33 57 108 -33 121 -45 -132 10 78 -55 -25 -89 29 31 49 110 237 -103 -188 23 109 153 39
6612C9J56p5k72J63J73m82N06m57L69Lj36O2Q7N5r3m0j6j70L15k98ok8M3L01J0
$$ 39 195 120 -152 11 184 -298 208 -249 120 123 -13 49 136 191 98 58 42 -128 187 -111 -117 -145 -102 199 209
6637B09j76K51k25K7J13m28J09R5K8K67k95J57j15j26K10r8m9J92j59o6J24k51
$$ 209 33 284 59 86 199 -229 -120 -25 3 270 -25 132 17 -109 101 3 -46 146 -13 -79 45 -206
6659b06J71l2J00J74k29j1r4L0K07J1l5o1J85k98N7k36Q8N5J49k53J57O9p9o2
$$ -206 -35 -67 33 207 -22 -33 -127 -97 110 121 86 25 210 -88 -31 -267 -179 -124 25 -228 -71 -2 -81 -143
6683a43K22j2P0m11L44j45J55m3J09k94p1J3J61J77l82K97j13J76j64P3J13l11
$$ -143 79 67 137 -274 70 -75 80 37 146 -148 -219 -206 -45 132 -250 47 -66 110 -54 19 132 -179
6705a79K66L8m3nO8o1q6j77J33M29m79l7mL04k12J14K70l8k91q0m6K34J95l04
$$ -179 87 125 82 77 145 84 -2 -179 -46 383 -96 -133 -137 167 -45 69 339 301 10 -70 -116 118 313 9
6729IK53m40L80l28K37J18l13Q5K8k10J7L30k33p9R2JJ05l5p0J30J2j17j56L41
$$ 9 262 -178 202 -126 111 229 -84 1 29 -181 -164 166 -67 -146 -54 -53 52 17 -53 77 89 -28 -184 157
6753A57j70j1r1J28q7nJ5R7J8o5m0J95k21J34o4k40L72k52K90p5k41J33J95p2
$$ 157 -13 -24 -115 13 -74 -79 -64 33 51 -14 -54 141 -80 54 -10 -250 122 -130 160 85 -156 -23 172 100
6777A00J32j53j12J80k87n7J03J80m7j87J51J7k01K80q7K13k38N6r1J48k60J03
$$ 100 232 79 -33 147 -140 -197 -94 86 39 -148 3 20 -181 99 12 225 -13 43 -48 100 -160 -57
6799e7K65l00K6L6J85k15Q3P4m72K03J85L8k10o2J59J91k80R3J78j47j8K53l68
$$ -57 208 -92 -66 -30 155 -60 23 97 -375 -172 13 51 -159 -221 -62 129 -151 -58 120 -27 -45 208 -160
6822a60L40j70P6N3j32K8k26L4N9J1J49r6M9J69l07r9J67j52J97J62k81l9L28
$$ -160 180 10 86 139 7 35 -191 -157 -98 -87 62 -34 15 184 -123 -222 -55 -207 -10 152 -129 -168 160
6845A60Q7k05J26k44K33Rj73k50J33J40m3K33k59J5J67L0k52L07k19J08l6r6j4
$$ 160 247 42 168 -76 157 166 -7 -257 -124 16 -27 206 -53 -38 129 159 -93 214 -5 103 67 -29 -43
6868d3J33lk14J33k1J41O6J6J0r0r1j95J70J76j26L3Q2k63J21k57M48k34K14j38
$$ -43 90 87 -127 6 -15 126 192 208 218 128 37 -158 12 188 62 95 177 -86 35 -222 226 -8 206 68
6892F8k4p9m00L76K10k10L09j24j40O7l8L0k11J52J25j41k2O2j21P8J66ll11K37
$$ 68 44 -35 -435 -59 151 -59 250 126 -14 53 15 45 -166 -14 111 -30 -52 10 -111 -33 133 130 -181 56
6916E6n5R9J7k13J72k77N98m65j9k25L26p7J00j25p8K70Q4j21qo9K72j87j25J08
$$ 56 1 100 117 -96 76 -201 397 -68 -87 -312 14 -63 37 -88 -166 104 188 67 59 -10 262 75 -50 58
6940E8r4k16J52L01q2k17j63P4o6K52n8J69j01j0O6k14J61Jj32K97Qo1l2lm8j23
$$ 58 -36 -252 -100 201 119 -98 -261 -187 -253 -1 -59 110 9 -1 65 -149 12 13 -119 178 186 125 93 90 42 -81
6966h1J9l7q0%J76o7M61k82K0k2j28J8k9K30j83p0M3O0N1k26L30o8n5N8n2j74
$$ -81 -62 -99 -179 -179 -3 -70 391 109 129 107 -21 -3 -32 198 15 -55 -12 48 99 -127 203 135 80 138 86 -88
6992h8k5K34k2j48L12l99Q0j54K96o9k5J11J19m3mM4j85K41k56J12nL8k96M4Q9
$$ -88 -113 121 99 -49 263 -136 -56 -210 86 17 -8 103 222 179 175 219 34 275 19 131 126 164 -132 -88 1
7017AJ43O0j68J54o1p7MP8J6K6qJ40l10j09K13O9k98K29p9k46J27n5K45J17l87
$$ 1 144 204 36 190 129 52 56 134 150 176 168 308 -2 -111 102 171 -127 102 23 -223 -96 -151 94 211 -176
7042a76L06k5j3M1r5J37l60M72k99o2m0J31m3J14J9J0j26P1j09K6j2J80k44J26
$$ -176 130 105 92 133 38 175 -185 287 -12 -74 -114 17 -26 88 107 117 -9 62 -47 -21 -33 147 -97 29
7066B9o8p2L00l31R9J37JQ0m70K47N9R6j98M17j97k65o1K98k68J59J18o5PL5k71
$$ 29 -39 -111 189 -142 -43 94 95 175 -295 -48 11 107 -91 326 129 -136 -197 101 -167 -8 110 45 52 87 -184
7091a84J05M7J24j44q4r9K22j35L16j98J09qm8j25K06rm1k30J77m5J75k26K1L42
$$ -184 -79 -32 92 -52 -136 -235 -13 -148 168 -30 79 71 23 -102 104 95 54 -176 1 -44 131 -95 -74 268
7115B68j52oj36o4K00n2j01k17L18j27J38j16j73J18o4K47p7l9l0n7Q5Q1k83K51
$$ 268 116 110 -26 -90 110 58 -43 -260 58 -69 69 -47 -220 -102 -166 81 4 -35 -65 -122 -37 44 -239 12
7139A2N2J60l61M6lK78k10N1j28rQ2J3J32j94J06k20L18q5J36r7J27j85n4j37
$$ 12 64 224 -137 -91 -94 184 -26 25 -103 -112 -30 -17 115 -79 27 -193 125 40 176 79 206 21 -33 -170
7163a70L08J57l72Q9N1m6j33K28k5j60K09o3j57MM9R1q6j40j49J54K38j13k55
$$ -170 138 295 -77 12 63 17 -116 112 87 -73 136 73 -84 -80 -31 60 -26 -166 -315 -161 77 -36 -291
7186b91J63J54j25L54k10j83J39J7K0M3K6jk06R6M8k38Q7j7K67j45O6j12R0k5
$$ -291 -128 26 -99 255 45 -138 1 18 38 81 107 106 -100 -4 44 -194 -107 -124 143 -2 64 -48 42 17
7210A7k42J39J61J05j30j50J13J86j17J22J07j26k85J7J17jk5O7Mj62K10N9l7
$$ 17 -225 -86 75 180 50 -100 13 199 82 204 311 185 -100 -83 34 33 8 75 79 -83 127 186 149
7233A49l39J80k8J36n1j14M8Pj87L48k79j16K47mM3L2n3K23Rk70j35L52j98R0
$$ 149 -190 -10 -38 98 47 -67 -19 -12 -199 149 -130 -246 1 -3 40 72 19 242 251 -19 -154 198 0 90
7257I0q0O8j17K40l66J45J46l68K12K9J99l02J74j61K9N3O7k88K44j67K4K61r5
$$ 90 10 78 -39 201 -165 -20 126 -242 -30 -1 198 -104 70 -91 -62 -9 58 -230 14 -153 -129 132 37
7280C7J5j01J2l1J24mk10K33j24j7Jj09J91M5J07m58M04N8n38L87J54l76O6o2
$$ 37 52 -49 -37 -68 56 52 -158 75 -49 -66 -65 -174 17 62 169 -289 115 173 -365 22 176 -200 -134 -196
7304a96O2M5K0N1j57K30m%j73K57q8J75k78j60K95k2K5m9K8K60l00n7M6j78M24
$$ -196 -134 -89 -69 -18 -175 55 51 51 -122 135 47 222 -56 -216 79 57 82 33 61 321 21 -36 10 -168 256
7329B56j66j56J34j10j06O7J06p4L3N1J59j07qn9J51j53j57K46o0j0rJ27o42M27
$$ 256 90 -66 68 -42 -148 -81 25 -49 -16 35 194 87 79 20 171 18 -139 107 47 37 28 155 -487 -60
7353f0J95j04p1P3O2k51J6J36qr7J91j61K19J34j40pp9k22J36P0j8j39k16J76
$$ -60 135 31 -40 33 95 -156 -140 -4 -12 -109 82 -79 140 274 134 127 48 -174 -38 32 14 -125 -341 -165
7377a65J55L48l48k66L89l3j35J63j51j17J82j02j75K78P5m7j42J72j12P9k13
$$ -165 -10 338 -10 -276 113 80 -55 108 -43 -160 22 -80 -255 23 98 51 -91 81 -31 48 -165
7398a65K94j15K9N8j57K06j32p1k2L2M03l29R6k41Q6R6q9Q9k40K24L8J60m87K08
$$ -165 129 14 43 101 -56 150 18 -53 -75 -43 360 31 127 -114 -28 68 -21 68 -172 52 90 250 -237 -29
7422b9J27o7k1k79L46l35L80m5L8r1O4k6K8j93J25j05K95k65j5OK71l72K61K5
$$ -29 98 31 10 -269 77 -258 122 77 115 24 88 62 90 -103 22 -83 212 -53 -68 -62 209 -163 98 123
7446A23l02K37j69K87k61N8j92L04j93K66j54j94%K06L2R5l36L4R7J99j14KJ91
$$ 123 -179 58 -111 176 -85 -27 -219 85 -108 158 4 -190 -190 16 48 143 -193 -159 -62 137 23 25 216
7469B16m54L17k12j38K36n9J13J46o1j61q9PJ72j13M0m3KK06j24J4j20j7J62J25
$$ 216 -238 79 -133 -271 -35 -94 19 165 104 -57 -146 -139 33 -80 -40 -83 -81 125 1 15 -105 -122 40 165
7493A65k36K45l03Q3R5k13K49k4j36k33J93J9O9Q4kr0J94k22J14J62l63P5J90
$$ 165 -71 174 -129 -46 49 -164 85 61 -75 -308 -115 -96 -27 57 55 -35 159 -63 51 213 -150 -75 115
7516A15j15k66L93l14K47l16K33r1L62j72j36J72L4m22L79k8j80J38j3j02J18
$$ 115 0 -266 127 -187 60 -256 -23 -114 248 76 -60 112 146 -276 103 75 -105 33 20 -82 36
7537C6j10J09K7j59J17J1m3R2j40j52J32J76K06n35M17l02J18j42J10J36K7j00
$$ 36 -74 35 62 -97 20 31 -12 80 -60 -212 -80 96 302 -233 184 -118 0 -142 -32 104 131 31
7559C1j08M1O3J2j03j2k3J52p1P6j10J01k84K54k36r0N48k69j60K80K50n76J54
$$ 31 -77 -36 27 39 -64 -76 -99 53 -18 58 -52 49 -235 19 -217 -307 241 -28 -188 92 342 -234 -80
7582h0Jj7J03ln9J26j2K39j67K0K21l96O8J8J63j61j74JJ83k02J03J25j96O3j18
$$ -80 -79 -96 7 4 -55 71 59 298 131 151 372 -24 44 62 225 64 -110 -109 74 -128 -25 100 -96 -33 -151
7607a51J60K2j52K84q2k44K65m24K62O5R6j46K04j06j20Q8k8Pn7J85j08j8P5l5
$$ -151 9 31 -121 163 81 -163 102 -322 -60 5 101 -45 159 53 -67 21 -7 0 -57 128 20 2 77 42
7631D2oJ26L0l72Q0k49L73l87L42R2K9l68M48j66l0KJ08j99l4J00R6l25K92m2
$$ 42 36 162 192 -180 -100 -349 24 -363 -21 71 100 -268 180 14 -16 -14 94 -105 -139 -39 57 -268 24 -18
7655a8n5K9L23j60j27J4J60l9j6J06p0j54RO3j31N1L2pl3Q2k15J85n8J40k10J51
$$ -18 -73 -44 279 119 -8 6 166 127 111 217 147 -7 2 65 -66 -15 17 10 -23 59 -156 29 -29 111 -99 52
7681E2K11r0r3q8K41k91K43l23NL73j22k09R7K2N0J1l45r2M30J8q7J67o8K5r0
$$ 52 263 173 80 -8 233 -58 185 -138 -133 240 118 -91 6 28 78 89 -256 -348 82 100 13 180 112 137 47
7706D7K7k6j65Q6k10M91k22m5j63K25j6l07J05K88k97M8J55n6R7o5J3L67l80N0
$$ 47 74 48 -117 -31 -241 250 28 -17 -180 45 29 -278 -173 115 -182 -134 21 -35 62 -3 10 377 -3 47
7730D7L0k54L00n5K07k56M7P7Qj72J13m9q9K24ok91K98l10R7J07N9j59J12l59
$$ 47 77 -177 123 68 275 19 66 143 151 -21 92 43 -46 178 172 -119 179 -131 -34 73 132 -27 85 -274
7754b74K07J86l38R9K06N5j20M4q7J60j93K07k28L7J08Pp2N5J24R6k86Q5j78L4
$$ -274 -67 119 -219 -120 86 141 21 65 -22 138 -55 152 -76 -39 69 76 4 59 183 279 -7 78 -100 -66
7778f6p4j0L81l4l3k89J25K53m94M3K50k5n1Q5k08K03j7l2j0J00j93k1L20k90
$$ -66 -140 -150 231 197 164 -125 0 253 -241 -198 52 27 -24 61 -147 56 39 7 -3 97 -96 -117 203 -87
7802h7K8o0L82j50J09O5k19k9k42J69K53k63o8n4J43O4j76K36j02J32l6l6k02
$$ -87 -59 -119 263 113 222 287 68 39 -203 -34 219 -44 -112 -166 -23 41 -135 101 -1 131 95 59 -143
7825a43K8M22l42K00r4J05J31m98R3J93j13J55k30K70k12RJ05P0k49K23No2o8
$$ -143 -115 307 -35 165 71 176 307 -191 -98 95 -18 137 -93 177 -35 -26 79 149 -100 123 128 66 -2
7848bp5L7L0j4j7k46r2M60k93P4J11J49n4j63K67n47L94L9k78J00K50k43r5J48
$$ -2 -77 -40 -10 -24 -41 -287 -379 81 -212 -138 -27 122 68 -95 172 -375 19 58 -220 -120 130 -113 -208 -60
7872f0J39Q1l48Q3R9L6k2r0K62j14p3J76j48Q4n3P7M4m2o12N04J61j32k5j73J03
$$ -60 79 160 -188 -105 -6 30 8 -82 180 66 -7 169 21 105 52 129 173 131 -481 23 184 52 27 -146 -43
7897d3J89L6l2j93J53K30l26J1l2J19k30oJ84k78J62N4M3k35L43Q0j69k4q4M7
$$ -43 146 182 150 -43 110 340 14 25 -7 112 -118 -124 60 -218 -56 -2 41 -194 149 229 60 36 -48 -1
7921ak95M30m5k%l85M02k7k24j4M6K97k91l0L14j44j61L25l07j00M34m01J34k
$$ -1 -296 134 89 87 87 -298 104 77 -147 -161 -115 182 -109 -139 175 31 -130 195 -112 -212 222 -179 -45 -47
7945d7k3Q1J04j92p1J53Q8K3o6j46J03oj9o3k27N2K23M3P1k78O7J33Oon6K03l48
$$ -47 -70 11 115 -77 -148 5 93 116 50 -96 7 1 -18 -81 -308 -256 -33 10 81 -197 -130 3 9 3 -53 150 -198
7972a98M41l58p4J69j0K29l59K76K81k44j36K70l77q7M11k30M6n8J58o8k67J69
$$ -198 243 -115 -189 -20 -30 199 -160 116 397 153 17 287 -90 -177 234 4 50 -8 150 82 -185 -16
7994a6N5n9J66l26L19l90K18J12j22L43l01K8l8M1J00L4K8j59Q6j65j41J38J34
$$ -16 39 -20 146 -180 139 -251 -33 79 -43 300 -1 27 -11 30 130 164 192 33 119 -46 -187 -49 85
8017H5j71K34j75M1J55j13k86K80j10N1l09M04k79J05J15N1l3j51N8k3k42J26
$$ 85 -86 148 -27 14 169 56 -230 50 -60 -9 -318 86 -193 -88 27 78 45 -106 -48 -71 -313 -187
8039a87p4N63p0k8j99J13Lk17R9l10L0L16m6k07K99K35k67m09M73j83r6J34J25
$$ -187 -261 302 232 204 5 118 121 -96 3 -307 -277 39 -7 -214 85 320 53 -356 117 -66 -162 -28 97
8062I7n0J34k66L04n4r1K11m06J85Qk37K0J29R2k28L70j90k33K58o5P8J93j78
$$ 97 47 181 -85 219 165 74 285 -121 64 72 -165 -145 -16 76 -152 218 28 -205 53 -12 66 259 81
8085H1rk59J04m1J39k40K06M6m9J63m4j41p0J44q4J8J32j80j36K72j7L8j08q4
$$ 81 72 -187 -83 -124 15 -225 -19 27 -22 141 97 -44 -114 30 -54 -36 96 -84 -220 52 35 73 -35 -119
8109a19K9L06j43Q7j72P0K99l20j33R4k91N44m00J17Jj33j12L11j2n3J93q4J19
$$ -119 -90 216 73 160 -12 58 357 37 -96 -2 -293 251 -149 -32 -31 -164 -276 35 23 -30 163 79 198
8132A98m7l33J79L36m08J01k27L25j39p6j92L35R1m0%N6K0k62O9K52j38j28j5
$$ 198 151 -182 -3 333 -75 26 -201 124 -15 -91 -283 52 143 103 103 159 179 -83 -14 238 100 -28 -43
8155d3j39J34o3L25l13Q2J0k29J98l1rJ40l09L58l81L88P3j27k70L90j85l0J51
$$ -43 -182 -48 -111 214 -99 -17 -7 -236 -38 -69 -78 62 -247 111 -270 118 191 64 -206 184 -1 -31 120
8178A20k15K84K64j95k11l01K86j66J76JJ85l9L5
$$ 120 -95 189 453 258 47 -254 32 -134 42 43 228 189 224
8191B24
$$ Imaginary data points
##PAGE= N=2
##DATA TABLE= (X++(I..I)), XYDATA
0@%%%%%%%%%%%%%%%jRj6J6j6J6k2L0l2L7m5M9n7O6p4Q8j02J12j24J41j61J80k00
$$ 0 0 0 0 0 0 0 0 0 0 0 0 0 0 0 0 -1 8 -8 8 -8 8 -14 16 -16 21 -24 25 -32 34 -40 48 -54 58 -66 75 -86 94 -106
38a06K25k52K79l08L43l81M21m65N12n63O20o84P55q32R15j009J117j239J376
$$ -106 119 -133 146 -162 181 -200 221 -244 268 -295 325 -359 396 -436 479 -530 587 -652 724
57G24j535J720j939K207k535K953l504M260n372P165j0487J8549p0156q6297J60380
$$ 724 -811 909 -1030 1177 -1358 1595 -1909 2351 -3021 4144 -6343 12206 -57950 -144247 16133
72A6133n0161o6012M4733j2312j1053J8747q235J1864o046M92J9613k033J610
$$ 16133 -34028 -100040 -55307 -67619 -78672 -59925 -68160 -56296 -62342 -61850 -42237 -44270 -42660
85d2660J3523p859Q556J4755m864L68R365O38M891J342j262N545L470l890J930
$$ -42660 -29137 -36996 -28440 -13685 -18549 -18181 -8816 -8178 -3287 -1945 -3207 2338 5808 1918 3848
100C848N231j679l519M443J427m501J479K904m492R4K467l318J55M77l113J469
$$ 3848 9079 7400 3881 8324 9751 5250 6729 9633 5141 5235 7702 4384 4539 5016 1903 3372
116C372j97l198J777m86l025K500p50l073K112l90j901J521j267o00J628j071
$$ 3372 3175 -23 1754 1268 -1757 743 -7 -3080 -968 -1358 -3259 -1738 -3005 -3605 -1977 -3048
132c048o79J883j266o85J986p42r11J533j17r02J057l4l04R98m69k34J141j19
$$ -3048 -3727 -1844 -3110 -3795 -1809 -2551 -3462 -1929 -2046 -2948 -1891 -1925 -2229 -1231 -1700 -1934 -793 -912
150i12q09J179J37j440K074k49j103J204J8m61J014m16o53J357o53p11J954j276
$$ -912 -1721 -542 -405 -1845 229 -20 -1123 81 99 -362 652 236 -417 940 287 -424 1530 254
168B54k17J546j057o44J666l81r69J188l15m60J115j080L82Q92r77q0J412j032
$$ 254 37 1583 526 -118 1548 1167 198 1386 1071 611 1726 646 1028 1920 943 863 2275 1243
186A243o82J644q98n21J217l12n68J175j251L24R95j165K59J167j492J63J594
$$ 1243 561 2205 1307 786 2003 1691 1123 2298 1047 1371 2366 1201 1460 2627 1135 1298 2892
203B892j544k2J439j526P0J087j048L45K84r57M16P86j428R61O52j828Q32Q05
$$ 2892 1348 1326 2765 1239 1309 2396 1348 1693 1977 1020 1436 2222 794 1755 2407 579 1411 2216
221B216j238N74K32r32N51O8n81O59j43o35J185l36j144J005O4j401J257J61j149
$$ 2216 978 1552 1784 852 1403 1471 890 1549 1406 771 1956 1620 476 1481 1545 144 1401 1562 413
240D13Q40J06p33M64k33m27P04m63o45J222j93j197J242m67q77J114m06o85O91
$$ 413 1253 1359 626 1090 857 430 1134 671 26 1248 1055 -142 1100 633 -244 870 464 -221 470
259D70j81N7K29p62RP37q71r6J054j035l88J093o41l77N09j89l26M68o80J00N63
$$ 470 289 346 575 -187 -178 559 -312 -408 646 -389 -777 316 -325 -702 -193 -382 -708 -240 -920 -820 -257
280b57p81R9N04r67Q6Q86p11k06J000o79l61N37m51P5L53p54M52O22j250L53Q22
$$ -257 -1038 -939 -435 -1402 -1316 -430 -1141 -1347 -347 -1026 -1387 -850 -1301 -1226 -873 -1627 -1175 -553 -1803 -1450 -628
301f28j057L32P10q58M9N78o08K50L73n57J01O83r68L67J65q01P85J91o49K11
$$ -628 -1685 -1353 -643 -1501 -1452 -874 -1482 -1232 -859 -1416 -1315 -632 -1600 -1233 -1068 -1869 -1084 -893 -1542 -1331
321a331Q05p51R7M13n44L64J20o34N38J33n85Q72nr85R34o4o15L41O07j013O72
$$ -1331 -526 -1277 -1180 -767 -1311 -947 -827 -1461 -923 -790 -1375 -503 -508 -1493 -559 -623 -1238 -897 -290 -1303 -631
342f31q5l72N39N9p43J072j42m31Q45n32o27Q39Nm40N22j55l6M61L0l64L42j40
$$ -631 -716 -1088 -549 -490 -1233 -161 -303 -734 111 -421 -1048 -209 -204 -644 -122 -277 -313 148 178 -186 156 16
364A6J5M75n29l77R79n38m19R65j73l93L21j46N1L77j79j05M23m73L17L22o11
$$ 16 31 506 -23 -400 579 41 -378 587 414 21 342 196 247 624 445 340 763 290 607 929 318
385C18J41O13m92r5N26l38l9L61n11M90J33n91N78J65n81O8N89p59K20L99m18
$$ 318 459 1072 580 485 1011 673 634 995 484 974 1107 516 1094 1259 678 746 1335 576 796 1195 777
406G77J3K28k20J73K41o25N83j27p16P52L67r74O52Q0l67j09L76l94K04J23m03
$$ 777 790 1018 798 971 1212 587 1170 1043 327 1079 1446 472 1124 1204 837 728 1104 710 914 1037 634
427F34K49J03m12P81m13o83P32j26k98K7K75n64J60J65l56J63R7j64L78m33k03
$$ 634 883 986 574 1355 942 259 991 865 567 594 869 305 465 630 274 437 534 370 748 315 112
448A12N28l28o5Q0J56k72K08j67j24J34j03q1K26j67M9pk0k42L54k38n08N78j21
$$ 112 640 312 247 327 483 211 419 252 128 262 159 78 304 137 186 179 159 -83 271 33 -475 103 -18
471a8N9o8k52N4j44J03M0J70l45K24N0j13k89J40J20m3K35m18K8K3p0J37j28k56
$$ -18 41 -27 -279 -225 -369 -266 -226 -56 -401 -177 -127 -240 -529 -389 -269 -312 -77 -495 -467 -444 -514 -377 -505 -761
495g61P6K75k92J97J84m93k3K70k65j54N96k56j51J48n0j98K08k14K57L2m52K30
$$ -761 -685 -410 -702 -505 -321 -814 -837 -567 -832 -986 -390 -646 -797 -649 -699 -897 -689 -903 -646 -614 -1066 -836
517h36L08n66J55M09k19p3J34j07J45K43m25L50k68j70N80j54l04K44K46n01L44
$$ -836 -528 -1094 -939 -530 -749 -822 -688 -795 -650 -407 -832 -482 -750 -920 -340 -494 -798 -554 -308 -809 -465
538d65k0k4j01K61j18qK79j68J91q1k33O24k20l77K81N8l26N61k25Q6k13P4j66
$$ -465 -485 -509 -610 -349 -467 -475 -196 -364 -173 -254 -487 137 -83 -460 -179 -121 -447 114 -111 -25 -238 -164 -330
561c30L12Nk48N01m56N1K23p6j04j56N11k60K45l26J28J99k87R6M17l87J47m5
$$ -330 -18 -13 -261 240 -216 -165 58 -18 -122 -278 233 -27 218 -108 20 219 -68 28 445 58 205 160
583A60j51K92J30k09J88J37k17O9l4k55L89j94l3Q6K83m72Q5L64o34M89r9l4k8
$$ 160 9 301 431 222 410 547 330 399 365 110 499 305 272 358 641 169 254 618 -16 473 374 340 312
606C12P0r6R1L14l13M30l44j10J21p0k9J24J3r7K35j57j40q3L08l9PM1k9K5n3
$$ 312 382 286 377 691 378 808 464 354 475 405 376 500 513 416 651 494 354 271 579 540 547 588 559 584 531
631E31qJ66l11J6K75l5m58L95j5j60j53J84j3L1J62l81P2o6j79Q4K3R0j63J97
$$ 531 523 689 378 394 669 634 176 571 556 396 243 427 414 445 607 226 298 232 53 137 160 250 87 284
655B84k01rM3J28m4j75m1K10J0o5K74k19l59L0J69k43K41j2P4M0k51L02l83J63
$$ 284 83 74 117 245 201 26 -15 195 205 140 414 195 -164 -134 35 -208 33 21 95 135 -116 186 -197 -34
679c4J27q5j9j71J62j56M3k7l6N1j4J63l83R3J33r4M3j77J83O0q6k50L28j88L20
$$ -34 93 8 -11 -182 -20 -176 -133 -160 -196 -145 -159 4 -379 -286 -153 -247 -204 -381 -198 -138 -224 -474 -146 -334 -14
704a4k42l9R2Q2l07o4K61j70P8oJ1J48Rm3J11K3m65jL04J1R8p9o4J1kr0O2p5m94
$$ -14 -256 -295 -203 -121 -428 -492 -231 -401 -323 -329 -318 -170 -161 -204 -93 -70 -535 -536 -232 -221 -123 -202 -266 -255 -257 -347 -285 -360 -854
733h54M77J58k40K54j06K42j42k68K93M4j4l75J28J10K4J98j10Qj03J65n4k1L27
$$ -854 -377 -219 -459 -205 -311 -69 -211 -479 -186 -142 -156 -531 -403 -293 -269 -71 -181 -173 -276 -111 -165 -186 141
756A41o07J81J9P0J19j11j86J75J79j81J34J04M2K8r7k06L44k58N0J65l21J21
$$ 141 -466 -285 -266 -196 -77 -188 -374 -199 -20 -201 -67 37 79 107 10 -196 148 -110 -60 105 -216 -95
778i5J09j00J15K8j26j39K87k0J3r9LN6j2j08K00r5J00o6L10m54J27Q0J07k01
$$ -95 14 -86 29 57 -69 -208 79 59 72 -27 -24 32 20 -88 112 17 117 51 361 -93 34 114 221 20
802B0L13j17N5n3j28k06L85k46K9n1R6k2K37k91M4J6j05PJ23J35l8M1j21K5j71
$$ 20 333 216 271 218 90 -116 269 23 52 1 97 75 312 21 65 81 -24 -17 106 241 203 244 123 148 -23
827b3J74K09j87j92K13j35K75m3j90J6K55j24Q1r6L2j0l17M12k00k8K56l01M89
$$ -23 151 360 173 -19 194 59 334 291 101 117 372 248 329 233 265 255 -62 350 150 122 378 77 566
850E66l91k37K09J34M1m92M02q9J53j95j78L85J4l16K82m0j07k9j6j48K80p3N7
$$ 566 175 -62 147 281 322 -170 232 143 296 101 -77 308 322 6 288 248 141 112 96 -52 228 155 212
873B12j95J89l21k8J91K00n8k40J9O2J8j66N0m3J96q1K6P5L1k86O3K06p9k02J21
$$ 212 17 206 -115 -143 48 248 190 -50 -31 31 49 -117 -67 -110 86 5 31 106 137 -149 -86 120 41 -161 -40
898d0n7j37J71P3l04K13p3r5K51k80K05K93n51K83ol9k4n2Q5J51j07j9j19K61
$$ -40 -97 -234 -63 10 -294 -81 -154 -249 2 -278 -73 220 -331 -48 -54 -93 -117 -169 -84 67 -40 -59 -178 83
922H3m6k65M6l2K19K4j02j44N6J42P3k22k32J73K1%O5L3j25r3K07L9k52M3O4q6
$$ 83 37 -228 -182 -214 5 29 -73 -217 -161 -19 54 -168 -400 -227 -206 -206 -141 -108 -233 -326 -119 -80 -332 -289 -225 -311
948c11M81j90l18M75r2j66P7k03L89k99O0N5J24J8k14p2l5J64j35K44k96J43L
$$ -311 170 -20 -338 137 45 -121 -44 -247 142 -157 -97 -42 82 100 -114 -186 -221 -57 -192 52 -244 -101 -98
971i8r7Q5k55M19q3oQ4k36q5K88j00j13J0K27p5k26J07J82p8r7J76O9k42J59j19
$$ -98 -195 -110 -365 54 -29 -35 49 -187 -272 16 -84 -197 -187 40 -35 -261 -154 28 -50 -147 29 98 -144 15 -104
996a04J82N9K64n47J90j38K13o9m7j96J56n2m3K11k5J03l4j61J92k43K50k91N5
$$ -104 78 137 401 -146 44 -94 119 50 3 -193 -37 -89 -132 79 54 157 123 -38 154 -89 161 -130 -75
1019g5L16p2J19k20N6k51K57k64p1L7K39j3j60L03j58p4J54j90J58J10l6o8J05
$$ -75 241 169 288 68 124 -127 130 -134 -205 -168 71 58 -102 201 43 -31 123 -67 91 201 165 97 202
1042B02Kk53l9O7J71p0k08K59J79J36m06J32j11J9P7k8j3k38o1L58j52k31M37
$$ 202 204 -49 -88 -21 150 80 -128 131 310 446 40 172 61 80 157 129 116 -122 -183 175 23 -208 229
1065B29J08l91L11k33K66ol74J95J86l01K91j87Q6l8J92k37J09k82J62J51j84
$$ 229 337 -54 257 24 290 284 -90 105 291 -10 281 94 180 142 334 97 206 -76 86 237 53
1086E3k08N70k88K25l41J46j85j7K22N9J91l20r4j08J35O5o9J6l2Mj00K70k70
$$ 53 -155 415 127 352 11 157 -28 -45 177 236 427 107 13 -95 40 105 36 52 20 24 -76 194 -76
1109g6O8K64j87%j85L13l74J27L6l3K4J70o2k57J02j6Q6r7O6n7J02j31J04k08
$$ -76 -8 256 69 69 -116 197 -177 -50 -14 -47 -23 147 85 -172 -70 -86 0 -97 -31 -88 14 -117 -13 -221
1133b21L83l03J87j80N8O1o3J90r7j39P6J67k81L1J9j16J04J95j53nQ6j54j6K14
$$ -221 162 -141 46 -134 -76 -15 -78 112 15 -124 -48 119 -162 -131 -112 -228 -124 71 -82 -87 -1 -155 -171 43
1157D3l11j8M69m04R0R9l32L43n2%l24M13J3k14q5L07q2k20m8j11L85j60j58K71
$$ 43 -268 -286 183 -221 -131 -32 -364 -21 -73 -73 -397 16 29 -185 -270 37 -45 -265 -313 -424 -39 -199 -357 -86
1181h6j19M1j77k8K07J03j0rj35J57k55J98j19L31k67j70J27j06J69L14l07n6
$$ -86 -205 -164 -341 -369 -162 -59 -69 -78 -213 -56 -311 -113 -232 99 -168 -338 -211 -317 -148 166 -141 -197
1203a97J69K1k3j97m9M37NJ3l40J41m9R7j71L69k98K6K6J04k31J04J7K18l04p5
$$ -197 -28 -7 -30 -227 -276 161 166 179 -161 -20 -69 28 -143 226 -72 -46 -20 84 -147 -43 -26 192 -112 -187
1227a87L24k38o1J15K09k15j77n8M36j01R7j85J12m21M17J52k33M2k3K82k97J72
$$ -187 137 -101 -162 -47 162 -53 -230 -288 148 47 144 -41 71 -350 67 219 -14 28 5 287 -10 162
1249A62j39R5J52o5n1j77k37K12O6J10Oj45K7J09K79n44K05n2K36K1K8k5n3q6
$$ 162 23 118 270 205 154 -23 -260 -48 18 128 134 -11 16 125 404 -140 65 13 249 270 298 273 220 134
1273A34j17K11m1k25Q9J40Q3j14j03K01j98J15K4j82j16j7K96k72O2K18jO2l31
$$ 134 17 228 187 -38 51 191 274 160 57 258 60 175 199 17 -99 -116 180 -92 -30 188 187 249 -82
1296h2M81l15R4J43m47L83J11l62K7m1J54j46J18o3M8r7P5J7k5J82ol59M7K39
$$ -82 399 84 178 321 -126 257 368 6 33 -8 146 0 118 55 103 6 81 98 73 255 249 -110 -63 176
1320A76J7Q2k35j30J21R3k78J11j35L63l0l8j96L2l8K06j82N3q9K03J10j28J7
$$ 176 193 275 40 -90 31 124 -154 -43 -178 185 155 117 -79 -47 -85 121 -61 -8 -97 106 216 88 105
1343A05mq6k87J77K92k65j41J91nM4k00Q6j3K33l0j14L8k55o7L01j02n1P8r5M7
$$ 105 101 15 -272 -95 197 -68 -209 -18 -23 21 -179 -93 -106 127 97 -17 21 -234 -301 0 -102 -153 -75 -170 -123
1368a23k0K06j51J46k29J33j38K09l08L11j80J48o5j12J2J8K62j87J03P8l36K75
$$ -123 -143 63 -88 58 -171 -38 -176 33 -275 36 -144 4 -61 -173 -161 -143 119 -68 35 113 -223 52
1390E2K4k37Q5l42M91n37L79j40j35J41N8J92k10J9M2r6r8K41o9K75k07k3j53
$$ 52 76 -161 -76 -418 73 -464 -85 -225 -360 -219 -161 31 -179 -160 -118 -214 -312 -71 -140 135 -72 -95 -248
1413b48Q3R1J39m28K65M9l01N20l82J3J18K6J37k77RK2Q1J09m0j6k06N5L1J30
$$ -248 -165 -74 65 -363 -98 -49 -350 170 -212 -199 -81 -55 82 -195 -186 -164 -83 26 -14 -30 -236 -181 -150 -20
1437b0J43j73P4k42M51l52K08j10N6k84M97J7l68M93k66l7k7O1j52J51j05M9k04
$$ -20 123 -50 24 -218 233 -119 89 -21 35 -249 248 265 -103 390 124 87 60 121 -31 120 15 64 -140
1460a40J85J06j95M5JJ44l9L6j38q3L16j96r5J83j9j96K22J92n50L16L8J28k87
$$ -140 45 151 -44 1 2 146 107 143 5 -78 238 42 -53 130 111 -85 137 329 -221 95 133 261 -26
1483b6oL11m89J82j6P1N4l4J12J89k71m6J51l60L04j19K7J9M2J4L37l19mj7K13
$$ -26 -32 279 -210 -28 -44 27 81 47 159 348 77 31 182 -178 126 7 34 53 95 109 446 127 123 106 319
1508C19k85o2P4L16j62l7l10K57j64R3J59l47M08O6m10J65L0q7L44k43n1r0O3
$$ 319 34 -28 46 362 200 163 -147 110 -54 39 198 -149 259 325 -85 80 110 23 367 124 73 -17 46
1531D6K38j38J41l88J10J84k95L05j70j7j05J17J5p2K44k70K1P7p3m3J40p6r4
$$ 46 284 146 287 -101 9 193 -102 203 33 16 -89 28 43 -29 215 -55 -34 43 -30 -73 67 -9 -103
1554a03j4J41j85J39j75L58N5k81R5O2k30L18j85o1J27k1r5L0J46k31N4P6j15
$$ -103 -117 24 -161 -22 -197 161 216 -65 30 92 -138 180 -5 -66 61 40 -55 -25 121 -110 -56 20 -95
1577i5N0k45L02K8p2p7j8L3P1M4J22j21m7J51l88K24n7Q3k86%O5K67k24K63l22
$$ -95 -45 -290 12 40 -32 -109 -127 -94 -23 21 143 22 -25 126 -262 -38 -95 -12 -298 -298 -233 34 -190 73 -249
1602b49O7J45P9k91K92nj54J3P0M3O1j01l5l6J29k27k5J92O9q8L5M5k38j74L93
$$ -249 -182 -37 42 -249 43 38 -116 -103 -33 10 71 -30 -65 -101 28 -199 -224 -32 37 -51 -16 29 -209 -383 10
1627A0k23K33p9o5jq1K06r7M2n1J92j03R1J50j67Mj15J29l4n9l0J72k02K22j50
$$ 10 -213 20 -59 -124 -125 -206 0 -97 -55 -106 86 -17 74 224 57 61 -54 75 41 -18 -48 124 -78 144 -6
1652fl4J22l6n8j74L88m07L25l76M72k60J37P0P4k43K20j40k0J82k64m4J69m45
$$ -6 -40 82 46 -12 -186 202 -205 120 -256 216 -44 93 163 237 -6 214 74 54 236 -28 -72 97 -348
1675c48N27M7j88J63l94M82j60J28m87l3Q3R6L7J55l13N00j65j7K95m44J00k03
$$ -348 179 226 38 201 -193 289 129 257 -230 -263 -180 -84 -47 108 -205 295 130 113 408 -36 64 -139
1697a39K64L10l53j83L65j85J12j48l9K08k39J86k40K22k09J21J24k13j43L31
$$ -139 125 435 82 -101 264 79 191 43 4 212 -27 159 -81 141 -68 53 177 -36 -179 152
1717A52J50k92l0j2K15j34K19k28J01j30p4J50k07L36jm64L80Q8j68n7j61j7j27
$$ 152 302 10 -20 -32 183 49 268 40 141 11 -63 87 -120 216 215 -249 131 219 51 -6 -167 -184 -311
1740c11L17pr0p7P4P8n4n1P6N3p1J28l02K20j66L50j06N1j93O6K79k1k30j11J36
$$ -311 6 -1 -91 -168 -94 -16 -70 -121 -45 8 -63 65 -237 -17 -183 167 61 112 -81 -15 264 243 13 -98 38
1765C8k01L07j66j55J03M02l21J40l14J14K60j04k18K16m14J26J44J06L7j38q5
$$ 38 -163 144 -22 -177 -74 328 7 147 -167 -53 207 103 -115 101 -313 -187 -43 63 100 -38 -123
1786a23J2N1j6R2J0J44n3l3j97J68j98O5K00k94J99P4k64J24J9J59o9o6Q6J10
$$ -123 -111 -60 -76 16 26 170 117 84 -113 55 -143 -78 122 -172 27 101 -163 -39 -20 139 70 4 90 200
1810B00p6R2l72K35j19m7K65l92J65p6j08J35K49l18J51J04j48J31j41J32k17
$$ 200 124 216 -156 79 -40 -87 178 -214 -49 -125 -233 -98 151 -167 -16 88 -60 71 -70 62 -155
1831a55K5J25p9J5r7J5J59M0J72Q7n46K67j3Pj61J76j32l8m8k98M89j28R6p1K87
$$ -155 -130 -5 -84 -69 -166 -151 8 48 220 307 -239 28 15 22 -139 37 -95 -133 -181 -479 10 -118 -22 -93 194
1856A94j51k04J95Q7m4l84J65K53k43J92j3l07L60lj86K79k54o6j04L72k84J84
$$ 194 43 -161 34 121 77 -307 -142 111 -132 60 47 -260 100 97 -89 190 -64 -130 -234 138 -146 38
1878C8k10j57J56J30K4p6R7o0K13K6j61j29q9J86J91l40j7K95P0q9Q8k56J04O2
$$ 38 -172 -329 -173 -43 -19 -95 2 -58 155 181 20 -109 -198 -12 179 -161 -178 117 187 98 186 -70 34 96
1902I6J19k30O0j4p7J74n35M17m7K65k52M72l10Q5l11Q8J38j21K13k35J23QK40
$$ 96 215 -15 45 31 -46 128 -407 10 -37 228 -24 448 138 223 -88 0 138 17 230 -5 118 126 366
1925C66l11q0J0Q7L0l0j54Q7n9L45rj73L5o9O4m4k29L24k94P0oq4K65j36j3J17
$$ 366 55 -25 -15 72 102 72 -82 5 -54 291 282 109 144 75 139 95 -134 190 -104 -34 -40 -124 141 5 -8 109
1951A09L6l20N46k82P9k36P2L20j89L8n19L65j46j7P5r0J61r6J41o7K14n4j28
$$ 109 145 -175 371 89 168 -68 4 324 135 173 -346 19 -127 -144 -69 -159 2 -94 47 -20 194 140 12
1974A2n3J31J74l33j3K17J2j13l8j81K62j59K96k26J73j93Q9N4k75R0o5J06j75
$$ 12 -41 90 264 -69 -82 135 147 34 -4 -185 77 -82 214 -12 161 -32 57 111 -164 -74 -139 -33 -208
1997b08l9J45K15r0k81K69o7N7k6p0p9LM5J30j74J47J66J00k36j26J28j42K95
$$ -208 -247 -102 113 23 -258 11 -56 1 -25 -95 -174 -171 -126 4 -170 -23 143 243 7 -119 9 -133 162
2020A62j00l44K46L0J51o3l06J42J94J11k37j63J52k58J40K62k12N6J44j57K17
$$ 162 62 -282 -36 -6 145 82 -224 -82 112 223 -14 -177 -25 -283 -143 119 -93 -37 107 -50 167
2041A67k39Q1j37K18j08k17O5QK75j45o9m2J81j24m9J41Q2r4K7kk79M86n26K99
$$ 167 -72 9 -128 90 -18 -235 -170 -162 113 -32 -101 -143 38 -86 -135 6 88 -6 21 19 -260 226 -300 -1
2065aJ45l57K99j51j42M72j96K5r2J44J36m54J33o9Q1Q8o1m2K27j68J7K58k84
$$ -1 144 -213 86 -65 -207 265 69 94 2 146 282 -172 -39 -108 -27 61 0 -42 185 17 34 292 8
2088HK40j22J9O0k84J51p6J19j00J96j78r4K4K35l59N9K02k42R0J59l36J64J1
$$ 8 248 126 145 205 -79 72 -4 115 15 211 33 -61 -37 198 -161 -102 100 -142 -52 107 -229 -65 -54
2111e4K19k12j55K88j90J36J19m0p0K67j19l86L81R4k67P9k1J31j15j0j10Q2j
$$ -54 165 -47 -202 86 -104 32 151 111 41 308 189 -197 184 278 11 90 69 200 85 75 -35 47 46
2134D6j14n4O6J90n7R2j13Q8q1J90k06Orj37K0K20J20j78P1j23j45K47k44K01
$$ 46 -68 -122 -56 134 77 169 56 144 63 253 47 53 44 -93 -73 147 267 89 160 37 -108 139 -105 96
2158I6j43J65J38j80O6j29L6j14o8L34o7k59J46J44q1j04J35j51j04K05J47k42
$$ 96 -47 118 256 76 142 13 49 -65 -133 201 134 -125 21 165 84 -20 115 -36 -140 65 212 -30
2180c0L15j42j23q6LJ37l16K31J96l72R6qJ95q1m2p8J0L02k55o5o3J66j83K29
$$ -30 285 143 20 -66 -63 74 -242 -11 185 -187 -91 -99 96 15 -27 -105 -95 207 -48 -113 -176 -10 -193 36
2204C6R5j84K63l27L82m22J0J06N8r2n2R2N2Qj07K26l51K00l49K95k1j26J7J22
$$ 36 131 -53 210 -117 265 -157 -147 -41 17 -75 -127 -35 17 25 -82 144 -207 -7 -356 -61 -82 -208 -191 -69
2228f9O0j88K34N5P0l36l7j09L85j47j5J85M8k58j4j50P6L64j76J73m13N56j81
$$ -69 -9 -197 37 92 162 -174 -211 -320 65 -82 -97 88 136 -122 -136 -286 -210 154 -22 151 -262 294 113
2251A13R0j28r9P4j97J42J5o4O1N8J48k71j77J3J55K55l58j10P9M45m29j05J01
$$ 113 203 75 -24 50 -147 -5 10 -54 7 65 213 -58 -235 -222 -67 188 -170 -280 -201 244 -185 -290 -189
2274a89J26j19Q3K37k78J14K26ol23q6J39L8J56O7l66K67k90L98j46j24J76L3
$$ -189 -63 -182 -99 138 -140 -26 200 194 -129 -215 -76 -38 118 185 -181 86 -204 194 48 -76 100 133
2296A33k00K7rj28K25k22J18P1k35N4J5R1L27k38j66K31J39j49P0l7m42J99J15
$$ 133 -67 -40 -49 -177 48 -174 -56 15 -220 -166 -151 -60 267 29 -137 94 233 84 154 117 -325 -126 -11
2319a1L53m30K29k7j06Q4k72L02m5j23J20M2k60J34j02Q4K38k16R4K24j61k0k6
$$ -11 342 -88 141 114 8 92 -180 122 77 -46 74 116 -144 -10 -112 -28 210 -6 88 312 151 131 105
2342A05j58J54J22l83K41J3l63N49j59O3k40L9N8ql7J66j60k3mm6p1J99r8J12
$$ 105 -53 101 223 -160 81 94 -269 280 121 184 -56 -17 41 33 -4 162 2 -21 -25 -71 -142 57 -41 71
2366G1L2j31O0j93J14l7K13k49Q2r6K46J84l04J05r1rN3k19K84m25K97J3K8j74
$$ 71 103 -28 32 -161 -47 -84 129 -120 -38 -134 112 296 -8 97 6 -3 50 -169 115 -310 -13 0 28 -146
2390a46L5J5J34l1J43K27l10l16M27j32Q3l95L84j87P4p0Qn3J04K96l66j26K14
$$ -146 -111 -96 38 7 150 377 67 -249 178 46 129 -266 118 -69 5 -65 -57 -110 -6 290 -76 -202 12
2413A2L2J55j97r3j75M7J45M0J02j59j03j8L5K43k45L26M5l21J96k38JmJ43K4
$$ 12 44 199 2 -91 -266 -219 -74 -34 68 -91 -194 -212 -177 66 -179 147 192 -129 67 -171 -170 -174 -31 -7
2437gM0K5k19N4l8J38M9k48K19l82K88J7J39L1k57J39N1m5K07j6RM3k60J96q9
$$ -7 33 58 -161 -107 -145 -7 42 -206 13 -369 -81 -64 75 106 -151 -12 39 -6 201 185 194 237 -23 173 84
2462H4m54K39K43j43k31J72Q9r5M6l74L50J04o3J88L6j91l0J77K11l49j61K9J26
$$ 84 -370 -131 112 -31 -262 -90 -1 -96 -50 -424 -74 30 -33 155 191 0 -30 147 358 9 -152 -123 3
2485Co6L2J29N7k24J38p5P9k9J07j74j04J54J0k8J93j7j92J4l5M9K62l28K3K4
$$ 3 -63 -31 98 155 -69 69 -6 73 44 151 -23 -127 27 37 9 202 185 -7 7 -28 21 283 -45 -22 2
2510Bn0M2J24P7k44J61Q2R1Qj02j64K1K43j14j27j33J37R8k85K04o9P7q8J30N
$$ 2 -48 -6 118 195 -49 112 194 285 293 191 27 48 291 177 50 -83 54 152 -133 71 2 79 -9 121 126
2535A26J15m5l20K35j25J03q7j04J69R7j88j12J01J05P7j5N7k31J85r8R9q1r4
$$ 126 241 196 -124 111 -14 89 2 -102 67 164 -24 -136 -35 70 147 132 189 -42 143 45 144 63 -31
2558c1J63k64K62P7l21M77m97J19J23j00Mn5LR4K2L08p63N18k51J83o1q3R9m3
$$ -31 132 -132 130 207 -114 363 -134 -15 108 8 12 -43 -40 54 76 384 -379 139 -112 71 10 -73 26 -17
2582a7L44l61J08j57k32M65j89J85k02j02Q5m2J63J08j68jQ0n6L9Mm4j0q7K03
$$ -17 327 -34 74 -83 -315 150 -39 146 -56 -158 -73 -115 48 156 -12 -13 67 11 50 54 10 0 -87 116
2606A16j16l1n8J30Q1k07q8Q3Q6k43K18M9R8j86J75PJ75m81N5J00m0O6K5j33J83
$$ 116 0 -31 -89 41 122 -85 -173 -90 -4 -247 -29 20 118 -68 107 114 289 -192 -137 -37 -77 -11 14 -119 64
2631F4k69K11mPJ0k8l48J10K09o9l8K7J11m7O9J78m70J36K29k72M29l28q2j06
$$ 64 -205 6 2 9 19 -9 -357 -247 -38 -107 -145 -118 -7 -54 15 193 -277 -141 88 -184 245 -83 -165 -271
2655b71K35N5k90M88k27J40n1Lj42j11J7p9J75n9j9J62o9J44k40J86j19K42k49
$$ -271 -36 19 -271 217 -10 130 79 82 -60 -171 -154 -233 -58 -117 -136 26 -43 101 -139 47 -72 170 -79
2678g9P1j41k9L62m3j16P3k70L03o1j09k3Q1J52j22p9jm3j04L14N7j21k51J42
$$ -79 -8 -149 -178 184 141 25 98 -172 131 70 -39 -62 19 171 49 -30 -31 -74 -178 136 193 72 -179 -37
2702c7J27j42o4L59l76J28K7qj30N1Np0P0K11N6j99J59l17M22l34J10Q8j13N9
$$ -37 90 -52 -116 243 -133 -5 22 14 -116 -65 -60 -130 -60 151 207 8 167 -150 272 -62 48 136 23 82
2726H2j47K41l09J94J02k37Q7p6j68L76r2o3M6J47l43J04R7n4K96m85R4J16J0
$$ 82 -65 176 -133 61 163 -74 13 -63 -231 145 53 -10 36 183 -160 -56 41 -13 283 -202 -108 8 18
2749A8l4J00l03L77n1p0j50K7N0K58m65N4J84k7J12J16j22o2L5l1n2L10O4m14
$$ 18 -16 84 -219 158 107 37 -113 -86 -36 222 -243 -189 -5 -32 80 196 74 12 47 16 -36 274 338 -76
2773g6K33j54j16J12K16l02j2J9l7J0j45K06j57K08J12l49J56J65j06J66l13L25
$$ -76 157 3 -113 -1 215 -87 -99 -80 -117 -107 -252 -46 -203 5 117 -232 -76 89 -17 149 -164 161
2795A61k16J29p7o0j8j27K84J39l07j13K60n4l70K63k14N02k38K1j92M06r0l3
$$ 161 -55 74 -3 -63 -81 -208 76 215 -92 -205 55 1 -369 -106 -320 182 -56 -35 -227 179 89 56
2817E6k99L30q9j33J66L4j5l1k24JR2R2k05J48J0K19j63K68j77k48o5L58o5j87
$$ 56 -243 87 -2 -135 31 65 50 19 -205 -204 -112 -20 -225 -77 -67 152 -11 257 80 -168 -233 125 60 -127
2841a27l1R3j5j30R1j02P7r7J80L9M40l41k62K28j09J25o0l28L21k24L08j05M7
$$ -127 -158 -65 -80 -210 -119 -221 -144 -241 -61 -22 418 77 -185 43 -66 59 -1 -329 -8 -232 76 -29 18
2864A8O9L3l4k50J48J1K56l32q5O6K1R8R8j11L3k43J48Q5M9k83L45j92J72l41
$$ 18 87 120 86 -164 -16 -5 251 -81 -166 -100 -79 19 117 6 39 -204 -56 29 78 -205 140 -52 120 -221
2888b21L6L58k99L68k07l4K68k28j12o6K49k74K7J18J9J21j49K12j33J35k27O5
$$ -221 -185 173 -126 242 35 1 269 41 -71 -137 112 -162 -135 -17 2 123 -26 186 53 188 -39 26
2910B6L1L0J8n4k2Q9j53Q2ol3K56j42N3nj53J2j34K14k46K54j48J71k08N9p5J07
$$ 26 57 87 105 51 29 118 -35 47 41 8 264 122 175 170 17 29 -105 109 -137 117 -31 140 -68 -9 -84 23
2936B3k41L42l06L37k88J04J48k31J46R1j55J54r9J3p0K0K55k63J57j56K48qk84
$$ 23 -218 124 -182 155 -133 -29 119 -112 34 125 -30 124 25 38 -32 -12 243 -20 137 -19 229 221 -63
2959f3K86J19j93J2j20q6K75j81K4K43m74K3L93j54l35L17j31j6n0j41L61O7k4
$$ -63 223 342 149 161 41 -45 230 49 73 316 -158 -135 258 104 -231 86 -45 -61 -111 -252 109 176 152
2982A52k03L04m10J20J15j96K89k1m02K34K07n1k04K94j45J65k27P7j72L45j48
$$ 152 -51 253 -157 -37 78 -118 171 150 -252 -18 189 138 -66 228 83 248 21 98 -74 271 123
3003A23l2m1l13N9J73j5N4j72J36J24j53j78L75k22k03K65l0m5nq9K68p1j97L48
$$ 123 91 50 -263 -204 -31 -46 8 -164 -28 96 -57 -235 140 -82 -285 -20 -50 -95 -100 -189 79 8 -189 159
3027A59k81L24r9J79n02L10k30O7P5p3J67%P3k24j03J34j40K33r4j77K64Mm48
$$ 159 -122 202 103 282 -220 90 -140 -73 2 -71 96 96 169 -55 -158 -24 -164 69 -25 -202 62 66 -382
3050c82N97m72J70p0L57l46K15l15j33K86L09j85o4o3L13j13j14J03Q3k45L78
$$ -382 215 -257 -87 -157 200 -146 69 -246 -379 -93 216 31 -33 -96 217 104 -10 93 176 -69 309
3071C09j08k25j13r9l2K47j27J74K0j46K04L4r0l20M14j90j45M08k82K60K1j34
$$ 309 201 -24 -137 -236 -268 -21 -148 26 46 -100 104 138 48 -272 142 -48 -193 215 -67 193 214 80
3093H0l55K18OM6P4P2j40n2J51j93r8O6P6J59j54Q3J7l72K93k11M6K33q3%M8j15
$$ 80 -275 -57 -51 -5 69 141 1 -51 100 -93 -191 -125 -49 110 -44 39 56 -316 -23 -234 -188 45 -38 -38 10 -105
3119a05R6L0M9j42L7Kl2K37j75n2L9J4M4q8L5R7P5j41J26j33j2q0J88K76l60L1
$$ -105 -9 21 70 -72 -35 -33 -65 172 -3 -55 -16 -2 42 -46 -11 86 161 20 146 13 1 -79 109 385 25 56
3145E6rJ10n01L22N4R3M1k39J64m0l21L24k45J61J88k21R0K10k93K38m92K85J55
$$ 56 47 157 -344 -22 32 125 166 -73 91 51 -270 54 -191 -30 158 -63 27 237 -56 182 -310 -25 130
3168A30Q7k91K51n9N8n8N7k8j48j94O57o7m59K18k74j13P3R3pR4j4l2l56L60j69
$$ 130 217 -74 177 118 176 118 175 147 -1 -195 462 395 -64 154 -120 -233 -160 -67 -74 20 6 -26 -382 -22 -191
3193a91K19J25k01K13rj97N9j81M52l19k97K70l13L40K3m4k9J14l1r4j04J52j1
$$ -191 28 153 -48 165 156 -41 18 -163 289 -30 -327 -57 -370 -30 -7 -51 -80 34 3 -91 -195 -43 -54
3216e4l1j03K18J9J60l86J82P4j30J97j54k29K75j4O8jj28j12PL63l12N0m6J78
$$ -54 -85 -188 30 49 209 -177 5 79 -51 146 -8 -237 38 24 92 91 -37 -149 -142 221 -91 -41 -87 91
3240I1l11K49R4k08J42k01J48N2P2l13J89J15J23k20J04q8p6r4K64o3j77J37O4
$$ 91 -220 29 123 -85 57 -144 4 56 128 -185 4 119 242 22 126 38 -38 -132 132 69 -108 29 93
3263I3j63n4p4J98l6k0M55k46n7l52J50nK73q3L33n05J26m8r4J37J24J78l74N6
$$ 93 -70 -124 -198 0 -36 -56 399 153 96 -256 -106 -111 162 79 412 -93 33 -15 -109 28 152 330 -44 12
3287A2j68P4J00P9l57J22J9L41j67j9Rj06k9J06K16k41k04K14m8l02L18k2j35
$$ 12 -156 -82 18 97 -260 -138 -119 222 55 36 45 -61 -90 16 232 -9 -213 1 -47 -349 -31 -53 -188
3310a88J26J14j26J69M9j61k78L62r8j62K2J44n0J19m3L4k88J01J27R0k58R9O5
$$ -188 -62 52 -74 95 144 -17 -295 67 -31 -193 -171 -27 -77 42 -1 33 -255 -154 -27 63 -195 -96 -31
3333c1j5M9l21M82L9j29J88k01P1l07K24n4j22K54Q0j50P1Q7l15m3J90j00L6K21
$$ -31 -46 3 -318 164 203 74 262 61 132 -175 49 -5 -127 127 207 57 128 215 -100 -143 47 -53 -17 204
3357B04l72J22k01K80Ol1j26L40j34km1j12j9J57J49J1n56J71J79J70J03j14k83
$$ 204 -168 -46 -247 33 39 8 -118 222 88 86 45 -67 -86 71 220 231 -325 -154 25 195 298 184 -99
3380i9K26j6j66J83j56J07j87q2K22q0K33o2%l05J28K45k60J3j71J82l8J19J1
$$ -99 127 111 -55 128 -28 79 -108 -190 32 -48 185 123 123 -182 -54 191 -69 -56 -227 -45 -83 36 47
3403D7q3NK09j06r4l16J57N50l00L2j18J46j4o9J46k93J56j61n7J18J66m9r0L12
$$ 47 -36 -31 178 72 -22 -338 -181 369 69 101 -17 129 115 46 192 -101 55 -106 -163 -45 121 72 -18 294
3427B94j64l10K66k31J21j1O6M8l08M29m17K56j69R0M0m1r9L5K1K19j34m5j21
$$ 294 130 -180 86 -145 -24 -35 31 79 -229 200 -217 39 -130 -40 0 -41 -140 -105 -84 135 1 -44 -165
3450a65pJ01L6J18p4L70o12M82k47j5K2Nm8k95J57L60J14j07l80J51L44m59K87
$$ -165 -172 -71 -35 83 9 379 -233 249 2 -13 9 14 -34 -329 -172 188 302 195 -185 -34 310 -149 138
3473A38q5Q7L5j4N5l32o7O3K17j3Q8n34K45L73l76K07P1j23J8k37K01M3J09l52
$$ 138 53 140 175 161 216 -116 -183 -120 97 84 172 -362 -117 256 -120 87 158 35 53 -184 17 60 169 -183
3497a83J28N7R6j12J10l00Q5J67q0j78K59j8j52J05QJ37k25L1j73L30l6k39K08
$$ -183 -55 2 98 -14 96 -204 -119 48 -32 -210 49 31 -121 -16 -8 129 -96 -65 -238 92 56 -183 25
3520B5j45J80L6j32J63j36K27J18l37j06k00L16k44J60J82k27n1K03j07Q4O1r2
$$ 25 -120 60 96 -36 127 -9 218 336 -1 -107 -307 9 -235 -75 107 -120 -171 32 -75 9 70 -22
3542b2J57l27L18Q7k69L35k90j96K54J50M8l3l23O1L59k24K05j00k06P2n32M37
$$ -22 135 -192 126 213 -56 279 -11 -207 47 197 245 212 -111 -50 309 85 290 190 -16 56 -476 -39
3564c9J9Kj34J23j37J05j05J58K15k39l5J2O8j48J34L85m28J38Q7k40J53r2j46
$$ -39 -20 -18 -152 -29 -166 -61 -166 -8 207 -32 -67 -55 13 -135 -1 384 -44 94 181 -59 94 2 -144
3587a44J88K9N1j44o6j1J66J61j31m3l3o0q0R5J41Rj82l3J8K2K84k53J89N3m01
$$ -144 44 73 124 -20 -86 -97 69 230 99 56 23 -37 -117 -22 119 128 -54 -87 -69 -47 237 -16 173 226 -175
3612a75L24k62J26q2m44N24J40j74q9J71O2j22J09j24L58m29pQ9L20n28N14l21
$$ -175 149 -113 13 -69 -513 11 151 -23 -112 59 121 -1 108 -16 342 -87 -94 -5 315 -213 301 -20
3634b0j39R4l6j01K09j0l45J70J76Q4j49o9PQ9j58J69o5J86q9k57J23o7M57j05
$$ -20 -159 -65 -101 -202 7 -3 -348 -178 -2 82 -67 -136 -129 -40 -198 -29 -94 92 3 -254 -131 -198 259 154
3658A54om25M97m30J21L41n08K23j01J67j29K50k27l8N0j96M63j25M2k32O3J62
$$ 154 148 -277 220 -210 -89 252 -256 -33 -134 33 -96 154 -73 -111 -61 -257 206 81 123 -109 -46 116
3680A16O9n11M49j02l3lj93K06J77k53J54k34r1L32l89K47N4K7M47o24J32l25
$$ 116 185 -326 123 21 -12 -15 -208 -2 175 -78 76 -158 -249 83 -306 -59 -5 22 469 -155 -23 -348
3702c48L85Q9l36M8K81j57j1J10J00j78J38j65L03m67K73j53p4K14k17J28j3O8
$$ -348 37 126 -210 -162 119 -38 -49 61 161 -17 121 -44 259 -208 65 -88 -162 52 -165 -37 -50 18
3724A8pN8J18k51j74R9J46J21k11J32p1J68k81K16j13q9R8J54m11M45k02j32R7
$$ 18 11 69 187 -64 -238 -139 7 128 -83 49 -22 146 -135 81 -32 -121 -23 131 -280 165 -37 -169 -72
3747g2j29K7m8K08J94k17K5j21j55M11j31R3n6PR7j50P1j41M2J5j84J3K65j47
$$ -72 -201 -174 -222 -14 180 -37 -12 -133 -288 123 -8 85 29 36 133 -17 54 -87 -45 -30 -214 -201 64 -83
3771h3J90j56K69k02R7j2L0J82k70j96P9o3rJ04l32K95M3K6J08J1j53j82J57J22
$$ -83 107 -49 220 18 115 103 133 315 45 -151 -72 -135 -144 -40 -372 -77 -34 -8 100 111 -42 -224 -67 55
3795E5k08L69k84k5K00m21K97N7j88K59j45J02rJ26l29K39J28k78p9R6l0J28O3
$$ 55 -153 216 -68 -93 107 -314 -17 40 -148 111 -34 68 59 185 -144 95 223 -55 -134 -38 -68 60 123
3818A23j59J43l3j37P6mJ05l0p4J1J93j27j93M16l88K98l06R8M2R5k93R6kJ04
$$ 123 -36 107 74 -63 13 9 114 84 10 21 214 87 -106 310 -78 220 -86 12 54 149 -144 -48 -50 54
3842E4j39L32k38O4M0P1l21M32k90QJ04J38j85J03m05L23j9o2J27j75J09j53o9
$$ 54 -85 247 9 73 113 184 -137 295 5 13 117 255 70 173 -232 91 72 10 137 -38 71 -82 -151
3865a51M9J86j93l9J35K02Km53K16o2p6L02r4j4j02k75M91l2R2k49J0J93l25K88
$$ -151 -102 84 -109 -148 -13 189 191 -262 -46 -108 -184 118 24 10 -92 -367 124 92 184 -65 -55 138 -187 101
3889A01J6j74p4J5K35k29K30j69OL22m35N4J42j06J41pj4l5J97j60k42K63j03
$$ 101 117 -57 -131 -116 119 -110 120 -49 -43 279 -156 -102 40 -66 75 68 54 19 216 56 -186 77 -26
3912b6J77j5j21k84J84J14j02m3Q3J17k54L86l17O7P6Q2k39j75O2k2L92j37m3
$$ -26 151 136 15 -269 -85 29 -73 -116 -33 84 -170 216 -101 -34 42 124 -115 -290 -228 -250 142 5 -38
3935c8M6J66j92qk1k49J01K12r7J12n8J5J05l2m6J73k37L2j23L50o2R0j75l12
$$ -38 8 174 -18 -26 -47 -296 -195 17 -80 32 -26 -11 94 62 16 189 -48 -16 -139 211 149 239 64 -248
3959b48L83J67l10j05P7J36k12J66n4M5k08J75j65K64k12PJ8J58l7Kn5Q0k24j14
$$ -248 135 302 -8 -113 -36 100 -112 54 0 45 -163 12 -153 111 -101 -94 -76 82 45 47 -8 72 -152 -266
3983b66O15k64j21o9P8L6j63j99M32J30pl05L6J14J52q1j21k06M39l21O4j17J97
$$ -266 349 85 -36 -105 -27 9 -154 -353 79 209 202 -103 -67 47 199 118 -3 -209 230 -91 -27 -144 53
4006E3j55J05j40J03J4P9K4k69R0L4OJ37k6k04J15j71K78K0l27K75L16j01m45
$$ 53 -102 3 -137 -34 -20 59 83 -186 -96 -62 -56 81 55 -149 -34 -205 73 93 -234 41 357 256 -189
4029a89K76j78N4Q5j75K37p3K12j77j24l12N05m2L6j38kr5M2K63j59j10j0J58
$$ -189 87 -91 -37 48 -127 110 37 249 72 -52 -364 141 99 135 -3 -5 -100 -58 205 46 -64 -74 84
4052H4k11oK66r2j84K24N1J5k91K60J81k08j87M9P2n1K43j71n9J9K07j52r9J86
$$ 84 -127 -133 133 41 -143 81 132 147 -144 116 297 89 -98 -49 23 -28 215 44 -15 4 211 59 -40 146
4076A46l81K40m4J87k56J3jK0R3J9J35j60P3J34k23M3j15M53l67J53J62l80K32
$$ 146 -235 5 -39 148 -108 -95 -96 -76 17 36 171 11 84 218 -5 38 -77 376 9 162 324 -56 176
4099A76Pk49j25K76o3J85k37J22m1j42J33L20m01l3k13K44K19l18o2J23J22J21
$$ 176 183 -66 -191 85 22 207 -30 92 51 -91 42 362 -39 -72 -285 -41 178 -140 -202 -79 43 164
4121A64K8l45J68j09N7L52n34J17K05q3m5m1J09K39l00n2k7j5J77%k39J40q7K1
$$ 164 192 -153 15 -94 -37 315 -219 -102 103 20 -25 -66 43 282 -18 -70 -97 -112 65 65 -174 -34 -121 -100
4145a00P4Q2l5J69l81R4j34J88K86l85L64m12J77K7jK91l60J0Q1j06O7K04m56
$$ -100 -26 56 21 190 -191 -97 -231 -43 243 -142 222 -190 -13 14 13 304 -56 -46 35 -71 -4 200 -256
4168b56P9K00l64L45q2lJ24k79L37l16N1m5L39j39k2M0k09K27k57L03Q2k81P5
$$ -256 -177 23 -341 4 -78 -81 43 -236 101 -215 -164 -209 130 -9 -31 9 -200 27 -230 73 155 -126 -51
4191e1J1J14L6j20l4o4J73j54J11j13n1K61p4j93K13O1p6j68K55k50nR6Q1J33
$$ -51 -40 74 110 -10 -44 -108 65 -89 22 -91 -142 119 45 -148 65 126 50 -118 137 -113 -118 -22 59 192
4215A92j75l1Q9L0pk20J56j15J86J01j94J96r9k09LP4mo5M74j43k05o5n0R7J00
$$ 192 17 -14 75 105 98 -122 34 -81 105 206 12 208 109 -100 -97 -23 -27 -92 382 239 34 -31 -81 16 116
4240A16k50M8J37q7J45k39P1K69l86K78j98J43k5j06Q4K3k2J23q0j69K7j60L88
$$ 116 -134 -86 51 -36 109 -130 -59 210 -176 102 -96 47 22 -84 0 23 1 124 44 -125 -98 -258 130
4263A30K4J8o3j80j44K35j22L55j51r4J02J28k37N3k7n0j32L50l18K3L16m5j00
$$ 130 154 172 109 -71 -215 20 -102 253 102 8 110 238 1 54 27 -23 -155 195 -123 -100 216 171 71
4286G1m9j17J22j26J13K58j73j66m3K71qj85o9q2L81j68o2Q6j34O8N7ol8p9o8
$$ 71 22 -95 27 -99 14 272 99 -67 -110 161 153 -32 -101 -183 198 30 -32 54 -80 -12 45 39 1 -78 -146
4311a46J88o3J4o4J77k17J08l0J11J89l77L45J5l64J78K73l35r2K23r5k06O0K17
$$ -146 42 -21 -7 -71 106 -111 -3 -33 78 267 -110 235 250 -114 64 337 2 -90 133 38 -168 -108 109
4334A09K2K7k82K9J92k39M1J36l8j40Q5p3j18K72j71M2%J41l63K93j57J68J02
$$ 109 131 158 -124 -95 97 -142 -101 35 -3 -143 -58 -131 -249 23 -148 -106 -106 35 -328 -35 -192 -24 78
4357G8j86p1J54j53K56Kj38o5M4j6J01Q2Q4j63K55m27J31K31n01M81mj29O2p1
$$ 78 -108 -179 -25 -178 78 80 -58 -123 -79 -95 6 88 172 9 264 -163 -32 199 -302 179 175 46 108 37
4381C7j78O8R5M9j17L9R6n9K0j14K21l77K65r9j08L74j8j34j42kL03R7l41N7N1
$$ 37 -141 -73 22 71 -46 -7 89 30 50 -64 157 -220 45 -54 -162 212 194 60 -82 -84 219 316 -25 32 83
4406H3k2JJ06j07k23J57j9J03L3lK26k06L4k0j33J82k77j3K56j41l07N87M4m07
$$ 83 61 62 168 61 -162 -5 -24 79 112 109 335 129 163 143 10 192 -85 -98 158 17 -290 297 341 -66
4430f6q0J99k59J07k8L67j40q0K90k75J90l39J59k20J82j21M9K13k37J18l31L78
$$ -66 -146 53 -206 -99 -127 240 100 20 310 35 225 -114 45 -175 7 -114 -65 148 -89 29 -302 76
4452G6J43k26p2L5J14j50K09K6k60J42p6J3j95K16J09M5j01j33L11l82J82n5J54
$$ 76 219 -7 -79 -44 70 -80 129 155 -105 37 -39 -26 -221 -5 104 149 48 -85 226 -156 26 -29 125
4475A25l80K78o5J61j21J21k54J68J08O7R7k37Q4j86p2R8j35J25O2j25k7K85j57
$$ 125 -255 23 -42 119 -2 119 -135 33 141 208 305 68 152 -34 -106 -8 -143 -18 44 -81 -108 177 20
4498B0J50j39R7r3J2n4j81K34J8J34m89L9K36Q1L6L2r3j07J35q0K49k17%k8O2
$$ 20 170 31 128 35 47 -7 -188 46 64 198 -291 -252 -16 65 101 133 40 -67 68 -12 237 20 20 -8 54
4523E4J89k00j19j09PL3R1N0M1j03N1k8Rp9J46q2J8NJ18m55J26L81j72J4J26k17
$$ 54 243 43 -76 -185 -178 -145 -54 -4 37 -66 -15 -43 -34 -113 33 -49 -31 -26 92 -363 -237 144 -28 -14 112 -105
4549a05J07l8k2j54K59R2l87K98J97M8l31lJ4j05J80J41l30R5k9J16j53K04K3
$$ -105 2 -36 -58 -212 47 139 -248 50 247 295 -36 -39 -25 -130 50 191 -139 -44 -73 43 -110 94 117
4572A17K9J01j53j45l5j13j02J75K97k15L3O5L5k68L17j98q3J57n6J06k45n2L49
$$ 117 146 247 94 -51 -86 -199 -301 -126 171 -44 -11 54 89 -179 138 -60 -143 14 -42 64 -181 -233 116
4595A16l6j5m8K53n54L59P1k79J48q6OK00J56k83j56p6K40j08K03j60j8K78k45
$$ 116 80 65 17 270 -284 75 146 -133 15 -71 -65 135 291 8 -148 -224 16 -92 111 -49 -67 211 -34
4618c4no3K35n7k67M51l09Q8m9lk88L21J96k92M0J74j18j21k95J72K89j41K12
$$ -34 -39 -102 133 76 -191 260 -49 39 -10 -13 -301 20 216 -76 -36 138 20 -101 -396 -224 65 -76 136
4641A36L7J13l69N1r3J22J4p9J46j3K5J8l74J64L7K41J6m43L35m9nK36j53k87
$$ 136 173 286 -83 -32 -125 -3 11 -68 78 65 90 108 -266 -102 -65 176 192 -251 84 35 30 266 113 -174
4665a74M06j78j90K10n4K45k2l51O8K03j38J10l76K94j1K93l54j43J26j9L09j08
$$ -174 232 54 -136 74 20 265 243 -108 -40 163 25 135 -241 53 42 335 -19 -162 -36 -55 254 146
4687A46k46j53J27J17q1Q9K57k95l8m25N73k22k7K39l6M4j3l23K36J70M6j18k28
$$ 146 -100 -253 -126 -9 -90 -1 256 -39 -77 -502 71 -151 -178 61 25 69 56 -267 -31 139 185 67 -161
4710a61K25k9m8R5j06K7k3K03j68k27K59J0K49l00N1L8j8j66M4N3J50O0m02P5
$$ -161 64 35 -13 82 -24 3 -20 183 15 -212 47 57 306 6 57 95 77 -89 -45 8 158 218 -184 -109
4734a09J07j28J39R1j80J33J27j49m49K92L42j35j61M7K80m90J86n7J33R4j87
$$ -109 -2 -130 9 100 -80 53 180 31 -418 -126 216 81 -80 -33 247 -243 -57 -114 19 113 -74
4755g4o1K81j04p3J25j76J22K4j53m6J41j67J13j90K09K4J06q1k21j54J77j85
$$ -74 -135 146 42 -31 94 -82 40 64 -89 -135 6 -161 -48 -238 -29 -5 101 20 -201 -355 -178 -363
4777c63M59L4j02n5q2J4P2q2J65l3j1N6ol32L63n4O3l3p8j89J24j49K59n1k8J50
$$ -363 96 130 28 -27 -109 -95 -23 -105 60 27 16 72 66 -266 97 43 106 73 -5 -194 -70 -219 40 -11 -39 111
4803A11q1r1L01l70K34J03j51J56l55L49o3J38m7m22P0J87l85K50j17r1M49k91
$$ 111 30 -61 240 -130 104 207 56 212 -143 206 143 281 234 -188 -118 69 -316 -66 -183 -274 175 -116
4825a16J72k10K38l8m6K60l30J51q4K4j85M4J60o8J37k05OO9N0J32j21j9j81K59
$$ -116 56 -154 84 46 0 260 -70 81 -3 21 -164 -120 40 -28 109 -96 -90 -21 29 161 40 21 -160 99
4849I9L0k20k05L75M8l14K31j86L33m50N65m01M87k48p4j31K99M9j84k48J85j6
$$ 99 129 -91 -296 79 127 -187 44 -142 191 -259 306 -95 392 144 70 -61 238 287 103 -145 40 24
4871B4l6r3Q5k1J54j71Q8J02j91o3J32K43m7l08n8M03k79M1j49J45M42k40j62
$$ 24 -12 -105 -20 -41 113 -58 30 132 -59 -122 10 253 206 -102 -160 243 -36 5 -144 1 443 203 41
4894D1P1j43J68P2o7l17K61j49O5p5k5J51k15K04l04J17K5K31p1l86M62m97K87
$$ 41 112 -31 137 209 142 -175 86 -63 2 -73 -98 53 -162 42 -262 -145 -120 111 40 -346 116 -381 -94
4917i4K62k03j18J82J23j42j7o4j26R9N3NN2q2K5K9R1J64l56O4K28l03J01K61
$$ -94 168 -35 -153 29 152 10 -7 -71 -197 -98 -45 -40 12 -70 -45 -16 75 239 -117 -53 175 -128 -27 234
4941B34j13k66K22j61J20rjJ2j20K27j36l60N16j92K6j73M2j6J73L3l04K72N4
$$ 234 121 -145 77 -84 36 27 26 38 -82 145 9 -351 165 -27 -1 -174 -132 -148 25 58 -246 26 80
4964H0J70k80J33j93L9J74j33l4l02L71K51m26M21m29M7j39K35j5P0r5J73j19
$$ 80 250 -30 103 -90 -51 123 -10 -44 -346 25 276 -150 271 -158 -111 -250 -15 -30 40 -55 118 -1
4986aJ51k29K7J98K6k74j88L08p1j10K63l87L28l1m6M9j3MJ77J74n41M07k26L5
$$ -1 150 -79 -52 146 172 -102 -290 18 -53 -163 100 -287 41 10 -36 13 0 4 181 355 -186 221 -5 30
5010C0k08J66o3J50k95M23O2l36j1J5J13j09j5N5K06j39k9o8J74j78j12J26J00
$$ 30 -178 -12 -75 75 -220 203 265 -71 -82 -67 46 -63 -78 -23 183 44 15 -53 121 -57 -169 -43 57
5033E7R1k00K67j95q1J17P7l12K41j14K92m79J36M0J38j00K72j68k09M6j97K19
$$ 57 148 -52 215 20 -61 56 133 -179 62 -52 240 -239 -103 -63 75 -25 247 79 -130 -84 -281 -62
5055f2R4J82J6l08K57n6jk60J79Q0l67N1K23J43j42J77l41K07m1j61n5k3J48L91
$$ -62 32 214 230 -78 179 123 122 -138 41 121 -246 -195 28 171 29 206 -135 72 31 -130 -185 -208 -60 331
5079C31l61K2K6L7j62K04j28J34Rj40J10J22m22J48j58K52K23l04kJ37R4j82k59
$$ 331 -30 -8 18 55 -107 97 -31 103 112 -28 82 204 -218 -70 -228 24 247 -57 -59 78 172 -10 -269
5102b69J65Q3M3k82J69J14K0m9j98K04N0q8mP6p7J07J24R7m68M0K82k02O1M2k30
$$ -269 -104 -21 22 -260 -91 23 43 -6 -204 0 50 -38 -42 34 -43 64 188 285 -183 -143 139 -63 -2 40 -190
5127a90K10l9N0QJ88l09J15P2r4N7J09k12J92j86L20m59pM36j87l7J01k96J44
$$ -190 20 -19 31 39 227 -82 33 105 11 68 177 -35 157 -29 291 -168 -175 261 74 37 138 -158 -14
5150a4Q4M6n0k7j99K0J08m7J82M0j25J80l4m2P5k17k36R1L00J30L6n93K79M3r4
$$ -14 70 116 66 39 -160 -140 -32 -79 103 143 18 198 164 122 197 -20 -256 -165 135 265 301 -292 -13 30 -64
5175f4J27k95M39N9k21N0j36kJ16Q4k15N2k3k55M57j93j10p5K98J13M2o1j83j77
$$ -64 63 -232 207 266 45 95 -41 -43 73 157 -58 -6 -29 -284 173 -20 -130 -205 93 206 248 187 4 -173
5199a73J95j78r7Q2K34P1o3n1M9p6j58J64J99j53r6Qj18K75k94M24j63k41P1j05
$$ -173 22 -156 -253 -171 63 134 71 20 69 -7 -165 -1 198 45 -51 -43 -161 114 -180 244 81 -160 -89 -194
5223a94L13l74P4K10J82l48J41K6l3J88m07K98j75L09j71J98k91J38P5k37P7J1
$$ -194 119 -255 -181 29 211 -137 4 30 -3 185 -222 76 -99 210 39 237 -54 84 159 -78 -1 10
5245A0K31k81j18K31j15R9o1K00l79K76k54Q4J21J4l9j6Mn4J38k12J50l0r8K60
$$ 10 241 -40 -158 73 -42 57 -4 196 -183 93 -161 -77 44 58 19 3 7 -47 91 -121 29 -1 -99 161
5269A61L14l10l58L19j45J24k27Q5p0J24j35J6J90q3j73J48M4O3k05J1J91j51
$$ 161 475 165 -193 126 -19 105 -122 -37 -107 17 -118 -102 88 5 -168 -20 24 87 -118 -107 84 -67
5291f7m7M8P4L4j40K36j30Pj62K23r3K9J88l03J06m4L48m54J06J8K8Q7m0j17P8
$$ -67 -114 -66 8 42 -98 138 8 15 -147 76 -17 12 200 -103 3 -41 307 -147 -41 -23 5 92 52 -65 13
5316A3J31j29O2j72J16KK4J29k07p7M7nR5Qj54K79j64j06Q3OJ58J41l60pj82L79
$$ 13 144 15 77 -95 21 23 47 176 -31 -108 -61 -66 29 37 -117 162 -2 -108 -25 -19 139 280 -80 -87 -269 110
5342A10k12K94j81k9k8J07n5N3l0j6k05L42K18m13O5j95J73O5j02J50k10Kj16
$$ 110 -102 192 11 -18 -46 61 6 59 29 13 -192 150 368 -45 20 -175 -2 63 -39 111 -99 -97 -213
5365b13K79j75p6M17k76l25M99j45K15l60O5O4J22J84l28J39j76K32l7k27K6K12
$$ -213 66 -109 -185 232 -44 -369 130 -15 200 -160 -95 -31 91 275 -53 86 -90 142 105 -122 -96 116
5387A16l04N7J76J54j21J49r9j07J47n11M35J99l92J47k39K44j24N8J50l76K11
$$ 116 -188 -131 45 199 78 227 128 21 168 -343 92 291 -101 46 -193 51 -73 -15 135 -241 -30
5408c0N7n3l5k35K63L3K62k21j98J94L9j34OK96l84L03k68J00l5J42n4O5k08J10
$$ -30 27 -26 -61 -296 -33 0 262 41 -157 37 76 -58 -52 244 -140 163 -105 -5 -40 102 48 113 -95 15
5432A5N1k64K16j86j9K93l32K46Lr7O9p3n3K7M8J03R5m2r0j22J98l79L31J43l19
$$ 15 66 -198 18 -168 -187 106 -226 20 23 -74 -5 -78 -131 -104 -56 47 142 100 10 -112 86 -293 38 181 -138
5457a38qJ51k7J92k09O6l7j07J1J23l05M70j82k7J31r6O1JO2l83J32L88j82J7
$$ -138 -146 5 -22 170 -39 27 -10 -117 -106 17 -288 182 0 -27 104 8 69 70 132 -251 -119 269 87 104
5481A04o3j47M05j82j72J68j28Q3q4k7J19j53J99O5M6k35J15j81n1L50J1j45O9
$$ 104 41 -106 299 117 -55 113 -15 68 -16 -43 76 -77 122 187 233 -2 113 -68 -119 231 242 97 166
5504A66m22K82j37K67Q3n15K33m6K08j64k04J66J17J96k56L9j25j83P31m33Mj40
$$ 166 -256 26 -111 156 239 -276 -43 -89 119 -45 -249 -83 34 230 -26 13 -112 -295 436 3 7 -133
5526a33J66k24J90m2M0K15j31n05L55j9O4j22J44J02k74M38j60K05l06K11J49
$$ -133 33 -191 -1 -43 -3 212 81 -424 -69 -88 -24 -146 -2 100 -174 264 104 309 3 214 363
5547C63m66K72k26j64L99k82J54j68M9j7k3J62J18k07%o1n4j9K77p0Nk0q8j9j0
$$ 363 -103 169 -57 -221 178 -104 50 -118 -69 -86 -109 53 171 -36 -36 -97 -151 -170 107 37 42 22 -66 -85 -95
5572i5J18p6r0P7k44J22N60j13m53N07l92K49l2q7k14P0J17j38J39Q9j47j17L7
$$ -95 23 -53 -143 -66 -310 -188 372 259 -194 313 -79 170 138 51 -163 -93 24 -114 25 114 -33 -150 -113
5595a13k18J94K78k46J66K60m34J06J00k23j53K57L4o5m1J53J25k83L6m1K07p8
$$ -113 -331 -137 141 -105 61 321 -113 -7 93 -130 -283 -26 8 -57 -98 55 180 -103 -67 -108 99 21
5617B1kj9J53l96K17O9J33k54M7P0q0J54m08K89Q2M6J58l04Nl25N05K44o04J13
$$ 21 19 0 153 -243 -26 43 176 -78 -31 39 -41 113 -295 -6 76 122 280 -24 -19 -344 161 405 -199 -86
5641h6J76J71l03r8M0ll2P6j50K82R4q2l37K1J49J11Q0pJ68j31K43k38j75J24
$$ -86 90 261 -42 -140 -100 -103 -135 -59 -209 73 167 85 -252 -231 -82 29 109 102 270 139 382 144 -31 93
5665I3k43K15k89J31M33k39k10m3RJ07J94j16Q1l42J57K78k49j25j46K35o1Q7
$$ 93 -150 65 -224 -93 340 101 -109 -152 -143 -36 158 42 123 -219 -62 216 -33 -158 -304 -69 -130 -43
5687d3n1K33J18k64N9j00kQ2k46L39m8J1k53m5J29J53P5p6J05j58r0J62k6K11
$$ -43 -94 139 257 -7 52 -48 -50 32 -214 125 77 88 -165 -210 -81 72 147 71 176 18 -72 90 64 275
5711B75m88K08J55k48L34k57K7o6k34M18j59lk05K18J97m01K06J36k14M2P9K48
$$ 275 -213 -5 150 -98 236 -21 6 -60 -294 124 -35 -38 -243 -25 172 -229 -23 113 -101 -59 20 268
5733B68l59m5J15j6J69j62Q7R2l19J5K15J53j39j11j6J74k7j73J70J29l31K33
$$ 268 -91 -136 -21 -37 132 -30 57 149 -170 -155 60 213 74 -37 -53 121 94 -79 91 220 -111 122
5755A22m1j19R9K3k0J22L1m68m6L29R4O6k00N9j12M3K24j70lk16J19J46k17pk6
$$ 122 81 -38 61 84 64 186 217 -251 -297 32 126 192 -8 51 -61 -18 206 36 33 -183 -64 82 -135 -142 -168
5780a68L26K3k3j58j48J27m2K43l09L75k55j18P3QJ18R7j78r6J94k02J98j17J11
$$ -168 158 181 158 0 -148 -21 -63 180 -129 246 -9 -127 -54 -46 72 169 -9 -105 89 -113 85 -32 79
5803G9k10K17k41rR7J32Q5r7j54Q7J75r1n9n5K66j0l35Q0k12L69l3k16j74J49
$$ 79 -131 86 -155 -164 -67 65 150 53 -101 -14 161 70 11 -44 222 212 -123 -43 -255 114 81 -135 -309 -160
5827a60R1o4J76O9j20O0j91l8L87n5m73K36J78r8K07j62j74K26k76J07O2o6j26
$$ -160 -69 -133 43 112 -8 52 -139 -177 210 155 -318 -82 96 -2 205 43 -131 95 -181 -74 -12 -78 -204
5850b04L15k17RJ89n9q6J93j48j17J85J67k84K30k36o0J40r3j19L9J1rQ0K58k42
$$ -204 111 -106 -97 92 33 -53 140 -8 -125 60 227 -57 173 -63 -123 17 -76 -195 -156 -145 -154 -74 184 -58
5874e8K33j07j81K5K76m10l5K91k32J02J92J61r9k1k47P0K07k00p2O5L11l90M11
$$ -58 175 68 -113 -88 188 -222 -257 34 -198 -96 96 257 158 137 -110 -40 167 -33 -105 -40 271 -119 292
5897B92l18q4k04J33K41M0J6k26L70j27n5k69J84R4j53Q6J64j91J03Q5k72J74
$$ 292 -26 -110 -314 -181 60 100 116 -110 260 133 78 -191 -7 87 -66 20 184 -7 96 181 -91 83
5919H3j61M5J13j36j35K1J46J2J74k94K95m59K34O0l2J03m0j97L58k54p6o8M31
$$ 83 -78 -33 80 -56 -191 -170 -24 -12 162 -132 163 -296 -62 -2 -34 69 29 -168 190 -64 -140 -208 223
5942B23k95N0R7l36M29r6j37J40r2M4r5q4K00m8j93K78n3k03K88k85K53j1l11
$$ 223 -72 -22 75 -261 168 72 -65 75 -17 27 -68 -152 48 0 -193 85 32 -171 117 -168 85 74 -237
5965b37K17l7l7l3J10p2J22k05L50k59J39k10m4M76l89N8K61l67K44j92K17r2
$$ -237 -20 -57 -94 -127 -17 -89 33 -172 178 -81 58 -152 -196 280 -109 -51 210 -157 87 -105 112 20
5987B0J05j29Q0r8k02J85j89M31n4q7l1n5j56Q7J09l13M24j73K0l9P8O7j42Oo9
$$ 20 125 -4 76 -22 -224 -39 -228 203 149 62 31 -24 -180 -93 16 -297 127 -46 -26 -65 13 80 -62 -56 -125
6012a25j0J13J09k85K10j37R6q9K52L07k64j36J49q7q0K1P2j9k18p7K99p4R1r2
$$ -125 -135 -22 87 -198 12 -125 -29 -118 134 441 177 41 190 103 23 44 116 97 -121 -198 101 27 118 26
6036B6o2nm7j90K09j22M29J1l65L00J05j26m0J31k86k25J71k7K05J92k92k2N7
$$ 26 -36 -41 -88 -278 -69 -191 238 249 -116 184 289 163 123 254 -32 -257 -86 -113 92 284 -8 -30 27
6059B7J34j37n1k22O8Q4J81j2Mk0k67N4N1J92k07K02j59J87j76j22o1R6K59l04
$$ 27 161 24 -27 -249 -181 -97 84 72 76 56 -211 -157 -106 86 -121 81 -78 109 -67 -189 -250 -154 105 -199
6083a99J59J92j50p6n6J17J65j00j72J7L35k19k05K38J33k45L29k14J2L3O6o2
$$ -199 -40 152 2 -74 -130 -13 152 52 -120 -103 232 13 -192 46 179 -66 263 49 61 94 160 98
6105I8j95P0J42Pk40J56k5l2J3j11J66p3m2J71r5j00O4j01L11OL3k56k51M30k62
$$ 98 -97 -27 115 122 -118 38 13 -19 -6 -117 49 -24 -66 105 10 -90 -26 -127 184 190 223 -33 -284 146 -116
6130a16nK05L5k96K15K0j43l1K86k19J14R6p1l27J10m3J90K36m46K90M1k29N9
$$ -116 -121 84 119 -177 38 58 -85 -116 170 -49 65 161 90 -237 -127 -170 20 256 -190 100 141 -88 -29
6153b9L41k83J09m4j15J72j68l4R8J2k31R5J39L14m37Lj67L28P8k56O7O7k27K98
$$ -29 312 29 138 94 -21 151 -17 -51 47 59 -172 -77 62 376 -61 -58 -225 103 181 -75 -8 59 -168 130
6177A30n26J59L80k92Q7J29k3R9Q5k42M3q8l6N8N6L9J1J24k22P8l83L06l1k1l0
$$ 130 -396 -237 143 -149 -62 67 44 143 228 -14 29 -59 -95 -37 19 58 69 193 -29 49 -334 -28 -59 -80 -110
6202a10J09J60k28Q1N5l7j20Q7K04l32N26j62l67j35M96m99J75mL41p7J64m36
$$ -110 -1 159 -69 12 67 30 -90 -3 201 -131 395 233 -134 -269 227 -272 -97 -101 240 163 327 -109
6224a09J83k31j14M69m27K90J10L0r6J49k49J04j60j1K93l3j91J51Ol45K8Q5K6
$$ -109 74 -157 -271 198 -229 61 171 201 105 254 5 109 -51 -62 231 198 7 158 164 -181 -153 -68 -42
6247d2M6j9L8J95l91N9l1J46J0J96j54O3oj92M8q3K18l7j38K44J62m67M54k47
$$ -42 4 -15 23 218 -173 -114 -145 1 11 207 53 116 110 -82 -34 -117 101 64 -74 170 332 -135 319 72
6271G2j84K9P9O5r8J13R4n1k98J53J18J08k96m1J78r5j75L61k37J67j09J24r6
$$ 72 -112 -83 -4 61 -37 76 170 119 -179 -26 92 200 -96 -137 41 -54 -229 132 -105 62 -47 77 -19
6294a9j3Q2o2Q9j66K62j90l1L07n98L51k46L11M1kk38NP6k61M14j28K78k10j7
$$ -19 -32 50 -12 77 -89 173 -17 -48 259 -339 12 -234 77 118 116 -122 -117 -41 -302 112 -16 262 52 35
6318C5k46J65M9P2j68j45J99K9k91l9L97k93p8J82K60l44J14L25n26N26j58J66
$$ 35 -211 -46 3 75 -93 -238 -39 -10 -301 -340 57 -236 -314 -132 128 -216 -102 223 -303 223 65 231
6340B31l07R2k0J41r0Nj60L38j10k08j00J83j07j64M08p3p3mJ37m09K95J5J50
$$ 231 -76 16 -4 137 47 52 -108 230 120 -88 -188 -5 -112 -276 132 59 -14 -18 119 -290 5 20 170
6363A70k11o8m4J46R6j90N8j02n1K4L66k0l14R9l3m0J90j94K02j57L2j26L46m36
$$ 170 -41 -109 -153 -7 89 -101 -43 -145 -196 -172 194 174 -140 -41 -74 -114 76 -118 84 -73 -41 -167 179 -257
6387b57K86J54j57J84j14K94n57J51j0O4j4j8j15J96p8mLO9q1on8j7K42j61J82
$$ -257 29 183 26 210 96 390 -167 -16 -26 38 24 6 -109 87 9 5 8 77 -4 -10 -68 -85 157 -4 178
6412A78j18J57j59l11J72N6k01R4P9m7N4LL42k33r6k94M75j47J16k07L17k89j00
$$ 178 60 217 58 -253 -81 -25 -226 -132 -53 -100 -46 -43 299 66 -30 -324 151 4 120 -87 230 -59 -159
6435a59j13L03n9J78J72k88R0J2J75k08j06J88k78N1q2J9K91k04j29N07m25j84
$$ -159 -272 31 -28 150 322 34 124 136 311 103 -3 185 -93 -42 -124 -105 186 -18 -147 360 -65 -249
6457b49K71J8%j40J1J0K05k24K31r3Kk65K48J04l96O01k84j96K35l8P0n4l3o9
$$ -249 22 40 40 -100 -89 -79 126 -98 133 40 42 -223 25 129 -267 334 50 -146 89 51 121 67 34 -35
6481c5j30J57r7k9j1M8J66j67L2k70L63j96m6J25J06N3J73l99L6L05j55j19J36
$$ -35 -165 -8 -105 -134 -145 -97 69 -98 -66 -336 27 -169 -215 -90 16 69 242 -157 -121 184 29 -90 46
6504D6K13l44J89j74m6J50O4j65q8P1J01O1k06K34j78J61LJ06j69J93j69j48L06
$$ 46 259 -85 104 -70 -116 34 98 -67 -155 -84 17 78 -128 106 -72 89 92 198 29 222 53 -95 211
6527B11l42J25L3j63J34m2j49K81j50J08j56K43l06K75j40j2q1P4j11Q1j03M7
$$ 211 -131 -6 27 -136 -2 -44 -193 88 -62 46 -110 133 -173 102 -38 -50 -131 -57 -168 -87 -190 -143
6549a43L44k86N4p8J82J40L5P8j19j72j09K31j62P0O8k61K83o8q1J69l83K25j92
$$ -143 201 -85 -31 -109 73 213 248 326 207 35 -74 157 -5 65 133 -128 155 87 6 175 -208 17 -175
$$ [...]
8191c58
##END NTUPLES=NMR FID
##END=
