##TITLE=1H_LR-760-1-C2-B2
 D2O
 8 sc, 
 20.1.2023
##JCAMPDX= 6.0         $$ Bruker NMR JCAMP-DX V2.0
##DATA TYPE= NMR FID
##DATA CLASS= NTUPLES
##ORIGIN= UXNMR, Bruker Analytische Messtechnik GmbH
##OWNER= root
$$ XWIN-NMR		Version 3.5
$$ Fri Jan 20 14:52:26 2023 Russian Standard Time (UT+4h)  she@DPX200
##.OBSERVE FREQUENCY= 200.13135
##.OBSERVE NUCLEUS= ^1H
##.DELAY= (6, 6)
##.ACQUISITION MODE= SIMULTANEOUS
##.ACQUISITION SCHEME= undefined
##.AVERAGES= 8
##.DIGITISER RES= 18
##SPECTROMETER/DATA SYSTEM= spect
##.PULSE SEQUENCE= zg30
##.SOLVENT NAME= D2O
##.SHIFT REFERENCE= (INTERNAL, D2O, 0, 15.7039)
##AUDIT TRAIL= $$ (NUMBER, WHEN, WHO, WHERE, WHAT)
$$ ##TITLE= Audit trail, XWIN-NMR		Version 3.5
$$ ##JCAMPDX= 5.01
$$ ##ORIGIN= Bruker BioSpin GmbH
$$ ##OWNER= she
$$ F:/spectra/data/she/nmr/H-F/1/audita.txt
$$ ##AUDIT TRAIL=  $$ (NUMBER, WHEN, WHO, WHERE, WHAT)
(   1,<2023-01-20 14:51:26.93 +0400>,<she>,<DPX200>,
      <created by zg, POWCHK disabled, PULCHK disabled
       configuration hash MD5:
       00 E9 B6 7A A2 85 ED C7 34 08 36 98 17 FE 4E 26
       data hash MD5: 16K
       B7 ED 1C DF 4B AB 66 7C AA FB F1 09 BF 1D B9 7C>)
$$ ##END=
$$ 
$$ hash MD5
$$ CE D1 D9 D7 65 82 6B 60 5E 1F 5C 3F 18 29 55 7A
##$RELAX= 
##$RELAX= 
##$RELAX= 
##$RELAX= 
##$RELAX= 
##$RELAX= 
$$ Bruker specific parameters
$$ --------------------------
##$DU= <F:/spectra>
##$EXPNO= 1
##$NAME= <H-F>
##$PROCNO= 1
##$TYPE= <nmr>
##$USER= <she>
##$AMP= (0..31)
100 100 100 100 100 100 100 100 100 100 100 100 100 100 100 100 100 100 
100 100 100 100 100 100 100 100 100 100 100 100 100 100 
##$AQSEQ= 0
##$AQ_mod= 1
##$AUNM= <au_zg>
##$AUTOPOS= <>
##$BF1= 200.13
##$BF2= 200.13
##$BF3= 200.13
##$BF4= 200.13
##$BF5= 200.13
##$BF6= 200.13
##$BF7= 200.13
##$BF8= 200.13
##$BYTORDA= 1
##$CFDGTYP= 0
##$CFRGTYP= 5
##$CHEMSTR= <none>
##$CNST= (0..31)
1 1 145 1 1 1 1 1 1 1 1 1 1 1 1 1 1 1 1 1 1 1 1 1 1 1 1 1 1 1 1 1 
##$CPDPRG= <>
##$CPDPRG1= <>
##$CPDPRG2= <>
##$CPDPRG3= <>
##$CPDPRG4= <mlev>
##$CPDPRG5= <mlev>
##$CPDPRG6= <mlev>
##$CPDPRG7= <mlev>
##$CPDPRG8= <mlev>
##$CPDPRGB= <>
##$CPDPRGT= <>
##$D= (0..31)
0 1.2 0 0 0 0 0 0 0 0.06 0 0.03 0 0 0 0 0.0002 0 0 0 0 0 0 0 0 0 0 0 0 
0 0 0 
##$DATE= 1674211886
##$DBL= (0..7)
120 120 120 120 120 120 120 120 
##$DBP= (0..7)
150 150 150 150 150 150 150 150 
##$DBP07= 0
##$DBPNAM0= <>
##$DBPNAM1= <>
##$DBPNAM2= <>
##$DBPNAM3= <>
##$DBPNAM4= <>
##$DBPNAM5= <>
##$DBPNAM6= <>
##$DBPNAM7= <>
##$DBPOAL= (0..7)
0.5 0.5 0.5 0.5 0.5 0.5 0.5 0.5 
##$DBPOFFS= (0..7)
0 0 0 0 0 0 0 0 
##$DE= 6
##$DECBNUC= <off>
##$DECIM= 32
##$DECNUC= <off>
##$DECSTAT= 4
##$DIGMOD= 1
##$DIGTYP= 9
##$DL= (0..7)
0 120 120 120 120 120 120 120 
##$DP= (0..7)
150 150 150 150 150 150 150 150 
##$DP07= 0
##$DPNAME0= <>
##$DPNAME1= <>
##$DPNAME2= <>
##$DPNAME3= <>
##$DPNAME4= <>
##$DPNAME5= <>
##$DPNAME6= <>
##$DPNAME7= <>
##$DPOAL= (0..7)
0.5 0.5 0.5 0.5 0.5 0.5 0.5 0.5 
##$DPOFFS= (0..7)
0 0 0 0 0 0 0 0 
##$DQDMODE= 0
##$DR= 18
##$DS= 0
##$DSLIST= <SSSSSSSSSSSSSSS>
$$ [...]
##$SUBNAM2= <"">
##$SUBNAM3= <"">
##$SUBNAM4= <"">
##$SUBNAM5= <"">
##$SUBNAM6= <"">
##$SUBNAM7= <"">
##$SUBNAM8= <"">
##$SUBNAM9= <"">
##$SW= 18.05172834244
##$SWIBOX= (0..15)
0 0 2 0 0 0 0 0 0 0 0 0 0 0 0 0 
##$SW_h= 3612.71676300578
##$TD= 16384
##$TD0= 1
##$TE= 0
##$TE2= 300
##$TE3= 300
##$TEG= 300
##$TL= (0..7)
0 120 120 120 120 120 120 120 
##$TP= (0..7)
150 150 150 150 150 150 150 150 
##$TP07= 0
##$TPNAME0= <>
##$TPNAME1= <>
##$TPNAME2= <>
##$TPNAME3= <>
##$TPNAME4= <>
##$TPNAME5= <>
##$TPNAME6= <>
##$TPNAME7= <>
##$TPOAL= (0..7)
0.5 0.5 0.5 0.5 0.5 0.5 0.5 0.5 
##$TPOFFS= (0..7)
0 0 0 0 0 0 0 0 
##$TUNHIN= 0
##$TUNHOUT= 0
##$TUNXOUT= 0
##$USERA1= <user>
##$USERA2= <user>
##$USERA3= <user>
##$USERA4= <user>
##$USERA5= <user>
##$V9= 5
##$VALIST= <valist>
##$VCLIST= <CCCCCCCCCCCCCCC>
##$VD= 0
##$VDLIST= <DDDDDDDDDDDDDDD>
##$VPLIST= <PPPPPPPPPPPPPPP>
##$VTLIST= <TTTTTTTTTTTTTTT>
##$WBST= 1024
##$WBSW= 4
##$XGAIN= (0..3)
0 0 0 0 
##$XL= 0
##$YL= 0
##$YMAX_a= 310932
##$YMIN_a= -416481
##$ZGOPTNS= <>
##$ZL1= 120
##$ZL2= 120
##$ZL3= 120
##$ZL4= 120
##$ABSF1= 10
##$ABSF2= 0
##$ABSG= 5
##$ABSL= 3
##$ALPHA= 0
##$AQORDER= 0
##$ASSFAC= 0
##$ASSFACI= 0
##$ASSFACX= 0
##$ASSWID= 0
##$AUNMP= <proc_1d>
##$AZFE= 0.1
##$AZFW= 0.1
##$BCFW= 1
##$BC_mod= 2
##$BYTORDP= 1
##$COROFFS= 0
##$CY= 11.3945322036743
##$DATMOD= 1
##$DC= 2
##$DFILT= <>
##$DTYPP= 0
##$F1P= 2.36226072786647
##$F2P= -0.459571619588291
##$FCOR= 0.5
##$FTSIZE= 0
##$FT_mod= 4
##$GAMMA= 1
##$GB= 0.15
##$INTBC= 1
##$INTSCL= 1
##$ISEN= 128
##$LB= 0.24
##$LEV0= 0
##$LPBIN= 0
##$MAXI= 10000
##$MC2= 0
##$MEAN= 0
##$ME_mod= 0
##$MI= 1.114404
##$NCOEF= 0
##$NC_proc= 0
##$NLEV= 6
##$NOISF1= 3.799351
##$NOISF2= 2.8
##$NSP= 1
##$NTH_PI= 0
##$NZP= 0
##$OFFSET= 15.70392
##$PC= 1
##$PHC0= -19111.8
##$PHC1= 5.600791
##$PH_mod= 1
##$PKNL= yes
##$PPARMOD= 0
##$PSCAL= 0
##$PSIGN= 0
##$REVERSE= no
##$SF= 200.130013532006
##$SI= 16384
##$SIGF1= 3
##$SIGF2= 2
##$SINO= 400
##$SIOLD= 16384
##$SREGLST= <1H.CDCl3>
##$SSB= 0
##$STSI= 0
##$STSR= 0
##$SW_p= 3612.71676300578
##$SYMM= 0
##$S_DEV= 0
##$TDeff= 0
##$TDoff= 0
##$TI= <>
##$TILT= no
##$TM1= 0
##$TM2= 0
##$TOPLEV= 0
##$USERP1= <user>
##$USERP2= <user>
##$USERP3= <user>
##$USERP4= <user>
##$USERP5= <user>
##$WDW= 1
##$XDIM= 8192
##$YMAX_p= 0
##$YMIN_p= 0
$$ End of Bruker specific parameters
$$ ---------------------------------
##NTUPLES= NMR FID
##VAR_NAME=  TIME,          FID/REAL,        FID/IMAG
##SYMBOL=    X,             R,               I
##VAR_TYPE=  INDEPENDENT,   DEPENDENT,       DEPENDENT
##VAR_FORM=  AFFN,          ASDF,            ASDF
##VAR_DIM=   8192,          8192,            8192
##UNITS=     SECONDS,       ARBITRARY UNITS, ARBITRARY UNITS
##FACTOR=    0.0002768,     1,               1
##FIRST=     0,             0,               0
##LAST=      2.2672688,     0,               0
##MIN=       0,             -416481,         0
##MAX=       2.2672688,     310932,          0
$$ Real data points
##PAGE= N=1
##DATA TABLE= (X++(R..R)), XYDATA
0 0 0 0 0 0 0 0 0 0 0 0 -8 8 -8 8 -16 16 -24 26 -32 40 -48 57 -71 81 -97 113 -129 151 -174 199 -228 259
32 259 -297 336 -378 426 -477 537 -599 670 -746 827 -917 1016 -1125 1242 -1370 1512 -1667
49 -1667 1834 -2023 2226 -2454 2710 -2993 3313 -3677 4095 -4581 5150 -5837 6678 -7734 9111
64 9111 -10986 13707 -18036 26005 -45710 206123 199582 -75320 84320 16749 -28779 120178
76 120178 310932 298431 250463 142011 44533 -43477 -105022 -80617 57899 103120 132122
87 132122 203788 104680 -157729 -225866 -168746 -166501 -82515 90037 119983 61449 -12678 -156674
99 -156674 -246009 -170846 -104489 -63907 59542 150287 103523 12434 -87281 -161720 -138453 -68924
111 -68924 6526 136593 211290 129289 21134 -44905 -124139 -133163 -28049 68024 121735 164283
123 164283 130563 23038 -75140 -141145 -140728 -47797 47590 100039 140066 108407 -19685 -124451
135 -124451 -143506 -122168 -62417 31934 105302 122270 72001 -21175 -96447 -134140 -133750 -61558
147 -61558 53319 119681 121491 79780 -14449 -113957 -144459 -105957 -26345 65635 117362 110230
159 110230 60615 -25690 -104430 -120057 -90111 -33149 53998 117484 111791 62428 -17523 -107271
171 -107271 -133782 -87388 -16676 69415 132854 111206 36763 -34481 -100786 -123835 -71301 1829
183 1829 63315 111785 100814 31459 -36875 -95810 -128467 -83299 2830 63300 103756 102137
195 102137 25521 -63227 -106999 -116588 -76658 10855 77269 100040 88598 24359 -59397 -96141
207 -96141 -95087 -63299 18262 94913 110656 88823 36818 -45851 -96605 -84218 -37724 31747
219 31747 101959 118844 84533 28070 -46222 -96341 -80080 -28536 29055 91460 115977 74338
231 74338 6390 -56208 -99733 -91688 -35116 30479 83959 100934 59551 -9916 -67698 -102444
243 -102444 -93593 -32987 35865 79516 92420 58198 -12752 -72893 -97296 -82885 -25898 46160
255 46160 90404 93068 56258 -10183 -70963 -92171 -68602 -11434 53470 94084 95051 54283 -14008
268 -14008 -71831 -85962 -60754 -9813 53788 96611 89628 39865 -23709 -74947 -92424 -65967
280 -65967 -7652 53517 86553 75251 28505 -33826 -85081 -98203 -65308 -6583 50283 80704
292 80704 69351 20526 -40827 -86690 -94281 -58657 1348 56204 83752 71195 20990 -40850
304 -40850 -80637 -81759 -45778 11858 66809 92273 73412 19732 -38050 -73037 -73886 -38321 21208
317 21208 73866 91373 67491 15582 -40996 -76979 -75018 -34689 23324 69975 83318 58861
329 58861 6129 -51211 -83676 -75462 -33789 21743 66105 78742 51096 -3507 -56677 -83063
341 -83063 -72052 -29080 26260 69724 78120 47442 -5475 -55291 -79343 -66212 -21335 33959
353 33959 74110 78438 45032 -7909 -54411 -76096 -61370 -13909 40260 74220 75188 41551 -11566
366 -11566 -57903 -75715 -57258 -9655 42065 73091 72123 36714 -18348 -61855 -73419 -53100
378 -53100 -7577 44742 73296 65786 29288 -21968 -64321 -74339 -50742 -4912 44883 71148
390 71148 60282 22555 -27745 -69737 -76396 -46934 -1612 43949 69731 56350 14446 -32755
402 -32755 -68304 -73955 -42718 4682 46732 70013 56803 13110 -33307 -64729 -68280 -35088
414 -35088 15250 54502 72666 58019 12580 -34909 -60319 -61140 -29851 20564 57475 68823
426 68823 53269 9614 -40191 -66130 -62423 -30989 18215 55290 62532 43199 -1886 -52077
438 -52077 -72247 -60613 -30201 15249 53327 58101 34680 -4661 -49502 -71922 -57924 -23793
450 -23793 21178 61522 66393 37420 -2458 -44681 -66071 -45614 -4214 35290 68179 71571
462 71571 38925 -591 -34924 -55435 -39026 2329 37947 66147 74868 40806 -9012 -42678
474 -42678 -59857 -45992 1363 42293 61018 61083 27070 -26347 -54270 -58432 -46998 -5869 37200
487 37200 51036 47014 23529 -25847 -61108 -62669 -47179 -8306 42066 60321 46577 19724
499 19724 -27047 -65236 -57666 -28385 3031 44179 65359 45017 14529 -18739 -54278 -56646
511 -56646 -24890 8375 43926 68616 50500 10149 -25304 -56989 -60260 -21706 17533 42492
523 42492 61412 46362 -734 -34517 -51731 -57002 -28569 16531 43783 54559 42650 -106
535 -106 -41240 -57891 -56743 -26421 23192 49182 48803 35280 -2907 -45808 -57363 -46153 -22314
548 -22314 18036 48514 49905 33388 -2113 -45824 -61506 -47083 -19837 22736 57523 52864
560 52864 23169 -11080 -45904 -58609 -39453 -8607 25512 52110 47877 22856 -4885 -39795
572 -39795 -59646 -40722 -5546 26237 56062 58158 22938 -16994 -46404 -58438 -35396 4603
584 4603 33505 52030 49067 13882 -20963 -38793 -50596 -38117 1615 32845 47300 50946 21932
597 21932 -23442 -47188 -51370 -37186 7452 47224 53291 44130 17184 -26573 -47430 -38640 -23214
610 -23214 8344 46247 53253 39809 19941 -19203 -50175 -42745 -21086 5916 45919 60249
622 60249 35023 5299 -25854 -55110 -48873 -16554 9949 37295 52120 28639 -5196 -29115
634 -29115 -52621 -53202 -18910 13294 34150 50191 33395 -9159 -35581 -47733 -47998 -16579 24281
647 24281 42169 45906 33664 -4301 -35438 -42165 -37868 -13318 27511 49038 47470 33624 -1843
660 -1843 -38350 -45466 -31845 -8828 28071 52326 44203 22501 -5735 -38023 -47931 -30503 -6610
673 -6610 22489 47422 44063 18821 -11007 -40031 -51912 -34391 -3331 26509 47255 42229 12335
686 12335 -18247 -40596 -49071 -31393 1588 28062 42049 38376 12624 -18838 -40793 -47074 -30733
699 -30733 2127 30999 44401 38947 11366 -22849 -43751 -44785 -25771 7041 35144 44616 34777
712 34777 8027 -22796 -41124 -40976 -23109 8546 36141 44104 33640 7216 -24557 -43793 -40677
725 -40677 -20400 10582 37734 43513 29423 2302 -27488 -45005 -39406 -17295 12124 36761
737 36761 42291 26639 12 -28090 -44733 -37595 -13545 15262 38677 43863 25403 -2797 -27711
750 -27711 -41922 -35251 -8744 20714 40133 42771 25593 -3850 -29195 -40568 -32263 -6080 22760
763 22760 39950 40972 22607 -8130 -32408 -40146 -30639 -5704 23677 40056 37034 17618 -10819
776 -10819 -34738 -41299 -29476 -3542 24104 39319 35103 15277 -12663 -36160 -41391 -26116 -735
789 -735 25278 39761 34451 12012 -15237 -36121 -39879 -24339 1721 26748 39320 32689 9539
802 9539 -17644 -36768 -39100 -22469 4505 28394 39026 30925 7619 -19073 -36413 -36755 -19431
815 -19431 7705 30548 38967 29948 6373 -20166 -36506 -34282 -15995 10065 31710 39005 27904
828 27904 3246 -22369 -36886 -33957 -14717 11609 32075 36788 24280 4 -24935 -38422
840 -38422 -33121 -12666 13146 32016 35422 21939 -2065 -26356 -37568 -30287 -8778 15708 33623
853 33623 36392 21449 -3555 -26166 -35859 -27416 -5832 18974 35408 35847 19206 -5766 -26915
866 -26915 -35599 -26374 -3526 20184 34423 32909 16152 -9412 -29870 -36716 -25999 -3041 20615
879 20615 33159 30426 12791 -12065 -31400 -35876 -23693 -514 22061 33517 29731 11953 -12759
892 -12759 -31166 -32926 -20508 1838 24936 35616 28656 10134 -13618 -31928 -33110 -17756 4512
905 4512 25620 35197 26489 6443 -15588 -32516 -32998 -16191 5756 24802 34112 25026 4013
918 4013 -17280 -32682 -33482 -14709 8790 25822 33534 25035 1299 -20480 -31023 -29832 -13097
931 -13097 11770 27990 31465 22245 144 -21576 -31604 -28690 -12877 12463 29288 29467 19612
944 19612 -690 -25034 -34466 -26759 -10212 12035 29487 29220 15523 -3190 -24204 -34050 -24982
957 -24982 -6640 13824 30770 31273 14714 -4959 -22654 -32789 -23119 -1622 17808 30953 30894
970 30894 14044 -6845 -22377 -30746 -22244 -421 18912 29413 29516 13891 -10073 -26165 -30701
983 -30701 -21984 -191 21332 29759 25956 9855 -13098 -27352 -29028 -19141 1355 21269 28505
996 28505 23809 9927 -11645 -27888 -29022 -18150 2444 23768 31547 24539 7408 -14899 -29928
1009 -29928 -27872 -13826 5628 24400 29456 19876 3942 -14920 -28869 -26834 -13080 4283 22464
1022 22464 30134 19496 2025 -16359 -30990 -28765 -10459 8817 24256 30559 18554 -2431
1034 -2431 -17897 -27993 -26222 -7279 12133 22948 28635 19675 -2718 -19297 -26140 -25166 -8104
1047 -8104 14808 25613 26819 18667 -3762 -22834 -26048 -21654 -7934 15410 27549 24013 15338
1060 15338 -3137 -24363 -28382 -19244 -5938 15221 30136 24616 10825 -4943 -24029 -29523 -16151
1073 -16151 -1128 13869 28173 25190 8023 -5960 -21059 -29780 -18017 614 14809 27575
1085 27575 27325 7638 -12146 -23144 -28845 -18160 4967 19247 24664 22716 6149 -14401 -22547
1098 -22547 -23868 -17417 2662 19514 24015 21602 8435 -13723 -26150 -24682 -15209 3978 23968
1111 23968 27603 18727 4640 -15394 -27423 -22292 -9784 5660 21873 26330 16633 2526 -13556
1124 -13556 -25669 -23294 -9997 6047 22139 27684 17216 -138 -16410 -27153 -23282 -7644
1136 -7644 9984 22592 25814 14933 -2686 -17137 -25357 -21536 -6429 10559 22407 25059 14479
1149 14479 -3267 -18426 -25362 -21059 -4968 12767 23148 24296 13113 -5346 -19373 -24554 -19570
1162 -19570 -3937 14342 23796 23108 12232 -6271 -21019 -23746 -17867 -2366 16289 24759 20967
1175 20967 10005 -7365 -21764 -23447 -15268 -1416 15649 24710 20063 8350 -7639 -22674 -24934
1188 -24934 -14307 391 16015 26016 20253 4491 -10026 -22616 -24731 -11951 4117 16635
1200 16635 24242 19670 3647 -11012 -20240 -23348 -12291 5567 18341 23703 19757 3705 -13718
1213 -13718 -22097 -22016 -11373 6889 20479 22587 16531 2047 -15147 -22657 -20033 -9939 6544
1226 6544 20285 22125 14603 892 -15269 -23786 -19988 -8171 7653 21120 23116 13119 -943
1239 -943 -15373 -24061 -18850 -4773 9777 21121 22834 12562 -2612 -15994 -22945 -18071 -3787
1252 -3787 11003 21026 22015 11336 -4751 -17364 -22397 -17320 -3290 12117 21128 20415 9783
1265 9783 -5942 -18491 -22407 -16452 -2212 13689 21552 19359 8640 -6825 -19375 -21998 -14454
1278 -14454 53 14429 21934 19250 7517 -8238 -19291 -21177 -12853 1211 15540 22363 17895
1291 17895 5599 -9135 -19797 -21315 -12442 2495 16227 21389 16359 4045 -10702 -20649 -20904
1304 -20904 -11461 3837 16168 21388 15642 2742 -11525 -20466 -20194 -9611 5457 17412 21579
1317 21579 15025 1852 -11988 -20144 -19046 -8036 6636 18141 21403 14239 248 -13141 -20156
1330 -20156 -17872 -7022 7415 18367 20285 12471 -1324 -14326 -20785 -17693 -5944 8126 18422
1343 18422 19344 11065 -2420 -15330 -20740 -16541 -4579 9644 19488 19283 10196 -3402 -15345 -20374
1357 -20374 -14681 -2281 11287 20088 19181 9282 -4597 -15571 -19457 -13571 -838 12076 19737
1370 19737 18311 7589 -6036 -16349 -19551 -13421 18 12928 19383 16743 6110 -7518 -17649
1383 -17649 -19307 -12053 861 13718 19346 16192 5215 -8452 -17925 -18719 -10951 1951 14714
1396 14714 19362 14880 4086 -9019 -18065 -18039 -9641 3132 14789 19242 14172 2424 -10310 -18720
1410 -18720 -18175 -8899 4194 14848 18766 12672 373 -11495 -18879 -17675 -7868 5395 15435
1423 15435 18193 12088 -203 -11853 -18082 -16634 -5806 7418 16726 18533 11888 -815 -12655
1436 -12655 -17759 -14629 -4130 8844 17284 17930 10436 -2029 -13331 -17632 -14117 -3588 9386
1449 9386 17325 16879 9122 -3510 -14689 -18728 -14085 -2986 9985 17410 15828 7506 -4688 -15168
1463 -15168 -18228 -12114 -1577 10099 17717 16036 6577 -4959 -15002 -17908 -10975 566 11365
1476 11365 18350 15809 5267 -6153 -15167 -17649 -10304 1833 11401 17360 15169 4392 -7979
1489 -7979 -15260 -17369 -10453 2578 12572 16308 14124 3297 -10139 -16151 -15587 -9535 3267 13913
1503 13913 16235 12371 3227 -9439 -16765 -14829 -8149 3486 15190 17448 11863 2714 -9972 -17833
1517 -17833 -14519 -5598 4962 15072 17237 9837 374 -9795 -17264 -14846 -4704 5369 13734
1530 13734 17125 9977 -1674 -11018 -17271 -15201 -3751 6960 14423 16638 9106 -3392 -12096 -15790
1544 -15790 -13555 -3227 8519 14457 14973 9308 -3352 -12988 -15459 -12758 -3151 9447 15909 14430
1558 14430 7851 -4278 -14431 -15695 -11139 -2022 9591 16153 13346 5907 -4514 -14181 -15989 -10503
1572 -10503 -925 10017 16482 13771 5128 -5212 -14577 -15970 -8819 803 10811 16692 12848 3745
1586 3745 -5610 -13594 -15481 -8273 1848 10931 16185 13229 2736 -7263 -14528 -15523 -7577 3779
1600 3779 11949 15398 11958 1177 -9021 -13888 -13993 -7505 4370 12344 14268 11439 1885 -10014
1614 -10014 -14641 -13393 -7024 4682 13945 14618 9865 426 -10783 -15232 -11891 -4877 5027 14194
1628 14194 14211 8182 -157 -9857 -15515 -11606 -3819 5349 14180 14950 7913 -1632 -10461 -15913 -11819
1643 -11819 -1937 6958 13753 14812 6650 -3277 -10545 -14749 -11372 -1277 7891 12977 13887 7073 -4187
1658 -4187 -11759 -14286 -11002 -1223 9218 13553 12808 6058 -4957 -12557 -13624 -9361 -559 9559
1672 9559 14295 11773 4883 -4740 -12891 -13766 -8345 240 9962 14548 11469 3737 -5430 -13254 -13510
1687 -13510 -7417 1391 10172 14367 10679 2347 -6702 -13427 -13799 -7124 2403 10310 13941 10095 1193
1702 1193 -7846 -13446 -13248 -6124 3544 11115 13558 9638 651 -7956 -12846 -12058 -5193 4259 11572
1717 11572 13608 9341 426 -8333 -13119 -11640 -4089 5400 12038 13220 8332 -887 -9440 -13002 -11070
1732 -11070 -3824 5659 12376 12277 7319 -1658 -10016 -13481 -10523 -2716 6168 12796 12731 6156 -2035 -10257
1748 -10257 -13367 -9398 -1389 7149 12926 12484 5691 -2894 -10225 -13060 -8990 4 7534 13057 12161
1763 12161 5023 -4155 -11003 -12948 -8547 316 8243 12516 11249 3926 -5239 -11485 -12579 -8088 569
1778 569 9124 12305 10477 3213 -6037 -12012 -11874 -6922 1626 9904 12749 9581 2426 -6366 -12024
1793 -12024 -11401 -5822 2363 10056 12806 8962 1433 -6894 -11810 -11421 -5377 2992 10057 12221 8266
1808 8266 380 -7765 -12407 -11356 -4832 3525 10122 11935 7587 -210 -8075 -12280 -10768 -3924 4670
1823 4670 10953 12111 7323 -615 -8475 -11933 -9659 -2859 5643 11326 11799 6501 -1514 -8890 -12153
1838 -12153 -9475 -2268 5659 11383 10962 5513 -2574 -9452 -12199 -9084 -1595 6389 11427 10490 4804
1853 4804 -3236 -9718 -11738 -8188 -822 7208 11616 10267 4180 -3593 -10082 -11442 -7126 99 8006
1868 8006 11635 9960 3591 -4729 -10289 -11159 -6739 941 8091 11620 9269 2713 -5210 -10607 -11046
1883 -11046 -6122 2030 8542 11387 8885 2344 -5901 -10757 -10501 -5641 2612 8849 11364 8408 1381
1898 1381 -6345 -10445 -9976 -4662 3485 9800 11101 7600 937 -6774 -10893 -9396 -4042 3568 9898
1913 9898 11088 6657 17 -6962 -11444 -9438 -2853 3854 9596 10901 5824 -988 -7691 -10889 -9000
1928 -9000 -2103 4767 9763 10654 5657 -1793 -7544 -10442 -8466 -1646 5732 9975 10052 5224 -2946 -8597
1944 -8597 -10284 -8128 -1226 6797 9989 9055 4421 -3215 -9113 -10196 -7077 -1209 6444 10598 8635
1959 8635 3392 -3203 -9349 -10854 -5993 206 7056 10717 8703 2817 -3723 -8832 -10108 -5400 1078
1974 1078 7120 10628 8604 2125 -4609 -9013 -9972 -5417 2202 7862 9840 8262 1408 -5723 -9543
1989 -9543 -9438 -5169 2268 8556 9693 7175 1052 -5922 -10100 -9084 -4282 2903 8541 9681 6662
2004 6662 519 -6139 -9810 -8788 -3229 3419 8635 10024 6144 -391 -6350 -9554 -8427 -2880 4074
2019 4074 8581 9459 5680 -852 -7428 -9809 -7553 -2358 4682 9196 8669 4686 -1433 -7780 -9881
2034 -9881 -6921 -1588 4913 9376 8834 3789 -2041 -7404 -9985 -6677 -419 5306 9848 9219 3072
2049 3072 -3196 -7588 -9720 -6401 467 5839 8774 8624 3358 -4072 -8014 -8791 -6461 519 7018
2064 7018 8915 7664 3091 -4415 -8892 -8548 -5396 795 7449 9269 6869 2521 -4181 -9198 -8201
2079 -8201 -4217 986 7150 9926 6422 1024 -4171 -9347 -9079 -3301 2094 7100 9713 6208 -353
2094 -353 -4886 -8671 -8874 -3229 3326 6903 9087 6285 -636 -6124 -8385 -8231 -3051 4087 7967 8203
2110 8203 5612 -522 -6913 -8129 -7040 -2790 4213 8623 8099 5239 -577 -6900 -8867 -6862 -1804
2125 -1804 4069 8678 8553 3865 -1386 -6907 -8932 -6086 -766 4506 8551 8071 3407 -2289 -7050
2140 -7050 -8679 -6055 -389 4893 8484 8195 3140 -3184 -7446 -8633 -5767 319 5720 8398 7234
2155 7234 2537 -3367 -7376 -8212 -4954 624 6240 8083 6630 2128 -3686 -7430 -8235 -4716 1132
2170 1132 6314 8637 6650 1380 -4218 -7524 -7727 -4017 2085 6591 8367 6032 1297 -4896 -7656
2185 -7656 -7156 -3416 2201 7298 8087 5712 766 -5055 -7925 -6966 -3198 2332 7202 8177 4863 -228
2201 -228 -5347 -8552 -7023 -2464 2992 7367 8489 4752 -933 -5691 -8422 -6993 -1673 3629 7346
2216 7346 7874 4470 -1553 -6051 -7551 -6252 -1423 4312 7448 7202 3945 -1780 -6362 -7846 -5736
2231 -5736 -1251 4675 7630 6704 3628 -2215 -6806 -7538 -5104 -627 5121 7918 6425 2502 -2364
2246 -2364 -6685 -7734 -4604 64 5197 7935 6636 2136 -3185 -6815 -7436 -4277 860 5581 7805
2261 7805 6343 1614 -3422 -7144 -7338 -4016 1454 5508 7286 5727 1040 -3922 -6928 -7287 -3400
2276 -3400 1700 6135 7576 5393 988 -4489 -7299 -6674 -3020 1996 6465 7354 4990 367 -4654
2291 -4654 -7109 -6404 -2355 2633 6677 7266 4679 -290 -5106 -7161 -6132 -1994 3256 6537 7175 3869
2307 3869 -941 -5216 -7517 -5672 -1644 3148 6648 6926 3635 -1526 -5389 -7219 -5410 -1211 3943
2322 3943 6857 6722 3267 -1640 -5669 -6880 -5012 -496 4344 6975 6234 3040 -2067 -6216 -6843 -4597
2338 -4597 -28 4591 6895 5980 2335 -2704 -6455 -6769 -4276 319 4575 6775 5540 1684 -3113
2353 -3113 -6137 -6836 -3847 767 5008 7110 5038 1106 -3531 -6602 -6488 -3272 1509 5238 7169
2368 7169 5308 853 -3563 -6707 -6400 -2856 1965 5718 6866 4934 74 -4047 -6688 -6050 -2455
2383 -2455 2181 5700 6623 4383 -187 -4625 -6626 -5905 -2080 2635 6243 6438 3982 -271 -4806 -6507
2399 -6507 -5489 -1706 2799 6333 6531 3513 -809 -4829 -6545 -4890 -863 3269 6294 6295 3057 -1308
2415 -1308 -5330 -6778 -4908 -677 3219 6284 5766 2692 -1818 -5213 -6342 -4336 -334 3995 6248
2430 6248 5712 2536 -2343 -5512 -6353 -3890 170 4669 6442 5643 1950 -2220 -5758 -6229 -3580 883
2446 883 4498 6382 5405 1496 -3107 -5664 -6182 -3309 1113 4713 6234 4828 931 -3350 -6087 -6025
2462 -6025 -3201 1318 5172 6123 4746 896 -3743 -6188 -5617 -2499 1940 5335 6479 3876 143
2477 143 -3598 -6124 -5169 -1968 1958 5355 6460 3818 -500 -4026 -6229 -5570 -1805 2629 5211 5944
2493 5944 3346 -1103 -4383 -6060 -5286 -1487 2909 5365 5878 3541 -1049 -4749 -5996 -4935 -1096
2508 -1096 3437 5536 5416 3392 -1141 -5143 -5717 -4215 -1084 3544 6135 4963 2232 -1331 -5471
2523 -5471 -5927 -3653 -577 3359 6047 5236 1793 -1928 -5125 -6400 -3640 206 3594 6060 5128 1390
2539 1390 -2311 -5111 -5845 -3299 778 4357 5545 4826 1171 -2903 -5272 -5556 -3151 1232 4549 5791
2555 5791 4450 635 -3455 -5444 -4982 -2521 1538 4828 5677 3895 622 -3523 -5686 -5102 -2210 1762
2571 1762 5001 5826 3759 64 -3772 -5746 -4703 -1898 2100 4929 5300 3555 -254 -3899 -5629
2586 -5629 -4338 -1489 2398 5178 5459 3028 -571 -3978 -5451 -4327 -1289 2718 5196 5221 2710 -950
2602 -950 -4308 -5894 -4069 -681 2885 4756 5015 2393 -1491 -4321 -5152 -4034 -302 3357 5111 5128
2618 5128 2250 -1807 -4626 -4999 -3652 232 3914 5341 4542 2108 -1974 -4741 -4929 -3091 154 3974
2634 3974 5368 4259 1714 -2327 -5139 -5306 -2533 883 3910 5455 3724 752 -2465 -5138 -5083 -2244
2650 -2244 1068 3875 5466 4014 419 -2786 -4788 -5286 -1972 1846 4161 5068 3789 63 -3445
2665 -3445 -5011 -4297 -2012 1891 4502 4969 3462 3 -3526 -5325 -4250 -1829 2051 4810 4735 3026
2681 3026 -104 -3694 -5368 -3883 -1292 2139 5062 4995 2609 -1010 -3537 -5558 -3796 -634 2379
2696 2379 4686 4944 2216 -1102 -4182 -4992 -3664 -553 2997 4847 4880 1752 -1569 -4205 -4664 -3491
2712 -3491 -178 3196 4502 4114 1723 -1884 -4288 -4721 -3427 138 3342 5142 4092 1514 -2121
2727 -2121 -4403 -4792 -2841 620 3785 4888 3906 1115 -2579 -4580 -4644 -2313 816 3855 4710 3759
2743 3759 753 -2832 -4981 -4323 -2404 972 3997 4781 3327 635 -2976 -4626 -4282 -1650 1608 4194
2759 4194 4916 3357 227 -3126 -4613 -4229 -1232 1508 4373 4779 3052 -348 -3157 -4668 -3708 -1324
2775 -1324 2048 3976 4601 2644 -791 -3517 -4464 -3744 -916 2253 4048 4309 2346 -907 -3667 -4811
2791 -4811 -3396 -815 2266 4671 4018 1978 -1386 -3868 -4529 -2946 -312 2746 4371 4311 1992 -1581
2807 -1581 -3759 -4636 -2826 15 2964 4433 3946 1339 -1452 -4176 -4604 -2827 100 3010 4403 3600
2823 3600 1246 -2125 -4356 -4074 -2428 475 3404 4344 3669 926 -2062 -4197 -4162 -2138 912 3673
2839 3673 4469 3282 591 -2692 -3940 -4018 -1962 1050 3793 4266 3025 284 -2844 -4616 -3756 -1395
2855 -1395 1237 3634 4347 2911 146 -3100 -4386 -3642 -1099 1435 3917 4295 2319 -35 -2996 -4485
2871 -4485 -3483 -936 2110 3963 4011 2109 -629 -3297 -3992 -3147 -890 2654 4026 4172 2142 -1017
2887 -1017 -3516 -4607 -3097 -301 2323 4150 3912 1714 -1226 -3842 -4247 -3016 -155 2779 3987
2902 3987 3909 1567 -1490 -3604 -4030 -2586 -93 2967 4052 3594 1192 -1722 -3736 -3682 -2008 276
2918 276 3114 4172 3482 770 -1806 -3923 -3966 -2198 792 2813 4239 2933 249 -2105 -4148 -3634
2934 -3634 -1905 1162 3263 4137 3033 465 -2264 -4022 -3528 -1693 1239 3575 3850 2888 269 -2844
2950 -2844 -3871 -3589 -1362 1366 3868 4220 2570 -165 -2708 -4142 -3345 -1282 1916 3775 3548 1871
2966 1871 -527 -3022 -3780 -3289 -1100 1803 3689 3878 1681 -636 -3111 -4355 -3071 -268 2533 4031
2982 4031 3392 1559 -1164 -3083 -3890 -2575 -344 2281 3881 3495 1662 -1688 -3363 -3623 -2495 37
2998 37 2657 3760 3261 1186 -1443 -3522 -3702 -2518 103 2677 3758 3072 841 -1955 -3419 -3732
3014 -3732 -2056 432 2918 3960 3107 550 -1973 -3636 -3651 -1797 806 3130 3543 2917 446 -2459
3030 -2459 -3815 -3368 -1727 907 3134 3950 2564 69 -2372 -3628 -3129 -1201 1096 3135 3551 2228
3046 2228 -171 -2297 -3810 -3347 -897 1506 3316 3717 2109 -450 -2308 -3473 -3148 -598 1873 3273
3062 3273 3600 1776 -753 -3271 -3616 -2641 -731 2116 3402 3136 2064 -830 -3339 -3530 -2659 -154
3078 -154 2274 3552 3019 1508 -859 -3460 -3574 -2331 -47 2514 3761 2691 1179 -994 -3189 -3754
3094 -3754 -2063 423 2242 3612 3123 854 -1458 -3445 -3674 -1771 914 2759 3717 2988 294 -1839
3110 -1839 -3242 -3476 -2140 614 2920 3434 2645 344 -2168 -3420 -3213 -1609 841 3232 3465 2511
3126 2511 417 -2030 -3386 -3054 -1384 1070 3069 3425 2135 -38 -2267 -3431 -2835 -786 951 3181
3142 3181 3585 2214 -367 -2469 -3520 -2907 -1004 1383 3377 3283 1950 -656 -2628 -3511 -2382 -858
3158 -858 1596 3554 3199 1554 -1075 -2730 -3206 -2555 -420 2109 3467 2971 1534 -930 -2636 -3240
3174 -3240 -2203 -95 2006 3339 3149 1343 -1506 -2981 -3368 -2268 -70 2276 3242 2804 1100 -1588
3190 -1588 -3035 -3272 -1721 500 2552 3764 2715 739 -1644 -3201 -2894 -1692 342 2727 3367 2452
3206 2452 221 -1691 -3285 -3044 -1470 805 2438 3409 2361 197 -1793 -3214 -3197 -1368 1077 2443
3222 2443 3125 1993 -73 -2146 -3307 -3084 -1052 1280 3008 3207 1966 53 -2215 -3181 -2538 -1040
3238 -1040 1428 3438 2972 1857 -257 -2407 -3292 -2266 -661 1687 3126 2938 1630 -270 -2469 -3297
3254 -3297 -2439 -279 1708 3261 3054 1270 -948 -2461 -3306 -2336 58 1729 3207 2900 1016 -1068
3270 -1068 -2964 -3150 -1989 -117 1948 3071 2994 1219 -1421 -2786 -3091 -2044 381 2308 3459 2435
3286 2435 815 -1413 -3012 -2992 -1730 445 2142 3403 2446 642 -1693 -2890 -2915 -1334 666 2461
3302 2461 3302 2498 421 -1751 -3014 -2881 -1280 918 2633 3407 1977 161 -2115 -2946 -2741 -933
3318 -933 1175 2646 3136 1791 41 -2114 -3009 -2535 -875 1123 2498 2901 1748 -187 -2144 -2928
3334 -2928 -2374 -487 1401 2800 2636 1765 -628 -2482 -3144 -2109 -207 1784 2814 2908 1330 -941
3350 -941 -2209 -2891 -2119 -334 1618 2940 2815 1273 -864 -2686 -3091 -1991 180 2116 2810 2389 901
3367 901 -931 -2633 -3026 -1923 114 2269 3153 2327 661 -1010 -2902 -2798 -1673 394 2282 3101
3383 3101 2530 495 -1345 -2726 -2771 -1392 560 2345 2962 2154 474 -1516 -2882 -2872 -1556 823 2277
3400 2277 3004 2104 -99 -2012 -2982 -2321 -835 1005 2551 2823 1776 -51 -1762 -3075 -2283 -965
3416 -965 1036 2634 3213 1625 -183 -1977 -3031 -2266 -913 1343 2749 2605 1537 -329 -2178 -3132
3432 -3132 -2328 -405 1364 2849 2593 1141 -477 -2224 -2890 -2354 -243 1555 2898 2447 1164 -1112
3448 -1112 -2373 -2682 -2104 -16 1955 2863 2288 1147 -847 -2535 -2821 -1936 -111 1959 2819 2488 838
3465 838 -1249 -2474 -2698 -1544 3 2061 3066 2132 530 -1374 -2589 -2543 -1597 448 2107 2854 1960
3482 1960 582 -1295 -2682 -2680 -1225 702 2279 2913 1755 154 -1474 -2774 -2258 -832 757 1993
3498 1993 2743 1930 -175 -1705 -2572 -2303 -914 1058 2297 2354 1525 24 -1991 -2691 -2429 -711 990
3515 990 2603 2359 1428 -278 -1777 -2587 -2336 -740 1270 2704 2361 1116 -370 -2089 -2857 -1954 -471
3532 -471 1409 2494 2293 981 -542 -2079 -2811 -1971 -52 1747 2372 2507 1043 -953 -2301 -2693 -1875
3549 -1875 241 1891 2565 2430 1024 -1088 -2118 -2572 -1752 327 1903 2705 2147 626 -1105 -2599
3565 -2599 -2644 -1419 568 2214 2686 1832 349 -1369 -2501 -2194 -1117 699 2026 2228 2016 606 -1696
3582 -1696 -2370 -2200 -1081 730 2162 2640 1836 158 -1622 -2558 -2099 -681 828 2197 2479 1773 267
3599 267 -1857 -2528 -2551 -645 989 2303 2663 1370 -257 -1776 -2414 -2005 -566 990 2217 2284 1300
3616 1300 -509 -1535 -2341 -1968 -458 1417 2119 2562 1468 -562 -2045 -2584 -1853 -324 1495 2481 2262
3633 2262 891 -637 -2039 -2371 -1740 56 1491 2530 2186 864 -1103 -2209 -2478 -1286 89 1716
3649 1716 2344 1872 384 -792 -2098 -2554 -1357 445 1678 2430 1963 367 -1334 -2288 -2197 -1528 762
3666 762 2035 2415 1833 654 -1290 -2440 -2155 -1267 549 2000 2451 1782 78 -1456 -2331 -2321 -1095
3683 -1095 543 2130 2382 1389 50 -1630 -2323 -2046 -721 1025 2054 2312 1488 -265 -1595 -2279 -1950
3700 -1950 -581 1023 2350 2301 1303 -488 -1720 -2608 -1882 -352 1108 2256 2216 1076 -374 -1938 -2539
3717 -2539 -1514 -241 1396 2368 2227 921 -729 -2106 -2283 -1756 -333 1561 2261 2192 877 -820 -1795
3734 -1795 -2257 -1657 -55 1685 2549 1970 404 -1144 -2020 -2019 -1402 316 1573 2120 1777 694 -998 -2367
3752 -2367 -2028 -1585 467 1788 2400 1513 457 -1300 -2339 -2167 -1104 500 1885 2455 1571 399 -1159
3769 -1159 -2209 -2013 -1081 544 2117 2377 1903 -221 -1564 -2163 -2035 -859 782 1851 2050 1474 34
3786 34 -1614 -2197 -1741 -582 876 1993 2481 1346 -253 -1968 -2562 -1662 -613 1091 2446 2256 1226
3803 1226 -554 -1931 -2410 -1704 -172 1112 2318 2051 957 -456 -1612 -2418 -1568 -301 1209 2240
3819 2240 2119 621 -750 -1647 -1930 -1178 -100 1529 2121 1866 775 -843 -2068 -2123 -1140 153 1477
3836 1477 2396 1560 570 -798 -2018 -2074 -1382 233 1572 2018 1605 385 -1089 -1413 -1950 -981 820 1799
3854 1799 2139 1582 487 -1128 -1748 -2074 -617 546 1969 2206 1510 332 -1155 -2105 -1762 -1051 895
3871 895 1818 2219 1303 -188 -1437 -2406 -1822 -865 574 1980 2221 1394 -335 -1671 -2052 -1541 -233 928
3889 928 2034 2016 1143 -363 -1432 -2061 -1692 -535 965 2018 2114 1110 -530 -1651 -2169 -1588 -108
3906 -108 1219 1897 1744 914 -547 -1910 -2003 -1447 25 1505 1943 1850 684 -787 -1704 -1954 -1354 130
3924 130 1454 2081 1670 672 -826 -1923 -2021 -1193 212 1506 2006 1485 222 -1143 -2036 -1853 -924 714
3942 714 1563 2301 1476 352 -1247 -1909 -1927 -832 355 1739 1988 1201 241 -1251 -1803 -1675 -904 780
3960 780 1594 1822 1576 -98 -1256 -1945 -1551 -647 764 2070 1861 1121 -252 -1378 -1984 -1588 -393 923
3978 923 1824 1627 1049 -448 -1599 -1957 -1649 -302 892 1874 1782 988 -433 -1113 -2109 -1258 -147 1191
3996 1191 1736 1550 1094 -489 -1576 -1845 -1368 -33 1363 1965 1779 570 -709 -1819 -1770 -1296 279
4013 279 1279 2110 1630 288 -930 -2044 -1825 -1100 340 1275 2139 1651 515 -819 -1826 -1827 -1094 254
4031 254 1551 1878 1369 260 -1037 -1926 -1960 -997 434 1555 2057 1137 -86 -1210 -2005 -1781 -670 493
4049 493 1678 1771 1238 -39 -1192 -1842 -1745 -461 765 1952 1672 1125 -265 -1341 -1951 -1782 -363 866
4067 866 1768 1880 1016 2 -1452 -1731 -1312 -601 856 1808 1553 866 -420 -1514 -1709 -1368 -298 1086
4085 1086 1838 1674 750 -255 -1525 -1831 -1168 -153 945 1966 1573 532 -537 -1474 -1967 -1108 182
4102 182 1116 1808 1548 517 -686 -1735 -1900 -1073 362 1367 1787 1630 587 -681 -1592 -1872 -905 132
4120 132 1449 2028 1258 290 -891 -1965 -1399 -1042 358 1681 1698 1370 144 -808 -1850 -1427 -844 517
4138 517 1589 1676 1301 -92 -1067 -1831 -1503 -403 645 1614 1735 1306 8 -1284 -1927 -1155 -256 596
4156 596 1609 1846 1001 -406 -1089 -1840 -1396 -458 914 1878 1421 811 -326 -1271 -1799 -1403 -316 957
4174 957 1821 1754 640 -642 -1211 -1746 -1256 -84 1056 1576 1456 796 -657 -1301 -1599 -1254 273 1209
4192 1209 1716 1464 663 -440 -1613 -1674 -1162 298 1213 1807 1455 343 -551 -1615 -1494 -944 121 1319
4210 1319 1883 1414 399 -930 -1897 -1437 -736 265 1336 1867 1397 -110 -1238 -1534 -1444 -532 305 1459
4228 1459 1541 1318 -50 -1047 -1521 -1795 -450 590 1459 1768 1130 -333 -1142 -1840 -1443 -677 642 1381
4246 1381 1635 818 -263 -1253 -1884 -1118 -287 966 1694 1631 740 -430 -1274 -1552 -1388 -409 983 1539 1499
4265 1499 826 -571 -1511 -1755 -1196 -37 927 1658 1657 721 -313 -1160 -1588 -808 -104 1257 1700 1401 627
4284 627 -828 -1595 -1825 -1025 104 1305 1745 1256 411 -757 -1654 -1703 -810 405 1272 1900 1224 284 -770
4303 -770 -1642 -1584 -535 361 1363 1634 1404 197 -1079 -1847 -1553 -687 523 1504 1674 1174 -3 -1250
4321 -1250 -1675 -1118 -562 785 1594 1301 1078 -102 -1453 -1560 -1672 -173 582 1581 1551 1196 -224 -1070
4339 -1070 -1468 -1149 -440 919 1959 1676 674 -507 -1630 -1799 -1061 -321 1021 1424 1580 934 -329
4356 -329 -1490 -1845 -1023 -11 956 1520 1454 521 -330 -1398 -1688 -856 -164 1091 1582 1405 203 -806
4374 -806 -1469 -1858 -989 244 1032 1489 1193 234 -1100 -1611 -1537 -805 179 1097 1795 1162 214 -977 -1679
4393 -1679 -1582 -863 188 1343 1711 885 423 -1002 -1311 -1446 -592 405 1265 1389 978 62 -785 -1490 -1355
4412 -1355 -632 467 1199 1672 806 -162 -1183 -1641 -1438 -243 748 1351 1572 1093 -363 -1102 -1685 -1340
4430 -1340 68 721 1544 1613 590 -443 -1086 -1746 -1012 -140 870 1304 1482 810 -116 -1405 -1400 -880 -211
4449 -211 862 1621 1217 498 -492 -1331 -1558 -983 100 1221 1208 1308 353 -512 -1675 -1791 -801 -275 960
4468 960 1534 1334 200 -648 -1666 -1462 -1146 222 1090 1331 994 395 -654 -1531 -1469 -860 346 1081 1452
4487 1452 877 156 -810 -1329 -1685 -700 505 1253 1637 967 25 -1158 -1519 -1081 -589 491 1376 1755 928
4506 928 -140 -1161 -1561 -1295 -242 604 1228 1367 954 -248 -887 -1480 -1420 -566 706 1351 1543 937 124
4525 124 -1232 -1686 -993 -352 666 1515 1316 853 -306 -1000 -1526 -1003 -147 924 1488 1495 348 -573 -1328
4544 -1328 -1554 -956 -141 700 1581 1281 540 -693 -1373 -1302 -1053 138 1100 1498 895 401 -773 -1521 -1227
4563 -1227 -740 347 909 1342 1189 374 -853 -1576 -1291 -561 437 1061 1318 1063 -63 -879 -1585 -1443 -495
4582 -495 175 1271 1369 1060 288 -808 -1485 -1307 -420 769 1376 1205 1036 37 -908 -1237 -1416 -302 339
4601 339 1268 1261 799 103 -1216 -1534 -1038 -157 684 1549 1360 945 109 -1249 -1714 -1201 -121 738 1369 1482
4621 1482 653 -349 -1353 -1286 -959 41 953 1315 1241 690 -340 -975 -1432 -1094 -14 953 1425 1062 449
4640 449 -661 -1222 -1152 -891 25 847 1566 1397 416 -415 -1509 -1373 -625 161 1141 1390 1122 468 -764
4659 -764 -1329 -1276 -752 250 1325 1545 1298 263 -667 -1127 -1313 -555 280 1137 1673 690 136 -947 -1218
4678 -1218 -1054 -743 555 1002 1502 1164 23 -927 -1429 -1166 -646 392 1238 1366 401 -309 -1001 -1539 -873
4697 -873 -528 680 1544 1496 746 -276 -947 -1579 -904 -154 805 1096 1238 613 -297 -1202 -1480 -1108 -257 700
4717 700 1265 1557 463 -211 -1146 -1433 -813 5 999 1340 1409 445 -371 -1133 -1359 -898 167 647 1420 1271
4737 1271 431 -573 -1187 -1610 -854 87 960 1250 1221 395 -511 -1276 -1216 -652 137 1013 1363 1111 364 -753
4757 -753 -1435 -1078 -429 217 1107 1526 966 492 -921 -1330 -1348 -425 247 1262 1379 632 -97 -847 -1651 -1297
4777 -1297 -582 645 1459 1194 791 77 -805 -1502 -1071 3 658 1319 1264 838 -115 -1076 -1394 -787 -243
4796 -243 815 1368 1233 718 -282 -1194 -1221 -1255 27 893 1362 1272 510 -680 -1276 -1268 -1112 -68 837 1556
4816 1556 1271 555 -416 -1074 -1191 -1102 -21 968 1267 1158 249 -492 -1305 -1268 -822 121 953 1624 1123 267
4836 267 -844 -1322 -1324 -979 200 705 1611 990 303 -596 -1167 -1211 -643 416 1229 1179 1245 313 -1233 -1551
4856 -1551 -1191 -776 261 1382 1466 930 32 -894 -1671 -1034 -463 429 1277 1254 847 -58 -930 -1484 -1234 -236
4876 -236 660 1328 1136 804 -86 -1263 -1400 -999 -298 783 1456 1229 972 -241 -930 -1408 -1140 -284 774
4895 774 1201 1373 584 -96 -1125 -1278 -987 -98 957 1159 1133 558 -363 -1352 -1352 -915 -147 832 1479 1053
4915 1053 840 -434 -1282 -1328 -938 111 1070 1274 1083 350 -758 -1036 -1282 -722 237 881 1496 1116 520
4934 520 -879 -1285 -1119 -534 137 996 1333 894 45 -788 -1264 -1241 -480 392 995 1376 892 239 -708 -1527
4954 -1527 -1210 -402 357 1331 1409 959 -25 -624 -1313 -900 -493 621 1109 1101 846 15 -976 -1354 -1147 -542
4974 -542 589 1296 1363 780 -131 -956 -1308 -1067 -400 646 1340 1280 751 16 -850 -1464 -1349 -171 953
4993 953 1249 1337 404 -406 -1231 -1359 -821 -95 837 1367 1214 477 -310 -983 -1308 -640 -436 908 1062 962
5013 962 293 -412 -1407 -1383 -824 465 826 1285 1284 275 -577 -1325 -1461 -908 245 1137 1307 1100 -222 -666
5033 -666 -1298 -1484 -751 407 1250 1259 1081 246 -927 -1158 -1026 -228 413 1260 1248 952 -8 -626 -1423 -897
5053 -897 -578 437 1107 1371 836 25 -962 -1086 -823 -115 646 974 1408 839 -186 -1127 -1220 -1241 -366 563
5073 563 1027 1274 956 78 -1212 -1298 -953 -188 708 1635 1111 768 -62 -1082 -1370 -896 -31 555 1199 1004
5093 1004 556 -360 -1088 -1355 -667 -292 753 1156 1097 364 -674 -1495 -1243 -636 122 894 1398 1030 473
5112 473 -752 -1113 -1263 -856 35 1150 1303 1358 394 -404 -1098 -1059 -528 96 1136 1215 768 144 -890 -1548
5132 -1548 -1213 -581 386 993 1488 1031 46 -676 -1449 -1078 -345 470 804 1374 889 -184 -878 -1298 -1141
5151 -1141 -487 612 1066 1301 937 -211 -829 -1286 -725 -290 213 1113 1235 710 -259 -857 -1324 -1042 -388
5170 -388 348 969 1150 623 -323 -1295 -1387 -1117 -118 513 1187 1346 495 -253 -1011 -1185 -985 -123 993 1060
5190 1060 1116 670 -272 -1207 -1327 -962 -116 609 1317 1031 419 -516 -1223 -1140 -670 51 960 1353 914 411
5210 411 -621 -1353 -1332 -642 175 685 1141 1082 -10 -737 -1050 -857 -457 234 1017 1195 1022 110 -618 -1072
5230 -1072 -1302 -409 176 884 1068 892 -6 -765 -1002 -1037 -525 226 1137 1366 838 70 -983 -1415 -888 -291
5250 -291 516 1047 1290 884 -178 -828 -1627 -1169 -265 502 1161 1111 849 -227 -742 -1326 -953 -390 503 1286
5270 1286 1158 594 -340 -963 -1407 -659 38 915 1449 1373 463 -297 -1212 -1096 -650 -283 542 1509 892 475
5290 475 -480 -960 -1189 -805 -18 1082 1228 927 424 -549 -1169 -1155 -736 73 849 1100 932 437 -429 -1180
5310 -1180 -1223 -775 269 813 1360 751 128 -609 -1517 -1268 -582 104 873 1384 938 -4 -862 -1061 -976 -473
5330 -473 398 1200 1077 1003 -85 -881 -1361 -1063 -504 578 832 935 999 113 -665 -1196 -935 -422 494 1115
5350 1115 1166 548 -247 -765 -1069 -1030 -89 456 965 1189 322 -182 -844 -1282 -853 -74 561 1310 954 574
5370 574 -347 -1313 -1383 -972 -324 808 1456 1001 700 -680 -1057 -1043 -800 121 862 1287 1148 372 -754 -1166
5390 -1166 -1419 -634 49 926 993 745 228 -540 -889 -1076 -625 310 856 1086 996 231 -848 -1239 -885 -395
5410 -395 333 1138 1407 738 -20 -442 -1259 -1151 -245 311 1052 1029 660 116 -714 -1076 -1196 -474 554 971
5430 971 1063 855 94 -835 -1273 -932 -319 455 1108 1407 799 -244 -866 -1309 -806 -316 667 1153 1253 793
5450 793 -212 -894 -1277 -850 -205 738 1254 1118 288 -412 -883 -1403 -953 -269 831 1196 1072 505 -149
5469 -149 -1151 -1036 -675 -112 654 1189 1218 172 -566 -1300 -1280 -1007 109 530 1092 974 123 -463 -1270 -1110
5489 -1110 -560 59 748 1064 1051 388 -589 -995 -1121 -682 119 1012 1205 760 165 -508 -1278 -985 -501 387
5509 387 1044 1148 902 91 -647 -1036 -985 -395 359 1276 1244 980 176 -959 -1269 -1214 -504 248 961 1108 495
5530 495 48 -891 -1212 -865 -465 852 976 997 565 -142 -865 -1360 -1011 -170 515 1012 1016 584 -454 -929
5550 -929 -1179 -964 216 791 1005 1149 614 -270 -1220 -982 -902 -309 320 751 856 410 -450 -1094 -1222 -795
5570 -795 -90 668 1210 1156 579 -328 -946 -1198 -523 117 816 1158 835 445 -523 -1147 -943 -562 376 685
5590 685 1130 631 4 -468 -929 -1113 -743 341 868 1281 664 -9 -744 -1335 -1203 -514 151 1136 1183 318
5610 318 147 -688 -1132 -849 -365 256 842 1225 792 97 -726 -1468 -1013 -181 346 1004 1003 593 -144 -908 -1202
5631 -1202 -1058 -425 659 996 1258 858 -407 -817 -1458 -927 -319 598 1205 748 613 -300 -904 -1058 -782
5650 -782 -229 695 1158 795 464 -204 -880 -1285 -1056 69 703 1097 1139 503 -474 -737 -1207 -567 90 584
5670 584 1106 882 231 -502 -1084 -997 -850 7 773 1127 758 211 -701 -1107 -1188 -757 119 867 1050 696 224
5691 224 -805 -1255 -1042 -428 406 1347 1345 781 205 -406 -1043 -1036 -426 281 904 1117 626 26 -444 -1233 -942
5712 -942 -483 289 807 1289 735 -245 -758 -1123 -912 -420 569 978 1198 705 -252 -794 -1200 -888 -173 743
5732 743 1043 1120 668 -229 -705 -1323 -929 -66 488 1230 992 286 -427 -822 -1161 -697 -64 602 1145 1059 379
5753 379 -250 -732 -1225 -658 -149 463 789 1133 346 -555 -1101 -939 -429 -279 772 1311 820 249 -387 -1053
5773 -1053 -1061 -554 64 784 1235 1019 300 -570 -1076 -1252 -536 246 958 1024 700 49 -574 -820 -921 -636 176
5794 176 943 1360 816 259 -774 -730 -968 -261 216 939 1162 451 32 -438 -1092 -769 -196 390 828 922
5814 922 592 -135 -695 -944 -620 -331 413 1341 1333 691 43 -783 -1120 -589 -320 513 1195 1082 318 -161 -813
5835 -813 -1130 -758 -154 716 1261 1182 560 -374 -1087 -1208 -867 60 680 820 857 344 -405 -953 -1209 -963 60
5856 60 949 1087 1036 80 -684 -779 -1037 -662 186 782 1172 817 185 -555 -1190 -953 -760 153 643 863 1071
5877 1071 -45 -502 -1238 -1058 -500 595 1006 1128 962 -269 -667 -1280 -978 -426 347 668 1176 589 138
5896 138 -828 -1194 -885 -210 475 635 1219 901 -150 -839 -1026 -671 -319 543 709 754 521 -154 -870 -1006
5916 -1006 -815 -104 480 1078 893 613 -34 -838 -1034 -863 -364 764 1235 1066 437 -157 -779 -1307 -662
5935 -662 -88 425 990 707 477 -331 -880 -1292 -541 -33 554 1146 713 296 -225 -983 -1153 -464 7 623
5955 623 1269 767 422 -416 -769 -1041 -648 60 672 1013 763 214 -523 -911 -1082 -688 -53 961 1177 908
5975 908 353 -479 -866 -944 -276 316 889 1142 738 203 -644 -1135 -984 -501 229 1073 1051 589 -64 -559 -573
5996 -573 -808 -566 267 1100 1080 528 -247 -735 -978 -758 -412 518 803 985 402 -46 -848 -1037 -818 13
6016 13 651 1025 1216 353 -82 -700 -1032 -720 32 634 1219 763 358 -283 -990 -1200 -679 -69 814 1034
6036 1034 1028 261 -309 -825 -1112 -589 336 761 816 644 264 -413 -785 -931 -933 -125 434 1083 1028 365 -398 -875
6058 -875 -921 -590 -72 610 975 496 164 -551 -1053 -833 -352 569 737 975 807 358 -448 -1254 -988 -569
6078 -569 295 878 1135 625 -81 -636 -1114 -881 -166 418 723 928 814 10 -716 -1239 -544 -327 343 777
6098 777 876 670 13 -865 -862 -559 -154 183 897 1007 586 -15 -723 -1144 -774 -266 520 1024 729 366 -446
6119 -446 -636 -956 -771 -271 381 802 1041 422 -360 -769 -1088 -517 85 824 1299 1068 495 -196 -584 -640
6139 -640 -573 181 777 914 738 372 -374 -858 -877 -523 295 557 908 595 100 -518 -719 -710 -647 548 325
6160 325 938 508 192 -539 -1104 -885 -466 198 689 1089 415 -49 -547 -808 -784 -223 358 910 735 589
6180 589 -35 -520 -939 -886 -247 441 989 918 514 95 -778 -923 -756 -300 583 778 872 561 -119 -795 -937
6201 -937 -632 -402 650 907 887 456 -113 -571 -1117 -882 -90 434 622 734 141 -259 -766 -862 -511 -261
6221 -261 616 867 911 299 -417 -574 -921 -371 103 631 1123 854 218 -357 -654 -839 -589 4 660 1104
6241 1104 913 360 -628 -969 -726 -486 274 573 896 851 -79 -576 -779 -750 -309 212 789 913 831 93 -437
6262 -437 -784 -877 -314 186 883 851 571 27 -655 -859 -815 -388 390 555 890 406 -77 -729 -932 -907 -102
6283 -102 187 679 1057 161 -387 -632 -910 -647 -90 336 1151 704 444 -260 -612 -847 -532 -230 652 865
6303 865 858 464 -171 -552 -634 -680 66 404 811 879 392 -311 -761 -910 -797 4 569 1099 907 142 -337 -872
6325 -872 -754 -440 -27 616 758 589 195 -352 -831 -764 -621 -8 870 984 476 305 -502 -954 -834 -230
6345 -230 355 844 716 564 186 -520 -926 -975 -293 351 549 834 632 -14 -629 -536 -867 -477 55 715 1048
6366 1048 527 117 -665 -927 -748 -215 200 487 1175 434 -103 -502 -876 -708 -5 575 853 737 261 -74
6386 -74 -595 -997 -663 -78 498 869 783 432 112 -483 -728 -971 -350 489 661 633 205 -119 -669 -842 -579
6407 -579 14 514 706 932 479 -576 -439 -645 -359 -11 594 1018 987 215 -205 -741 -954 -626 -4 675
6427 675 827 818 369 -374 -922 -754 -520 156 637 653 265 245 -393 -661 -744 -320 221 654 822 706 185 -356
6449 -356 -783 -701 -328 477 619 821 593 -25 -608 -668 -902 -426 406 699 1012 378 -204 -476 -782 -578 -396
6470 -396 510 632 752 384 -152 -823 -589 -484 -335 249 909 674 401 -392 -685 -1040 -429 106 324 1019
6490 1019 729 495 -55 -896 -846 -309 -101 452 679 660 295 -146 -765 -794 -781 167 418 975 802 25 -307
6511 -307 -814 -780 -810 81 189 709 844 86 -349 -713 -985 -304 220 737 615 438 178 -485 -870 -874 -487
6532 -487 291 775 927 708 286 -455 -944 -636 -405 323 508 805 429 34 -500 -787 -677 -184 249 684
6552 684 825 723 -173 -142 -631 -828 -335 457 970 728 275 -216 -815 -759 -530 -293 410 650 824 487 201
6573 201 -799 -853 -711 -290 746 979 556 286 -199 -789 -725 -665 -19 527 768 602 568 -325 -547 -513 -530
6594 -530 -1 294 807 839 211 -146 -454 -575 -347 116 336 836 873 400 -159 -680 -672 -400 56 333 973
6615 973 650 129 -336 -912 -666 -485 -122 770 777 493 147 -300 -863 -742 -163 161 659 542 732 71 -258
6636 -258 -761 -669 -318 104 568 836 464 39 -512 -362 -748 -433 525 726 610 514 145 -295 -690 -615 -146
6657 -146 206 534 989 458 55 -480 -891 -925 -391 141 526 793 467 20 -603 -764 -617 -96 451 572
6677 572 698 425 -215 -395 -734 -702 2 407 947 606 347 -203 -752 -753 -646 -87 368 558 891 182 -284
6698 -284 -416 -748 -431 -39 656 811 701 122 -470 -675 -712 -463 149 394 440 526 313 -473 -755 -623 -418
6719 -418 184 469 708 480 192 -251 -833 -840 -328 54 652 614 780 250 -422 -591 -648 -272 -20 688 680 393
6741 393 5 -571 -703 -485 -391 134 603 692 392 25 -531 -682 -606 -352 399 506 669 341 87 -564 -586
6762 -586 -581 -189 235 609 376 512 -31 -627 -893 -282 72 368 570 641 388 -35 -430 -686 -429 -113 318
6783 318 664 568 81 -387 -530 -664 -540 -122 471 713 648 101 -215 -514 -783 -401 374 740 761 596 324
6804 324 -259 -573 -571 -193 1 610 437 467 219 -303 -575 -657 -492 3 324 740 436 -112 -416 -549 -499 -432
6826 -432 217 542 644 439 62 -371 -642 -667 -490 159 470 799 517 28 -432 -516 -561 -116 105 728 774
6847 774 508 -122 -486 -566 -790 -205 406 852 515 546 -135 -339 -509 -681 -235 228 597 594 139 -191 -419
6868 -419 -897 -389 -128 394 337 806 198 -152 -552 -545 -451 2 381 359 660 298 -204 -607 -818 -298 -17 440
6890 440 463 520 484 -561 -742 -565 -335 29 537 912 650 10 -411 -678 -611 -589 -169 333 704 359 32
6911 32 -383 -528 -1111 -229 140 276 522 378 187 -409 -670 -659 -132 240 509 472 409 197 -393 -919 -551
6932 -551 -206 280 577 539 375 -15 -550 -621 -573 -159 296 326 622 293 -144 -318 -877 -540 -400 452 467 656
6954 656 492 -56 -520 -471 -263 -264 -95 551 551 475 -19 -705 -432 -292 -399 635 360 533 314 -256 -288 -694
6976 -694 -464 -420 313 502 513 284 -146 -234 -659 -504 -79 678 677 433 -18 -510 -445 -597 -266 33 390 462
6998 462 633 284 -118 -679 -505 -367 143 837 521 489 -160 -254 -664 -578 -352 -5 299 622 184 135 -207
7019 -207 -635 -910 -139 251 552 964 400 76 -350 -405 -813 -216 388 535 548 323 -264 -657 -519 -546 -12
7040 -12 156 133 666 324 -31 -515 -602 -559 -204 247 323 642 327 152 -476 -403 -469 -322 -27 434 390 287 -155
7063 -155 -610 -689 -202 -143 410 779 399 123 -37 -524 -507 -478 59 493 519 720 169 -167 -727 -737 -394 -14
7085 -14 261 765 269 19 -270 -653 -795 -450 -141 528 627 626 490 -77 -610 -265 -225 112 290 829 544 -51
7107 -51 -474 -527 -447 -152 206 695 716 97 115 -303 -412 -438 -284 306 513 560 395 -157 -435 -727 -385 -5
7129 -5 186 338 515 148 101 -327 -405 -617 -58 307 693 622 677 -177 -286 -458 -431 -93 279 550 378 348 15
7152 15 -464 -507 -354 -277 603 466 514 252 -45 -510 -579 -382 -73 377 501 631 243 -348 -769 -503 -658 -51
7174 -51 234 500 562 -11 -386 -550 -598 -492 -97 452 219 366 165 -354 -683 -275 -319 166 295 834 490
7195 490 109 -172 -707 -622 -445 80 497 612 295 118 -189 -417 -519 -433 143 148 693 530 -39 -299 -471
7216 -471 -658 -19 146 648 412 291 -62 -264 -329 -530 -90 234 639 591 415 39 -307 -682 -159 -91 297
7237 297 288 350 95 -16 -534 -533 -239 -217 369 680 715 226 8 -501 -367 24 -27 280 377 383 -43 -374 -405 -342
7261 -342 -392 -5 213 321 329 74 -188 -710 -654 -394 -306 303 767 321 352 -321 -281 -200 -443 88 361 510 416
7284 416 196 -48 -421 -643 -386 -167 485 758 312 312 -221 -348 -366 -299 355 398 520 365 117 -210 -295 -477
7306 -477 92 16 399 647 138 198 -320 -541 -438 -139 452 380 531 173 274 -541 -658 -384 -134 138 878
7327 878 445 562 -13 -386 -430 -358 64 221 488 571 308 -101 -250 -578 -316 39 108 595 483 342 -124
7348 -124 -210 -628 -351 -180 476 481 310 259 -58 -353 -206 -487 -103 104 495 192 -159 -278 -685 -356 -247
7369 -247 91 299 375 417 284 -288 -414 -360 -145 128 309 635 646 146 -253 -651 -562 -58 333 404 511 126
7391 126 85 -433 -254 -674 -85 319 199 334 260 -78 -52 -480 -428 -52 148 563 604 252 218 -260 -610 -369
7413 -369 -361 -85 548 603 344 136 -213 -441 -333 -61 -32 469 373 35 -175 -50 -415 -545 -232 50 405 380
7435 380 309 -194 -410 -496 -484 -13 96 765 389 364 -426 -387 -166 -409 -97 267 214 205 170 -118 -525 -446 -422 -40
7459 -40 434 575 358 297 -110 -121 -333 -412 -101 139 421 286 307 -223 -340 -468 -488 56 269 303 296 241 -551
7482 -551 -330 -286 -114 239 196 295 244 207 -220 -716 -201 -194 30 373 437 291 362 -501 -390 -332 -117 148 272
7505 272 365 471 151 -194 -244 -190 -19 8 436 293 146 258 -212 -408 -383 -262 184 778 685 345 -61 -55 -434
7528 -434 -255 190 85 198 431 83 -291 -578 -525 -217 -34 404 471 675 121 -118 -184 -386 -484 -127 213
7549 213 650 649 -262 -15 -295 -489 -459 32 406 588 336 104 -115 -300 -333 -130 -195 234 571 372 42 -163
7571 -163 -206 -413 -232 146 606 333 284 -99 -213 -613 -537 -244 189 390 672 97 263 -186 -559 -304 -156
7592 -156 223 365 314 155 -26 -403 -212 -386 105 120 339 353 234 38 -388 -471 -490 -55 187 390 356 363 159
7615 159 -348 -318 -189 -212 439 447 176 173 214 -259 -351 -144 -62 141 357 306 131 -9 -336 -418 -47 88 133 197
7639 197 307 106 -53 -232 -411 50 94 307 460 465 164 -233 -512 -222 -268 5 78 422 325 145 -161 -377
7661 -377 -172 -91 64 536 439 220 4 -112 -459 -452 -425 204 183 590 246 -22 -102 -479 -266 -188 182 359 299
7684 299 101 -169 -61 -398 -537 -97 -37 496 462 176 106 -471 -342 -161 99 165 196 548 259 -284 -85 -159
7706 -159 -193 -301 273 274 227 277 -193 -316 -302 -83 -21 321 274 353 138 -5 -375 -455 -218 -198 130 511 491 44
7730 44 54 -427 -279 -16 -51 96 443 156 46 -298 -304 -405 -121 12 272 353 237 104 -131 -172 -74 -161 141
7753 141 231 264 483 201 -209 -111 -438 -347 -1 358 550 214 48 -159 -258 -412 -348 201 402 278 160 -48
7775 -48 131 -349 -496 -177 268 272 261 55 208 -375 -461 -290 -56 184 89 281 302 179 -378 -549 -419 -193
7797 -193 52 246 429 275 -133 -434 -473 -220 22 190 586 565 -60 -100 -261 -325 -331 169 449 413 -40 238
7819 238 74 -84 -244 -79 -234 93 385 255 -7 -196 -387 -417 -156 -283 54 477 313 246 -119 -111 -397
7840 -397 -131 -38 240 540 212 79 -164 -203 -34 -326 21 450 280 143 150 -272 -130 -190 -227 -121 214 587
7862 587 118 200 59 -404 -379 25 259 411 550 291 -126 -408 -360 -386 -46 66 82 330 208 -148 -68 -261
7884 -261 -64 -97 163 528 379 66 9 -411 -177 -16 -180 -29 218 270 143 -173 -505 -448 -285 42 28 224
7906 224 462 135 150 -174 -516 -342 165 335 48 340 200 -212 -141 -450 -73 -215 220 327 49 216 -409
7927 -409 -91 -456 40 356 273 465 200 346 90 -206 -342 -157 159 157 498 41 98 220 -283 -347 38 -179
7949 -179 224 341 373 89 -141 -214 -208 -171 5 506 362 309 -106 -377 -215 -237 -62 193 107 341 62 -279 -280
7972 -280 -429 -228 -49 216 332 260 154 89 -144 -194 -160 -45 -173 146 318 107 77 -90 -255 -185 -110 447
7994 447 199 336 193 46 -126 -373 -231 -132 129 211 266 -33 -161 -277 -268 -286 -438 -17 351 145 374 -91
8016 -91 -311 -419 -223 -21 353 425 222 68 -18 -404 -502 -283 -42 201 532 368 403 -252 -239 -238 -228 36 237
8039 237 257 -23 -112 24 -418 -25 12 220 -38 370 514 82 -249 -116 -643 -181 213 233 265 -201 236 -439
8061 -439 -386 -188 -90 106 265 316 279 -317 -210 -340 -183 105 227 360 32 -41 -21 -343 -330 -531 19 52 111
8084 111 441 156 -239 -404 -125 30 -144 217 265 139 -149 8 -207 -205 -150 226 292 318 332 112 -164 -291
8106 -291 -50 -136 -74 -163 378 210 41 -15 55 -80 -451 221 324 277 71 -135 -102 -208 -145 5 -11 386 104
8129 104 112 -35 -167 -195 -93 -34 308 237 244 626 -54 -78 -541 -262 11 48 218 307 76 299 -145 82 -353
8152 -353 33 -116 262 316 133 -268 -125 -252 -291 -82 -8 248 399 221 -22 -240 -78 -125 -26 -67 124 190
8174 190 39 116 -422 -82 205 276 255 232 217 36 -10 -116 -116 34 160 52 406
8191D06
$$ Imaginary data points
##PAGE= N=2
##DATA TABLE= (X++(I..I)), XYDATA
0 0 0 0 0 0 0 0 0 0 0 0 0 -8 6 -8 8 -8 11 -16 16 -24 24 -32 33 -40 48 -56 65 -76 87 -101 114 -131 148 -166
34 -166 189 -211 236 -266 296 -329 367 -407 453 -499 552 -610 672 -742 815 -901 990 -1091
52 -1091 1206 -1331 1473 -1633 1812 -2024 2272 -2563 2919 -3361 3926 -4676 5724 -7297 9912
67 9912 -15044 28902 -146460 -416481 -134741 -24611 -40855 115423 277357 182631 54408
78 54408 -27711 -64867 -46239 12108 104953 251300 278109 210233 184829 78434 -131865 -122422
90 -122422 60109 127101 164701 256728 195663 27065 -74100 -149957 -167133 -32745 76128
101 76128 77930 109901 114812 -13238 -142097 -189665 -179755 -88902 27126 83818 124985 111862
113 111862 -28061 -152134 -154267 -127497 -65157 71734 155397 135308 93869 19087 -88711
124 -88711 -133243 -101117 -23354 93302 166618 146264 95811 18283 -100073 -151316 -85402 4711
136 4711 75434 131782 135166 72341 -23242 -107811 -133288 -94206 -28344 57442 135788 131340 51264
149 51264 -35864 -111885 -149809 -102220 -1859 84054 128371 109360 34991 -46343 -108997 -129179
161 -129179 -78629 4381 67785 111266 110746 40082 -46817 -106144 -132306 -90067 8981 85673
173 85673 119125 109281 29732 -69625 -113461 -110306 -68389 20957 95063 108880 88053 29017
185 29017 -58359 -104984 -99522 -65280 13658 98276 114088 79983 24160 -63439 -126246 -107993
197 -107993 -50439 16760 88149 107091 60649 -3436 -72961 -125811 -108974 -46553 12920 74563
209 74563 103789 58142 -15644 -72925 -115629 -110322 -39984 35720 84915 103179 63901 -12026
221 -12026 -70213 -99589 -89867 -22260 55724 94608 103376 73238 -3390 -71680 -91342 -72077
233 -72077 -15805 59423 103839 101867 61725 -11078 -76874 -93629 -68445 -15278 55527 99431
245 99431 88596 43398 -20309 -82913 -103419 -70859 -12517 50626 93097 83853 31778 -31724
257 -31724 -85606 -102023 -67246 -3169 58594 91765 80712 31320 -30964 -82572 -94098 -53767
269 -53767 10632 65002 95624 87187 33839 -34457 -78282 -80920 -44875 16501 74448 100647
281 100647 81162 25728 -36907 -77535 -81381 -43488 19492 73496 92087 69072 15247 -47245
293 -47245 -87075 -85583 -44739 16016 67259 82364 57034 3085 -56970 -93737 -86914 -41289
305 -41289 18132 64933 79524 54419 -1600 -60650 -90072 -76330 -31759 25667 72752 85597
317 85597 54820 -2219 -55177 -80464 -67876 -21651 37721 80844 86348 52529 -2532 -54297
329 -54297 -79415 -63831 -14860 42108 78732 80374 46093 -10412 -61787 -82486 -62227 -13647
341 -13647 40072 74876 74391 37331 -19432 -67287 -82278 -60188 -11656 42137 74564 70314 31605
354 31605 -23982 -67826 -78499 -54310 -5540 47162 77269 68336 27933 -24508 -66318 -75619
366 -75619 -48619 1704 52378 78024 66034 24707 -26717 -67110 -73006 -41070 8412 53828
378 53828 77898 65054 19044 -31131 -64694 -69052 -37451 12993 56963 76978 61349 15595
390 15595 -34684 -65755 -68631 -35172 17999 58437 71779 54807 9246 -42574 -70106 -66146
402 -66146 -34127 16565 56807 66067 46048 2527 -48058 -74053 -65633 -31564 18267 59183
414 59183 65446 40784 -1183 -48635 -72891 -58562 -21462 24469 63600 69493 40788 -1020
426 -1020 -42949 -67177 -53563 -12663 32407 66914 71028 39299 -5258 -46249 -68788 -51937
438 -51937 -7485 32729 59529 62648 30261 -17476 -53786 -70945 -58093 -14633 28076 52530
450 52530 54982 23289 -28340 -63923 -74600 -58402 -11416 35952 53756 48429 19730 -27914
462 -27914 -60539 -62539 -44899 -4011 43600 62098 53607 30213 -15938 -56348 -57261 -31773 7075
475 7075 55076 76172 57147 24237 -17259 -55528 -53309 -19347 13945 49086 70373 51179
487 51179 13901 -19818 -53879 -61321 -28427 10973 42981 65805 49226 2243 -35017 -60946
499 -60946 -66633 -28322 20852 43962 54075 43413 -1066 -40669 -54014 -55108 -28559 20648
511 20648 50109 55480 45704 5870 -41320 -56345 -48628 -21833 29048 61555 56142 38457 5380
524 5380 -41983 -57267 -38385 -13310 23329 58722 58975 32921 283 -39967 -61115 -43591 -10631
537 -10631 26626 60652 58275 23392 -9949 -41106 -60985 -42257 -2605 27890 50805 53733
549 53733 24543 -12686 -42682 -60788 -45590 -3127 31354 53022 55544 20997 -26086 -50961
561 -50961 -56202 -38890 1004 35073 48677 44106 14980 -24453 -45571 -52521 -42323 -2324 37936
574 37936 50676 45686 20288 -26542 -57482 -54712 -32438 7105 45837 53166 37439 10892 -28831
587 -28831 -53570 -44428 -25154 1892 39398 52997 35623 10506 -24175 -58073 -54681 -25093
599 -25093 6150 42299 58790 33419 -3514 -31334 -56270 -51553 -14411 16313 37362 52377
611 52377 34398 -3056 -26761 -45699 -49026 -15000 24333 43162 55679 43354 -1766 -35226
623 -35226 -43324 -40540 -11964 32645 50640 48149 35078 -2793 -38965 -43933 -36088 -15333 25801
636 25801 49939 42065 26137 -5088 -46377 -55385 -35323 -12400 20888 49367 41576 13950 -12029
649 -12029 -43382 -56012 -34279 -5786 21191 47631 45570 15308 -13233 -39124 -53730 -33137
661 -33137 4835 30592 48603 47562 15840 -18636 -36587 -44126 -28713 7743 35316 46119
673 46119 44210 18347 -18775 -39850 -42941 -28342 6494 38934 48719 40190 13143 -24340 -44992
686 -44992 -41506 -22937 8241 38731 46147 32589 7827 -23212 -44510 -41836 -21827 7714 36897
699 36897 46804 32214 4650 -26716 -47695 -43096 -18714 12646 38537 45279 28396 -949 -29150
712 -29150 -45443 -39317 -15090 14088 38100 44866 27540 -1649 -28754 -44242 -38532 -12051 18383
725 18383 40061 44575 26172 -5103 -31580 -43644 -36112 -9303 20880 39557 41068 22400 -8824
738 -8824 -34018 -43999 -35666 -8935 21965 38661 38353 19687 -11681 -37469 -43542 -32536 -7020
751 -7020 23888 41148 36705 16320 -12147 -36257 -42457 -28443 -1845 27007 42857 36896 15966
764 15966 -12354 -36395 -40589 -23649 2732 28663 43272 36858 12343 -15710 -36004 -39194 -22683
777 -22683 5030 29985 42102 34075 8917 -18589 -36963 -39192 -21464 7488 31391 40312 31150
790 31150 6764 -21048 -38400 -37308 -18776 8668 32201 39503 28885 4283 -23145 -38810
802 -38810 -35946 -16764 10494 32684 38359 26137 1101 -25084 -39436 -35095 -14608 12158 33453
815 33453 37614 23423 -1339 -25984 -39194 -33606 -11370 15509 34533 37417 22734 -2677 -26886
828 -26886 -38060 -30320 -8242 18026 35978 36878 20415 -4917 -27611 -37527 -28978 -6035 19619
841 19619 35628 34366 16930 -8481 -30187 -38231 -28286 -4514 20646 34431 31716 14269 -10623
854 -10623 -31654 -37688 -25597 -1583 22576 35615 31844 13148 -12048 -31138 -34733 -22177 1838
867 1838 25924 37363 31200 11780 -12542 -30768 -33751 -19676 4054 26449 36993 29146 8324
880 8324 -15745 -32875 -34213 -18851 5267 26335 34743 25750 4631 -18129 -33965 -33716 -16719
893 -16719 7088 26141 34654 25511 2957 -19842 -32725 -31891 -14824 10641 29348 34525 24158
906 24158 1533 -21052 -32095 -29112 -12264 12536 30200 32892 21851 161 -22690 -32848
918 -32848 -28211 -11713 13232 31711 31725 18947 -1739 -24957 -34789 -25420 -7230 14324 31962
931 31962 32046 16136 -3961 -23395 -33095 -24202 -4648 15845 32427 32340 14498 -6542 -23542 -33231
945 -33231 -25074 -1781 18482 30310 29885 12606 -11081 -26496 -32298 -24578 -2361 19269 28785
958 28785 27040 11347 -13449 -29251 -31432 -22644 -1022 21857 30522 25000 9177 -13494 -29015
971 -29015 -29069 -18326 1203 23319 32013 24636 8830 -11775 -29324 -29739 -15353 4408 24263
984 24263 33682 24279 4640 -15255 -29535 -28229 -12722 6133 23744 30715 21099 2218 -15603
997 -15603 -28240 -28763 -13537 7135 24200 31604 21478 555 -18480 -29888 -27642 -9707 12494
1010 12494 26344 30027 19321 -2382 -19345 -26806 -24355 -8488 12489 25302 28416 19605 -2148
1023 -2148 -21759 -28559 -25109 -9326 14926 28001 26770 15651 -5017 -25057 -28970 -21119 -6503
1036 -6503 15140 27982 23878 12669 -4005 -24174 -29873 -19297 -4508 14483 30172 26098 10007
1049 10007 -5980 -23691 -30664 -17567 154 15443 29026 26794 7981 -8907 -21750 -29701
1061 -29701 -18876 2996 17597 27040 26838 7498 -13650 -23314 -26785 -18022 5020 21411 24720
1074 24720 22633 8291 -14342 -23957 -23276 -16817 2878 22901 26885 21510 8810 -14495 -28972
1087 -28972 -24063 -12783 4828 25098 28553 16721 2989 -14631 -27741 -22484 -8418 5117
1099 5117 20581 27839 16918 997 -13480 -27410 -26202 -9247 8014 22420 29190 17728 -3167
1112 -3167 -18186 -26723 -24185 -5805 12658 22258 24637 15626 -3588 -18395 -23682 -21710 -7052
1125 -7052 12042 23090 24988 15900 -3181 -20773 -25921 -20344 -5244 14396 25375 23599 12483
1138 12483 -5781 -21627 -25207 -17688 -3409 14465 24788 22358 10602 -6261 -21807 -25539 -17243
1151 -17243 -2013 15545 25645 21559 8703 -8129 -23030 -25040 -15568 -143 15915 25636 21473
1164 21473 6910 -9521 -22824 -25563 -13766 1952 17079 26111 20621 4183 -11057 -21781
1176 -21781 -24011 -12721 4998 17692 24240 20049 3714 -12781 -21672 -23193 -12772 6086 19937
1189 19937 23891 18869 3083 -15581 -23339 -21542 -10887 7206 21294 22466 15173 1694 -16013
1202 -16013 -23957 -19560 -9515 6376 21719 23468 14144 496 -15497 -24923 -19598 -6450 8938
1215 8938 22510 24466 12586 -2333 -15922 -23993 -18898 -3864 10211 21143 23304 12324 -3934
1228 -3934 -16596 -23077 -19124 -4105 11830 20977 22060 11260 -5950 -18886 -23102 -17825 -2939
1241 -2939 13811 21651 19922 9759 -6651 -19772 -22642 -15454 -1380 14555 22904 19690 8357
1254 8357 -7373 -20121 -22230 -13540 513 15197 23367 19174 6560 -8636 -20442 -21761 -12878
1267 -12878 1941 15756 22443 18130 4553 -10363 -20688 -21742 -11938 3167 16601 22304 16648
1280 16648 3304 -11466 -20880 -20583 -9886 4839 17452 22161 16506 2355 -12544 -20591 -19211
1293 -19211 -8952 6269 18740 22475 14943 1045 -13023 -20970 -18635 -7707 7396 18968 21157
1306 21157 13585 -556 -14717 -21347 -18276 -6940 7926 18759 20413 11960 -2390 -15525 -21327
1319 -21327 -17411 -5351 9138 19545 20224 11205 -2789 -15902 -20991 -15685 -3612 10459 20207
1332 20207 20044 10305 -3945 -16031 -20659 -15021 -2409 11425 20206 18924 8479 -5979 -16930
1345 -16930 -20867 -14524 -1150 12106 19352 17362 6719 -7621 -18163 -20281 -13509 -209 13081
1358 13081 19703 16593 5707 -8427 -18404 -19452 -11484 1634 14826 20397 16328 5030 -8530
1371 -8530 -18377 -18097 -9580 3101 15598 20680 15399 3455 -9753 -18565 -18025 -8727 4181 15695
1385 15695 20028 14069 1749 -10780 -18936 -18093 -7890 5226 16030 19531 13264 149 -11850
1398 -11850 -18497 -17027 -6566 6982 16729 19350 12751 -82 -12470 -18421 -15909 -5582 7931
1411 7931 17554 18504 11581 -1267 -14037 -18878 -14901 -4810 8267 17331 17275 9430 -3145 -14890
1425 -14890 -19305 -15104 -4017 8961 17365 16707 8146 -4192 -15278 -19094 -13664 -1967 10418
1438 10418 18149 16877 7251 -4776 -15000 -17919 -11610 -267 11492 18004 16893 6672 -5868
1451 -5868 -15396 -18189 -11219 1092 12569 18393 15346 4507 -7669 -16175 -17763 -10845 2038 12465
1465 12465 16976 14558 3695 -9027 -16839 -17068 -10083 2518 13876 17165 13697 2797 -9736
1478 -9736 -16955 -16047 -8642 3555 15014 17192 12579 3133 -9402 -17439 -15253 -7119 4309 15795
1492 15795 18158 11415 1213 -10070 -18459 -15233 -5091 4998 14775 17752 10109 -871 -10536
1505 -10536 -17199 -15505 -4706 6420 14298 17963 10169 -2182 -11570 -16834 -14667 -3446 8935
1518 8935 15351 16309 9786 -3312 -12844 -15433 -12663 -3060 9485 15686 14927 9293 -2896 -14169
1532 -14169 -16356 -11817 -2805 9924 17156 14548 7039 -4257 -14954 -16692 -10131 -1432 9846 16879
1546 16879 13458 5018 -4695 -13992 -16940 -9796 263 10165 16815 14477 4330 -6075 -14263 -16702
1560 -16702 -9242 2107 10962 16198 13292 3020 -7604 -14329 -15910 -8830 2983 11367 15278 13020
1574 13020 2656 -8976 -15045 -15067 -8347 3748 12901 15144 11845 1404 -9735 -14677 -13754 -7059
1588 -7059 4252 13532 15263 11215 1486 -9690 -15711 -13044 -5878 5498 14692 15431 9444 216
1602 216 -10616 -15815 -11770 -4358 5474 14220 15202 7981 -765 -9910 -16002 -12583 -3103 6191 13927
1617 13927 15630 7746 -3027 -10994 -15743 -12335 -1397 7845 13356 14536 7096 -4283 -11183 -14237
1631 -14237 -11672 -1518 8717 13520 13720 7258 -4576 -12915 -14372 -10587 -1188 10314 14415 12372
1645 12372 5829 -5116 -13690 -13758 -8595 -413 9970 15019 11554 4575 -5033 -13708 -14193 -7705 966
1660 966 10033 15234 11340 3057 -6035 -13854 -14327 -7109 2271 10140 14546 11452 2134 -7171 -12877
1675 -12877 -13930 -6759 3610 11138 14330 11162 1437 -7985 -12735 -12558 -6033 4257 11870 13805
1689 13805 10065 726 -8990 -13407 -11988 -5093 4785 12018 13443 9062 -319 -9649 -14099 -11630 -4297
1704 -4297 5346 12561 13008 7670 -1460 -10342 -13932 -10967 -3589 5748 12705 12778 6948 -1900 -10638 -13910
1720 -13910 -10278 -2407 6775 13341 12978 6157 -2817 -10502 -13474 -9433 -874 7445 12959 12459 5429
1735 5429 -3694 -10977 -13417 -9352 -269 7884 12820 11647 4529 -5355 -11661 -13210 -8808 354 9054
1750 9054 12622 11131 3533 -5702 -11866 -12289 -7810 1231 9649 12892 10608 3516 -6048 -12186 -11867
1765 -11867 -6606 2311 10320 13161 9979 2494 -6211 -12229 -11697 -5506 2917 10327 12910 9201 893
1780 893 -7158 -12105 -11759 -5091 3756 10280 12825 8825 71 -8243 -12338 -11332 -4112 4549 10987
1795 10987 12519 8063 -602 -8232 -12165 -10280 -3455 5547 11250 12227 7290 -1186 -9020 -12142 -9814
1810 -9814 -2643 5782 11518 11486 6065 -2402 -9685 -12498 -9566 -2436 6253 11414 11133 5238 -2761 -10215
1826 -10215 -12721 -8653 -941 6786 11725 10906 4844 -3354 -10135 -11999 -7899 -83 7538 11910 10558
1841 10558 4136 -4051 -10249 -11577 -7166 442 8322 11623 10034 3348 -5095 -10900 -11573 -6824 1350
1856 1350 8412 11524 8905 2325 -5785 -11239 -11037 -6055 1952 9021 11579 8556 1657 -6379 -10915
1871 -10915 -10444 -5158 2734 9376 11313 8187 773 -6678 -10896 -10021 -4414 3661 9860 11206 7306
1886 7306 228 -7437 -10997 -9496 -4011 3957 10120 11014 6393 -670 -7587 -11344 -9282 -2631 4657
1901 4657 10169 11038 5937 -1353 -7948 -11014 -9000 -1825 5245 10280 10510 5874 -2202 -8543 -10681
1916 -10681 -8685 -1413 6223 10318 10386 5243 -3022 -8993 -10463 -7720 -1185 6670 10619 8962 4190
1931 4190 -3011 -9522 -10605 -6937 -442 6925 10860 9437 3572 -3478 -9443 -10725 -5983 724 7394
1946 7394 10950 8893 2024 -4236 -9468 -10282 -5587 1479 7448 10353 8538 1803 -5307 -9426 -9991
1961 -9991 -5491 2514 7857 9943 8288 1366 -6440 -9917 -9300 -4825 2699 8901 9914 7096 1174
1976 1174 -6351 -10218 -8620 -3833 3068 9298 10554 6308 181 -6508 -10033 -8393 -2929 3595 8964
1991 8964 10093 5731 -619 -6957 -10404 -8460 -2455 4373 8930 9661 5111 -1751 -7349 -9987 -7805
2006 -7805 -1920 4993 9260 9110 5006 -1735 -7948 -9884 -7298 -1380 5483 9574 9434 4241 -2198
2021 -2198 -8200 -9806 -6624 -181 5952 9424 9002 3325 -3593 -8253 -9638 -6598 349 6212 8805
2036 8805 7935 2659 -4148 -8530 -9304 -6092 464 7308 9218 7731 2687 -4926 -9486 -8732 -4922 1152
2052 1152 7734 9564 6723 1841 -4473 -8971 -8620 -3741 1280 7304 10129 6812 862 -4687 -9206
2067 -9206 -9177 -3307 2718 6983 9820 6515 -451 -5481 -8554 -8685 -3562 3772 7251 8893 6764 -475
2083 -475 -6446 -8347 -8053 -3072 4501 8401 8240 5637 -594 -7124 -8828 -7001 -2824 4347 9318 8137
2099 8137 4746 -769 -7313 -9513 -6247 -1721 3982 9211 8445 3078 -1839 -6867 -9670 -6008 -312
2114 -312 4297 8582 8242 3160 -2462 -6803 -9027 -6045 58 5375 8477 8224 2844 -3342 -7517 -8690
2130 -8690 -5656 768 6389 8496 7280 2836 -3684 -7792 -7813 -4866 656 6317 8645 6828 2092
2145 2092 -4049 -8143 -8248 -4251 1390 6783 8857 6381 1352 -4453 -8087 -7901 -3695 2065 6952
2160 6952 8360 5983 681 -4764 -7979 -7592 -3536 2487 7391 8434 5400 -40 -5417 -8462 -7286
2175 -7286 -2818 2834 7346 8492 4978 -515 -5424 -8006 -6776 -2115 3470 7312 8188 4717 -819
2190 -819 -5773 -8313 -7050 -1534 4319 7486 8006 4657 -1377 -5948 -7843 -6037 -1294 4450 7548
2205 7548 7498 4012 -1973 -6709 -7921 -5445 -855 4630 7796 7107 3063 -2476 -7109 -8002 -5050 -281
2221 -281 4897 7981 7004 2313 -2560 -6965 -7650 -4595 462 5362 7978 6284 1957 -3621 -6988 -7827
2237 -7827 -4437 1201 5588 7737 6395 1276 -4103 -7123 -7225 -4212 1376 6080 7759 5942 1232
2252 1232 -4352 -7265 -7053 -3605 2039 6433 7387 5217 535 -4560 -7362 -6730 -2986 2492 6463 7589
2268 7589 4693 353 -4925 -7552 -6476 -2380 2682 6764 7642 4391 -465 -5140 -7571 -6333 -1931
2283 -1931 3213 6789 7154 3985 -1274 -5578 -7325 -5963 -1164 3582 6981 7010 3739 -1515 -5655 -7234
2299 -7234 -5138 -978 4006 7126 6529 3250 -1762 -6148 -7228 -5350 -599 4589 7213 6339 2620
2314 2620 -2383 -6097 -7388 -4805 -158 4458 7186 5931 1980 -3019 -6477 -6957 -4316 558 5336
2329 5336 6976 5927 1925 -3226 -6525 -6768 -3753 1338 5294 7260 5506 1145 -3527 -6414 -6422 -3331
2345 -3331 1481 5610 7141 5069 787 -4023 -6650 -6310 -3027 1953 5740 6804 4706 120 -4443
2360 -4443 -6980 -5995 -2156 2207 6119 6717 4457 -269 -4871 -6901 -5671 -2043 2832 6019 6529 4195
2376 4195 -507 -4574 -6721 -5413 -1570 3417 6365 6375 3499 -958 -5306 -6863 -5207 -1404 3283
2391 3283 6372 6280 2949 -1581 -5338 -6931 -4786 -673 3939 6729 6031 2391 -2312 -5565 -6836 -4528
2407 -4528 -51 4211 6291 5621 2234 -2606 -5894 -6263 -4171 495 4619 6537 5449 1704 -2913
2422 -2913 -6269 -6297 -3918 586 4750 6499 5054 1476 -2917 -6098 -6223 -3306 952 5227 6505 4777
2438 4777 742 -3441 -5843 -5574 -2908 1499 5193 6390 4562 408 -3472 -5999 -5573 -2336 1837
2453 1837 5385 6686 4181 90 -3803 -6164 -5494 -2046 2131 5491 6340 3870 -513 -4200 -6341
2468 -6341 -5390 -1729 2625 5513 6046 3409 -1077 -4587 -6482 -4903 -901 3080 5786 5774 3195 -1160
2484 -1160 -4872 -5788 -4594 -1109 3624 6098 5476 2789 -1364 -5174 -5970 -4108 -911 3740 6151 5302
2500 5302 2312 -1814 -5172 -5952 -3631 -156 3740 6199 4968 1475 -2187 -5221 -6291 -3492 696
2515 696 3908 6042 5249 1184 -2868 -5357 -5658 -3562 1284 4521 6101 4791 1106 -3294 -5628 -5466
2531 -5466 -3262 1418 4725 5629 4366 776 -3526 -5859 -5168 -2591 1471 4946 5847 3671 341 -3611
2547 -3611 -5848 -5176 -2162 1864 5198 5695 3458 -342 -3671 -5570 -4800 -1464 2238 5130 6069 3340
2563 3340 -694 -3981 -5577 -4731 -1314 2856 5259 5558 3065 -748 -4644 -5796 -4647 -905 2732
2578 2732 5285 5561 2524 -1228 -4608 -5706 -4136 -860 3011 5347 5207 2364 -1223 -4626 -5216 -3895
2594 -3895 36 3552 5147 5125 2271 -1887 -4690 -5279 -3585 78 4029 5554 4555 1898 -2317 -5212
2610 -5212 -5408 -3120 334 4003 5387 4041 1225 -2540 -5231 -5444 -2741 1016 4257 5644 4118
2625 4118 783 -2676 -5201 -5246 -2193 1399 3970 5734 4156 44 -3074 -4953 -5232 -1885 1913 4393
2641 4393 5273 3844 -128 -3662 -4907 -4718 -2085 2167 4635 4817 3327 -112 -3901 -5264 -4104 -1504
2657 -1504 1960 5066 4592 2834 -350 -4081 -5337 -3700 -749 2263 4912 4898 2245 -653 -3752 -5627
2673 -5627 -3717 -570 2777 4700 4967 2174 -1670 -4182 -5326 -3689 -69 3245 4995 4714 2079
2688 2079 -1765 -4289 -4940 -3285 80 3576 4600 4377 1807 -2001 -4800 -4841 -3085 348 3522 4962
2704 4962 4151 1579 -2194 -4686 -4819 -2750 204 3676 5021 3731 795 -2483 -4733 -4707 -2532 1196
2720 1196 3903 4959 3893 257 -2925 -4621 -4440 -2095 1282 4187 4987 3484 324 -3099 -4534
2735 -4534 -4372 -1558 1675 4337 5069 3304 194 -3036 -5047 -4324 -1596 1666 4162 4932 2731 -283
2751 -283 -3390 -4813 -3754 -1238 2015 4221 4805 2799 -774 -3659 -4843 -3967 -1024 2473 4494 4407
2767 4407 2409 -1050 -3768 -4673 -3184 -517 2312 4755 4323 1966 -1049 -3917 -4890 -2989 -32 2740
2783 2740 4828 4048 1297 -1341 -4253 -4503 -2954 392 3059 4413 3823 1105 -1955 -4143 -4744 -2507
2799 -2507 543 3485 4631 3986 1085 -2215 -4136 -4131 -2468 571 3540 4548 3628 960 -2297 -4057
2815 -4057 -4398 -2054 968 3739 4425 3429 452 -2756 -4182 -4211 -1874 1225 3501 4434 2966 337
2831 337 -2845 -4443 -4107 -1640 1613 3769 4542 2850 -166 -2897 -4361 -3530 -967 1746 3971 4361
2847 4361 2664 -572 -3073 -4544 -3478 -821 2282 4203 4027 2160 -685 -3478 -4400 -3136 -622
2862 -622 2487 4155 4076 2117 -1187 -3697 -4105 -3421 -344 2497 4145 3546 1801 -1458 -3529 -4303 -2876
2879 -2876 11 2718 4339 3731 1543 -1574 -3945 -4203 -2717 294 2924 4299 3679 1136 -1581 -3904
2895 -3904 -4003 -2441 389 3181 4200 3329 853 -1831 -4105 -3981 -1938 925 3273 4302 3015 444
2911 444 -2160 -3975 -3689 -1722 1108 3410 4215 2994 330 -2753 -4059 -3527 -1500 1544 3663 4090
2927 4090 2831 -201 -2699 -3866 -3366 -1101 1573 3627 3768 2456 -159 -3003 -4328 -3458 -981 1906
2943 1906 3722 3868 2138 -658 -3022 -4171 -3067 -893 2089 3906 3979 1997 -553 -3078 -4019 -2693
2959 -2693 -20 2243 3727 3746 1897 -847 -3246 -4111 -2472 42 2675 3608 3506 1442 -1501 -3273
2975 -3273 -3967 -2704 90 2696 3953 3178 1049 -1689 -3822 -3967 -2017 419 2784 4229 3105 583
2991 583 -1904 -3646 -3737 -1856 560 3163 3852 2856 489 -2077 -3748 -3662 -1841 970 3210 3860 2801
3008 2801 201 -2347 -3761 -3547 -1334 1077 3414 3654 2447 179 -2697 -3713 -3334 -1245 1143 3519
3024 3519 4044 2287 -355 -2610 -3883 -3203 -576 1905 3610 3783 2078 -625 -2721 -3870 -3175 -711
3040 -711 1885 3606 3710 1921 -1075 -3121 -3644 -2696 -730 1993 3641 3232 1544 -961 -3323 -3634
3056 -3634 -2475 -523 2378 3458 2905 1155 -935 -3489 -3645 -2043 -60 2521 3855 3084 628 -1439
3072 -1439 -3105 -3696 -1940 342 2592 3788 3292 828 -1659 -2976 -3516 -2008 728 3021 3562 2623
3088 2623 718 -2005 -3680 -3619 -1533 894 2936 3284 2631 581 -2179 -3620 -3059 -1766 602 3037
3104 3037 3675 2243 437 -2308 -3621 -3417 -1257 971 3209 3505 2055 -255 -2303 -3323 -3088 -860
3120 -860 1247 2935 3692 1913 -567 -2616 -3503 -2958 -965 1919 3252 3433 1957 -735 -2792 -3674
3136 -3674 -2444 -327 1844 3632 3246 1585 -1075 -3126 -3530 -2410 -396 2004 3353 3378 1295 -957
3152 -957 -3053 -3134 -2329 -168 2343 3282 3052 1271 -1186 -2877 -3574 -2124 385 2221 3536 2846 952
3169 952 -1585 -3095 -3177 -1818 430 2714 3424 2435 841 -1462 -3264 -3268 -1699 682 2551 3751 2525
3186 2525 377 -1616 -3179 -3327 -1261 747 2464 3523 2304 285 -1940 -3304 -3278 -1252 921 2932
3202 2932 3187 2451 -276 -1913 -3168 -2970 -1338 1270 3196 3438 1971 -277 -2537 -3209 -2870 -977
3218 -977 1394 3411 2898 1843 -324 -2524 -3274 -2370 -731 1290 3282 3153 1515 -666 -2301 -3234
3234 -3234 -2434 -159 1955 3166 2993 1080 -833 -2371 -3399 -2422 -42 1941 3290 3030 1027 -1132
3250 -1132 -2783 -3059 -2042 188 2408 3163 2576 1282 -1355 -3141 -3056 -1951 190 2340 3283 2525 891
3267 891 -1628 -3230 -3018 -1757 344 2604 3277 2366 704 -1682 -3248 -3184 -1480 765 2469 3342 2286
3284 2286 243 -1781 -2999 -2665 -1401 842 2689 3014 2320 -120 -2007 -2887 -2825 -1196 1315 2689
3300 2689 3171 1849 -194 -2388 -3289 -2756 -755 1291 2992 3168 2022 -307 -2042 -3084 -2564 -796
3316 -796 1523 2970 2847 1570 -550 -2195 -3101 -2496 -480 1909 3027 2988 1271 -1055 -2512 -3196 -2122
3333 -2122 -355 1812 3231 2693 1059 -1198 -2521 -2797 -1800 15 2037 2971 2642 1095 -1261 -2903
3349 -2903 -2832 -1701 368 2135 3258 2609 710 -1393 -2664 -2854 -1762 441 2114 3025 2330 562
3365 562 -1332 -2886 -2792 -1404 675 2536 3063 2157 592 -1955 -2805 -2723 -1474 685 2509 2890 1842
3382 1842 222 -1970 -3125 -2634 -1078 928 2680 2981 1840 -103 -1830 -2674 -2438 -613 1086 2590
3398 2590 2678 1695 -214 -2136 -2896 -2517 -1001 1335 2477 2711 1534 -245 -1966 -2952 -2162 -380 1584
3415 1584 2832 2793 1173 -642 -2414 -2752 -1913 -323 1611 2776 2605 1248 -691 -2165 -3040 -1898
3431 -1898 -21 1738 2856 2285 695 -1103 -2641 -2839 -1728 348 1932 2759 2492 731 -1138 -2591
3447 -2591 -2947 -1704 536 1754 2928 2228 511 -1192 -2774 -2713 -1237 482 2073 2804 2040 241
3463 241 -1484 -2626 -2520 -1155 714 2391 2816 1801 165 -1725 -2837 -2429 -704 1114 2385 2694
3479 2694 1630 -158 -1572 -2493 -2472 -1073 775 2708 2823 1571 -78 -1852 -2852 -2226 -881 1248
3495 1248 2704 2615 1387 -235 -2281 -2465 -2013 -683 1467 2771 2630 1306 -361 -2442 -2661 -2039 -352
3512 -352 1564 2599 2603 1190 -776 -1877 -2745 -1925 -215 1639 2908 2585 979 -1022 -2217 -2733 -1943
3529 -1943 -22 1695 2903 2504 634 -974 -2245 -2582 -1396 211 2189 2632 2176 424 -1529 -2456
3545 -2456 -2639 -1387 369 2020 2566 1994 297 -1602 -2873 -2550 -1153 424 2280 2638 1789 177
3561 177 -1739 -2457 -2337 -956 631 2352 2358 1566 53 -1571 -2486 -2261 -675 838 2293 2498 1681 125
3579 125 -1819 -2545 -2148 -585 1169 2215 2327 1358 -254 -1803 -2666 -1988 -194 1202 2448 2479 1436
3596 1436 -433 -2274 -2573 -2395 -444 1481 2434 2234 1344 -468 -1883 -2459 -1777 -269 1539 2391 2252
3613 2252 1014 -899 -2013 -2598 -1833 -123 1569 2423 1976 556 -930 -2217 -2637 -1468 168 1501
3629 1501 2588 2043 576 -1006 -1983 -2312 -1334 164 1926 2680 2073 613 -1147 -2109 -2596 -1289 485
3646 485 1945 2411 1844 268 -1630 -2595 -2271 -1082 601 2192 2281 1352 209 -1408 -2324 -1990 -947
3663 -947 874 2044 2586 1149 10 -1848 -2571 -1979 -1008 923 2039 2523 1339 -134 -1965 -2241 -1859
3680 -1859 -703 1015 2414 2385 1649 -471 -1765 -2245 -1790 -76 1493 2247 2035 1413 -369 -1882 -2480
3697 -2480 -1842 -275 1142 2608 2236 1027 -735 -1931 -2497 -1719 -104 1213 2311 1934 841 -750
3713 -750 -1799 -2359 -1530 -44 1428 2268 2108 740 -896 -2055 -2183 -1420 297 1755 2318 1846 548
3730 548 -1050 -2382 -2386 -959 464 1549 2507 1754 305 -1303 -2143 -2234 -949 323 1811 2398 1439 101
3748 101 -1420 -2333 -2305 -927 501 1899 2409 1434 -340 -1527 -2419 -2203 -823 788 2189 2187 1700 -35
3766 -35 -1789 -2068 -1908 -737 926 2180 2206 1256 -291 -1558 -2344 -1713 -490 1151 2212 2031 1044 -472
3784 -472 -1798 -2177 -1621 -295 1432 2510 2124 1005 -637 -1940 -2224 -1624 120 1162 2264 2058 749
3801 749 -618 -1819 -2376 -1108 272 1158 2202 1779 905 -883 -1996 -2181 -1469 261 1778 2449 1801
3818 1801 713 -912 -2305 -2090 -1086 488 1456 1980 1776 512 -827 -2085 -1905 -939 636 1898
3834 1898 2340 1645 63 -1467 -2289 -1906 -913 729 1869 2112 1355 102 -1572 -2186 -1899 -644 694
3851 694 1971 1918 1368 -78 -1260 -2301 -2078 -476 894 2236 2079 1333 -93 -1637 -2300 -1584 -450
3868 -450 1083 2044 2301 808 -751 -1488 -2071 -1481 -455 952 2153 1837 914 -669 -1967 -2036 -1501 -69
3886 -69 1329 1992 1911 714 -567 -1857 -2352 -1480 -70 1590 2066 1748 758 -965 -2181 -2189 -1350 -108
3904 -108 1314 2254 1864 696 -849 -2137 -1858 -1181 221 1552 2124 1580 431 -1189 -1847 -2080 -1178
3921 -1178 424 1719 1856 1902 166 -1178 -2208 -2096 -838 547 1835 1891 1573 212 -1211 -1945 -1832
3938 -1832 -913 691 1793 2028 1259 -149 -1404 -2249 -1778 -461 583 1767 2098 1159 87 -1407 -2089
3955 -2089 -1832 -451 893 1647 1896 1037 -201 -1537 -2085 -1614 -102 1190 2054 1922 582 -203 -1608
3972 -1608 -1960 -1119 -91 1242 1932 1893 724 -644 -1846 -1937 -1480 151 1430 1973 1705 672 -541
3989 -541 -1731 -1838 -1288 113 1521 1913 1612 282 -725 -1860 -1970 -987 317 1085 2123 1677 125
4006 125 -952 -1850 -1765 -1048 553 1490 1892 1277 60 -1109 -1880 -1847 -902 423 1555 1940 1492 6
4024 6 -974 -1468 -1807 -561 701 1501 2015 1222 -282 -1347 -1988 -1695 -852 784 1736 1813 1192 -123 -1621
4043 -1621 -1836 -1607 -523 1038 1658 1895 1323 -271 -1405 -1793 -1262 -456 974 1880 1805 803 -578 -1409
4061 -1409 -1848 -1367 -243 1245 1591 1730 688 -579 -1534 -2005 -1451 85 1195 1698 1622 299 -392 -1898
4079 -1898 -1778 -757 104 1244 1851 1427 417 -668 -1818 -1773 -1182 84 1113 1838 1678 412 -1222
4096 -1222 -1674 -1657 -763 391 1251 1939 1327 303 -921 -1690 -1601 -949 433 1608 1730 1066 219 -1059
4114 -1059 -1808 -1681 -706 524 1634 2014 750 81 -1390 -1970 -1559 -337 601 1271 1793 1050 150 -1370
4132 -1370 -1570 -1522 -439 894 1946 1669 879 -306 -1393 -1886 -1528 -276 822 1780 1546 802 -316
4149 -316 -1560 -1815 -1186 -160 951 1902 1593 839 -272 -1525 -1600 -1270 98 975 1907 1601 565 -627
4167 -627 -1641 -1754 -1041 -22 1221 1810 1240 382 -331 -1724 -1457 -475 346 1279 1702 1546 167 -849
4185 -849 -1796 -1510 -897 248 1334 1781 1100 16 -1074 -1502 -1585 -944 435 1498 1813 1468 178 -851
4203 -851 -1617 -1563 -769 481 1508 1710 1182 -6 -1305 -1871 -1602 -327 515 1845 1712 1175 -13 -1202
4221 -1202 -1635 -1319 -609 734 1651 1621 1009 -113 -1264 -1618 -1385 -129 941 1477 1545 765 -282 -1723
4239 -1723 -1660 -1187 2 895 1597 1686 586 -512 -1581 -1439 -1173 -3 1143 1605 1641 829 -935 -1757
4257 -1757 -1542 -1306 120 1379 1758 1320 417 -592 -1693 -1807 -1018 44 1173 1730 1476 412 -816
4274 -816 -1391 -1593 -705 440 1264 1448 1262 370 -808 -1482 -1658 -574 550 1464 1536 1169 278 -1206 -1450
4293 -1450 -1607 -787 484 1507 1626 1141 -57 -1204 -1733 -1226 -454 687 1377 1771 1046 -319 -1065 -1719
4311 -1719 -1134 -250 717 1700 1787 742 -361 -1410 -1886 -1386 -230 842 1745 1398 818 -455 -1179 -1721
4329 -1721 -1342 -151 901 1556 1768 732 -382 -1602 -1363 -942 -154 605 1640 1272 512 -553 -1266
4346 -1266 -1628 -900 111 1084 1909 1428 532 -445 -1635 -1593 -876 177 1332 1635 1186 288 -810 -1462
4364 -1462 -1658 -794 328 1313 1664 1333 246 -704 -1301 -1427 -623 208 1313 1724 1093 299 -1185 -1606
4382 -1606 -1451 -777 409 1362 1660 1316 184 -867 -1504 -1164 -789 254 1406 1642 953 -167 -989 -1554
4400 -1554 -1323 -201 571 1444 1309 819 -168 -1279 -1643 -1307 -259 800 1578 1412 922 -361 -1284 -1675
4418 -1675 -1347 -323 917 1911 1693 574 -380 -1275 -1585 -892 -43 1109 1629 1114 551 -347 -1433 -1411
4436 -1411 -872 -40 887 1472 1450 260 -389 -1564 -1692 -728 98 1104 1698 1197 237 -768 -1509 -1390 -891
4455 -891 587 1235 1748 1215 394 -793 -1566 -1323 -786 374 1061 1616 867 215 -1041 -1780 -1285 -628 433
4474 433 1134 1474 1048 156 -864 -1380 -1591 -415 464 1215 1337 724 -234 -1125 -1548 -1380 -357 644 1424
4493 1424 1485 891 17 -1235 -1596 -1200 -266 786 1702 1549 766 -262 -1056 -1411 -1085 -30 681 1445 1062
4512 1062 310 -472 -1198 -1883 -995 127 744 1388 1387 741 -523 -1271 -1382 -986 112 1329 1682 1351 570
4531 570 -674 -979 -1172 -738 212 952 1625 1268 201 -615 -1430 -1710 -637 598 1079 1634 1325 68
4549 68 -624 -1129 -1308 -609 246 1276 1800 1294 194 -860 -1613 -1413 -578 504 1077 1347 1050 -50 -1047
4568 -1047 -1502 -1200 -547 596 1255 1592 820 -99 -1003 -1164 -1319 -362 612 1446 1545 981 -169 -840 -1456
4587 -1456 -1226 -311 595 1150 1360 485 -446 -1142 -1468 -1173 -381 741 1464 1388 582 -321 -1030 -1200 -1326 -209
4607 -209 816 1540 1220 571 -583 -1267 -1422 -1160 -197 1098 1445 1253 511 -409 -1390 -1467 -945 -97 997
4626 997 1517 1011 369 -542 -1357 -1103 -745 266 983 1348 980 298 -773 -1448 -1307 -464 332 1357 1575
4645 1575 919 -24 -689 -1345 -1139 -337 379 1116 1350 825 70 -1076 -1125 -985 -427 439 1394 1398 912 -251
4665 -251 -1092 -1384 -1049 -401 470 1424 1538 834 -166 -999 -1443 -1178 -404 685 1282 1183 411 -250 -1121 -1218
4685 -1218 -965 9 927 1194 1572 631 -497 -1052 -1598 -1056 -368 810 1469 1334 647 -422 -1192 -1398 -763
4704 -763 -151 936 1535 1538 532 -519 -1200 -1258 -1078 133 1008 1385 1256 216 -614 -1165 -1360 -701 250
4723 250 1168 1509 1111 221 -858 -1418 -1337 -446 171 1385 1578 1101 355 -831 -1520 -1311 -470 379 1320
4742 1320 1311 1042 259 -892 -1514 -1219 -419 656 1434 1551 773 102 -1052 -1487 -1165 -548 671 1099 1268
4761 1268 982 -164 -1217 -1494 -849 -250 620 960 1442 729 -279 -1162 -1314 -1023 -382 705 1346 1201
4779 1201 594 -184 -1120 -1344 -1041 -64 990 1321 1277 955 -122 -970 -1468 -828 -276 920 1565 1510 609
4798 609 -796 -1339 -1503 -990 74 724 1575 1157 298 -669 -1344 -1467 -903 248 938 1368 985 347 -760
4817 -760 -1472 -1480 -677 228 1139 1443 971 368 -694 -1226 -1267 -609 373 1136 1375 1008 374 -600 -1635 -1248
4837 -1248 -578 732 1107 1316 891 -102 -823 -1458 -1282 -469 569 1276 1591 940 -83 -1022 -1215 -1136 -345
4856 -345 564 1395 1200 852 60 -1108 -1453 -937 -3 976 1440 1003 556 -231 -1062 -1477 -1212 80 803
4875 803 1296 1341 645 -95 -1113 -1133 -712 169 554 1202 1194 480 -597 -1283 -1450 -809 -50 1016 1393 1016
4895 1016 398 -692 -916 -1056 -917 217 1119 1368 1140 476 -577 -1302 -1443 -689 265 1365 1357 1141 361
4914 361 -607 -1344 -1462 -896 517 1069 984 897 175 -681 -1510 -976 -683 546 1148 1470 837 13 -832 -1136
4934 -1136 -1371 -590 581 1132 1058 867 86 -975 -1492 -1040 -414 736 1301 1387 594 8 -557 -1377 -1264
4953 -1264 -367 614 1401 1344 612 -444 -876 -1307 -1014 -265 666 1327 1177 651 -183 -930 -1369 -1213 -388 912
4973 912 1364 1210 693 -311 -926 -1128 -936 -45 781 1409 1131 573 -643 -1305 -1274 -1001 141 1042 1350
4992 1350 1086 354 -528 -1146 -1015 -803 22 915 1447 1073 298 -598 -1112 -1145 -691 298 877 1662 1108 357
5012 357 -655 -1415 -1282 -641 234 1264 1314 896 39 -925 -1223 -1210 -453 327 1323 1299 821 49 -694 -1475
5032 -1475 -1246 -371 381 1272 1212 781 -285 -863 -1214 -1234 -702 519 1457 1243 960 -225 -913 -1275 -997
5051 -997 -343 593 1280 1346 438 -625 -1078 -1436 -1082 -30 587 1188 762 169 -505 -1061 -1646 -663 226 703
5071 703 1274 1183 394 -542 -1163 -1247 -868 121 648 1316 1359 444 -528 -1237 -1279 -744 306 783 1339 1082 179
5092 179 -628 -1504 -1313 -734 171 1114 1614 1171 342 -810 -1355 -1628 -890 183 1145 1446 896 137 -741
5111 -741 -1429 -1153 -729 216 747 1485 835 71 -539 -942 -1144 -200 650 977 1430 982 -147 -988 -1283 -1067
5131 -1067 -295 683 1057 1497 604 -224 -1059 -1231 -1099 -444 656 1190 1246 642 -552 -1238 -1262 -975 -15 785
5151 785 1025 1275 655 -222 -1066 -1702 -1037 -274 906 1325 1143 722 -412 -926 -1333 -929 4 805 1093
5170 1093 1230 368 -393 -944 -1174 -947 146 775 1128 1199 493 -533 -1283 -1392 -636 153 1081 1202 808
5189 808 255 -693 -1431 -1230 -777 450 972 1458 1021 307 -585 -1111 -1193 -979 127 1064 1434 853 142 -757
5209 -757 -1115 -1186 -545 465 1006 1148 964 -117 -775 -1318 -1188 -316 628 1083 1215 920 -151 -932 -1420
5228 -1420 -1336 -225 390 1275 1138 459 -157 -888 -1577 -840 -269 806 1318 1309 535 -220 -902 -1360 -926 -309
5248 -309 706 1202 1268 591 -369 -1208 -1088 -849 52 668 1185 1115 802 -435 -1098 -928 -727 176 837 1216
5268 1216 1021 578 -418 -1087 -1461 -722 174 957 1220 1010 540 -456 -1127 -1184 -747 478 870 1253 1067 43
5288 43 -481 -1242 -1214 -613 455 1010 1289 866 -29 -532 -1151 -985 -740 544 1139 1346 739 36 -816 -1343
5308 -1343 -1014 -516 509 1209 1322 677 93 -694 -1322 -1199 -201 544 1058 1109 737 -13 -1050 -1532 -1030
5327 -1030 -301 656 1349 1446 514 -223 -1197 -1352 -1153 150 446 894 1106 558 -370 -1077 -1068 -705 -208 574
5347 574 1098 1235 361 -474 -845 -1160 -782 -96 929 1358 1257 256 -333 -1061 -932 -585 32 917 1133
5366 1133 777 466 -580 -1188 -1426 -648 607 864 1220 968 242 -912 -977 -1179 -735 583 909 1282 1023
5385 1023 -2 -491 -1259 -1369 -445 485 1010 1531 912 167 -426 -1121 -1237 -383 551 1056 1001 911 -190 -979
5405 -979 -1596 -890 -166 415 1217 1199 743 -260 -1177 -1299 -1039 -380 638 1150 1224 806 -334 -1027 -1158 -959
5425 -959 -349 792 1207 1198 506 -209 -819 -1047 -974 -115 878 1188 1093 363 -106 -973 -1038 -714 95 630 1282
5446 1282 982 602 -403 -1425 -1388 -962 213 857 873 1032 70 -641 -1044 -1094 -732 45 914 1006 747 150
5466 150 -626 -1201 -1246 -406 228 689 1084 1009 149 -657 -1236 -962 -550 468 1155 1295 649 -57 -610 -955
5486 -955 -1070 -535 403 942 1126 863 150 -1011 -1203 -1155 -451 604 980 1027 593 -117 -971 -941 -648 -371
5506 -371 619 879 1296 664 -96 -625 -1187 -871 -523 570 991 1301 818 -168 -913 -1386 -837 -170 554 1318
5526 1318 1103 519 -261 -852 -1098 -676 128 814 973 987 466 -332 -984 -1154 -669 -74 682 1198 1232 341
5546 341 -205 -1049 -1297 -862 28 805 1174 935 523 -392 -1052 -916 -382 91 859 1164 972 409 -446 -1175
5566 -1175 -956 -580 248 877 1310 798 276 -537 -1200 -1097 -548 183 1150 1199 950 123 -556 -1139 -941 -358
5586 -358 462 723 1174 800 133 -501 -1206 -1086 -456 148 851 1055 495 -7 -994 -1190 -1151 -176 370 1098
5606 1098 1171 512 -190 -802 -1068 -869 -204 636 1037 782 597 -300 -1056 -1264 -867 -183 769 1089 964 362
5626 362 -254 -727 -1191 -1028 -144 724 1166 1091 367 -289 -908 -950 -792 241 576 1072 989 74 -283 -1117 -1193
5647 -1193 -877 342 711 1083 997 526 -695 -1030 -1091 -347 107 702 1209 653 159 -694 -1061 -1235 -544 465
5667 465 890 1137 1082 126 -900 -1013 -1006 -541 306 864 886 823 142 -485 -960 -1373 -791 510 1328 1110 603
5688 603 9 -879 -1097 -1132 -394 357 617 1086 487 -294 -828 -813 -1464 -413 528 867 1067 604 -155 -836
5708 -836 -1334 -537 -20 738 1294 1007 817 -321 -899 -1457 -1033 -116 476 1005 841 236 -227 -1034 -860 -652
5728 -652 -198 566 1090 1075 331 -340 -1029 -1306 -442 268 719 1108 1249 298 -585 -1185 -1179 -572 42 770 1134
5749 1134 964 161 -486 -1092 -1171 -426 -8 706 1059 1134 263 -480 -1016 -891 -594 362 836 1116 931 79
5769 79 -623 -1273 -974 -372 338 885 1027 599 123 -658 -1052 -1101 -519 430 918 1007 561 -239 -801 -1070 -740
5790 -740 -89 572 826 1314 423 -561 -612 -1088 -491 -207 357 1110 987 561 -398 -943 -1237 -820 -331 250
5810 250 1022 1064 610 -441 -776 -1233 -664 -179 733 1008 1089 447 -363 -925 -1099 -514 50 711 1245 994
5830 994 416 -141 -956 -1087 -789 26 661 1262 750 144 -627 -975 -1136 -736 119 716 1287 379 77 -644
5850 -644 -982 -1166 -538 124 815 817 1091 121 -427 -871 -969 -460 56 956 1081 1009 -28 -811 -994 -707 -300
5871 -300 333 896 996 776 -19 -646 -974 -1012 -409 481 635 987 588 -43 -461 -918 -954 -215 656 1048 1094
5892 1094 573 33 -896 -959 -891 -278 590 1254 915 275 -318 -635 -943 -722 163 680 956 1091 603 -118
5912 -118 -1006 -813 -548 -249 856 842 829 365 -450 -1067 -1044 -601 -185 638 1168 676 143 -269 -897 -823 -591
5933 -591 199 772 1441 671 283 -481 -912 -980 -593 -29 876 849 778 -146 -485 -950 -1014 -435 286 814 851 916
5955 916 39 -731 -1045 -967 -537 255 782 1071 843 -76 -682 -897 -838 -523 302 972 698 737 -24 -588 -929
5976 -929 -719 -245 407 1048 1051 547 -1 -494 -1028 -1092 -323 704 609 1008 350 -358 -746 -904 -458 32 147
5997 147 995 880 276 -170 -823 -719 -854 -331 443 994 775 244 -466 -1043 -969 -790 26 553 1058 967 510
6018 510 -265 -919 -1094 -527 87 600 862 1023 527 -502 -753 -739 -528 166 655 740 1086 196 -335 -1108
6038 -1108 -846 -424 7 715 1266 941 178 -506 -853 -907 -461 374 896 1055 495 356 -639 -1290 -799 -396
6058 -396 208 1044 902 700 -31 -611 -1018 -939 -419 391 864 932 732 -108 -656 -1082 -835 -147 428 878 1038
6079 1038 372 5 -808 -1131 -556 -14 612 1113 817 747 -286 -995 -905 -642 -294 687 935 748 521 -360
6099 -360 -748 -1067 -718 -287 607 896 952 562 -159 -1187 -1266 -488 79 535 966 606 93 -354 -798 -934
6119 -934 -605 25 509 828 738 89 -142 -819 -889 -669 157 605 845 925 174 -331 -663 -822 -291 -33 559
6140 559 903 895 -101 -283 -846 -986 -282 456 738 891 472 75 -431 -654 -1188 -115 226 956 1106 535
6160 535 245 -656 -922 -1044 -148 195 871 1049 664 -42 -812 -1046 -814 -232 423 951 896 674 36 -893
6180 -893 -1050 -775 -57 485 1009 1003 579 41 -601 -854 -784 -390 476 862 698 375 -285 -705 -1077 -588 -13
6201 -13 631 828 1006 126 -93 -833 -731 -619 -14 649 935 1075 223 -333 -816 -891 -785 16 462 1036 891
6222 891 203 -659 -696 -1069 -571 41 741 1195 741 74 -474 -919 -749 -516 148 693 919 726 133 -560
6242 -560 -728 -917 -292 152 655 691 514 -210 -612 -823 -942 -380 224 997 975 616 -153 -811 -857 -765 -398
6263 -398 540 968 1079 318 -203 -611 -1030 -775 -300 436 1006 855 459 -139 -654 -931 -447 -178 483 778
6283 778 1000 403 -251 -732 -743 -511 -195 296 818 899 269 -128 -984 -1128 -629 -102 641 1048 639 486 -434
6304 -434 -798 -1048 -442 253 654 677 1042 316 -107 -802 -704 -466 -37 908 724 695 267 -473 -810 -974 -526
6325 -526 19 514 850 453 149 -808 -930 -907 -381 43 900 830 534 219 -648 -872 -840 -289 223 896 891 626
6347 626 -227 -625 -1065 -881 -394 338 993 998 269 -50 -558 -777 -492 -118 294 563 772 268 -75 -677 -1034
6368 -1034 -382 216 594 1082 755 560 -189 -701 -816 -562 -139 609 816 697 256 -276 -689 -978 -321 119
6388 119 484 761 558 594 -403 -818 -1068 -526 463 549 936 930 44 -196 -764 -1051 -376 387 443 898 617 183
6410 183 -554 -613 -833 -380 321 663 869 546 215 -409 -740 -772 -637 393 830 906 597 135 -630 -684 -1072
6431 -1072 -444 141 778 665 415 -160 -502 -854 -703 -378 373 795 751 430 -38 -586 -868 -541 -255 93
6451 93 771 675 384 -14 -472 -1046 -808 56 389 652 972 471 -153 -501 -883 -788 -244 387 668 882 450
6472 450 -247 -692 -431 -592 -210 359 720 707 454 -161 -682 -922 -547 -3 455 915 737 -18 -152 -872
6492 -872 -791 -480 -209 826 831 578 77 -365 -740 -1164 -459 277 397 459 367 -116 -439 -608 -722 -468 261
6513 261 636 902 615 127 -630 -625 -857 -555 505 880 780 553 196 -611 -632 -779 -156 356 491 971 477
6534 477 200 -375 -603 -962 -415 370 723 845 228 -158 -536 -827 -594 29 632 724 551 381 14 -534
6554 -534 -814 -263 -105 275 727 639 310 -92 -743 -811 -485 -252 403 744 621 145 -207 -891 -586 -615 295
6575 295 394 514 642 367 -415 -874 -821 -791 91 338 656 786 365 -349 -635 -740 -483 -94 527 864 602
6596 602 255 -419 -608 -821 -256 341 603 918 536 117 -476 -752 -616 -225 208 555 803 397 60 -472
6616 -472 -746 -614 -450 384 526 853 565 58 -471 -799 -468 -45 347 587 947 620 -146 -316 -658 -659 -311
6637 -311 220 885 683 396 -223 -461 -619 -688 -207 316 648 1095 426 -194 -681 -741 -683 -12 406 666 813
6658 813 320 -12 -776 -831 -778 110 599 813 1101 212 -165 -1122 -746 -291 10 417 548 527 214 -244 -883
6679 -883 -896 -630 -34 356 470 546 517 -106 -760 -554 -470 -156 482 637 666 345 -20 -680 -534 -67 342 487
6701 487 741 532 270 -397 -744 -740 -191 108 350 833 341 321 -512 -547 -867 -511 109 464 743 639 -102
6722 -102 -301 -537 -487 -189 396 663 670 729 -24 -560 -657 -798 151 274 727 684 376 -208 -745 -637 -782 -49
6744 -49 315 668 777 444 -224 -630 -977 -416 90 253 779 589 626 106 -612 -688 -664 -276 391 768 699 313
6766 313 -327 -340 -612 -450 -132 336 590 728 181 -357 -258 -735 -661 -2 397 870 637 240 -344 -765 -691
6787 -691 -425 135 473 831 723 113 -375 -620 -472 -132 180 448 352 479 151 -316 -923 -927 -370 -17 392
6808 392 431 628 179 -372 -539 -609 -80 208 918 630 458 -30 -461 -900 -416 -168 204 355 645 207 -200
6829 -200 -234 -949 -442 -230 250 534 609 209 -265 -435 -634 -440 -383 238 571 700 419 -171 -279 -881 -730
6850 -730 -136 118 808 742 195 -516 -770 -829 -595 31 557 800 546 380 -378 -675 -818 -629 -20 478 936
6871 936 887 343 -483 -616 -561 -551 166 523 758 277 32 -246 -661 -489 -649 -76 448 466 590 128 -386
6892 -386 -493 -569 -485 279 465 742 623 -222 -420 -458 -417 -209 -65 617 531 437 -18 -468 -765 -545 -175 177
6914 177 401 704 480 178 -378 -415 -458 -154 303 625 547 475 31 -486 -637 -438 -30 420 602 642 457 -167
6936 -167 -351 -710 -518 -63 424 501 662 423 -282 -415 -625 -347 -177 506 495 385 546 -30 -673 -311 -567
6957 -567 80 438 664 432 344 29 -673 -542 -442 155 474 585 385 216 -262 -482 -535 -177 232 328 438
6978 438 534 -158 -330 -644 -659 -436 1 368 631 712 108 -399 -567 -650 -486 -11 684 658 386 188 -400 -535
7000 -535 -604 -182 293 318 653 490 55 -396 -536 -706 -472 121 765 483 535 316 -567 -456 -872 -106 224
7021 224 577 707 273 44 -455 -722 -444 -55 233 798 641 516 -257 -425 -552 -701 -254 -60 442 542
7041 542 226 -219 -402 -503 -329 110 161 709 364 291 -155 -625 -916 -580 54 280 533 467 78 -353 -557
7062 -557 -547 -402 225 392 474 500 49 -393 -486 -654 -358 47 456 788 310 -25 -218 -444 -612 -242 -21
7083 -21 470 565 425 134 -125 -679 -280 -387 160 485 685 189 8 -491 -442 -443 -81 463 583 714 590 14
7105 14 -666 -671 -483 14 423 795 735 305 10 -205 -574 -251 78 311 524 491 286 -212 -582 -547 -412 -81
7127 -81 122 434 547 437 -250 -542 -453 -528 -76 115 415 447 217 -112 -340 -378 -510 85 340 353 637 295
7149 295 -217 -623 -423 -353 91 384 426 451 167 -78 -530 -732 -325 340 600 685 505 115 -331 -709 -343
7170 -343 -258 -92 385 512 406 -17 -129 -289 -538 -290 213 389 500 424 -350 -300 -659 -474 -153 187 499
7191 499 680 465 -67 -316 -506 -286 -177 169 663 497 381 50 -6 -619 -410 -237 164 484 489 500 -109
7212 -109 -357 -602 -198 -151 228 359 627 288 -174 -352 -367 -221 -23 245 501 372 175 -206 -459 -278 -227
7233 -227 -26 123 422 406 404 -209 -448 -682 -364 -41 620 543 394 145 13 -373 -839 -505 160 356 423 392
7255 392 197 22 -556 -584 -521 -298 192 392 417 1 -384 -512 -520 -46 83 382 750 532 154 -91 -659 -615
7277 -615 -389 224 380 684 233 287 -399 -596 -399 -282 -100 304 407 689 -58 -97 -316 -379 -159 151 319
7298 319 423 424 142 -372 -625 -312 -255 -11 746 564 318 148 -288 -542 -838 21 189 197 430 239 9 -347
7320 -347 -348 -138 -7 190 525 472 167 -76 -578 -325 -433 -106 511 309 454 157 -300 -306 -515 -240 227 205
7342 205 499 451 90 -94 -476 -411 -284 113 277 313 501 97 72 -373 -509 -361 -308 574 347 273 58 -207
7364 -207 -317 -514 -228 141 518 567 261 169 -222 -579 -427 -330 119 463 600 417 -145 -133 -389 -514 31
7385 31 -66 513 644 26 179 -61 -117 -134 -137 -180 463 188 422 127 -438 -462 -411 -41 465 706 589 379 -372
7408 -372 -510 -142 -210 81 315 606 494 45 -121 -175 -364 -237 -85 373 211 59 259 76 -409 -225 -204
7429 -204 87 169 378 531 122 -257 -546 -554 -220 -15 -17 704 367 -84 -170 -763 -723 -339 -62 393 424 472 204
7452 204 -664 -500 -391 -324 -146 187 440 339 168 -211 -363 -675 -155 2 521 458 474 -157 -334 -647 -324
7473 -324 -264 290 586 299 177 165 -327 -256 -263 -425 219 141 413 347 -13 -129 -441 -324 13 163 372 409 563
7496 563 -80 -314 -440 -302 -126 289 447 353 114 201 -229 -618 -322 -253 352 108 530 135 -150 -377 -331
7517 -331 -178 -177 131 504 493 57 89 -264 -471 -105 135 116 344 506 186 -104 -406 -647 -139 -99 171 330
7539 330 367 -136 -136 -240 -409 -247 -5 150 232 324 -131 -179 -117 -414 -304 -111 600 200 266 388 -91 -542 -419
7562 -419 -128 -109 55 178 225 27 -216 -685 -397 158 100 115 561 279 72 -199 -480 -354 -16 308 446
7583 446 463 197 315 -276 -464 -134 15 -56 349 415 268 -110 -147 -236 -69 -69 91 205 474 147 74 -318 -196
7606 -196 -270 -134 335 236 375 -31 -108 -276 -349 -394 -165 197 724 393 82 -10 -248 -384 -333 158 396 714
7628 714 350 -195 -45 -235 -310 -178 105 295 405 298 127 111 -493 -439 -303 -203 251 264 582 -6 9 -110
7650 -110 -656 -277 -54 197 123 243 -95 -297 -692 -631 -63 43 576 166 581 186 -126 -24 -192 -87 -13
7671 -13 235 499 199 311 -334 -256 -368 13 173 354 432 149 291 -328 -279 -401 29 413 253 305 422 189
7693 189 -242 -315 -244 8 292 180 134 214 264 -454 -253 -120 -129 246 414 521 249 -130 -204 -447 -195 42 170
7716 170 431 97 -105 -141 -502 14 -263 27 271 291 218 113 -230 -136 -165 -400 71 209 478 527 268 -116
7738 -116 -261 -189 86 55 80 298 349 132 -174 -467 -347 -146 41 181 332 92 89 -86 -475 -73 -128 91
7760 91 214 84 293 -89 -34 -502 -339 48 188 172 310 243 90 -83 -233 -262 -48 -167 349 390 186 -88
7782 -88 -260 -231 -235 62 -140 376 314 400 17 -135 -494 -77 -79 282 312 88 288 -223 -463 -403 -63 -74 -41 402
7806 402 257 131 -65 -277 -492 -300 -86 119 33 24 484 -49 -212 -501 -297 -241 119 312 264 208 -176 -464
7828 -464 -288 -327 190 275 350 160 -51 -420 -334 -567 39 190 316 268 333 -47 105 -366 -196 -65 365 330
7850 330 376 140 -154 -104 -469 -364 -32 -219 401 523 125 -132 -292 -112 44 -229 -83 373 114 166 38
7871 38 -197 -472 -95 -87 222 358 239 197 -65 -338 -455 -377 -9 142 90 296 111 -344 -261 -279 -113 -153 174
7894 174 329 356 78 135 -288 -624 -249 -46 6 105 292 198 -46 -297 -296 -307 167 180 99 342 51 -408 -302
7917 -302 -74 -166 -35 279 93 189 53 -111 -466 -222 -108 -177 407 274 176 20 -361 -354 -279 -307 -81 356 132
7940 132 -98 -137 -344 -303 -348 -269 212 199 -25 275 -31 -493 -293 -428 -203 99 282 114 83 -252 -203 -261 -227
7963 -227 -67 -38 195 335 -17 -117 -244 -299 -138 -192 213 240 336 264 -120 -303 -254 -204 123 124 508 282 10
7986 10 -73 -232 -233 53 -204 55 224 194 181 -26 -171 -234 -295 193 84 304 74 64 -96 -250 -90 -207 225
8009 225 99 310 136 3 62 -178 -289 -80 31 375 204 206 40 -132 -322 -121 -121 -92 191 84 343 79
8031 79 -163 16 -167 -113 66 -39 165 226 46 -159 -143 -223 -76 226 97 359 -38 95 -288 -179 -356 -195
8053 -195 37 275 245 18 125 -242 -313 -222 -107 104 555 429 55 -319 -53 -274 -180 -66 62 94 89 297
8075 297 -231 -400 -215 -210 219 -38 273 526 81 212 -83 -380 -75 -15 150 337 128 -24 -144 -122 -332
8096 -332 -50 32 443 118 50 255 41 -278 -414 30 71 277 134 493 221 -107 -206 -123 -392 182 137 186
$$ [...]
8191A43
##END NTUPLES=NMR FID
##END=
