##TITLE=1H_LR-760-1-C1-B
 D2O
 8 sc, 
 20.1.2023
##JCAMPDX= 6.0         $$ Bruker NMR JCAMP-DX V2.0
##DATA TYPE= NMR FID
##DATA CLASS= NTUPLES
##ORIGIN= UXNMR, Bruker Analytische Messtechnik GmbH
##OWNER= root
$$ XWIN-NMR		Version 3.5
$$ Fri Jan 20 15:24:17 2023 Russian Standard Time (UT+4h)  she@DPX200
##.OBSERVE FREQUENCY= 200.13135
##.OBSERVE NUCLEUS= ^1H
##.DELAY= (6, 6)
##.ACQUISITION MODE= SIMULTANEOUS
##.ACQUISITION SCHEME= undefined
##.AVERAGES= 8
##.DIGITISER RES= 18
##SPECTROMETER/DATA SYSTEM= spect
##.PULSE SEQUENCE= zg30
##.SOLVENT NAME= D2O
##.SHIFT REFERENCE= (INTERNAL, D2O, 0, 15.7039)
##AUDIT TRAIL= $$ (NUMBER, WHEN, WHO, WHERE, WHAT)
$$ ##TITLE= Audit trail, XWIN-NMR		Version 3.5
$$ ##JCAMPDX= 5.01
$$ ##ORIGIN= Bruker BioSpin GmbH
$$ ##OWNER= she
$$ F:/spectra/data/she/nmr/H-F/1/audita.txt
$$ ##AUDIT TRAIL=  $$ (NUMBER, WHEN, WHO, WHERE, WHAT)
(   1,<2023-01-20 15:23:20.20 +0400>,<she>,<DPX200>,
      <created by zg, POWCHK disabled, PULCHK disabled
       configuration hash MD5:
       00 E9 B6 7A A2 85 ED C7 34 08 36 98 17 FE 4E 26
       data hash MD5: 16K
       2B C4 79 13 6E 1E FD DB A6 49 34 E5 0D 39 F6 03>)
$$ ##END=
$$ 
$$ hash MD5
$$ 3B 7C CF A7 37 97 E1 08 22 02 ED B5 E1 1E 18 F8
##$RELAX= 
##$RELAX= 
##$RELAX= 
##$RELAX= 
##$RELAX= 
##$RELAX= 
$$ Bruker specific parameters
$$ --------------------------
##$DU= <F:/spectra>
##$EXPNO= 1
##$NAME= <H-F>
##$PROCNO= 1
##$TYPE= <nmr>
##$USER= <she>
##$AMP= (0..31)
100 100 100 100 100 100 100 100 100 100 100 100 100 100 100 100 100 100 
100 100 100 100 100 100 100 100 100 100 100 100 100 100 
##$AQSEQ= 0
##$AQ_mod= 1
##$AUNM= <au_zg>
##$AUTOPOS= <>
##$BF1= 200.13
##$BF2= 200.13
##$BF3= 200.13
##$BF4= 200.13
##$BF5= 200.13
##$BF6= 200.13
##$BF7= 200.13
##$BF8= 200.13
##$BYTORDA= 1
##$CFDGTYP= 0
##$CFRGTYP= 5
##$CHEMSTR= <none>
##$CNST= (0..31)
1 1 145 1 1 1 1 1 1 1 1 1 1 1 1 1 1 1 1 1 1 1 1 1 1 1 1 1 1 1 1 1 
##$CPDPRG= <>
##$CPDPRG1= <>
##$CPDPRG2= <>
##$CPDPRG3= <>
##$CPDPRG4= <mlev>
##$CPDPRG5= <mlev>
##$CPDPRG6= <mlev>
##$CPDPRG7= <mlev>
##$CPDPRG8= <mlev>
##$CPDPRGB= <>
##$CPDPRGT= <>
##$D= (0..31)
0 1.2 0 0 0 0 0 0 0 0.06 0 0.03 0 0 0 0 0.0002 0 0 0 0 0 0 0 0 0 0 0 0 
0 0 0 
##$DATE= 1674213799
##$DBL= (0..7)
120 120 120 120 120 120 120 120 
##$DBP= (0..7)
150 150 150 150 150 150 150 150 
##$DBP07= 0
##$DBPNAM0= <>
##$DBPNAM1= <>
##$DBPNAM2= <>
##$DBPNAM3= <>
##$DBPNAM4= <>
##$DBPNAM5= <>
##$DBPNAM6= <>
##$DBPNAM7= <>
##$DBPOAL= (0..7)
0.5 0.5 0.5 0.5 0.5 0.5 0.5 0.5 
##$DBPOFFS= (0..7)
0 0 0 0 0 0 0 0 
##$DE= 6
##$DECBNUC= <off>
##$DECIM= 32
##$DECNUC= <off>
##$DECSTAT= 4
##$DIGMOD= 1
##$DIGTYP= 9
##$DL= (0..7)
0 120 120 120 120 120 120 120 
##$DP= (0..7)
150 150 150 150 150 150 150 150 
##$DP07= 0
##$DPNAME0= <>
##$DPNAME1= <>
##$DPNAME2= <>
##$DPNAME3= <>
##$DPNAME4= <>
##$DPNAME5= <>
##$DPNAME6= <>
##$DPNAME7= <>
##$DPOAL= (0..7)
0.5 0.5 0.5 0.5 0.5 0.5 0.5 0.5 
##$DPOFFS= (0..7)
0 0 0 0 0 0 0 0 
##$DQDMODE= 0
##$DR= 18
##$DS= 0
##$DSLIST= <SSSSSSSSSSSSSSS>
$$ [...]
##$SUBNAM2= <"">
##$SUBNAM3= <"">
##$SUBNAM4= <"">
##$SUBNAM5= <"">
##$SUBNAM6= <"">
##$SUBNAM7= <"">
##$SUBNAM8= <"">
##$SUBNAM9= <"">
##$SW= 18.05172834244
##$SWIBOX= (0..15)
0 0 2 0 0 0 0 0 0 0 0 0 0 0 0 0 
##$SW_h= 3612.71676300578
##$TD= 16384
##$TD0= 1
##$TE= 0
##$TE2= 300
##$TE3= 300
##$TEG= 300
##$TL= (0..7)
0 120 120 120 120 120 120 120 
##$TP= (0..7)
150 150 150 150 150 150 150 150 
##$TP07= 0
##$TPNAME0= <>
##$TPNAME1= <>
##$TPNAME2= <>
##$TPNAME3= <>
##$TPNAME4= <>
##$TPNAME5= <>
##$TPNAME6= <>
##$TPNAME7= <>
##$TPOAL= (0..7)
0.5 0.5 0.5 0.5 0.5 0.5 0.5 0.5 
##$TPOFFS= (0..7)
0 0 0 0 0 0 0 0 
##$TUNHIN= 0
##$TUNHOUT= 0
##$TUNXOUT= 0
##$USERA1= <user>
##$USERA2= <user>
##$USERA3= <user>
##$USERA4= <user>
##$USERA5= <user>
##$V9= 5
##$VALIST= <valist>
##$VCLIST= <CCCCCCCCCCCCCCC>
##$VD= 0
##$VDLIST= <DDDDDDDDDDDDDDD>
##$VPLIST= <PPPPPPPPPPPPPPP>
##$VTLIST= <TTTTTTTTTTTTTTT>
##$WBST= 1024
##$WBSW= 4
##$XGAIN= (0..3)
0 0 0 0 
##$XL= 0
##$YL= 0
##$YMAX_a= 365333
##$YMIN_a= -459535
##$ZGOPTNS= <>
##$ZL1= 120
##$ZL2= 120
##$ZL3= 120
##$ZL4= 120
##$ABSF1= 10
##$ABSF2= 0
##$ABSG= 5
##$ABSL= 3
##$ALPHA= 0
##$AQORDER= 0
##$ASSFAC= 0
##$ASSFACI= 0
##$ASSFACX= 0
##$ASSWID= 0
##$AUNMP= <proc_1d>
##$AZFE= 0.1
##$AZFW= 0.1
##$BCFW= 1
##$BC_mod= 2
##$BYTORDP= 1
##$COROFFS= 0
##$CY= 11.3945322036743
##$DATMOD= 1
##$DC= 2
##$DFILT= <>
##$DTYPP= 0
##$F1P= 2.36226072786647
##$F2P= -0.459571619588291
##$FCOR= 0.5
##$FTSIZE= 0
##$FT_mod= 4
##$GAMMA= 1
##$GB= 0.15
##$INTBC= 1
##$INTSCL= 1
##$ISEN= 128
##$LB= 0.24
##$LEV0= 0
##$LPBIN= 0
##$MAXI= 10000
##$MC2= 0
##$MEAN= 0
##$ME_mod= 0
##$MI= 1.114404
##$NCOEF= 0
##$NC_proc= 0
##$NLEV= 6
##$NOISF1= 3.799351
##$NOISF2= 2.8
##$NSP= 1
##$NTH_PI= 0
##$NZP= 0
##$OFFSET= 15.70392
##$PC= 1
##$PHC0= -19116.75
##$PHC1= 11.80079
##$PH_mod= 1
##$PKNL= yes
##$PPARMOD= 0
##$PSCAL= 0
##$PSIGN= 0
##$REVERSE= no
##$SF= 200.130013532006
##$SI= 16384
##$SIGF1= 3
##$SIGF2= 2
##$SINO= 400
##$SIOLD= 16384
##$SREGLST= <1H.CDCl3>
##$SSB= 0
##$STSI= 0
##$STSR= 0
##$SW_p= 3612.71676300578
##$SYMM= 0
##$S_DEV= 0
##$TDeff= 0
##$TDoff= 0
##$TI= <>
##$TILT= no
##$TM1= 0
##$TM2= 0
##$TOPLEV= 0
##$USERP1= <user>
##$USERP2= <user>
##$USERP3= <user>
##$USERP4= <user>
##$USERP5= <user>
##$WDW= 1
##$XDIM= 8192
##$YMAX_p= 0
##$YMIN_p= 0
$$ End of Bruker specific parameters
$$ ---------------------------------
##NTUPLES= NMR FID
##VAR_NAME=  TIME,          FID/REAL,        FID/IMAG
##SYMBOL=    X,             R,               I
##VAR_TYPE=  INDEPENDENT,   DEPENDENT,       DEPENDENT
##VAR_FORM=  AFFN,          ASDF,            ASDF
##VAR_DIM=   8192,          8192,            8192
##UNITS=     SECONDS,       ARBITRARY UNITS, ARBITRARY UNITS
##FACTOR=    0.0002768,     1,               1
##FIRST=     0,             0,               0
##LAST=      2.2672688,     0,               0
##MIN=       0,             -459535,         0
##MAX=       2.2672688,     365333,          0
$$ Real data points
##PAGE= N=1
##DATA TABLE= (X++(R..R)), XYDATA
$$ [...]
2804C275o84j500k425j782j27J216J978K225J259n61k086k197j542l46J240K310
2820B53J962Q40l74j807k268j692L1J266K006J876R94q95j503j999j509k58J475
2837a602J934K155R54r25j864k145j276j10J471J849J957R11r70j905k160j358
2853c084L56J495J935J924P46j219j621k304j478L92J513K184J594O12r31j950
2869A64k391n32J79J455J897J723L36q29j805k381p16K70J650J742J873N19j254
2886A900k156j588j094M73J569K122J449J40r94j943j675q87K70J463K226J453
2902B728J80j157k214j653q10N45J819J855J417l3j351j663j951p34O64J600K102
2919A344J466j82j245j977j724p58Q97J683K111J281m03j269j328k097o72Q62
$$ y = [3275, 2591, 1091, -1334, -3116, -3243, -2027, -49, 2176, 3435, 2874, 788, -1409, -2951, -3297, -2057, 253, 2215, 3055, 2681, 874, -1394, -3086, -3055, -1789, 217, 2093, 3087, 2192, 689, -1310, -2819, -3077, -1602, 332, 2487, 3441, 2516, 652, -1493, -2769, -2879, -1408, 441, 2398, 3309, 2339, 434, -1726, -3084, -2728, -1233, 702, 2626, 3372, 2153, 532, -1772, -3250, -2858, -1345, 839, 2433, 3045, 2114, 164, -2227, -2759, -2580, -1125, 772, 2495, 2831, 2002, 197, -2184, -2900, -2630, -980, 762, 2635, 3154, 1900, -256, -1844, -2938, -2465, -896, 1226, 2675, 2815, 1821, -122, -1797, -2684, -2414, -951, 1275, 2728, 2908, 1751, -463, -2116, -2926, -2381, -562, 1293, 2710, 2677, 1326, -337, -2288, -3022, -2358, -758, 1344, 2810, 2628, 1383, -594, -2318, -3076, -2179, -496, 1615, 2896, 2493, 1224, -104, -2201, -2873, -2011]
2935b011J630K248Q62k59j216k266j369n41P77J912J713J293l77j122k051j733
2951b510l60Q94J930J847Q94n02j209j720j880K17O55J690J706J282m57j571j485
2968e79j806n24J177J853J593J040m17j319k215j058k30P83K174J228Q33j11j898
2985E24j808j068l53R89J977J862O70p12j289j807j479lQ46J850J941M59p85j225
3003E89j732j408J11R80J963J613P55q94j841j329j450J68J444J671J484O69j103
3020A690j604j534r38k24J475J891J477L19m91k084j574p69j42J022K171J370
3036B055Q6l57j526j851r13L22J109K036J209K32r47j322j747j004N90J171J482
3053F25J577J34j006j344j405p78OJ759J505J558j4j069j787j122q85J39J538
$$ y = [-2011, -381, 1867, 2729, 2470, 1254, -1012, -2381, -2922, -2145, -233, 1480, 2773, 2396, 1274, -777, -2510, -2870, -1976, -46, 1801, 2695, 2193, 984, -736, -2616, -2399, -1744, -54, 1652, 2934, 2477, 906, -579, -2385, -2909, -1732, 121, 1714, 2754, 2337, 1018, -1197, -2255, -2485, -1702, 472, 1700, 2533, 2422, 524, -1284, -2352, -2705, -1716, 261, 2123, 2793, 2081, 792, -1015, -2494, -2497, -1651, 199, 2140, 2599, 1814, 589, -1143, -2551, -2440, -1460, 503, 2116, 2871, 1977, 136, -1193, -2643, -2475, -1031, 640, 2124, 2793, 1690, 86, -1448, -2386, -2610, -1135, 756, 2233, 2552, 2061, -23, -1597, -2366, -2508, -1486, 685, 2055, 2141, 1784, 258, -1593, -2506, -2184, -1075, 961, 2170, 2402, 1455, 133, -1614, -2618, -2028, -857, 625, 2202, 2336, 1330, -14, -1419, -2197, -2191, -432, 1073, 2631, 2617, 1548, -239, -1361, -2246, -2107, -569]
3070e69J558R74L61p59j904j602l17R5J435K067P94j36o54j512j923l62O43J009
3088h02K001J181k28r49j416j406p76O51J497J656J010j79j149j393j621o24J012
3105a535J303J232J208J08j295j460j225q39P22J757J379O83R5j109k194p89k14
3122b173M12J765J511O69k06j093j717j126l48Q73J222J915N79n50j063j432j173
3139a935k14P20J376J378J078o45j068j404j416m40J165J626J140R83k84j483
3155E77j484j049k29R08J273J329R93n10j213j898o36l5M63K001J239P00p04j279
3173D46j962n95Q5Q89J292J581M74o82p43j871q98r8J314Q05J600N38n58j433
3191A84j191r38q1J023J460J250M56n81j441j420o84lJ098J562J057K00l24j805
$$ y = [-569, 989, 1963, 2324, 1565, -339, -1941, -2258, -2163, -728, 1339, 2133, 1997, 1343, -169, -2092, -2454, -1811, -802, 1199, 2380, 2152, 1203, -213, -1619, -2395, -1744, -247, 1409, 2419, 2240, 1091, -302, -1923, -2547, -1535, -232, 1000, 2208, 2316, 1021, -439, -1664, -2503, -1781, -24, 1355, 2038, 2133, 1024, -1170, -1959, -2173, -1761, 4, 1515, 2184, 1978, 885, -832, -1958, -2306, -1433, -211, 1704, 2283, 1733, 670, -762, -1935, -2149, -1429, -53, 1325, 2403, 1758, 690, -714, -2130, -2570, -1405, 221, 1361, 2344, 2060, 577, -907, -1956, -2185, -1277, -4, 1325, 2318, 1808, 595, -1303, -1939, -1974, -1511, 490, 1729, 2429, 1725, 446, -1516, -2111, -2026, -1137, 155, 1736, 2210, 1528, 785, -1086, -1984, -2082, -768, 37, 1637, 2175, 1617, 184, -1007, -1945, -2026, -1003, 457, 1707, 2163, 1582, 141, -1279, -1963, -1966, -868, 694, 1751, 1951, 1627, -178]
3209a78j118o42r5R25J758J009M58m81j554j573o30L27J034J404J331L64j006
3226A333j226j405j074N90J110J417J170L56j068j266j209j018M47J139J334R29
3242A559N50j251j265j096n74O22J126J031R06J97m47j443j290m72J25J348J290
3259I16P62P6p41j415j090k42K62R59J176J250o0p60j612r33m73N65Q08J563P73
3278A784j76n72j709q00o06N62J056J507Q40J29r23j505j040l54L91J223J323
3295A130O72k23q06j466r47k94Q18J390J172L14Q5j015j473j081l7L34J331J044
3313I48J016l99j106j293o05n34N54J688R36O61m71p54j284j145k03R70R68J270
3331A217O48l60r03j486p58J37M67R12J494L41k23q38j393o00k70P10R79J163
$$ y = [-178, -1296, -1938, -2033, -1108, 650, 1659, 2117, 1636, 82, -1491, -2121, -1794, -760, 644, 1975, 2339, 1333, 107, -1298, -2372, -1782, -672, 745, 1915, 2271, 1203, -63, -1272, -2290, -1843, -704, 630, 1559, 2109, 858, -407, -1503, -2077, -1455, -329, 702, 1608, 1805, 1358, -85, -1375, -1847, -1722, -374, 916, 1678, 1754, 1013, -402, -1492, -1734, -1472, -513, 663, 1913, 1853, 1093, -519, -1452, -1925, -1360, -552, 1011, 1784, 1608, 1036, -673, -1473, -2079, -1517, -461, 1046, 1886, 2015, 1092, -413, -1453, -1807, -1416, -193, 1130, 1802, 1579, 773, -693, -1640, -1934, -1116, 274, 1446, 1760, 1845, 830, -643, -1724, -1761, -1427, -96, 948, 1964, 1565, 459, -834, -1439, -1973, -1419, 269, 1205, 1866, 1395, 641, -643, -1788, -1991, -1021, -53, 1217, 1865, 1505, 602, -884, -1642, -1505, -1038, -126, 1368, 1709, 1486, 648, -745, -1345, -1615, -905, 74, 1237]
3349A237N29m07j099j226n48J37N27J152Q67J79j34j135j062p01k18J138J162
3366C98J042N40m28j184j592m01JO66J245J132L56q53n89j242r05K48Q80J253
3384E67Q13M01o09j017j152p51M08O19J212P83K59l76j086j093q39K51J172J153
3402G15Q55K99o55j122j402l08K83P91J305N98K26l25j311j023l05k24J087J315
3420G99O40M87j211n24j295q03M25R48J095P31M03q63j095j106n00N11R68J026
3438F36J054k48l79j324q44n29J45J033J235P20o3o62j045j130k50N32Q88R46
3456G15J076m02q16r53j002n80O22J297R58M87O7q63r84r00l48M76J044R81Q71
3475A746l83n77j242r31J0N0J118J318M78J05j147j187p58j07J42J091J260M34
$$ y = [1237, 1766, 1359, 260, -966, -1514, -1377, -850, 302, 1169, 1348, 1214, 79, -983, -1684, -1902, -764, 398, 1440, 1980, 1552, 368, -1224, -1625, -1624, -958, 287, 1419, 1775, 922, 333, -909, -1814, -1566, -686, 567, 1380, 1781, 1172, 155, -997, -1748, -1340, -721, 491, 1274, 1533, 1157, 71, -1022, -1861, -1610, -438, 715, 1570, 1869, 1214, 92, -1310, -1618, -1335, -544, 761, 1359, 1585, 1260, -51, -1074, -1379, -1603, -516, 799, 1439, 1926, 715, 191, -1104, -1907, -1482, -534, 561, 1292, 1695, 832, -263, -1369, -1869, -1358, -390, 636, 1690, 1442, 1063, -261, -1105, -1634, -1489, -456, 779, 1499, 1436, 774, -271, -1401, -1651, -1119, -231, 715, 1791, 1389, 573, -380, -1382, -1962, -1340, -43, 915, 1402, 1469, 606, -378, -1278, -1626, -1150, -106, 875, 1746, 1363, 786, -456, -1387, -1377, -1327, -209, 1109, 1587, 1692, 545, -642, -1400, -1507, -1365, -274, 986, 1420]
3493A420J5q92j403l82j31M39P84J247P48n37r78p26j108j40N95J013R95P62n21
3512A200p27q79j045m3L66J550O35L19j79p60j233n37l42N72J282R20L37n6j193
3531A87j176l15k37O25J028J142M30l98r40j260n98J29N03J194J070K55p73q12
3549E4r18p74M90M78J025Q60M47m00j005q87r37K66P62J076Q13L31m17j385p89
3568i10k80l97J055Q38R96Q0k95j149q37n19J1P31J214P78q3j83r44j061m52j4
3588a421P77J167O73K54l65j027q70o20K4R79R24R43J48p61j111k63r19K01P37
3607e30R28Q17N49o67j389p79l22J8R35J245N47O3o32j025p90l78J76J228Q51
3626H45L26Q1n18r03j150j07K59O36J224O82J53q94o72j231j08L74Q79R29P20
$$ y = [1420, 1435, 543, -860, -1242, -1373, -934, -150, 1097, 1845, 1308, 330, -396, -1504, -1644, -1049, -36, 959, 1721, 1200, 473, -406, -1451, -1494, -1128, 422, 1057, 1376, 1197, 437, -796, -1333, -1675, -1103, 179, 1099, 1436, 1380, 187, -989, -1304, -1541, -916, 112, 1254, 1684, 1286, 346, -914, -1512, -1383, -880, 314, 1384, 1639, 866, 54, -864, -1638, -1148, -670, 355, 1215, 1662, 1262, 257, -630, -1567, -1301, -539, 537, 1350, 1681, 1264, -121, -910, -1190, -1587, -532, 306, 1302, 1382, 1087, -62, -899, -1418, -1407, -676, 538, 1316, 1233, 1050, 106, -955, -1407, -1421, -644, 523, 1196, 1450, 1085, 58, -812, -1432, -1408, -429, 495, 1438, 1586, 825, -286, -549, -1468, -1267, -530, 398, 1215, 1764, 1097, -292, -1071, -1393, -1375, -440, 805, 1352, 1415, 783, -242, -1032, -1410, -1234, -6, 845, 1171, 1252, 734, -169, -1319, -1426, -1167, -531, 693, 1375, 1528, 634, -38, -1269, -1377, -1003, -124, 805, 1525]
3645A525j99n45j080r45O9K33Q71Q51M33K62p51j188p59k43O06Q62P81M37r7o42
3665D81j001o15k92L65Q64J018N82j00q68n99j153J10J85J227J038L96m47o90
3683E01r27q51L8M43P33P99N92R9j008q34q23m02R78N43Q36P21m9j000r68o43
3703a222j28K86J273O32O33k48r91q01m25l00M77J278O94L06n86n01j161o55L94
3722a045N02O02J265K75p31p28p65p64K81L09J096O76J76j7j022p62o90J4Q34
3741d94P48Q57J23l31q45j002k38k20Q78J042N94K24m37o45j228o43L56O80J166
3760E85O10K0l53q02p52o62M64L86P79P63J38m09n91r90p70K01J098O79Q84J16
3780A394r48l81j104k41K69M67J104O78J9n66q05r03l31Q7R81O75Q42J72p44o91
$$ y = [1525, 1326, 781, -299, -1244, -1175, -942, -71, 780, 1213, 1475, 724, -464, -1223, -1466, -860, 2, 783, 1220, 1123, 481, -520, -1135, -1427, -1062, -198, 820, 1402, 1302, 434, -165, -1318, -1208, -1023, 204, 1242, 1638, 1191, 501, -426, -1277, -1239, -796, -63, 736, 1328, 1427, 419, -415, -1238, -1640, -662, -119, 717, 1438, 1389, 389, -579, -1222, -1350, -1064, 209, 841, 1474, 1226, 235, -566, -991, -1291, -814, 464, 1158, 1464, 878, 377, -784, -1439, -1045, -543, 59, 1324, 1599, 868, 140, -625, -1389, -1108, -799, 297, 973, 1149, 1132, 110, -652, -1342, -1328, -494, 254, 1111, 1234, 903, 58, -944, -1182, -1402, -524, 518, 1112, 1336, 899, 254, -974, -1617, -1261, -581, 585, 1195, 1215, 862, 60, -692, -1354, -890, -504, 275, 1038, 1176, 767, 176, -814, -1584, -1383, -285, 394, 1278, 1394, 446, 65, -1039, -1280, -1011, -544, 560, 1238, 1257, 691, -114, -1017, -1348, -1261, -280, 395, 1237, 1409, 665, -26]
3800b6r80l96J59P19J320P09r7p43p09p88m44J55R04R57M67J90p00j020q12L5
3820a100J03O09J192L63R7m92j107o58k53K93O89J002O77j83o41j114k74l87L34
3839h50J144M28M80j45o04o75r61J06L50P90P68M35l91k77r90n64m67M88J080
3858A45M96P96k55p99p80o58m5N02Q68O17M30m72l63q23q96k7N68P37Q84N95k99
3879A221r96j004k83l71P12R97Q50L43m86m78j086n15j90O96R58N29N80l59r14
3898B04n86p78J40M37P22N31M94l19n92q10p01M7N30P77J003L94o80p38o22n98
3918a145k52Q35R50Q50k66j77p44m88r84J97P27P76O03O14l52j087p52k74l12
3937a281Q17J245K58J98k65r69r90l46j0Q32Q11R51J5l88r45q02k15j97Q42J141
$$ y = [-26, -1006, -1402, -1243, -524, 796, 1505, 1408, 665, -44, -832, -1276, -1121, -217, 740, 1207, 1397, 697, -323, -1135, -1100, -997, -388, 804, 1167, 1264, 772, -335, -993, -1246, -953, -264, 738, 1415, 1232, 591, -523, -797, -1184, -850, 294, 722, 1202, 1057, 453, -222, -1183, -1077, -727, 63, 831, 1266, 875, 598, -392, -956, -1423, -935, 145, 641, 1437, 1182, 383, -397, -1055, -1100, -598, 270, 887, 1317, 845, 482, -341, -1237, -1264, -696, 41, 925, 1520, 1221, 225, -779, -1062, -1433, -721, 276, 1126, 1469, 983, 505, -581, -1096, -1286, -590, 368, 897, 1477, 1118, 204, -382, -1160, -1020, -583, 139, 670, 1164, 845, 253, -557, -1258, -1211, -681, 96, 1099, 1493, 813, 75, -547, -1145, -1397, -562, 388, 1238, 972, 795, 51, -437, -1421, -1224, -497, 279, 882, 1496, 1144, 57, -695, -969, -1281, -464, 781, 1039, 1237, 972, 3, -987, -1333, -1343, -511, 300, 1251, 1266, 878, -67, -869, -1084, -1281, -439, 702]
3957G02M95J23m34q89r10l53L08P21O57P82Ro40n87q32j90j18J009O81O29J12
3977A275m53q65r53l77L51N81R43M89K55k88j240n73k10P5L84J397L57j24n51
3996D73p04q89j65M98M66R16N75R2r32o51l97k66M2P41N82R03K3p35p28n29m57
4017a142M41O28Q30M05L23j157n97q71l01L02J119Q01N60j45p34r85l55j01K64
4036g15O74Q69O09n43m17j128o37k9P16P66O56J72k32l16q07p06n2M31Q38Q76
4056A025K25n02k60j026n80K45K92O85P50M92n49n41q07p85N2N74J155M48M06
4075A299l40q51p58l57mK87R60O65K09k70p31p50n43N1P20O91O48M59o76m90q71
4096f52o18K11Q21P18M75J65n7j006j106m7p4Q59P57O86Nl28j059j18r03K28O17
$$ y = [702, 1197, 1320, 886, -3, -913, -1266, -958, -237, 420, 1202, 1211, 571, -16, -848, -1038, -1156, -147, 534, 1163, 1275, 822, -43, -996, -1373, -1022, -441, 502, 991, 1246, 958, -282, -855, -1065, -990, -606, 791, 1148, 1024, 473, -231, -1120, -1285, -787, -321, 595, 1170, 1262, 330, -321, -718, -984, -942, -201, 381, 1284, 1307, 572, -156, -685, -1142, -701, -73, 757, 1162, 1485, 328, -269, -1140, -1441, -1139, -20, 781, 1341, 1196, 462, -523, -878, -979, -715, -41, 828, 1437, 894, 477, -651, -1288, -1317, -601, 165, 821, 993, 761, 445, -362, -1068, -1120, -689, 149, 1025, 1250, 748, 488, -538, -1118, -873, -581, 104, 854, 1346, 797, 256, -551, -1336, -1284, -710, 445, 893, 1299, 959, 108, -650, -1007, -1011, -724, 236, 901, 1110, 840, 109, -641, -1184, -1133, -413, 278, 926, 1385, 709, 219, -652, -1270, -1059, -238, 480, 955, 1120, 1063, 57, -1049, -1096, -1170, -311, 446, 1132, 1137, 809, -250, -368, -1271, -1043, -426]
4117d26Q83L47L91o17n30o90m08L2M88J100M18P8n93m09q60k63j5P11R31R09n44
4138I33l00p13o89r2o4P21Q66L02K55n06o84p68k68J6Q46O32L48Kk87o36o93k88
4160a067K53O37Q53P0J24j80j172m60j82J16O34J045L91j43k14j025o20j05L45
4179g00M67J084O01o39l05o79q90k8L20O93O11M32K37r38p17q85M18J32R16Q00
4199I30J81rp63n92n97m37N87R76L91M11k22n06o04q68J4L46J094P39J13j19p86
4220B79r53k18l64O39Q47M41N84o09m12p68l50j01L27J049L30M54n42p29n60m57
4240a113n2Q38K78M43O96l34n57r46m18j17P78O65P99J77m50q23l68n35P4N80
4260c85Q93L41N03o26o30p99o04L83N30N80Q87j6m25p50r05k68O28L77O61Q62
$$ y = [-426, 457, 804, 1195, 578, 48, -642, -1050, -1018, -530, 570, 988, 1066, 473, 64, -796, -1059, -1074, -363, 568, 1477, 933, 633, -80, -769, -861, -925, -204, 662, 964, 1219, 713, 29, -739, -1007, -991, -145, 487, 835, 837, 550, -86, -779, -1067, -814, -177, 676, 746, 870, 690, -482, -942, -1124, -1008, -374, 671, 1062, 919, 705, -320, -940, -1045, -700, -233, 851, 1452, 813, 508, -171, -1061, -1089, -769, -76, 535, 967, 1204, 266, -451, -1336, -918, -786, 130, 930, 1111, 1102, 339, -253, -850, -1287, -700, 276, 667, 1078, 856, 350, -254, -1122, -1108, -762, 332, 1071, 1184, 1065, 279, -674, -892, -1256, -617, 230, 671, 1255, 646, 234, -534, -884, -985, -658, 391, 721, 1175, 633, -96, -656, -1113, -1165, -327, -49, 394, 1090, 756, 199, -747, -1165, -1282, -504, 161, 960, 1137, 687, -136, -504, -1039, -965, -385, 508, 849, 1352, 726, 96, -703, -1307, -924, -394, 186, 1073, 1057, 632, -118, -1023, -1291, -663, -286, 375, 1237]
4280A237k60j94p70p19l17lM85J206L10J45l66j084j91o91J79M41J114M95j01
4299I16n54p35k18o87O42M21N64O37J29m09p87q35p0o1Q94O89M33Lm52q00n85
4320h65k20L76L38J080J60j96l22o49l92n80N59R63K46M25J02p73m90j008L51
4339h95Q6J052M74L20m7q38m50m97k76M90O27Q02KK46n19r72n85m7N14M44J040
4360I71o7J06p43q87N5l64L55N97P11L13k79o20o15n35l92P84P23N85L31j22r04
4381Cr11j34J22K16O08R61K92l72o36p87k89OK30Q42O60L03j28j004m94o23K66
4402h69Q7R06J084j29m50m18m98n74j20Q34L73P03k8n4o47o48m63J22L10P30N38
4423G89L06n02n88p54l35K22K12R42N50Nj93p67k14m30J13N54M74M12K67m45q44
$$ y = [1237, 977, 783, 13, -706, -1023, -1026, -541, 665, 975, 1120, 754, -330, -521, -1212, -1033, -592, 522, 1017, 916, 362, -373, -591, -1278, -636, -215, 349, 986, 1115, 706, -81, -916, -986, -1047, -153, 536, 969, 972, 520, -280, -865, -1085, -709, -371, 709, 869, 673, 351, -298, -690, -1270, -711, 252, 498, 923, 1025, 252, -238, -1246, -895, -809, 243, 717, 1037, 990, 152, -298, -795, -1071, -581, 46, 848, 850, 1096, 577, -395, -980, -1027, -513, -69, 971, 904, 1010, 267, -620, -565, -929, -574, 23, 734, 1047, 768, 148, -467, -1002, -1394, -610, 113, 698, 1029, 907, 3, -908, -1042, -920, -704, -96, 865, 1157, 785, 149, -638, -927, -921, -691, 151, 811, 1114, 986, -18, -512, -1135, -869, -782, 124, 1208, 1079, 629, 211, -287, -861, -981, -147, 226, 929, 901, 847, 200, -448, -911, -789, -479, 251, 789, 1095, 593, 5, -749, -1084, -862, -650, 292, 842, 847, 654, -113, -327, -757, -644, -90, 384, 796, 1063, 618, -226]
4444b26m82k92K31L05Q30O89j06l22q27p08J1o4P79O35O09K19o79j008m25k58
4464a089L28P11M86M80N1m39o73o29k81J68P22P22M52L2m23r86k96m84J58R43
4484d7Q14K98j38m88o23r25j13M39M90Q42N06k73n96l51q06Q4Q2P25J025K14m18
4505G41o19m87l80l64L79R14K28Q02m97l72n65n00n59O98P37P11L4Mo61p10l86
4526h52q2L15O18O24M55j28q48o48l93R0J53Q91L66M19j6r23q78k83j64O27L92
4547b65J138J21j75o72n20p42J93O00M22P08N58n70l66j054m41Q6N76Q60K48M15
4567A120n32n99p48j44J22K81Q15O86J16m58n50o25l40J40L96O51O23N3M6j126
4587g3o59k74R7N91Q70N97j40l76o71m58o99K74O58O78Q01k68l51p61n04k82K57
$$ y = [-226, -708, -1000, -769, -464, 366, 1055, 949, 627, -200, -908, -897, -961, -182, 453, 1062, 1281, 602, -406, -831, -1089, -761, -50, 436, 916, 967, 528, -145, -774, -1055, -887, -165, 557, 1009, 1041, 618, -368, -664, -1148, -990, -47, 767, 1065, 927, 439, -184, -1109, -1222, -783, -293, 549, 1055, 782, 186, -165, -971, -887, -805, -80, 945, 1159, 741, 122, -365, -745, -1109, -730, 184, 412, 1214, 717, 345, -220, -720, -1279, -581, 156, 867, 901, 905, 244, -466, -852, -934, -619, -1, 623, 1078, 950, 102, -546, -939, -849, -696, 195, 561, 980, 964, 41, -837, -1120, -1284, -657, -265, 873, 994, 819, 147, -373, -1115, -922, -322, 100, 808, 1366, 796, 430, -624, -1065, -979, -403, 457, 705, 1120, 588, -11, -759, -903, -781, -500, 315, 1001, 1117, 659, 109, -516, -856, -716, -320, 331, 954, 1007, 1053, -73, -732, -1006, -909, -318, 552, 1149, 1009, 633, -38, -496, -1195, -921, -263, 415, 1216, 948, 597, -164, -668, -950, -693]
4608f93M89Q59N62o8m58q72o94m40O67L27R80N31l73j28o67p99K0J22N44P41N37
4629A187l49l12p66m19n13L71O79P68M18j54n43l85q68j26L16P10O26K8L89m18
4649F39r85n50k32L62Q71P08n0L10p20m56o06l18M59N94N59L85j81l22q81p29
4669a143J34O18O30L72O27m03m90r99n56M57j53R98R45L21n18n83p38n63j53P71
4689d26P76L11P85o21n87q24l99J06L38Q34O74J48m76o08o87l30l08P94R15K33
4709F48O11m05o39q52m29Q7M04P90O30J7m07k78p02k64j50P35P50K81L53l39r28
4730h7o43n54L57P50J037K10r0k89n33r88J23k83Q30N78Q66n33j0r29o94l41J80
4751a043P64Q88L45Q1o75p39k17m37L00N74N65N55J46o11p50p89L08P5K80Q06
$$ y = [-693, -204, 655, 1217, 1149, 691, -181, -875, -1315, -648, -321, 659, 1190, 817, 689, 22, -777, -757, -635, -91, 650, 1187, 838, 526, -240, -659, -1172, -801, -122, 646, 1064, 910, 367, -18, -886, -1012, -696, 14, 640, 668, 1057, 639, -346, -896, -1128, -766, 105, 813, 763, 1073, 353, -103, -709, -1027, -568, 26, 585, 970, 789, 467, -414, -1143, -1009, -391, 239, 611, 1238, 835, 345, -654, -1210, -753, -906, 92, 1037, 1358, 840, 257, -481, -1044, -1197, -426, 350, 661, 1446, 825, 238, -586, -985, -879, -541, 293, 967, 1115, 639, 31, -656, -986, -1294, -500, 415, 648, 1259, 854, 215, -637, -1066, -979, -575, 215, 845, 862, 455, 177, -525, -789, -939, -204, 546, 827, 1180, 841, -87, -730, -1284, -927, -177, 860, 1070, 980, 691, 158, -830, -707, -990, -160, 418, 1284, 751, 741, -188, -882, -1223, -1043, -279, 609, 954, 1035, 360, -379, -596, -1033, -733, -159, 406, 961, 1107, 496, -254, -1043, -735, -660, -380, 426]
4771D26O48j94o37l57o41l63M5J084Q44J50k86k64o32q37k05K64Q90Q98K71k06
4791H98m95q33n20p2K06O18J125P4j83m29n94p48k29N04P17O81L49k66n30l65
4811i2p55k22M76P66O61K62j73o48q52m09r5L72Q08O74L95l87m46j068k61j43
4831a137L58Q90N79M31k93p65p99O1m04N97Q82L61L58l50n80o33n69M24L34M19
4851A64N60J73j52n03r44l98o0Q49M71M34N07m86o55m62n80K77L94N17O92M62
4871A260n06q53p53n7KN85O36M06M18m70r22l40l05k75Q34P73N62m8j46p95r40
4892i34k07L25L74Q06Q32L7n05r39l86m69M80O92L90P26j07o29p13n64p1P1N26
4913b65Q70N60j13q46o70l38l62N30M03P49M98k25k80o05p13j6R2P60N78M97K2
$$ y = [426, 1074, 880, 243, -114, -755, -1118, -1073, 11, 855, 1005, 719, 455, -177, -1014, -1219, -955, -65, 833, 1104, 898, 403, -430, -950, -1022, -816, -198, 927, 1001, 818, 389, -205, -953, -1182, -678, 39, 720, 1069, 803, 273, -92, -847, -1069, -593, 173, 834, 1096, 923, 275, -577, -986, -1081, -709, 99, 773, 1168, 781, 335, -733, -994, -1137, -779, 111, 690, 1121, 828, 63, -736, -675, -1079, -482, 400, 761, 1119, 769, 189, -444, -1013, -589, -255, 164, 724, 897, 745, 242, -702, -1100, -1160, -311, 160, 594, 1101, 615, -40, -502, -1082, -805, -411, 106, 798, 1260, 754, -99, -852, -909, -907, -322, 314, 720, 1138, 668, -254, -594, -899, -1174, -340, 433, 995, 947, 801, 6, -934, -1141, -816, -442, 364, 1196, 1233, 728, -211, -597, -1066, -586, 106, 496, 1222, 1115, 486, -227, -791, -862, -791, -265, 605, 1165, 1052, 206, -464, -802, -1164, -634, -231, 518, 1016, 791, 511, -94, -807, -823, -731, 29, 607, 1104, 1126]
4934A126o54o65r38J69K50O82M60O75M0n41r94q26J60L98M30R83M35l19o66n39
4954c34m02l10L08O82P83L90j97n11q42o78R2J90Q90O42J41J68q32o04l80k11
4974a015M04N50Q69K27n7p00n22p50%M12N90O98M17j60n00j029l21j82O70L59
4994d0R49K62j63p75r10k43l29R11J77J061k9p9p15p38j29j38N53P79O10o3L8
5015I89j020p73k03N0M71O76P12P9l86l25j020j49J7M15R71L79M74p00m72q07
5035f22n10J05N39P22P62j64j81o36o66n39J69J132K54M63M5j55q23r02m9J15
5055i41N01R74N06J36m34j069l53n49M41O06P79M51M0l69o54j016o4M74M18Q10
5075F87J90K94o10p36p48j22J68O02P56O72k81m50o40n31l71L3J024M85R09k84
$$ y = [1126, 472, -193, -1131, -962, -712, -30, 430, 1105, 1145, 604, -390, -1216, -1056, -658, -228, 755, 1190, 871, 205, -334, -736, -1046, -738, -56, 727, 1117, 920, 409, -433, -1111, -1019, -829, 61, 703, 844, 1012, 180, -424, -804, -1015, -611, -61, 808, 1035, 978, 278, -244, -994, -994, -582, 8, 706, 1123, 963, 463, -566, -887, -1069, -399, -40, 909, 1171, 1008, 233, -677, -920, -1249, -338, -161, 900, 871, 792, 77, -661, -790, -928, -375, 404, 1014, 951, 989, -31, -804, -1007, -957, -486, 190, 902, 981, 595, 270, -750, -899, -882, -467, 504, 883, 1357, 657, 185, -622, -1132, -1027, -488, 234, 996, 832, 651, 15, -651, -1190, -1021, 111, 365, 828, 873, 718, -105, -1007, -1056, -941, -440, 534, 1040, 1176, 742, -327, -680, -1229, -788, -182, 597, 1048, 1088, 719, 65, -951, -1015, -541, -123, 687, 877, 1171, 561, -175, -923, -1045, -877, -275, 481, 1153, 872, 422, -218, -749, -1120, -1087, -63, 422, 1331, 1047]
5095A047p68l51p37q5J95O31O35M58j53m34q79m39j48J55L34J402J54j11m50m26
5115C0j228K43L2R19Q64K88k78o18q93l44k61O76O08Q39L42k06p19o61o66k13
5135a246R18L97P44L46m30p29l37n35m5M33J100J19L70l86n89p51o90K31N79P98
5155B97N10K80j31r64o98l70K64J35R94O92J39k21o92p76o98L97K45O51P34L39
5175A127n09o19p50l43R0M19J011L58M44m99l64r04q23J49Q78R61M52J23m58q34
5195i1o34k80J20M97R04P25p7m12q94p58l02K99N29R62K30L05o81n66o59l63K15
5216i31M81N76P62Q2k56j051m67k54J31Q16O77M68P6o82q89n01k5N01M34P21L46
5237A015J59n51r59l23j63o8R63O47M14q2l05j218m34j81L84O78O70N73j48n17
$$ y = [1047, 279, -72, -809, -894, -699, -68, 567, 1025, 872, 438, -441, -880, -1028, -873, -539, 863, 1017, 906, 456, 30, -1198, -955, -923, -4, 860, 1148, 870, 252, -641, -985, -1246, -570, 38, 877, 1219, 1013, 294, -367, -1033, -1246, -328, 69, 813, 1159, 729, 0, -337, -872, -917, -484, 616, 735, 1105, 719, 130, -621, -1311, -1080, -501, 297, 807, 1087, 956, -8, -706, -1076, -812, -677, 317, 1009, 1148, 927, 235, -541, -1239, -842, -597, 54, 788, 1127, 618, -1, -751, -1094, -1004, -585, 426, 784, 1228, 729, 365, -539, -1362, -1213, -335, 626, 1078, 1201, 743, -91, -725, -1005, -885, -388, 516, 1241, 1164, 752, -142, -900, -1202, -903, -374, 588, 818, 1123, 442, -124, -783, -1146, -931, -450, 126, 888, 970, 714, -337, -804, -1058, -927, -111, 566, 1034, 1110, 428, -461, -962, -987, -486, -52, 669, 1015, 1174, 623, -336, -659, -822, -890, 73, 720, 1134, 1052, 747, -471, -905, -1086, -702, -24, 646, 1219, 1071, 554]
5257E54j109k97k89O00M36O44M49jo23m88p07k94L07J050N73L95p0r45o42n53
5277a010j08L50Q21Q45K17nq20o95p68L21K20J042M80J65r3o31p33n90m1M19P16
5298A02R40j18J20q25r79k70R2M82M34J004R3k32o19r22l49J24K42R25N34L89
5318A167m49n51q87n17J59P01P27M57K49m24o43m79n15J36N38N71N42K49k89n85
5338A57j027k47R2P00N66R24k97n93m43o22l04R6P14M44P22L59l79q02r08j95
5358a043K11N80R93K16r2l71o46o09k80J85N62P13P08j13l84p44q34m07N10N04
5378c41P26M57K91n52o55j057J46P05J27O58N30J64q04n40j013K68j31O12Q90
5397D81M76J99p79q63n00K29k92J128N19N76k52m92m53j059l4K73J116O26P5m
$$ y = [554, -555, -852, -1141, -541, -105, 539, 988, 987, 364, -124, -831, -1125, -818, 232, 805, 1200, 1130, 185, -457, -1010, -1118, -768, 53, 898, 1115, 1110, 290, -405, -1173, -852, -632, 410, 890, 1055, 962, 331, -402, -992, -1033, -614, 102, 1042, 924, 1044, 219, -760, -1030, -938, -456, -22, 982, 1075, 843, 224, -698, -1047, -923, -681, 244, 778, 1167, 718, 167, -720, -1237, -1078, -377, 350, 807, 1056, 632, -11, -490, -1005, -869, -331, 240, 782, 1031, 742, 157, -870, -1117, -1025, -325, 241, 1165, 868, 275, -168, -790, -1094, -998, -284, 160, 882, 1241, 862, 60, -848, -1043, -832, -252, 741, 957, 865, 494, -152, -761, -1041, -856, -294, 419, 1127, 1014, 630, -114, -948, -1355, -845, -341, 385, 842, 1133, 581, -74, -1131, -985, -280, -153, 505, 1035, 1199, 395, -145, -1158, -890, -1021, -409, 481, 957, 1156, 377, -486, -986, -757, -1049, 79, 598, 1174, 922, 430, -23, -1082, -1116, -843, 273, 899, 974, 970]
5417I70n57r16o06K10J91P67N93L53K10o86r39p79ON48O08R88J06j70n20r81m60
5438a064j11N59R84P31N0l19o90n13o78p6P57M44O27M00l53n30j033l90K35N17
5458d53L31P38L84K7o41r00o52L30J47R28N52K91l00p69p42n59J62Q61N74O00
5478I09M1j24p12p68l39l0O33P75O20K63m39p19p76m22m1Q40P54M66J64m46p82
5499a33m04p35M89O78M87Q21j76j20j183n78j49J02P63M91L23M39n20p96o04m7
5519h52q4N77Q56L80L23o43o33o60l92K04O64P35N50o8j77j058m56k86L21M67
5539b32Q31O73rp98p30o93p3r0P89J020M99j60o03p65m29m41K75J021N16N65p1
5560A095p41n14q02k79M58Q72O35L15J28n38j166n63k1L25Q37O11M23j06n58r28
$$ y = [970, 413, -503, -1109, -899, -708, 59, 652, 1005, 1215, 529, -410, -1189, -1183, -635, -27, 961, 1067, 897, 377, -604, -1064, -1175, -616, 368, 1099, 1149, 830, 140, -373, -1051, -1127, -370, 74, 701, 1101, 748, 218, -815, -1205, -970, -453, -122, 616, 1000, 1027, 386, -514, -1166, -836, -689, 239, 791, 1082, 782, 13, -729, -1288, -1126, -265, 309, 909, 950, 826, 114, -654, -993, -1023, -390, 385, 1005, 1268, 829, 110, -666, -1088, -1129, -289, 465, 931, 1095, 649, -133, -537, -1272, -783, -105, 382, 1203, 1027, 907, -276, -854, -1003, -901, -138, 353, 676, 1115, 595, -201, -805, -852, -936, -359, 497, 877, 1200, 557, -76, -736, -1128, -924, -260, 475, 1025, 957, 780, -278, -734, -1020, -699, -232, 599, 1272, 1263, 465, -265, -958, -1031, -1121, -332, 688, 1187, 1027, 424, -341, -770, -1211, -936, 85, 601, 1166, 1095, 354, -160, -962, -1241, -783, 89, 724, 1039, 1167, 629, -537, -1100, -1121, -796, 41, 652, 1075, 969, 411, -517]
5580e17k08k96P4J211L87L21O4p57o21o26k42N37O50Q68J91j90o10p65n51O2L08
5601g10R71N46L82k84o17r31m37j21O91Q11O81K78n48n66o61p11M20L07Q23K99
5621F23P38n59q36o02o62J48O63P50Q11N0l41o50p81l93k2R64N56L19L15m51o19
5642B1o82k78J11M69P73L27J46q9q41r59Q6lN61R94J71J71l02o26p30l41L22L85
5664c14Q50Q00l57r9j096o60n33L69P47L95J189k61k80r16q58k15K94Q87O91L20
5684I53j48l22o87p04j84J19J019L11P48k78k53r95n55R4R1N75Q70M25j29p15
5704B35n11o82k06L28O04J248l9n7q5r85p54j32J31O77Q19M77q6r37l80l89l70
5725a094K69N52J162L71j70p63q40m16l13P02Q92L74K99L3o82j100j22j44L23
$$ y = [-517, -725, -1021, -947, 264, 651, 972, 1036, 279, -342, -968, -1210, -673, -23, 845, 1036, 846, 236, -529, -1080, -1018, -710, 261, 807, 1189, 905, 288, -643, -1080, -1201, -510, 301, 982, 1260, 712, 146, -515, -1226, -806, -499, 324, 623, 1361, 802, -34, -636, -1298, -1150, -487, 263, 1074, 1124, 783, 133, -648, -1041, -1063, -99, 457, 776, 1091, 640, 21, -661, -939, -828, -359, 414, 741, 887, 798, -43, -1002, -916, -919, -358, 636, 807, 978, 676, 50, -680, -1021, -699, -314, 536, 1336, 979, 880, -216, -876, -1409, -1040, -293, 102, 1291, 1030, 750, -166, -1024, -1239, -945, -58, 633, 953, 805, 483, -204, -908, -1092, -973, 46, 357, 1105, 827, 574, -421, -976, -882, -791, -216, 654, 1079, 950, 235, -276, -958, -1164, -836, -232, 1016, 977, 920, 835, -150, -904, -1036, -905, -228, 591, 1068, 982, 45, -335, -724, -1094, -825, -273, 889, 1260, 1090, 327, -513, -929, -1242, -540, 352, 726, 1025, 1058, 376, -724, -846, -990, -667]
5744f67P09Q55K02j97p52l36r61j12N21R77L63N18n3j003n46o10m0M09O18J047
5764I42K02k65q74m46o46K13K57R59L91K51q0o95o97p06K22L84P33P01J76j16
5784I06p54p69m97m8P18Q14P92j51q6n84j159l4l7N47O52Q20mm33p39n40m49K9
5806a006Q83N66M74J8q9o56q69m65L51L56Q65M05nk8r48n66j89R3L31R17L93L13
5828A144o16n73r43j82J59O92R82M82r7o90o76m82n51N51P13N58O12j15o28m27
5848h7q60l07M76R24O40J31J38l98q33n74k20K43Q57N96L79j73m28n17p76l58
5868a147K54Q61P57J01L64r58p65l55j17L75L90R97L50k66n03p40o62K40L34N76
5888H6O41L64j90m35r02k35k18K09Q64P05K20L5r75p90o57K62M89J052K19L65
$$ y = [-667, 42, 897, 1099, 902, 150, -186, -1147, -1259, -738, 239, 602, 1120, 1067, 64, -482, -1092, -1132, -723, -105, 942, 1144, 879, 5, -441, -1087, -874, -617, 342, 733, 984, 904, 209, -488, -1194, -972, -588, 145, 846, 1022, 906, 152, -617, -1114, -1162, -444, 370, 1162, 1011, 925, 341, -818, -852, -889, -342, 310, 1130, 1126, 693, -46, -586, -1035, -1006, -123, 443, 917, 935, 846, 190, -679, -1144, -793, -437, 428, 833, 828, 800, -148, -714, -903, -810, -479, 438, 831, 1144, 528, -45, -988, -1170, -1011, -319, 663, 1145, 1048, 358, -318, -800, -1351, -800, -87, 471, 1083, 968, 340, -87, -947, -1254, -778, 146, 786, 917, 1055, 657, -176, -750, -970, -727, 130, 726, 1105, 932, 504, -13, -789, -1147, -893, -32, 725, 826, 1190, 232, -533, -888, -1005, -630, -240, 757, 1107, 841, 338, -402, -1064, -824, -490, 86, 727, 1091, 901, 466, -436, -671, -889, -680, 184, 889, 1109, 1144, 169, -621, -1278, -1016, -527, 525, 744, 1109]
5908A109j71p56r18l89L41OP61Q37K34k34m28j217j12j57N50P44N77M12m82o42
5928F5o03l57j46N73R18M02K39j18p00j073k02j48Q37P81K97L92o24l17q25o11
5948a220L92M27R16L13J26m93k19j089l14K53P46O44N83l4l40r07n98m20L81O61
5968a92N98P57j3m26o53o44o96J94O91R54L82J36n83m32p44m51L75N88O61N61
5988A063J4l97q78p69L3J82P51M68M80m6n58m79p50q0J07P83M35N17K54o53j017
6009e40l89J1Q9P29N67M01j2m45p27o64k37O56P45M97M49k58l46p54o95J9J02
6030h02R84M93M15k69m92r28k07o9K84O53Q75K48k28q10n26o72J38M21N24Q43
6050H75Q9R1q21r40n56K04O50Q75L37K17m81k45r06o80L22L56P47P53J89j61q60
$$ y = [1109, 938, 182, -736, -1125, -784, -778, -17, 820, 1054, 820, 392, -825, -937, -1094, -544, 200, 777, 1189, 707, 65, -538, -895, -1041, -468, 450, 852, 1091, 973, 273, -800, -1002, -1150, -313, 468, 765, 1157, 533, 216, -609, -1220, -828, -401, 515, 828, 954, 461, 242, -847, -1161, -908, -162, 482, 1065, 1031, 691, -216, -814, -1234, -853, -192, 406, 1163, 1150, 724, 71, -573, -1269, -1075, -384, 570, 952, 1088, 505, 73, -671, -1122, -747, -159, 502, 1063, 1077, 680, -198, -967, -934, -752, -1, 467, 947, 901, 343, -136, -886, -966, -859, -76, 359, 876, 1130, 477, -540, -929, -918, -829, -100, 467, 868, 856, 411, -316, -980, -1217, -561, 184, 681, 1130, 872, 526, -228, -923, -904, -802, 182, 675, 1090, 821, 329, -599, -806, -875, -591, 62, 937, 1185, 957, 147, -379, -1051, -913, -492, 32, 875, 964, 1055, 234, -706, -1262, -1058, -408, 467, 804, 1021, 540, 295, -611, -1291, -969, -613, 134, 887, 1076, 915, 55]
6071E5n31q31L33N64L25R16N05n37q86n01k87j8L53P20N06M54o55o80k46l97k69
6092a107P00P29N02K05k70p65n42m98J19N24Q03N96Kk39r26n13o44L74O15Q23
6112D88N49k14j80n98r44j94K18O36O04P30jp32n69m68j17l6Q65N00K91Q6l47
6133E67q59m43k76N0Q73Q60L49k13j47r94o61l88L61N23J082L62m18l00n78o98
6153i48J41J2O02O93M93K30p19o41n51o75N30Q53P94M12o7p35q50m23k96N77Q21
6174B53M59L13j81m79q79l80N0L77M80O56K90k0r03l23o53K3J38J044M99K80k92
6195G52o25q33n14K68L16P20P02K04j89m36p65m88K6L53N50M30O85k94p66n40
6215d44l98k32M60P32P92L19m54o50o16l14k09M20R71L43M7n9p20p41l41M18J31
$$ y = [55, -476, -1307, -974, -410, -85, 831, 1336, 799, -87, -588, -875, -893, -540, 180, 686, 1140, 485, -195, -441, -838, -1107, -407, 322, 824, 1029, 759, -6, -548, -1046, -927, -403, 400, 996, 998, 759, -167, -680, -1324, -950, -335, 488, 1037, 823, 643, 45, -899, -1093, -875, -239, 365, 1095, 1094, 362, -207, -675, -792, -828, 37, 537, 828, 914, 567, -292, -735, -1011, -961, -88, 772, 1121, 908, 761, -233, -894, -1282, -921, -398, 684, 1046, 628, 328, -250, -948, -807, -795, -193, 500, 993, 1223, 504, -137, -688, -1363, -833, 20, 814, 1226, 1159, 424, -426, -849, -1145, -568, 253, 712, 1025, 844, 365, -514, -894, -844, -467, 13, 669, 959, 939, 36, -287, -940, -917, -779, 265, 764, 1044, 752, 127, -706, -1220, -952, -636, 84, 786, 990, 801, 365, -400, -888, -862, -509, 41, 471, 1156, 862, 96, -444, -842, -1074, -614, 118, 910, 1229, 775, 125, -491, -805, -1014, -594, 377, 720, 767, 708, -12, -753, -1094, -676, -545]
6236e45J019L59J42j68q06o26l89K84K67O75P53K42o46m65q59j43m1P97M68P91
6256A109Lo95l38p76j06j07Q01M74O14N2l91p50n25m25K8P52O59O33N9m98p94
6277b21o84j97L68N64O33O48q8l06r34n44l75L46P01P64L49l9m47p48r70L76P
6298g97N59Q00L37r7l21q52m44l15L70P60N61O45m83k68o25l29l78K44P66L77
6318E10M48J1n88m95q68j47L63R74N33N05j81p49o73o25QL69P12P40J4k41m70
6339A50o35m44j56L45P73N55N48k26n84m89p05K1L27Q07N58J79l41o35m15o80
6359a047k29O41Q68L81K87J53p33j036m99K91O84O43K50K73j45p22n49l25p0O91
6379a93M06N69L54l81n58n49m73j22N66N15N13K42k53n43p02n90K73P27M11Q14
$$ y = [-545, 474, 833, 975, 807, 1, -625, -1014, -730, -463, 212, 965, 1207, 561, 96, -763, -906, -947, -150, 318, 1109, 1112, 417, 79, -697, -803, -910, -109, 365, 979, 1031, 640, -110, -635, -1060, -1032, -280, 379, 1012, 1071, 573, -221, -905, -1102, -734, -170, 463, 1111, 1023, 717, -217, -761, -1136, -790, -89, 675, 1024, 985, 538, -210, -1180, -804, -797, -238, 562, 899, 802, 481, -371, -815, -1130, -760, 0, 561, 1206, 723, 455, -170, -499, -877, -633, 133, 510, 958, 969, 381, -114, -982, -1129, -766, 208, 741, 1246, 1065, 316, -357, -982, -974, -605, 107, 847, 861, 620, 150, -485, -929, -1085, -740, 33, 588, 1136, 910, 326, -163, -868, -847, -520, 287, 845, 1024, 683, 48, -367, -1047, -1276, -635, 233, 614, 901, 1054, 321, -715, -1214, -923, -239, 404, 654, 927, 782, 60, -489, -814, -884, -193, 213, 782, 1136, 755, 197, -352, -825, -947, -381, 134, 647, 889, 636, 93, -609, -1199, -926, -199, 212, 1026]
6399A026n26R5n56p29n4k10O48O32P71j75m57m98o38j92L3M83O73N14L3l01o36
6420f4o86k90L01M98N91N37j0j81q80o11k37L6J036N87K76L5m42o90o16k21O9
6441i62R50N17M02j0l71r72m38k6M38L81N81N84p3k34j098k89m17L20R94J80L37
6462G94j84l65m47p05k28L32Q61M32K69j04l13n86p94r2P40N05L89O24m35m02
6482B91p36p04K23M38O05P03J37j67n95q43m3p9J98P63M76L85m29l81j013k27
6502i98J37K18Q92L89J18k28l90o65l20J67M44L52P09K28l16o78m51k45j77P36
6522g8L65Q03M8m68o81p27R6L4K96M69O88J31k56o33p89k13J02M31P15M54N9m41
6544D05m23q34l0K2O60O34M64Mm29n26l76m55J22O65M25N93O3k67p70o37j29j87
$$ y = [1026, 500, 595, 39, -690, -744, -954, -306, 326, 1097, 922, 465, -33, -671, -863, -830, -347, 326, 840, 873, 572, -64, -750, -1040, -739, -241, 350, 887, 877, 696, -184, -795, -1032, -996, 40, 627, 903, 938, 496, -194, -810, -1031, -962, -12, 505, 907, 897, 526, -446, -884, -910, -472, -91, 490, 1074, 1001, 767, -331, -620, -1037, -717, 277, 457, 794, 610, 245, -202, -907, -1135, -803, 58, 490, 759, 655, 342, -244, -1038, -1130, -390, 115, 504, 1128, 693, 291, -445, -1149, -926, -488, 117, 820, 957, 790, 195, -648, -691, -770, -572, 191, 667, 1052, 623, 242, -771, -998, -861, -643, 249, 638, 756, 528, 138, -527, -847, -680, -236, 116, 825, 1053, 737, 59, -392, -637, -814, -78, 287, 1090, 1138, 670, -11, -738, -642, -608, -312, 157, 845, 976, 720, 87, -702, -915, -813, -382, 333, 787, 846, 405, -18, -852, -882, -860, -200, 434, 898, 902, 473, -53, -429, -884, -762, -97, 328, 921, 984, 717, -53, -690, -819, -1006]
6566a006Q82L76L83Q1k84n73q72M9K05N37O97M30J81n75r18m98J3J77M59P80L05
6587H29l9l19o47p42k22L39N35R52P2L6k74o63q25j5L79N32M83N73k59k70r01
6608d46l20l04M66N52N80N13j74o97k55p52j7J38P18P66j1L68j192k70m57j12
6628i06L43O71M64M46l23k44j056m89K11J20Q27R18l47j53l80o98k1j73K74N58
6648D2P03P7k60l78o56l19l42R10M35L95M26l42m84n98m18l2P96M98O2Q5Pn89
6670A8l97m12j17N37Q34L8K30k07m71o79j16R1M77N09N25R2m97m36o74n95O30
6691f20J41J062L59j72r4o68o56p2OO20N29L85K24o81o70j5n73J05N97N58N25
6712H90%l10q81j44l12K16M41L53M78M05j050l02m50j85K07N01P84K29J76n89
$$ y = [-1006, -124, 252, 635, 716, 432, -141, -1013, -964, -759, -222, 475, 905, 1086, 511, -407, -905, -892, -715, -256, 524, 829, 790, 471, -176, -918, -1140, -801, -266, 686, 758, 794, 520, -143, -968, -983, -604, -72, 411, 984, 725, 455, -446, -766, -1070, -604, -52, 528, 1041, 867, 170, -85, -837, -854, -716, 2, 768, 757, 1125, -67, -337, -794, -906, -563, 108, 572, 1018, 695, 451, -605, -1094, -883, -763, 64, 982, 635, 482, 102, -596, -617, -790, -516, 42, 745, 822, 562, 184, -472, -791, -1133, -223, 212, 607, 1033, 691, 207, -391, -809, -841, -45, 453, 515, 600, 607, 18, -379, -791, -908, -371, 463, 501, 731, 524, 53, -626, -742, -651, -174, 335, 860, 952, 455, 19, -655, -1250, -620, -479, 583, 942, 770, 676, 8, -648, -720, -714, -94, 435, 820, 1044, 363, -307, -322, -895, -790, -193, 365, 890, 890, 580, -301, -445, -757, -541, -100, 253, 731, 1136, 86, -216, -666, -851, -644, -143, 641, 870, 1046, 457]
6732D57q87j33l31K62P70N4N20L2j048J10n18j52M30M93N88K62j61m54n45o53
6752i04J29K10Q08L64L10j62m90o14j95k38K56O65K14N10K67q85o99j89r1K7Q86
6773A79M58K91k18n71m93l34j67L86P35N17j52pm40q25k20j73P36M53M23O2Ll83
6795B60o05n07J46L97N86K90J0J45n61n91l54P4M67O23L28J39j96n59o45m41J83
6816h11M75N86M79K71k85q04m34k94K14N49J32P76j47k37m80m17n25K71O74J87
6836A80N86P7k58m57p76o1K56R9O95N12J4n78l89m76l54K83O15L25L62J82o23
6857B14m18m79o2K50K32P07L68j2j88r21l59l42N04M82N11n9M88n03o73l26j22
6878g08r2O43M94K91j33j85p22k66p4M81N25K55J53m8l58n46m71p9M48N47M61
$$ y = [457, -430, -563, -894, -632, 138, 192, 712, 744, -304, -194, -712, -864, -434, 59, 647, 909, 748, 294, -251, -904, -775, -565, 243, 607, 917, 755, 265, -349, -544, -782, -526, 139, 353, 863, 1130, 245, -454, -643, -734, -707, 179, 637, 928, 710, 139, -354, -688, -855, -469, 266, 783, 631, 624, 184, -641, -861, -1034, -298, 155, 578, 640, 643, 260, -345, -852, -706, -309, 277, 567, 577, 722, 161, -430, -784, -710, -243, 380, 708, 847, 651, 92, -553, -994, -811, -336, 250, 729, 1000, 715, -89, -523, -817, -603, -54, 78, 854, 707, 470, -10, -427, -952, -681, -7, 180, 766, 843, 585, 128, -648, -709, -453, -354, 341, 853, 867, 289, -100, -576, -930, -647, -32, 293, 655, 837, 214, -204, -683, -745, -495, -263, 444, 812, 800, 612, -309, -668, -1010, -506, -24, 487, 428, 916, 413, -260, -586, -708, -800, -157, 337, 628, 495, 310, -412, -678, -752, -271, 254, 509, 662, 614, 256, -290, -761, -840, -392, 155, 616]
6899F16J50J82q07n49m24J68J79L99O96k2J94q97J35o96K76M2M15M55M70l49o21
6920A2l79k87r7N11M08M37J41j81m64n74m16m2N05M78N36L32m07l40o25k53J2
6941f93K46N61P61O5n22j50q41J13j61J63O61K35M22m25n40k67k88j70M77Q70
6961E17K02J13k3p43o61l85K81P15L26L17J96k67o10n45l15K32P71J08N32K2j39
6982F44o96l66n32K62O62M47J24L39m37o40m92m7j01N37Q12J89k4l53l70m86k18
7003g46OO16P76P0K35o56m32o20m1k9Q16K57M89K52n50l57p78k13M13M85L68L18
7025F79k02m51l68j76k94L72M80O47J18k09k36r01n2j90K93K76O83R9J9m97n76
7046d86k25j8Q7O44L56N33k38l34p49j12l61O51L28P14J65o65j95o40k16m2M05
$$ y = [616, 766, 948, 141, -408, -832, -664, -485, -86, 610, 588, 782, -115, 20, -676, -400, -358, 57, 512, 982, 633, 12, -367, -654, -751, -240, 168, 605, 746, 565, 101, -473, -889, -931, -426, 52, 588, 920, 513, 173, -452, -705, -693, -447, 114, 875, 940, 418, 268, -573, -460, -621, -458, 203, 438, 860, 435, -105, -372, -660, -830, -353, 517, 719, 832, 809, 66, -595, -980, -699, 16, 342, 659, 855, 588, -22, -567, -882, -650, 121, 229, 761, 783, 644, -52, -418, -950, -688, -26, 421, 545, 884, 447, -193, -685, -732, -833, -296, 516, 705, 681, 328, -42, -528, -746, -740, -124, 652, 722, 957, 301, -131, -751, -792, -821, -5, 252, 741, 993, 443, 86, -692, -905, -492, -7, 361, 679, 477, 26, -342, -518, -812, -440, 40, 687, 805, 596, 360, -541, -593, -783, -490, -214, 469, 568, 587, 90, -486, -711, -729, -642, 2, 358, 891, 653, 319, -430, -542, -903, -252, 76, 790, 955, 290, 95, -545, -761, -803, -398]
7067c98Q20O3K8J24n85m98j38k15O71N52L16l11J72q15j2o70M51j51P58M06J93
7088G61k93r12J14m94J59L73K26O94L57n34o80m62J27j60O85N21L07n0k76p50
7108b87l41L0o7N25L04N14K28l27p32m95q3k4N72M75K57K03k71n02n18o8J18N21
7130C2L65L48p5K8p38n43p6J16M87O36L93k44m22o58l44N1J07O52N02K95j18n99
7152A95m69j77j25J49N70M21J04J33k42q49m62L7L75L17N00O5L9j94n80o68L49
7173e12R3L75M77L18P3p39m54l64j76N21M32M59K23j04o50k30n84j92P52J83R81
7194H82n7k40n03n46j98j72L79L75N71L53k00o60k34m30J21L89K78K91N00o69
7214B30r1m96o55M12J88O33L99K90m02o76m80n2J70L50N58J86J88m69l49p7q17
$$ y = [-398, 422, 485, 513, 637, 52, -446, -584, -799, -128, 424, 740, 429, 601, -214, -226, -896, -445, -596, 162, 568, 761, 468, -444, -330, -824, -665, -292, -66, 628, 985, 451, -229, -691, -564, -724, -39, 482, 789, 739, 463, -287, -628, -598, -665, -140, 164, 678, 906, 579, -153, -648, -731, -755, -183, 292, 549, 752, 481, -21, -539, -607, -489, 32, 397, 745, 670, 698, -40, -583, -659, -543, -56, 580, 973, 729, 307, -351, -695, -644, -537, 115, 617, 912, 794, 195, -274, -451, -576, -427, 143, 564, 668, 801, 559, -290, -752, -715, -340, -23, 477, 542, 581, 387, -193, -861, -512, -419, -44, 433, 751, 824, 85, -369, -733, -909, -388, 44, 503, 726, 622, -28, -258, -842, -1034, -282, -99, 882, 825, 585, 82, -464, -662, -834, -455, -80, 491, 844, 644, -16, -250, -680, -559, -170, 108, 399, 899, 230, 139, -357, -1012, -600, -412, 221, 620, 910, 508, -168, -648, -700, -530, -180, 378, 564, 752, 283, -66, -143, -960]
7235i60M54M25M13O40l30l19k60m45m53K92L92L53N12j54k05l48k69o15L11K81
7255b85N08L76K28l97q47%l88R7N88N03M27J2o69l86l39J2j57M31M80M43J31n44
7277B24m58m91RJ07O14M58K95p2k29o87l35mJ15M38L77M57o6n38l79p56J55k3
7299g89P72N47J02J74m30p19k00k53N21M15K16L75j58l60o22l45l0K58O69M76
7319F19J91p9p81k87l51j45L67N04M58M36o9r25k24m21O0K02N07M49j2Ll36n88
7341d22k86K45J36N16M49j7j34l49p02m1P0J82P31qK75n9p81l53l46J93L86L43
7363B8O82j33j53n86k73o8q3M40L84N40l8m02l46m40k06J9L88M48L53k30l3l73
7385h2m49k40K57K82O61M8K29K9p09o88l20M53L25N94M35n54Nl46l20m16J76N33
$$ y = [-960, -506, -81, 332, 972, 642, 323, 63, -382, -835, -543, -151, 202, 714, 560, 355, 7, -262, -877, -566, -285, 223, 599, 827, 430, -417, -417, -805, -708, -120, 383, 810, 822, 153, -233, -572, -560, -717, -286, 194, 637, 768, 224, -234, -725, -716, -609, 5, 463, 758, 686, 457, -230, -565, -569, -454, -16, 361, 818, 752, 214, -165, -921, -766, -789, -17, 530, 632, 806, 376, -343, -543, -796, -275, 140, 356, 731, 573, 213, -409, -754, -784, -526, 143, 619, 810, 731, -50, -337, -688, -833, -466, 38, 496, 932, 863, -62, -286, -707, -647, -445, 62, 511, 499, 502, 166, -422, -708, -463, -327, 189, 638, 621, 487, 138, -564, -605, -535, -353, 378, 370, 645, 586, -195, -548, -894, -701, -315, 28, 710, 577, 424, -162, -435, -503, -586, -146, 238, 778, 740, 338, -8, -448, -654, -635, -247, 201, 554, 324, 291, -82, -531, -771, -514, -232, 429, 477, 706, 735, 26, -662, -982, -529, -204, 390, 825, 271, 276, -70, -390, -806, -630, -97]
7407i7N28P7J06j96o28l76k31L78K81N35J16L6k49n99k72r6K12N20K13L98L0l91
7429B95m61n09J74j56L10Q81L59m47j38k35o63k76L13L64O50M21j61m75m70m99
7449g23o8L11M96L46L00j7l17n77k67o8K4N46M35L27l03o5q20k17P3L4O95M76
7471F21J78m05l24m36m11P5K08M73N94K91l63l75j84o61j81N04Q23K04k8k37l43
7492B3k10n63J11L70M73K76L71k12q24l44n1J20L78K02M14J18Np42n02k0r2O79
7514b0M47j05K64j22n98k63l84L0M58N30K62j75Ml37l80l98K86J55N30O56l08
7535E32j05m77k77m21N7L16N66N13j33l8q53j44k04J48L99N62K08J8m18p95j08
7556f54j70J47O09K05M58J63n43l91j39l75K70K60K97M90p2j46p28n7k21Q8R7
$$ y = [-97, 431, 508, 614, 418, -210, -586, -817, -439, -158, 377, 493, 529, 280, -319, -591, -687, -475, 45, 258, 656, 686, 295, -166, -675, -501, -657, -347, 534, 893, 446, 308, 73, -590, -866, -553, -189, 461, 882, 721, 246, -224, -723, -791, -480, 16, 362, 662, 645, 328, -249, -516, -584, -560, -14, 421, 748, 445, 380, -440, -657, -584, -550, 145, 621, 799, 394, 70, -366, -777, -702, -494, -21, 573, 864, 501, 126, -58, -719, -900, -396, 427, 631, 603, 366, 23, -187, -750, -639, -269, 204, 480, 851, 639, -185, -529, -580, -460, -82, 120, 534, 652, 657, -85, -587, -607, -699, -20, 427, 322, 586, 464, -134, -397, -781, -751, -293, 237, 499, 324, 328, -9, -389, -787, -501, -346, 184, 840, 532, 427, -50, -327, -748, -691, -375, 191, 704, 571, 533, -320, -464, -668, -520, -121, 441, 649, 667, 249, -546, -654, -824, -677, -68, 137, 595, 758, 215, -176, -315, -690, -420, -160, 137, 627, 555, 409, -319, -376, -597, -509, -412]
7577d12P77L80l3l98n18m60o2K74P17J34M86k41o45k6n61J0R1O89O35o7j18m95
7599A57l73n21J63OO37N84J55n17j51m42l39K12j67O51L45L72k08l63n57m31J67
7620f20K20N76K86m7P9o06k08l33O6K53N27M32R6k32o04l14J1M1P9N20L00J33
7642F55p7n59m64q5j20K42P86K24k74L73q16j12k48rK12O65J02j30J87n09o47
7663f04P0n9K69R55pj8j41l80o76m9k3O43N81l6K04k57n68k81k63j25O05P40k09
7686C71j04L4k46n36l32M97J87N99J50K0m20k69l71j54M15K69K72O9P8l79j74
7707b4l51m43L02M98M25R6J96k20p78o0l75K7M72N33L69J39m66l96n48N0L09J67
7729g8M53K09j31k77m43k29J58j95Q19j09M52P2n34m12l19o9M4P04J78L93k07
$$ y = [-412, 365, 745, 712, 314, -204, -664, -726, -452, 265, 399, 885, 644, -1, -27, -588, -578, -487, 202, 837, 770, 652, 157, -216, -737, -574, -568, 69, 653, 808, 291, 140, -302, -641, -429, -596, 55, 400, 772, 564, 201, -356, -787, -620, -400, 176, 462, 415, 494, -112, -320, -653, -587, -334, 193, 625, 721, 489, -115, -429, -418, -377, -298, 222, 522, 655, 578, 19, -445, -530, -650, -408, 378, 602, 328, 701, -115, -227, -475, -484, -272, 393, 495, 365, 552, 43, -604, -534, -593, -324, 631, 624, 606, 465, 85, -591, -640, -663, -20, 561, 525, 729, 472, -96, -377, -640, -765, -160, 580, 371, 267, 301, 55, -481, -813, -316, -129, 470, 620, 640, 220, -49, -420, -574, -159, 110, 382, 451, 529, 150, -24, -375, -818, -516, -18, 407, 503, 699, 479, -299, -359, -734, -707, -235, 298, 667, 806, 340, -56, -604, -554, -245, -78, 375, 584, 453, 176, -267, -496, -338, -533, 286, 177, 629, 701, 167, -245, -564, -633, -589, 115, 293, 686, 479]
7750D79m58n3o48L23K5L59N15q5j47m07k25k80K28P8L51N92j01j81m44k25k79
7771e83L00N6L19K11L03m85J38o89j09r5M42K15N45q5j10l41n57j16O1N03K25
7792A48R7K89k21k47n23k62J3N27L43L73rk83r9m20m40o1M53P34J53p5m0l51l78
7815b79q3l37O94K46J83Q1p5o73j77q7K43K14K44J94m5k17m10j68j10K6K19O87
7837C70J90J12m36o4q70M7L40J77O05K34k72j69l23k60m17M27N44Q7K26j6j84
7858C48n62k60k29K6Q99L43l55N25o12n0o31Q0j47P65L68K80l48m61J42n76l5
7879d90Q3L06L84K16p0k98n13k9j00J72L72L27n3K31k16l56p98J62L71J83N86
7900D70J70m3o04j67k98j55K35L92N88j25j4m28m78j01k5K24P22l95O35k03j88
$$ y = [479, 21, -32, -680, -357, -332, 27, 542, 457, 310, -97, -322, -602, -374, -296, 55, 647, 546, 365, -79, -304, -583, -283, -227, 92, 303, 606, 121, 259, -430, -539, -634, -192, 23, 568, 483, 373, 32, -525, -641, -580, -77, 148, 245, 534, 313, 66, -457, -719, -706, -179, 164, 537, 528, 245, 146, -274, -714, -775, -322, 412, 565, 490, 450, 99, -279, -362, -699, -5, 241, 424, 505, 430, -243, -420, -507, -264, -50, 194, 388, 343, 126, -284, -452, -562, -536, -317, 370, 560, 672, 236, 172, -698, -651, -311, -134, 471, 705, 433, 264, -59, -319, -736, -309, 235, 322, 548, 532, 348, -214, -474, -703, -677, 222, 565, 210, 735, 123, 73, -558, -478, -625, 140, 508, 788, 440, -21, 121, -455, -490, -407, -101, 283, 499, 429, 131, -382, -411, -511, -339, 33, 360, 307, 538, 322, -34, -832, -670, -299, -116, 470, 640, 597, -7, -174, -472, -627, -392, 0, 588, 463, 449, 21, -457, -558, -583, -359, 363, -32, 603, 400, 212]
7921B12m65k31k46M09M75O0L66j65k99n38j11O9J9M87O83Q0k24m53k73j93k46
7942e84L13L05N90Q8l31m18k07m94O6N63J67L37K35l65j85m25k73p4O50L12Q6
7963C56L57q8o19k56k29j23M98M20K67k01j1m34n15J48K50O9L26L39L8m17k82
7984a07k82j51J5L51N39J87n2j92l92m75M3J11L59N34K9j04m11j0k53n24K96M66
8006b3K09K98K92n59l70l47j29O01M8K17K51o1j47l53l16j25K38K28M94K75m01
8027C20o4m71l75K6L19K38M01L49j03n83r0n20M1J27N23J34Q4K5n51q9m44K30
8049d73K7L71O22J38k48l34k26k34j54K95N01j39L03R9o88k79q5K1L34J17M04
8070C72J92M2p93Q4n84J03L34K80N69q2j07n44q7k63j25L08M75K79j29L16o16
$$ y = [212, -253, -484, -730, -321, 154, 214, 580, 415, 116, -422, -533, -464, -445, 42, 725, 805, 581, 128, -145, -338, -584, -271, 34, 624, 712, 381, -37, -244, -738, -672, -109, 58, 395, 630, 265, 80, -345, -618, -692, -42, 270, 356, 713, 625, 6, -250, -479, -602, -104, 316, 583, 382, 371, -63, -578, -430, -180, -111, 215, 554, 592, 175, -107, -389, -540, -525, -174, 365, 552, 500, 308, -84, -559, -516, -405, -46, 488, 517, 413, 2, -8, -261, -785, -489, -23, 186, 484, 776, 217, -153, -500, -629, -28, 20, 237, 488, 427, 280, -73, -389, -514, -276, -48, 446, 721, 320, 256, -215, -590, -564, -245, -7, 394, 743, 640, 57, -33, -553, -512, -385, 138, 272, 356, 381, -170, -259, -703, -473, -446, -75, 547, 685, 437, 103, -123, -357, -511, -216, 285, 146, 449, 548, -140, -419, -504, -483, -149, -32, 372, 564, 606, -187, -103, -687, -584, -250, 30, 599, 517, 410, -134, -221, -484, -609, -301, 174, 453, 324, 640, 24]
8091B4k21k78l6O71pL27J27k64l85m31M0KK73L57K10m2K04n18l04l30J11N51J30
8114B11K00J35m55j80M5m47L08J8L03N18m09m4l4n39N9k82N00L24K81L9n60m9
8136e8m87M9J34L51K78J61J15l13k10n62J56r9N60L18J58j83o3m16j39l15K25
8157c40J87N00K90l58j30k19j11K9k60L71K13L57J78m24n23k93k90P91k7M27K61
8178F29j33p7n71J04m52N5M78K45K59M0l09j21p07
$$ y = [24, -197, -475, -511, 160, 153, 480, 607, 343, -42, -473, -433, -431, -158, 199, 409, 367, 571, 53, -251, -581, -470, 81, 211, 411, 546, 91, -89, -44, -491, -183, -165, 138, 656, 247, 203, 169, -370, -311, -593, -93, 231, 512, 551, -9, -58, -545, -496, -362, -11, 267, 428, 543, 230, 20, -542, -386, -485, 75, 393, 551, 368, 305, -111, -250, -565, -340, -153, 347, 637, 279, 149, -70, -181, -152, -412, -41, 172, 529, 707, 283, -240, -533, -823, -32, -59, 368, 629, 496, 419, -152, -48, -500, -445, 33, 278, 537, 577, 268, 147, -560]
8191e60
$$ Imaginary data points
##PAGE= N=2
##DATA TABLE= (X++(I..I)), XYDATA
0@%%%%%%%%%%%qJ6j6J6j6K4l2L3m1N1o1P4q8J04j20J38j59J84k12K42k76L14l55
34a88M01m51N06n68O35p08P87q75R73j076J189j314J449j598J763j943K139k355
52a234K596k865L166l506L891m334M849n457O187p083Q213r687J1700j4632J9306
67A1110k7933M9051j95575k96188L29282J83163m4759N1440K02732K2766j30623
78A54466j52443m9085O2491J19444O7517L3987L0098N5162l6688k38435k24342
89a77828J21456K09579o9951q1471J88021O9659k67145k33826L196N4226L9720
100a44364O4614N5500L1363o110j00311j44664o4051O9699J33195N7065j1671
111e9735R5240J23910j24138k33012J2072J49156L5511M0659J39774O8439o1079
$$ y = [0, 0, 0, 0, 0, 0, 0, 0, 0, 0, 0, 0, -8, 8, -8, 8, -8, 16, -16, 17, -24, 27, -34, 40, -48, 56, -64, 74, -85, 99, -113, 129, -147, 167, -188, 213, -238, 268, -300, 335, -373, 414, -461, 512, -564, 625, -689, 760, -838, 925, -1018, 1121, -1234, 1362, -1503, 1663, -1843, 2048, -2286, 2563, -2894, 3293, -3790, 4423, -5264, 6436, -8196, 11110, -16823, 32228, -163347, -459535, -130253, 52910, 8151, 59591, 262323, 285089, 154466, 2023, -47062, 15429, 134873, 202390, 236377, 266475, 321637, 284949, 46514, -177828, -56372, 153207, 83256, 1785, 189806, 259465, -7680, -241506, -238310, -184084, -144364, -79750, -24250, 7113, 1003, -99308, -243972, -308023, -238324, -105129, -48064, -59735, 35505, 159415, 35277, -197735, -185663, -36507, -996, 39663, 179437, 247876, 186797]
122A86797r7671j01881m8912O1478R1963M7127L2207K6932j4589r3238j53918
133f3705p1418Q4926P5572j4737M3058Q3083n6291j47448q4591l2695P531Q1569
145i5146Q7676L7641K0279k6817j04398r3481j0361N7557Q9965O6791K6145L3239
157H9090N649r3435r9234M165M9758N1796Q3441O8706o16m2420p6850r5712k4924
170h0586N7633O2675N1042M5345m547n6539p9097q7081l4416N4076O8189L6290
182C2984L5819Q465o0515q2620n6872k4034L2080P5471O1536L8728J2543n1829
194B1756q7817n1732j443M0979Q1319P0922K4577m793l6882p4183n3940L090L6088
207c2059N9308P0810L5287j8866n2816p3106n8530l466L9216N3457N9253L0547
$$ y = [186797, 89126, -12755, -61667, -189, 91774, 138901, 171108, 198040, 183451, 90213, -63705, -135123, -50197, 25375, 10638, 53696, 136779, 80488, -66960, -151551, -184246, -176715, -95146, -7470, 30171, 50450, 23633, -80765, -174246, -184607, -127050, -37085, 29706, 55851, 89090, 94739, 1304, -97930, -93765, -44007, 7789, 91230, 159936, 159320, 116900, 40050, -55662, -80586, -22953, 39722, 90764, 136109, 131562, 75023, -4074, -91155, -125571, -71495, -3306, 32984, 68803, 77268, 16753, -65867, -122739, -146773, -114693, -39222, 22314, 61042, 73585, 21756, -66061, -117793, -119236, -78257, 3062, 73984, 98561, 93768, 56886, -17297, -71237, -68147, -32059, 27249, 98059, 133346, 114480, 61664, -11442, -69972, -73438, -34222, 19235, 78488, 109035]
219A09035k7884o0818o4263n5386j3011M2873O3889N5165K6567k5539o4110n8123
231g1605l5535n576M0000O8422N7665K5936j5980n5855o0117l3169K46M1642P5625
244C1699O1838J3689k7535n2476n4700l3521K80L6870O6344N7725R825l5190n3967
257B0881n8069m0773Q75M2682O2706M8167L905l7237n1637n0557l9488k221M7074
270e3692O8484M8179L056l4848m9708m7313l2786O185N3663O9996M2522J98k8293
283D5643m1805m7846l5441P355N9213P0913L5843o366k9473m3532n1205l4536
295g1237J1543N5682O2129K8914r008k9712m3919n5623l8791J5047O1431N9437
307D5893K0102j1872k5260m2624n7153l3402K3945O2760N2628K0978l655k3496
$$ y = [109035, 81151, 20333, -43930, -99316, -112327, -69454, -5565, 49600, 76167, 50628, -13482, -71605, -107140, -112716, -72716, -4294, 53371, 79307, 63327, 7472, -52645, -85814, -85568, -43926, 31699, 93537, 107226, 79691, 27215, -27485, -61006, -60726, -23856, 42488, 100213, 110038, 74848, 20881, -37188, -77961, -77086, -34404, 28302, 76469, 80374, 43137, -8500, -59057, -98545, -100766, -53692, 14792, 62971, 66027, 31179, -18529, -65842, -98628, -92443, -38780, 31216, 73738, 73936, 45643, 3838, -44008, -79449, -72094, -12881, 58032, 93875, 87509, 58036, 14504, -36701, -71237, -59694, -4012, 58117, 87031, 78023, 48311, 4392, -51231, -90022, -74975, -13544, 45893, 65995, 54123, 28863, -13761, -70914, -104316, -80371, -17611, 35017, 55995, 52340, 28844]
319B8844m5851n4616k4866L0728O4842N0843J6991l601j9705m5572n6044k1757
331g9764L5551O1887M3594J5773j511k4732n3992n6337j4090L6493N3528L7249
343E3649J5328l880k8765n5939n4450j1345L7340N0750L5291J6727k766l2571
355A9369n6993m6827k872L8253M7520L6578K2353j623l6216n5551l8592K868L6730
368c5003M6847L9148K2565n720m0193n3405l2388L163L1736M4043L9511J9829
380H0133j1682m3391n4883l1017M787K7834M0192M0588J7993j8928m6211m9834
392d4419k7115M413K7130M0595M2574J8105k2603m4689m2452k4574M946L1739
404c6350M3222M2288J9486k3277m7652l7535j7229K959L1331M8921L8198J1850
$$ y = [28844, -17007, -71623, -96489, -65761, -919, 49924, 66915, 63314, 43609, -1963, -58007, -79764, -44213, 17674, 61268, 77041, 75530, 50798, -3194, -59531, -73621, -37128, 16400, 53649, 68977, 65097, 36332, -19607, -74057, -85402, -48062, 2688, 37979, 54706, 51940, 19369, -37624, -84451, -87323, -49070, -1550, 35028, 57381, 55758, 19542, -36009, -74601, -71733, -35003, 11844, 50992, 73557, 67837, 27644, -25761, -58149, -54986, -23250, 20793, 60304, 80133, 68451, 25060, -29823, -60840, -56053, -28219, 11973, 52561, 70554, 51626, 5415, -44419, -71534, -67121, -39991, 604, 43178, 61283, 38680, -6009, -48461, -73035, -68089, -36350, 6872, 49160, 68646, 45369, -2283, -39818, -57047, -54088, -22757, 26164, 64362, 76212]
416G6212k2710m6092l9653j6295L846K7629M6410L6296O663k4797m6893m2959
428d2343j4859N999K3276M6443M0649m16l1692m0094m0706j9642J4837L2879L8014
441A2345L5564P201l1008m2025l2498j3281J2728L1871L9589L9361R926l5124
453C4649m4619k7202j4828R266M1674M2539K3487N824k6805n3982l3613n67J1125
466c3052K5671M1024K8987k503l2629m7988l0996l191P597K5014M6413K9525q945
479D4927k8315m1690m2056k927K8817K7231L4595L7177m996m3845l7350j9005
491d7437l217J8143L1544L5573L1000k677l9420l6861k1467j1662J8120M1389
503A3028L1450K0609K213m2136n4267j6977M202Q372L3982M3244J2508j6245l4352
$$ y = [76212, 53502, 7410, -32243, -48538, -44692, -17063, 29347, 65643, 72306, 47509, 616, -42343, -57202, -51203, -27927, 18516, 59165, 58749, 27057, -13037, -53743, -73385, -58548, -25669, 12345, 47909, 55110, 24102, -17923, -50421, -63702, -50974, -19103, 20486, 59847, 69773, 34649, -9970, -37172, -52000, -42734, -1060, 41479, 64966, 70790, 43985, -9997, -43610, -44177, -33052, -7381, 33643, 62630, 60127, 27498, -20490, -51486, -54677, -47080, -22066, 24347, 53872, 44927, 16612, -25078, -67134, -70061, -41244, -14013, 20582, 57759, 52763, 8918, -28432, -47437, -50654, -32511, -967, 34606, 65606, 62929, 23509, -13352, -34819, -46481, -28361, 13028, 44478, 65087, 67300, 25164, -29103, -46080, -41878, -33506, 476, 43720, 56228, 39983, 5631]
516E631m2528k0634N854J2540K7773M0992J5966j3644k5815l9942l0749P431K4383
529c2742K7245M4369K8039k5371m1719k6745j9347J481L1441L3118K7560J8729
541F6058j6308m0817k7379j5412o246K3893L7209K4447J4030j0366m4903l8096
553c3890j1088l792J5445M6227L3700r79j7510l6294m1193j0302J3059J8423L5676
566G482L3747k577k0665k0171l1255k0822J0962K2652L1416M0530R375k9478k9631
579A565k7120k4281J0735L7950L1190K3529P166k9234l7302j9758j5508N66L5464
592e038L4538J2555K939j7417l8560k6031r080j461K6966M3749J8458l496j3932
605B4190l6974l8274m946J5945K7721M0637K0801j3260k0895k4090l0206p130
$$ y = [5631, -36897, -57531, -51677, -39137, -11364, 29628, 45594, 31950, 6135, -33807, -64556, -57125, -32742, -5497, 38872, 66911, 41540, -179, -26924, -46271, -44790, -13349, 19769, 47329, 66058, 49750, 8933, -18446, -33858, -40104, -16211, 20998, 45445, 59475, 49109, 4206, -33890, -44978, -48770, -33325, 12902, 46602, 45623, 28113, -8181, -49374, -59676, -46617, -28194, 7482, 41229, 38652, 17987, -2184, -33439, -54261, -43299, -20647, 10769, 51299, 60674, 31196, 1565, -25555, -49836, -39101, -1151, 30039, 53568, 60734, 31500, -5802, -25560, -41068, -40502, -5038, 29500, 42055, 44994, 27577, -10983, -37014, -46094, -47555, -20589, 23160, 41618, 38122, 24190, -12784, -51058, -56004, -40059, -12338, 28299, 49100, 35840, 14945, -9145, -39351, -46481]
617d6481J9522K2465K8976K7229m300k6279k4868k9823j6651K1418L3854K3707
629B8769K1128R94l3332l5648j9598q819J4111L5035K8255J2732k781l0026l6052
642b5232j4350k336Q803L1295L0720R806j164j9305l9950k4705M220J3204K5634
655c360L8796J7996j6465k9523k9312j9182L191J6965K3753L1254J5609j5376
667C4346k6577k5150k2931j744K2580K4498K4608K0644j2468l7374k5467j0270
679c5305o536J4374L5106K9474R383j4613l1884k7453j2102M15J8545L2901K2865
692C5170N446j0219k7481l0056j0406L280J1117L1226L5147L458k1692k4774k4711
705b4495j6954M653K3072K8615K3923L089j7140k5437k5658j5714O817K2791K6302
$$ y = [-46481, -26959, -4494, 24482, 51711, 47411, 21132, -3736, -33559, -50210, -28792, 5062, 28769, 49897, 50891, 17559, -18089, -37687, -46506, -32395, 2640, 30895, 43627, 40846, 10820, -25232, -39582, -41918, -33115, -1820, 28900, 38706, 37542, 18237, -21713, -46418, -42198, -28994, -3360, 35436, 53432, 36967, 7444, -21868, -41050, -37859, -20894, 2859, 34113, 49722, 34346, 7769, -17381, -40312, -42056, -19476, 5022, 29630, 50274, 37806, 432, -25035, -35305, -41841, -27467, 7639, 37113, 46496, 31883, -1, -27454, -39556, -39141, -20596, 12305, 35170, 40616, 30397, 2916, -27140, -37546, -34266, -23149, 8077, 43224, 46682, 24990, 216, -24495, -41449, -36796, -13724, 14891, 38814, 41903, 24763, -674, -26332, -42046, -35229, -12438, 13864]
718A3864K3798N398k2052k8571j8383j2152N77K4169L1173J7828K420j3682k8896
731d509k6900j0763R344K4468K8421J7626J85j7372k7541k2010p051O463K0238
744i401L0308J9872k668j7788k5567k5854r224J3468K3892K3482J6933m74j9627
757A7352k6542k2240p595J0441K3301K6135J7504l533k2032k6569j8878n890J1260
770b7286K5026K4143J3088k096j8252k7277k0465m708J2875K4897K5692J3123
782C8760n706k1698k5200j6989l052J1794K3330K5367J1991o630k0583k5506j8915
795c3037l116J5069K5490K2867R115q304k0707k3419j6879k127J4198K4016K3302
808B6468J0464q987k2683k4013j4805r28J5786K5739K1373O800j0082j9694k2402
$$ y = [13864, 37662, 43060, 21008, -7563, -25946, -38098, -37521, -13352, 17821, 35649, 38069, 24387, -4509, -31409, -42172, -32828, -8360, 20061, 37687, 37872, 20500, -7041, -29051, -36102, -29639, -9401, 20907, 40779, 38111, 20323, -5244, -31098, -40322, -26854, -2962, 20520, 37453, 36979, 17352, -9190, -31430, -39025, -28584, -5283, 20852, 38356, 34823, 12791, -13778, -32656, -38546, -27286, -2260, 21883, 34971, 32875, 14623, -12654, -33119, -37827, -24952, -55, 25637, 38760, 33054, 11356, -13844, -30833, -33885, -22091, 1239, 26606, 38597, 31967, 11384, -14122, -33037, -36153, -21084, 4406, 27273, 36388, 28084, 7377, -16042, -32921, -35048, -20850, 3166, 26468, 36932, 27945, 5262, -18751, -33556, -34484, -18698, 7041, 28414, 35214, 25132, 5438, -16964]
821a6964j6417o14J7143K5418K0568O934j0178k2891k3444j2456K473J5629K3359
834H560K0606N849j1202k1433k1779j4229J371J8595K5577J8959K927j2118k0862
847H21k1971j2301M615J7637K1976J8266N799j2354k4281k1164r471L550J7956
860a0922K4475J7346J100j4063k0633j9885j0567M630J9222K3431J5346K299j2044
873A9735k4591k2417n827R323J6430K1225J6950J239j6310k1688j7529q061N624
886b5897K0178K3486J4362j861j4323k1866k1153n521J2595J8314J6511J4720
898B9545L580j8017k6352j5389k444O986J8064K2210J3755l556j7139k1663j6064
911b6484m332J0449J9550J8162J0847J741j5789k8687j6756M508J0404J3095K1922
$$ y = [-16964, -33381, -33995, -16852, 8566, 29134, 36068, 25890, 2999, -20445, -32901, -30428, -14799, 8560, 29166, 35015, 23813, 2380, -19399, -33628, -32257, -13662, 11915, 30874, 33801, 21683, 821, -21150, -33451, -28836, -11199, 10777, 29043, 34842, 22488, -1793, -22957, -32428, -28878, -10922, 13553, 30899, 31999, 17936, -2697, -22582, -33149, -28519, -9297, 14134, 29480, 31779, 19735, -4856, -27273, -33100, -23777, -7347, 13878, 30828, 32067, 15757, -5931, -23460, -31521, -25897, -5719, 17767, 32129, 30268, 15945, -5921, -27074, -32595, -20000, -1686, 14825, 29545, 33125, 15108, -11244, -26633, -29077, -22091, -4027, 18183, 31938, 28382, 11243, -10420, -26484, -30816, -20367, -817, 17345, 28192, 29933, 14144, -14543, -31299, -26791, -16387, -3292, 18630]
924A8630J5390o523k0931j9924j2608k004J0277J8073J9414J1943n014j8156k2643
937a4076j5142J676J4445J3864J6832J5656m433k5838k0827o628j023Q216K0572
950C294K0052Q317q001k0791k0077q752J347R626J8901J7993P846n631k0521k2960
964a9357q081M334P648J8595K3817N635j4089j8095j7627j0321L951J2974J6991
977F375J8563O078j3212j8519j5311j0700J742J5324J7345J5757P549j2455k1700
990c164j4745q450l73J6171K2611J2786L057j0723k2344j6636l835K990J3109
1003i546K2504J2556j945p839j6776j9493n981N826J2066K0604J6291j053j2005
1016A5209j6905j9886p382J0621J4546J6754J6071j492j7336j5498j3884r127
$$ y = [18630, 34020, 27497, 6566, -13358, -25966, -27970, -17693, 380, 19794, 31737, 26723, 8567, -14076, -29218, -27542, -13097, 767, 17599, 33255, 28822, 2984, -17843, -24471, -25494, -17278, 3294, 23346, 31663, 23662, 2871, -17206, -25958, -24611, -14985, 3916, 21909, 29755, 24124, 3603, -19357, -27438, -23104, -15456, 3139, 26956, 32591, 18502, 407, -17220, -27541, -23590, -10616, 6375, 24938, 31016, 17804, -715, -16026, -26726, -24984, -9660, 7685, 23442, 30991, 18536, -3164, -17909, -26359, -26732, -10561, 12050, 24836, 27893, 17170, -5174, -21810, -25645, -22655, -9546, 12958, 25514, 23569, 15730, -1046, -20539, -26520, -20694, -8628, 11976, 28267, 27214, 15209, -1696, -21582, -28964, -18343, -3797, 12957, 29028, 27536, 10200, -5298, -19182, -28309]
1028b8309Q427J9005J3334J0279L023j4072k0045j2660o768M992J9293J7657R461
1041B3617K372j4318k3749j2365q62N193J8160K1909N655m429r932j9580j4856
1054b3185J371P747J2572J9228J0511n768j1838j6018j7627k246J0913J4147J8053
1067A7860J2854q218j8314j4570j2933m578J3714J8120J1926Q390m509j8390j4157
1080a2805q239n396R140K0463J3397N732p99j6061j9715q349j460P530K2378J8205
1094B4021J068o569j2549j9572j0116M283R387J7134J6958P37r321r801j5393
1107i733j4511K850J2917J3021J5840O324j0921j4907j3369j4210N08J7729J6763
1120H301J0482M444r302j7331j2380r102L44J6372J8416O940K791l932j6302j6343
$$ y = [-28309, -19882, -877, 12457, 22736, 25759, 11687, -8358, -21018, -27786, -22794, -3501, 14156, 23617, 25989, 11671, -12078, -24443, -25305, -20112, -1952, 19957, 25612, 21183, 11251, -8329, -23185, -21814, -14067, -1495, 17733, 28244, 22476, 10638, -5380, -23007, -25253, -14340, -193, 17860, 30714, 22496, 4182, -10388, -23321, -27899, -14185, 3935, 15861, 24251, 19742, 1352, -12805, -21044, -26440, -17300, 3163, 16560, 22292, 21493, 5432, -14283, -22632, -24092, -16562, 5816, 24021, 25089, 18520, 5971, -13601, -23717, -19434, -10047, 7087, 24045, 24782, 15461, 5660, -9733, -24244, -21394, -8477, 4544, 20384, 26708, 15787, 880, -12489, -26699, -26191, -8462, 8301, 18783, 23227, 13925, -3406, -15786, -24888, -24544, -8172, 10244, 17184, 19975, 16043, -259, -16602]
1134a6602n560J562J2139K0517J0516p32m708j4685j9752o486O926J2927J7290
1147A3352J1274l213q475j1981j7798p695R189J3388J1373J1075R60j0745j3050
1160b346j5221j0150Q080J7501J1807Q793J926j0824j6675j2895n845O998J8378
1173d73J3245N221J896q239j8417j2765j673P009J4923J4543N432q6o744j7605
1187c733j5794o60Q601J3021J4707P344l279j0423j6271j4883o91J1659J1636
1200A234J0903Q154k795j2427j4661j2798k123J1040J3792J0493P719j339j3777
1213C415j5523r382p27R737J5066J1668O278j808j3169j6337q399J079R382J4784
1227F064J2387L946l795j1928j5672r051K041Q400J2720J3351M617o737j3343
$$ y = [-16602, -22162, -20600, -8461, 12056, 22572, 21840, 17132, 2447, -17305, -23791, -16865, -3938, 13352, 24626, 21413, 12938, 957, -16841, -24536, -15347, -1959, 9414, 20489, 21449, 10704, -2346, -17567, -27717, -19637, -2136, 9671, 18464, 20390, 9566, -7109, -20004, -25849, -18851, -473, 12772, 17993, 19889, 11650, -6767, -19532, -21205, -14196, 727, 15270, 20702, 20616, 13872, -3733, -19527, -20187, -11586, 1435, 16142, 23486, 20207, 9784, -6487, -21370, -22061, -10402, 1234, 12137, 20291, 17496, 5069, -9592, -22390, -24513, -13473, 319, 10812, 18531, 17192, 3415, -12108, -21490, -22217, -12480, 2586, 14254, 20532, 18724, 5555, -10782, -19181, -18102, -8720, 6064, 18451, 22397, 18602, 6674, -8998, -18049, -16008, -7608, 5112, 18463, 23080, 16343, 3000]
1240C000j4837r063J516J0473J2878J1786L627q119j2456j2526q714J013J1280
1253a0142J3892J1335L696p361j3670j1875o299J520J1145J5162J1081K067o898
1266A3653j2507j2103p243K193J2145J5303R313L97p355j2820j2695n905K844
1279a4780J0625J3954R748m98q555j2233j2598p650M126J2688J3826P571j044
1292A5180p432j2349j2332n612N128J2250J3395Q671R3r526j2412j0701m473N444
1306a4676J3584J3793O340j159p229j2389j2303l674O779J2212J2118P581j189
1319A9788j0323j3997r797k852N504J1389J2456O176k761r502j3217j0989k788
1332b0913P088J2213J1828O326k547j0865j3483q053n73O221J1362J3022O804
$$ y = [3000, -11837, -20900, -19384, -8911, 3967, 15753, 19380, 11261, -1195, -13721, -22435, -21422, -10142, 3750, 15085, 18781, 11420, -2250, -14125, -20424, -18904, -7759, 7403, 18484, 20551, 13653, 1146, -10957, -18200, -16007, -3862, 11441, 20754, 21151, 13796, 976, -11719, -17624, -14780, -4155, 9799, 19547, 19049, 10494, -1739, -14337, -21987, -17861, -5173, 8653, 16224, 15180, 7748, -4601, -16933, -22545, -17417, -5167, 8228, 16899, 16992, 7466, -4946, -15647, -20120, -14676, -1092, 12701, 19041, 17882, 10653, -1736, -14039, -17713, -10934, 1278, 13396, 20977, 19788, 9465, -4532, -14329, -17181, -11677, -288, 12168, 18344, 15583, 6081, -7136, -18125, -20913, -13825, -1612, 10216, 16542, 13995, 3130, -10353, -18406, -18979, -12758, -1396, 11626, 18430]
1345A8430l267j1136j1584p985j206P232J3254J2009M881l955j0556j2286p752
1358a3921n30O416J1838J2549M857o164j2048j1805p308p18O857J2627J0815L148
1372A6613n733j0583j1447p798o0P687J2842J1556L579o968j0970j0325n897K92
1386a7212Q938J3394J0356K757n956j0709j0103o291M62R616J3517R586J204o824
1400A2735j1036j0352n595N81Q903J2675Q751J03o699j0776j1344o023K364R238
1414f475J2284Q723j041p230r321j0204o204L087R931J2405Q320K75p354r762
1428b566r769n496M655J1449J1193O814O58p190j0873q644m738L098J1727J1827
1442A2145N115p44o809j1806r772l176L401J0374J1407N044j621o500j1739j1106
$$ y = [18430, 15163, 4027, -7557, -15542, -16748, -9516, 3738, 15747, 20628, 16673, 6117, -6169, -13921, -14451, -8035, 3803, 16352, 21209, 15045, 2997, -8808, -16116, -16834, -9977, 2650, 13465, 16613, 10880, 297, -11150, -18948, -19008, -11321, 1521, 13077, 16656, 9688, -1282, -11607, -17504, -17212, -8274, 5120, 15476, 18233, 12277, 1568, -8535, -14826, -14364, -4748, 8769, 18355, 19559, 12735, 1699, -8653, -14248, -13667, -4764, 7911, 16662, 16765, 10066, -710, -12054, -18077, -15713, -6475, 5809, 14532, 13491, 6261, -3060, -13264, -19468, -16381, -6450, 5955, 14275, 14550, 7196, -2566, -12335, -17831, -13176, -1727, 9466, 16280, 16938, 9748, -1125, -9769, -14507, -11409, 318, 12145, 17260, 16516, 9707, -2099, -11871, -15047, -11646, -1272, 10135, 15179, 13558, 7058, -4681, -15787]
1456a5787k755N645R869J1517N943l581p326r603r694k192O828R707R670O792
1470A5033j501q125r690q558l269P184J1997Q537N404p84r716j1414o388k396
1484a3686N821J1712Q989L286j918r279j2031o385o86M624J0595R948K235k812
1498A0413p163j2049q628J315N976R348J1876M009n810r213q968p144J295Q120
1512f623R208R555M262n504q976p013p313r78R092J0060P230M581m217j1548q995
1527g179l948j914P051J2475P784R25n034j0714r688l916L15O348J2203P369j381
1542A0696l969p439j0728m727K327O048J0714J0763k24p373p125q499o550L469
1556a2617R818J0101P735J66p877p457o707o511L050J0301Q722N390J581p138
$$ y = [-15787, -18542, -12897, -3028, 8489, 14432, 10851, 3525, -6078, -15772, -17964, -11136, -1429, 8241, 15033, 13532, 5407, -4283, -12841, -16110, -8926, 3071, 11608, 17012, 16228, 6512, -4902, -11290, -13686, -7865, 3847, 12836, 16122, 14204, 4925, -7106, -13491, -14177, -9553, 1042, 10990, 13225, 10413, 3250, -8799, -17427, -16112, -10136, -788, 11088, 15097, 9287, 74, -8894, -16038, -14743, -6623, 2585, 12140, 16402, 10898, 1922, -5091, -12404, -13382, -4290, 5770, 13000, 17581, 13364, 1816, -7179, -11127, -13041, -5990, 6485, 14269, 15194, 10160, -554, -10242, -14158, -13843, -7495, 4708, 12077, 10696, 6727, -712, -11440, -16167, -13840, -7792, 2922, 13685, 13461, 6088, -1037, -9536, -16086, -12617, -2799, 7302, 15037, 15203, 7326, -131, -6838, -13349, -10299, 2, 8724, 14114, 15695, 8557]
1570H557j0136o571m248l54J0368J1538L600m80n104j1260q739k605K792R465
1584c177J1268L836k528m680r245r133r13M817O472J0314O840k473o244p185r368
1599a1399l301O750Q529Q778O696j954q625q288p225l379O257J0305O348M049
1613A3541l33r026r496n064k483L571J0364P351L180n47p159j1741n639l52L292
1628a0541J0122J0198K353k991o440j0273o632K194N189P639R472L603m482o051
1642C360q212p276J013O455P209Q303M879m821q915p212o132j140P707Q822O215
1657A0255L441l999r833q116l686o55O559R537N677J753k795q454q878l159K10
1672a2143N202J0192P784L71l609p365r512l874K886O169Q767P655K73m806p078
$$ y = [8557, -1579, -8150, -12398, -12752, -2384, 9154, 12754, 12274, 7170, -4090, -12829, -15434, -12642, -3177, 8091, 11927, 9399, 4719, -4526, -13659, -14572, -9755, -3283, 7031, 13871, 11398, 5154, -2031, -11399, -14700, -7950, 579, 9357, 16053, 14099, 5474, -2814, -10039, -13418, -7161, 3144, 9492, 13541, 13208, 4182, -5314, -10378, -12861, -9290, 1074, 8425, 11605, 11058, 3899, -7842, -13481, -13833, -10541, -419, 9779, 12132, 9141, 2701, -7572, -14204, -12010, -6821, 818, 10290, 13893, 9411, 3360, -4852, -12128, -11115, -4660, 2549, 10852, 15731, 10910, 1995, -5217, -11349, -12489, -4782, 4040, 10255, 13696, 9697, -136, -8252, -11938, -12593, -6034, 3503, 9180, 10933, 8138, -316, -9194, -12353, -12143, -6941, 3251, 11035, 11406, 7797, 432, -9080, -12954, -10068, -3899, 4868, 12523, 12796, 7990, 912]
1687I12q033n070L152O870P175P087J502o343p709o848m869J794P821Q211N408
1702A1060R06n282q957p410l113K070Q120Q213M347N29m653r080p177j327K086
1717i668O211R562M910o53m823p504p666k291L919O778Q091N054r56n244q111
1732b391p048j666M408O753O858N426j014p043p170o049k567M046P819O736L992
1747A1090r11o158q527o025j181M045P531O801M162j258o772q486m911m90L828
1762g262P313P921K902k299n865p889n488J55M796O841P056L585k404o629p793
1777e060n388O54M746O726P063L190l126p001p075m762L23M967P323N809K887
1792A1276k794p788p080l978L63M835P139O607K290l702p254o852l385L67M887
$$ y = [912, -7121, -12191, -9039, -2169, 5006, 12093, 13595, 7252, -457, -7305, -12174, -10380, -2559, 5652, 11060, 11966, 6684, -2273, -9683, -12796, -10726, -2606, 5607, 9954, 10483, 5830, -3250, -10427, -11754, -9668, -3457, 6105, 11015, 10362, 5539, -1965, -9631, -11922, -8003, -1225, 6866, 11920, 10964, 5720, -2391, -9439, -11105, -6697, 56, 6914, 12340, 11326, 4283, -2887, -8936, -11503, -7457, 362, 7098, 11090, 10179, 4021, -4506, -10531, -11712, -7667, -136, 6665, 10827, 9569, 2797, -5689, -10600, -11090, -7262, 51, 7972, 10874, 8575, 2710, -5179, -10667, -10512, -5716, 1125, 8181, 11766, 9362, 2733, -5060, -10448, -9794, -5048, 1678, 8741, 11931, 8805, 1804, -5271, -10033, -9710, -4743, 2580, 8389, 11276, 8482, 694, -6386, -10364, -10001, -5166, 1973, 8580, 10870, 7168, -86, -6938, -10323, -9956, -5069]
1807e069P828O497J404l967o746o871l285J198N158P040O310J432m290p054o206
1822f621l222J067N373P636N933O50m793o935n500l602J444N563P323N397N01
1837A0214m698p144n741k854J605N839P381N004k05m568o271n645l094J850O341
1852a986P161M845o44m466o584n816k541K335O585P023M087p22m842o269n852
1867g686k324K912O301O757L802q74n318o402n316j849K884O620O152L483q07
1882H335m904o352n646j666L461O795O227L068j115m679o919m959j118L685O214
1897D27O385K995j587m931o764n060k39L550O237O141K499k026n245n998n060
1912h676p14M424O118N369K629j965n904o158m246r4M287O214N552J946k249n220
$$ y = [-5069, 2759, 9256, 10660, 6693, -53, -6924, -10209, -9011, -3853, 3187, 9497, 10929, 6639, -415, -6621, -9843, -8776, -3403, 4233, 10166, 10816, 6023, -912, -6412, -10014, -8570, -3007, 4316, 9713, 10214, 5516, -1628, -7369, -10223, -8618, -2779, 4602, 9606, 9401, 4833, -1438, -7083, -10177, -8327, -1986, 5175, 10020, 9376, 4910, -1674, -7490, -10031, -7696, -1111, 5912, 9999, 9277, 4435, -1834, -7686, -10010, -7098, -797, 5960, 9762, 8888, 3570, -2832, -8148, -9997, -7113, -493, 5659, 9142, 8335, 3431, -2921, -8567, -10233, -6772, 23, 6250, 9318, 8203, 3524, -3395, -8354, -9472, -5787, 427, 6812, 9807, 8220, 3289, -3475, -8535, -8774, -5224, 1013, 7154, 9653, 7627, 2382, -3616, -8676, -9390, -4966, 1152, 6521, 9150, 7185, 1281, -4877, -9123, -9217, -4930, 1284, 6836, 8782, 6533, 1313]
1928A313o044m073p5M292O872M840K070k025o023o097l952J228M114O118N680
1943H238J099k790n451o239l638J036M212O993M560M96l131m451o050m200J403
1958g913N246N196M731J765l696o082n048l533J130N748O321L589O06l339n605
1973h84m819l389J281N686O072L403Q64k704o275n926j614J705M712O515L682
1988H309m78k902n554o091k056K357M935N955M034p50l606n645n621k001L659
2003e455M778M465M210k25m260n530m560k714K935O238M759K941L64m361o434
2018b849l801j498K621N929N090K092q1m154o445m097l86K470N259N682J856j026
2034F662l198o369n059K72L088M164N937K892k010m530n476m686J50M615M035
$$ y = [1313, -4731, -8804, -8879, -4587, 2285, 7125, 9195, 7170, 1147, -4950, -8902, -7674, -3560, 2558, 8238, 9337, 6547, 1096, -5143, -8781, -7745, -3533, 3460, 8020, 8516, 5385, 934, -5116, -9316, -7913, -2667, 2529, 7260, 9025, 5329, -753, -5801, -9334, -8204, -2456, 3865, 7454, 8060, 4721, -884, -5703, -9092, -7811, -2125, 3947, 7350, 8214, 5510, -765, -6691, -8305, -6600, -1888, 4627, 8309, 7831, 4929, -625, -6716, -8772, -6415, -1480, 4475, 8509, 7759, 4153, -1492, -7113, -9114, -5455, -677, 3788, 7998, 7773, 3513, -2017, -6577, -9291, -6356, -118, 4641, 7582, 7946, 3585, -2849, -6650, -8148, -5527, 402, 5492, 7584, 7503, 3349, -3096, -7193, -7579, -5109, 150, 5832, 7688, 6662, 3464, -2905, -7964, -7692, -4604, -440, 5497, 8389, 6379, 1849, -3627, -8313, -8163, -3548, 487]
2049D87M409L071j424n033m741m153p45M243N145M692K258r41n629n555k789p60
2065g465L728N818M283J164q08n265o189k840Q17L245N320M824N08j793m331o100
2081e084k958J279L103M462N759J318l075m590n156l357J436M390M457M779J799
2096H562l518n089l771k845K07M753M817L145J894k587o097m297j897M41L746
2111b536N993L318M55j951o368m819j323P55L995N722L486p79k647m669n003j178
2127g549J800L724M687M142O2l576l964m598k657L002L876M803L903n8m334m503
2143a240l636k142K347N096L937K580K39l874n231l492j412J525M718M876J792
2158F083k6l085n672l825o94J795M545N177K125p55l478m732m469J57K809L600
$$ y = [487, 4896, 7967, 6543, 1510, -3231, -7384, -8129, -3886, 1259, 5951, 8209, 7268, 1639, -3916, -6705, -7465, -3737, 2081, 6364, 7528, 6720, 1455, -4734, -7574, -6757, -3512, 1808, 6632, 7140, 5347, 1016, -5084, -8042, -6763, -3660, 802, 6561, 7879, 4804, 214, -4942, -8299, -6863, -2473, 1984, 6763, 8562, 5044, -45, -3816, -6661, -6454, -1701, 3116, 6261, 8155, 5568, -529, -4826, -6723, -6282, -2536, 3457, 6775, 7230, 5279, -1089, -5908, -7231, -6476, -2481, 3241, 6727, 5948, 3301, -1368, -6371, -7549, -5749, -2025, 2662, 6804, 6866, 3290, -674, -5272, -7929, -4927, -1051, 3752, 7655, 7597, 3263, -1240, -4876, -7018, -4671, 425, 4362, 6942, 7181, 3307, -1924, -5416, -6828, -5303, -585, 4291, 6083, 6057, 2972, -2700, -6525, -7219, -5424, -879, 4298, 6423, 5668, 2190, -2542, -7011, -6854, -4045, -445]
2174d45N101K620j769l271m108m145m64K823M210M306K695j553l974m348l364
2189e686j116L533M564L549K381j207m751m657k801l66K706N063L873J024j034
2204E075l897n075k571rK796M700M062J265j364m155m556k926O24L056M677M281
2220E983R30k660l299m490k835L42L483M267L906J017k233m115m044k575J69L779
2236b375M467L161J130k053m527l821k181L16L834M781K835M94k315m199l970
2251d423j816Q33L528M739L037O4k148m276m095j906J407L628M539K606P8k413
2267C382m024l854j679J247L783M035K871j28k524m097l990j532J824L918L871
2282C103K768k13k810m336l143j537J495L954M318K346k79k899m398l282r68J883
$$ y = [-445, 4656, 7276, 5507, 2236, -1872, -6017, -6481, -3658, 552, 4858, 7553, 6000, 2026, -2322, -5686, -6802, -3269, 1295, 4844, 7225, 6018, 1267, -3390, -6191, -6557, -3851, 1212, 5085, 6109, 5075, 1178, -3897, -6468, -6477, -3681, 1019, 5081, 6346, 4982, 827, -3729, -6655, -6031, -2975, 1702, 5983, 6913, 4253, 954, -3536, -6371, -6029, -2546, 1721, 5627, 6644, 4411, 296, -3748, -6323, -6154, -2375, 2092, 5253, 6383, 4330, -197, -4018, -6199, -5883, -2049, 2732, 5567, 6061, 3746, -453, -4423, -6239, -5406, -1878, 2861, 5898, 5962, 3814, -462, -4557, -6463, -5056, -1428, 3111, 5717, 5795, 3382, -642, -4496, -6175, -4928, -1145, 2890, 5761, 5633, 3109, -988, -4978, -6510, -4686, -768, 3103, 5871, 5658, 2848, -1488, -4631, -6168, -4673, -719, 3599, 5945, 5666, 2767, -1631, -4913, -5881, -3998]
2298c998L792L990J978n90k687m165l489o53J988L793L744K224q21l164l978l289
2314e325q28K531L689L853J934q17l237m279k884m96K616L733L558J778q32l401
2330A593m067k899j43K289L917L357J653j112l367l981k626m7K211M214L170J495
2346E657j182l349m236k619M12K391L978L263J361j642l313l770k359J62K716
2361b530L781L294N53j458l172l768k139L08K947L834K937Q31j479l729l821j871
2377e482N91K594M152L023M71j758l378l701j946M91L471L525K627N62j816l734
2393c08l680j635J011K970L420L132L18k328l279l106j800P28L126M042K233L49
2409E193k526l470l140j412J342L170L281K442J98k134l980k709j262J087L151
$$ y = [-3998, -206, 3784, 5762, 5172, 2485, -1680, -5169, -5822, -3834, -41, 3703, 5927, 5106, 1942, -2036, -5325, -6153, -3622, 67, 3920, 5854, 5037, 1800, -2479, -5363, -5859, -3243, 490, 4048, 5826, 4994, 1593, -2474, -5373, -5516, -3227, 690, 4047, 5700, 4588, 1221, -2760, -5386, -5433, -3222, 992, 4162, 5657, 4475, 1126, -3110, -5729, -5317, -2926, 1052, 4315, 5676, 4034, 721, -3049, -5408, -5246, -2530, 1251, 4545, 5098, 3640, 468, -3300, -5439, -5131, -2184, 1650, 4587, 5418, 3939, 210, -3611, -5482, -4891, -2297, 1855, 4878, 5349, 3591, 213, -3488, -5434, -4943, -1472, 2053, 4680, 5242, 3426, -308, -3988, -5623, -4612, -1642, 1778, 4910, 5228, 2900, -379, -3485, -5285, -4557, -1431, 2611, 4844, 5193, 2667, -803, -3943, -5355, -4013, -843, 2438, 4880, 5078, 2944, -1036, -3745, -5007, -3920, -769]
2424g69L642J848ok005l764l126r51J265L321L378J865l85j868l665l095q12J338
2441c789L213L502J935n31k618l179l107q06K214L003L054K093l08k536l583k738
2457d181r37J859L453K851J572j33l055l404k216n43J774L496K755J485n65k636
2473A575l762k150j05J532L097L264J376q61k748l557k292k02K457K841L391Q09
2489D665j294k414l331k296J98K198L100K833J495j648l211k454k386Q2K260L403
2505A200K754P51j248l333l030j171j29J923L935K212Q51j637k533l580j333L74
2521c994J602M026K433K46j276k447l590j458N46K113L031L084J12j982k372l213
2537c139j565Q31K659K738K170Q47k014k672k506j851M29L168K711K107O94k000
$$ y = [-769, 2873, 4721, 4715, 2710, -1054, -4180, -5131, -3866, -545, 2833, 4698, 4313, 2445, -1220, -4315, -5127, -3789, -576, 2926, 4861, 4330, 1712, -1467, -4574, -5380, -3166, -163, 2891, 4984, 4676, 2140, -1443, -4181, -5118, -3259, 194, 3045, 4617, 4484, 1429, -1975, -4191, -4734, -2960, 536, 3291, 4776, 4211, 1575, -2187, -4337, -4442, -2910, 187, 3451, 4827, 3966, 1218, -2339, -4631, -4833, -2376, 465, 3856, 4665, 3371, 957, -2374, -4670, -4472, -2274, 826, 3659, 5154, 3506, 295, -2159, -4545, -4463, -2203, 1200, 3954, 4705, 3457, 124, -2906, -4077, -4206, -2283, 1652, 3864, 4715, 3078, 545, -3035, -4368, -3994, -2392, 1634, 4067, 4313, 3037, 590, -3000, -4458, -3912, -1799, 1232, 4316, 4428, 2446, 74, -3139, -4704, -3873, -1214, 1524, 3694, 4541, 2527, -145, -2651, -4502, -4073, -905, 1806, 3913, 4607, 2607]
2553B607l078k808r93L04L081L305J298L98j166l774k511m16M18K124L461J849
2569D099j49j600l325k598j012J330K327L296J979m72j962k796k783q71J685K790
2585f2K145K092J32l033k210k119j329J462K544K965J829n14k452k797j787j139
2601d273J207L153K602J509l50j955l804j881k2J052K503L363R31q24j597l409
2617a795k259K08J246K636K872J204q78k219k755k215J39J584K294K813J439j049
2633C265k606k320j704p35J854K843K018J614p63l043k311j861j55J416L251K560
2649C323N58o56k427l303q25j07J236L046K755L32j191k003l078j487J50J944
2665a733K616K639M11j710j921k380j999M65K116K704K269L43j545k487k022j538
$$ y = [2607, -471, -3279, -4272, -3968, -887, 2418, 3716, 4114, 2948, -826, -3337, -3753, -3335, -1211, 2250, 4099, 3950, 2350, -975, -3573, -4585, -3255, -928, 2368, 4347, 3875, 1913, -883, -3666, -4537, -2852, -62, 2083, 4175, 4307, 1274, -936, -3055, -4384, -2922, -378, 2587, 4416, 3902, 1450, -1347, -3134, -4273, -3066, 87, 2689, 4198, 3848, 1893, -1911, -3792, -3814, -2762, -259, 3104, 4035, 3211, 1614, -1795, -4054, -3846, -2600, 36, 2908, 4112, 3234, 1015, -1740, -3955, -3816, -2232, 62, 2875, 4314, 3265, 659, -1661, -3365, -4100, -2246, 597, 2615, 4229, 3466, 423, -1888, -3749, -3904, -2488, 763, 3323, 3881, 3225, 798, -2505, -3330, -3437, -2201, 845, 3600, 3932, 2741, 738, -2340, -3827, -3677, -1733, 883, 3522, 3933, 2223, 302, -2078, -4077, -3612, -1496, 1208, 3477, 3820, 2275, -212, -2234, -3772]
2681c772J2K233L036J517O96j248k709k125j278J90K222L083J480L50j043k614
2697C0k878r33O37J865K848J831j6j272k261k746r84J006J675K818J935j17j940
2714A498j779k206j348J100J976K417K041q1k071k300j919j095R01K287K295J675
2730C391J44k033k328j866r88J003K340K563J219j90j512k442k209n22R02K248
2746b80K338J230j98j313k548k584j17J272J902K816J039m24j571k551j964n65
2762c518J454K142K326J045o62j694k405j795m27J407K273J852J455n18k160k248
2778a473j340o50J480K229K032J254o86j982k479j531r9J341K326K038R58o82
2794B736k237k191j599J37J204K672J957M22n82j855k287j470l6J841K073J577
$$ y = [-3772, -3760, -1527, 1509, 3026, 3722, 2474, -235, -2360, -3638, -3448, -1226, 1857, 3337, 3687, 2644, 30, -2848, -3781, -3144, -1279, 1569, 3400, 3384, 2112, -149, -2895, -3879, -2873, -1198, 1620, 3555, 3438, 1498, -281, -2487, -3835, -2735, -759, 1658, 3699, 3618, 1547, -753, -2672, -3767, -2866, -579, 1716, 3391, 3535, 1502, -826, -2692, -3680, -2677, -337, 2226, 3445, 3255, 1743, -699, -2908, -3430, -2528, -280, 2058, 3288, 3090, 1777, -771, -3355, -3472, -2200, -298, 2518, 3557, 3133, 1562, -989, -2953, -3518, -2064, 78, 2404, 3449, 2787, 1093, -1312, -3107, -3534, -2127, 146, 1998, 3453, 2935, 775, -1473, -2813, -3463, -1983, 246, 2278, 3532, 2846, 864, -1615, -3146, -3245, -1904, 422, 2460, 3418, 2736, 499, -1692, -3291, -3154, -1950, 722, 2679, 3101, 2519, 664, -1623, -3093, -3129, -1288, 785, 2362]
2810B362Q85q27j859k321j586K60J641K244J616R91r59k428k056j252L50J762
2826a177K224J541M29o88k110k290r69J78J453K219J788L56q58k144k178r96N18
2843b704J679K237J412M68j024k101k158r25L69J826K237J415L68j127j850k372
2859b250o03J85K111J952J259L83j476j942k079n61P57J709J847J481J85j309
2875A649k192j946m42N78J647K133J401L0j525j882j884l22P15J706J864J302
2891B832j9j483k017j868n21R29K075J564J620m01j353j906j810o11J140J584
2907b45J986J024r2j712j798j644j09N27J905J823J046k17j647j886j664q6Q12
2924a977J790K007J037n17j465k045j441P0J205J505J682Q19l18j328j921j593
$$ y = [2362, 3247, 2420, 561, -1760, -3346, -3086, -1445, 799, 2415, 3406, 2447, 19, -2037, -3289, -2939, -1177, 1047, 2588, 3017, 2329, 219, -2071, -3040, -2862, -1409, 810, 2598, 2954, 2096, -48, -2226, -3222, -2704, -1025, 1212, 2624, 3092, 2068, -33, -2191, -3116, -2747, -921, 1316, 2731, 3099, 1972, 122, -2250, -2853, -2668, -557, 1395, 2654, 3037, 1561, -381, -2460, -3021, -2264, -555, 1292, 2773, 2958, 1649, -543, -2489, -2931, -2353, -706, 1427, 2828, 2858, 1333, -549, -2433, -2755, -2040, -334, 1530, 2832, 2813, 1330, -687, -2555, -3076, -2147, -72, 1492, 3112, 2711, 1358, -548, -2358, -2969, -1829, -245, 1741, 2765, 2673, 961, -837, -2481, -2590, -2063, -158, 1665, 2711, 2494, 847, -1039, -2703, -2789, -1977, -187, 1820, 2857, 2340, 875, -1170, -2611, -2541, -1336, 169, 1851, 2670, 2352, 1024, -897, -2490]
2940b490P8P30J873J748J000n36j551j892j556P3J058J828J721Q06o83j556k030
2957a379r58k42J040K002J578Q22p26j791j654j132j62J164J968J498P70p19j535
2974E44j996j046J89Q43K108J560N31q85j450j834j171M73R67J659J764N88j089
2991A755j589j715r71L5J369K071J235N57j168j771j360j225L15J375J889J176
3007A978N24n86k167j556p88M1J774J783J329J12m70j850k085n55L07J342J972
3024A105J306J81j004j440j801j026R30J088J422J472L91j327j747j424q04P24
3040a954J397J729J221J55j380j707j033j223P07J712J459J186j2q02j709j643
3056a897m60O00J426J733R74j36p53j918j521n19Q68J286J954R92k45j255j453
$$ y = [-2490, -2412, -1682, 191, 1939, 2939, 2403, 852, -1040, -2596, -2523, -1465, 363, 2084, 2890, 2207, 651, -1379, -2337, -2579, -1539, 463, 2041, 2863, 2137, 346, -1308, -2440, -2602, -1438, 530, 2028, 2798, 2079, 544, -1452, -2498, -2309, -1466, 642, 2202, 2733, 1848, 398, -1436, -2607, -2134, -1167, 492, 2256, 2844, 1755, 166, -1549, -2520, -2485, -1116, 955, 2190, 2747, 1579, -192, -1552, -2777, -2462, -1087, 802, 1978, 2502, 1916, -251, -1807, -2595, -2554, -780, 1003, 2332, 2444, 1974, 124, -1961, -2516, -2209, -867, 1105, 2411, 2592, 1588, 148, -1653, -2679, -1749, -661, 761, 2233, 2624, 1297, -450, -1874, -2678, -1954, -557, 1172, 2393, 2548, 1168, -539, -1572, -2795, -2088, -376, 1083, 2269, 2257, 1455, -254, -1897, -2357, -1757, -331, 1402, 2376, 2240, 1487, -431, -1952, -2471, -1603, -317, 1637, 2629, 2384, 1129, -324]
3073c24j668p02J163J256J668J046k16j444j164j552q35J124J564J356R22Q7j601
3090F80j394j124o07Q85J723J476M17r4j185j674j007k91M93J751J457N26k71
3107A761r62j451j469J07O54J220J908O63p45r81j458j652K46Q92J463J435J082
3124B713j105j187j324j231k75J307J713R52J042o85j538j572r49k10J224J536
3140D11J181P91l72j669j681p40J5J019J569J487L9n45r78j748o94K23N68J538
3158D14J641J11p89j252j842l47N01O15J412J515L65q90j641j075j063L39J305
3175f81J600Q03N92q23j465j235j071K77J518J111J387j49k76j589j518l92J29
3192a782J102J520J111K8p34j340j401m32L95P98J397J495n2p57j401j666l51
$$ y = [-324, -1992, -2694, -1531, -275, 1393, 2439, 2223, 779, -385, -1937, -2772, -1648, -84, 1272, 2194, 2281, 680, -714, -1838, -2445, -1560, 163, 1639, 2056, 1962, 777, -897, -1904, -2195, -1702, 49, 1506, 2032, 1761, 799, -652, -2121, -2014, -1360, -140, 1768, 2431, 1686, 705, -753, -2405, -2159, -1267, 196, 1631, 2713, 1608, 421, -903, -2134, -2409, -1102, 611, 1563, 2605, 1920, 382, -1190, -2139, -2349, -1125, 411, 1592, 2383, 2011, 342, -1339, -2079, -2064, -1045, 524, 2011, 2050, 1505, 527, -1221, -1915, -1692, -1124, 414, 2055, 2166, 1377, 125, -1717, -2064, -1563, -948, 464, 1979, 2344, 1454, -187, -1262, -2325, -1986, -681, 919, 1722, 2314, 1491, 26, -1209, -2280, -2003, -485, 626, 2013, 1864, 1588, -1, -1519, -1911, -1782, -680, 840, 1951, 1979, 1245, -95, -1496, -1928, -1533, -735, 662, 2157, 2105, 1348, -53, -1719, -2070]
3209b070M59J108J017J532k19p18j224j604m72N49R73J762N60K30o28j549j507
3226a801j25L38J193J514P80K82j126j591q89m29M18J041J784N29p6j074j458
3243f90j126r3N40J133J158J071j85j057j115j751r0R77R49J473Q74k98j338j233
3261h01o85o55J126R30J305O64M1j246j290r17j81M92J120J331P67m62j068j398
3279i27n80k90L44J525J199M54k63q24j478r80k17O56J158J549Q42p36j120r07
3297e95j083l19R41J236J239J67o5q37j468q91j07J220J011R77N17m95j290j058
3315i00p93R0O00J237J438K00n33j143j302m77k51J036J305R21L00k23j495j119
3333a109m50j67R52J417R16K39p99p36j195p63K22Q62R91J013L40l97j294j212
$$ y = [-2070, -1611, -503, 514, 2046, 1827, 1109, -115, -1719, -2191, -1642, -669, 1093, 1653, 1883, 1255, -294, -1801, -1926, -1588, -395, 1119, 1899, 2181, 1055, -536, -1425, -1854, -1436, -395, 1389, 1918, 1842, 768, -690, -1816, -1909, -1369, -236, 922, 1993, 1808, 751, -364, -2115, -2205, -1228, -279, 1194, 2068, 1770, 432, -801, -1486, -2141, -1015, -85, 1220, 1884, 1925, 679, -611, -1528, -1709, -1217, -97, 1234, 2001, 1539, 471, -927, -1507, -1797, -1453, 72, 1271, 1725, 1462, 638, -840, -1820, -2037, -1381, -223, 1326, 2168, 1432, 312, -595, -1678, -1997, -1056, 180, 1419, 1586, 1521, 684, -784, -1675, -1782, -562, 449, 1426, 1943, 1448, 158, -900, -1693, -1603, -1003, 234, 1672, 1872, 1339, 196, -1106, -1583, -1834, -798, 507, 1428, 1728, 1505, 10, -1109, -1559, -1726, -774, 643, 1559, 1798, 999, 263, -932, -1695, -1473, -611, 380, 1393, 1733, 1336, 42, -1170]
3351a170o58K06Q32J151J097L87q65j101q97o87J09Q87J472Q42K09p57j310j063
3369a316m20J41R88J392M55J78l50j059j021n76o7R99J564N57M61j084q69j132
3387a159n80N18R21Q87J068J01j081j040j105j69L74R42J387L77J83o20j175r25
3405a096o58N60P34J675K55j06m60j114j253k15L31J074J152P30J72j191r57o93
3423a060q88M88J306J212P15j16p67j373r72k18M04J265R61K08J75n06j354q24
3441a344l46M51J090J248N27n41o22r79r20j79M18J374Q62K38K69j014j232q59
3459a559K3L74J233R89P49m97o77j296p38r7M70J237P37N28k40o87j300p82J80
3478a353P12R18P50O13l69q80j152n72j41P48R01J097M82n10j002r08o14j66P39
$$ y = [-1170, -1828, -1622, -790, 361, 1458, 1845, 980, -121, -1018, -1705, -1596, -709, 763, 1605, 1814, 1057, -253, -1316, -1736, -1595, -607, 785, 1240, 1418, 1068, 9, -1012, -1588, -1655, -656, 908, 1465, 1926, 842, -27, -1159, -1739, -1221, -300, 587, 1655, 1756, 675, -365, -1470, -1639, -1265, -323, 1064, 1441, 1624, 1004, -171, -1096, -1754, -1194, -460, 1215, 1470, 1364, 904, -210, -1463, -1678, -1347, -273, 879, 1609, 1781, 590, -367, -1060, -1948, -1460, -154, 1058, 1773, 1657, 890, -483, -1455, -1673, -1269, -4, 957, 1165, 1340, 834, -520, -1344, -1690, -1239, -149, 1099, 1626, 1085, 463, -516, -1436, -1615, -1197, 177, 1039, 1277, 1546, 532, -700, -1559, -1536, -1162, 71, 1060, 1809, 1312, 635, -661, -1399, -1496, -1026, 211, 948, 1476, 1236, 549, -751, -1533, -1353, -641, 277, 1027, 1640, 1271, 391, -761, -1333, -1474, -726, 175, 1272, 1754, 1244, 242, -666, -1280, -1446, -707]
3497g07R17P85P44k37j110q42j115n6P85J201R88m8J26j303q33p10M6L77J341
3516C49J010P0k21j222q91o07L08O59Q04J126L89p46p62j023q28L76Q57Q35Q45
3535A328l2k93j125p69o52K82Q73Q92R00J60m48j213r57k60p7Q91J109O81J10
3554A400k46j250r09l33L8O06J366Q73j35n17q38j164k99N84M93J159Q51l78n86
3573G15p81q46m09R0P72J006Q56J11q42p86q01o67L85P92J117N98K82o39j436
3592d83q66M4j4R46J167L36K90o48j178n89o50N91P66J198N17L2p82r84j056k38
3612a601P64N78J070O86k21p61r77o75m76Q67Q12O12Q80j68j000p94p05m63P45
3631h27Q61O91P72oj150j114l62l53N78P63R90N02o9j041q26o01o9J33J328R22
$$ y = [-707, 210, 995, 1739, 1502, 392, -450, -1565, -1621, -836, 365, 1353, 1305, 1431, 128, -705, -1415, -1369, -992, 349, 1359, 1429, 1208, -14, -905, -1512, -1204, -545, 259, 1385, 1774, 1028, 266, -757, -1585, -1209, -352, 483, 1328, 1296, 1003, -122, -891, -1543, -1261, -388, 504, 1404, 1564, 1116, -97, -1054, -1314, -1391, -500, 609, 1290, 1400, 1154, -96, -1005, -1338, -1300, -694, 672, 1545, 1410, 893, 55, -1109, -1408, -824, -331, 828, 1679, 1301, 715, -66, -912, -1321, -1231, -459, 547, 1403, 1514, 672, -114, -915, -1582, -1197, -405, 712, 1310, 1592, 953, -483, -1349, -1305, -1319, -373, 794, 1130, 1420, 772, -406, -995, -1645, -1054, -288, 910, 1427, 1459, 677, -307, -1363, -1601, -837, -259, 811, 1497, 1276, 515, -462, -1137, -1613, -746, 66, 678, 1558, 1390, 390, -404, -1109, -1572, -827, 34, 725, 1497, 1491, 341, -773, -1135, -1488, -910, -147, 843, 1345, 1276, 235, -591, -1192, -1261, -1128, 200, 1122]
3651A122M68k06r72j128p46K31N03P11J131M57n55p20q37q02l11P83J164R24K20
3670A437l89r88o18r60Q4Q92O58J067J37j22j150q12m67K8M62R86R84n5n3p77
3690C44j188m52J03O01Q58Q65J67k96r63p98p19K37O27P07R16M71m58p93j270
3709a041m34L08O58J121M71K90m50p01j067n01L74M65R86N54Q2j79q49j004p05
3728a622M96P96R71M86J64k80j165n88m82J05O72Q21P67K78n62r53r59m17M27
3747a045N45J084Q95k21m11j019q70m22K99R02Q30P49R8r22p30o60n85J78J004
3766c01J139N42j92o01j163m95l50J93J113J062L08K1m12q70j438J15K31R03J008
3785H13N90k16o04n61j234j75M63R44O24O97l57o01p96o72l22N37Q63R25M30k76
$$ y = [1122, 1590, 1384, 412, -716, -1462, -1231, -728, -17, 1114, 1571, 1016, 296, -541, -1343, -1654, -871, 293, 1217, 1437, 1048, 60, -558, -1518, -1434, -542, 116, 1183, 1320, 1198, 48, -764, -1231, -1203, -741, 245, 1229, 1174, 1121, 344, -844, -1296, -1193, -592, 266, 1131, 1298, 1002, 39, -759, -1478, -1241, -614, 93, 1009, 1480, 1022, 229, -1041, -1475, -1167, -509, 612, 1083, 1373, 923, 222, -845, -1346, -972, -507, 479, 1033, 1115, 936, 87, -917, -1622, -1126, -330, 641, 1127, 1291, 1011, -154, -742, -1224, -1119, -447, 374, 1141, 1419, 857, -96, -1055, -1472, -1045, -500, 584, 1479, 1258, 847, -172, -1042, -1464, -1165, -263, 567, 1316, 1414, 492, -238, -898, -1483, -1305, -301, 838, 1380, 1188, 587, -576, -1071, -1421, -1228, -115, 947, 1255, 1276, 864, -6, -1444, -1329, -1098, -195, 813, 1403, 1187, 583, 22, -1212, -1387, -924, 20, 644, 1341, 984, 383, -413, -1085, -1407, -870, -7, 918, 1348, 1072]
3805A072o87o78r32j04L54J008P65N58P9j124p35p43P8L11R99P83L15j37p93j057
3825f68n48J0J01J129R74L76j66q40j010l41k33N82Q74P54K51j48p68r89n37O4
3845a133N77N81J002J69j97j001m28o59k4M05Q20Q23M25l63q52r38o38K04O28
3864e99R36M60K21l7n56j162m70K2N58R85Q48J92m78q57q25l30J9P68P03P04k51
3885H51J22r84p62n99P1P19J030Q52K3o57m94j233k61M65L49R44P26J11l73r96
3905i6o99l66J96P26N06P42L57m57j126p31l6n4O25P81P83Q5l89r77r52k25PR95
3927c05Q74Q27j79l63q21j100j14K98N83Q65N05K4n83p36n89n38M01O79R12M88
3947A128O2n58j030n68k74K66Q50P23O86k11o45p88n54l12nQ97R56M50K56o59
$$ y = [1072, 385, -293, -1225, -1329, -975, 33, 798, 1356, 1435, 311, -424, -1167, -1089, -778, 221, 1004, 1319, 1182, 389, -668, -1216, -1206, -1105, 24, 998, 1374, 1208, 368, -642, -983, -1216, -634, 240, 994, 1245, 1097, 329, -660, -1197, -1133, -556, 25, 1027, 1196, 999, -2, -430, -1089, -1113, -708, 112, 935, 1360, 997, 145, -793, -1431, -1227, -599, 337, 797, 1018, 981, 425, -737, -1207, -1185, -627, 358, 1206, 1398, 920, 63, -762, -1092, -1073, -305, 398, 1102, 851, 973, -11, -773, -1372, -1301, -582, 448, 1300, 1323, 666, 172, -1061, -1322, -857, -508, 436, 1162, 1273, 900, -96, -795, -1161, -965, -239, 267, 1009, 1366, 909, -217, -948, -984, -1038, -413, 368, 1151, 1236, 847, -130, -1082, -1307, -1300, -305, 569, 1396, 1217, 854, 33, -1067, -1181, -883, -300, 565, 1070, 1094, 511, -225, -814, -1352, -951, -272, 640, 1128, 1190, 632, -398, -966, -1240, -974, -124, 599, 1285, 1074, 429, -359, -913, -1225, -1230, -333, 623, 1073, 1329, 670]
3967F70o51j086j56M87M02J159L25R9o07j182m11k07N36M62J090M45n41l52q96
3986d14p00m4N24R6J265N59l48p25p10n28m20N67R20Q44K76l92n38q41n34k79
4006a422R88O56N35N82l86o68p56q30p2O44Q56R14R6j94n74r42o15k96P58R03
4026A77P51N24o78m01p73q43N0R12L71P74N04m33j076m16o78J07Q09P31N62L24
4046A298l11p22r39l76j39O55Q40O05L8j22n46r16m83K00K62J111P30Km50n52
4066A85n66q48L96L41P31Q17K89o68o25o62o63M83P30L61R02Pm86r74o67k81J78
4087a020O34J039N77K11o52j221m06l23K57N82R70L47L41o92p00r53N5K0O68R09
4107F43M90K8n99r38o78J19J96N43N68P42k27m33n29q93j49J03R00O20P70k87
$$ y = [670, 19, -1067, -1223, -736, -334, 825, 1150, 1249, 642, -540, -951, -1158, -622, -160, 930, 1375, 834, 482, -414, -1114, -1158, -634, -538, 727, 1286, 938, 213, -497, -1025, -1445, -878, 42, 886, 1162, 770, 232, -609, -1143, -1422, -434, 222, 757, 1339, 953, 285, -471, -1301, -1373, -729, 127, 1041, 1137, 943, 369, -573, -1188, -1484, -726, 177, 928, 1452, 774, 373, -400, -1243, -1193, -281, 90, 864, 1368, 935, -141, -557, -1235, -1128, -319, 412, 974, 1298, 987, 265, -674, -1050, -1189, -534, 306, 911, 949, 827, 281, -635, -1118, -918, -656, 455, 1185, 1187, 737, 185, -381, -1229, -833, -492, 239, 1056, 1345, 677, 52, -610, -1273, -790, -60, 301, 1203, 1210, 724, -250, -917, -1198, -1020, -386, 653, 1230, 1441, 789, -432, -838, -1161, -904, -322, 648, 995, 1336, 644, -56, -1009, -954, -934, -266, 643, 1133, 1161, 562, -376, -1054, -935, -739, -196, 372, 1114, 887, 454, -75, -968, -1117, -1014, -114, 506, 1276, 989]
4127I89n70p85o89l9K44P94O95M31M7o57o93o34l71L66O45J076M53n85j16r80
4147c79o97O6J45Q22M85N68o5l52q27r11p4N75J57J130O45l66p09n43n70k90N65
4168f25Q50M19L14j15l66r46n87p4N87Q13N03J27L56j038p42l48n3J54P63P97
4188G89M3Q6p16n78q26Q6M15J170L35K56l48m47q85n11j95J068P26N71J24l71
4208G92p99p15l80M1O62P28N89oj40l98q38m26o9K45R65O88k08O0o81p80m21Q8
4230a003M63Q79M11M60n32q56n64l88J72Q09O11L17J79m01p05p25n21N92N71Q19
4250E88P06k8m21r30o48n37M31O19Q83K86L2l95m93j047l86K92J040N35L70l5
4270H62k43p73o22n6j2P53N63M92J40m62q19n16l01K20Q29O92N40n12k27o71p64
$$ y = [989, 419, -366, -1055, -1094, -850, -56, 639, 1070, 1117, 460, -233, -867, -1238, -872, -227, 849, 1302, 717, 601, -379, -1076, -1010, -865, -43, 442, 1010, 945, 593, -234, -1145, -1219, -644, -487, 643, 1288, 922, 213, -330, -900, -1190, -625, 225, 644, 958, 843, 477, -469, -1056, -1130, -543, 270, 773, 900, 1256, 218, -524, -872, -925, -771, -8, 789, 832, 918, 202, -376, -1202, -1116, -701, 469, 804, 1060, 712, 265, -620, -1131, -1326, -258, 468, 1039, 1163, 792, -7, -722, -1102, -1061, -399, 329, 918, 912, 772, 374, -464, -890, -959, -714, 251, 939, 731, 791, 110, -670, -1091, -1003, -540, 339, 750, 1210, 678, -178, -742, -1130, -958, -149, 462, 779, 958, 557, -148, -873, -1394, -802, -231, 588, 1294, 1266, 845, -85, -733, -1270, -839, -220, 663, 949, 981, 586, 93, -954, -1340, -1048, -8, 527, 897, 862, 619, -154, -776, -832, -844, -91, 472, 964, 1104, 642, -177, -693, -994, -774, 55, 747, 1287, 775, 548, -123, -887]
4291h87k80O08M91O41L85J29p24o56n70k41N37N92Q13K55lo57p27q10K23K1Q13
4312d7O47N23l68l47p98n44k13M69Q12M84J64j03k30r22l31k25L60O96Q72L87
4332A286n33j22q79r35j29N15J114M73L62l71m73o87p55K70M61L34Q46K93j43
4351I27p41p47l29K12K28O48P06K20k2r93p10m90K46L31R83K41M52n51m22r30
4371g41k20n8M37R50Q74K61q27n97p35n81l7P72Q90J11O00m01o95p25m73K65N23
4392d07Q54M48M18n17r69o06k92J37N29Q36P04j37k26q65o01m94L90N58N43P45
4412A048L9l64q98p76k24K05O90N59N21L51o08q20m44l83N67N00O21M45j2p59
4432B58o05n52j52K22O06P85M95K2l77q92o99k24L66N33O07R29n13n45o99n23
$$ y = [-887, -1167, -559, -68, 573, 958, 1087, 363, -293, -863, -1104, -567, 25, 838, 1093, 1090, 433, -294, -1104, -881, -860, -47, 600, 1123, 755, 408, -390, -934, -1147, -678, 134, 618, 782, 679, 449, -473, -804, -1029, -669, 27, 899, 1286, 753, 631, -248, -1183, -1312, -797, 317, 790, 1152, 781, 308, -379, -1134, -864, -403, -69, 777, 1070, 927, 186, -561, -890, -678, -450, 198, 904, 1124, 1102, 109, -601, -1091, -845, -514, 469, 710, 1162, 611, 189, -741, -961, -1019, -582, 368, 1242, 1503, 676, 79, -656, -1237, -1274, -502, 388, 499, 1099, 698, 3, -722, -1195, -930, -407, 447, 895, 1313, 796, -173, -779, -1071, -934, -405, 431, 1135, 998, 772, -93, -694, -1188, -798, -240, 303, 1048, 1087, 723, -175, -951, -1175, -970, -280, 279, 800, 1151, 543, -277, -721, -1104, -537, -37, 584, 1029, 1017, 258, -347, -899, -1051, -829, -223, 562, 1057, 1079, 702, -190, -889, -1113, -747, -214, 393, 1322, 809, 264, -435, -958]
4452i58K5L08M63P67O12l48m16p15p38q2L54Q65M52N36K0r49m54m43j69l4O47
4473b57J003Q6J28p98m86p16r5O37O44M83O00q3q01p89n38K85J60Q11N32K8P6
4494I10p23q61j34j43L55Q94L08L51l90n45o93k66k06J46R92Q84K90n43k60r32
$$ y = [-958, -933, -625, -162, 605, 1217, 869, 453, -262, -1000, -1082, -728, 137, 589, 1125, 1145, 196, -258, -701, -870, -904, -257, 746, 832, 960, 162, -324, -1040, -1135, -498, 146, 629, 1229, 1146, 345, -444, -982, -697, -537, 274, 806, 834, 910, 187, -674, -808, -951, -596, 298, 606, 957, 567, 22, -671, -937, -1143, -997, -5, 879, 1169, 626, 366, -566]
$$ [...]
8191d83
##END NTUPLES=NMR FID
##END=
