##TITLE=1H_LR-759-R2-C1
 CCl4
 8 sc, 
 21.12.2022
##JCAMPDX= 6.0         $$ Bruker NMR JCAMP-DX V2.0
##DATA TYPE= NMR FID
##DATA CLASS= NTUPLES
##ORIGIN= UXNMR, Bruker Analytische Messtechnik GmbH
##OWNER= root
$$ XWIN-NMR		Version 3.5
$$ Wed Dec 21 14:21:28 2022 Russian Standard Time (UT+4h)  she@DPX200
##.OBSERVE FREQUENCY= 200.131
##.OBSERVE NUCLEUS= ^1H
##.DELAY= (6, 6)
##.ACQUISITION MODE= SIMULTANEOUS
##.ACQUISITION SCHEME= undefined
##.AVERAGES= 8
##.DIGITISER RES= 18
##SPECTROMETER/DATA SYSTEM= spect
##.PULSE SEQUENCE= zg30
##.SOLVENT NAME= DMSO
##.SHIFT REFERENCE= (INTERNAL, DMSO, 0, 15.7039)
##AUDIT TRAIL= $$ (NUMBER, WHEN, WHO, WHERE, WHAT)
$$ ##TITLE= Audit trail, XWIN-NMR		Version 3.5
$$ ##JCAMPDX= 5.01
$$ ##ORIGIN= Bruker BioSpin GmbH
$$ ##OWNER= she
$$ F:/spectra/data/she/nmr/H-F/1/audita.txt
$$ ##AUDIT TRAIL=  $$ (NUMBER, WHEN, WHO, WHERE, WHAT)
(   1,<2022-12-21 14:20:25.03 +0400>,<she>,<DPX200>,
      <created by zg, POWCHK disabled, PULCHK disabled
       configuration hash MD5:
       00 E9 B6 7A A2 85 ED C7 34 08 36 98 17 FE 4E 26
       data hash MD5: 16K
       67 66 05 D6 83 D2 FF 82 E8 A2 1D 86 7D 01 A4 8A>)
$$ ##END=
$$ 
$$ hash MD5
$$ 82 75 BE 4A 52 BF A7 6C B0 29 D1 8E 41 83 ED EF
##$RELAX= 
##$RELAX= 
##$RELAX= 
##$RELAX= 
##$RELAX= 
##$RELAX= 
$$ Bruker specific parameters
$$ --------------------------
##$DU= <F:/spectra>
##$EXPNO= 1
##$NAME= <H-F>
##$PROCNO= 1
##$TYPE= <nmr>
##$USER= <she>
##$AMP= (0..31)
100 100 100 100 100 100 100 100 100 100 100 100 100 100 100 100 100 100 
100 100 100 100 100 100 100 100 100 100 100 100 100 100 
##$AQSEQ= 0
##$AQ_mod= 1
##$AUNM= <au_zg>
##$AUTOPOS= <>
##$BF1= 200.13
##$BF2= 200.13
##$BF3= 200.13
##$BF4= 200.13
##$BF5= 200.13
##$BF6= 200.13
##$BF7= 200.13
##$BF8= 200.13
##$BYTORDA= 1
##$CFDGTYP= 0
##$CFRGTYP= 5
##$CHEMSTR= <none>
##$CNST= (0..31)
1 1 145 1 1 1 1 1 1 1 1 1 1 1 1 1 1 1 1 1 1 1 1 1 1 1 1 1 1 1 1 1 
##$CPDPRG= <>
##$CPDPRG1= <>
##$CPDPRG2= <>
##$CPDPRG3= <>
##$CPDPRG4= <mlev>
##$CPDPRG5= <mlev>
##$CPDPRG6= <mlev>
##$CPDPRG7= <mlev>
##$CPDPRG8= <mlev>
##$CPDPRGB= <>
##$CPDPRGT= <>
##$D= (0..31)
0 1.2 0 0 0 0 0 0 0 0.06 0 0.03 0 0 0 0 0.0002 0 0 0 0 0 0 0 0 0 0 0 0 
0 0 0 
##$DATE= 1671618024
##$DBL= (0..7)
120 120 120 120 120 120 120 120 
##$DBP= (0..7)
150 150 150 150 150 150 150 150 
##$DBP07= 0
##$DBPNAM0= <>
##$DBPNAM1= <>
##$DBPNAM2= <>
##$DBPNAM3= <>
##$DBPNAM4= <>
##$DBPNAM5= <>
##$DBPNAM6= <>
##$DBPNAM7= <>
##$DBPOAL= (0..7)
0.5 0.5 0.5 0.5 0.5 0.5 0.5 0.5 
##$DBPOFFS= (0..7)
0 0 0 0 0 0 0 0 
##$DE= 6
##$DECBNUC= <off>
##$DECIM= 32
##$DECNUC= <off>
##$DECSTAT= 4
##$DIGMOD= 1
##$DIGTYP= 9
##$DL= (0..7)
0 120 120 120 120 120 120 120 
##$DP= (0..7)
150 150 150 150 150 150 150 150 
##$DP07= 0
##$DPNAME0= <>
##$DPNAME1= <>
##$DPNAME2= <>
##$DPNAME3= <>
##$DPNAME4= <>
##$DPNAME5= <>
##$DPNAME6= <>
##$DPNAME7= <>
##$DPOAL= (0..7)
0.5 0.5 0.5 0.5 0.5 0.5 0.5 0.5 
##$DPOFFS= (0..7)
0 0 0 0 0 0 0 0 
##$DQDMODE= 0
##$DR= 18
##$DS= 0
##$DSLIST= <SSSSSSSSSSSSSSS>
$$ [...]
##$SUBNAM2= <"">
##$SUBNAM3= <"">
##$SUBNAM4= <"">
##$SUBNAM5= <"">
##$SUBNAM6= <"">
##$SUBNAM7= <"">
##$SUBNAM8= <"">
##$SUBNAM9= <"">
##$SW= 18.0517599122864
##$SWIBOX= (0..15)
0 0 2 0 0 0 0 0 0 0 0 0 0 0 0 0 
##$SW_h= 3612.71676300578
##$TD= 16384
##$TD0= 1
##$TE= 0
##$TE2= 300
##$TE3= 300
##$TEG= 300
##$TL= (0..7)
0 120 120 120 120 120 120 120 
##$TP= (0..7)
150 150 150 150 150 150 150 150 
##$TP07= 0
##$TPNAME0= <>
##$TPNAME1= <>
##$TPNAME2= <>
##$TPNAME3= <>
##$TPNAME4= <>
##$TPNAME5= <>
##$TPNAME6= <>
##$TPNAME7= <>
##$TPOAL= (0..7)
0.5 0.5 0.5 0.5 0.5 0.5 0.5 0.5 
##$TPOFFS= (0..7)
0 0 0 0 0 0 0 0 
##$TUNHIN= 0
##$TUNHOUT= 0
##$TUNXOUT= 0
##$USERA1= <user>
##$USERA2= <user>
##$USERA3= <user>
##$USERA4= <user>
##$USERA5= <user>
##$V9= 5
##$VALIST= <valist>
##$VCLIST= <CCCCCCCCCCCCCCC>
##$VD= 0
##$VDLIST= <DDDDDDDDDDDDDDD>
##$VPLIST= <PPPPPPPPPPPPPPP>
##$VTLIST= <TTTTTTTTTTTTTTT>
##$WBST= 1024
##$WBSW= 4
##$XGAIN= (0..3)
0 0 0 0 
##$XL= 0
##$YL= 0
##$YMAX_a= 176665
##$YMIN_a= -271799
##$ZGOPTNS= <>
##$ZL1= 120
##$ZL2= 120
##$ZL3= 120
##$ZL4= 120
##$ABSF1= 10
##$ABSF2= 0
##$ABSG= 5
##$ABSL= 3
##$ALPHA= 0
##$AQORDER= 0
##$ASSFAC= 0
##$ASSFACI= 0
##$ASSFACX= 0
##$ASSWID= 0
##$AUNMP= <proc_1d>
##$AZFE= 0.1
##$AZFW= 0.1
##$BCFW= 1
##$BC_mod= 2
##$BYTORDP= 1
##$COROFFS= 0
##$CY= 11.3945322036743
##$DATMOD= 1
##$DC= 2
##$DFILT= <>
##$DTYPP= 0
##$F1P= 2.36226072786647
##$F2P= -0.459571619588291
##$FCOR= 0.5
##$FTSIZE= 0
##$FT_mod= 4
##$GAMMA= 1
##$GB= 0.15
##$INTBC= 1
##$INTSCL= 1
##$ISEN= 128
##$LB= 0.24
##$LEV0= 0
##$LPBIN= 0
##$MAXI= 10000
##$MC2= 0
##$MEAN= 0
##$ME_mod= 0
##$MI= 1.114404
##$NCOEF= 0
##$NC_proc= 0
##$NLEV= 6
##$NOISF1= 3.799351
##$NOISF2= 2.8
##$NSP= 1
##$NTH_PI= 0
##$NZP= 0
##$OFFSET= 15.70392
##$PC= 1
##$PHC0= -19110.22
##$PHC1= 15.20072
##$PH_mod= 1
##$PKNL= yes
##$PPARMOD= 0
##$PSCAL= 0
##$PSIGN= 0
##$REVERSE= no
##$SF= 200.130013532006
##$SI= 16384
##$SIGF1= 3
##$SIGF2= 2
##$SINO= 400
##$SIOLD= 16384
##$SREGLST= <1H.CDCl3>
##$SSB= 0
##$STSI= 0
##$STSR= 0
##$SW_p= 3612.71676300578
##$SYMM= 0
##$S_DEV= 0
##$TDeff= 0
##$TDoff= 0
##$TI= <>
##$TILT= no
##$TM1= 0
##$TM2= 0
##$TOPLEV= 0
##$USERP1= <user>
##$USERP2= <user>
##$USERP3= <user>
##$USERP4= <user>
##$USERP5= <user>
##$WDW= 1
##$XDIM= 8192
##$YMAX_p= 0
##$YMIN_p= 0
$$ End of Bruker specific parameters
$$ ---------------------------------
##NTUPLES= NMR FID
##VAR_NAME=  TIME,          FID/REAL,        FID/IMAG
##SYMBOL=    X,             R,               I
##VAR_TYPE=  INDEPENDENT,   DEPENDENT,       DEPENDENT
##VAR_FORM=  AFFN,          ASDF,            ASDF
##VAR_DIM=   8192,          8192,            8192
##UNITS=     SECONDS,       ARBITRARY UNITS, ARBITRARY UNITS
##FACTOR=    0.0002768,     1,               1
##FIRST=     0,             0,               0
##LAST=      2.2672688,     0,               0
##MIN=       0,             -271799,         0
##MAX=       2.2672688,     176665,          0
$$ Real data points
##PAGE= N=1
##DATA TABLE= (X++(R..R)), XYDATA
0@%%%%%%%%%%qJ6j6J6k4L2m0M8n6P2q8J04j20J36j60J92k24K56k96L41l89M44
32B36n04N73o50P31q20R22j033J152j284J429j588J760j947K152k375K620k891
49a517L187l508L864m259M695n184N733o351P060p876Q827r959J1327j3023J5189
64H205j8062K2085k8161L8526o0960J97365j04282j22775K41297j94837Q5865
75F4266J12399j39898K9381O5923q7322P0782p3776n6216J46867l944o5534M8655
87A11583o3156P988L0206o4084L8027L4595k0054O8674o1993q0200N2551q253
99D5884J7204L1674o7190O7243L4169j09018M3809R57q7532J18131L2981r4793
111C3519L3356k8322k264P7592j01630R1J11558q7532J9830O7667j39537J2100
$$ y = [0, 0, 0, 0, 0, 0, 0, 0, 0, 0, 0, -8, 8, -8, 8, -16, 16, -24, 24, -32, 40, -48, 56, -64, 72, -88, 104, -120, 136, -160, 181, -208, 236, -268, 305, -345, 386, -434, 488, -545, 607, -677, 752, -836, 924, -1023, 1129, -1246, 1374, -1517, 1670, -1838, 2026, -2233, 2462, -2722, 3011, -3340, 3720, -4156, 4671, -5288, 6039, -6984, 8205, -9857, 12228, -15933, 22593, -38367, 158998, 54716, -68059, 173238, -21599, 64266, 176665, 36767, 66148, 132071, 44749, 115531, 41755, -14461, 132406, 128462, 62928, 111583, 48427, 56415, 86621, 22537, 60564, 95159, 75105, 143779, 81786, 1586, 54137, 45884, 63088, 94762, 27572, 94815, 128984, 19966, 63775, 64732, -22800, 95331, 128312, 33519, 66875, 38553, 36289, 113881, 12251, 12342, 123900, 36368, 56198, 123865, -15672, -3572]
123c572Q2347n5260N0820P332p1277P6836k0829q6338P4309n534l9159P1304k2041
136E8938m0891K5644j3679J8743l519m6047M8912J3811l9486K6753j9989k6989
148B201L5148k928J4461O494n0258L3428J7622o4575K7830K1516l4276L8553j833
161D3383k9355K8590l1719j296N0122o0296r113O9965l7221j3576L4926l5793
173H617j838J8919j0700K1462j9065k3323M6443k0130l8843M1031l70j3245K6345
186C5303j4635j3091L604j0898J9033k035k7476K3747J5932j0472q67j8468k19
199e42J1905j4047J9368R731l6855J7027K2801l3780l211J6728L999P807j7283
212C648k541J2631k7356R048L2360l5409n596M3155r999k1436j560p586P958M042
$$ y = [-3572, 78775, 23515, 74335, 81667, 10390, 87226, 66397, -19941, 54368, 48834, 9675, 80979, 58938, 18047, 43691, 30012, 48755, 45236, -811, 48101, 61912, 22426, 49179, 29190, 2201, 37349, 34421, 48882, 55376, 5118, 38546, 56168, -8407, 19423, 40939, 6663, 45216, 43383, 14028, 42618, 10899, 9603, 59725, -571, -9684, 60281, 23060, 9484, 44410, 8617, 6779, 25698, 14998, 36460, 17395, -5928, 40515, 20385, -18458, 22573, 22203, 8958, 35303, 20668, 7577, 11181, 283, 19316, 17281, -10195, 13552, 29484, 19012, 18145, -323, -542, 11363, -2684, 16684, 26415, -10440, 6587, 29388, -4392, -7603, 9125, 13124, 20931, 3648, 1107, 13738, -13618, -4570, 27790, -7619, -13215, 29940, 19941, -1495, -3055, -10641, -2683, 1359]
226A359J207J6272j3872j3178K1514r305k2445J3723J3494L821o151j4304M697
239c168J144n968J3422K86j1967Q600Q141m956j5820j2438J9736J2632j4301J0315
253E658P989k0718n28P988j0102l043Q190J6436J743k7361p00K0204j2953l373
267a0570J8975q659j0623J2933L767j3754j1778R468J9174n876q864J0807n101
280a01j4438N970M318o983L564J4392M916j5292j2499Q158O006l679Q02K745M20
295a701k628QM688r489r735J8246J2079j5496n597Q288l043p880R52Q756J291
310a261m185J1868K785k5988m879K3579j194j2766Q933O344p955n86M964n037
324e378r806O056J5705l039j4295L364Q502p239n207O979L476j253L831P39j0116
$$ y = [1359, 2566, 18838, 4966, -8212, 13302, 3997, -18448, -4725, 8769, 12590, 6439, -7865, -3168, -2024, -7992, 5430, 5716, -6251, 2349, 10490, 5534, -10286, -22724, -2988, 9644, -4657, 5658, 13647, -7071, -7599, 389, -9713, -12756, -4566, 11870, 13613, -13748, -14448, 5756, -7197, -10570, 8405, -254, -10877, 2056, 5823, -7931, -19709, -10241, 8933, 3057, -5807, 5000, -101, -14539, -8569, -4251, -11234, -7670, 6722, 11638, -3654, -16153, -7995, -1989, -5668, -4866, -2121, -1701, -4329, -4321, 367, -9122, -18857, -611, 11468, -4028, -9625, -1337, -4380, -12260, -11308, -2552, -1261, -5446, 6422, 9207, -16781, -21660, 1919, 725, -12041, -3108, 3236, -4719, -5305, -341, -5378, -15184, -9128, 6577, 3538, -10757, -7393, 1109, -6130, -11337, -4358, -882, -2135, 1696, 2435, -7681]
339g681r007N916J2708L84r691K632R577n615r232M213M39n961Q035J1289p902
354A04j1794O519Q265r137q030J1918Q907q775k625N450j0594p643J8009R384
368I958j4813k681J1231k491r884n20M505O88k88P432L064j2530l777J1218k571
383a459r771N468Q702O63l541n555n93J12l40Q923M366j1505l404J0335k067j1245
399a0911J942J1089J61m778M971Q45j1758q66J1121k449r650Q019J3562p218j3615
414i535M724L343p261P185J0999r679p669O605K798n388m719O221R149n066m794
429c087N458n268o767Q635L060n822J634N795L280o539j1438M305Q315l635K345
444B71O153p486n535O399K665o868k906J0275O062j0102m794O170j921m529N900
$$ y = [-7681, -16688, -10772, 1936, 2320, -7371, -4739, 4838, -777, -10009, -5796, -5357, -11318, -3283, 8006, 104, -11690, -5171, 3094, -6043, -14073, -2155, 6752, -2023, -4648, 802, -9792, -17435, 574, 9958, -4855, -7536, 3695, 1204, -8680, -9200, -4695, -4007, -4295, 3137, 6201, -6329, -10106, 1112, -1459, -11230, -5762, 2940, 3603, 62, -5493, -6086, -5974, -6314, 2609, 6975, -4530, -7934, 2401, 334, -10911, -8969, 2120, 2281, -2497, 2474, 3319, -8439, -9305, 1816, -633, -10283, -2264, 11298, 4080, -9535, -4811, -1468, -8729, -1544, 9455, -224, -7893, -1288, 1510, -3878, -8597, -2376, 6773, 1707, -3087, 2371, -2897, -9664, -1029, 2031, -3791, -2157, 3638, 6918, 379, -11059, -6754, 1561, -2074, 271, 6424, -1062, -6597, -198, 2467, -4401, -7307, 2968, 9030, -1072, -5866, 304, -1617, -6146, -246]
459b46M745n991j707J0533r70j7448J9J3856q79k663N812j416o691o05L787K13
475C49o582L908J2608o344j1076N656J451l096M001k04q81K489j194J133k298
490h0j0188M550J3352j936o272J373P97l698k985L659L251m403L956Q715r525
505E66j0804R135P021p723k395Q390L18o884L924K095j1536N19J4233O79p604
520f6q91J657m08m133O1O094q42n80O171m739q629K753M765J224j508l480N164
537B613L621q339q5M110n862J535J0146j991q193k91M527j382n596M773P744m465
553B865l425L802l515o011N218O951l507o192N228N558o624l992M276j171j831
568b370N037L404l579o006K232N445n791k905R777J69o517K212n25m416J929L651
$$ y = [-246, 4499, -1492, -3199, 7334, 6364, -11084, -11065, 2791, 1912, -751, 5061, 3645, -3046, -3651, 136, 349, -6233, -2325, 10283, 3939, -7137, -1481, -30, -3126, 875, 671, -210, 2279, 1085, 2218, -80, -10268, -5718, 7634, 5698, -574, 799, 1596, -2102, -5087, -1428, 1823, -2580, 1376, 10091, 566, -10238, -1103, 5918, -1805, -4200, 4190, 4508, -2376, 1548, 3643, -7893, -7374, 6859, 7538, -66, -957, 700, 292, -3841, -3780, 2314, 1472, 892, 7063, 2324, -6305, -3552, 1213, 2437, 929, -2551, 2613, 6234, -2105, -2190, 1920, -3942, -2407, 7739, 5748, -2445, -2736, 1791, 409, -5187, -414, 7330, 2865, -560, 3242, -273, -6284, -1066, 5885, 2378, -3814, 1414, 6972, 348, -3644, 632, -539, -2370, 2667, 6071, 2492, -3514, -1282, 4163, -1628, -4533, 5244, 5413, -1104, 1108, 583, -3833, -1904, 1747]
584A747K440j714m708L965L378o911j824M492j57l85K584J734l313n415L146M748
600C807n943r61Q988l23p612m58L758k209k296P787K586j0088o2R246m666p389
616e835M923L371j651Q23K697j213o730J26O594l153l156O793J796m026k186k213
632c040J755L249j332K080J236o168O28N640l590n625L739P088j561n174K789
647A714K54p144K607P138m068k468O666J024p281m395M988M304l376J219L785
662D967n713k843N859p67m494J073M739K698m871l324L906j366l871N241K029
677C263l378J690K010k721n080p57O630K954m527M96J895l849r26L244Pk839Q41
694a047N544m29p379M98M659k706j723M509J331k645j588K295j412o070M265Q848
$$ y = [1747, 4187, 2473, -2235, 1730, 5108, -1803, -3627, 865, 708, 323, 2907, 4641, 1328, -4087, -941, 3807, -2136, -3097, 5891, 5568, -2044, -2502, 1256, -953, -3249, 4538, 7124, -2964, -3026, 6220, 1554, -5835, -912, 2459, 808, 1631, 4328, 3115, -3615, -3489, 3105, -48, -3204, 3589, 5385, 1359, -827, -3040, -1285, 1964, 632, 2712, 3948, -2220, -1592, 4048, 458, -5167, -1428, 5660, 4099, -1075, 1714, 1968, -5176, -2569, 4569, 501, -1967, 4699, 5723, -1558, -5953, -965, 3339, -37, 1182, 4967, -746, -3589, 2270, 1503, -2991, -1918, 2821, 5519, 648, -2676, 1230, -136, -4007, 1234, 3263, -115, 1575, 3585, 864, -4216, -4973, 1657, 4611, 84, 580, 2475, -1374, -2300, 944, 951, -1888, -1047, 4497, 4068, -3311, -2813, 1846, -860, -2583, 1926, 3257, 612, -976, 1319, -93, -6163, -1898, 6950]
710F950m671m741M135p31m329K274K669j201k230K775M039n379m440N008J364
725A492l384K027J793j009m10j048j70j117j563M416M507m505m282K271K084k520
741a418j288M048M60l903L123L188p078k458O800J426n154K97M920p49m839J363
757a262K104n015K335P806l375o286J736K398o41j603O21K921p72j451K237k384
773f31l720L367K932j516j803P11L060p11n147N75K987r52J473K975k847m654
789c901J366M307j635l790M020L704m090k082K223j438j891L282K749k655l014
804b845M091K356o487j897N175L62j072K416k50l816j106K773J890l170k09M858
820C069p78m546P23Q71r43J306J547n1j578q19K176q7m074K10M338Q96j827m09
$$ y = [6950, 2279, -2462, 1673, 942, -3387, -1113, 1556, 355, -1875, 900, 4939, -440, -4880, 128, 1492, -1892, 135, 1928, 919, 509, -539, -709, -1826, -3389, 1027, 5534, 1029, -3253, -982, 1102, -1418, -2706, 1342, 1802, -2101, 1022, 4210, -2868, -5326, 1474, 2900, -2254, -1957, 2963, 2214, -2625, -1262, 842, -4173, -1838, 5968, 2593, -3693, -1957, 441, -200, -1803, -1182, 1739, 967, -484, 1753, -631, -4351, -984, 1948, 432, -1371, -660, 2400, 1689, -3458, -2883, 104, -848, 625, 3600, 753, -3901, -2535, 1772, 137, -3653, 367, 4071, -19, -2101, 122, -1316, -3207, 75, 2824, 169, -2845, 1246, 3602, -2885, -4782, 393, 755, -317, 2099, 1849, -1967, -3073, -300, 1590, -1580, -1789, 3069, 2291, -2255, -1532, -661, -1604, -298, 1249, 1198, -380, -1199, 977, 890, -3184, -2974, 1364, 2260, 433, 24]
838B4N93k524j017L442J552l470P36L964k119m678J382L498j331j340L093K22
854B027m406J495L753m372k516M766K428k284j157P06r80j813J538K833j652j559
870a193K799M56l511j139K274J598l29p70N74j20j565O75J455k113j606M024K606
887D115l681k701K196K01j877J795K418j711j508K308Q8m321k55N018O77l734
903i72Q29K139k277q94K333q14k512K211L818j732l798L08K125j026o22K264O01
920A981j687p1P96j928j536K456K773r84j992k36J762q86j716J227J001j274J239
937I25K332k520l254J635K719j284j378K700J175l339q59K215j648j480M149K031
953D119m250j479K639M62k728O03K282r54p09K192n54l175k05K710O88j671P1
$$ y = [24, 617, -1907, -2924, 518, 2070, -1400, -664, 3300, 1181, -3497, -2115, 1383, 52, -1288, 1805, 2027, -2379, -884, 2869, -1503, -4019, 747, 3175, 891, -266, 440, -540, -2353, -815, 2018, 366, -1193, 1606, 2062, -1449, -2588, -314, 1284, 955, 185, 759, 639, -926, -251, 1204, -909, -2515, 1509, 4115, 434, -2267, -71, 130, -1747, 48, 2466, 755, -753, 1555, 1643, -2678, -2933, 2085, 2762, -972, -143, 1996, -281, -1175, 1158, 344, -2168, 43, 3861, 2129, -1669, -1361, 764, -262, -884, 1380, 1981, 294, 223, 1019, -909, -2445, 11, 2784, 1800, -192, -428, 1334, 448, -1268, -41, 960, -314, 925, 3257, 737, -2517, -882, 1837, 553, -825, 1875, 3050, -289, -1148, 1067, -581, -2061, 2088, 4119, -131, -1610, 1029, 1491, -1237, -634, 1648, 694, -15, 2177, 1623, -1552, -1757, 953, 1641, -30, 41]
970D1K031o57k341L93P09n25R77J547j91k323j506K755P62k892N48K896j079j380
988b35J509n62k119J75L118K25l000Q54K910k440k695K290J312j367P64J780j695
1005H24k894J512K818k100j596K591J002j854k26L96o64j084J437K087j602j645
1021i98K387K29k644q9J062J137J28p09L36o04k048J665K238k421o53K438L85
1038A839j999j046J143O27j493J177K091k317j156K869q09l180P91L177M5j895
1054a36L80O60k172n1L002j145j782J504J528r12j802j77J414j52n66J683k59
1071A017j748Q73K37j002n02M56K458N48l220J37J543k017K97K431j057j203J040
1088B88J027j360k162J628K248j829p74K282p58j740J185M32j600k96K575J326
$$ y = [41, 2072, 1415, -926, -533, 176, -349, 628, 2175, 1984, -339, -1845, 910, 1672, -1220, -672, 2224, 1145, -235, 1274, 712, -1407, -1232, 1886, 2111, -889, -35, 2875, 435, -2260, 30, 1342, -25, 739, 2519, 824, -2070, -558, 2260, 160, -1436, 1155, 2157, 303, 77, 473, -191, -1275, 162, 2249, 647, -998, 1389, 1618, -1026, -1115, -53, 1084, 1212, 503, 839, 235, -1813, -148, 2090, -331, -984, 1454, 1839, -160, -1206, -63, 564, -929, 248, 2339, 22, -1134, 1735, 926, -2254, -1463, 1714, 1759, -136, 244, 904, -1268, -1319, 1683, 538, -1244, 260, 1788, 876, -926, -1103, 311, 159, -407, 1276, 1017, -731, 142, 379, -623, -1125, -669, 1789, 2337, -883, -746, 797, -1220, -923, 1508, 451, -752, 288, 1315, -45, -2207, -579, 1669, -160, -934, 1348, 590, -1150, 35, 467, -1133, -1429, 1146, 2472]
1104B472k728j323J429m12j67J174L13n93n49N61N35j923p53K831K75j936R01
1121A07N26j155L5m00N93J55m01J798M99l487j80K317l15o25P63L45m78q63M46
1140c20P22k173L65L373j081k344R53J298j220j118J316O15j276J052J718k516
1156f36j760J985P05n20mK54L90p37p01J192q65o35K075L46j681o3Q3N89N0j612
1176a545Q16J689j152L2R95j977q99J889R17q98r47J217Q86k120j92J779j030
1193e40n33K190k28k186J04J661j24j799N25J458l86k74O49r55j215R81Q09N15
1211F52j046j62J292p53j554Q85P14m34P39K68q95m22j35J093j04j749J098J983
1229A470j271p94L69m23l31P48Q65n2j493O46J140j687j084J939Q27j070M1L24
$$ y = [2472, -256, -1579, -150, -562, -729, 445, 758, 165, -384, 177, 712, -1211, -1964, 867, 1142, -794, 107, 633, -522, -487, -887, -294, -139, -540, 1258, 1757, -1730, -1910, 407, 92, -533, 230, 575, 97, -766, -320, 402, -1771, -1406, 1967, 886, -1458, -505, 793, -427, -1545, -229, 386, -890, 162, 1880, -636, -2396, -411, 294, -226, -230, 24, 414, -323, -1024, 168, -697, -1332, 743, 1089, -592, -655, -572, 17, 67, -1545, -729, 960, -192, -160, 835, -1142, -2041, -152, 765, -133, -1080, 137, 1023, -1097, -1289, 490, -540, -1073, 1117, 889, -1297, -1193, 468, 344, -1455, -930, 528, 142, -132, 517, -438, -1653, -672, 137, 652, -394, -556, 736, -17, -1571, -686, 28, -406, 333, 601, -294, -716, -851, 242, 138, -1611, -513, 1470, 199, -595, -226, -649, -980, -232, 633, 581, -912, -266, 874, -813, -1897, 42, 869, -201, -160, 164]
1247A64n10r89R65J159j651k44J954J19j674l4K16K6j27P20Q75j037p69J137m03
1266a03j343R13J041k7l41m88o0J84m89M99J093j320j28J405l32j434l43J147
1284a26M97p98N77R30j627m48J341m86j033J104J415q80j304O07N05j058M94R43
1302F53n50q84J216R8j103k46J90R76o3o15N95K1j025M20M08l83J76M60N09o08
1322B45j277M48J106p95j05Q79k91o69N58N41j205n17J256R72j276m19J146m46
1340A51r15N97L22o91K84R61Lj584j87J471m4q83N92L52m18j54M47j87p52J29
1360e06J284l25r10L30O56n28m09K50K07K02j8K27m79p94N82Q14l48n54L36N02
1380E19k28n49K19J54n78K76J199m15j231O54O40q82n41Q30N45m47Q1J27p58n60
$$ y = [164, -346, -1335, -370, 789, -862, -1106, 848, 967, -707, -741, -525, -499, -626, 94, 969, -68, -837, 300, -103, -1446, -533, 508, 481, 140, -348, -408, -224, -713, -214, 879, -441, -569, 836, 504, -930, -1273, -126, 371, -427, 150, 1080, -547, -995, 346, -140, -1173, -69, 1346, 466, -838, -231, 274, -784, -290, 653, 103, -781, 435, 533, -570, -816, -626, 350, 287, -328, 267, 288, -737, -317, 91, -292, -116, 344, 853, 245, -1032, -584, 522, -273, -378, 501, 210, -459, 99, 640, -565, -1082, 174, 1146, -130, -549, 597, 151, -764, -167, 155, -536, -252, 709, 712, -872, -1059, 412, 368, -515, 77, 429, 11, -143, 304, 117, -635, -506, 778, 453, -457, -127, 529, 1, -408, -158, 49, 251, 233, 460, -19, -813, -231, 583, 235, -319, 17, 519, 291, -258, -39, 115, -463, -187, 1012, 597, -634, 20, 660, -222, -763, 67, 612, 165, 246, 373, -385, -945]
1400i45J176M08p41j05O49J24p30j21L35pk55O33J28m78k89L45K4k65k89O38N71
1421H06o51n88P13n56k58J043L74q24k59P93p4r66J00O85r0k43O47q7r84l7R85
1442E29m16q29Q66P35l70o82K36O6m74M07N53j57n22q4N70k97m81K52O20j73k82
1463F7L78k88l51R4M59k01l45M36M65m78p30K94L84j79L8O01k60o66M17K65m43
1484d3m81R54M89p39k12L53k70m12N11M17p65J56Q95n04n53j90N18J33j59K96
1504C94L7n97r6N13R5o53K71P25j66n24r2K26j02M1J21O0j91kM91l53p62M1J094
1527E71j82n67L19J08m75n5N58p9m42L50Q15n88p18K61O69o35j9M67k13j05K55
1548B95O0n78k68N65M91k87k89K44P6o25K54M29k26q9M26J27q57k08N38L35n31
$$ y = [-945, 231, 639, -102, -207, 442, 566, -164, -285, 50, 43, -212, 421, 549, 71, -218, 127, 151, -114, -403, 235, 806, 155, -433, 280, -276, -534, 509, 883, 59, -200, 593, 519, -447, -347, 338, 248, 5, 652, 565, -419, -456, 529, 113, -716, 150, 885, 515, -167, 69, 135, -339, 68, 621, 464, -58, -142, 428, 131, -350, -98, 522, 349, 67, 445, 157, -194, -100, 359, 158, -187, 249, 714, 236, -494, -200, 184, 5, 43, 644, 384, -282, 135, 400, -43, -524, 430, 919, 180, -32, 321, 51, -361, 150, 567, -198, -42, 853, 349, -204, -394, 124, 257, 98, 394, 431, -166, -262, 251, 346, -307, -36, 689, 523, -1, -93, 133, 31, 72, 193, 253, 62, 60, 551, 198, -564, -523, 571, 389, -178, 141, 249, -226, -281, 277, 198, -244, 106, 921, 333, -385, -124, 545, -90, -109, 358, 145, 40, 295, 355, -223, -491, 74, 565, 278, -11, 233, 309, -316, -62, 367, 141, 52, 478, 605, -252, -460, 78, 413, -118]
1569a18j95M21L97o23K3M70q25Q9O88K06m32l21J69K04m13p9Q41k70m35P40j98
1590C39p99M5O47r0l27K53J26N4l63K00j13l92L54N83k47n87J52K87j1l89K26
1611e2K87j91j16K42k67k89K03M15P2n35MN90l51m41L76O1k96L60L32j97n14J09
1633a98L94k80m21P37K29p58K26J33n55K76L04J76j98k15M58q2l58l10M79J7j27
1654g3K40q8j26j71K23K69m27j85O32O8m96j85K37Q4k40M78R9m09m04P83j97m58
1676c46K15K48n2j8L2n6k79k35O20P9o25L24O51n21k97J66l1J00J04J66J49r07
1698e13L66L94n69q4K74K38Jk06j11J60k15P6M60l50l6K13l2q3n04K13M49P1m35
1721b23L73j55m68M46J46k15j01K68K98k68o64P56l5q22N95L53m97J81K88l02
$$ y = [-118, -313, 108, 505, -118, -95, 375, -450, -361, 327, 533, 101, -220, -51, 153, -260, -339, 502, 232, -203, 537, 339, -460, -415, 232, 142, -185, 68, 194, 248, -115, 85, -28, -420, -66, 517, 270, -317, -165, 122, 111, -278, -52, 235, 44, -72, 170, -97, -386, -183, 232, 304, -231, -227, 363, 12, -429, -53, 8, -288, 72, 404, 207, -307, -198, 196, -84, -505, 232, 461, -297, -71, 62, -493, -217, 87, 263, 65, -150, 308, 226, -132, -442, 37, 54, -73, 167, 79, -47, -218, 5, 274, -153, -338, 294, 362, -134, -319, -82, 2, -238, 240, 339, -70, -474, 309, 112, -346, -131, 117, 65, 47, 79, 23, -256, -491, 129, 208, -417, -93, 558, 37, -260, -94, -125, -25, 79, 245, 394, -513, -147, 247, -322, -406, -132, 106, 107, -99, -210, -50, -265, -189, 271, -79, -115, 98, 66, -17, -521, -308, 141, 212, -223, 150, -5, -473, -27, 119, -96, -197, 71, 369, 101, -563, 193, 158, -664, -69, 284, -213, -32, 256, -46]
1741d6k60K0L85R7k37rK94l94l9L49l55J7J01L16K9m18l02N05r1k62K63K52k73
1764e8j1r8M6j81k21J130m47m34K31K76m62P6Q9J27j10j24M96p7p05M82M12n75
1786a38k15M63K7k97n0N4R8k19L76M03m90k27L66j60k10K95j63J35j02n3L17m12
1808b02k02N48J6k65o3K63J81k78j59O8N6k22N40Q7n57k1K26m0p5j00K74J89m21
1831a57J11L13p95L81N11l56k80M39J17k19k19O3L11k35J48L43m74k75J87J50
1851F4k6j60J14J09J56k92m2k7j82L94n0K4k12P0K71j12m36L39K51l00O2K17m70
1874b38rJ96J63Jm42N21K28o75P1L45k21K3J17J84k50j07J63J07n84J37L19Rp3
1897a5P0Q3l03P1J91J27m74K42K67j05m03K35l6N0o0R5kp7j63L30j07m15J98L59
$$ y = [-46, -306, -286, 99, 196, -41, -50, 244, -150, -189, 160, -195, -178, -77, 239, 268, -150, -452, 53, -38, -300, -37, 215, -58, -69, -167, -121, -302, -523, 607, 160, -274, -43, 233, -229, -153, -64, 63, -47, -171, 325, 248, -457, 25, 437, -138, -353, 110, 137, -160, -210, -156, -58, -277, 99, 502, 12, -215, 151, -9, -219, 76, -87, 48, -54, -107, 210, -202, -404, 144, 160, -105, -168, 95, 276, -2, -161, -93, -37, -259, 281, 368, -189, -210, 16, -24, -99, -199, 75, 264, -157, -46, 267, -528, -147, 364, 8, -272, 167, 284, 65, -154, -91, 220, -15, 133, 476, 2, -273, -86, 64, 38, -122, -8, 101, 257, -35, -77, -104, -286, 108, 58, 82, -130, -60, 211, 99, -337, 2, 253, -47, 15, 232, -238, -247, -51, 112, 113, -329, 192, 420, -255, -184, 161, -60, -37, 80, 264, 14, -93, 70, 177, -407, -270, 49, 58, -15, 55, 138, -165, -94, 97, 224, -250, -8, 259, 154, -249, -14, -50, 0, -60, 35, 33, -44, -207, 123, 16, -399, -201, 158]
1921A58o2j70P0Rrj69K36qk83JM49k22m48N89K3k79o1K30j00j19mL35k90k86M99
1946H9J49j32j96R8R7j75q4J98J36k07j21K29r8l54K48M70l77j81K18J7l83M03
1968D4L26n20j84M24L17m59k75K59J70k95J52L36l14NK24j80l60J28N01j3m87
1989b01J46j13Rj12J62J79k17l3J73L10m84k34L97N7j42l8K61j52j85k0K55k17
2011a99O8L86j51k01k54N89k50q4l0K03k38J10K27j86l46M31O0l05j0K69J18j77
2033C0l02K32q1k40N34K24m85j49K82J71l38mJ84m7M1Q0l7j14j34MK83k54j35
2056b55L04Kj77l9K19j35J3K50Qn04P6N38n4n75K08K26o1o8j9J07j87K7L26J20
2080C50o32K78J72j21m21K01R9J40J4%l4l16K1M58m11n9K19K59k56j2l3J41j63
$$ y = [158, 96, -74, -4, 5, -4, -173, 63, 55, -228, -227, 222, 0, -448, 141, 164, -115, -176, 54, -46, -165, -169, 166, -124, -410, 89, 238, 106, -90, 8, 105, -70, -154, 44, 180, -27, -148, 81, -17, -371, -123, 347, -30, -211, 7, 24, -359, 44, 370, -150, -334, 90, 407, -52, -327, -68, 102, -193, -41, 295, -19, -14, 210, 30, -330, -202, 299, 286, -201, -55, -168, -159, -271, -109, 70, -147, -180, -7, 303, -181, -415, -18, 39, -103, -141, 120, -32, -217, -237, 18, -199, -131, 255, 104, -97, -351, 238, -12, -96, -126, 77, -161, -51, 176, -10, -356, 75, 135, -170, -180, 89, 207, 30, -272, -40, -121, -361, 173, 397, -88, -237, 45, 216, -122, -126, 58, 11, 52, 132, 95, -19, -153, -149, 134, -120, -255, 49, 51, -126, -165, 54, -81, -68, 182, 190, -314, -238, 300, 246, -329, -121, 105, 44, -24, -43, 64, -123, -96, 230, 350, -282, -4, 168, 47, -374, -173, -74, 66, 80, 80, 46, -270, -249, 209, -202, -261, -42, 217, -39, -51, -84, 57, -106]
2103a06LK03k3k42K44J09l69k19K73L68j35k23K15m9l23L65J16k51m7K31O2k41
2125c9l27K16K19j83P6L72m67j31N19k31k89l9L88J72j70k34K04p2k49M93m4k59
2147g5p8P0P6j63r1K64J81j27j45K04p0n2P6j42j02J53M22j56l76r8L45k58L1
2170a11K81J12m21J00L65l24l12L67M32n13n8K06l17J12K66j76l9r6J85L94m17
2191C6l76M54o1j58O4J89j84lP8m6j26j23L49K65m00J8N9k6q5J33Q5j39j58M81
2215C26j76m20J93K86j43j16m5J39J22k30QK24k60m9M76k16m48K74J90m5j21q
2237c9K29j93r7M53k62l89J49L46j28o6j5K1R7k76K04Q9l30L19L52m17k00J05
2259d8L28j34l13K41O5n3N1L2k98r3J93L93l42k79L06K08l14l7L24k70rK87k80
$$ y = [-106, -103, 100, 77, -165, 79, 188, -181, -400, -127, 241, 106, -117, 98, 49, -274, 91, 207, -44, -91, 140, 202, -39, -366, -150, 69, -114, -38, 334, -133, -264, 255, 24, -265, -304, 84, 256, 86, -148, 56, -16, -265, 228, 184, -75, -153, -83, -7, -170, -261, 3, 184, 57, -88, 116, 46, -6, 70, -72, -174, -21, 401, 245, -131, -229, 116, -142, -111, 170, 282, -139, -39, 326, 2, -310, 57, 489, -24, -82, 124, -193, -81, 185, 9, -30, -126, 59, 453, 36, -340, 114, 53, -105, -41, 148, -36, -39, 39, -7, -133, -256, 93, 358, -42, -24, 35, 9, -76, 57, 142, 3, -155, 326, 150, -270, -77, 209, 66, -50, -95, 44, 166, -64, -56, 168, -92, -141, 335, 119, -329, -55, 135, 90, -31, -39, 190, -3, -100, 353, 91, -298, -149, 197, 69, 3, -12, 9, 106, -170, 34, 123, -207, 112, 464, 47, -153, -48, 280, 146, -167, 74, 139, 86, 137, 169, -129, -222, -29, 364, 22, -257, 49, 257, -57, -94, 230, -40, -49, 238, -42]
2282d2o8o7K88P0k64j9L52j12k17J99j52k74L06M9R4l8k17K61J25m33M7M91k97
2305H2J32j8k63on7L19r0l17J64M08j37l40J27p0jj0J68q4r4o7L85m17j44L46
2329A6K05l1o0j12j70K13q2K53k50l26N55J62m46J00k34K68m3J26o0k5k98K63
2351B4P5k57J09K39j7k53j00P8J94l62L58J73l90J4L52J3l27j61K27Q1j64P6J56
2374A38k00k97N92k30j37K05J75j51l20K10K97l66j11K90m5k08L03n4j38k09J30
2395a26J79o0j62J40O7k26J29k4J72j23l6L72l25k76Q0L90j73k28L64Kj35K0J27
2418A48l24j67L44K34l29K0K77j39k50J05J40j48J1J47o3k07l5J39K02j53j44
2439a92L10p0n1po9J14k27K27P5j87M0K55j99ok00J35J15m6J87j56k75L0M36k40
$$ y = [-42, -110, -177, 111, 181, -83, -102, 250, 138, -79, 120, -32, -306, 0, 49, 143, 105, -112, 149, 274, -159, -112, 379, 82, 214, 196, -67, -73, -130, 189, 99, -218, -54, 354, 217, -123, 4, -66, -67, -77, 91, 7, -87, -154, 231, -186, -330, 16, 221, 190, 130, 18, -152, 61, -21, 232, -18, -344, 211, 373, -73, 27, -207, 61, 18, 144, 84, 59, -239, 24, 99, -158, -49, 190, 173, -80, -180, -102, 92, -270, 88, 261, -129, -115, 237, 250, -77, -238, -11, 70, -94, -18, 138, -62, -359, 233, 3, -134, 71, 246, 95, -225, -15, 282, -84, -195, 95, 50, -158, 145, 91, -47, -256, -126, 53, -7, -169, -29, 38, -188, -59, -83, 89, -34, -70, 302, -23, -299, -219, 171, -2, -230, 134, 136, 1, 21, 148, -176, -343, 1, 235, -94, -74, 203, 64, -186, -81, 59, -89, -78, 69, 6, -201, -236, -97, 105, -48, -192, 118, 48, -3, -10, -79, 35, -192, 35, 110, -77, -37, 218, 19, 13, -187, -52, 63, 17, 204, 48, -227, -197, 239, -1]
2463aj46J89R0k05j06J75j00p1O1M69k60k48J79P3j36o7K14Q6j93J48j04j83j04
2486b40M52J05m98m9K24M5m2j6m6Q3j37J31K50m29k1J46J13m4k17J71J78l5j20
2509Dk9q5j02L21O5l21k3L33K7m18L3M40j07k56P4l5p6M4J75K5l16K42J37P1l02
2534g9K9M3j02J71K5Kk66J64M5lj43J06K79j68j91J04m3j29J97oj75j13M37O7
2558B51m26n7K36n6R5KJ96k66j71K91J06k60j69N26J5k84j27K29o2j59K61j37
2580C4j02j3K48p9k69N5K91j7k54J93J05j06n7Q2J04k49M9J44M3l40M0K25j05
2603B2j63J21Q9r4p1J58R6m22J63K53j2m44L28J33j81j57L84k43j50L76J35k31
2625I0l13N03j56l6L2j73J48j41PJ33k59J32K03k7q7k0nK5j39L3J96j30J1J07
$$ y = [-1, -147, 42, 132, -73, -179, -4, -104, -175, -114, 355, 95, -153, 26, 99, -37, -104, 110, 196, 3, 151, 47, -136, -240, 212, 317, -181, -230, -6, 39, -3, -19, -65, 18, -119, 12, 262, -167, -188, -42, 71, 27, -190, -19, 159, 124, 4, -25, -110, -212, 109, 174, -147, -170, 163, 190, -228, -195, 245, 138, -118, -44, -79, -155, -111, 64, 89, -227, 15, 152, 223, -79, -50, -7, -109, 62, 87, 89, -177, -13, 32, 29, -114, -8, 271, 103, -88, 16, -27, -156, 41, 35, -140, -253, 184, 251, -175, -232, 4, -52, 43, 45, 241, -25, -196, 95, 201, -59, -228, 298, 313, 29, -98, 131, 69, -90, 171, 34, -68, -81, 167, 88, -181, -126, 165, 148, -106, 87, 192, 86, 29, 111, 215, -34, 15, 159, 202, -138, -98, 127, 22, -141, -20, 69, -25, -96, 62, 158, -264, -101, 152, 140, -304, 24, 157, -24, -181, 203, -40, -190, 186, 321, 90, -223, 280, 124, 88, 120, -53, 95, -46, -39, 94, -165, -33, 170, 143, 56, 36, 31, 56, -83, -50, 146, 16, 27, 134]
2649A34K44n58j67N25L6l12p3K01P8k44K80j48j32m5K27K57l94l8K69k43p9L2
2671a50K46r5P1K72m60p5J51K50j02j90L6J87n1m6j15J89p3o1R7r3K3j01J44O2
2695A16j31mJ52l2k51J19Ro1l7L89k44k27J30L95l62k5K05p0j91J13M9l17K41
2718c4K2J67k40K2J81j5j75O8l8j5Q5K15j00k19j37N60j47m90J52J50L3Kk3q9
2742f5J0J45m7J17k22J75J67j65n0k34K19k3JM3j6k80J34K93p8l60J89J74o0j12
2766d5k2J16k28J33K78j1l84J82O2o3l2j32K09M8q2N5j4j37J12m1k20N3J12J30
2790G9J5j33M4l6P7k8J41l01rL49o1l80o3L16K85k48p5K10k23j60J78N9k44K70
2814F2K5Lk11j00J98N6j53K03m6l0Q5M7l57oJ33J78k8j65n3J88j66J41q1j8O4
$$ y = [134, 378, -180, -347, 178, 214, -98, -171, 30, 108, -136, 144, -4, -136, -181, 46, 303, -91, -129, 140, -103, -182, -150, 96, 1, 72, 344, -116, -191, -40, 210, 108, -82, -46, 141, 90, 44, -71, 118, 45, -16, 81, -12, 11, -90, 54, 116, -15, -19, 133, 101, -150, -31, -22, -83, -120, 269, 25, -202, -72, 323, -39, -64, 141, 71, -120, -7, 42, -275, -34, -12, 155, -85, -63, 118, 103, -72, -4, -42, -57, 28, 243, 143, -76, -213, 347, 200, -290, -138, 12, 45, 47, 24, -65, -55, 90, 43, 160, -62, 113, 280, 115, 65, -169, 50, 27, 28, 71, 55, -225, -91, 202, 124, -236, -47, 127, 67, -45, -67, 49, -179, -46, 232, 221, -163, 19, 81, 18, -14, -146, 63, 111, 29, 84, 70, -67, 45, 4, -216, -163, -51, 79, 94, -39, 5, -31, 46, 18, 159, -142, -151, 198, 137, -243, -306, 10, 295, 47, -28, 182, -41, -201, -23, 36, -208, 62, 87, 90, -121, -221, -23, 33, -120, 83, 37, 7, 92, 139, -218, -224, -91, 87, 59, -106, -159, 29, -137, 4, -77, -95, -31]
2839c1K34j29jl29K43J50j76p9P9O2p3P2j01R9l31K66K48j75l37K22K36j96K5
2862b2jl3j15J93q7q8j03K65k2l10K17N1L2j16Q3M3j30J4K42O0m62J37K40j69
2886h1R8k70K11J8q9Q5j94j7J83K78j62j46m3J99q1j65J12J42j03j02J82M7l04
2909b02K02J36k63j04L90j42O3n0Rj65L7K34k0j53j36J48K3l2j48J94j68MJ94
2932E1m2j81OK90o6j79j90M31J0j93l3P4j50J04K43m3k35n3J27J71l04j01M29
2955A66k5k62O4J30k54M7K57k7k59J00J67k10K2O1J99k02J00J3j34Q3N8J48k76
2978c4j25RK48o1j28J53j94M5K8R2j69j07J68J56j44j66K58j8o6M0L9n0J5N4p0
3003b7p7QKK88k90k4R0R3j35M4R8j65M0J11n5j94J07J48m1J02k01K19j86K8J82
$$ y = [-31, 203, 74, 73, -256, -13, 137, -39, -118, -39, 23, -50, 22, -79, 20, -311, -45, 203, 28, -309, -87, 149, -47, -22, -23, -56, -171, 22, -65, -153, -256, 9, -13, -323, -106, -55, -23, -139, -56, -13, -143, -129, 113, 173, -289, -152, 88, -81, 17, -253, -42, -24, -113, -28, -222, -239, -56, 222, 60, -86, -129, 70, -11, -176, -64, 78, -25, -127, 55, 102, -202, 0, 136, -127, -231, 159, 17, 80, 30, 39, -126, -89, 145, 125, -28, -164, -16, 7, -25, -173, 21, -147, -143, 51, 9, -172, -166, 124, 58, -121, -311, 120, 130, -63, -96, -22, -172, -68, 175, 132, -103, -156, -29, 142, -162, -263, 166, 141, -121, -57, 73, -181, -134, 123, 96, -163, -63, 104, -106, -84, -23, 176, -26, 74, 87, -47, 36, 94, 242, -34, -159, -150, 98, 37, -91, 62, -132, -87, -59, 33, -136, -243, -75, 81, -63, -229, 29, 11, -55, -15, 24, -26, -11, 43, -27, -104, -96, -94, 194, -96, -120, -30, 63, -72, -28, 70, -95, -55, 56, 1, -193, -86, 62, 21, 123, -78, 141, -45, -17, 165]
3028A65j82p3p2L04j38j20J17J1J43n3q6L6q7Q9J13j54j24J06J68m5p8j36N4K9
3052a3j52O1J29p1J03N8O0k86L9J12o6J1K0N7p3J99k05j22K41r8R3o7l24J63K60
3077A29k27Q2R8j09N7L8p9Jj63P1L07j13k46J50J97k82K59j28q2O0j2lj78J00
3101g3K30r9LL2ql1j98J98j00j42R5J53J7j93L7K17J5k25K0k8R0L7Q2j45j50n6
3127b22L06m5j47L3K31j50l9m6J82l8q5J47o3j96K08J22k34%j4Q2j3r3J65j54
3151f3J21o7K91k45j38L5J66j73J0K10j86o2M3M7n4J89r6j2q9J98q7J79l07J93
3175A03j09j42K17O6k59n7n6M29j36j56R8p8J89k94L37k69m3K95p6p8L4j29J53
3198C9K4r0L6q2J3j9P2R4j68K07M2p1k15Q0J43Kj34Nj3j9J2K30j61j82K34K6k57
$$ y = [165, -17, -90, -162, 142, 4, -116, 1, 12, 155, 102, 16, 52, -35, 54, 167, 13, -111, -5, 163, 118, 40, -96, -42, -13, -165, -104, 25, -46, 57, 115, 175, -111, -72, 40, -26, -15, 5, 62, -11, 188, -17, -139, 102, 4, 97, 30, -294, -131, 129, -98, -16, 82, -27, 30, 68, -11, -10, -173, -102, 205, 92, -154, -4, 193, -89, 170, 42, -40, 20, 8, 5, -173, -73, 157, 58, 61, 93, 85, 54, -144, 54, -46, -188, -93, 60, 77, -116, -79, 138, 153, -72, -52, -80, 10, 47, 129, -16, -166, -222, 84, 39, -108, -75, 156, 6, -33, -79, 103, 65, -20, 127, 64, -132, 76, 198, -36, -36, -50, 32, 19, -74, 91, -63, 58, -9, 282, 37, -101, -66, 100, -73, -63, 147, -39, -101, -58, -11, -65, 124, 28, 16, -73, 125, 38, 217, -90, 103, -6, -148, 69, 135, -124, -181, -237, 192, 56, -100, -2, -80, 109, -185, 152, -117, -160, 135, 59, -19, 15, -114, 39, 63, -27, 9, -73, -60, -79, -7, 87, -81, 126, 168, 97, -118, -38, 105, 107, -27, -22, -35, -54, -42, 188, 27, -155, 79, 105, -152]
3225a52L0J58j38O3J19j62N7j05J55O6j16N2j9R1j35J29o9K4k6r3n4J16R8O2m4
3250A07j85j03K96j7k23J69O7k20L3O7L8n7O4P7j34j18J3J49m3J25k08J00q5J27
3274C9nj48N5L7J38Q6j40j65J62k4p8O9R1j94J51p2r6Q9K0k8J38k8j65NJ14j47
3300i6J97l38Q0K83n0q1o4K1qQ9r6K2k4K5J11Lp0j11K99k67o4J92l2J07k30J18
3326A6r8j89L47Q0n7k6r9l3J22j93K8J39o8J46j26n0l0J01p3J69l06J34K85l25
3350a06j00K92q7j15K25L5j29l7J49P4m13Q5J45j4J1j5N0r1q7J64m9q1J6J35J37
3375A94k38j5k3Ln7K27r1j36M9J67l7k11lL44o9j77K9P1j06O6M9o9j91K06j2N0
3401B0j86J98j03O9mn2N6j44J1J79n2j26N8J47K3p9j93J59j23J61j2l18K45J20
$$ y = [-152, -122, 36, -102, -39, 80, -82, -25, -130, 25, 91, -25, 27, 8, 99, -36, 93, 24, 48, 22, -71, -125, -9, 89, 151, 107, -78, -181, 115, 98, -125, 44, 111, -109, -76, -9, 29, -28, 36, 113, -21, -139, -126, 23, -20, 105, -103, -3, -88, 39, 34, -114, -59, -22, 116, 202, 62, -103, 59, 35, -43, 26, 117, -77, 74, 2, -94, -5, 15, -13, 125, 97, -68, -63, 51, -96, 101, -237, -157, 126, 76, -5, -69, -48, -56, 33, -63, -41, -65, -40, 71, 74, 4, -107, 192, -75, -139, 53, 21, 128, -102, 16, -82, -271, 76, 156, 99, 73, -26, -59, 63, -130, -102, 37, -31, 115, -11, -61, -91, 10, -63, 106, -200, -66, 219, -106, -206, 86, -1, -116, 109, 144, 15, -22, 127, 201, -212, -127, 18, 4, 15, 0, 50, -41, -128, 36, -13, -94, -78, 57, 194, -44, -59, -82, -79, -136, 91, 0, -136, -87, 80, 43, -168, -171, 173, 104, -73, -44, 27, -79, -13, 36, -33, -224, -18, -30, 20, -166, 32, -71, -2, -6, -58, -2, -146, -135, 44, -8, -134, -76, 71, 94, 15, -178, -19, -142, 19, 7, -311, -66, 54]
3425E4j43j01j0N8K19j1j37N8j4r6J58R7j99J01J6j9L6k06N8J44mj26k8J26p9
3450d8K22j00k2l09K95J66j74K1j65R7j9J23l09O1P5J98j9l03J64P0J3j46Q1J2
3474a6Qm6J71k15J38J8qj85K7j5J08N5l7j1L2j05J00R3j26j60Q9L20k82r7K5K07
3500H8r6P9P8j86J42k18L22j91k49K58J08k23j1K03nl7nr4m6P6l1J9j9m8J38k4
3526B8p2l4J4n5J34l0J3j32R4nJ40r0j37J96J29j66j48N0l9Q1K47m4k97K60q2
3551E5j19J64k13J64l3j7p2K2j9q5K33j02j57N0N4J11j32L44j06k17K06j47P8
3574F2k99L08m1j41J97r7J79j23M1p7n3J12rJ4p5j75K94m2K3j44J30j43j7J66
3598I0R0k38l6J56n8j46L2J01J64k15O9j35p7L12j1p5m1M1K1j17K6M5L0L9j98
$$ y = [54, -89, -190, -200, -142, 77, 66, -71, -13, -27, -123, 35, 132, -67, 34, 50, 31, 67, -139, -81, 63, 59, -67, -95, 31, -48, 174, 74, 52, -257, 38, 204, 30, 51, -114, -17, -36, 87, -222, -161, -86, 112, 93, -210, -46, 24, 37, -109, -28, -16, -8, -54, 117, -98, 40, 58, 50, -135, -108, -123, -15, 40, 3, -8, 24, -81, 19, 112, -14, -174, -85, 235, -47, -144, -119, 88, -8, 71, 149, -37, 105, -113, 209, 18, -231, 27, 135, -88, -99, 104, 99, 62, 57, -37, -83, -7, -38, -19, -38, -86, 52, 28, -44, -78, -64, -119, 15, -15, -2, -134, -40, -45, 95, 5, -132, 64, 193, 27, -121, -71, -110, -29, 218, 174, -123, 137, 55, -64, 100, -113, 51, 18, 1, -71, -49, -68, -153, 80, -22, -179, -129, -75, 36, -96, 248, 142, -75, 131, -16, 62, -237, 71, 30, -111, 86, -11, 168, 45, 86, 9, -44, 68, 59, 73, -2, -177, 117, 75, 98, -46, 84, -59, -76, 90, 180, -58, -94, 62, 4, -142, -110, -9, 155, -60, 9, -126, -203, 109, 98, 23, -18, 23, 44, -73, -47, -2, 28, 67, -131]
3623a31J20Q7j21J1R1j27J39j75M00j64l70L12N5j74Mj0q2K1J15J73q5o1j12L5
3647d9M9J06p0l4j37K80p9M4r4J09O1k09k1J49j72J32j69K32k57J91Q2l9j28P0
3671D7L7J3J9k75K60o5k2Q3j6j11J50o1j07k9L5J55j14j76J31n4J42q1M2M4q0
3696c3N0N0K4n6j13M4m0MKJ15Jr8J21J05k22J87L7k57k0J70j9m1Pj42J25l8m4
3723h1J8J12l8l6M5j63J08Q0j33j2P5r4O4O0kn8K6J78j97J54o6j28J12N0o9Q2
3749H7R0k26qR9j98K00j00OJ48j95O9KMq8P5q1k1J63n5L6J26j09N7j39Q7K6r0
3776c5q2R4m9o2Q6L8K9j00O2o2N3L8j08J79p8n6K02j17m4M0j31J03J31j15k8Q9
3802G7p7O4j03q2OJ38l9j11J06j49L9J84J8k69O8K19k4j01n6m9J90O2K0k06q3
$$ y = [-131, -11, 76, -45, -34, 57, -70, 69, -106, 294, 130, -240, 72, 127, -47, -43, -53, -135, -114, 1, 174, 89, 28, -84, -49, 0, 106, 36, 2, -135, 145, 66, 110, 16, 125, 186, -23, -44, 105, -67, 65, -104, 128, -129, 62, 144, 105, -23, 47, 84, 97, 116, -159, 101, 36, 14, 97, 81, -30, 120, 59, -48, -77, -42, 113, -1, -177, -46, -100, 42, -39, 3, 47, -33, 17, 67, 91, 35, -78, -34, -74, -70, -68, 47, 48, -50, 71, 176, -46, 141, 178, -79, -99, 71, 52, 11, 18, -124, 1, -37, -81, -63, 49, 11, -25, 20, -143, -35, 45, -88, -100, -25, -119, -55, 5, 3, -55, -29, 149, -48, 106, 40, -88, 24, 74, 5, 87, 177, -49, -57, 42, -156, 44, -56, -50, 98, -97, -28, -26, -22, -110, -35, -116, -137, 26, -29, 7, 133, 24, 81, -58, 29, 55, -35, -117, -23, -72, -134, -48, -10, 19, -81, -19, -81, -28, 10, -98, 81, 3, -53, 149, 32, -12, 28, -103, 0, 131, 16, -12, 77, 0, 64, -39, -121, -115, 23, -16, -127, -21, -170, -131, 53, 71, -198, -130, 89, 65, -36, -92, -141, 49, 111, 131, -75, -158]
3827a58O5J97p9p2J16j46J08r7O7M1L5Qp3o1J36l16K26J39j14j83J86L4j06L4
3851a3k10K57N4m7K6j03o3J31J23p6j01n3J71o4pjj65J37L7K95l65j75L94k66
3875h4m2j6L32j32k4o2j2k9q4J46k9N1q1M3J74j68k6K51k12m4N3k5N2O9p9j59
3901a37K34j96K50j29j59J32o3P2J1K6j16lN3Q6k1r9J75j3r2OJ80k89J05Q5l3
3926F5j72Ln3K84j80jk8L6J69k86J60j24mM8K03jj51J72q2j38J37q2K6o7M3m2
3952f5J46p5Q9P6j60J2o6P4r2o2M4J03n4M2k0n7mj02K96j30j9J22m7o5m3K5J23
3979I1j07M9J47k45K13n5P5j88J50k82M9Pk8L6N7J54o3j12o2Q5KJ23j08k5M4m5
4005c8nP9j16l6J16j7M4q8O3k4J02j03j1p0RJ57r6M7l4L7J66l37J03j09K32k8
$$ y = [-158, -93, 104, 25, -47, 69, -77, 31, -66, 1, 42, 77, 85, 12, -49, 87, -229, -3, 136, 22, -161, 25, 59, -47, -13, -223, 34, 88, 41, 67, -36, -99, 32, 155, 79, -22, -75, 96, 32, 25, 24, -141, -4, 33, 328, -37, -212, 182, -84, -126, -142, 190, 58, 34, -28, -40, -69, -153, -7, -36, 15, -66, -23, 151, -17, -43, 208, -4, -48, 5, -20, 32, 101, 22, -137, 97, -99, 151, 22, -137, -5, -68, 4, 15, 41, -75, -78, -25, 61, 40, -59, 116, 103, 11, 17, 197, -92, 13, 98, 65, -107, -104, -157, 127, -53, -54, -82, -46, 123, -163, -3, -127, -131, -83, 120, 119, -32, 140, 58, -80, 57, -25, 1, -66, -23, -65, 81, 6, 95, 171, 11, 23, -43, 31, -61, -123, -79, 24, -30, 12, -8, -65, -69, -171, 125, -5, -24, 98, 51, -14, -57, -32, 91, -16, 33, 180, -65, 148, 93, 168, -20, 130, -152, -103, -96, -124, -88, -31, 123, 60, -52, -114, -29, -27, 96, -12, -37, 7, -38, -43, 36, -80, -116, 0, -17, 27, -61, 2, -22, 80, -23, -34, -104, -95, 62, -34, 13, -21, 16, 182, -155, -52, -161, 71, 43]
4031D3l0q4%P8k3J17j95P2J04j30Joj87L00p2R4n4n5J75o8m4j71MK68m6j07k9
4058d5N9K16j05j42m5L9q2L39j70k47K17L1L2K0j49K3m4lM5M9k5k4J81o0j2q2
4084A6J45k45J15N4k93K47j2j55O2M8mJ43r3m3M7n8J2J23q3r4J90J4j46r1K07
4109A06k93K48R1q7j92J0J70o9N9m5r9J16P3rk14O5L51l77J90j27nR3r6R2p9m8
4135g6J91k5r0J89k51J09p8J29q8nj39L45j81ql8n2K25j19M1j91J24k3J7j06J27
4160B7j01J39p0l5J90k01Kq1j7K39j17K2Q8n2p0n0J05O6L7q1Jo4N4l6lK61k10
4187D3O0q7o7N5J75k81J14O7j91J29oM4p7Q8j1N1k4k20N7J03p7M5q7M5J61l9P1
4214A41k84K74j30J4Kjr3J78q6j77J96j13k08L45p2j01J5M3Q8Oj05M3J0r8K36
$$ y = [43, 13, -71, -71, 7, -16, 101, -94, -22, 82, -48, -47, -53, -240, 60, -12, 82, 28, -27, 148, 80, 36, -135, -131, 137, 91, -16, -45, 14, 230, 125, -17, -62, -23, -105, 234, 64, -183, 34, 65, 97, 117, -32, -9, -53, -56, -11, 38, 13, -11, 170, 110, 98, 16, 161, -84, 31, 85, -208, 39, 27, -128, -66, -18, -22, 121, 28, -15, 32, -26, -14, 109, 26, -68, 122, 136, -10, -101, 106, -187, 61, 152, 65, -127, -117, 53, -16, 43, -2, -101, 15, 88, 79, -135, -70, 281, -96, 94, -33, -38, 55, -41, 51, -28, -76, 115, 90, 0, 189, -62, 47, -31, 98, 10, 5, -134, 211, 30, 22, -16, -68, 157, 38, 79, -112, 12, -11, 6, -100, 27, -74, 65, -5, -40, 150, -51, -49, -130, -147, 92, -25, -3, 85, 33, -37, -87, 18, 84, 121, 40, 41, -23, 31, -5, -8, 253, 43, 103, 16, -51, 4, 179, -102, 12, 79, -112, 17, 11, 55, -22, 66, 55, 106, 82, -138, -81, 22, -55, -10, -97, -52, 109, 70, 141, -143, 131, 1, 15, 17, 16, -77, 101, 15, -162, 34, -79, -287, 58, -14, -115, -100, -57, 31, 37, -68, -25, -15, -113, 123]
4239A23o7k98J33K04Po1K6j32J38p3j05l5O5J25q2p1k6J09m8PP7J40k25J41j17
4264d5J34n4OL8j44k2K00j03N6j00j01J99n2QJ30J0l33J31N7N0j22o5N5K6ko3
4290a06L6j21J01P9q8k6M5Q4m7J4P7k23J85K4p4J5K19j85q0R0j32P6PJ83j16p
4316C0J7k28K39q3Kj5J34j28Pj21J68J23J3j38j24R8O3P8l0L3k00J30j15O7n4
4341c4M6j2j09J13m3l8N4m3K1J30k62j17K95K9k01J36J14o4K46l33K25j38j0r2
4365h7J74k03N1j76K90J37k75J19nk1Q9p2j28J28n6j9J31j00nR1L2j69J50j04
4389b8q7M8J10J04j69J2k6kj09J68Mq1M3O8ml4N2l8j81M3J51j59N8K51l01J05
4415bj6j9KR1J25k65l9J12n2Q1q7J05%kk20J96J2q4J59k13j82K27N9J4Q6j12P6
$$ y = [123, 56, -242, -109, 95, 102, 41, 67, -65, 73, 0, -105, -140, -75, 50, -32, -103, -129, -20, -68, -61, 16, 156, -69, 72, -45, 89, 35, 41, 79, -65, -87, 113, 10, 66, -34, -135, 64, 12, 20, 150, 160, -173, -42, 15, 65, -57, -122, -67, -41, -43, -106, -70, -191, -90, -11, -99, -125, -80, 4, -43, -29, 48, -175, 10, 34, -40, -25, 194, 9, -71, 19, -113, -37, -30, 153, 37, 30, 47, -181, 58, -25, -23, -38, 96, -32, -25, -146, 22, 145, 158, 20, -104, -6, 57, 135, 105, 138, -62, 68, -47, 20, -34, 12, 0, -109, 4, -39, -77, -23, -66, -45, 85, -177, -294, 1, 30, -171, -35, 79, 15, 261, -72, 153, 15, 5, -87, 87, -116, -65, -241, 49, 186, -89, 30, 25, 4, 93, 21, -107, 21, -35, -54, 77, -23, -28, 63, 95, -74, 76, -28, -115, -67, 43, 147, -22, -10, -36, -38, -147, 21, 25, -56, -13, 55, 51, 17, 69, 31, -150, -107, 44, -115, -57, 194, -107, -2, -18, -37, -35, 56, 181, -84, -123, -11, -63, 18, -69, 36, 36, 34, -186, 10, 22, -62, 97, -116, -298, -71, -12, 2, 88, -24, 52]
4442E2j84J67Lj67J82J1q1k5L0R1J3j58J06p2k5L3J40l8j72J8l0K04M3n8n6j62
4468a35L34j22r5R2l7O8P6k61M6J47n9J9ll7j5j4O4q4r3J19J2M3m2m1J02r8l5
4495d9n9l9K41o6JJ03n2j85J97jp9j2K3j73M4J64j51J20p0J87j89p4J79L1Lj43
4521d9m8J2J04j31J0K31n0k35J41K9K0N6r6k3R3j42J39j50L7K60k52n7L4O4m2
4546d5J0N7L3J1N0j06r5O9P9L8o4q3K4P2P8l3j65L3J24j6P5r3KPr6l5L8j04L33
4575A98k93lJ07Q6j18N8Kk09K12p8J30M4k46O8K7QJ33j52K6K4o7K01k45J88j19
4600a8J23j06r6j8J73k2O7K3j45J23r5Q2j07j1M7J17m6q1j97J66l0M6j70J73j02
4625a04K02q5j35K30j11O4j10k3M2J9Kn8J2J10o9K6j55K79j07j33J00P3r3j50
$$ y = [52, -132, 35, 38, -129, 53, 64, -17, -42, -12, 79, 92, -66, 40, -32, -57, -24, 116, 78, -94, -76, -106, 98, 141, 83, 27, -135, 199, 77, -18, 74, 37, 105, 181, -80, -34, 113, 54, 73, 70, 33, 18, 4, 68, -16, -109, 10, 22, 65, 23, -18, 84, -14, -49, -108, -147, 94, 28, 29, 132, 80, -105, 92, 91, 12, 0, 23, -150, -106, 58, -93, 27, -43, 144, -45, -119, 60, 91, 94, -49, -97, -85, 19, -112, -102, 129, 79, -156, -15, 14, 34, 90, -6, -29, 64, -78, 61, -89, -52, 208, -44, -101, -67, -3, -45, -35, 22, 55, 66, 116, 10, -85, -16, 63, 101, 37, -46, -22, 50, 128, 95, -70, -37, 87, 71, 146, 53, 55, 62, -34, -69, -31, -135, 198, -95, -98, 9, 95, -23, 35, 37, -172, 40, -38, 92, 136, -110, -42, -15, -7, 126, -26, 0, 24, -43, 158, -87, 101, -18, 105, -1, -97, -115, 58, 36, 103, 126, -19, 104, 9, 91, -16, -27, 20, 137, 91, 10, -187, -21, -51, -5, -175, -2, -104, 98, 13, -122, 108, -3, 61, -49, -72, -30, -11, -9, -67, -55, 55, -14, 12, -143, 136, 29, -104, -4, 69, -24, -174]
4649a74K61k3M4j27q0j25J54K80k90L5M5R6j55J56p7m5QQ8pj52kK47j00n5k1j21
4675a40J72O1p4r0J48j59R4Qn3Np9K50l9j06Q8r7Q4N6n6j18J30k08J55Jl00L46
4701G9R5j58q1Q5N9j35j69L35j36l4J22J19k37P2j50J55K2k9J79j34l5M6k05J03
4725c2MN9nq6m7K08n6J9j42J28j92Q0K6R0n1r3J36j48k7k8K12L2j78P0J27k25
4751a19J08J5J02j6q4j26J77q1m9P2J4qR8q2M7j09J09j50J7k6J44nk30K29K8j37
4777f2oJ26N1j08j01J32m7K2J01o9n5p2N3J7q6J41m0N3m3Q1j16N1mm2r5N0J12
4804D4j01Q2J04j89J12j82J5J02o8l8O0l1K8J03p2J30k09J12o1j2L3K48l69J92
4828C3n1J6j99J30J13k52R6N1%n6K53k2j46p4J05J31r1m6J70j36L8j23J60j41
$$ y = [-174, 87, 64, 108, -19, -99, -224, -70, 210, -80, -45, 0, 96, -59, 97, 20, -25, -17, 71, 64, -88, -90, 157, 57, 2, -19, -140, 32, 93, 19, -71, 77, -82, 12, 20, -33, -28, -107, 143, 104, -2, 86, -11, 73, 129, 73, -45, 85, -123, 32, 33, -267, 79, 174, 16, -65, 20, 79, -56, -225, 110, -26, -60, 62, 181, -56, 16, -134, 21, 43, 14, 193, 59, 24, 70, -135, -32, -28, 31, 26, -60, -107, 101, 45, 64, -78, 50, -142, -62, -36, 54, 3, -90, 46, -102, -129, -157, 55, 87, -91, -21, 106, -119, -11, 4, 106, 90, 6, -120, 57, -24, -73, -1, 13, 5, 103, 21, 68, -41, 68, -82, -65, -91, 53, 48, -182, 47, 75, -62, -68, 58, 109, 1, -100, 32, -15, 7, 108, 39, -16, -88, -35, -18, -104, 37, -3, 50, 7, 88, -28, 23, 19, -23, -118, -68, 44, -57, 25, 129, -60, 52, -130, -115, -13, -81, -119, -59, -90, -62, 41, -31, 99, -110, 2, -59, -71, -38, 210, -159, 33, -18, -2, -201, -71, 42, -210, -114, -63, -63, -119, 134, 112, -34, -108, -3, 128, 37, -9, 161, 25, 63, -60, 100, -41]
4852d1n9k1K66l08N7K36k12J07m1K9j06J56q4j40J60O4j57j7N5J6R2M0j58J62
4876I6j63M2Q8L2j64K8rp4J22o9J00j6j10M7j23K13m2K4n1k29J25lL13j94j19
4901a36L73l02N1r1K85k10l1P3r2K3p0R6r6J54k4n4Q2l8K13j89r4R1R0o8q6J98
4927A48j33m3o1Q0N9p0q6K57k23J55n7N5l9j21NJ64l6%k62J03j2k0K23j60L4N7
4953A7P9j90K07p2r0k8m3O6N9K7L4Pj04k8p7R8J58m5N5j31l0K3j25Q4J8O5O9o1
4981D2p5m2K06k86R3QK5O4Q9j57J15p0j9K1Q8r7j3q5LP4MJP5j7k4p2J35j44J32
5010G4j92N3j66K40M8j3Rq9l1K35j87K1J70j70M1p2J04k54J23J33N8j71J76j4
5034A26k71O8K3j28J73o4J63n9QM9j85Q9j4j53K18J05j15m8J52j28P2P8j88J8
$$ y = [-41, -100, -121, 145, -163, -106, 130, -82, 25, -16, 13, -93, 63, -21, -161, -1, 63, -94, -111, -56, -40, 52, 92, -66, 96, -67, -25, 63, 95, -69, -41, -50, -124, -2, -71, 29, 13, -97, -50, -173, 40, -2, 22, -29, -258, -133, -136, 177, -17, -136, 237, -65, -14, -105, 180, -30, -61, 12, -80, -57, -127, -31, -127, 27, 3, -51, 31, -7, 206, 17, -77, 14, 104, 36, -50, 148, 15, -28, -89, -9, 50, -20, -106, 151, -72, 83, 26, 81, 42, -79, -74, 90, 54, 54, -208, -105, -117, -137, 86, -74, -40, 17, 96, -94, 113, 41, -49, -77, -120, -54, 5, 32, 66, 73, -31, -59, -136, -38, 120, 75, 130, -1, -31, -8, -133, -49, -31, 34, 103, 42, -33, -75, 131, -155, -62, -54, -29, 35, 124, -33, 82, 12, -7, 14, 102, 5, -8, -93, -90, -16, -12, -11, 64, 47, 23, -49, 86, -58, 74, -118, -65, -231, 9, 57, 44, 53, -36, -67, 168, -19, 2, 172, 2, 43, -29, 75, -179, -56, 77, 135, -36, 140, 126, -145, -77, -54, -182, -9, -73, 90, 31, 39, 88, -97, -8, -22, -175, 43, 148, 33, -15, 137, 9, 81, 159, -29, -11]
5058a1j0K2O8k4N6j30Q0O6l83K33N2N6p4n1KJ88m9j28K11k9K2m40L99q5k1R3j7
5085I6j92J06j84J92J1O8p5j35R8j7N9m3J5j77J93J4L1m5k0n8N1q1o0J26J18n7
5111C4N0j34Q9p3J9P5n9oM5q7M3j20J54L1ko7P8j84L01j02p8J06j14k4O7j4j15
5138h7P9J50j31j6Rq0J78mJm6n7N1j61J24r5Q6J89j33N0j49j31K43K5j35J11r8
5164b7n3J02J15j88j05J67n3J42k11J6L1J03l2N2q0j53K18o3J01k0rl4K9o3J23
5189A08j6qj67J6J76j14j64J75N7j30Q8P1q2P1q2j61K19o6Rj05J30N8J19l46K86
5214A42k06J94j39k8k3n4J05M3n4OQ7o3nl5J76l12K52l36K26J75l5p5N6Kj75O5
5240a1q0l5K02j06Q1j55P8M5m8o2m0K64n0j88J13Q2k05J94o5R4j16M1j35J30O6
$$ y = [-11, -21, 1, 69, 45, 101, -29, 51, 117, -266, -33, 19, 75, 1, -50, -48, 140, 91, -37, 174, 145, 167, -273, 126, 41, 20, 113, 96, -96, 10, -174, 18, 29, 97, 22, -113, -15, -32, 27, -16, -1, -178, 15, 29, 60, 15, -5, -63, -12, -93, -153, -27, 91, 34, 84, -50, 39, -34, -15, 60, 1, -5, 40, -47, -4, -124, 30, 61, 59, -8, 70, -114, 187, 85, 7, 113, -1, -25, 42, 28, -87, -8, 142, 11, -5, 4, -76, 102, 98, 99, 53, -4, 47, -114, 10, -85, 1, 190, 57, 107, -42, -173, 70, 95, -40, 71, -27, -80, 22, 137, -51, -156, 11, -42, 100, -111, -95, -64, 39, 7, 59, -21, -174, 44, -19, 82, 62, 53, 19, 48, -15, 108, 92, 84, -83, -67, 109, -5, -169, 6, 63, -67, 21, 92, 10, 81, -1, -162, 57, -9, 0, -105, 25, 83, 202, -144, 142, -64, 130, -9, -37, -60, -114, -9, 34, -20, -14, 73, 10, 5, -30, 146, -166, 86, -250, -24, 151, 116, 41, 97, 99, -76, -11, -91, -126, 76, -30, 51, -104, -26, 19, -29, -91, -131, 133, 83, -105, 8, 90, -115, 79, 14, 108, -8, 33, -102, 28, 94]
5265I4m5o7J82j26j7j18Q7qp4k4J49J21k06R0j00M5j58K50j94Q1N0P2k93M6J06
5290e7K40Oj79k6Q2o8n9j8P7j2j20J81L5k39O8l4J49p2Q8n0kR9j48K16k30n2M4
5317h1Q6o2p8M0Q1J45o7k87K45l06L09M7m9L9j9j17R4%J3r2m9J57j55J93l03K23
5343GK0n1lK6P8j58J17j3P3j30O0Jj49N1J55n3j47J43j1K9Rj24R8n7L9K01k35
5370b4m7J30K2j81K75j31j02K01o2K0j09J11P2k17N4m2j5O2M7j81Q9l1K05j44
5394BR8k61K65k17J55k7j12j2K41j71p7J32K00l88J15J50k13J64j23J14J4L5j93
5417a09L7J5o1R1jpR8J67k24m8J4J1j29J58n4J9m9j3l3P1J95j78O2j03M5P3N8
5444A05j1j38n3J13J8l5J16k26K43l1n2j6j04R5p4Q4k61K19K8j5K1j26pM3J69
$$ y = [94, 49, -18, 164, 38, 21, -97, -10, -18, -92, -116, 33, 154, -52, 38, -62, -17, -175, 75, -119, -38, 12, 84, -209, -163, -57, 183, 189, 10, -16, 66, -2, -61, -79, -2, -14, -134, 47, 82, -157, -89, -123, 26, -46, 42, -8, -10, 89, -59, 157, -73, -125, -81, 5, -57, -135, -95, -14, 131, 64, -223, 22, -284, 25, 72, 23, 62, 43, -74, 20, 20, 33, -59, -108, 49, -106, 87, -216, 7, 27, -24, -27, -1, 77, -81, 36, 23, 96, -34, 26, 27, -122, -71, 84, 31, -116, 27, 16, 45, 54, -70, 28, -29, 10, 211, -24, -71, 59, 81, -100, 175, 44, -58, 143, 81, 101, -8, 103, 175, -42, 12, -30, -45, 17, 64, -117, -28, -59, 146, 2, 100, -161, 104, -113, 42, 15, -97, -109, 132, -39, -116, 16, 216, -172, -57, 93, -120, 44, -79, 35, 49, 84, -109, -72, -57, -118, -27, -28, -35, 63, 230, 6, -42, -28, -17, -146, 12, -42, -23, -72, -85, -118, -47, 148, -30, 32, -71, -26, 47, 105, 94, -44, -97, 16, 34, -1, 115, -111, 132, 101, 49, 33, -71, 24, -50, 34, -227, -8, 20, 5, 26, -100, -107, -64, 105]
5469A05j58N5M1j10J84o6l9q6o8J26P4l5k7l12L44m8j72J48j10J23K9P0l0J0j61
5494a13J9J20j2M5r3J24L2q7j06N6JP1R7q4j36rP2KO2j16n9J70L3j16j1n6J04
5521A0p9R5nj90R6J36k51J38l4J64K0r1j19J13P9k00R0Q2p2n8J75l3j55M3k7J03
5547C0M9q3l1j25J45J6kj05J32q3j2r9J96O9l3m0l7LpJ23j27q5O5M4pK0J21k2
5575A15j56Ol9N3J48j24j08R1q5M6Q4q0Q3j96Q5R7l2o3QJ54r4K1p5P6J22j41J00
5602I6k08O0J78j11kO0k1j73K72k62N8N9K5P8m5q5o2J41q1O6q5K1Q4j22j2r5R3
5629g3J15p4K5M7M5k47J92j37LJ52j00J26J23k49R0M2l12K06l7K18j16PR0j49
5653a3J5m0J74r9J53j15j80o1R0R0R1j22jK0n0q5K02j3N4j56L0l8P8K3%k1j13
$$ y = [105, -53, 2, 43, -67, 117, 51, 12, -74, -142, -16, 58, 23, -4, -316, 28, -20, -192, -44, -154, -31, -2, 68, 38, 48, -113, -94, 26, 14, 59, -34, 90, 122, 35, -71, -15, -14, 57, 154, 70, -66, -75, -3, -1, 61, -55, -114, 56, 89, -27, -38, -94, 10, -69, 26, 21, -169, -73, 63, -188, -50, -84, 80, 100, 9, -110, 3, 82, -118, -28, 54, -18, -76, 99, 66, -89, -46, -73, 30, 79, -4, -35, -160, -15, 1, -1, -106, 26, -57, -69, -168, 28, 97, 64, 24, -13, -10, -17, 106, -21, -106, -41, 3, -4, 16, 137, 115, -41, -35, -74, -21, 127, 3, -105, -14, -99, -53, 31, -49, 34, -162, -77, 20, -12, -75, -67, 87, -7, 14, -61, 15, 137, -4, 96, -112, -52, 126, 15, 13, 73, 52, -121, 151, -111, -53, 6, 31, 109, 64, -21, -83, 58, -23, 43, -42, -21, 63, -59, -71, -166, -73, 42, -32, -7, 40, 85, -162, 30, -107, -104, 48, -52, 74, 197, -52, 38, 80, -232, -26, -63, 155, 39, 46, 136, -13, 2, -38, 136, 37, 190, 75, -105, -166, -76, 14, 105, -17, -18, 2, -48, -133, 69, 56, 110, -46, -16, -54, 24, 47, 47, 26, -87]
5680h7J28J07k64J11N8j47L7J02j26kk4K32j45qp5J99J03j45kj08k2M3J17r4o1
5705g3J66m8o8k4Q1N1j90J49p%J94k17j12Q4L7j04M7n3J46j62J51j03J30o3j19
5730a07J96QN0k45J15j17J64j9j20R0J39p6m0p3LP1j48j7l0P2J72j23R9j91N4
5755g3Q9j07o0p3L13k92K33n6qP3n8P2j79K01L2j71L7K8O3lM4j84J60j65l7K50
5781A29m8n6j29K61p2r1m2m7J82k7j05o5L8J98j81J86l28K59p6L2Q9q4L2J1Q0
5806A46j19j1J70k68k4J69j36J54L4j76R7J86k87K5J39P1j94J79j55j27L6J61
5828G0j82j6L4M1P3O5j64kO1J72Lj59Qn1J37j12J41j83Q4RR9j89K6K08j72p6l8
5855a13J53j21J29j22M4J80l3j45J22j50mP3J9J4L3k5j04r7J42o6l9K8J21p3n5
$$ y = [-87, 41, 148, -116, -5, 53, -94, -57, 45, -81, -83, -107, 125, -20, -28, -103, 96, 199, 54, 52, -56, -78, -35, 82, -12, -73, 93, 45, -23, -47, 34, 85, -105, 44, 37, 37, 231, 14, -98, -14, 23, -81, -34, -87, 59, -103, 48, -55, 75, 12, -107, 89, 97, 147, -98, 17, -100, 64, 45, -75, 15, 154, 78, 38, -35, -32, 39, -109, -126, -156, -84, 88, -35, 64, -127, -73, 16, -91, -151, -224, 89, -203, 30, -26, -34, 39, -19, 53, -126, 75, 107, -64, -27, 1, 64, 61, 105, -79, 81, -84, -121, 129, 81, 25, -104, 157, 85, -6, -48, -95, 87, 60, -45, -110, -72, 126, -55, 131, -197, 62, -14, 18, 107, 23, 55, 66, 146, 27, 16, 186, -82, -106, 63, -73, 81, 115, -61, 36, 222, -65, -40, 99, 170, -24, 155, 0, -127, -91, 70, -112, -128, -94, -53, 20, 85, -79, -81, -20, 152, 155, -4, 4, -47, 90, -22, 119, -64, 20, 29, 128, -61, -35, 173, 1, -75, -113, 40, -81, 48, -74, -30, 150, 117, -28, 94, -56, -60, 13, 32, 46, 79, 54, -50, -147, -5, -71, -110, -82, 39, -34, -89]
5880h9J79k23K51q3j65L4Q0K8l2K5L6J90k26m8O3lMj7L0L9j81J29k17J98j42J51
5906A1J9K3q0qK02k11J07o8j18k7L11j25n1M2j4n2j12N3k2J18L7j05J93j56n7
5931i0Q6n8K23j03l4lO1j8p1J73k44R3j02o3J96K3mj39M2m7N1J12j50R1LK1P9
5958A28j39k7P9pk00J75L1n3o2Q2N0j93J39O5l5m0M7n1l4O8j67K43j58O2o4K53
5984A92k27J05j58P3MJ59k0j96l6K13j64m1J58k17J15jkQ1K6j49p4L10j63p0l
6009h5J53j49l4N9N3N4l0j48q8N1k5K9J48L6K4j45O6L2O2k8n0p4R4O6K5kr0M0
6037D4nM7rj2l6Nn7K3j16O6Q0r3k8J16n0J32j27j0rO1l2L4J52j82J22j17r7J57
6065E9j5L8o0j26Q5K05k61J31n5P7o9m8Q8PLm2J5m6p7K38j97l8M3R7qj11J49J34
$$ y = [-89, 90, -133, 118, 35, -130, -96, -16, 12, -20, 5, 41, 231, 5, -43, 20, 17, 21, 4, 34, 73, -108, 21, -196, 2, -140, 11, 30, 53, -27, -35, 167, -44, 63, -5, -123, -150, 161, 36, -15, 27, 13, -39, -151, -98, -120, -2, 35, -70, 123, -33, -90, -4, -62, 161, 58, 24, 21, 82, 64, -7, 166, -78, 15, -87, -150, 46, 69, 65, -74, -32, -79, -28, 84, -66, 25, 28, 49, 128, -11, -38, 41, 34, -166, 9, 40, -13, -75, 7, 57, -136, 3, 68, 33, -7, 40, -11, -45, 23, -144, 99, -59, 3, -61, 192, -35, 70, -88, -15, -11, 148, 128, -68, -104, 109, -55, -96, 62, -155, -40, -41, -43, 38, 64, -85, -159, 151, -12, -82, -85, 68, -81, -115, -56, -3, 51, 21, -127, -215, -164, -189, -160, -12, 24, 48, -97, -31, 1, 63, 35, -15, -89, 5, 71, 96, 94, 4, 44, 39, 86, 77, 65, 29, 34, -23, 0, -116, -50, 30, -63, -91, 25, -25, 107, -20, -30, -39, 22, -10, 24, 176, -6, 116, -1, -98, 59, 44, 82, 22, -104, -19, 186, -75, 56, 1, 78, 9, -39, 49, 56, 59, 17, 32, -14, -91, 147, -50, -88, -45, 52, 44, -67, 82, 216]
6093B16j31j07J20m2j6q7J46k13K56l7j03M1k15J86J12N4k42L5K6o5M2Q6j09p7
6117a24N3N1j13J94M7N9k68J26N4j6L9k04J13J44j48R3n1pM8J0k29L9K4M3j5r9
6143a37J89N4j46N2J51q0j4k26J60k5R0j42J60l9k3Q6L3q1q1J3j7r7ML4Q4Q1j19
6170c6J39k36J54J6l6J7K2m6j59J35JO9nj54J47K1p1j74K01j9O8j34J32j35J8
6195f5J22n3k6m4J04P4j36L4J13n1J01j51m1o5N5J2j7M7j65J02J16j13J5J3M5
6220B6P6j31j09J68r9J32K4J5j96L9J02LN6j12J22K1q1l5q2K02j39m7q2K58j62
6245c1ln8R6l2L8j05J35k8q8oL5J31k10J80Mm9j43J68jk3O6K11l26Lr8J67P3j16
6273a0j1l5mJ7J22m1j01Q0R5j54k8M7r3K85p4q5l1K5J84k61p0J78j39J30J05k36
$$ y = [216, 85, -22, 98, 56, 40, -47, 99, -114, 142, 105, 2, 43, -172, 14, 126, 180, -62, -27, -1, -66, -24, 62, -47, -124, -71, -20, -133, 61, 108, 167, -101, 25, 79, 63, 102, -102, 11, 155, 7, 100, 49, 42, 90, 100, -129, -90, -66, -23, -38, -137, 52, 106, -40, 12, 163, 83, 69, -157, 3, -22, 68, -74, 86, 47, 24, 110, 143, 62, -19, -6, -23, -120, -116, -82, 2, 83, -36, 103, -133, 21, 37, 1, 18, 40, -6, -165, -30, -29, 40, 35, -119, 28, 49, -22, -196, 5, -14, 54, -80, 52, -83, -65, 57, 4, -22, -66, 38, 112, -24, 10, 123, 72, 173, 22, -19, -84, -29, -17, -34, 13, -152, -50, 66, -47, -32, -19, 26, 102, -29, -138, 30, -69, 63, 87, 102, -94, -55, 47, 50, 106, -6, 116, 137, 56, 21, -61, 141, 2, -45, -127, 131, -31, -34, -92, 4, -28, 10, -95, 40, 12, -76, -82, -47, 84, -126, 54, 58, 9, -134, 34, 33, 10, 76, 287, -39, -36, -134, 33, 106, -10, -21, -56, -60, -43, 79, 38, -63, 17, 112, -42, -70, -23, -116, 169, 95, 10, -21, 4, 188, -73, -143, 35, -104, 26, 131, -105]
6299a05N2Q6K5q8%R3q2JM9l4p7J16J54k88J00K0Rp5j58R8K7K06p6N3j30J5q7L9
6327e7l9J77M1j63O3N3k34J33j4l2K55jk54K04l3j27l4p9O8Q3J57j14p7J3J15
6352A04r5J5K21j52j31p4J97l6Kn2Q7jL2n1k02L89k41j03J91j05J39p7j42J82
6376I7k11J09j4n8QN2j3Ol4p7K38m4k25J24J05m0j4j59J17J17j51O1N1k14L11
6401A42j60L2k2k6J99j30R0j44P6L5mq9p3n8K11Mj04L2k9k2Q4kk9M7j15P5p9k7
6429h6R8k3O0J83k77J71j97K63k15J59j99M1Q1n6K8q5N1M6n4J17m7m7M9J0J3l8
6455D6J8J42k08J04j29mQj7K7K1Q0j16j3J07j6j77kJ16q7K27j68R5j04m0J26j34
6481i8k5K54l5m5j04m7J70j10R0J9Jp9J35M5j67N7l9J63k11L8l4M0n2O4k4n6P5
$$ y = [-105, -53, 33, 58, -30, -30, 63, -19, -18, 31, -3, -80, 36, 190, -98, 2, 22, 31, -44, -202, -104, -77, 129, 53, 106, -24, -9, -96, -57, -96, 81, 122, -41, 22, 75, -159, -26, -40, -72, 183, 182, -72, 132, 99, -28, -62, -141, -73, 10, 167, 53, -24, -11, 104, 9, 24, 245, 93, -38, -112, 85, 49, 51, -1, 86, 85, 117, 66, -136, 253, 12, -91, 100, -5, 134, 57, -85, 97, -114, -5, -19, -77, -69, -17, -30, -24, -58, -135, 103, 59, -166, -42, 63, 23, 9, -150, -33, 84, -67, -6, 45, -169, 142, -18, 14, -8, -34, 165, 35, 125, -19, 57, 92, 88, -1, -74, -132, 79, 83, -21, 11, -18, -40, 44, 42, 13, 60, -55, 20, -59, -86, 12, -11, 49, 232, -45, 126, -71, 192, -23, 136, -63, -22, 59, 3, 31, -54, -3, 43, -11, 106, 59, 12, 61, 71, 84, 46, 64, 206, -2, 102, -27, -31, -23, -40, -13, 8, 88, -28, -41, 66, 50, -127, -129, -13, -100, 127, -41, 54, -50, -90, 36, -98, -123, 131, 96, 51, -53, -100, 70, -40, 50, 69, 70, -9, 126, 171, 4, 61, 22, 185, -26, 12, -22, 18, -34, 30, 6, -50, 25]
6508B5q9O5j19J77l9r1J89j72j89K82j46n1J44k2L6j33J01l1m3J1J75m7R9q8j12
6533f8J02r3K5j05NK3p6K5K65j72pk3J51o8KL6o6j08J70n7K37k06J3Lj22K10K
6560I8j52R1n6K9j30l6J69n0J39j62PO6J4M7M8l04K66k31J78j51Q3M0K0R2o3k48
6586a96J98m2O1n5r6L99m25Q6k8o9K53j85N0J83p4qL8p9m9m0R4m3m5J23K3j02
6612b8P9j42N7P8j0j49R4j49J14j68L38k09M4j7K5P5r7P7j22J96j03nJ8K67l30
6637f7M0J19p4K46m14K36r7J47p8r8J02j38k6P2j12O3N3l2J5r2J7J54p2J73r8
6662C9J9Jq5njJ87l18J71N7n0r6l0OJ99r2J72p9p8J64j46o7k7K07k53J12j68K41
6689H0l1j45J18L4%j68J34j14J69k49L05Q4k61J12m1K3O1qk10Q6q1J18j0P4QO3
$$ y = [25, -64, 1, -118, 59, 20, -71, 118, -54, -243, 39, -107, -158, -14, -36, 0, -133, -32, -63, -106, -95, 80, 33, 132, 44, -68, 34, -59, -34, -139, -134, -111, -187, -162, 103, -69, -76, -99, 52, -16, -14, 22, -44, -152, 18, -39, 198, -8, 5, 8, -114, 96, 98, -54, 37, -19, 10, -120, -156, 13, -37, 102, -60, -53, 13, 27, 74, 122, -182, 84, -147, 31, -120, -37, 3, 23, 115, 52, -196, 2, -40, 21, -34, -130, 269, -156, -70, -98, -167, 86, -99, -49, 134, 60, 52, 90, 11, -38, -78, 16, -27, -72, 51, 74, -28, 51, -91, -34, 44, 34, -115, -21, -170, -56, -224, 114, -95, -51, -68, -43, 32, -65, 12, -110, 86, -17, -22, -4, 263, -67, -27, 92, 18, 264, -150, 86, -11, 136, 58, -40, 62, -76, -102, -30, -142, -79, -26, -58, -43, -135, -118, 36, -36, 137, 39, 58, 59, -26, -31, -32, 155, -163, 8, 65, 15, -81, -111, -105, 94, 2, 174, 95, 17, 181, 35, -32, -59, 148, -105, 7, -161, 80, 49, -96, 22, 56, 56, -112, 22, -92, 77, -172, 133, 217, -44, 68, 27, 50, 111, 103, -107, -21, -102, 16, 6, 80, 88, 151]
6715A51m5k05J11l2P4J4R0j43NM0j46J40j3Q3k13J58oK4L3k23K24k0m4m7k23K82
6741F9r4k3j1L3J4n6P0p3J86n5j38Q5j10J2J82j06j8j36J98K0j75J70o2Q1K77
6766C40l15l6N3o9Rn0P2l7R7R2j74Rn7J57J8L1j76Q3M3r9O2L2r8LP4q7q8R0K2
6795AR6q3J00j02l8O3pO6j06p8J54p3oO8q1R6J6m9l6J5j39J4M9J49q6j00P2N1
6823B6K5n3J0n6J78j96J43j26m5PmL2N5P3o9l8l2N9Q7K5k37J03M8J04j74J51j19
6850b3K8K9P2j03J2p3J61k5j69M0LQ1P3j68J12j41J0R9J22j33Q6k02m2L08j74
6875a7lJ11j11M6l9K2k2Q5q0K9o9O0j08O4J22j15r5J41ok1j0qR0j23J49j98K25
6902A19q3LK5j78j6J44L8N8m6j38K8J57j89K6m1m6kJ63R8j54m9P2K2L2k4K3J0
$$ y = [151, 106, -99, 12, -20, 54, 68, 158, 15, 20, 60, -86, 54, 41, 124, -89, 69, 63, 87, 120, -103, 121, 101, 57, 10, -213, 69, -25, -48, -59, -26, -12, -68, 2, -71, 115, 60, -78, 7, -103, -91, 91, -15, -33, -169, 29, 49, -126, 44, -18, 63, 340, 25, -11, 42, -27, -18, -68, 4, -33, 64, 156, -18, -9, -66, 91, 109, 140, -36, 47, 90, -9, 53, 85, -13, -10, 64, -23, -111, -21, 1, 97, 14, 114, 12, -26, 37, 30, 96, -10, -88, 66, -7, -13, 55, -26, 70, 86, 37, 1, 16, -123, -109, -60, 89, 3, -97, -25, 26, 51, -2, 8, -48, 130, -66, 77, -49, -94, -87, -91, -59, -4, 69, 0, -38, -70, -11, 76, 101, -136, -33, 15, 119, -55, 96, -23, 5, 34, 106, 3, 15, -58, 103, 78, -91, -51, -48, 33, 106, -62, 50, -91, -81, 18, 140, 7, 93, -109, -151, 157, -17, -20, 91, -20, 26, -13, 9, -13, 72, -8, 21, -48, 12, -96, -32, 90, -25, -120, 21, 15, -6, -16, -24, 66, -57, 92, -106, 119, 36, 39, 64, -114, -130, 14, 52, 110, 64, -74, -46, 111, -78, -52, -93, -139, -141, 22, 120, -34, -83, -11, 11, 43, 19, 42, 52]
6929E2j10K06j93P3j08J92k46M2K64l4j50%r5J43p7P2J27j19m7O8j33nn3J73M9
6954I1q1n2J78j95p1J59q6J20j14J01j54K34p7j03N3pqj8O1o5k98J67J82m7J24
6979I4k54J92J09j50m1J5J26k12J79K6j02J63j6j29L3k8L2j86J33M6r0J99j27
7002A2Q2o3p3J16l8q8N2l1p5J27l5M7j39J05J19j55p0K4M6pJ06j29j8J3P5J64
7028A67k4j09j0p6J84j20j1J76k07J99p0j27J8j1R5p3K8Kj4J80o1l31J53P1j57
7053a28O6nO8j5l2J17jp0J8l9l9K5K3j73P6J18j64J42J66k16mq1Q8n0J53q5J3
7080b9k1L5N0J8k2n1m6M4N7K7k14nK86j14n4J26j60R5L2J2ml7N3j06N8j45J82
7107F7j83J52j72P6J16O5j85J13L2j51R3J28Kk26j70K49P0r8K24k87J37M6%qn
$$ y = [52, -58, 148, -45, 28, -80, 112, -134, -92, 172, 138, -12, -12, -107, 36, -41, 31, 158, 39, -8, 60, -73, -78, -131, 42, 91, 10, -42, 136, -59, -130, 29, -57, 63, -51, 50, -104, 130, 53, -50, 3, -4, -12, -30, 31, -34, -332, -165, 17, -30, 94, -160, 32, 141, -9, -50, -35, 91, -121, 58, 84, -18, 145, 129, 0, 33, 5, 37, -149, -16, 30, -60, 139, 12, 94, 31, -42, 74, 36, -52, 0, -31, -106, 21, -14, 33, -106, -1, 118, -37, -107, -83, -37, -44, 62, -67, -85, -72, 3, 167, 143, 34, 24, -52, 132, 12, 1, 177, -30, 169, 99, -28, -10, -21, 74, 1, 29, 31, 17, 197, 136, -195, -42, 29, -128, -62, -67, 1, -14, -46, 71, 70, 0, 18, -21, -60, -35, -12, -185, -109, 9, -155, -13, 153, -63, -67, -148, -60, -110, 43, -42, -29, -50, -15, 35, 53, 31, -20, -66, -22, 35, 62, -152, -157, 129, 15, -39, 87, -73, 22, 54, 66, 62, 25, 78, -28, 30, -115, 67, -116, 36, -136, -60, 56, 121, -64, 49, 81, -70, 23, 151, 153, -73, -243, 6, 76, -22, 202, -85, 52, 98, 98, 90, 85]
7132H5j76K22o0k48J66j6j57L34j33O3m6M8j25R2q8J36M4o7k3r0O3K1j16M2Qo6
7158h7K6P8KQ7q8o4L5J0M9j16J46j13K1L6R3j60J11k2O5j12K9J88l16K12l9oQ5
7185A50j96qN0j07J9O0k1K7R2o0N1N5k45J86n2r2kJ03j99K24n6mm5J63R2n8j49
7212b2j18J24K3n0N9Q9n6MJ4j56J07p1O6J04j99K1L2K1q5J26p0o5M4J11L2q5q2
7239h2Q5l0J35L0j85R7q9J8o5J75j38o4K93j49qk8l0MK2lqJ15k38K17m7p2MJ57
7267A16K2j68O9j6L8j10M4n9J88P5l05J02k2J3P8M0j20J48m6r2kr6J36l0k41M41
7293B03j80J6j12O0mj38K67j84Qp0N7O5J34q0N9l9p5J47p6L0RP0l20K19j56j03
7319a93K63k5k1O6j20M6m0J14j40K45k15mJ59j91M0J34o7k76M00j81n4J39q9q5
$$ y = [85, -91, 131, 71, -177, -11, -27, -184, 150, 17, 80, 34, 82, -43, 49, -39, 97, 141, 74, 51, -39, 24, 45, -71, -29, -21, -87, -61, 17, 19, 106, 18, -46, -11, -1, 48, -68, 78, -35, -14, 22, 115, -45, 66, 44, 109, -3, 26, 214, -102, 110, 71, 65, 150, -46, -54, -4, -111, -92, -32, -53, -26, 66, 6, 57, 112, -133, 53, 1, -91, -93, 10, -189, 35, -21, -25, -70, 93, 185, 127, -22, -140, -16, 7, -43, 16, 105, 49, 53, 67, -89, 18, -53, 13, 117, -82, -61, -29, -8, -93, 33, -37, -102, -58, 53, 85, 0, -82, 3, -27, 108, 138, -47, 50, -39, -21, -86, 89, -49, -113, 180, 31, 23, -5, -35, -31, -9, -12, -20, 95, -143, 74, 27, -45, -41, 116, 138, -30, 39, 23, 61, -49, -5, -64, 124, 199, -106, -4, -26, -13, 65, 105, -15, 133, 87, -5, -7, -103, 33, 3, -238, 203, 23, 39, -73, -13, -17, -155, 112, -72, -64, -134, -77, -12, 122, 42, 101, 62, -13, 134, 58, 88, 97, 167, -153, 66, -90, -193, 70, 45, 24, 90, -30, 16, -24, 90, -50, 195, -20, -24, 135, -56, -16, 118, 51, -225, 175, -6, -60, 79, -10, -95]
7343i5J89j30k8K2RJ01k4l1r9O7J02O6q4o9j58J68l4m8J63Ql7J%P6q7j48J38N9
7371I7lq8J16o5j22J48j01j8R4j25j67J82O0J0J65r9j20K3o2N9l4o5R3k10J69
7396f3O4o1J30j13M6j07M6l5R4n6j14M8K91k27M7l0Q0m7M4j7p7K44l06J53l2J3
7422A5r5P3K2j85K11n3O3MJ13o3l9n8J9o7K9j38J88o6j7O6K5k8J06j42J7j8M1
7449B3m9m1L2k0L5m0J93p9qOl6l7%j2k7k2L4J55j55l1J69l0l9o1k9J28n7O1O4
7478A27O2l28J35Q8j50J19J65k31NP2j3M5k02J55j51J99k56J60p6L5P8MN8J7n8
7503E9m5J83j86J05j10q4o4J18l5O7L1R1j71J29p8o1j6N5j60J69l5N5q1J21j20
7528f3M1o6L2k9M7Q4k06K13j63l6J61k4m0J05kr1N2j06J65j68P1P3on8J35k45
$$ y = [-95, 94, -36, -64, -42, -33, 68, 44, 13, -86, -19, 83, 149, 65, -4, -162, 6, -28, -76, 87, 95, 58, 59, 59, 135, 48, -100, 38, 97, 94, 6, 122, 57, -65, 83, -18, -36, 58, -67, -234, -52, 8, 18, 183, 84, -36, -13, -75, -16, -50, -115, -22, -232, -63, 1, -60, 70, -43, 3, -104, -58, -93, 1, -55, -169, -121, 170, -57, -10, -40, 40, -7, 37, 20, -57, 187, -119, 34, 2, 15, -80, -7, 15, -170, 41, -12, 51, 55, 168, 105, 66, 8, 27, -40, -11, -149, 39, -27, -44, 22, 47, 19, 125, -17, 0, -18, 23, -26, -67, -35, -55, -20, -60, 133, 54, 46, 52, 16, -21, -21, -33, -60, -82, -48, 107, -48, -79, 90, 60, 21, -40, -69, 59, 2, 63, 127, 189, -139, -4, 84, -66, 53, 218, -13, -8, 64, 51, 96, -106, 49, -102, 97, -159, 1, -75, -40, 38, 42, 100, 117, 59, 14, 197, 11, 116, 6, -78, -142, -24, -59, 8, 39, 130, -41, 88, 10, -51, -67, -12, -172, -3, -38, 17, -64, 57, -63, -22, -88, -56, -85, -38, 46, -160, 53, -110, -146, 15, -9, -49, 56, 54, -37, 15, -91, 74, -94, -23, 50, 44, -14, 121, -124]
7554a24J76j17J02J33j26P5j58o1J96k1j2j60q1P1R9Q8j74K3j3M4R4j25R7N2k3
7579E5p9p6R9K4J20J5r9q8P2n3l6M0Q5j43R2n7o5RK34k63K5M9N8j14l6Q7J4j23
7607a54J59j07j79J24L61j44Q9j54M7j23j60K98j95N4J54k89J29J98j51O9pM5
7629F4j52J64j0j65J88j57m7N4P8mo0K20k45O9J19K3l29L9L6R0J14o0J0l0j23
7654a14J33L1M0L9k5o1L4p4P5j4j15n9K23j48K5Q2j1J7J40l51R5L7m3L3J3l0o1
7681h9K52j38q8J97j26j8oJ10o8o2L9rl6p4J52j16L9j69L78k57m5P1K5o2J34n
7707B9q8R5j44Q1L9k9JL0J17k1j49J23MK9j19R6l7n9R4qk22R5k34L17j05J21J8
7734G4l4q8l7P5J0J38p0o5J9l1l5J47k29P4K7m2J7K7l3R7r2J16L4j1q1J04n4k
$$ y = [-124, 52, -65, 37, 170, 44, 119, -39, -100, 96, 75, 63, -97, -178, -107, -8, 80, -94, -71, -84, -40, 54, -71, 26, 78, 55, -24, -100, -1, 23, 143, 158, 59, -29, 43, -10, -46, -6, 79, -64, 28, -29, -94, -85, 149, -114, -89, -40, 18, -96, -132, -45, -31, -154, 5, -102, -281, -157, 204, 60, 149, -5, 42, -81, -241, 57, -138, -84, 70, -219, -90, 108, -43, 26, 19, 64, -88, 76, 66, -99, 89, -68, -115, -61, 17, 13, -47, 173, -72, -3, 116, 139, -190, -151, -115, -25, 89, 29, 39, 9, -114, 19, 50, 90, 129, 104, 43, 77, 3, 78, 64, -51, -110, 113, -35, -10, 72, 61, 78, 218, -133, -38, -1, -44, -11, 2, -28, -89, 163, 25, -63, 134, 8, -10, -16, 94, 26, -36, 3, -6, -42, -116, 36, -80, -41, -210, 168, -89, -134, -63, -38, -100, 34, 29, -59, 36, -108, -27, 12, -17, -16, 14, 131, 110, -39, 84, 88, 117, -2, 94, 57, -2, 92, 84, -138, -43, -277, 40, -65, 56, 74, 40, -48, -85, -10, 0, 138, 68, 3, 22, -9, -44, 103, -126, -52, -25, -67, -50, -23, -56, 41, -51, 65, 99, 88, 7, 111, 57, 55]
7762E5m1j67M4k6J14J69j65P7j24P7j27P9K74l55k3NQ2r0K02j56J64j01J40k15
7786a08K8O6j4J0l3L2M7j47J42N4m1p0J5Q4K0M2j05l6p1j0Q8p3n5K88l20J42J06
7813H1j53j0K34k29Q6K7p1J39o8p1q5qQ0J3N2J22j16P0j09P4J21j37krj22O6O3
7840C8j6j51J44K2o1M0L4m0Q8L8q8j81Q7J63j31l1k3J49j39m3J46L7k63L06j4
7865A11j03P6K8l4k30Q6K15k74J03N6m0o7Q7j96J03R3l7k1N4r0J63ql8K9R3r5
7891F4j10O2o3O3k6Qo1k1J02l6J51j17K4j74M01k08PL1k27J43K8j54J09m3J77
7916A30j77m3N3L4ml3K4N8N8J01j05j3j32l7J30QM1j32m9J38Q5n3j89J72Q5j47
7942Cm0JJ61j87J58k68K97j70J03J1q8Q9k4O3j62J53J69k87Nk6k5m0J45R8j48
$$ y = [55, 14, -153, -109, -135, -21, 148, -17, 60, -64, 13, -114, -35, 239, -116, -139, -134, -52, -142, 60, -96, 68, -33, 107, -108, -80, -14, -28, -18, -51, -19, 28, -119, 23, 77, 36, -34, -19, 65, 85, 127, 22, -14, -85, -95, -7, -80, -135, 153, -167, -25, 81, -72, -82, 152, -77, 9, 36, -35, 104, 36, -35, -120, -128, -48, -35, 17, 139, 23, 93, -16, 58, 179, 42, 40, 31, -91, -25, 38, 22, -129, 15, 37, -24, 16, 50, 10, 98, 136, 48, -133, -46, 117, -14, -45, -68, 81, -58, -101, 45, 82, -181, 125, 111, 8, 84, 112, 78, -152, -66, 149, -125, -22, 34, -6, -73, 14, -182, -79, 14, -23, -44, 10, -80, 83, 75, 37, 66, 159, 64, -46, 16, -47, 16, -10, -2, -63, -84, 18, -18, 133, 16, 40, -134, 267, 59, 66, 97, -130, 13, 41, -113, -4, -47, 130, -47, -90, -37, -3, -7, -40, -16, 42, 100, 201, 96, 83, -49, -86, 44, 52, 93, -39, -88, 50, 135, 82, -107, 65, 150, 3, -37, -36, 125, -62, 96, -172, 125, -45, 58, 69, -19, 70, 46, 109, -53, 100, 269, -18, -13, -39, -64, -104, 41, 139, -9]
7967im6R4J12l36K52M1j12m3J2k1K08j71m3J91k28J92L5k67K17q4KO2j29K09k24
7992h6L50l18M3P3j43J65j68J74j21o6l6K4K26j29J4l0n3PR3j45L62j07j61J28
8016I6j23K5N3p9k0J3n2Q0M9L3n3p4J37o6J6o4J5%j48J18j9J40L7pj37P0j33J00
8044Gn6j42J11j4MP0J59j07n4jQ0M8k13l6K43j16L2O5j72N7J86o5j55N7n2J13
8070D9l3J20k08K04k06P3p9J64l5j77J93K6j2k7j52J51j07J16n1l0J67j3p2k13
8094a52R3J10R6m1o6L4j93J86j73L19m1k01K3MJ3q6J41r4Q1j69J52j06J30K7q6
8119Ak4j0p6J14j00N7JJ4l4p3K04J22p5j85N3j0K47j38j87l0K3RJ15j10J17r4
8145f9q4J22J31j75N4o8m4K10k10J38J82l67K9J53M8jk24L02j48O0o7M9K5k01
$$ y = [-9, -55, 39, 151, -185, 67, 108, -4, -47, -35, -56, 152, -19, -62, 129, -99, 93, 128, -139, 78, -6, -4, 58, -71, 138, -86, 264, -54, -11, 62, -81, 84, -84, 90, -31, -97, -133, -109, 117, -12, 2, -28, -81, -74, 19, -126, 236, 129, -32, 96, -27, -2, 51, -28, -48, -35, -87, -7, 42, 75, 22, -52, 85, 19, 35, -29, -14, -14, -162, -44, -63, 77, 114, 107, -30, 40, -93, 7, -49, -191, -80, -94, -90, -20, 139, 32, -22, -23, 57, 105, -108, -144, 99, -17, 15, 80, -92, -35, 151, 86, -69, -12, -64, 49, 16, 136, -72, 132, -74, -1, -80, 84, 49, -128, 65, 91, 79, 52, -100, 51, -56, 60, 9, -21, 146, 133, 61, -152, -59, 51, 147, 106, 40, 74, -119, 67, -106, 213, 172, -29, -6, -2, 11, -75, 66, -28, 53, -116, 36, -70, 60, 87, 1, -23, -33, -109, 5, -95, -38, -37, -23, -57, -130, 74, 196, 121, -64, -11, -21, 226, 88, -99, -129, -106, -97, 18, -92, 25, -69, -153, -31, 100, -75, -21, -89, -133, 77, -133, 5, 187, -180, -151, 2, 50, 49, -175, 127, -21, 39, -28, 21, 46, -155]
8169a55J77J35j01j93N6O8J45o9q9k4Q8Rn4N6q3j9J53p6j38K6P9M5
$$ y = [-155, 22, 157, 56, -137, -81, -13, 132, 63, -26, -50, 38, 47, -7, 49, -34, -53, 100, 24, -114, -88, -9, 36]
8191C6
$$ Imaginary data points
##PAGE= N=2
##DATA TABLE= (X++(I..I)), XYDATA
0@%%%%%%%%%%%%%qJ6j6J6j6J6k4L2l2M0m8N6o7P5q8J04j19J34j51J71j93K18k45
36a29K73l05L40l78M19m64N15n71O31o96P66q43R29j024J128j241J366j509J671
55H78j854K063k305K590k928L339l853M511n384O604q419J1383j6982L0862j21340
70a00835j70964L29131p6323n4379J76034j40204n0699J18266r2120J8068J8020
81b6005o9561J36205L4434j24585L6623j6983l2904N8363m4802R240O7916m0139
93a2198K4956k0116q9236P0086L7497k4870L4089n4205R898O2020j02497P821
105e6755P4539p3317P1566O8357j30429K717L1469l5925P0497m7203m5343J30802
117F0975m8737n6011R1211r8179l3265J29728m5939j2617M3091p7407M1482L3716
$$ y = [0, 0, 0, 0, 0, 0, 0, 0, 0, 0, 0, 0, 0, 0, -8, 8, -8, 8, -8, 8, -16, 16, -16, 24, -24, 32, -35, 40, -48, 56, -63, 71, -80, 91, -102, 116, -129, 144, -161, 179, -199, 220, -244, 271, -300, 331, -365, 401, -442, 487, -537, 591, -650, 716, -793, 878, -976, 1087, -1218, 1372, -1556, 1783, -2070, 2441, -2943, 3661, -4758, 6625, -10357, 20505, -100835, -271799, 57332, -18991, -73370, 102664, -37540, -88239, 30027, -62093, -44025, -26005, -95566, 40639, 75073, -49512, -12889, -29872, -62776, -4413, -49215, -39975, 27941, -12198, 12758, -7358, -96594, -26508, 10989, -13881, 20208, -33997, -24099, 37921, -64576, -56755, 17784, -55533, 16033, 84390, -46039, -43322, -11853, -47778, 22719, -24484, -69827, 60975, 12238, -43773, 47438, -50741, -84006, 45722, -217, -12834, 30257, -47150, -5668, 28048]
129B8048r4139N9761M5727o8661M5476J985o8046L2989J0432j791J8316l5987
141b5890L0175L4965n5646O468O820l5309L7086J3620j1904J4418l6727J1679
153a0245M0726n7539N173M8787m0248J1713J9660m2661K3192K408k0323N1119
165C1762l1333l6750P2740k0732m8709M2325j6834j6479L8046p307M197n04l1234
178b0812L3360R35m9728L6220K1277k9352K0172j900k2246J3829k434O788O429
191A2538k8378J4441K2923k1140n284l449j74K1873p163J972J3492l4466Q48L1966
205A9999k8528r942L0980K748r69j0812j1086J6041j4055n754L4034k2989j9461
218a9794M4741l998l3963P003M510N547Q686o692N155q465j8201J9741L492k1147
$$ y = [28048, -66091, -6330, 39397, -29264, 16212, 18197, -49849, -16860, -6428, -8219, 10097, -25890, 4285, 39250, -16396, -9928, -3108, -38417, -1331, 12289, 385, 14803, -21924, -10245, 30481, -27058, -21885, 26902, -13346, -1633, 18027, -24634, -1442, 966, -19357, 31762, 429, -36321, 36419, 15687, -33022, 9303, -7531, -24010, 14036, 6729, 10926, 10422, -20812, 12548, 13483, -36245, -25, 21252, -8100, 12072, 10172, -12074, 1755, -679, 6109, 12538, -15840, -1399, 21524, 384, -4900, -8349, -8523, 13350, 6187, 8159, 21651, -12815, -11967, 19999, -8529, -18471, 12509, 15257, 14288, 3476, -7610, 8431, -5624, -11378, 22656, -333, -19794, 24947, 20949, -13014, -6011, -1501, 4046, 12732, 6040, 11195, 2730, -15471, 4270, 7762, -13385]
232a3385J6462J9128o915j0786j3735K901Q854n638Q662O045j2766O009R576r230
246E182j2449n602J7529J4851j7666j798J1679j7203l281J6491n122l191R496
259H916O735m464k4630l293K6508m174j0121J9135l407j6340J0701L829j5351
272e956p277J1702J7993n877j4874Q973J473j4174O341R363o833L30R707o46j5508
287e263r025J3186J1521m697k116K221k105l975k156K734l528n634J6066J2724
301A9953j7601r561J0544m07q720K194Q538J541n913M803L360j9290m056K6604
315A1989K084j9121M473Q046r496l349O803j214n656O760J3506n302j7257J636
329f098J0218n508o095Q581N817l525K88P3q293n481Q120J1236k573j1582Q01
$$ y = [-13385, 3077, 22205, 15290, 4504, -9231, -6330, 2524, -3114, 5548, 11593, -1173, 4836, 14412, 5182, -7267, -12869, 4660, 19511, 1845, 47, 11726, -5477, -8758, 7733, 2611, -580, 8916, 15651, 11187, -13443, -16736, 9772, 5598, -4523, 14612, 11205, -5135, 5566, 9395, -5956, -13233, -1531, 16462, 10585, -4289, 4684, 6157, -8017, -1676, 7687, 854, 1184, 10891, 10245, -5263, -14288, -1102, 10419, 5722, 3606, 5827, 3722, -253, -2409, 325, -3203, -8837, 7229, 19953, 2352, -7209, 3335, 2928, -5792, -3598, 4940, 6481, 568, 5371, 8731, -10559, -14615, 11989, 14073, -5048, -575, 7471, -2025, -5374, 1429, 215, -5441, 1319, 14825, 9523, -7734, -6098, 4120, -1388, -7483, 1098, 6915, 3390, 3678, 3751, -4542, -10023, -1903, 9333, 6760, -4822, -4021]
344d021R726l999r307N685N368m825L964P797r634j2894O931J0746o578o798J1781
359C942Q867j1371p537N499m571o323J5610R575j6461n962J3201l73j0793Q41
373e856P070O87k111K625J422j0627l607J3249J257j0054N016Q931m161o996m577
388g732Q78M283J521N408L380j1066n183J0663p7j1321K300J1783j93p644J907
403a093K751q543n76J1767p95j0504N111J0854q268j4540O032J0056m884L114
417D82R504j0301j0509P669M225n818k413O481P981n297q231N131o22o961P494
432a185N043p530L25N378Q6o060p705N930J1495l620l662M292o480o374P256M517
448A706n614j734R301M303j1288o842P830J131n110M582N500n544l362Q005m4
$$ y = [-4021, 5705, 1706, -7601, -1916, 3452, -1373, 2591, 10388, 754, -12140, -5209, 5537, -1041, -7839, 3942, 12809, 1438, -6099, -600, -5171, -11494, 4116, 13691, -2770, -8732, 4469, 4096, -6697, -5856, 1214, 1901, -210, 2415, 3837, -6790, -10397, 2852, 4109, -5945, -929, 8002, 3841, -3155, -7732, -6854, -2571, -1050, 4358, 7738, -3328, -8511, 2152, 2075, -9246, -6946, 4837, 4644, -3000, -1093, 1658, -6885, -7461, 4306, 3511, -6993, -1882, 8972, 704, -13836, -7804, 2252, -2632, 482, 9986, -315, -10824, -3155, 1070, -4748, -7161, -680, 7301, 2004, -6227, -1096, -1718, -8679, -1185, 3858, -3672, -3347, 2031, 2117, -3943, -11648, -5718, 5777, 2157, -1505, 2787, -3693, -10067, -2811, 1706, -3908, -5642, 3659, 7962, -3326, -10168, -2338, -1207, -6317, -1735, 3765, -1779, -5141, 2864, 2820]
463B820j4607N11J6634k47q680L483n97o898J385N538J258m221J460R443o217
478A065j3593O058O897m207K683K304k777J768j064k027p75n840L782J3180l326
493D128j0062J513K576k228j228L653L806l948l96O040p399j0369J0495R784p870
508a505m352Q086P70q738R22M325p533J16J4281N7j1073j072L826r5k457J4N629
525A201k3l891L673k630q250N004P378r43k644k838K543L598p627k229P384k329
541b623o79Q932k512j0096M31N548j08m616L323P642m449o426M034m59m580M845
557a793O402m522o567L919N812o075m816O264J903k959L661J895n360n075K642
572d669O091l250l935Q862J320q955P38K488l728K160M177K14k061l977K521M489
$$ y = [2820, -11787, -11276, 5358, 5111, -3569, -86, -683, -7581, -6196, -658, 600, -3621, -2161, 7282, 1065, -12528, -6470, 427, -3780, -1097, 1207, -1570, 198, -866, -2893, -3668, -9508, -5726, 7454, 4128, -5934, -4421, -1845, -4073, -5301, -1648, 2158, -1790, -2186, 3854, -3545, -13914, -3419, 6365, -1505, -5857, 2229, 2999, -5739, -4817, -492, -8025, -7909, 6372, 6429, -4644, -5716, -1890, -1985, -4442, -4428, 1201, 1178, -2713, 960, -1670, -9920, -4916, 2462, 1519, -1125, -3963, -1420, 2178, -5449, -7678, -294, -2623, -3302, 5630, 3118, -6978, -6547, -999, -1107, -5723, -2400, 5242, 793, -5633, -1599, -2058, -6638, -1793, 4609, 87, -6480, -2561, 3251, -2824, -7640, -1376, 527, -2432, 1229, 3124, -2236, -7311, -4669, 1422, -1828, -5763, 3099, 4419, -4536, -3798, -1310, -5038, -2878, 1299, 1513, -548, -4525, -2004, 2485]
588B485n725k811O530O43k069J091J23k987l742L563N976m061k732P518j43r242
604e583m70N640l20k281N247K754r350j726R983k872q781N691N129l000r66J714
620H09j223m730O20P528j353n145N126J907o181j806R51J991M100j330q31J415
636A848m886j070O119k086n405M488O390k471o520J617K867m956J223Q077l673
651A562n016N524R95p308k520O543N144l762k042L567m314m048O416R91m785J846
667a207M630P03n016l851M180J120l528L830L237m806j2K524k800l143J237O280
683C378K365o167j895L253k594j286M039J065k731M34L817j019p094K33O485j315
699I68k747L960J232l526j774J936J39m080L202Q250m744p680M523J930m254K158
$$ y = [2485, -3240, -6051, 479, 1122, -947, 144, 267, -2720, -6462, -2899, 3077, -984, -3716, 3802, 3659, -5583, -6053, -413, -733, -3014, 2233, 4987, -4363, -6089, 3894, 1022, -7759, -2068, 3061, 61, -905, 809, -414, -5144, -4524, 3004, 1651, -3494, 1632, 3539, -2642, -4448, -3497, -1506, 2594, 1264, 433, 1848, -3038, -4108, 2011, -75, -5480, -992, 5398, 2927, -3593, -1976, 891, -4065, -2842, 5235, 1562, -3454, 2070, 3065, -4243, -6763, -220, 4924, 1162, -880, 2687, -1627, -5675, 741, 1732, -3053, -1207, 3423, 4126, -890, -4741, -561, 559, -2969, 861, 4098, -708, -720, 1804, -996, -4139, -2902, 3378, 5743, -424, -2319, 934, -1660, -2946, 1093, 2158, -573, -139, 3678, 2659, -4435, -4202, 2283, 968, -1779, 2181, 3413, -113, -1887, 49, 188, -3892, -690, 7560, 2816, -4864, -341, 1589, -2665, -507]
715e07L276j506k127J669K630m198m883N903L454m249P49K403j893j164k46m29
731a118N49m96L103L542n014m795L105L284j947j489L273R83m413J082L569n387
747b169k703P765J715n623m70M341q11n159R32M025l034N60O883l495p558K699
763b102M013j307j295O99K286n71k531J339o35k891K923L741k447k406O36K407
779A859q75m084O92M639l81o53J658k857m103K368M481j395l562K924L756m650
795a83k979L214J79j787K558K372l041l039L080K700n272j893O242J231l173Q85
811A094j63l506j10L421J829k733j070M214p08n166O32K945o12L05J468o25j698
828d83p38J779J65k844K37M380N06l340q90Q91p34q20L144J574l474l81L377j839
$$ y = [-507, 2769, 1263, -864, 805, 3435, -763, -5646, 257, 3711, -538, 211, 2614, 721, -443, -689, -1118, -569, -1065, 2038, 5580, 566, -4229, -1124, 2160, 213, -1276, 1997, 2980, -1433, -351, 3218, -2169, -4872, 2893, 4608, -1015, -1485, 2856, 2045, -3114, -2182, 1843, -1191, -631, 6252, 2757, -4801, -2102, 1911, 604, -691, 8, 2294, 1723, -808, 531, -104, -2995, -72, 3669, 1222, -1184, -548, 1859, 984, -3100, -2408, 2231, 1850, 1197, 2855, -2, -4105, -1737, 2744, 1349, -2213, 711, 4467, -183, -3162, 52, 231, -1556, 1002, 3374, 333, -2706, 374, 3074, -2198, -4091, 2151, 3382, 209, 1094, 931, -2575, -2685, 736, 2565, -168, -1238, 2976, 2268, -2898, -2266, 679, 67, 372, 1840, 1215, -483, -1221, 558, 723, -2121, -1884, 2496, 3002, -338, -1228, -337, -1071, -1891, 1253, 2827, -647, -1028, 2349, 510]
846E10m403J956M062r26j902J985N95m135N71M178k902l060M655K617l616j884
862a699J011k5p00J390K360j525k323K013Q29l339o59L158J461r73j229Q4Lr84
880a147L06J492j009j287L130J959l979l021K852J694j853P53K556j946k231J906
896A75N97l246J7M933P97m944N3L030j963j360K383L51k463J718L045k168m004
913c049R40K841k99j056J487P14k159n53J188q71j069K227K388j935k539L25J903
930D83j67j666J201J664j488j86J977k067l309K569L050j158k047J938J293l225
946a138j396L117m79j570L184J476m345j978L586Q92k749N42K515p24j530J181
962E84p6k783L64L166P46k336j58J637p10k377P22J694k57O67P60r68k047q66
$$ y = [510, -3893, -1937, 2125, 1199, -703, 1282, 1877, -2258, -1687, 2491, -411, -3471, 1184, 3801, 185, -1699, -688, -713, -1413, -23, 2337, 812, -1511, 502, 1331, -2008, -2667, 491, 1952, 979, -250, -166, -163, -1147, -841, 651, -358, -1645, 1485, 3444, -535, -3556, -704, 990, -863, -110, 2446, 500, -1731, 175, 772, -2474, -2457, 2476, 3273, -1671, -1618, 1412, -551, -1911, 472, 823, -1640, 78, 3123, 955, -3049, -2109, 732, 433, -623, 864, 1578, -581, -1134, 54, -817, -1886, 341, 2729, 794, -1745, -1420, 483, 316, -1350, -149, 1515, 27, -159, 1818, -249, -3558, -989, 2061, 903, -1144, 794, 2087, -1138, -2534, 583, 104, -1466, 1718, 3194, -1151, -3129, 457, 1349, -1400, -858, 1657, 933, -597, 584, 508, -2275, -1911, 1255, 2001, -335, -493, 1144, 434, -1943, -1221, 473, 216, 883, 1643, 675, -1372, -2238]
980b238K638J624k814k51L073j026k064J197J22j649M29K962n9l021J14K885k009
997h7k805K737K277j794n0J158j547k330J684L177k150j857K604R85k311n12O53
1014a68nm80R71J737j528k110K079O80k534J29K104O77m11j300k99K96j274J158
1032b78K398j919j604K785K44k608n62J523J061j246L15J776j908j928K729K24
1048A002l021J049L236l12k766p0J439j689K4L158p94k236J224J351j353j442
1064a200J03J745J70r45J001J22j947N75P98q16r7P88J293J56k998l30K352q47
1082g7o43K579q67j919Q74J000j041j765J619K572j514j935K186l67k280J287
1098b91R62j034k63K139P01k780j536K037M86o45J140J86j107m69L25N89r61r46
$$ y = [-2238, 400, 2024, -790, -1041, 2032, 1006, -1058, 139, 261, -1388, -959, 2003, 1944, -1077, -963, 1922, -87, -2892, -155, 2122, 328, 278, 1436, -111, -2441, -757, 2420, 270, -1587, 1017, 2002, -309, -821, -168, -173, -653, 318, 2055, 527, -1583, 496, 1176, -1358, -1229, 875, 1552, 1141, -159, -458, -162, -1436, -278, 2120, 201, -1403, 1382, 1626, -982, -1544, -21, 1040, -206, 109, 1885, -23, -1951, 778, 1002, -2019, -970, 2266, 1954, -812, -882, 557, -1132, -1108, 2050, 1256, -980, 244, 1595, 242, -1200, -1097, 648, 818, -127, 874, 996, -951, -376, 422, -394, -491, 297, 1590, 1746, -1252, -1582, 770, -77, -720, 1859, 992, -927, -53, 947, -94, -1859, -240, 2332, 818, -1117, 1069, 702, -1578, -291, 671, -363, -626, 1513, 2214, -566, -2102, -65, 421, -224, 916, 1102, -5, -474, -149, 440, -521, -1467]
1116a467K660Q44k768K24J260j276j59O41K43L93n18Q58M89l091l41K969J82j548
1134d05R03K35o39q54K48J009r68P3K274o74l062J234J616r73j115J187R16j221
1152b16J90J433j749k081K498J501j474j52K81J64p60p48J225Q1p82J477L40k172
1170i44J42P42Q9J82j070M43J690j068r27J538j619q97K204Q86j298r18Q56P23
1188G54j721n32K285k36j282J605R2k263L19J663l6j686M12J655n34r98O18l32
1206b17r26J219Q94m27p60n10J159j41j836R78J360n96n7K93q65k04J51P89K51
1225E55j365M70J899j435j492R51O9j89Q58N90o17j162K58J181j056r75K021Q63
1243A424j252n80L92l48m64N72J175r89r57J932N6j966k66J147L5K35K39L24p15
$$ y = [-1467, 1193, 2037, -731, -507, 753, -523, -682, -41, 202, 595, 77, 935, 1424, -1667, -2008, 961, 1143, -405, 498, 733, 94, -760, -512, 497, -471, -398, 1876, 1202, -1860, -626, 990, 17, -1098, 89, 1005, -216, -26, 1407, -342, -2423, 75, 1576, 102, -50, 231, 395, -365, -1113, 112, 193, -589, 888, 1228, -944, -802, -60, 29, 211, -859, -416, 1274, 206, -721, 817, -802, -1699, 505, 1391, 93, -825, 31, 754, -967, -1499, 786, 550, -732, 873, 965, -1298, -979, 684, 648, -1038, -626, 1029, 495, -503, 115, -217, -1143, 76, 970, 543, -217, -727, 432, 291, -1545, -567, 793, 197, 140, 433, -432, -636, -485, 304, 555, -810, -340, 1559, 124, -1368, -417, -348, -537, 321, 911, 294, -868, -610, 571, -485, -1460, 561, 1424, 172, -408, -16, -364, -828, -256, 919, -70, -1027, 905, 961, -1005, -1271, -124, -89, 146, 385, 709, -6]
1262fj245J260K66j455R35J368q37m32n64j05O82l61K87R89r66o25J450l90j433
1281a182J97J316L81p94r1P58j147j096J985J21j376R80J104r85j647R23R86r08
1299d75J0J292n18j347R87M86j018n02Q56P24R4j018M81j6j069N73P33n20o2N87
1319B78K16p85r79O60J282o39o74J097k89q03N03L87q23m35J230P77r83j142J331
1338B09r6j117O30O10l65n4M85P1j412r2J539rj009L41N31m91j45J49Kk50q6J224
1360F65j74j379L57Q02n10m21M23L06J56k45p2k03n55L07J198l60r27K77O91l82
1380d6o31K91M22l83MR12m06j277P32P42q27m55J145N78j056k41O07o75k97R69
1400A08O09j121k92R00%p73O5L26J41j40K74J78p75J4K86J57k21k6O71J06p04
$$ y = [-6, -1251, 9, 275, -1180, -245, 1123, 286, -146, -710, -815, -133, -494, -207, 782, -184, -809, 641, 251, -1182, -985, 331, 712, -82, -173, 585, -562, -1658, 327, 448, -928, 52, 1156, 171, -1476, -553, 433, -475, -465, 827, 309, -1038, -51, 435, -583, -1085, -229, 495, 589, -429, 52, 36, -1033, -460, 273, -247, -309, 278, 494, -291, -1270, -610, 672, 33, -641, 456, 167, -636, -133, 254, -569, -1004, 226, 1003, 20, -1122, 209, 113, -1004, -374, 236, -129, -183, 302, 373, -1039, -1131, 408, 399, -610, -269, 262, -229, -374, -225, -223, -473, -559, 665, 491, -888, -531, 271, -239, -660, -237, 69, 225, -20, -92, -295, -850, -543, 655, 295, -632, -355, 336, -46, -677, -386, 36, -347, -343, 569, 163, -1114, -382, 360, -467, -922, 223, 801, -255, -496, 111, -564, -861, 108, 717, -404, -696, 204, 204, -569, -504, -178, -37, -177, 97, 275, -500, -486, -200, -43, -264, -290, 381, 487, -217]
1421b17n50N91j69j76Q38M63r36m29O49J34q77J43P85l4n09K87K73j081J14Q65
1441A64n9q11N25P17n43p35M70J83m03M92M41l20n95J04M65k47m92L11Q56l56
1461A67l54O8k02k66L88L09o7l59L02L90n58p32M90O94k89RL35m46n24M16M19
1482A90m81k02O37M71p95l98M23J82l85M47L48o92o2O68lj001J69N92L41o58K80
1503G1J6l98n6M27j69q7O4N31k28n27l3N43k5j65K37m7j84j38J90J60p31N4J219
1526G24j78r06K94L92o03L1K91K46l85P0N61l77q14N46N23m59k59L75J46k76Q5
1547B7j0k30j88N74M48m04m74M20m4l72K82J80M3j81P6J67n74k51O37Q6j64k47
1569a99K81k9j15j61L79k34j27O19J73q40O7L53m3l10P3L13P5m97L14J57o39k1
$$ y = [-217, -767, -176, -345, -521, 317, 780, -156, -585, 64, 198, -679, -536, 249, 215, -294, -7, 266, -815, -701, 164, 105, -706, -181, 536, -7, -742, -272, -89, -492, 0, 441, 121, -474, -370, 95, -152, -644, -333, 523, 167, -187, -119, -321, -587, -199, 110, 43, -316, -14, 376, -182, -914, -424, 270, -19, -10, 325, -121, -645, -229, 190, -291, -493, 144, 615, -180, -578, -155, 27, -358, 89, 437, -255, -317, 351, 348, -653, -484, 108, 449, -209, 71, 87, -311, -367, 60, -109, -196, -132, 399, 171, -356, -389, 154, 129, -36, 201, 154, -30, -168, 22, 182, -549, -495, 724, 546, -360, -66, 326, -277, -246, 45, 291, -94, -24, 537, 160, -654, -108, 415, -44, -303, 72, 218, -58, 27, 17, -213, -401, 173, 621, 217, -257, 163, 119, -253, 29, 209, 252, 71, 147, 314, -260, -511, 126, 212, 48, -199, 82, 53, -62, -223, 156, -78, -205, 414, 587, -253, -186, 167, 124, -186, -113, 200, 275, -222, 92, 249, -390, -411]
1591d11Q73n2p42K33M88k30k74j05M33l23rP57m49n86L53J56j82K2rM93j78m21
1613a63J73k34j01K52L00J15n12p8O21j26q32O18J73l62M70J19m73k65J68N28
1633C91k07o03P08L11q51j07M81l39N2N23K0l27k68J47M76o18k60P69Pj55j06
1654D4R6l86p0M05K69m88o9N11j27n45J29R4K86J2j98L50m27k25L89J23m46m5
1676c18O60m3k91j57K03r8l48M52L58o47J84O48o11n84N43J85j25k05K49J22o04
1697d27J37O31m35m67Q13K5j22k74k8R9j30j2L43j32j83K16Qk99j81J63O55k0
1719C80o14L43N1m85J49N07m55j18M65om19k91M09K66n79K25O05o07N0L07j85
1740bm71K44L98J51l46k10L82l19O5J42r9k14M05J4P1k11k51N21n6m06K14K68
$$ y = [-411, 462, 410, -332, -99, 389, 159, -115, -220, 213, -110, -119, 638, 189, -397, -44, 112, -70, -48, -57, 436, 258, -163, 10, -224, -325, -73, 227, 342, -170, -248, 373, 247, -585, 33, 206, -156, 314, 433, -40, -305, -137, 391, 184, -419, 289, 600, -251, -358, 123, -216, -164, 359, 379, 52, -216, -69, 407, -211, -471, 298, 305, 150, 44, 140, -246, -316, 89, 358, -130, -199, 312, 185, -360, -231, -137, 149, 161, -37, 313, -114, -339, 50, 173, -273, -318, 342, 299, 8, -149, 54, -44, -392, 60, 418, -229, -45, 603, -8, -592, -49, 136, 11, -194, 55, 177, -427, -290, 341, -94, -561, 252, 277, 155, -119, -147, -48, -178, -190, 153, 21, -162, 54, 62, -237, -418, -255, 400, 380, -234, 109, 160, -325, -176, 331, -124, -242, 223, 217, -202, -493, -84, 182, -397, -172, 433, -174, -124, 183, -2, -473, -229, 169, 320, -26, -236, 146, -173, -108, 34, -65, -279, 126, 140, 211, 0, -251, 270, 214, -192, 22, 290]
1762B90n39J39Lp5j3j08O83Q1p78P2L16k01j12K83R7j91oK62j29n99L92N43m06
1785Dl72O08k51j30O6n5J50k57L32M49n15m28M11P7l94K80p1J68l3q9K01l92n
1808b46L78M2k86J97r4K07r9m77M38K2j94K75J65n85o0M40L5k46j70L98M3l22
1830a39j7J68l09J36M65l8l82Q7J43j81k36O7L62j19L3K21k69l20M13MK7j05k
1853IL08j53l55J20J93k25N5J10O3l35J18J73k2m42L45M41m56K4J52k83k55L60
1875e5L87l33l27L69J13k57j28K66j76OM55r1j76k23L27K5l05k8L16J12l84JP4
1898c2j02K5K65k5r1j76L94j15m72K93K45K4j30m6n9Jk32L70%m98K84M45k49l72
1922b53J05K27p0m9N3K39k58j64N91m74k51K68K17k66M9J19M5k27j75N77k61j59
$$ y = [290, -249, -110, -107, -182, -195, -303, 380, 461, -317, -245, 71, -130, -242, 41, 138, -53, -59, 203, 74, -525, -133, 410, 4, -368, 240, -11, -141, -75, -130, 20, -237, 95, 544, 29, -399, 12, 89, -305, -25, -96, 72, 39, -50, 151, -241, -246, 132, 174, -112, 85, -9, 198, 99, -378, 60, 82, -112, 163, 328, -257, -317, 123, 158, -88, -258, 140, 183, -139, -156, 12, -297, -161, 304, 266, -116, -29, 114, -67, -303, -236, 126, 7, 40, 261, -8, -328, 85, 89, 116, 11, 9, 317, 164, -191, -71, 122, -103, -48, 62, 125, -210, -92, 81, 59, -383, -38, 403, -53, -29, 123, -160, -415, -55, 332, -1, -328, 41, 154, -103, -231, 35, -141, -135, 320, 229, 53, -170, 157, 182, -123, -151, 165, 277, -107, -106, -32, -134, -109, 156, 131, 40, -136, 258, 143, -329, -36, 209, 233, 103, 57, -2, -1, -233, 137, 137, -361, -77, 368, 119, -253, -148, 79, 9, -40, 13, 252, -6, -170, 421, -53, -304, -36, 181, -85, -36, 83, 128, -99, -274, 303, 42, -117]
1944a17K08Q7k07k12K76M4k01O3K36r2k99K29n0k55kL37J31q1j74J43R0m16J84
1967g8J64p3r0K34M3k82k33L99J71m17O4L57k12k42L55r3l30J40L73O2l71RK12
1990A62j76l5P7J34k60O4L08j96m00N4M52l0l56L76k66K4j64O9J30j95K06J86
2012A64M3n02J21L04j97r1J88J54l01lJ90q6k12J59L59l86j06J84J30k70j7J96
2034B1j07j43K83K02l80o5K62J1k03r7L06P4l74Q8K20l68m0M35j11M8k47K59K13
2057B87l65j52K66J24l12J85n2j39l24O03K06n88j33O24q1l95J72M9j21K4M23
2078C01k06k15j51N99k61n67K01L75o2R5k31p8mJ61J26l6k56J65J48l5l25J49
2100a07K13k18N6L4P4m94K82R3r0k57M00K08p1m48K09r5Q0r4N70n00k22O39K0
$$ y = [-117, 91, 178, -29, -241, 35, 79, -122, -59, 177, 85, -214, 15, -35, -290, -292, 45, 176, 95, -79, 64, 154, -262, -78, 86, 13, -77, 157, 200, -82, -315, 84, 255, -162, -98, 259, 47, -195, 160, 67, -263, -123, 250, 312, -59, -50, 162, -14, -49, 28, 162, -98, -34, 274, 78, -322, -268, 184, 154, -202, 174, -92, -68, -232, -163, -33, -228, -22, 164, 207, -295, -174, 130, -67, -158, 30, 184, -117, -120, 70, -16, -228, -69, 290, -96, -202, -18, 112, -158, -175, 21, -86, -229, 54, 256, -124, -189, 73, 84, -119, -216, 90, 164, -210, -122, 98, -270, -310, 125, 14, 62, -185, 74, 287, -78, -230, 36, 160, -152, 33, -19, -158, -482, 121, 327, -261, -394, 230, 149, -246, -74, -25, -146, -122, 301, 95, -120, -271, 328, 67, -500, -299, 76, 14, 109, -122, -200, -204, -43, 83, 47, -209, -44, 104, 69, -256, -107, 106, -112, -56, -22, 52, -442, -160, -67, -157, -414, -14, 194, 123, -325, -116, -211, -131, -225, 345, -155, -377, 262, 282]
2123B82n52K7P6K21o6j22K89j67k83K56R3m21K00M53p0j79l33K20p4J57R0J84
2145B81o95L32K91l09p4p1J43K35k49J96J1j35j61J50J41j96Q0J92m6m23Q8L99
2167A80k06j13K37k3l18J50pJ14l31K43L90n39Q0J09J83l87J58J14j10m9L90k23
2189D2j36k87L72J59j85j09M09m94J01J57j69J96l03L24K53m09l23M03L04l17
2209a2q1K21k36K06q4Q2l05j03O00j58l46K05J0Q4k52O1L65m33O0K65mm98Q1M02
2233A30q4j38l4J47pl5J75m1m61K35M30k81l8K41k48m1n3n8K89k40J77K23l16
2256b8j42Q6J25j39j41J27J33Pk6L8j93j29N72R6m31k17L93L2l41k6M21j21r1
2279EK62Jm93J96K23m1k89J17Q9L01m19J22l3j82K25KO6k78j28K70Q2l25nM85
$$ y = [282, -270, -243, -167, 54, -12, -134, 155, -12, -295, -39, 54, -367, -167, 286, 216, 37, -296, -76, -150, 7, 97, 281, -414, -82, 209, -100, -174, -245, -102, 133, -116, 80, 91, -44, -205, -55, 86, -110, -30, 162, 116, -307, -219, 180, -26, -139, 98, 75, -243, -93, -100, 14, -317, -74, 316, -223, -143, -34, 149, -238, -80, 34, -76, -125, 265, 42, -94, -381, -9, 150, -35, -144, 265, -229, -128, 29, -140, 56, -247, 77, 330, -79, -402, 1, 305, -12, -93, 128, -108, 98, 14, 96, -209, -312, 288, 130, -216, -11, -1, 83, -169, -108, 257, -176, -116, 149, 145, -353, -272, 130, 46, -92, -126, 21, 14, -21, 154, 113, -348, -113, 317, 36, -2, 239, -9, -50, -103, -161, 128, -112, 65, 288, -28, -170, -84, 41, -98, -239, -112, 21, 28, 2, 40, -153, -282, 290, 386, -45, -262, 131, 163, -178, -204, 217, 96, 5, 267, 268, -225, -29, 194, 153, -136, -19, 70, 371, -48, 74, 41, -141, 84, 86, 152, -126, -254, 16, 98, -227, -232, 253]
2303B53k3l24L2O7k28K17j2K37n32K71M53k88l37K43m7j18K46K22l03k08J72R
2325Bj42K9J11K64k36j00p6P3k0J21K44k21k5J26J69k91k70L82M1j15N5j81j8
2348g8l2K04L9l02Q3L80j61k60r8K19J02K0j80L93k02k61L43j01k53J39K13j07
2370A00n6j66K91j11o5J43O7m36L17L04l93j94LK85j28J35l1J49m22K56J12l39
2392a79l9Q7M28r9k41l4K06j60j30K23k6j86K54K79l96k78K38M44l14p8M8j36
2414h9j99J63J96l16Q6J35K95m18j92M16Q0j95J88j9k23J20J03r0k53M9L91k8
2436B00l59K67oj62r3Q8PJ7r0J31J17j08j19J27J1j51Q4Q8l2o4J14J38k97k82
2460c74O77n2m08RL69j15l98K69J26j20m4K16k43j82K58J46j57k64M69j04l9j00
$$ y = [253, 230, -94, -62, 5, -223, -6, -18, 219, -313, -42, 411, 123, -214, 29, -18, -136, 110, 332, 29, -179, -7, 2, -140, -111, 0, 264, 28, -72, -148, -75, -95, 26, 270, 49, 24, 150, 319, 28, -242, 140, 181, 66, 121, -60, -78, -110, 94, 133, -169, -86, 294, 133, -127, -225, -6, 96, 116, -64, 329, 127, -134, 209, 108, -145, -6, 207, 100, 44, -122, 169, 58, -7, 136, 203, -233, 84, 388, -5, -199, -196, 89, -39, 96, 65, 214, -208, 48, 160, -179, -218, -131, 297, 198, -43, -77, 129, -31, -161, 62, 36, -150, 104, 383, -13, -291, -53, 391, 77, -1, 47, -89, -288, -125, 71, -245, -159, -24, 271, -147, -339, 77, 157, -38, 150, 131, -92, 28, 131, 41, -212, -163, 228, 200, -159, 108, 102, -60, -153, -65, -58, -41, -131, 0, 117, 9, -110, 17, 28, -123, -39, 49, 17, -47, 67, 205, -92, -374, 303, 251, -157, -148, 221, 106, -292, -23, 103, -17, -61, 155, -88, -270, -12, 134, -23, -287, 182, 78, 39, -61]
2482f1j79O8q8L82K9k64p2J38J39k08m8J83K16j72j52O5l6j11J44L5m1n8M9L11
2506B69k94j22Q5j94kM46m8k94k36M46l6j43k09M13j08n2o9K36m43L84K39l68
2528a00q6M9K06m1j65j18K72p5o6K11P6l92J68J48K5l55J83K81k82j00R6R1m0
2551a4PJ67l00j34M45m0l25L0N8L75r9j31n3P2m9L6N0k61j99O39J15o45K3L69
2575A36k37P8J0P1k94J8M00j50k84n7L76J6m1R7j21j28L7K2O5q9M7K25j56j70
2599a29r8J55L3j48J64N1l62K58J50j14j90J95O8Q6l02Q7R6k99J67K87j74k90
2621c09L19P6k06k10L44J7L5j42J95j19R4j28J10k27j33M37Q9j66l94K51K56k89
2643a00k3J54j5J0k03J88j53mK30m8j29pO5J57l23L04J17j21l00L57q3k79l0L06
$$ y = [-61, -240, -172, -260, 122, 151, -113, -185, -47, 92, -116, -164, 19, 235, 63, -89, -24, -60, -171, -27, 8, -33, -91, -42, 269, -25, -147, -62, -256, -258, 188, 140, -154, -390, 56, 20, -123, -332, 81, -27, -79, -148, 88, -355, 29, 268, -100, -186, -137, 69, 28, -137, -255, 17, -58, -124, 87, 163, -229, -61, 87, 112, -243, -60, 221, -61, -161, -65, 26, -14, -7, 160, -140, -274, 171, 131, -194, -164, -106, 269, 170, 39, -14, 58, 9, 45, 95, -166, -365, 274, 389, -256, -233, 136, -101, -23, -13, 58, -236, -218, 182, 32, -252, -309, 67, 83, 42, 139, 18, -110, -73, -51, 14, -75, -28, 197, 41, -129, -227, -72, -39, -187, -23, 28, -334, -76, 74, -40, -230, -35, 33, 119, -183, -96, 0, -299, -132, 155, -19, -309, 10, 86, -120, -330, 14, 31, 66, -76, 119, 0, 94, -34, 76, -151, -284, 153, 242, 76, -318, -67, 189, -100, -123, 31, 16, 26, -177, 11, -142, -146, 84, 36, -93, -100, -35, 122, -201, 103, 220, 99, -201, 156, 73, -206, -236, 70]
2667G0n2j50J27K37m33J88J45k98j61M47J59k51k73J58J83j25m1J3J34k01J23
2688aK10l51j67L00O8k0k43O6K06o8q5J60m2j66K52P3k38j25J49J65j19j80J47
2711iJ49j06P9l9q8j68K79J32l38k5L48o4j65j43Q6K35j08J82L8l84J3K37J76
2734C17m83J73K35k16m8N1k8k1q0L14r1k03J14J62j15l66K91K4K05o9k90L86k09
2757E3j46K87j46j93K02J18j8l47K67N6p0j0J13p6k10K65J90l92o0J25K08j99
2779A7o5j8K01k57K70L3k39L6K85j06k04o9o6M99k68j3P4k25R8J58J04k03j65
2802a23K90k0j13q1J24k47K01J0Q1j8j74K72n3l93N6J68O7k38M08j09j88RJ75
2825A04j33p0K21K42j08l22J84j03k6P2o7j25J49J94k05N6q3p4M77k98J7o8N6
$$ y = [70, 18, -132, -5, 232, -201, -13, 132, -166, -327, 120, 279, 28, -245, -87, 96, -29, -70, -57, 77, -124, -1, 209, -142, -309, -9, 59, 39, -204, -138, 68, 0, -85, 75, 33, -133, 119, 192, -46, -171, -22, 143, 24, -156, -9, 140, 34, 113, 74, -14, -182, 97, 229, -109, -134, 214, 150, -15, -158, -72, 163, 55, 237, 275, -109, -96, 141, 317, -166, 7, 242, 26, -22, 29, 1, -20, -100, 214, 123, -80, 34, 196, 81, -285, 6, 30, 235, 166, -124, 262, 53, -93, 194, 48, -145, 57, 175, 157, -190, 77, 133, 63, 53, 166, 90, -120, 145, 335, -57, -117, 8, 216, 17, -48, -66, 135, -122, 148, 181, -58, -22, 263, 157, -47, -116, -182, 317, 49, 36, 110, -115, -17, 141, 245, 42, -123, 167, 147, 34, -47, 77, -170, 31, 41, 122, 104, -70, 202, 149, -244, -188, -20, 47, -191, 217, 108, -80, -71, 104, -29, -99, 122, 364, 256, -66, 118, 15, -11, 61, -6, -131, 18, 212, 7, 63, -20, -94, 383, 85, 102, 34, 90]
2848I0j47L3J92p7j15R6L41l64l76M71J20l46R7J89j63J1r3R5n1k32M34Pj24k0
2872F8l0r7%O1j01j6L6J92J8l03j1K02j24J69k6n7J59nk97K43j69J08J61j09j89
2897a17j56M47K1k39j64L05n7j68K52k97J1K05K25pl41N3M8P2k03K06o7j86K47
2920I0l7j20j51J05J5R6j46J01J64o5r9J41l06K2K37K20k59j59J84M8l8j91L1
2943a17J90j25J77o3k83L0L33M5k65j54L04j7j38J40n1k55K56J53j50k71J29L06
2965A74j73j67J17J49j83J51q6k13J68J10J56j00m13K26K11j40q7L0R5j68Q7J26
2987G0J8j24k6R8o8o1R0K13j95n9L0L2j04P4K32l68j45L23P9j88M8j38K04l7n9
3012f1J14Oj68K38j8k57k0K61j15k77L22r8J7j54J53J05k63R6K10k54M1r5R5J41
$$ y = [90, -57, -24, 168, 91, -24, 72, 413, 49, -327, 144, 264, -82, 15, 204, 41, 52, -41, 54, 3, -229, 205, 212, 88, 68, 38, -59, -59, 2, -99, -115, -79, 113, 131, -172, -183, 19, -105, 64, 38, -19, 140, 135, -162, 81, -88, 20, 181, 72, -117, -273, 174, 195, -44, -208, 97, 40, -128, 124, -173, -162, 43, 268, 261, -80, -27, 21, 93, -110, 96, 29, -157, 90, 53, -67, -218, -113, -98, -2, -148, -47, 117, 52, -47, 94, -212, -190, 47, 267, 8, -151, 33, 81, 43, -148, -117, 73, -52, 125, 62, -221, -191, 142, 187, -78, -232, 72, 55, -83, 57, 6, -249, 7, 160, 10, -261, -132, 174, 1, -166, -49, 100, -83, 68, -18, -231, -63, 47, 203, 103, -310, -84, 127, -13, -100, -70, 25, -143, -56, 70, 88, -36, -62, 36, -32, -93, -3, 210, 15, -44, -14, 18, -86, -12, 220, -148, -293, 30, 109, -79, -31, -169, 35, -2, -61, 53, 59, -109, 129, 111, -146, -166, 95, -20, -297, 25, -73, -56, -210, -57, 48, -215, -119, 91, -163, -122, -217, -122, 19]
3036A9m2j89K30L7k25L26k27qP2K05k95r2L2J67k8k70K69O9j25O4J05p7j63J05
3060d1K42m02N3J33JQ1r2j63P0J52L7R6k51mJ52j26J53j43N9o6J21k24J63k7j88
3085b14J97K83j46m29K91J71j91j29K69j0j45J50j22k39K10p5L49j42k24J44J83
3106A81k49J04j08j2N1M1K0j34JJ20j9j46J93J06j56j54L26l18J51n4J09o4k98
3129c09K17J00K53j51j41N3n4j04L57j09k81P0K54j38j33K59q3J5k43K31l26M7
3151b16K96M3J5j75J58J50k83p5J49p9nJ57M4k11N5L5K8k73J46J52P3k03q5Q2
3175b2r2P0O5J24k97L4K65k5j88L2J05j17R4%J2j04R8n9Q7j52L8K92j87m6r4J82
3201A15p6KJ21p8m09M68M8m40K00J87ko1k54J52j25J60Q3j8q9j56K68N1k27Q8
$$ y = [19, -23, -212, 18, 55, -170, 156, -71, -79, -7, 198, -97, -189, -157, 10, -18, -288, -19, 50, -75, -11, 94, 17, -146, -41, 201, -201, -148, -15, -14, 67, -25, -188, -118, 34, 71, 167, -84, -88, 64, -62, 91, -52, 7, -59, 62, -162, 1, -26, -214, -17, 266, 120, -309, -18, 153, -38, -167, 102, 92, -53, 97, -25, -264, -54, -129, 220, 78, -146, -2, 181, -68, 36, -72, -84, -33, 8, 28, -106, -105, 15, -4, -150, 43, 149, -7, -161, 165, -153, -2, -56, 53, -11, -309, -92, 8, 261, 110, -31, 22, -32, -136, 221, 112, -169, -99, 155, 17, -116, 143, 60, 75, -168, 63, -263, -216, 80, 123, 138, -37, 121, 271, -12, -87, 62, -17, -22, 135, 179, -32, 23, 58, 86, -187, -41, 111, 184, -19, -104, -22, -114, -44, 21, 145, -152, -118, 147, 122, -66, -34, 71, -46, 48, 48, 60, -44, 54, -5, 82, -70, -32, 260, 73, 27, -67, 115, 39, 41, 162, 84, -325, 143, 191, -249, -49, 138, 136, 75, -179, -27, -152, 8, 91, 73, -16, -172, 96, 147, -80, 8]
3225HO9J18k2n8j79O9N7J05K5j93qN0pj54J33j6N4p2K06j55J8j71J93M1j67p1
3251a27L65r2k37K89j13o4l4M2L2j42J9K48Qk10QJ28Ln7q3k8J36l2Q7k26p9L24
3277A65nr6j98J99J28jO6k21Kl1j4K19l90J1K08R6O8k53n7R0N5M9m3j78O8K6J1
3304b6N6k77L25p0P6q6O9J89k98L34j06k55J23K8K1j66O4K23ql77J24R4j64J48
3328D1rK2jj14R8j92K74p1j23K56k53J63j38J8J05N6p1j84J90PJ1j63J53R5l1
3353A39j55j84K24k45K30P7l9j05J82j01j17N2J83j78o0J09O8k8O2J7rk01K8n5
3377a06K19j01J73p3k00Q6J53q5k18K72p0J42k49r9J53k4O9L0j29j05K02P7p4
3400D3k48K47L8q1Q4j04Pl5K49j23j06m5J69N9k56JM2J37r2J64j16P6k58K00P
$$ y = [8, 77, 195, 173, 115, -64, 5, 62, 167, 192, -1, -9, 41, 34, -120, 13, -3, 51, -21, 185, 30, 48, -123, 70, 111, -56, -127, 238, 146, -91, 198, 85, 21, -13, 29, 61, -81, -62, 186, 194, -16, -8, 120, 123, 66, -17, -45, 91, 59, 146, -80, -159, 165, 160, 64, -134, 65, 193, 192, 258, 37, 39, 8, -6, 213, -177, -166, 42, 138, 206, -47, -104, -14, 41, 90, 47, -131, -63, -37, -26, 30, -247, 78, 8, 84, -2, 67, 256, -42, 292, 186, -69, 54, 82, 103, -63, 1, 224, 216, -161, -37, 57, -107, 41, 32, 54, 53, -61, 37, -155, 119, 48, -75, 181, -72, 91, -47, -29, 76, 132, 61, -123, 67, 74, 85, -78, 75, 170, 139, -16, -200, 24, -221, 9, 86, 47, -58, 124, 23, -94, -42, 141, -37, -97, 12, 80, 52, 114, 131, 122, -79, -51, -106, 113, 12, 185, 112, -88, -2, 151, 66, -152, 120, 50, 192, -57, -156, -3, -27, 42, 72, -57, -162, 40, 117, 43, -205, 42, 80, -1, 83, -21, -14, -49, 200, 77, -29, -74, 95, 154, -102, -101, -59, 78, -14, 150, 34, 110, -148, 52, 59]
3425E9J5k77J77J20p7m5qO5j19KJ49K7j90L5K52k70j32K84O2j52j9l5k4q0J67
3450a4o4l5J97O5m3P3k45K2M2J21j45oj2%J25j37p0J40j60J19K60k93J63j57M8
3475fP3j62p6K69k2j45j7J2J06P9j62J24k0j86K82j45q7n9L2R7O2J14k89J32j1
3500eo8J79j29K3N8l3N9j86J65Pj14j11Q8J43r8M8n9M9J8j20J47n7r6J44l2j56
3526a36J21n3K20q0P2pk11N1J22k3j86j7O4J50k31J95q1N9R3j03l7j2j42J81m5
3551c6l9J5L5J5K2L9p0j40K38n0j28J4J91j24J46k17nO8P9k36K34j17nJ46j82
3576a07n4K4K18lq5n1K7J60q4j7Nl1P5k90K21k7j63J85J4l6K5P8j95Q8J01j3j16
3603e1Nk7R2k35J89j72J93jQ5o2r8J00J80j81j2o7Q5J06j43R3m9Q9p6L8M1j59
$$ y = [59, 74, -203, -26, 94, 17, -28, -36, 29, -90, -88, 61, 88, -102, -67, 185, -85, -217, 67, 129, -23, -42, -77, -101, -181, -14, -78, -113, 84, 149, 106, 179, -66, -44, -2, 119, -26, -32, -44, -44, 81, -56, -126, 14, -146, -27, 233, -60, 103, -54, -6, 67, -95, -171, 98, 76, -69, -86, -74, 32, 111, -51, 73, 53, -133, 149, 4, -83, -142, -110, -13, 49, 163, -126, 6, -5, -73, 106, -23, 0, 58, 25, 84, -102, 63, 70, -44, -155, -67, 76, -22, 26, -33, 16, 34, -86, 61, 4, -92, 52, 20, -136, -15, -68, 152, 72, 144, 137, -74, -23, 99, 76, -110, -127, -63, 87, -144, 51, -30, 29, 122, 19, -18, -30, -172, 9, -36, -75, -60, -25, -10, 12, 51, -19, -159, 79, 29, -99, -85, 106, -18, 128, -89, -94, -26, 53, -183, 51, -66, -71, 75, -107, -161, -137, 81, 78, -7, -58, -31, 129, 45, 28, 33, 2, 77, -213, 8, -19, -182, 3, 17, -19, 6, 84, -111, -23, 78, 65, -51, -46, -73, 19, -216, -27, -199, -6, -7, 78, 16, -82, 18, 198, 17, 5, -62, 23, 129, -14, 79, 30, 119, 43, 81, 122, -37]
3629c7j6O9J2p7J13n3N5K8j36N1r9L0K75q1k52M7J95j50j68J73Q6p0pO4j04j1
3655f3J51o7k5m0K17n6k33J20r4RJ07p2K17k58m3pJ68j28o1R0Q6rm3J11O3j07
3681C3n3J22k20Q4K05j24q2k9P7l7M0J20%k55n5K30p1l2l4M4j8J84j43o8j1K04
3707A11j59L0J10p1M0J1K9j87J00Q4j39k8P2r4J16r2O8j26J21l3j18MJ02j8K69
3732B02l15J71r2L3P9Q8k57K44o0k05l8L2J71J3q2R0j34j25K31m2O9o3O1K6j02
3757eo4J88r5N3o2J09m0k21Q4Q1o6k7OJ14j3M5j32m2j47J04J24NL4k3J07o1m0
3784A6J19k04P1p6J15o4o0J89M3q9j31L9MKr2K17p3m1K9J00k39J84Q3n2k53J59
3810dl5J56k08J08j03J33N7oq6j49K08K6l1m8MJ0r6J48M2j50Q8j83K29l37Q9M6
$$ y = [-37, -53, 16, 28, -49, 64, 11, 66, 94, -42, 9, -90, -60, 215, 134, -118, -71, 124, -26, -194, -21, 65, -5, -12, 52, -52, -63, 88, 21, -4, -44, 173, 117, -116, 4, -90, -81, 26, -46, 171, -87, -130, -137, 31, -97, -158, -68, 18, 9, -34, 77, 140, 33, -20, 102, -118, -34, 171, 47, -35, -64, 13, -24, 16, 136, 136, -119, -174, 56, -15, -47, -81, -37, -55, 129, -14, -82, -93, 111, -48, -18, 92, 21, 61, 72, 101, -86, 14, 98, -41, -69, 3, -91, 25, -67, 1, -125, -4, -37, -155, -151, -49, -67, 202, -113, 58, -34, -1, 78, 166, -91, 153, 93, -112, -150, -118, 53, 66, -16, 74, -60, -185, 46, 4, 73, 10, 71, 97, -5, -69, 119, 24, 77, 15, 124, 84, -137, -53, 28, -38, -65, -59, 55, 42, 87, -45, -87, -234, -130, -6, -1, 33, 10, 117, 56, 16, 135, -69, 2, -74, 41, -23, -83, 106, 149, 60, -71, -32, -28, -26, -118, 99, 26, -15, 14, 114, -125, 59, 142, 90, -163, -4, -39, 117, -91, 17, -86, 47, 104, 98, 12, -137, 71, 97, 66, 18, 22, 32, -64, 84, 126, -24, 64, -119, 110, -227, -138, -92]
3836i2J63j13J43j39J08o1l2J05Q2j11j29J36j09j40K11J62j71MN6o8J5j37J30
3859A3K5q5Q3r3Q0n6q3J88k3m0L0n0PJ7j22P3j0J32o3L7j97J79r4K58k38J70k27
3886h9N1J16R8k99M5J61L3j82J18j42J1J40J3P1j32M9o2K5j99O4q6K29j4j62j5
3911a58R3J19l8j06J27j38L8J60p4j19P5J09n9o2J57k06Q4J10M3j69k45L09m9
3934AR3k16P0M9L9k31P1Q5Q8J05j38l2j34K1O3j0q5J36j90J95J78j09j79J24K17
3959B11k01m3lJ04l9j79J17j23K22qr5K39l80J19J37k2l1j20R2n0J75j83p6K85
3983A48o7j2j49m7K48m8j99K92l27Q7J19J2J4n2j19J47j61O1J86k6n3j67Q0j87
4007b20K14L9q8NM5J24R0j57m1L4j14q1M9J34o1J48j37J83j61M6JJ9k23J95j23
$$ y = [-92, 71, -42, 101, -38, 70, 9, -23, 82, 164, 53, -76, 60, -49, -189, 22, 184, 13, 17, 73, 5, 20, -117, 13, 38, -47, 36, -57, 23, -33, -116, 72, 49, 9, 39, -11, -4, 13, -109, -36, -46, 86, 23, 60, -137, 42, -52, 206, -32, 138, -89, -38, 78, 176, -123, -78, 83, 116, -66, 52, -90, -79, 61, 74, 145, 13, 62, 0, 25, -174, -110, -196, 33, 19, -143, -158, -65, 54, 16, -90, 37, -101, -63, 97, 23, -96, -21, 88, 29, -33, 124, -82, 2, 112, 155, -14, -259, 50, 1, 94, -122, -52, -3, 36, -195, -124, -39, 49, 154, 16, -16, -150, -129, -66, -76, -161, -25, -215, -20, 158, 49, -130, -6, 211, 10, -33, -36, 68, 29, -150, -33, -156, 66, 58, -37, 202, -178, -59, 78, 56, 25, -95, -3, -53, 122, -61, -137, 148, 81, 69, -80, -127, 121, 73, -126, 166, -161, -74, 45, 57, 71, 19, -100, 47, -114, -53, 133, 107, 54, -113, -33, -220, -6, 33, -55, -50, -5, 119, 209, 52, 11, 45, -69, -150, -101, 33, -28, 120, -17, 166, 5, 51, 52, 71, -152, 43, -80]
4032h0J34R8q0J39l79O0O4J08n0j40K25l4j55J18J6Nn2M7j65J31K7P6k07O9J51
4057A26j99K20j81J68j6j59L7M1j15J69r6L1p1J62j01q9J20j86J60j47J37MJ25
$$ y = [-80, 54, 152, 72, 211, -168, -108, -44, 64, 14, -126, 99, 65, -90, 28, 44, 49, -3, 44, -121, 10, 37, 113, -94, -25, 126, -73, 147, -34, 134, 118, -41, -4, 37, -78, 91, -5, 26, -45, 117, 16, -73, 47, -139, 21, -126, 11, 15, 140]
$$ [...]
8191B3
##END NTUPLES=NMR FID
##END=
