##TITLE=1H_LR-759-K3M
 CCl4
 8 sc, 
 22.3.2023
##JCAMPDX= 6.0         $$ Bruker NMR JCAMP-DX V2.0
##DATA TYPE= NMR FID
##DATA CLASS= NTUPLES
##ORIGIN= UXNMR, Bruker Analytische Messtechnik GmbH
##OWNER= root
$$ XWIN-NMR		Version 3.5
$$ Wed Mar 22 14:15:30 2023 Russian Standard Time (UT+4h)  she@DPX200
##.OBSERVE FREQUENCY= 200.13135
##.OBSERVE NUCLEUS= ^1H
##.DELAY= (6, 6)
##.ACQUISITION MODE= SIMULTANEOUS
##.ACQUISITION SCHEME= undefined
##.AVERAGES= 8
##.DIGITISER RES= 18
##SPECTROMETER/DATA SYSTEM= spect
##.PULSE SEQUENCE= zg30
##.SOLVENT NAME= CD3CN
##.SHIFT REFERENCE= (INTERNAL, CD3CN, 0, 15.7039)
##AUDIT TRAIL= $$ (NUMBER, WHEN, WHO, WHERE, WHAT)
$$ ##TITLE= Audit trail, XWIN-NMR		Version 3.5
$$ ##JCAMPDX= 5.01
$$ ##ORIGIN= Bruker BioSpin GmbH
$$ ##OWNER= she
$$ F:/spectra/data/she/nmr/H-F/1/audita.txt
$$ ##AUDIT TRAIL=  $$ (NUMBER, WHEN, WHO, WHERE, WHAT)
(   1,<2023-03-22 14:13:28.62 +0400>,<she>,<DPX200>,
      <created by zg, POWCHK disabled, PULCHK disabled
       configuration hash MD5:
       00 E9 B6 7A A2 85 ED C7 34 08 36 98 17 FE 4E 26
       data hash MD5: 16K
       30 27 4E 0F 9D DC CF 2D 50 2E D4 28 51 B9 89 AA>)
$$ ##END=
$$ 
$$ hash MD5
$$ B3 1A D0 61 28 69 FD 87 0D 49 06 8E 75 36 5E EF
##$RELAX= 
##$RELAX= 
##$RELAX= 
##$RELAX= 
##$RELAX= 
##$RELAX= 
$$ Bruker specific parameters
$$ --------------------------
##$DU= <F:/spectra>
##$EXPNO= 1
##$NAME= <H-F>
##$PROCNO= 1
##$TYPE= <nmr>
##$USER= <she>
##$AMP= (0..31)
100 100 100 100 100 100 100 100 100 100 100 100 100 100 100 100 100 100 
100 100 100 100 100 100 100 100 100 100 100 100 100 100 
##$AQSEQ= 0
##$AQ_mod= 1
##$AUNM= <au_zg>
##$AUTOPOS= <>
##$BF1= 200.13
##$BF2= 200.13
##$BF3= 200.13
##$BF4= 200.13
##$BF5= 200.13
##$BF6= 200.13
##$BF7= 200.13
##$BF8= 200.13
##$BYTORDA= 1
##$CFDGTYP= 0
##$CFRGTYP= 5
##$CHEMSTR= <none>
##$CNST= (0..31)
1 1 145 1 1 1 1 1 1 1 1 1 1 1 1 1 1 1 1 1 1 1 1 1 1 1 1 1 1 1 1 1 
##$CPDPRG= <>
##$CPDPRG1= <>
##$CPDPRG2= <>
##$CPDPRG3= <>
##$CPDPRG4= <mlev>
##$CPDPRG5= <mlev>
##$CPDPRG6= <mlev>
##$CPDPRG7= <mlev>
##$CPDPRG8= <mlev>
##$CPDPRGB= <>
##$CPDPRGT= <>
##$D= (0..31)
0 1.2 0 0 0 0 0 0 0 0.06 0 0.03 0 0 0 0 0.0002 0 0 0 0 0 0 0 0 0 0 0 0 
0 0 0 
##$DATE= 1679480008
##$DBL= (0..7)
120 120 120 120 120 120 120 120 
##$DBP= (0..7)
150 150 150 150 150 150 150 150 
##$DBP07= 0
##$DBPNAM0= <>
##$DBPNAM1= <>
##$DBPNAM2= <>
##$DBPNAM3= <>
##$DBPNAM4= <>
##$DBPNAM5= <>
##$DBPNAM6= <>
##$DBPNAM7= <>
##$DBPOAL= (0..7)
0.5 0.5 0.5 0.5 0.5 0.5 0.5 0.5 
##$DBPOFFS= (0..7)
0 0 0 0 0 0 0 0 
##$DE= 6
##$DECBNUC= <off>
##$DECIM= 32
##$DECNUC= <off>
##$DECSTAT= 4
##$DIGMOD= 1
##$DIGTYP= 9
##$DL= (0..7)
0 120 120 120 120 120 120 120 
##$DP= (0..7)
150 150 150 150 150 150 150 150 
##$DP07= 0
##$DPNAME0= <>
##$DPNAME1= <>
##$DPNAME2= <>
##$DPNAME3= <>
##$DPNAME4= <>
##$DPNAME5= <>
##$DPNAME6= <>
##$DPNAME7= <>
##$DPOAL= (0..7)
0.5 0.5 0.5 0.5 0.5 0.5 0.5 0.5 
##$DPOFFS= (0..7)
0 0 0 0 0 0 0 0 
##$DQDMODE= 0
##$DR= 18
##$DS= 0
##$DSLIST= <SSSSSSSSSSSSSSS>
$$ [...]
##$SUBNAM2= <"">
##$SUBNAM3= <"">
##$SUBNAM4= <"">
##$SUBNAM5= <"">
##$SUBNAM6= <"">
##$SUBNAM7= <"">
##$SUBNAM8= <"">
##$SUBNAM9= <"">
##$SW= 18.05172834244
##$SWIBOX= (0..15)
0 0 2 0 0 0 0 0 0 0 0 0 0 0 0 0 
##$SW_h= 3612.71676300578
##$TD= 16384
##$TD0= 1
##$TE= 0
##$TE2= 300
##$TE3= 300
##$TEG= 300
##$TL= (0..7)
0 120 120 120 120 120 120 120 
##$TP= (0..7)
150 150 150 150 150 150 150 150 
##$TP07= 0
##$TPNAME0= <>
##$TPNAME1= <>
##$TPNAME2= <>
##$TPNAME3= <>
##$TPNAME4= <>
##$TPNAME5= <>
##$TPNAME6= <>
##$TPNAME7= <>
##$TPOAL= (0..7)
0.5 0.5 0.5 0.5 0.5 0.5 0.5 0.5 
##$TPOFFS= (0..7)
0 0 0 0 0 0 0 0 
##$TUNHIN= 0
##$TUNHOUT= 0
##$TUNXOUT= 0
##$USERA1= <user>
##$USERA2= <user>
##$USERA3= <user>
##$USERA4= <user>
##$USERA5= <user>
##$V9= 5
##$VALIST= <valist>
##$VCLIST= <CCCCCCCCCCCCCCC>
##$VD= 0
##$VDLIST= <DDDDDDDDDDDDDDD>
##$VPLIST= <PPPPPPPPPPPPPPP>
##$VTLIST= <TTTTTTTTTTTTTTT>
##$WBST= 1024
##$WBSW= 4
##$XGAIN= (0..3)
0 0 0 0 
##$XL= 0
##$YL= 0
##$YMAX_a= 251851
##$YMIN_a= -410601
##$ZGOPTNS= <>
##$ZL1= 120
##$ZL2= 120
##$ZL3= 120
##$ZL4= 120
##$ABSF1= 10
##$ABSF2= 0
##$ABSG= 5
##$ABSL= 3
##$ALPHA= 0
##$AQORDER= 0
##$ASSFAC= 0
##$ASSFACI= 0
##$ASSFACX= 0
##$ASSWID= 0
##$AUNMP= <proc_1d>
##$AZFE= 0.1
##$AZFW= 0.1
##$BCFW= 1
##$BC_mod= 2
##$BYTORDP= 1
##$COROFFS= 0
##$CY= 11.3945322036743
##$DATMOD= 1
##$DC= 2
##$DFILT= <>
##$DTYPP= 0
##$F1P= 2.36226072786647
##$F2P= -0.459571619588291
##$FCOR= 0.5
##$FTSIZE= 0
##$FT_mod= 4
##$GAMMA= 1
##$GB= 0.15
##$INTBC= 1
##$INTSCL= 1
##$ISEN= 128
##$LB= 0.24
##$LEV0= 0
##$LPBIN= 0
##$MAXI= 10000
##$MC2= 0
##$MEAN= 0
##$ME_mod= 0
##$MI= 1.114404
##$NCOEF= 0
##$NC_proc= 0
##$NLEV= 6
##$NOISF1= 3.799351
##$NOISF2= 2.8
##$NSP= 1
##$NTH_PI= 0
##$NZP= 0
##$OFFSET= 15.70392
##$PC= 1
##$PHC0= -19106.42
##$PHC1= 14.60075
##$PH_mod= 1
##$PKNL= yes
##$PPARMOD= 0
##$PSCAL= 0
##$PSIGN= 0
##$REVERSE= no
##$SF= 200.130013532006
##$SI= 16384
##$SIGF1= 3
##$SIGF2= 2
##$SINO= 400
##$SIOLD= 16384
##$SREGLST= <1H.CDCl3>
##$SSB= 0
##$STSI= 0
##$STSR= 0
##$SW_p= 3612.71676300578
##$SYMM= 0
##$S_DEV= 0
##$TDeff= 0
##$TDoff= 0
##$TI= <>
##$TILT= no
##$TM1= 0
##$TM2= 0
##$TOPLEV= 0
##$USERP1= <user>
##$USERP2= <user>
##$USERP3= <user>
##$USERP4= <user>
##$USERP5= <user>
##$WDW= 1
##$XDIM= 8192
##$YMAX_p= 0
##$YMIN_p= 0
$$ End of Bruker specific parameters
$$ ---------------------------------
##NTUPLES= NMR FID
##VAR_NAME=  TIME,          FID/REAL,        FID/IMAG
##SYMBOL=    X,             R,               I
##VAR_TYPE=  INDEPENDENT,   DEPENDENT,       DEPENDENT
##VAR_FORM=  AFFN,          ASDF,            ASDF
##VAR_DIM=   8192,          8192,            8192
##UNITS=     SECONDS,       ARBITRARY UNITS, ARBITRARY UNITS
##FACTOR=    0.0002768,     1,               1
##FIRST=     0,             0,               0
##LAST=      2.2672688,     0,               0
##MIN=       0,             -410601,         0
##MAX=       2.2672688,     251851,          0
$$ Real data points
##PAGE= N=1
##DATA TABLE= (X++(R..R)), XYDATA
0 0 0 0 0 0 0 0 0 0 -8 8 -8 8 -16 16 -24 32 -32 48 -56 64 -80 96 -112 134 -154 184 -212 246 -282 326 -374
31 -374 424 -482 546 -618 698 -783 878 -983 1096 -1218 1356 -1504 1665 -1842 2036 -2249
47 -2249 2480 -2732 3009 -3314 3650 -4023 4437 -4899 5420 -6011 6687 -7471 8388 -9482
61 -9482 10815 -12476 14617 -17491 21575 -27869 38980 -64606 251851 41509 -57910 201701
73 201701 -111116 190227 -29224 -117294 -21412 -186060 -119704 -165392 -114870 21468 -239268
84 -239268 -134485 -60922 -40356 60201 17535 100176 68176 39922 135792 106400 225445
95 225445 104910 -10757 76697 26352 57131 -23394 -42647 -3424 -189961 -82485 -73575
106 -73575 -115881 19923 -166827 -132252 7635 -32455 48404 -26835 74528 100906 -45122
117 -45122 142791 82390 71761 159669 -57011 36143 68105 -5082 49997 -79298 -16812
128 -16812 -40761 -136123 17263 -64209 -77520 -21323 -102791 -9177 9330 -5100 11931 6340
140 6340 67263 -1302 27950 93843 26818 59659 22114 3814 39812 12405 25596 -39098
152 -39098 -17808 3703 -88850 -3727 -13796 -63108 -4989 -55066 -15300 -2292 -19012 30118
164 30118 -29367 32061 39148 -37630 64919 37499 8226 49015 -5592 14958 12820 13502 13187
177 13187 -36178 12859 -25745 -49916 24898 -22875 -26232 -10905 -34945 -5983 -4973 8760
189 8760 -5862 -9097 29492 -10555 4706 38733 17925 16627 -2957 7861 6996 8187 31397
202 31397 -23636 -10536 13132 -36385 265 14054 -13509 -19197 -23993 98 -9839 8358 16853
215 16853 -32621 12442 12217 -26136 29582 24750 -5797 -5509 -5850 11042 8732 18137 329 -25122
229 -25122 9697 -1902 -10847 22026 4289 -18933 -17555 2758 10419 -646 7080 -12775 -15068
242 -15068 9456 -5492 -3589 12762 3354 -20271 -16098 19107 7348 285 13149 -14883 -4196
255 -4196 18271 1807 9445 15860 -1702 -19713 1309 26002 -5452 -7191 1064 -24126 -4554
268 -4554 5023 -14254 -926 3461 -17535 -20652 10310 18760 -4688 5123 6487 -6776 14308
281 14308 18961 6352 12966 7952 -12148 -5767 19188 6307 -16367 -8434 -9152 -15366 -5575 -2366
295 -2366 -9659 -7093 -3201 -17441 -4813 24740 5968 -6509 12026 7197 2522 16699 17886
308 17886 4585 2789 2131 -12534 3776 19150 -15701 -20520 586 -13553 -14112 2588 -4463
321 -4463 -10140 -2445 -6747 -8063 14202 18367 -4758 383 14762 1825 5076 19365 6831 -3617
335 -3617 -144 -5161 -2573 10163 51 -20058 -11538 1134 -9416 -7845 6875 -5027 -12641
348 -12641 963 -320 1003 16731 5126 -10174 5648 12185 -866 6985 15466 -4853 -10540
361 -10540 5097 54 -401 9520 -10934 -19153 5206 1778 -9631 3900 1528 -11725 -5245 5145
375 5145 1728 3737 8252 -6718 -6734 12774 4843 -1112 10504 1795 -9524 -1021 7235 4361 621
390 621 -221 -10723 -7198 9529 222 -8546 3261 -2853 -13392 1521 8576 -2541 -108 1896
404 1896 -8625 1064 13510 275 -1590 9200 -2440 -9732 9895 11061 -4466 868 -3266
417 -3266 -10926 6270 7022 -7640 -3340 8 -7667 -7037 7661 4788 -7553 323 -1273 -5527 9606
432 9606 6184 -3022 3554 3086 -4839 -781 12328 5497 -7758 -1163 -1669 -3852 7539 1468 -9342
447 -9342 -1861 -308 -8535 -93 10657 -3190 -9269 1954 -1031 -915 8781 2649 -5297 3031 2509
462 2509 -6270 8219 13529 -7993 -6354 3417 -2134 3249 6010 -4767 -7328 -221 -1467 -5021
476 -5021 7287 3901 -13561 -2899 3626 -1708 3802 2954 -2290 -1940 1252 2125 1876 9949 3803
491 3803 -10841 -135 8401 1582 1746 2211 -5688 -6433 2494 260 -2907 4260 -6169 -13841 3362
506 3362 6057 -4667 739 3481 -6603 -619 8370 735 5362 8567 -7155 -3074 10579 4230
520 4230 -814 778 -1699 -7019 -1346 3611 -3792 -2445 -2853 -11368 -2110 5899 -541 -3926 118
535 118 2352 -2844 3390 9700 1296 2577 4183 -4073 3955 10373 -437 -4137 1125 -3173 -7204
550 -7204 2819 1317 -8316 -4016 -3595 -6438 2433 4358 -5429 -2841 5883 -625 -845 9387 4539
565 4539 93 4349 399 -483 6117 4558 -4664 -2865 1892 -6414 -3089 4677 -5076 -6516 -1395
580 -1395 -4727 -1122 3849 487 -3499 324 4612 -752 2665 8476 702 -924 3259 502 837
595 837 5390 857 -6371 -1231 741 -5361 622 3060 -6970 -6003 1008 -1762 -631 5607 -2389
610 -2389 -5931 5833 1986 -2411 7768 3756 -3966 1080 2213 430 3324 4215 -4950 -4906 2736
625 2736 -1990 -1489 3663 -3697 -6701 -2070 1467 1726 282 155 -3698 -2284 5679 1582 -623 5094
641 5094 -139 -5288 2549 5802 263 1638 846 -6884 -233 5321 -1978 -665 1460 -6120 -5651 4487
657 4487 3714 -3121 -127 -2103 -4417 4921 4079 -1868 1844 1359 -3267 -418 6002 2954 -3061 620
673 620 -1376 -3448 4040 2001 -3105 -432 -1961 -4708 632 5660 -536 -5020 -305 -298 -571 4774
689 4774 1188 -3249 797 1103 -2628 2794 6095 -2559 -3618 2237 -1098 -350 3993 -434 -3682 -74
705 -74 -148 -3076 3895 4082 -6371 -2472 2778 -1291 1448 2874 -2429 -1942 1407 -133 -1511 4782
721 4782 1146 -5417 979 2253 -1691 1699 1914 -1600 -1484 406 -233 576 3410 -690 -5531 501
737 501 3029 -1441 -187 1641 -2883 -2285 2394 -909 -159 3833 -2263 -4179 3612 2059 -2094 2512
753 2512 2844 -3531 -729 3082 -1023 1960 2440 -5629 -2337 3608 -281 -1651 803 -910 -3867 43
769 43 2227 -762 1353 781 -3335 739 3875 556 -600 2445 406 -3543 1238 3639 -316 -116
785 -116 -824 -4168 171 3350 -1791 -2640 1086 -2162 -3364 3313 2196 -1862 395 -355 -1623 2842
801 2842 3769 -1529 -502 2615 -2803 -1412 4521 357 -2311 -514 -2216 -1599 2916 1008 -3207 -1242
817 -1242 532 -2208 883 3892 -1274 -1543 543 -129 1078 2824 581 -1711 536 878 -1835 1152
833 1152 2965 -1911 -2791 -72 -677 -76 2009 -871 -3669 649 724 -1216 2294 2250 -2564 -1297 2518
850 2518 354 493 2422 -1890 -2005 2294 -683 -1502 2840 105 -3805 -674 716 -427 900 905 -2563
867 -2563 -986 1761 -150 203 2565 -777 -2419 808 2120 218 405 394 -1580 -560 1321 -493
883 -493 -705 2172 -1836 -3445 1384 1616 -1237 470 -40 -2107 641 2190 -566 773 1712 -2229
899 -2229 -1383 3742 1204 -1768 1006 -497 -1999 1425 602 -1410 879 -71 -3008 -518 2667 -222
915 -222 -966 626 -626 -1071 2331 1343 -450 829 -590 -1841 1844 2743 -752 -1797 89 -592 -1311
932 -1311 1037 348 -1551 -154 -771 -2268 1883 2173 -1789 -1004 1293 -691 -156 2995 784 -1493
948 -1493 642 -331 -892 2802 1078 -3116 -204 1206 -1633 282 1577 -1688 -1071 221 -1015 36
964 36 2195 -154 -2089 597 1057 -606 1859 2021 -1302 -784 460 237 904 1262 -1250 -2426 501
981 501 1028 -1331 384 846 -2249 -737 987 -430 497 1242 -935 -1385 1910 1238 -884 1949 416
998 416 -2535 229 1471 -472 378 57 -2601 -545 1955 -637 -808 1249 -784 -1772 882 1204 -289
1015 -289 812 250 -1557 569 2268 -579 -122 1241 -1451 -1499 890 861 -209 -381 -460 -1783 460
1032 460 1854 -1116 -251 968 -1380 -663 1663 972 -740 322 148 -1691 1240 1449 -1899 443
1048 443 638 -2265 -165 2472 -106 -1108 -95 -1101 -501 2046 175 -1242 681 -249 -1263 915
1064 915 1926 -439 -929 480 -361 -116 1318 -406 -715 -56 -542 -980 859 1702 -718 -1610 656
1081 656 -366 398 1884 -604 -1006 775 5 -510 1727 950 -2089 -732 1189 -608 428 980 -1456
1098 -1456 -782 591 -557 -85 1751 -145 -2286 196 997 -20 906 357 -962 -238 963 -209
1114 -209 423 1374 -900 -1756 1016 482 -682 261 -520 -900 -489 232 -293 -132 844 -1569 -1242 1710
1132 1710 843 -110 412 -116 -603 259 1005 -153 99 698 -1954 -618 2032 -431 -906 444 -518 -1190
1150 -1190 577 370 -615 528 76 -1424 793 1606 -255 -106 475 -501 -392 1081 498 -574 235
1167 235 -241 -904 820 405 -756 -484 86 -499 -789 625 878 -645 284 -253 -821 1388 703 -793
1185 -793 -179 949 -513 -117 1487 -91 -1301 471 -782 -412 1497 -161 -1418 340 488 -1071
1201 -1071 442 1074 -492 -384 -25 -567 639 1426 -66 -592 109 459 -713 752 669 -900 -488 98
1219 98 -128 383 392 -484 -957 439 377 -870 1116 617 -1196 -229 672 -65 520 602 -933 -575 675 -150
1239 -150 -186 956 -311 -1631 137 786 -268 216 206 -792 -122 958 -465 -105 1021 -617 -1067 502
1257 502 552 236 371 -49 -1030 217 897 -671 101 6 -1163 -496 401 449 -5 -192 -11 -576 394 908
1277 908 -563 -60 154 -1002 -239 1204 31 -677 83 -163 -664 823 695 -669 -28 120 -1164 509
1295 509 1178 -329 -745 374 -457 106 1036 -472 -383 606 -258 -416 475 597 -426 -544 121 -92 32
1314 32 597 -186 -126 83 30 -342 729 800 -500 -505 532 -131 94 434 -593 -253 318 -445 -382 846 316
1335 316 -1260 15 465 -612 437 582 -506 -2 269 -437 -5 1154 -434 -1158 185 383 -98
1352 -98 497 63 -610 4 344 -246 372 658 -558 -517 702 171 -105 394 95 -487 19 423 103 455
1372 455 266 -863 -371 713 231 -109 141 -211 -736 153 319 -321 105 -72 -1047 170 1048 -18 -256
1391 -256 898 -331 -669 620 550 -131 164 -518 -936 454 203 -700 -214 69 -721 -362 445 324 -55
1410 -55 120 -132 -341 765 686 88 327 158 -20 -249 1029 363 -405 -102 -358 -261 373 -11 -1025 24
1430 24 -294 -803 4 467 -18 -238 358 -229 137 701 54 -445 452 146 -476 543 448 -478 -654 -80
1450 -80 -617 139 262 -426 -705 -72 -17 -212 504 117 -605 -118 401 186 399 644 -197 -166 411 87 -356
1471 -356 614 -32 -721 -318 157 -323 16 -25 -712 -421 227 -71 64 229 -43 -590 377 724 -85 558
1491 558 353 -426 552 450 -76 292 434 -476 -586 113 123 -260 168 -567 -455 -22 216 -43 -131 31 -436
1512 -436 45 487 380 83 81 180 164 361 416 -510 16 330 -735 -286 453 -15 -445 158 -330 -372 550 34
1534 34 -276 40 61 -470 306 659 -564 9 256 -57 617 700 -274 -54 63 -295 -394 440 149 -267 -316
1555 -316 60 -237 19 330 -169 -57 180 -184 139 731 272 -416 188 83 112 -129 431 177 -397 304
1575 304 -465 -51 537 -88 -705 -71 11 -495 99 369 -327 -131 430 -145 204 527 -312 -132 532 289
1595 289 -70 341 -26 -267 -15 155 -138 172 424 -464 -167 406 -201 -217 214 66 -486 195 -13 6 273
1616 273 77 -237 -54 236 303 -304 467 -133 -580 157 175 13 36 -152 -342 -203 353 -156 -84 221 -623
1637 -623 -483 104 -186 -83 5 -263 -297 256 240 -212 -111 194 -442 -156 293 171 -75 -100 -228 -100 324
1658 324 350 -439 -36 98 -548 68 347 60 -193 -218 -313 -150 428 38 -466 185 184 -4 490 210 11 -134
1680 -134 -22 -7 -181 267 132 -383 106 -327 -28 500 -7 1 -141 105 -182 133 464 -403 -106 476 -147
1701 -147 -69 254 56 -40 38 379 -298 49 231 -193 -85 -131 -403 -159 419 224 -370 -123 298 -297 307
1722 307 194 -437 -115 391 -107 146 245 -67 -525 201 93 -322 116 -3 -408 32 107 -281 72 80 -235
1743 -235 -428 62 -256 33 242 152 -172 175 337 269 242 97 -383 -7 317 -42 -225 371 -136 -314 82
1764 82 -68 -244 173 229 -446 -107 395 41 -287 382 -402 43 64 113 32 183 126 -470 225 124 -10 119
1786 119 -102 -197 -169 77 43 -472 158 -137 -310 436 180 -286 25 -56 -239 -14 332 -83 -246 145 -185
1807 -185 132 409 -134 -211 79 -33 -50 -32 73 139 -279 109 -267 -6 593 32 -75 47 -92 -216 226
1828 226 274 -239 158 100 -298 144 43 -290 -227 112 11 -80 296 143 -339 85 10 -203 407 11 -243 -10
1850 -10 102 57 -70 62 -22 -169 43 354 -227 -94 153 21 -219 106 -86 -93 238 -234 -182 402 83 -147
1872 -147 390 -13 -366 84 373 -184 -15 140 -78 -16 325 51 62 54 -103 -138 50 81 -113 36 110 -87
1894 -87 57 74 -283 190 -52 -220 -177 -139 -114 -35 114 39 -245 138 285 -183 41 34 -2 -58 124 -88 -346 573
1918 573 161 -346 11 -7 -129 -113 -284 58 23 442 102 -224 201 -119 -56 68 117 -309 -160 -27 15 4
1940 4 139 -166 10 59 -170 -68 462 -255 -247 -165 189 -34 2 14 -321 -104 -60 21 155 382 96 -214 -112
1963 -112 -38 -1 293 -28 -329 228 -10 -115 -249 47 -84 15 42 -23 -226 101 66 -36 187 73 -179 81
1985 81 -176 -300 170 54 -34 -44 316 -41 6 196 -46 60 253 177 -123 -214 51 -224 -14 33 63 -33 40
2008 40 161 -68 161 34 -556 156 176 -54 77 -60 -79 25 13 48 -348 100 -65 -251 19 214 -62 -57
2030 -57 -15 -27 78 133 111 170 78 37 23 367 86 -487 185 -17 -426 3 114 138 177 -14 -244 75 191 67
2054 67 -85 298 53 -204 306 192 -75 25 61 -243 -184 142 -44 -291 93 58 180 121 -28 -333 -198 148
2076 148 -91 154 261 -122 -1 105 -69 122 429 23 -108 265 -187 245 -160 -12 89 -167 201 26
2096 26 225 225 -45 -85 -93 108 -100 70 296 -61 93 220 -82 264 477 -327 110 82 -118 -12 173 -84
2118 -84 -92 105 121 0 -127 -183 -59 -143 221 -105 -149 158 -55 -106 58 193 -139 80 158 -281 -238 147 -105
2141 -105 11 -8 -17 -12 146 38 -124 -147 -238 -133 71 177 69 -38 -106 113 -151 180 103 -49 190 -101 -240
2164 -240 207 238 -129 -145 30 -196 -27 261 -13 -263 -21 -22 -62 285 -111 -127 -26 25 44 20 94 -150 23
2187 23 -59 -74 170 -14 133 -229 -1 -95 -209 -3 -18 -41 -42 124 -386 -169 270 -46 -507 -23 -6 201 40
2210 40 -29 241 389 -123 -132 46 19 -410 -137 98 139 -43 2 184 -119 -38 38 -1 27 -202 -6 131 1 162
2234 162 127 141 -89 -366 95 13 65 19 46 -24 -5 -77 162 -61 -28 -284 -273 -181 -259 180 93 -59 77 160 215
2259 215 21 42 124 -34 -123 146 -34 -22 158 -11 -12 -259 -26 -178 -83 445 -210 149 27 -32 -240 -80 -328
2282 -328 175 1 -218 -22 28 129 -269 26 122 164 242 11 63 81 94 -97 -276 -56 115 -121 184 133 -89
2305 -89 171 -9 8 89 146 7 4 162 32 -67 -77 171 -127 112 -37 86 -72 156 223 16 69 -189 -7
2328 -7 398 -158 -320 -102 -40 -36 56 -186 56 264 -37 31 115 98 68 -190 48 -75 -84 -187 2 92 -82 35
2352 35 -142 46 31 267 127 95 -141 14 -81 -173 -43 -312 197 -188 36 -7 -315 -198 -163 16 -236 -61
2374 -61 -79 -102 61 118 51 329 78 -85 -72 -100 -221 -46 -82 -30 43 -53 -57 12 -1 54 56 -138 -51 -68 -11 -104 -213
2401 -213 3 171 -151 128 222 -68 -157 -15 20 94 98 25 -53 189 -21 123 -54 120 262 141 228 214 -261
2424 -261 -4 190 -20 -61 120 -117 -197 74 -9 77 -112 186 204 149 46 59 -19 -114 224 156 90 -4 18 108 127
2449 127 -163 131 -200 -155 173 196 -56 152 108 -239 186 380 -213 -147 38 303 -60 36 23 21 117 26 -126
2472 -126 221 -52 -82 -43 150 68 -27 261 -116 81 -65 246 73 100 131 4 -183 213 -18 -241 -78 109
2494 109 -221 -126 7 -24 18 -171 -209 -5 212 -398 -199 142 -164 156 -32 -33 164 166 -8 34 158 19 -194
2517 -194 46 77 -72 180 273 57 19 47 -33 32 -175 -204 -55 -59 92 188 146 28 -1 -46 -55 -115 -38 114 -143 -45
2543 -45 171 50 209 92 182 -321 66 -125 119 287 80 -215 -176 -144 -190 -142 41 -33 -38 -14 163 1 277
2566 277 74 -131 -53 211 54 -64 208 148 -101 159 103 -66 213 4 -22 -57 -57 168 80 148 -119 -14 -45
2589 -45 88 252 27 -134 -133 75 -163 304 80 168 -98 111 131 69 -270 45 144 331 73 28 79 98 247
2612 247 55 -130 152 -52 145 22 0 -72 -185 88 167 100 -96 -89 -176 73 162 81 196 -152 93 77 1 146
2636 146 -11 100 -161 253 106 -1 173 107 -45 244 -251 49 -142 40 132 -89 299 -100 4 -9 89
2657 89 6 62 74 -70 142 291 -4 39 -127 62 -292 178 20 -10 380 152 80 19 79 139 113 111 -59 2 -119
2682 -119 -260 -81 114 74 25 275 -63 92 146 51 -270 -262 101 -82 10 133 -20 59 -13 -7 -37 -48 231 -57
2706 -57 -81 -26 184 292 58 30 -70 -73 61 49 -59 39 -50 23 -87 172 -12 44 -27 -300 155 165 69 -53 -219
2731 -219 -320 130 -24 -227 31 92 -68 41 -34 -23 49 -232 -169 46 98 99 -95 25 360 -209 -81 -1 116
2754 116 237 -128 185 6 86 272 3 138 35 -160 -24 -217 -410 108 -118 -58 237 -58 -106 -88 -144 291
2776 291 134 -5 113 105 198 36 -230 -9 90 -275 263 121 250 54 272 33 105 276 -13 33 -70 157
2798 157 -218 -148 169 79 32 62 58 165 58 148 -255 -135 148 -77 -198 426 185 16 -180 -218 114 195 137
2821 137 -2 -114 44 68 283 165 42 62 308 157 -99 92 -238 126 307 -148 -38 190 -136 33 102
2842 102 -43 52 148 142 181 -48 37 144 17 -112 99 -96 202 -71 0 291 -16 -262 227 130 -210 55 107
2865 107 121 -103 118 -179 50 433 60 -68 145 235 -55 -127 -24 223 195 328 -29 -87 -45 106 -77 131
2887 131 -293 -10 -93 60 -60 -13 -118 105 -185 -19 29 -41 77 -90 129 -11 -70 -53 -245 106 -81 -160
2909 -160 -26 -27 -121 -37 -72 -207 -34 28 -48 -83 -163 -123 32 13 -60 -247 8 -138 -73 -75 -38 -17 76 74 -56 60 -171
2936 -171 -180 -107 -16 29 -239 7 48 53 70 8 -88 -119 109 -202 61 105 -115 -184 -118 36 106 -6 220 -71 262
2961 262 -92 -190 -38 -42 64 -128 -43 -64 -82 -21 -117 253 2 -78 305 106 60 185 203 62 -24 118 -57 -130
2985 -130 146 -50 80 92 21 -57 51 265 183 -154 -5 -22 393 38 241 225 -305 161 185 -72 -40 -87 12
3008 12 106 83 260 37 136 -27 -48 -62 -77 -6 12 -129 66 -78 83 -91 -212 289 -2 80 107 -87 100 -61
3032 -61 48 -148 58 247 97 -63 -240 119 -15 -1 58 -27 -146 -177 -119 -222 117 94 -260 -239 -105 -114 -259
3055 -259 58 -146 -203 140 -12 304 -123 -229 101 429 89 69 67 80 27 -90 -24 12 280 -233 -178 50 168
3078 168 -118 233 114 151 2 168 159 95 261 -49 61 -99 53 -41 223 -77 26 113 -80 45 -244 -58
3100 -58 -95 196 -144 57 -262 75 -144 74 -78 -142 125 145 136 -326 322 138 110 71 86 40 -25 196 182 32
3124 32 4 -166 -145 17 -35 253 117 139 44 3 34 -18 -134 -108 -118 -82 209 -176 16 -23 -23 -89 64 -29 -39 25
3150 25 142 223 329 59 -208 188 109 -11 104 54 -82 -120 226 258 -196 266 -26 -120 73 62 102 -260 -8
3173 -8 78 51 204 2 156 159 -101 -59 46 -127 -278 -144 89 -71 1 -4 80 -18 -9 174 333 31 -291 5 54
3198 54 138 -37 -18 -122 285 17 48 -233 55 -141 -109 53 -6 25 -271 -231 3 -6 -51 -44 -123 94 -187 112 -8
3223 -8 185 201 -9 -46 -15 -46 -106 111 -57 -257 37 -86 174 352 -20 -93 167 -151 82 116 28 -147 4
3246 4 -4 -11 34 -26 44 -52 244 268 -87 -104 169 23 -68 147 -206 -6 -315 -282 219 173 24 -4 58 59 -176 -95 16
3273 16 83 134 248 111 -377 29 57 -97 120 -51 -189 50 -47 226 385 2 -119 50 -215 -48 126 -62
3295 -62 115 -90 -234 131 40 -79 18 -99 39 -96 -76 -93 -78 -157 -18 -222 -40 54 107 -175 29 -305 106
3318 106 107 20 96 63 -78 162 -27 156 -124 -161 258 -88 -161 -252 21 112 -203 15 -190 24 9 -141 -7
3341 -7 149 -41 93 25 -26 -104 -94 107 32 -60 -156 -232 -81 -18 41 20 28 -2 188 -158 215 104 -30 -171 23
3366 23 -87 -152 7 -8 128 143 -158 -84 -82 -78 -92 -101 55 116 -77 -46 -264 66 270 -54 -71 112 -95 -89 -281 -231
3392 -231 -121 135 -146 -97 143 -121 -128 -19 197 -279 -37 17 -139 -53 -58 -105 -15 -19 201 53 106 -17 -71 -70 -42
3417 -42 33 -21 -210 -346 -35 33 -143 -135 8 6 205 -40 459 66 -15 -42 216 -70 -68 -251 -5 96 219 -182
3441 -182 42 56 -98 54 -131 -94 -105 173 -79 -37 31 270 -139 184 85 -71 -59 58 63 111 -44 43 155 -116
3465 -116 -25 -21 55 -85 9 143 83 -21 -245 159 -373 -176 9 -3 195 4 25 -145 118 -222 7 -32 -12
3488 -12 -58 60 -231 -76 -4 43 -348 13 -49 79 209 16 129 55 74 -173 95 36 -94 52 113 321 -259
3511 -259 -125 -212 -11 -224 63 -64 190 -58 -170 42 -65 38 -87 193 25 -18 194 134 64 57 -26 146
3533 146 -160 -141 -197 -28 1 296 14 -93 34 -62 152 -75 -36 8 -30 -47 -204 -100 89 76 -15 -1 -155 -196
3557 -196 -149 149 -147 -125 31 -20 296 45 234 14 -10 -134 -44 16 30 -89 57 202 -79 -152 169 182 39
3580 39 13 -20 269 152 211 -300 -32 -393 97 245 69 -37 250 -11 -161 -45 39 154 -2 16 152 12
3602 12 89 -63 -233 -156 49 -89 -149 109 -167 -48 60 31 -32 -40 -161 12 -137 -91 -22 -40 -178 441 23 46
3626 46 279 -35 -177 -46 245 154 -147 -43 2 112 69 205 261 -251 227 160 -17 191 143 100 56 -50 111
3649 111 145 -183 15 7 -42 -60 -88 163 -140 271 171 107 63 -115 99 -146 136 -10 -123 -8 -25 21 220
3672 220 -58 98 -324 -5 337 126 -151 13 -93 -21 48 -231 -290 75 294 -53 178 108 -134 7 -206
3693 -206 118 131 143 -1 -15 196 -11 82 143 -110 -3 221 67 150 -217 -59 -196 -25 64 10 -2 151 44
3716 44 26 -156 87 218 -98 226 -26 171 101 -149 155 26 -81 -4 20 -34 -59 -201 -232 -34 164 29 109
3739 109 -97 -32 121 71 -89 39 242 293 -38 -95 76 64 125 119 110 176 196 11 1 37 82 -51 18 74 191 -68
3765 -68 32 79 8 -71 136 184 -100 -89 81 -66 179 -142 -131 -12 123 -150 85 34 33 317 -29 263 66
3788 66 -40 191 272 -8 -331 130 -154 -116 69 80 202 53 -88 -121 47 78 142 -82 -3 173 -171 142 33
3811 33 53 232 -231 70 -92 264 66 -51 -195 0 -171 93 64 -24 -168 11 171 184 212 -185 50 80
3833 80 63 338 162 138 164 -60 74 -206 153 214 -154 -347 94 180 210 -20 53 187 -19 135 104 -17 132
3856 132 163 107 -1 -121 -82 139 90 -109 -27 -50 -58 24 9 -36 130 -98 -257 -19 -60 -247 -136 180 28 321
3880 321 -214 298 -108 -64 -4 15 163 8 76 15 88 -113 77 14 -111 24 -192 28 -63 49 151 -257 -106
3903 -106 43 -187 242 95 -57 202 -289 -108 245 11 -29 161 -202 -185 18 86 148 -97 13 219 99
3924 99 90 -74 65 39 58 85 77 146 103 52 28 210 -53 42 -203 -143 14 -106 -108 -364 -92 -40 -243 -34 -42 -144
3950 -144 -63 81 101 76 90 224 148 165 84 69 245 -164 127 -9 18 -109 -116 67 353 103 -191 252 58 179
3974 179 116 -42 142 88 -103 28 -54 -50 -255 173 -90 284 294 -99 83 -173 15 51 55 14 8 -4 111 106 90
3999 90 48 -81 2 119 -260 165 52 227 239 -106 7 -124 -15 44 -82 -3 99 109 -214 110 14 -27 -48
4022 -48 -115 -155 110 -61 22 -123 -228 -69 138 -16 -79 -50 59 -184 -199 -38 111 30 -62 62 57 -21 61 -231
4046 -231 0 155 80 -143 3 -221 -178 60 -55 80 48 -149 175 -272 -16 47 -7 -107 194 0 66 0
4068 0 -106 -17 17 15 -22 150 -17 106 52 -252 -226 -97 19 101 110 -147 54 -1 -18 194 -199 189 106 99 115 17
4094 17 -10 -58 200 -140 191 5 -7 -29 47 33 -133 57 83 72 -33 -90 -170 -74 -107 54 33 9 -14 -29 -309 179
4120 179 3 111 3 -111 135 -232 181 0 -17 -142 300 -65 -252 32 -47 350 -227 59 -143 127 71
4141 71 69 81 284 142 -52 31 111 -150 -19 263 -141 55 157 -75 169 -53 -44 -23 -150 64 -141 235 -202
4164 -202 67 -175 -185 -222 5 -160 -380 -117 26 59 -148 30 82 -76 87 -39 141 168 -4 -131 53 -200
4186 -200 -143 -82 11 -90 21 66 8 -283 -47 -104 -209 -93 206 69 30 -226 155 -99 39 5 -146 42 64
4209 64 25 -17 -156 77 -234 -98 -260 -230 33 31 216 47 75 211 118 54 -59 18 36 19 204 -245 128 -42
4233 -42 -138 13 42 43 -105 -20 180 -209 -128 -26 -72 -99 176 180 -63 139 112 -82 -49 86 -115 -13 -133 -138 260
4258 260 -154 -244 103 -31 -14 -54 170 -54 121 40 -4 55 -102 -152 0 87 -61 174 108 173 120 -13 -130 -95
4282 -95 292 203 -121 -64 -71 31 44 -87 -259 169 233 15 -68 71 221 101 230 20 58 -183 -44 106 190
4305 190 87 269 143 -182 -29 -198 -37 59 -2 -101 16 70 -224 -346 177 105 -85 82 176 -186 0 -197
4327 -197 -277 -120 198 90 -234 45 -46 103 45 7 40 100 -252 112 -289 -86 84 -190 204 -85 76 -63
4349 -63 -162 -103 -2 -158 89 -54 94 251 178 138 -21 -21 -144 147 -197 89 -284 60 -70 81 -98 138
4371 138 43 29 98 19 118 -117 65 10 115 -299 -32 -186 -192 71 -79 78 -12 -139 -70 -109 151 -130 -250 26
4395 26 -197 -116 94 -360 90 82 151 54 219 6 115 -29 -25 -55 37 44 123 -15 5 206 40 67 158 -181 -45
4420 -45 171 36 -392 -74 -132 329 -31 -41 -126 176 30 -110 117 -319 188 65 77 -24 -58 -8 78 -32 -286
4443 -286 -26 26 21 65 -103 -18 126 -182 171 -150 110 129 138 138 168 43 -88 -98 48 -142 59 -74 -49 -41 190
4468 190 85 -193 -1 137 -142 56 -82 211 -23 22 -108 -6 204 134 186 131 146 -162 5 -213 -30 40
4490 40 57 2 70 50 101 -74 80 284 284 45 69 186 209 111 38 236 -45 -119 25 -15 -23 255 112 -19 -135
4515 -135 -100 236 125 183 -207 -135 -100 -157 115 87 119 -129 -3 92 113 106 26 151 145 19 -50 -15 -376 -85 80
4540 80 -8 -153 -140 -150 7 -26 -112 4 0 -157 -128 2 229 -25 -100 -31 -67 113 68 113 -195 -46 -162 -65 -199
4565 -199 190 -1 73 -6 -180 126 124 -108 105 -55 -80 17 22 109 -26 -174 -16 84 248 -119 -88 -232 58
4588 58 56 -148 98 196 -129 49 253 -239 -124 -185 -66 -33 -84 -63 -64 28 14 -30 77 -131 -189 199 50 -77 -65
4613 -65 151 -75 -46 181 338 -135 55 63 74 50 -144 34 12 -140 7 -150 -133 162 186 94 -194 -11 -56 -68
4637 -68 121 -8 -57 -227 -178 186 -143 -33 246 -80 83 22 89 -349 9 186 77 -84 -115 229 -6 -156
4659 -156 63 18 -70 -43 390 -121 -1 146 -332 -91 -34 90 217 -138 -72 -29 -168 -269 31 -149 -205 -73
4681 -73 -234 301 -82 31 61 -7 76 -59 67 -221 -83 54 -67 77 78 87 -93 57 -18 67 -73 -22 -235 -131
4705 -131 -34 -190 -254 -320 -352 1 290 -88 49 40 -2 13 -17 -149 -34 36 45 -27 59 -116 192 -209 167 -208 14
4730 14 -190 -151 -184 -58 -272 41 17 120 -165 -117 96 -95 -101 -106 -380 -117 -212 -222 57 -28 2 11 251 139 -112
4755 -112 -138 94 95 199 -308 130 -216 -120 128 -46 -118 87 74 -263 102 -153 92 -30 294 -111 2 221
4777 221 -159 159 -81 -20 -136 -38 9 270 -45 -47 63 110 51 176 223 173 125 320 -230 -145 -49 269 -40 -167
4801 -167 -14 74 -64 25 -154 -20 -104 14 119 -44 -65 -94 -8 229 175 -33 -163 -188 13 -11 77 160 -100 -240
4825 -240 8 36 -34 87 14 -115 -47 88 -305 130 -10 -158 61 184 108 -166 144 -127 -22 190 -108 10
4847 10 1 -100 -34 110 -55 -122 106 219 -32 -57 34 56 -224 -36 50 30 36 -208 -111 11 149 147 224 136 -42 75
4873 75 -29 -71 -90 -54 153 55 24 6 91 76 -286 -262 -158 -197 71 -7 -170 -57 189 -99 148 118 124 117 87 49
4899 49 -61 105 -24 -90 11 -121 -142 -60 37 38 240 82 128 -77 -91 -175 -34 -55 20 -551 52 -261 -216 282
4923 282 -79 120 -110 -145 49 -195 125 -43 16 51 -72 127 -100 -25 291 -172 -1 -59 -15 163 -191 313
4945 313 210 -247 25 -95 103 151 -161 35 -16 -127 106 55 135 99 -200 -190 -51 255 -259 -19 -111 -305
4967 -305 -14 108 -61 -60 -76 56 170 5 -141 67 -52 72 -16 289 221 46 -109 5 -148 -101 -64 83
4989 83 34 91 9 -32 41 -99 59 -49 76 -268 63 47 11 151 73 -130 -356 -10 11 -196 -89 40 -97
5012 -97 40 -45 47 -67 -92 -176 326 150 23 -235 182 54 -37 263 71 327 11 55 205 92 -53 -78 24
5035 24 135 220 -16 -145 51 21 -70 71 -106 -215 102 -31 136 -39 -58 -62 33 -129 -115 -184 -45 -12 -295 -51
5059 -51 -117 163 96 53 40 -156 109 -207 -260 77 -98 -159 -31 2 221 -30 -23 35 -29 -65 113 -115 239 120
5083 120 -23 -39 -142 13 -152 -55 -117 109 127 195 -48 34 193 -22 -44 66 175 145 -87 35 -140 -44 227
5106 227 181 -34 141 -126 -149 6 5 90 123 -30 28 197 206 -15 23 -167 35 46 186 5 -64 -188 169 -24
5130 -24 -85 10 110 84 -90 259 -37 -131 122 -78 -68 -120 -73 99 -146 167 -30 130 199 95 -78 -94 103
5153 103 68 162 -70 370 120 284 -91 -32 121 -141 -115 -105 -122 -81 181 -153 71 -144 63 88 -173 -56 -23
5176 -23 -61 29 160 50 149 104 -11 -133 107 331 -106 66 -61 -301 7 -84 100 -152 206 -72 141 14
5198 14 -40 157 88 -5 -295 -31 -91 45 -80 -77 207 153 44 87 -217 -59 -117 204 40 -94 61 126 276 210
5222 210 208 118 17 -186 -269 49 -198 42 134 262 67 -67 -139 -108 -56 76 -174 53 118 114 -24 200 85 74
5246 74 -163 -123 238 86 56 -145 45 -124 -127 -31 218 -48 -29 -133 -44 131 380 -24 -134 -222 128 -58 42
5269 42 213 104 -117 -67 -22 21 -73 -205 -183 15 33 107 8 -69 173 309 -266 210 -20 40 154 2 52 190
5293 190 63 126 -90 -16 -17 -85 35 -143 -137 -196 -17 5 179 -231 -36 -58 99 213 -167 206 170 -114 -255 -76
5317 -76 -152 -3 -1 -102 96 27 17 256 190 -86 -145 207 -41 -3 150 -43 149 96 -78 137 -118 110 -80
5340 -80 223 -40 112 88 -31 60 -104 -141 176 111 -200 282 -30 181 3 108 60 81 -76 -88 8 250 -70
5363 -70 -58 -255 -67 122 318 -39 -331 -106 10 -219 9 57 5 -129 100 -14 376 -155 -136 81 65 227
5385 227 -62 47 8 217 158 134 90 -180 -82 133 115 -159 75 -23 -122 5 307 44 -215 213 -75 -115 -101
5408 -101 -91 -76 156 -82 -52 145 179 53 -98 141 60 86 124 106 88 -289 -14 -70 164 107 -72 37 -155 6
5432 6 -70 -23 -6 55 111 173 88 48 189 -9 20 -136 -109 166 168 -33 -110 46 -118 167 -187 -28 12 128 -59
5457 -59 -216 42 -328 103 36 24 -125 89 -97 81 -255 -78 37 113 119 -43 -155 -31 -377 40 6 115
5479 115 -143 66 -60 -9 -24 135 191 -64 -113 12 86 100 -29 -133 296 105 -115 145 193 16 205 -60
5501 -60 -103 174 38 -50 98 -235 202 117 321 -94 -35 -398 6 107 -104 210 -43 -41 -3 121 -61 17 119
5524 119 166 -35 -117 106 -64 -2 -88 -38 141 51 -40 -115 -77 -159 425 -64 -327 -246 -187 308 -107 16 -42 71
5548 71 -103 -48 -219 92 64 -36 2 -49 115 -235 295 114 8 38 -62 -1 -18 193 -19 -199 -59 -245 -350
5571 -350 143 -50 34 -94 -63 11 -142 309 293 -84 212 47 -20 -9 -58 194 121 43 -19 20 46 -27 149 -12
5595 -12 73 172 -171 8 -66 83 -43 1 35 -28 -123 -299 94 178 21 61 83 27 168 -65 170 -187 -181 76 81
5620 81 -94 -26 55 5 -350 27 -71 -69 189 22 24 -177 305 -161 68 95 67 18 59 25 -173 -133 131 58 44 -138
5646 -138 -59 15 -52 -62 -261 20 -83 40 27 76 215 -36 -57 -150 0 -11 97 162 153 27 57 65 255 281 -127
5671 -127 53 -294 -125 -162 -97 -81 -45 -124 91 -127 4 31 11 162 -100 10 149 153 -88 97 216 -141 -196
5694 -196 142 238 148 253 156 -22 163 125 -166 -155 -13 -89 43 -64 -27 80 -29 73 -139 83 -38 64
5716 64 73 198 63 211 -135 -142 -13 -153 22 -30 308 128 285 -35 -8 -24 -35 36 275 -111 17 10 -192 -15
5740 -15 -53 -188 -369 -65 11 -141 107 13 -25 -40 -33 183 31 112 -226 -87 158 -58 34 -198 33 64 100 92 29
5765 29 19 -162 -72 -134 -69 449 115 75 -62 137 -108 -49 140 106 4 114 72 -128 44 -179 -244 50 129 101
5789 101 -79 54 168 202 120 -176 53 -77 98 -6 51 -29 -71 380 72 -55 -72 -192 -163 191 106 296 79
5812 79 226 -140 -193 -15 117 -157 11 -93 173 -55 121 -40 -68 -335 -94 -86 59 82 310 -112 50 93
5834 93 -115 -71 91 -28 -138 -56 267 -37 2 -133 -95 2 47 -251 -74 -31 237 42 2 -109 -132 317 -350
5857 -350 123 41 -118 92 156 -21 -159 53 -55 185 -74 -100 -37 -241 -121 -108 176 -65 -147 285 29 -321
5879 -321 144 -58 31 170 168 88 -108 -96 37 -140 -166 -270 196 -157 -152 94 -76 125 56 143 -181 44 99 8
5903 8 -116 -89 79 114 147 -55 177 -168 -148 -115 -82 17 89 238 192 11 216 207 -50 -259 115 -93 -72 84 -229
5928 -229 -250 334 8 18 13 -99 23 61 73 -94 372 -76 -52 -104 1 -14 -188 188 191 23 60 -120 -54 -49 -214
5953 -214 -99 -38 -205 -192 63 -203 116 -43 -63 205 197 84 75 -29 66 23 150 19 -118 -81 -74 -161 -90 3 -155
5978 -155 96 -146 -61 7 130 40 -142 185 5 -31 -141 59 -66 -241 -66 -66 -63 203 -34 298 -104 -6 -25
6001 -25 -28 -42 237 23 -142 -218 184 -44 -2 196 147 -2 400 43 57 -183 134 382 59 25 77 69 -249 143
6025 143 -88 119 -9 -109 210 219 -30 18 -41 -6 -118 -28 -170 -404 98 65 9 -321 449 -133 -107 -207 2
6048 2 -109 -90 -216 185 55 8 -28 -17 -168 -207 142 140 -37 -82 -267 -193 -143 98 -100 -43 -162 94 -290 -72
6072 -72 59 -27 129 -56 -54 -80 -209 22 -113 94 42 177 -12 -57 310 10 131 90 46 94 -5 59 -10 -132
6096 -132 -217 188 59 63 -12 40 201 -125 -79 -152 -134 -208 -33 224 73 -128 -187 -138 -26 -11 -16 313 -71 58 104
6121 104 -97 157 28 -382 -131 72 -35 -108 -120 -66 138 78 -60 -11 129 24 12 -109 -68 137 219 61 -45
6144 -45 -73 52 83 121 22 -49 -423 19 214 178 -45 -15 80 151 51 -81 75 -61 -208 317 -123 125 -32
6167 -32 -231 133 -40 130 6 -124 11 -156 70 -8 145 182 -303 83 181 -242 -160 -182 27 -179 -3 80
6189 80 207 150 -18 -135 281 50 155 -167 168 -190 27 -8 91 150 -123 -38 120 97 55 -92 177 120 -195
6212 -195 62 -176 -46 -9 37 -79 167 -19 318 -51 -82 6 -89 101 -22 65 -69 48 128 -91 -5 4 111
6235 111 41 210 104 6 10 116 -18 41 -123 -137 55 -150 173 48 -155 37 -113 159 223 106 50 62 -207
6258 -207 -123 184 100 137 -140 41 130 70 6 113 169 75 -32 66 221 1 96 -159 -26 -173 69 -220 -262 48
6282 48 -39 237 -126 -26 -38 245 101 33 136 21 267 71 -167 -118 73 -174 63 -83 28 -23 -123 141
6304 141 -28 147 -48 406 53 113 -5 -2 -131 -193 -9 45 193 -37 120 210 -74 96 172 100 161 -133 -330
6327 -330 -207 151 -104 -118 109 -129 14 45 20 -81 74 -93 44 154 -12 -74 3 5 -29 85 -130 80 204
6350 204 -21 45 -286 -96 -188 19 29 -167 12 2 271 -48 -35 -223 15 -58 273 -21 151 26 -296 -114
6372 -114 138 106 74 -138 57 187 -182 207 -75 -11 2 -42 -9 6 -135 -132 -54 12 -201 64 -85 -73 170 -94
6396 -94 125 140 -10 -272 278 80 -59 73 77 -83 -36 -137 -9 194 -95 97 15 -34 -38 198 80 -93 23
6419 23 -140 -116 25 50 -16 6 -147 50 -103 -401 230 -26 56 -209 59 -51 14 108 -16 262 -93 -14 -148
6442 -148 -199 -26 -101 -8 -323 -98 -17 -59 -4 149 -81 66 213 -43 -44 -92 -175 35 -7 136 196 118 8 -45 -26
6467 -26 -23 -192 -120 -55 13 -92 -147 -110 -52 -147 -38 -99 -22 -34 -111 43 -247 -94 20 196 -122 50 -109 -138 -119
6492 -119 -198 102 215 -73 8 14 -61 220 -107 -142 134 -74 57 114 -250 111 8 143 -30 -19 -6 113 192
6515 192 -331 -49 -103 157 -27 -107 -142 -240 -43 -43 101 166 167 246 49 44 -214 -47 39 260 -60 210 157 82 -160
6540 -160 119 137 -20 -60 -202 -176 80 120 60 -146 -34 9 24 51 -4 60 69 261 115 5 -113 140 289 119
6564 119 28 -68 71 23 21 -130 196 -115 -90 -190 -127 -83 240 13 -161 69 163 -62 -51 146 -81 133 -95
6587 -95 -7 -49 -104 72 54 -30 365 18 -136 181 115 -22 71 64 33 -91 111 248 -37 -56 159 -202 -14 -59
6611 -59 -207 319 11 291 271 238 -17 42 -127 -67 -270 25 117 53 41 136 203 -51 -231 -196 -83 -60 21 -21 231
6636 231 -22 -157 -1 -61 -151 -103 -228 6 9 58 161 11 71 45 -44 -99 20 -98 -234 -178 10 -121 -92 -10
6660 -10 111 5 62 167 -159 113 208 32 -15 -126 -35 -30 -267 -42 198 311 -230 182 96 -60 -253 37 -12
6683 -12 -33 151 212 85 179 -75 -240 9 -161 -359 -386 133 151 50 139 -72 -52 -284 -36 227 -218 -314 -197
6706 -197 2 1 162 34 369 40 -150 268 60 -147 75 22 -16 -85 96 -45 7 -63 107 13 264 22 -86
6729 -86 76 -42 34 26 -123 114 -76 -28 157 34 -75 -280 60 16 -21 -191 -75 145 -58 -82 -158 1 102
6752 102 -28 -142 -93 147 -20 79 151 44 -139 -71 -45 11 -21 -58 -124 120 -329 148 168 32 -12 67 -195 -91
6776 -91 -217 32 -19 -244 -206 -18 -283 -8 36 87 -34 -265 -45 -196 -34 258 -73 15 -127 -230 -166 -37
6798 -37 -13 151 -101 -22 -215 -231 51 137 -57 23 89 57 -96 43 205 131 55 221 -38 -91 6 -86 95 -68
6822 -68 -70 -57 -20 299 31 25 -73 59 27 -162 -85 -354 92 284 184 150 -113 197 297 3 -96 -49 -56 62 -325
6847 -325 222 -131 96 -207 342 101 -71 293 -266 -8 329 -101 -236 252 -59 274 139 23 49 106 -190
6868 -190 134 -341 239 255 -259 -39 -60 137 -107 -56 -6 -14 7 6 46 -196 76 26 -18 79 -117 -43 40 165 -9
6893 -9 68 -28 78 97 -44 -154 -3 10 222 90 -191 -118 -357 151 -67 -44 -328 -93 27 -39 -89 -25 -172 -20
6917 -20 -102 -21 16 -63 -20 -138 60 -201 87 -62 150 144 71 65 -146 -73 175 6 83 22 75 3 -96 161 -50 -131
6943 -131 -76 -248 -49 309 81 63 -119 38 -63 237 -12 -45 61 6 304 56 22 183 -271 -51 -196 52
6965 52 37 -2 128 141 74 -32 17 197 -103 103 -8 -62 -11 -108 -52 198 -24 184 126 43 61 -82 25 -90
6989 -90 200 -96 62 92 -14 -204 125 283 -4 276 -228 -67 236 70 -58 21 -82 -112 -200 -150 78 -47
7011 -47 -66 125 35 150 202 216 -304 -51 -71 82 166 -36 -62 -152 -247 -4 -41 -71 -288 -158 11 -212 -33 32
7035 32 -76 -76 -95 76 52 -231 -80 -12 -44 -24 -85 -87 124 27 -189 142 -56 29 -174 -108 -3 27 215 88 -78
7060 -78 -108 130 10 -10 29 -54 106 51 90 -40 -37 73 163 78 -128 114 0 -69 -77 1 -168 -44 -121 142 15
7085 15 221 -35 -27 -2 -151 -181 -249 178 -161 -46 36 0 106 226 -56 53 109 -59 -15 -318 64 -12 30 -27
7109 -27 90 -10 186 86 197 -52 -62 13 -36 -468 260 46 72 125 120 -23 116 305 136 70 -128 -231 -194
7132 -194 159 -138 -95 -180 -82 -146 -61 -8 21 99 25 -76 316 24 -55 47 170 21 68 74 -66 35 -48 -44 142
7157 142 60 -184 -140 -190 21 219 -124 49 169 -57 44 220 3 66 207 58 -79 -165 -72 -4 84 14 250
7180 250 15 -198 208 -28 75 163 -90 -70 -229 35 -66 90 -10 166 258 -6 8 -52 29 154 -28 233
7202 233 196 158 2 -205 222 196 108 -323 91 -259 26 -126 95 -175 -82 126 -59 -6 159 -154 -136 206
7224 206 174 44 509 -197 -66 -184 -219 -111 66 -46 8 -195 -183 -210 -61 0 112 -116 -134 271 9 -73 155
7247 155 -1 80 -55 -31 -196 190 -123 12 -189 -272 7 63 450 -1 175 405 11 -298 -105 151 -90
7268 -90 50 -100 -120 72 -38 21 328 -89 -40 65 -108 120 29 -206 -49 49 -16 49 -319 31 18 -366 31
7291 31 79 6 -214 84 193 141 -136 197 -28 -80 118 -222 -37 -45 -191 -75 44 -18 83 123 -150 99 -161
7314 -161 -184 125 -57 -260 117 18 -227 -92 85 -214 105 5 205 16 -164 171 -10 21 -309 -6 -194
7335 -194 60 198 -34 177 68 -19 -152 -423 121 -44 135 -98 -39 86 -89 144 180 -19 -125 246 63
7356 63 14 -75 111 -162 -137 -124 201 -95 194 -74 57 15 95 49 106 -39 48 4 466 -25 34 -207 118 85
7380 85 52 79 -178 200 -121 236 -37 -64 -236 -7 100 -247 -45 58 -305 -216 42 -4 74 -63 -308 -20
7402 -20 87 -402 190 -133 135 80 -50 149 -2 -27 -164 87 355 73 -205 34 -74 -19 -137 -70 151 38
7424 38 -124 55 31 114 -83 79 -99 78 -38 188 -15 109 -53 -13 -200 65 111 231 -296 21 3 23
7446 23 -12 8 63 22 3 -93 62 -7 366 80 17 83 -264 -232 28 -132 -136 -89 217 30 31 50 -93 103 -288 -260
7472 -260 -176 -193 295 -32 -43 142 22 48 -69 166 -11 3 159 163 -153 -50 -220 -178 178 100 -78 94 -11
7495 -11 146 25 7 -19 115 67 231 271 -120 -92 45 78 179 18 250 174 -58 -19 -54 14 10 -184 27 26 -22
7520 -22 -125 110 -115 -30 -16 -31 -186 7 -165 78 -55 116 200 -93 188 2 19 165 -13 36 -16 -7 57 -123
7544 -123 -21 -143 19 122 -185 106 -130 -118 31 114 -313 58 281 -95 -223 -107 172 89 -183 -100 -40 -70
7566 -70 -38 -38 68 -110 -8 202 -281 -217 -35 -48 180 203 -119 71 92 -137 -80 -94 -108 11 -56 28 102 -162 32
7591 32 -338 85 -68 211 165 170 -73 6 0 -70 -180 -5 -39 -76 154 -100 -48 140 -5 59 151 -339 -404 74 -146
7616 -146 126 134 -62 98 58 -169 113 182 -92 206 -135 -110 -127 94 -38 184 40 -95 59 -107 -160 84
7638 84 -120 -182 -231 151 247 -85 74 -65 9 -82 -28 -287 90 91 244 -39 -263 -58 -211 -50 -132 411 222
7661 222 -97 -61 191 136 140 106 137 -139 91 -30 250 23 -67 -229 -29 -210 -250 -62 -41 -146 26 -45 178
7684 178 7 296 78 -11 -2 20 -159 -54 -32 -159 -17 14 188 -67 6 217 -41 -98 -137 148 -8 -94 38
7707 38 -73 219 178 -20 -25 24 -208 -93 62 199 38 115 187 180 -36 67 294 93 74 69 -190 -104 -108 -21 -426
7732 -426 -181 39 -99 141 -94 55 -78 -148 -193 135 -14 20 -148 235 -95 -84 -6 -50 231 -174 248 -83
7754 -83 -403 -116 -166 130 -158 32 -23 -10 -58 -95 -54 51 175 -42 245 242 119 -131 -6 -181 -255 -37 259
7777 259 215 4 -72 -132 -192 160 -226 192 -95 26 -1 184 -22 222 -155 244 297 -33 -181 -163 -1 -93 341
7800 341 189 -102 100 -115 -88 70 -9 -34 56 24 -171 98 -185 -69 -55 -167 -206 17 -284 77 -63 30 18
7823 18 -48 20 -5 23 173 -127 -206 8 -142 -61 41 -24 8 114 400 -132 47 25 -63 -113 13 -388 38 -6
7847 -6 163 -156 -258 -109 17 122 -3 97 276 122 165 82 -38 -329 -265 -78 100 158 -369 -210 -131 -39 105
7870 105 45 133 -90 -43 -131 -99 29 -107 81 -35 99 322 208 -5 89 111 175 84 -13 -235 27 -184 -139 370
7894 370 -104 127 67 -101 -7 -103 1 -43 103 -7 59 -93 -70 82 122 -15 1 259 161 109 -40 171 -95
7917 -95 78 85 82 -114 -29 97 109 174 -6 189 -483 170 156 88 4 -121 12 -76 10 -135 -254 -435 77 66 165
7942 165 -235 -40 10 113 59 0 112 156 -138 -75 14 128 -46 -81 139 162 -107 -155 9 113 -210 -151 -236 -229
7966 -229 2 -194 -27 235 41 125 109 111 129 -134 -92 -58 161 185 -161 -114 116 -78 36 -55 191 13 -103
7989 -103 32 -15 124 -230 222 52 202 -90 -66 -72 -17 -3 -71 7 -155 42 90 5 -52 -163 68 42 -206 83
8013 83 -298 -195 100 -142 201 79 -40 39 -195 131 -73 22 -315 -52 -4 108 -174 65 188 126 -137 99
8035 99 22 271 -34 -259 166 253 130 173 -91 -136 50 42 -138 155 90 173 -187 133 -30 -278 89 152 335
8058 335 -86 63 5 -21 23 -25 49 -155 12 -46 156 -113 -68 169 71 89 -86 -49 -397 98 30 -136 -36 -47
8082 -47 -98 -13 129 32 -30 159 20 47 65 368 88 -21 -138 137 -39 -123 128 298 135 19 12 -153 -348
8105 -348 112 -103 -2 -122 22 -53 69 -101 292 0 44 114 132 -165 26 -94 -317 -91 48 -57 -17 88
8127 88 -262 -99 48 84 -28 108 -58 -206 -184 -69 60 -57 -230 199 -72 165 -95 5 128 148 47
8148 47 -127 -127 93 -39 394 -144 241 -88 202 81 24 -70 -72 -36 57 84 -3 91 -171 -24 -44 154 -274 -120
8172 -120 25 256 -44 -17 254 -241 133 41 16 173 149 159 -11 98 164 -244 -29 29 -121
8191a21
$$ Imaginary data points
##PAGE= N=2
##DATA TABLE= (X++(I..I)), XYDATA
0 0 0 0 0 0 0 0 0 0 0 0 0 0 8 -8 8 -8 16 -16 16 -24 24 -32 36 -42 48 -56 64 -76 86 -99 111 -124 140 -158
34 -158 179 -200 223 -248 276 -305 338 -375 414 -456 503 -554 608 -670 738 -811 893 -985
52 -985 1087 -1202 1333 -1484 1657 -1861 2102 -2397 2761 -3223 3831 -4661 5853 -7697 10839
67 10839 -17098 33855 -158545 -410601 80689 -174508 -70208 -29143 -286460 -50794 -131441
78 -131441 -109504 1751 -43236 125340 -59092 -49097 165595 99538 164719 110046 90852
89 90852 108740 9645 103036 62498 57578 6425 -168421 -43049 -41212 -74768 -76231 -145607
101 -145607 -48155 -150831 -103419 43365 -64559 52082 -18670 -74098 152147 85878 94012
112 94012 78458 57676 150262 -24658 72080 115674 -44419 64381 -92317 -99989 47579
123 47579 -90298 -45525 -97875 -106952 -13688 -124423 6290 21280 -73939 43073 -7271
134 -7271 36911 105664 37601 61572 44950 73915 40432 2276 83643 3190 -17960 -8106
146 -8106 -60239 -10303 -36111 -45337 -61980 -73086 -3067 -70439 -24399 37564 -45367 20306
158 20306 17139 10309 65481 17837 54851 24451 18401 70069 -28952 27642 48531 -43292 5661
171 5661 -27932 -37715 -5353 -30217 -13685 -49601 -19191 -211 -47229 30744 15275 -25719
183 -25719 21115 10 18272 30106 18439 16591 -4876 28299 5020 -12743 31091 260
195 260 -14809 -16954 -14302 3591 -9642 9840 -20184 -30975 21313 -17111 -5448 30388 -11810
208 -11810 -13553 -6867 10802 11903 926 19025 -23743 -5397 28306 -22972 13737 29031 -20868
221 -20868 -10221 371 13155 13434 5279 551 -24427 5519 14311 -14094 12616 2081 -28404
234 -28404 -16148 3678 11685 -7044 -6381 -9298 -16292 12904 7413 -2534 15526 7026 -9967 -3513
248 -3513 28473 21030 -5774 8512 -7312 -10357 19197 -437 -8409 894 -14872 -24244 -6280
261 -6280 18953 -8053 -23783 1901 -12205 -2878 20664 -2090 2683 14574 -3214 -5283 20136
274 20136 27384 -3247 -5115 7766 -7112 4057 12628 -8241 -8090 -5523 -18865 -12027 12181
287 12181 2945 -22828 -10533 1565 -4438 4199 9394 664 13 6651 -478 3214 27027 9963
301 9963 -14596 5835 7894 -4099 6520 7158 -8125 -11609 -4775 -10573 -3454 13835 -13796 -25859
315 -25859 5997 902 -8937 9644 4289 -6047 2741 4614 1232 15303 18593 -6127 -6320 13658
329 13658 3627 -2288 10911 120 -14303 -5849 -3787 -4678 4050 -3268 -20758 -11326 7311 -894
343 -894 -5860 8323 1949 -9334 6397 10908 4531 14334 7033 -10325 3985 15026 -430 -1245
357 -1245 7800 -8651 -17104 1901 2168 -7692 61 -10679 -20500 5303 9015 -8776 1893 6600
371 6600 -6855 -77 13417 8792 3790 7597 -2214 -5520 13117 7726 -7490 2470 -1359 -13975
385 -13975 -4379 5565 -671 -7337 -6247 -8321 -5848 10376 4616 -9330 2761 4544 -6398 5730
399 5730 14934 1003 -2611 4224 -3451 159 12447 -789 -8926 2926 -2757 -11715 4928 9703
413 9703 -9403 -6749 -245 -7606 5803 10380 -7334 -4653 4534 -1477 -2138 9113 7353 -7928
427 -7928 -2167 3932 -3497 6330 6748 -7088 -1635 2587 -4379 -1214 8965 3627 -11243 -3943 3102
442 3102 -2261 5128 2200 -10414 -3045 3484 -3919 -271 9711 -2019 -11281 3003 5283 -256
456 -256 6970 2994 -6070 1085 5636 -2910 3955 11219 -8678 -11706 5721 781 -987 3614 -6759
471 -6759 -9718 65 2086 -3075 3410 4641 -11586 -2621 11290 2102 3288 4825 -1812 -95 3455
486 3455 4156 1845 3798 459 -12408 -3667 8518 -1506 -5853 -2492 -6933 -6784 2942 3179 -3594
501 -3594 2155 -763 -8642 7274 13189 -1841 -123 6340 -2056 -371 9788 1794 -2135 3673
515 3673 -8087 -7797 8210 1960 -8117 -4477 -3136 -5767 -1398 5323 -1421 -3797 1115 -4082 2069
530 2069 11269 2516 -2645 1885 4581 687 1734 8025 -1012 -4477 1571 -4979 -1223 6555 -3910
545 -3910 -9626 -1444 -1346 -5701 2399 3885 -6639 -3277 2713 -1011 4725 7229 -2850 -2081 7393
560 7393 2861 -1940 7170 3766 -5070 472 -111 -3251 2245 1275 -7394 -6596 1497 -3200 -4458 4901
576 4901 -2509 -7037 2580 918 1026 6037 2033 -1751 1573 6326 1438 584 6291 -454 -4418 1625
592 1625 -517 -1845 1700 -1932 -8168 -3178 2160 -3679 -1334 3676 -5023 -5179 4500 3055 307
607 307 5007 784 -4331 6253 6265 -2792 4575 3950 -6283 -1567 3204 -1128 -508 331 -6309 -6897
623 -6897 2594 371 -3407 2380 -1799 -5692 1407 5059 3368 691 427 -268 -103 6575 3468 -2773
639 -2773 2199 95 -5610 599 5370 -2083 -3771 -832 -5796 -1827 5995 -1336 -3780 1695 -2883
654 -2883 -3099 5907 5974 -3299 -1475 1396 -2228 4690 5774 -3633 -1262 1393 -2946 -967 4433 1576
670 1576 -5345 -2052 702 -2855 3265 2706 -4368 -1362 82 -2104 1776 5779 -48 -5879 278
685 278 2845 35 3452 1043 -4337 -314 2077 -1492 1286 4385 -2768 -5315 2767 1073 -1179
700 -1179 2983 -381 -4337 -235 1916 -1417 1691 3771 -6115 -3808 5129 235 -478 2552 -2187
715 -2187 -2117 2300 1378 -991 2757 1924 -5162 -106 4546 -1052 142 1693 -2372 -2247 713 466 -202
732 -202 1427 -700 -5092 117 4614 -996 -1529 1885 -1199 -1897 3483 1787 -1381 2976 -787 -4311
748 -4311 3564 3499 -2935 13 2036 -3778 -2004 3610 -523 -1169 1604 -4704 -2731 5290 1277 -2477
764 -2477 436 153 -2097 678 3906 91 -80 899 -2287 -112 4086 145 -1890 493 -6 -2908
780 -2908 329 3571 -1453 -2364 -474 -2434 381 4208 -973 -3270 1365 210 -2170 3455 3246 -2929
796 -2929 -509 965 -722 2304 3122 -2297 -2386 2041 -1414 -2265 3751 434 -4293 -937 -549 -370 2474
813 2474 1243 -3108 -1247 2099 -305 279 4115 -611 -2863 1147 1101 335 2105 -319 -2770 -323
829 -323 1523 -1220 -457 1949 -2224 -3685 760 1125 33 1569 -544 -2998 830 2771 -588 1147
845 1147 2189 -2514 -1653 3189 989 -967 1254 -1620 -2859 2147 608 -2563 1358 377 -3959 -499
861 -499 2296 216 94 716 -1591 -767 2949 846 -839 1621 -420 -2858 1234 2327 -282 -1144
877 -1144 -284 -1655 -919 1328 -326 -1258 1064 -602 -2996 1808 3106 -1182 -523 993 -1081 366
893 366 2982 -292 -735 851 -1851 -1918 2997 1307 -3289 -384 312 -1928 700 1419 -1298 -208 745
910 745 -1907 58 3435 592 -1798 827 385 -637 1733 1532 -1062 -534 -103 -1726 1018 2225
926 2225 -1675 -2726 177 376 -714 908 889 -1600 -353 939 -770 1552 3116 -1393 -1479 1574
942 1574 195 -307 2177 194 -2873 -140 532 -984 1486 574 -3607 -692 1880 -802 -365 1677
958 1677 -1079 -1484 1408 575 175 2061 167 -2047 407 1738 -144 137 1291 -1700 -1290 983
974 983 93 147 323 -1269 -2229 613 2131 -916 -494 1164 -1374 -701 2033 197 -57 904 -1385 -1341
992 -1341 1422 1444 -1658 416 1079 -2580 -129 2130 -465 -418 73 -1813 -571 2386 321 -1448 1187
1009 1187 -116 -1618 1170 1914 -451 -94 516 -1323 88 2034 -654 -1308 924 -913 -1486 1299
1025 1299 1192 -535 -950 27 -785 651 2362 -1172 -1143 1256 -342 -1030 1752 960 -1201 -344 511
1042 511 -880 584 1831 -1400 -775 982 -1255 -357 2423 154 -1996 -82 311 -442 1916 420
1058 420 -1667 548 705 -664 639 1676 -309 -1702 437 -36 -356 1207 -432 -1705 111 175
1074 175 -332 758 1692 -889 -1943 1124 802 -223 1441 -388 -1775 844 439 -586 884 784
1090 784 -2051 -1070 1473 -315 -803 1030 -948 -935 966 162 -362 1394 292 -1935 229 1842 295
1107 295 300 120 -1178 -62 1187 197 -423 381 -673 -1958 823 1364 -1092 -14 -76 -705 -25 662
1125 662 253 -195 759 -560 -1656 1711 1385 -1052 -166 97 -763 -126 1101 -128 -917 368 -969
1142 -969 -1030 1831 337 -1510 500 317 -796 493 843 -506 286 663 -1268 705 2010 -574 -1125
1159 -1125 437 -80 -281 590 585 -857 -398 -58 -990 987 746 -1049 -509 365 263 -500 471 1267 -872
1178 -872 -58 174 -443 1019 1173 -1404 -697 1079 -61 -589 1156 -211 -1582 136 -31 -660 1245
1195 1245 73 -1421 215 826 -279 190 1170 -316 -627 202 -98 463 1166 -471 -718 182 616 -151
1213 -151 87 743 -989 -837 263 219 342 286 -649 -786 588 528 -653 465 850 -1395 -422 929 234
1232 234 325 76 -705 -647 834 354 -695 490 -103 -1526 362 1455 0 28 -53 -601 -359 1223 -91
1251 -91 -596 734 -400 -1213 978 565 -130 -92 -352 -701 -35 1119 -415 -145 283 -599 -237 907 466
1270 466 -191 -312 104 -131 222 916 -587 -330 752 -609 -472 846 217 -1092 -274 156 -633 487
1288 487 610 -1225 -172 385 -622 198 1406 -202 -1200 381 205 -149 752 -73 -827 401 255 -372
1306 -372 501 616 -530 -796 364 131 -313 869 -89 -662 384 -53 -211 665 413 -901 -733 868
1324 868 364 -150 580 -256 -716 264 -38 -215 600 151 -948 -255 800 -263 119 526 -741 -380 451
1343 451 -97 -323 733 -211 -1236 496 873 -618 239 409 -513 123 367 -1 -123 687 -172 -455 946
1362 946 436 -465 332 57 -801 -230 247 -133 -117 -96 -1051 -488 1107 264 -573 219 -68 -605 -77 743
1382 743 -30 -8 404 -260 -164 1246 132 -604 589 45 -674 291 435 -391 -182 -210 -973 585 841 -538
1402 -538 -337 266 -164 -186 780 275 -272 -53 -133 -117 666 615 -417 -399 -22 -133 -290 604 72 -815 -300
1423 -300 -156 -410 417 598 -773 -168 368 -38 218 712 -30 -588 497 174 127 742 90 -683 142 186
1443 186 -380 140 337 -659 -768 160 -227 84 485 -383 -382 525 417 -119 383 270 -518 39 654 157 447
1464 447 439 -634 -495 345 -58 -366 219 127 -734 -372 244 52 -72 24 -431 -55 685 184 -17 444 164
1485 164 -476 481 822 -135 120 184 -740 -14 476 -230 -335 186 -441 -553 251 298 -467 -19 -152 -226 206
1506 206 473 -75 229 248 -158 177 895 362 -587 -34 -221 -228 204 34 -366 -65 126 -388 -310 504 -108
1527 -108 -419 148 -168 -10 348 291 -136 22 375 74 115 606 -394 -261 264 132 28 150 -278 -516
1547 -516 165 -2 -551 401 321 -632 -182 118 -37 -78 608 81 -504 60 290 -123 406 109 -520 -310 371
1568 371 -53 -16 294 -126 -484 78 -13 -156 554 -113 -399 153 418 -1 -8 185 -340 -217 544 253 315 436
1590 436 -544 -464 495 152 -186 158 349 -447 -288 141 -147 142 109 -434 -187 160 106 -204 163 17 -279
1611 -279 289 231 -38 129 -137 -158 96 301 232 -229 158 -84 -647 153 429 -450 24 -197 -537 179 363
1632 363 -33 -342 253 -226 -202 608 247 -258 65 -87 -144 292 36 -116 -213 381 8 -302 463 146 -244
1653 -244 -231 -272 -252 97 -32 -304 -148 -40 -406 152 361 146 -59 -175 87 -116 369 512 -473 71 419
1674 419 -224 120 189 -223 -360 -102 -43 -107 108 113 -608 192 -116 -163 446 41 -228 -354 51 61 169 408
1696 408 -409 -250 528 -118 -193 141 273 -357 -293 118 -302 -373 175 -173 -335 334 -144 69 215 -55 -31
1717 -31 -365 521 -53 -17 178 -292 53 502 129 -136 64 -55 -301 170 194 -484 201 47 -402 327 193
1738 193 -121 82 85 -217 -107 194 428 -61 286 -211 -98 251 370 -21 -35 -71 -150 -247 433 152 -428 -56
1760 -56 -138 -170 116 341 -152 -50 -93 -344 77 663 52 -112 346 -134 -149 310 220 -152 -72 266 -227 169
1782 169 322 -124 -160 180 -163 -198 324 -20 -144 151 102 -50 395 231 -310 -136 141 40 133 83 61 -156
1804 -156 -93 76 -223 68 -78 -296 -151 367 87 192 -47 -294 -92 62 -37 -246 686 -25 -250 117 431
1825 431 -185 158 208 -245 -218 290 -62 -193 62 -219 -157 26 -139 -55 285 -61 -109 -27 95 -88 242 -15
1847 -15 -300 -64 305 367 -317 -75 -48 -60 43 23 10 86 -230 -176 237 24 215 -113 193 -277 -254 77 282
1870 282 -21 93 14 -248 662 392 99 -87 339 -217 -6 239 -34 -65 50 -186 -135 -76 56 -217 -201 188
1892 188 -134 142 157 -191 -64 102 11 -62 111 167 -263 -190 201 -304 141 317 -113 -210 127 -210 -23 -7
1914 -7 -35 -270 -135 -81 -324 19 363 29 -76 119 -144 -192 407 38 -61 182 -53 -122 -51 -132 -82 18 -116
1937 -116 11 -47 133 -174 -37 -19 24 -42 495 -306 98 -68 -59 -197 77 136 -251 44 42 355 -125 153 149 -119
1961 -119 16 11 -134 -156 238 -178 -124 200 -81 -293 86 -86 -133 136 551 -53 135 210 50 52 46 -31 -29 138
1985 138 -258 -152 -137 402 -157 4 -120 -322 41 33 161 -43 198 -34 -185 390 20 -141 163 172 10 46
2007 46 49 -115 84 -125 -201 96 219 -136 -16 52 -153 -46 -19 -87 -70 99 -114 -245 186 204 -110 118 110 81
2031 81 -40 220 -164 -68 175 104 -49 71 -30 -39 212 -279 -295 4 -62 -199 44 -314 112 45 280 204 -21
2054 -21 32 73 108 -248 221 -175 28 65 -214 -60 -162 -37 -263 150 169 134 -34 -157 -253 110 -22 77 -80
2077 -80 160 -74 -308 375 -14 -196 119 -84 135 240 117 172 167 14 -470 -196 65 37 -21 186 -166 -166 -189
2100 -189 81 -46 115 82 205 35 289 141 -300 62 47 -214 -132 254 -159 220 150 -238 182 199 -138 53
2122 53 21 -23 -64 209 217 -37 -5 -149 60 129 181 -256 114 193 47 4 177 109 -164 -225 -161 56 172 -92 -98
2147 -98 -142 -19 -229 69 31 -250 -101 -207 -153 -114 134 11 26 105 102 -113 188 317 -115 -73 104 -83 37
2170 37 71 159 -241 56 107 -56 140 131 -261 -229 185 -63 -50 -116 81 35 -258 34 19 -49 -65 -379 24 119 28
2195 28 214 -138 -33 43 -9 91 65 24 -9 -55 -3 172 169 -123 72 -222 -62 -59 203 156 -2 100 -99 128
2219 128 2 -50 14 -52 -114 -163 97 10 -41 50 41 -90 377 71 -257 -170 9 -21 357 -43 -117 -257 -149 -214 224
2244 224 214 -69 -177 131 -169 -69 137 238 -96 12 135 -200 -30 -250 -109 -44 8 23 -6 127 78 -46
2266 -46 27 -245 -39 151 96 -25 -328 185 -82 16 296 -101 22 249 -48 153 129 15 54 -39 214 -33
2288 -33 -122 64 -179 141 67 68 230 250 118 -123 9 -19 -121 134 122 215 73 249 28 -47 297 -126 -137 179
2312 179 -3 -195 -188 62 -116 94 -96 -1 -129 209 33 -130 -60 -143 -319 175 142 -26 209 194 2 223
2334 223 164 10 -151 154 54 -90 260 -187 -29 -154 27 -149 -116 -99 -265 -73 135 -53 73 -87 -27
2355 -27 -255 -107 133 89 -49 113 33 -27 106 -335 -16 149 -179 -191 -130 56 48 234 -17 -194 -74 124 -93
2378 -93 345 -6 -303 -162 -21 28 -9 -181 17 -133 57 -72 -131 182 -222 -73 -211 53 -251 -59 -130 -40
2400 -40 -280 -20 -47 -429 -6 -163 -120 20 199 -42 -215 110 -109 62 61 -143 -164 289 -127 63 74 296
2422 296 -210 -51 144 -82 178 -137 4 -82 -50 -186 -44 58 -153 -11 27 -78 141 -11 -140 47 -113
2443 -113 -152 6 -111 108 71 -234 177 114 -138 -107 143 10 88 143 118 -208 -50 -155 -92 51 -201 87 -55
2466 -55 43 -176 225 197 227 281 -182 123 -37 -105 -233 -28 -181 -28 -30 17 67 -3 58 273 -39 219 43 133
2490 133 -2 -30 -176 -132 -58 -195 -95 73 -248 -197 40 248 119 -138 170 -3 51 -120 67 -117 -19 -51
2512 -51 -1 6 -35 -124 -153 -61 -138 -94 297 84 -227 165 -20 -175 -17 64 -329 22 -178 -86 95 107 -66 -116 306
2537 306 -136 35 53 236 24 -37 -16 -166 -38 217 268 -31 84 107 239 -49 -22 -72 239 19 -189 21
2559 21 90 99 100 -21 104 87 -27 -121 167 11 -90 -6 -94 -157 -60 33 4 299 142 276 -171 285 87 127 61
2584 61 212 -104 -229 138 101 -28 152 36 -18 -62 -26 -29 -76 159 -183 -218 116 -135 164 -116 -175 -224 316 26
2608 26 -6 305 117 80 66 327 -103 86 -93 -13 -67 114 -32 245 73 -133 -37 38 80 131 125 101 34 -195 -1
2633 -1 -15 -81 -36 -29 -218 185 46 -104 14 -29 264 -59 -5 3 -60 151 97 -34 -80 -51 -201 -90 345 -179 61
2658 61 -139 -61 -44 285 166 161 -33 -190 -12 -75 12 -96 77 -87 -19 198 -68 194 -333 18 -15 -81 -13 143
2682 143 -186 1 167 -79 201 -7 -45 -40 202 -60 -291 -123 177 -90 118 205 -48 143 -70 -141 272 -27
2704 -27 -133 -98 233 -70 -145 39 142 173 81 -87 -60 101 -39 -42 166 190 -101 194 139 -96 -32 187 78 -270
2728 -270 -79 9 -54 238 7 -30 -89 107 -68 -68 137 -242 -139 -130 114 23 133 27 3 -108 348 -83 -59 -106
2752 -106 165 -103 49 32 346 5 144 37 -82 -100 -195 95 -106 49 -193 -47 -60 -60 54 -163 133 44
2774 44 -66 121 212 273 -221 -229 -49 193 75 94 -52 -358 -21 -291 -158 -104 93 -134 7 102 -33 23 232
2797 232 -262 167 -62 -244 87 -2 273 -72 101 216 -25 -106 183 -147 132 70 -132 -48 -155 69 342
2818 342 55 26 -236 -63 0 -297 -47 151 83 43 80 43 -95 197 70 -8 -103 141 77 33 -88 -52 257 2
2842 2 -4 -84 36 -44 145 -135 102 -187 -70 34 30 125 -38 -201 204 16 -254 -34 233 28 -151 -130 153
2865 153 -277 54 -120 -325 37 23 0 -39 160 145 -43 73 -134 -62 -105 -224 158 50 119 -333 11 -99
2887 -99 -56 184 195 255 162 -22 -130 -68 107 90 184 83 216 49 -173 -317 87 -17 -19 38 -287 222 -14 -78
2911 -78 -8 -158 -176 -170 45 -237 41 -244 -120 99 232 134 -225 85 25 -102 39 -168 15 203 -59 102
2933 102 202 23 48 78 -170 49 -114 67 -106 -80 49 96 -110 -33 -67 65 -11 -26 -4 166 -145 174 -270
2956 -270 -95 109 209 82 -60 93 -111 111 61 -11 32 -367 42 81 27 -26 66 137 -193 17 -42 73 -52
2979 -52 147 -130 -101 167 -3 -13 129 -109 -101 37 90 -321 -170 146 -186 -170 234 -185 161 102 -77 -75 -26 -12
3003 -12 -38 24 77 -94 267 -130 -226 329 0 -29 70 135 186 -28 -76 -13 -80 -122 242 -166 40 -7 109 219 219
3028 219 -139 46 321 -186 99 -147 312 -150 -26 120 37 -82 -95 -112 -104 -42 -75 -63 88 -11 -162 156 109
3051 109 79 9 367 61 79 30 -196 141 237 32 77 206 217 80 32 -17 47 201 282 4 -40 -279 98 73
3075 73 67 99 61 44 20 27 -146 -74 -99 60 48 73 -19 197 -25 -90 -201 216 129 263 13 -57 -44 -33 -64 -122 202
3102 202 -2 58 227 -29 -233 42 16 155 63 -395 96 80 110 -176 -216 85 -256 -242 -166 -72 -179 155 -203
3125 -203 18 -147 143 -135 -183 -96 94 -92 136 103 117 -131 86 98 60 164 3 188 -33 129 50 -85
3147 -85 62 276 -10 -84 -180 -126 -83 55 -21 -115 -226 36 -151 -13 -193 -6 48 5 214 -117 180 -277 20
3170 20 -5 1 35 249 -253 -91 3 208 287 -133 -19 -82 1 -157 13 -220 -15 38 126 -59 -27 249 -220 66
3194 66 261 432 36 42 316 15 263 -34 -38 189 -102 -93 212 -38 -37 183 7 181 -18 -22 144 -7 228 153
3218 153 -38 109 94 2 30 112 -39 304 63 -8 -134 104 234 -55 37 -218 -48 66 18 96 28 154 -74
3241 -74 323 13 284 -83 -41 -266 76 -121 -81 -92 102 86 -234 212 64 -165 -91 -28 -14 -75 -72 -40 204 -141
3265 -141 101 218 137 91 42 -9 -117 -50 -142 53 43 -40 -25 201 -280 -84 114 -361 -12 -109 -5 -58 117 -183
3289 -183 219 28 -159 54 12 -123 -141 -4 118 -34 -21 76 44 -203 -190 43 -92 231 110 71 266 133
3311 133 85 85 -230 -203 97 -8 17 51 -78 67 -68 -41 -16 -52 -158 77 260 108 38 -254 -51 73 54 -56
3335 -56 -108 258 -74 -98 3 -58 40 -86 -61 38 -64 49 228 -135 -51 124 -76 -146 9 -31 -34 94 -54 -138
3359 -138 37 -2 87 -210 -35 94 -78 208 11 -38 -174 -93 -307 -122 2 78 73 -149 53 314 105 -25
3381 -25 -231 -67 -111 99 160 -70 -72 140 -93 -172 -125 98 115 122 110 -17 137 -142 -22 -25 1 -72 -21 -204 207
3406 207 -150 -120 -20 -41 -204 53 -204 54 48 53 47 35 100 62 -47 -133 114 -73 135 -73 -97 194 -107 -14 -50
3431 -50 52 -131 317 -74 -182 11 33 -117 46 -110 -67 162 66 5 34 -135 268 -40 -62 58 -3 93 50
3454 50 -71 -15 -113 324 -117 -10 -84 216 -144 -137 -164 -331 182 -215 15 11 35 65 1 -52 -164 -63 -46 215 118
3479 118 103 -298 113 122 -184 15 158 89 -82 -151 23 -92 -60 -15 -190 206 -58 19 -67 -12 -45 20 139 34
3503 34 -60 -19 -129 25 3 -72 57 14 -25 58 -111 -6 -398 -99 49 13 48 -141 29 -51 -44 59 103 291 187
3528 187 -162 50 -150 -63 -26 55 90 -141 22 -83 -537 22 -213 -75 83 -226 18 -79 58 136 205 190 -47
3551 -47 11 12 -21 -147 97 68 -42 89 -56 338 -152 -28 79 -55 313 49 -15 -11 42 -110 -17 -55 185 26
3575 26 -108 118 -301 121 17 -190 -239 -62 173 -98 38 -184 -67 0 4 -142 8 -134 47 31 35 -19 -72
3598 -72 27 12 7 92 240 42 73 -62 -235 -190 22 -77 104 21 -212 165 28 2 82 -34 -272 -457 -115 -124 281
3623 281 -61 183 -33 164 78 59 12 81 4 -122 -22 -120 -69 -149 -60 20 56 -39 94 -116 -213 194 -82 -140 16
3648 16 -199 198 250 68 -54 -30 -8 201 149 -85 134 87 10 164 58 11 -183 -72 331 -132 12 45 -2
3671 -2 -107 -15 -16 -11 45 75 9 -9 29 83 -4 -72 103 -8 17 107 -68 247 -49 -288 -197 -21 -95 -93 42 72 -134
3698 -134 -108 57 50 -100 52 -54 -59 -98 -50 0 -124 63 -26 44 -158 113 15 -101 117 133 109 150 -96 -8 -159
3723 -159 -240 -92 11 94 -141 -54 152 -77 110 -68 36 214 18 74 59 2 238 11 218 108 -393 -165
3745 -165 49 197 12 113 -17 -28 14 -209 102 24 -29 178 -375 171 55 310 118 16 -21 87 93 -27
3767 -27 -82 365 -67 -36 17 -203 -235 101 177 12 344 -20 -95 0 -123 -54 125 -41 -185 90 112 111 -118 -163
3791 -163 2 -131 -124 -9 39 -79 -34 105 99 -92 -151 -35 108 65 -211 -109 -164 -104 62 117 -158 144 359 262
3815 262 -146 44 -52 -57 123 67 90 90 71 9 22 -182 -105 144 568 -246 167 100 -81 -3 101 -129 113 121 149
3840 149 -37 -34 -43 268 34 253 -79 236 53 -156 -144 59 29 -135 46 64 -62 -117 71 41 84 172 65 27
3864 27 136 -29 -114 168 133 84 -12 -256 -81 -65 307 -31 10 -126 171 70 193 -127 54 -9 -196 142 -58
3887 -58 -84 -32 -308 -290 167 -105 226 10 -79 92 102 25 -189 -90 193 -144 -206 29 -93 -39 70 14 118 -105
3911 -105 26 67 4 139 -22 136 46 -66 13 -57 5 -163 -164 138 78 104 39 -200 -133 -35 -19 -109 -76 -165 145 -97
3937 -97 51 70 -86 -119 -3 -115 23 -278 20 131 276 -160 60 73 -53 12 82 81 -34 -286 -182 -35 -170
3960 -170 174 -91 229 94 -146 9 63 124 10 -5 -99 88 8 105 100 70 114 -108 83 -45 63 49 133 -191
3984 -191 218 80 -20 -26 -11 52 139 -20 -115 -101 31 147 86 199 123 64 -186 -154 191 7 -100 -77 30 -45
4008 -45 -62 38 57 -108 38 65 149 87 73 -43 -101 -15 -355 -45 -129 176 180 188 94 39 256 -125 106 74 103 0
4034 0 47 -92 -148 111 -53 -114 2 -99 34 -224 -132 -177 23 -16 -103 -77 147 154 -145 -275 -112 15 85 102 133
4059 133 -63 187 -72 146 37 -64 -15 22 185 136 4 -56 154 -50 253 56 -86 144 335 82 -57
4080 -57 -57 167 49 -247 -123 -107 114 230 -86 -152 -359 114 43 -153 -5 4 41 -80 261 249 -60 -9 67 162
4104 162 13 -34 -86 30 -55 -135 -180 177 -321 -201 168 136 -124 76 57 61 -77 123 -68 215 215 -381 65 -18
4128 -18 -143 100 -78 271 26 -170 -71 334 72 -1 -48 401 -78 -50 79 -109 -317 172 -133 -71 163 -378
4150 -378 191 -205 -194 15 203 220 92 -69 46 117 -116 24 56 -207 -76 115 212 -99 58 21 -34 157
4172 157 -30 79 177 -79 -81 -37 -190 224 13 66 23 0 -283 225 270 37 -58 118 -158 40 -12 -321 304
4195 304 241 89 123 -102 54 -37 69 -70 -29 -5 -12 133 102 -115 282 -23 -79 73 139 91 -191 65 74 56 -259
4220 -259 -97 -328 -330 321 242 89 -4 -95 127 52 -159 -32 289 -46 -149 -40 -140 63 47 63 35 53 6 70
4244 70 146 -172 -18 -272 -58 -25 103 -91 -101 -157 -104 -12 -11 18 -83 -21 -137 50 187 -283 58 49 235 81
4268 81 92 -18 45 363 5 -201 84 77 97 142 129 -179 -229 75 -170 -143 -1 -229 -167 73 34 -133 18 -189
4292 -189 276 142 -6 -69 196 -6 144 11 -324 -74 -234 -36 51 351 -221 -102 -10 -1 -4 -36 7 -206 24
4315 24 33 -184 -43 134 227 -84 9 -41 21 84 -43 -136 -62 32 29 -143 118 -284 -102 175 101 -67 33 25 40 -89
4341 -89 20 17 -21 -180 -33 56 -120 118 142 9 -33 219 -408 -143 -171 121 202 -60 171 179 7 -5 27 -57 -87
4366 -87 -65 -68 -5 -280 -43 -107 -133 180 167 31 -153 196 -34 184 85 -73 -66 -311 50 292 65 70 29 159 -34
4391 -34 291 -5 -81 -6 -486 43 49 28 -139 -71 165 42 51 -293 248 -146 61 -106 113 -9 -178 -166 28
4414 28 46 -89 -222 192 220 -327 -9 -27 -226 43 131 90 -189 -77 85 -314 -47 -57 416 124 -26 139
4436 139 -5 -208 277 150 -6 137 -117 -64 -53 -78 -116 39 145 83 -430 94 -125 77 -43 -95 -380 121
4458 121 97 -50 -92 -158 35 44 -61 -185 146 -40 162 50 8 61 7 8 268 -191 -110 112 23 24 -54 -16 -243
4483 -243 -173 -223 -18 114 42 -2 169 50 33 8 178 -22 -26 -156 8 263 84 152 50 -54 185 -75 10
4506 10 -53 138 60 30 56 11 -58 -144 63 144 57 -127 34 95 44 255 54 219 159 89 -28 -128 -79 -216 42
4531 42 -67 -179 3 -6 18 -303 -55 -226 -106 -4 -146 124 108 -180 -89 30 -146 -159 -90 -116 96 -49 -25
4554 -25 -188 -279 -78 -44 324 -237 38 -91 1 187 -123 87 37 99 -117 11 62 23 56 -27 169 109 -60 -57
4578 -57 25 -220 46 47 6 -10 -1 39 39 112 4 67 -97 106 33 123 -50 -88 55 -24 -125 -61 118 104 -240 -131
4604 -131 107 140 -208 -182 126 105 -147 207 -75 -37 -42 -119 232 -38 -34 -94 34 174 29 45 -58 -90 -150 -24
4628 -24 157 -203 27 230 -34 91 178 171 -70 -161 -72 -100 -103 -84 -235 64 82 102 414 23 -17 -85 -60 158 -173
4653 -173 -32 133 295 -37 162 1 85 150 -186 149 -122 35 -61 -68 112 -68 254 135 -202 39 96 244
4675 244 -87 -14 17 -66 151 -51 -8 133 82 3 127 -108 -35 -143 125 70 -5 -330 1 -48 -228 183 -385
4698 -385 -6 16 -48 -169 -11 -167 -93 -269 -66 6 -98 -123 -336 88 -47 -152 101 -91 21 -30 140 46
4720 46 168 2 25 68 79 -87 -42 145 -80 -196 191 75 -28 158 204 14 -53 20 -40 -132 223 26 -122
4743 -122 78 -29 10 28 221 -97 -160 -175 260 -66 185 -265 88 -32 154 -19 -179 136 -14 -224 9
4764 9 -14 -61 158 -177 -52 240 454 -9 94 -20 154 -51 -189 -255 -146 -158 111 -209 -16 217 -46 75
4786 75 -22 92 -80 -41 178 137 21 -166 -138 -287 92 -18 -25 -45 -31 -45 -145 -15 199 -102 36 63 160 -255
4810 -255 -204 -139 -80 -53 0 -96 -2 215 -71 114 77 224 206 81 144 25 30 127 -51 -95 34 -35 51 -325 -387 -120
4836 -120 3 122 16 -43 -12 52 -59 -36 173 21 51 -50 291 46 -138 -11 126 -91 111 116 43 313 81
4859 81 -139 -191 -145 24 220 93 -306 164 -8 -80 -138 -62 -84 -101 -40 246 4 194 -253 -222 152 -36 63 -75
4883 -75 29 -13 15 98 -21 121 -137 54 22 127 -2 -118 -321 71 -12 -41 18 7 176 -2 -66 -122 -112 94
4907 94 29 188 57 130 -183 178 295 175 110 -23 62 47 -9 -156 -84 -188 -21 194 110 146 -133 70 156 -29
4931 -29 -53 203 -20 139 -32 -95 24 28 -10 136 10 135 -17 282 -44 72 -324 119 105 -205 120 23 141
4954 141 207 64 52 51 38 7 -89 90 -28 -77 288 -28 133 -5 -80 149 185 95 -140 -24 -114 38 56 -2 163
4979 163 -198 274 16 -120 34 -136 -67 -56 7 91 57 -226 27 -56 313 161 -47 -165 76 100 300 295 111
5002 111 17 -158 -7 61 -44 -206 140 35 102 -225 -8 -118 177 -16 -123 161 157 55 -168 -97 133 216
5024 216 172 -334 191 -28 -61 430 -58 -128 15 -184 -62 115 -70 -4 -72 41 -48 78 87 53 -102 -29 -181
5047 -181 53 15 28 -91 73 63 -50 -35 -181 -168 -106 -137 114 -111 -272 -74 -36 40 -150 14 88 197 44
5070 44 -55 -140 -70 97 -42 191 94 -110 -55 125 62 -239 73 -87 -58 10 41 -80 -28 135 -35 153 -38 129
5094 129 -303 -151 25 -26 -11 10 -294 -158 3 75 -30 197 77 15 -150 201 -82 -134 139 144 31 135 141
5117 141 -15 14 107 180 196 -10 181 79 16 -108 -65 -118 -193 -164 -143 141 -234 -33 -42 -352 211 125 6 17 37
5142 37 31 -34 20 9 106 457 -60 188 -14 94 126 -310 49 48 124 74 -40 -112 128 -76 40 243 -177 -198 86
5167 86 -44 -45 -80 -99 -141 -119 -47 -218 196 -16 -54 238 -188 -62 -193 -31 116 -50 52 -65 217 30 -134
5190 -134 -66 21 -59 -241 127 -179 -192 -54 235 68 -25 -9 29 77 -36 -150 115 123 19 -16 102 105 -15 235
5214 235 -150 -13 124 -17 58 -7 -174 108 16 -217 57 42 -86 -1 -155 -148 -107 162 -50 -208 -52 215 -11
5237 -11 96 -95 165 -140 -193 162 -200 79 282 58 -95 -127 48 63 276 -105 129 37 -113 -47 -92 228
5259 228 -124 -19 -37 352 26 110 149 148 -276 -111 63 5 73 127 -53 -81 -179 31 -4 -43 51 -127 -82 -224 230
5284 230 332 108 -35 -138 -28 93 212 -26 98 135 -118 89 -223 -58 203 -15 -68 127 97 42 55 6
5306 6 -82 -188 10 209 -147 -21 -35 197 8 61 261 -130 61 -231 -48 115 8 -21 87 -35 204 -40
5328 -40 94 141 3 -59 252 6 -59 126 169 158 110 -81 -151 148 -1 -334 65 -98 -170 92 68 73 268 61
5352 61 142 -96 131 204 165 77 -47 12 122 59 103 170 -73 17 106 -49 204 68 -87 57 -119 -7 -117 -232
5376 -232 -37 153 197 46 56 205 -118 -305 -186 116 175 -218 -50 -216 59 -17 -168 113 -22 81 -376
5397 -376 -187 176 -15 243 88 19 4 30 -83 -189 54 -154 -43 -151 8 23 22 57 -29 -31 -114 -25 187 65
5421 65 -50 -53 -118 71 243 -102 -104 8 -99 115 -106 6 60 109 159 166 -158 -90 31 138 -80 -47 19 116 76
5446 76 -108 3 -101 -103 -275 246 204 108 53 184 42 127 103 274 106 -58 81 2 204 -2 -217 57 -26
5469 -26 83 66 -60 124 -77 200 -98 -292 -118 102 156 201 -161 -125 17 -72 73 -243 -229 -69 215 -13
5491 -13 -295 -25 113 -268 63 236 19 -56 -137 1 34 -58 27 -360 -39 24 -112 -43 -103 -226 35 -51 45 16
5515 16 102 -4 315 -196 245 -111 89 -77 -31 178 -188 82 -131 -312 -305 101 -86 -64 68 -45 -95 320
5537 320 114 -196 -183 49 -341 -113 -390 117 62 160 26 -12 -28 -93 41 -80 -43 -8 -95 -34 -124 196 66 9
5561 9 75 50 -36 -67 27 -49 9 -139 46 -188 -35 -156 80 176 46 -81 -180 -36 -61 -98 101 109 -251 83 -249
5586 -249 114 -59 -251 17 -97 45 -21 -165 95 34 96 -34 -234 -48 -246 -211 126 -134 43 -203 529
5607 529 -109 -24 -98 142 -61 -21 40 -58 194 -19 -27 70 6 100 337 59 89 -364 63 -109 339 161 -252 32
5631 32 -97 -151 89 -76 56 -95 -52 86 -51 -506 60 -54 -135 -116 136 -25 71 -96 -17 209 -311 137
5653 137 -12 -183 178 78 159 158 61 -140 -4 1 -64 193 -123 103 2 -50 35 -282 -154 136 -50 39 -256
5676 -256 257 91 -9 -125 16 -180 189 110 -257 46 -224 -86 129 -120 -101 62 162 31 83 -95 106
5697 106 -48 261 -189 -49 166 -219 -19 -53 80 -86 120 -131 14 113 56 -42 36 -241 -81 -58 -10 97
5719 97 -125 -89 146 -132 -198 41 22 -133 67 122 -308 149 -76 236 168 17 -197 -73 33 -56 -94 -147 2
5742 2 63 65 -121 -84 16 73 -175 162 140 23 244 -101 -181 44 129 -277 -14 -12 -50 148 -109 26 -43 126 -83
5767 -83 -479 -54 -192 -86 -52 -105 54 27 -25 57 -135 68 -69 118 103 73 51 -114 144 176 74 -105 -168 162
5791 162 -121 51 105 65 -63 -37 64 -184 83 -89 -2 -57 -33 -98 136 -108 -286 -5 5 -130 81 76 75 126
5815 126 -90 -189 24 -39 205 -157 48 -90 64 -135 -280 -54 -9 240 177 -99 80 -81 -88 113 -79 -50
5837 -50 155 40 77 -267 100 -49 88 -235 4 107 2 11 -129 202 -1 122 -14 215 128 -27 145 -75
5859 -75 8 -7 41 -15 -14 175 9 -105 239 -96 46 172 -175 138 -62 217 -208 100 247 -11 -79 30 -25
5882 -25 -98 104 78 -48 -57 -52 112 -446 -16 -19 -95 30 39 44 61 87 176 -153 -182 81 -54 -174 27 -72 62 -13 -139
5909 -139 72 -112 97 -9 424 -16 169 173 152 -23 101 -6 43 42 -30 1 72 218 145 -10 -91 -21 188 39
5933 39 92 -54 -185 133 -210 69 126 50 -149 -31 37 216 -104 -37 78 -139 4 -123 212 64 311 -133
5955 -133 -80 -21 212 -135 -73 191 -12 113 105 -109 66 41 -290 9 -186 -129 -175 -148 46 -108 95 -31 49
5978 49 -49 -124 -79 68 -17 134 -80 -89 154 -250 -52 201 -4 53 -211 22 -138 -83 -203 -172 235 112 118 162
6002 162 86 62 -33 -38 83 -19 43 -233 69 79 118 -216 32 -139 -71 62 -147 38 173 15 218 -124 45
6025 45 70 24 150 31 -174 -24 -119 71 -84 192 179 -22 45 378 44 249 113 -36 -65 210 216 164 44
6048 44 -10 -226 107 125 20 32 -167 72 59 89 18 -28 -122 -45 -62 -102 -120 -20 111 -195 48 105 121 -102 29
6073 29 -28 30 -223 93 87 -220 92 56 81 183 -82 52 77 108 -216 228 3 188 228 -44 293 -88 -110 -187
6097 -187 -12 -275 189 -160 -221 -204 28 109 30 -137 -44 -152 -236 101 143 24 64 -152 167 -175 -59 -32 263
6120 263 230 -79 271 -193 -44 306 263 86 127 217 130 129 -131 -88 -18 -162 230 214 100 57 -157 200 119 288
6144 288 83 -91 -3 11 -93 -17 -90 66 133 -89 -249 -59 -244 170 -243 -320 -402 139 227 -30 282 -233 64
6167 64 -59 -18 -231 110 -4 194 35 54 -177 156 -91 111 -91 12 -150 -93 -35 72 119 -275 -14 -110
6189 -110 -14 -93 -4 324 -51 -126 -122 -97 195 115 135 -48 293 -283 270 41 -138 252 259 32 134 -169 71 90
6213 90 -269 -13 -71 -118 98 -79 21 -133 -221 -68 -49 -205 -203 193 -29 220 83 92 7 117 45 -19 -112 -160 266
6238 266 90 36 89 -141 260 119 -58 129 240 162 -31 -241 100 -10 248 -15 4 121 -117 193 -250
6259 -250 151 48 260 6 -223 8 161 81 68 131 -56 112 219 -78 204 -104 -100 -54 -98 32 88 34 15
6282 15 -27 -41 0 -230 -278 -48 -155 161 49 52 -8 70 -51 -44 52 23 37 -11 132 -90 -220 -285 -133 99 144 267
6308 267 -3 148 -198 408 -193 -50 35 -15 -125 -241 26 223 -49 -180 23 -104 252 66 -39 25 -177
6329 -177 -164 45 229 -2 82 165 278 -45 277 -50 32 229 -131 -18 154 -137 -33 -52 127 -187 -165 41
6351 41 -160 85 53 -111 -256 -250 -81 -278 -17 -46 80 150 -18 29 32 230 123 -12 -16 116 68 79 -155 -260
6375 -260 9 39 -144 175 90 29 -92 54 74 112 -163 -113 -166 150 -104 -61 1 -184 -6 13 -128 115 17 133
6399 133 212 229 -177 -101 33 -183 104 32 -78 15 -172 -177 198 -24 130 -75 100 -74 -207 38 -36 -184 -90
6422 -90 -8 -252 1 103 134 86 -167 113 5 -193 3 59 -76 -161 -37 34 -218 -73 -146 -73 54 -174 260
6445 260 136 123 28 -88 -158 -70 97 -56 -15 -13 24 -155 -9 23 78 -4 275 -80 -6 -14 -50 -49 -67 -115 222 -173
6471 -173 36 8 -168 18 56 -84 58 73 -33 -125 -107 5 -23 -66 138 70 274 12 10 45 -146 -208 -42 93
6495 93 105 169 -57 -105 -99 -22 100 -74 -108 -43 -56 -30 111 150 97 -84 11 -118 108 -20 -107 -12 84 -45 -207 -51
6521 -51 -189 85 220 -269 -137 22 -46 86 77 -99 -8 10 -80 72 -8 273 -63 -136 62 -41 -161 -19 49
6544 49 -24 15 52 115 -135 64 142 53 -69 -19 -213 61 80 18 75 46 251 -61 -234 100 -236 -116 7 -219
6568 -219 103 8 35 33 23 212 154 -1 104 104 117 126 71 -7 -251 -3 -190 -25 127 154 118 189 -63 99 -147
6593 -147 -85 -241 57 -16 4 -103 -5 -75 -94 -150 44 -54 183 156 -262 -149 -40 3 86 54 222 -35 -29 -90 -108
6618 -108 71 40 73 135 -75 -45 -79 62 -32 -89 -225 11 180 149 69 -106 61 -25 -199 -36 -24 177 213 70
6642 70 -27 39 18 -25 102 36 -76 -96 -125 57 -44 -21 117 32 97 29 1 27 -42 46 191 7 3 200 167 71 104
6669 104 55 -19 234 97 5 0 -59 277 330 -117 253 -258 84 78 -95 13 -54 53 -77 -48 418 -162 35 -9
6693 -9 -32 217 -84 -25 -213 -180 -155 108 305 84 -118 64 10 130 -338 85 100 -78 162 -15 -126 96 -231
6716 -231 -78 17 314 -9 481 49 270 29 85 -96 -96 170 -522 96 73 -68 58 316 184 87 -176 -332
6738 -332 18 -70 139 -28 -105 49 31 230 225 43 22 -154 71 -84 -137 9 212 53 331 22 -23 123 -220
6761 -220 92 -202 144 -200 -242 -202 -75 186 -66 -29 297 104 -34 93 -37 -117 -85 254 -43 -29 37 92 -74
6784 -74 90 -166 -193 192 -29 147 99 -115 -92 -225 50 131 48 -77 265 -126 -44 39 58 348 97 111 204 168
6808 168 25 98 -108 18 -7 -154 -194 -2 -125 -126 33 45 -51 51 109 -209 -88 84 141 192 153 -174 267 89
6832 89 8 226 57 31 149 -107 -31 125 -168 -258 4 -70 250 -29 -220 -278 55 172 64 -131 -131 79 189
6855 189 27 110 -216 -63 184 97 -122 39 -135 -61 -85 169 35 90 96 -172 174 113 -102 -102 -42 39 -70 63
6879 63 113 49 167 -80 249 49 9 36 -55 86 65 139 88 132 194 131 -109 -22 239 -365 82 253 -95 -118 44
6904 44 -170 -106 42 141 49 46 -14 242 2 210 34 -148 -9 -11 160 -40 -154 163 72 42 239 -231 29 -55
6928 -55 119 97 198 -127 398 -68 10 -91 -79 104 -101 127 246 -109 -227 126 210 224 -105 -163 41 -9 149
6951 149 -112 -181 -72 23 49 -16 73 -6 111 -126 39 -46 231 -150 65 -50 53 -211 92 -31 103 18 29
6974 29 187 -151 -133 109 129 182 -13 14 133 -175 223 -507 -201 -24 -367 72 261 110 29 9 -24 -56 -241
6997 -241 65 12 40 -81 276 -65 -128 1 85 119 225 154 109 -359 172 3 13 307 8 35 -106 -269 156
7020 156 218 -37 169 49 -92 -279 7 305 133 -169 149 -222 -33 86 0 -131 28 -7 -167 -19 241
7041 241 -158 -223 13 -14 -128 -41 -86 91 -292 -111 -234 -47 -134 -64 -1 207 43 78 -161 129 63 -89 -131
7064 -131 -25 13 -121 8 65 1 30 128 185 -209 4 -117 -261 67 -135 224 -66 66 48 -150 83 -11 16
7087 16 -345 -2 -2 89 -76 -193 299 -53 15 101 -85 3 -109 -110 110 -212 161 103 110 203 79 71 -153 -43 40
7112 40 238 -145 170 84 58 1 -255 164 -158 27 -100 29 -16 -147 128 46 -63 24 -76 84 -48 32 208
7135 208 -198 36 348 209 45 9 -162 -35 35 194 -70 -93 333 177 43 16 -5 168 204 157 -140 116
7157 116 -12 15 64 67 -97 201 -132 -64 -58 46 205 -176 -91 -286 -61 -33 26 -10 142 -22 -4 -77 32 -76
7181 -76 156 -136 26 -32 255 17 100 186 89 -108 87 221 -139 91 -159 -154 116 -36 -202 -54 -8 -207 141
7204 141 95 -74 73 -133 90 29 -68 -89 -213 -62 -166 32 18 117 -114 152 169 -30 -25 -40 102 -59 141
7227 141 126 -371 263 2 -122 -161 92 -127 -137 28 -30 159 14 98 168 -53 -30 -167 275 4 -114 136
7249 136 46 116 140 -334 -34 217 -44 63 -78 -28 226 431 50 -32 -112 0 191 124 -25 -138 244 105
7271 105 28 -103 114 -236 -102 -258 -443 -7 121 -28 -103 -123 -149 265 -82 -131 -140 60 124 -360 -139 182 144
7294 144 77 135 -32 123 -112 -77 0 120 407 82 -77 2 148 -118 303 152 38 44 -29 -69 87 95 75 -295
7318 -295 -95 -12 14 32 11 252 228 -18 15 139 -7 85 -154 -86 -191 -48 -15 93 -29 138 -264 -75 234
7341 234 -118 459 -67 -27 -218 -143 -79 15 168 -59 -168 79 -197 21 219 -33 112 87 144 110 -21 58 144
7364 144 -83 -32 -153 -293 247 132 73 -58 -81 3 143 33 145 -67 84 178 -283 134 -96 171 -231 -8
7386 -8 -20 -42 -58 -118 100 -97 100 79 16 262 -54 -252 82 -160 -10 220 -115 -104 143 -97 -23 -27 -291 114
7410 114 -66 -31 187 -281 56 91 -10 -43 -22 185 -222 -92 -79 6 3 -43 8 109 -22 103 175 -274 96 44
7434 44 136 32 121 139 -15 102 -8 -8 86 -86 -122 -22 -54 12 132 78 -96 14 -125 159 89 -236 39 39 -181
7459 -181 -21 75 125 51 -34 -10 171 -91 79 132 -208 153 -14 222 -39 141 118 252 -279 69 2 -51 -20
7482 -20 -37 -41 160 -152 -81 -4 -13 -23 -9 51 -117 -252 -112 97 25 -49 58 -46 143 -178 139 154 58 24 13 -102
7508 -102 -201 -72 122 130 62 -290 7 124 -27 -35 78 -115 237 147 -78 -8 43 -88 160 -28 -164 161 -71
7531 -71 -254 -4 -141 121 -4 -182 23 36 -33 -140 -166 134 194 9 66 120 -22 116 36 3 222 -163 59
7554 59 -52 -32 36 57 -34 -26 93 -89 -101 5 112 55 143 -1 -132 -329 168 -95 44 44 116 178 -32 18 133
7579 133 -58 107 -11 -39 -128 -52 198 48 -22 -112 32 451 92 33 91 -37 16 -50 -148 5 8 -38 -21 55 -140
7604 -140 -299 -95 -170 200 -92 14 113 -70 109 -16 6 75 -16 13 -43 -125 18 -100 153 196 -135 -124 -73 -47
7628 -47 69 0 -103 -61 -90 62 153 -16 -18 -167 16 -12 -72 -102 23 -139 6 72 -45 303 -140 311 200 100
7652 100 229 52 54 -121 15 11 -157 97 65 -44 82 106 152 52 125 -15 23 -63 42 -111 -96 -88 -26 -172 35
7677 35 147 -73 -136 51 -255 -19 -23 -221 179 98 -28 94 1 98 -44 22 -88 96 -24 -377 -156 -43 -181
7700 -181 -21 407 -19 -151 64 -40 141 -34 -26 -173 -43 121 -150 -10 226 -139 -76 34 141 134 81 193
7722 193 45 111 81 -275 -4 128 65 3 170 -12 6 170 -28 -94 -225 144 415 -117 70 -81 121 -56
7744 -56 -95 -54 -87 -21 -25 -12 74 -14 98 101 -167 -62 56 35 -99 -52 -90 -41 -92 186 -71 118 138 360 -197 -17
7770 -17 -146 -89 -205 30 238 123 -92 170 -30 -48 51 37 104 -130 266 -50 -40 -15 114 4 50 -67 -184
7793 -184 -83 -46 -1 -102 -49 -110 -55 81 -140 261 -274 -234 -115 -103 -139 47 36 -30 57 -33 -10 -16 -290 -151 -82
7818 -82 153 73 151 -60 -23 36 36 193 26 155 -308 149 -35 32 -1 -30 -65 11 191 86 98 -145 208 -68
7842 -68 -120 -114 18 153 74 -77 -179 240 76 -33 -260 1 -51 88 3 78 106 67 116 -156 -334 6 -8 115
7866 115 57 29 -240 -38 197 189 -79 143 102 68 208 -74 88 81 -92 -303 234 302 -282 -47 -122 -103 -55 -5
7890 -5 46 -28 40 -54 -28 -140 126 -228 295 197 150 0 58 -12 -50 126 297 -10 144 -28 93 152 -54 -233
7914 -233 93 -225 8 91 68 -113 92 85 -11 21 -164 31 -101 -28 55 -94 235 53 -101 -133 229 3 228
7937 228 16 51 61 -97 18 64 13 -63 261 -107 -242 146 -51 -4 -58 51 -255 94 134 95 84 -260 -2
7960 -2 -268 151 -56 -153 128 44 56 197 -298 189 -45 -34 -16 -131 -39 -127 -179 2 -87 -20 16 41 -10 253 34
7985 34 55 37 5 -74 -46 142 -147 -128 115 15 -19 -3 -84 23 13 -17 63 29 314 -194 -125 -18 251 -93 -143
8010 -143 -138 -229 211 -175 -52 -38 -4 256 -270 -155 -35 59 -114 211 -129 14 19 30 86 -70 46 -78 18 207
8034 207 -187 -115 -51 -28 82 85 -60 5 -24 270 -30 -106 -102 -25 12 -4 285 -185 105 12 224 285 -92 -157 96
8059 96 13 -58 -220 -165 -213 51 -55 -3 -135 -226 68 -53 -41 -102 51 109 117 8 39 167 47 126 -33 56 -157
8084 -157 -178 -9 -410 -40 -40 -54 -113 58 219 163 154 250 -118 -57 -16 108 34 -152 -122 -9 88 -164 -66 139 96
8109 96 106 57 -41 275 33 304 67 95 97 32 32 -252 148 -155 -137 80 107 -276 -248 274 -8 -149 -54 247 -41
8134 -41 -18 -77 -178 89 -47 -1 -99 -27 306 -69 154 131 155 96 153 119 117 31 315 -93 -80 -175 153 -241 -26
8159 -26 -224 -108 133 -29 4 359 26 -75 92 81 -65 137 -7 -207 -106 120 56 179 -70 -61 -55 131 315
8182 315 34 139 75 148 52 44 13 305 116
8191A16
##END NTUPLES=NMR FID
##END=
