##TITLE=1H_LR-759-K3
 CD3CN+CCl4
 8 sc, 
 22.3.2023
##JCAMPDX= 6.0         $$ Bruker NMR JCAMP-DX V2.0
##DATA TYPE= NMR FID
##DATA CLASS= NTUPLES
##ORIGIN= UXNMR, Bruker Analytische Messtechnik GmbH
##OWNER= root
$$ XWIN-NMR		Version 3.5
$$ Wed Mar 22 13:51:07 2023 Russian Standard Time (UT+4h)  she@DPX200
##.OBSERVE FREQUENCY= 200.13135
##.OBSERVE NUCLEUS= ^1H
##.DELAY= (6, 6)
##.ACQUISITION MODE= SIMULTANEOUS
##.ACQUISITION SCHEME= undefined
##.AVERAGES= 8
##.DIGITISER RES= 18
##SPECTROMETER/DATA SYSTEM= spect
##.PULSE SEQUENCE= zg30
##.SOLVENT NAME= CD3CN
##.SHIFT REFERENCE= (INTERNAL, CD3CN, 0, 15.7039)
##AUDIT TRAIL= $$ (NUMBER, WHEN, WHO, WHERE, WHAT)
$$ ##TITLE= Audit trail, XWIN-NMR		Version 3.5
$$ ##JCAMPDX= 5.01
$$ ##ORIGIN= Bruker BioSpin GmbH
$$ ##OWNER= she
$$ F:/spectra/data/she/nmr/H-F/1/audita.txt
$$ ##AUDIT TRAIL=  $$ (NUMBER, WHEN, WHO, WHERE, WHAT)
(   1,<2023-03-22 13:49:33.23 +0400>,<she>,<DPX200>,
      <created by zg, POWCHK disabled, PULCHK disabled
       configuration hash MD5:
       00 E9 B6 7A A2 85 ED C7 34 08 36 98 17 FE 4E 26
       data hash MD5: 16K
       4D 49 29 F9 A0 F0 67 4F 0D F6 6F EF 11 39 36 B3>)
$$ ##END=
$$ 
$$ hash MD5
$$ FA E6 ED D8 CB 03 AF E2 66 42 3F E4 95 BB D6 CB
##$RELAX= 
##$RELAX= 
##$RELAX= 
##$RELAX= 
##$RELAX= 
##$RELAX= 
$$ Bruker specific parameters
$$ --------------------------
##$DU= <F:/spectra>
##$EXPNO= 1
##$NAME= <H-F>
##$PROCNO= 1
##$TYPE= <nmr>
##$USER= <she>
##$AMP= (0..31)
100 100 100 100 100 100 100 100 100 100 100 100 100 100 100 100 100 100 
100 100 100 100 100 100 100 100 100 100 100 100 100 100 
##$AQSEQ= 0
##$AQ_mod= 1
##$AUNM= <au_zg>
##$AUTOPOS= <>
##$BF1= 200.13
##$BF2= 200.13
##$BF3= 200.13
##$BF4= 200.13
##$BF5= 200.13
##$BF6= 200.13
##$BF7= 200.13
##$BF8= 200.13
##$BYTORDA= 1
##$CFDGTYP= 0
##$CFRGTYP= 5
##$CHEMSTR= <none>
##$CNST= (0..31)
1 1 145 1 1 1 1 1 1 1 1 1 1 1 1 1 1 1 1 1 1 1 1 1 1 1 1 1 1 1 1 1 
##$CPDPRG= <>
##$CPDPRG1= <>
##$CPDPRG2= <>
##$CPDPRG3= <>
##$CPDPRG4= <mlev>
##$CPDPRG5= <mlev>
##$CPDPRG6= <mlev>
##$CPDPRG7= <mlev>
##$CPDPRG8= <mlev>
##$CPDPRGB= <>
##$CPDPRGT= <>
##$D= (0..31)
0 1.2 0 0 0 0 0 0 0 0.06 0 0.03 0 0 0 0 0.0002 0 0 0 0 0 0 0 0 0 0 0 0 
0 0 0 
##$DATE= 1679478572
##$DBL= (0..7)
120 120 120 120 120 120 120 120 
##$DBP= (0..7)
150 150 150 150 150 150 150 150 
##$DBP07= 0
##$DBPNAM0= <>
##$DBPNAM1= <>
##$DBPNAM2= <>
##$DBPNAM3= <>
##$DBPNAM4= <>
##$DBPNAM5= <>
##$DBPNAM6= <>
##$DBPNAM7= <>
##$DBPOAL= (0..7)
0.5 0.5 0.5 0.5 0.5 0.5 0.5 0.5 
##$DBPOFFS= (0..7)
0 0 0 0 0 0 0 0 
##$DE= 6
##$DECBNUC= <off>
##$DECIM= 32
##$DECNUC= <off>
##$DECSTAT= 4
##$DIGMOD= 1
##$DIGTYP= 9
##$DL= (0..7)
0 120 120 120 120 120 120 120 
##$DP= (0..7)
150 150 150 150 150 150 150 150 
##$DP07= 0
##$DPNAME0= <>
##$DPNAME1= <>
##$DPNAME2= <>
##$DPNAME3= <>
##$DPNAME4= <>
##$DPNAME5= <>
##$DPNAME6= <>
##$DPNAME7= <>
##$DPOAL= (0..7)
0.5 0.5 0.5 0.5 0.5 0.5 0.5 0.5 
##$DPOFFS= (0..7)
0 0 0 0 0 0 0 0 
##$DQDMODE= 0
##$DR= 18
##$DS= 0
##$DSLIST= <SSSSSSSSSSSSSSS>
$$ [...]
##$SUBNAM2= <"">
##$SUBNAM3= <"">
##$SUBNAM4= <"">
##$SUBNAM5= <"">
##$SUBNAM6= <"">
##$SUBNAM7= <"">
##$SUBNAM8= <"">
##$SUBNAM9= <"">
##$SW= 18.05172834244
##$SWIBOX= (0..15)
0 0 2 0 0 0 0 0 0 0 0 0 0 0 0 0 
##$SW_h= 3612.71676300578
##$TD= 16384
##$TD0= 1
##$TE= 0
##$TE2= 300
##$TE3= 300
##$TEG= 300
##$TL= (0..7)
0 120 120 120 120 120 120 120 
##$TP= (0..7)
150 150 150 150 150 150 150 150 
##$TP07= 0
##$TPNAME0= <>
##$TPNAME1= <>
##$TPNAME2= <>
##$TPNAME3= <>
##$TPNAME4= <>
##$TPNAME5= <>
##$TPNAME6= <>
##$TPNAME7= <>
##$TPOAL= (0..7)
0.5 0.5 0.5 0.5 0.5 0.5 0.5 0.5 
##$TPOFFS= (0..7)
0 0 0 0 0 0 0 0 
##$TUNHIN= 0
##$TUNHOUT= 0
##$TUNXOUT= 0
##$USERA1= <user>
##$USERA2= <user>
##$USERA3= <user>
##$USERA4= <user>
##$USERA5= <user>
##$V9= 5
##$VALIST= <valist>
##$VCLIST= <CCCCCCCCCCCCCCC>
##$VD= 0
##$VDLIST= <DDDDDDDDDDDDDDD>
##$VPLIST= <PPPPPPPPPPPPPPP>
##$VTLIST= <TTTTTTTTTTTTTTT>
##$WBST= 1024
##$WBSW= 4
##$XGAIN= (0..3)
0 0 0 0 
##$XL= 0
##$YL= 0
##$YMAX_a= 117764
##$YMIN_a= -107626
##$ZGOPTNS= <>
##$ZL1= 120
##$ZL2= 120
##$ZL3= 120
##$ZL4= 120
##$ABSF1= 10
##$ABSF2= 0
##$ABSG= 5
##$ABSL= 3
##$ALPHA= 0
##$AQORDER= 0
##$ASSFAC= 0
##$ASSFACI= 0
##$ASSFACX= 0
##$ASSWID= 0
##$AUNMP= <proc_1d>
##$AZFE= 0.1
##$AZFW= 0.1
##$BCFW= 1
##$BC_mod= 2
##$BYTORDP= 1
##$COROFFS= 0
##$CY= 11.3945322036743
##$DATMOD= 1
##$DC= 2
##$DFILT= <>
##$DTYPP= 0
##$F1P= 2.36226072786647
##$F2P= -0.459571619588291
##$FCOR= 0.5
##$FTSIZE= 0
##$FT_mod= 4
##$GAMMA= 1
##$GB= 0.15
##$INTBC= 1
##$INTSCL= 1
##$ISEN= 128
##$LB= 0.24
##$LEV0= 0
##$LPBIN= 0
##$MAXI= 10000
##$MC2= 0
##$MEAN= 0
##$ME_mod= 0
##$MI= 1.114404
##$NCOEF= 0
##$NC_proc= 0
##$NLEV= 6
##$NOISF1= 3.799351
##$NOISF2= 2.8
##$NSP= 1
##$NTH_PI= 0
##$NZP= 0
##$OFFSET= 15.70392
##$PC= 1
##$PHC0= -19104.71
##$PHC1= 6.40075
##$PH_mod= 1
##$PKNL= yes
##$PPARMOD= 0
##$PSCAL= 0
##$PSIGN= 0
##$REVERSE= no
##$SF= 200.130013532006
##$SI= 16384
##$SIGF1= 3
##$SIGF2= 2
##$SINO= 400
##$SIOLD= 16384
##$SREGLST= <1H.CDCl3>
##$SSB= 0
##$STSI= 0
##$STSR= 0
##$SW_p= 3612.71676300578
##$SYMM= 0
##$S_DEV= 0
##$TDeff= 0
##$TDoff= 0
##$TI= <>
##$TILT= no
##$TM1= 0
##$TM2= 0
##$TOPLEV= 0
##$USERP1= <user>
##$USERP2= <user>
##$USERP3= <user>
##$USERP4= <user>
##$USERP5= <user>
##$WDW= 1
##$XDIM= 8192
##$YMAX_p= 0
##$YMIN_p= 0
$$ End of Bruker specific parameters
$$ ---------------------------------
##NTUPLES= NMR FID
##VAR_NAME=  TIME,          FID/REAL,        FID/IMAG
##SYMBOL=    X,             R,               I
##VAR_TYPE=  INDEPENDENT,   DEPENDENT,       DEPENDENT
##VAR_FORM=  AFFN,          ASDF,            ASDF
##VAR_DIM=   8192,          8192,            8192
##UNITS=     SECONDS,       ARBITRARY UNITS, ARBITRARY UNITS
##FACTOR=    0.0002768,     1,               1
##FIRST=     0,             0,               0
##LAST=      2.2672688,     0,               0
##MIN=       0,             -107626,         0
##MAX=       2.2672688,     117764,          0
$$ Real data points
##PAGE= N=1
##DATA TABLE= (X++(R..R)), XYDATA
$$ [...]
1817g8p36J129J381r24p20K32O37j123o21M82R85n29q13L50P13j51j165M1J401
1836D91o85r04K74Q60R1o17O79R86l51q12k38M86K64p96J16O70N24r90N9O62q4
1857F85j185n62Q00K32r99p8Q37L69m46r7O19K92o54p45O28Q23o47k32J138O00
1877A378o29n90N48K91n18j031K57O93o24p02O47O71k72p03J73L38l11j288O24
1896a048J085l1l73N59J028o6j012j27N25j59o39o0Q57M47r17l2P29J04j208p24
1916a062J010m28m77l29R77P48p86j30Q16L69j245m86R93M17m55j99J018P68o95
1935H24o82M27K17o00r24N05L96m17m32J66Q00k03o16j13P33m05q44J95J286m
1955C09n34O08P95k65p70o4L68q5q83J45R30J47p01q8N51k6p22k4j26Q7l83m95
$$ plain form
1817 -78 -814 315 1696 772 52 284 921 -202 -823 -341 644 115 -698 -348 365 214 -951 -910 491
1836 491 -194 -1098 -824 36 127 -490 189 1175 824 12 -226 260 524 -272 -156 514 1038 48 107 769 685
1857 685 -500 -1062 -262 -30 -1029 -1107 -270 99 -347 -444 175 467 -187 -932 -304 519 -128 -360 778 1378
1877 1378 749 159 707 998 480 -551 -294 399 -225 -927 -280 391 119 -584 -411 -73 -384 -1672 -1048
1896 -1048 37 6 -367 192 1220 1154 142 15 540 381 -258 -318 539 986 69 37 766 870 -338 -1062
1916 -1062 -52 -480 -957 -1286 -309 439 -347 -477 339 708 -537 -1023 -30 387 -68 -267 751 1519 824
1935 824 142 569 786 186 -738 -233 163 -254 -686 -520 280 77 -539 -652 81 -324 -1168 -973 313 309
1955 309 -225 383 1178 913 143 79 447 362 -521 -376 554 701 0 -88 463 437 -285 -309 -435 -348 -731 -1226
1977a226R65M58k25l83P24L58n22n44K79Q07o70l56M33O75l54k28L59J97m55q63
1997e71N25K75l13o66M49P43k07n81L72P7m22l96J0R47J7l60j58J174q0o42r0
2018A03N89l15n64q2M53K67o83q3P53O8p31o84J056k17q07ON50N60l22l06N57
2039A68L80m23o15N42L98o26%M36O76l18n51K33K34k46p27L11M36p15k03J40L83
2060h7J87p23J88N43lj313Q58M52J1m76J58R30k29p66M77P42n48p11j14O43J03
2081C22m58k9N62J66o90l98O10n6p69o5P88L62l92j45N74K08m94n68N97K68n25
2102a32k87K42P34k95k12M19O0l99p10M82J48k71l59M12O08n10n88N46M62k82
2122F8o67J84P06m41j03j02J076k27m90M0O98l29n35k67O45r8n51J49O09k04l49
$$ plain form
1977 -1226 -261 197 -28 -411 313 671 149 -395 -116 691 21 -335 98 773 419 191 550 747 292 -571
1997 -571 -46 229 -84 -750 -301 442 235 -346 26 103 -319 -715 -705 242 259 -101 -259 915 835 193 103
2018 103 692 377 -187 -269 184 451 -232 -315 438 506 -225 -909 147 -70 -877 -871 -321 239 -83 -389 168
2039 168 548 125 -490 52 450 -176 -176 260 936 618 67 300 534 288 -439 -128 308 -407 -610 -470 -87
2060 -87 100 -623 -435 108 105 -1208 -350 102 113 -363 -205 725 496 -270 207 949 401 -310 -424 219 322
2081 322 -136 -165 397 563 -127 -525 85 29 -740 -805 -17 345 -47 -192 382 590 96 -472 125 393 -132
2102 -132 -419 -177 557 262 50 469 529 130 -580 -98 50 -221 -580 -168 440 -70 -658 -112 350 68
2122 68 -599 -415 291 -150 -253 -355 721 494 4 44 742 413 -122 -389 256 158 -393 -244 365 161 -188
2143a88k05M25q4k57MQ9N29m98J75L79K19m35k89J92K61p56J39K09N97n06k02
2164b02L71M75m69q41N40J75l05k81P4J003n12l99L60P04k76j002L17L43n2l15
2184b92J05Q89j57n79k73O92m77k55N9M12m4n34J20N02o1m41N3L73Jl42l38O47
2206F0K38l30M3N33k9m14p1K0K04m88j55M11L04l76l10M62K03k90m38L36L05n42
2228c24k06K83N58j89k16L16M51m56m14jO03k47k31J67J91K52p25L5N03j76n80
2249d06k08N58j70j42J0L88K99l08k93O17m3m91k11P04Q9j78k22M53M30m71n62
2270a57J87L30o57k1L48J58j37n61N17J69l0n87L28K43l34k69K52L93K89k19K48
2291D90L1l03m77L39K19k22k00j15N52j25n32J00M25l10k19j60M49j28j19j17
$$ plain form
2143 -188 -393 32 -52 -309 -305 -216 313 -185 -10 369 588 153 -136 56 317 -439 -300 -91 506 0 -202
2164 -202 169 644 175 -666 -126 49 -256 -537 -463 540 28 -371 -11 693 417 -585 -268 75 23 -292
2184 -292 -187 702 545 -34 -307 385 -92 -347 -288 124 80 -454 -334 168 107 -334 -281 92 93 -249 -587 60
2206 60 298 -32 11 544 515 101 30 50 254 -234 -389 22 326 -50 -360 102 305 15 -423 -87 218 -324
2228 -324 -530 -247 311 122 -94 222 673 217 -197 -198 405 158 -73 94 285 537 -188 -153 350 174 -406
2249 -406 -614 -56 -226 -368 -358 30 329 21 -272 345 302 -189 -400 304 393 215 -7 446 876 405 -157
2270 -157 30 360 -297 -318 30 188 51 -510 7 176 146 -441 -113 130 -204 -473 -221 172 461 242 490
2291 490 521 218 -259 80 299 77 -123 -238 314 189 -343 -243 182 -128 -347 -507 -58 -186 -305 -422
2311d22P21J28o91j89P45k12k24j32R2P55n0l99M07J23p28J03J0pk55k33J78N59
2333B79l83k41K64N99m18m64m7M28j40j43K37M95m1n11M77J94k85j96p5K63l19
2354b7j65k60J049l70m10j55M83j7m98j93J30J44l32M34L10L01m83m3RM64l72
2375ak60L69M70k11l83N82R0l37l75J57R5m84l50J61O02n97J45L65L37o17r1J67
2397a66R2j30k84L57M07m5l13O63J05n18k99K02K70l56l32Q9L19P5o54M20Q2j0
2419b6m92M5K74R5q0m8L10n8k03J03M09j50l47N0M49J43p15J63L61N1k15j40K80
2442B59L9m89j30Q4L93l34o7J24N72m08m84M72J63l30j03K24O6k11m1L66J68O6
2464C99m96K85q5Q4l13O6K08J39l14k62N94k37o28N3P37o5n27j33P60l08K98l69
$$ plain form
2311 -422 299 427 -264 -453 292 80 -144 -276 -184 571 521 122 529 652 -76 27 37 30 -225 -458 -280 279
2333 279 -104 -345 -81 518 100 -364 -411 17 -123 -266 -29 466 425 -86 391 585 300 104 29 292 -27
2354 -27 -192 -452 597 227 -183 -338 145 128 -370 -563 -433 -289 -621 -187 123 424 -59 -102 -93 371 -1
2375 -1 -261 108 578 367 -16 566 656 319 -56 101 196 -288 -638 -477 125 -472 -327 38 375 -242 -333 -166
2397 -166 -74 -204 -488 -131 276 231 -82 581 686 168 -131 71 341 -15 -347 -258 61 136 -518 -98 -16 -26
2419 -26 -518 -473 -199 -104 -184 -232 78 20 -183 -80 329 179 -168 -118 331 474 -241 -78 283 334 119 -21 259
2442 259 298 -191 -321 -237 156 -178 -245 -121 451 43 -441 31 194 -136 -239 -15 51 -160 -201 165 333 399
2464 399 -97 188 103 187 -126 -60 148 287 -27 -289 305 68 -560 -507 230 165 -362 -495 265 -43 255 -114
2486a14M2M98o82j8M02o6j12j64M14J22J1l31J61N7l65k80M11j8n0k49L37K80
2508B86l50k09L76K80l98j3J94R1j88k13J69K93J2l46J25Q8l50j77R0L53j45k32
2530b64K74M5J93l31j67L03p1k06M5L28P4m77K79L18q2k68l82K72M07l63K3Q4
2552C4K09k54j56k1L42k94kK22k15j51J99J82L75l82l81L70j2L41q69O09N4j64
2574C6q0K97J76l68l37K09J46J09l85k51M20N5o3K3L78k90k81k7K59J0l58R5L06
2597G9J33j88K44j1k2k26M9k75K28m34J00O23o5k35k8R1K22k57p3M8J6K2l34P
2621b86O95j08m00K68Jk51l6N7J93j1k13p0N68l49l43J89J03P1k36Q2N3J57j46
2644a2j61K90J73k88j75K26L0j32j08K86q6l8K9ON0j86l3J71r9M7m72L51L05j78
$$ plain form
2486 -114 -72 426 -256 -274 128 62 -50 -214 200 322 333 2 163 220 -145 -425 -14 -32 -82 -331 6 286
2508 286 -64 -273 103 383 -15 -28 166 257 69 -144 25 318 330 -16 109 197 -153 -330 -240 113 -32 -264
2530 -264 10 55 248 -83 -250 53 -18 -224 -179 149 223 -254 25 343 261 -7 -389 -117 290 -73 -50 34
2552 34 243 -11 -167 -188 154 -140 -142 80 -135 -286 -87 95 470 88 -293 77 65 406 -463 146 200 36
2574 36 -44 253 429 61 -276 -67 79 188 -197 -448 -28 27 -36 -13 365 75 -206 -233 26 36 -322 -227 79
2597 79 212 24 268 257 235 9 58 -217 11 -423 -323 300 235 0 -28 63 285 28 -45 3 19 41 -293 -286
2621 -286 409 301 -99 169 170 -81 -117 -60 133 122 -91 -161 407 58 -285 -96 7 78 -158 -76 -23 134 -12
2644 -12 -173 117 290 2 -173 53 83 -49 -157 129 43 5 34 40 90 -96 -129 42 -57 -10 -482 -131 174 -4
2668dK8L0P0L2l09J66j91J30k6O1L50j54q4j60M33m71j6O6J74l55j2K68Q7M2j34
2693B1k46L99k21q0N0K78j85l62J52L81j11q2j41L2L25j73P4J34j58P6l76K31
2715A8J23K0k39K6L22l92k56L61M2J0k01J78P9j21j06O2rk03O4m1L21J04j10J31
2739A83J89k09l28K7k83L85k66J36M03k22n9j01K52j77J6j74L94k88K14p6R6l1
2761H1q6l2K43J4k03q3J00K78k69j13J02o5J31k16J07L84m98j44J31L99k52p5
2783f6K61K14j45m61J31J15K86k30k8J57k43j20L32j14j35Pq8K52r0l03Q6K34
2805E2n1rJ9J66k41j2m2K00r8l8L01j54K21l97K7L21j47j08l07J96K34r6k02J66
2829AJ68l03j13K72L43l08l40L07j25J77k66J75J79k27j10K5L38L9m58L15l09
$$ plain form
2668 -4 24 54 124 156 -153 13 -178 -48 -74 -13 337 183 99 -61 372 -99 -115 -49 125 -230 -242 26 113 155 21
2693 21 -225 174 -47 -127 -77 201 16 -346 -194 187 76 -6 -147 -115 210 37 111 245 87 163 -213 18
2715 18 141 161 -78 -52 270 -122 -378 -17 25 35 -166 12 91 -30 -136 -74 -83 -286 -222 -263 58 162 52 183
2739 183 372 163 -165 -138 -421 -36 -302 -166 237 15 -44 -145 107 -70 -54 -228 166 -122 92 16 112 81
2761 81 -5 -37 206 220 17 -66 34 312 43 -70 32 -33 98 -118 -11 373 -125 -269 -138 261 9 -66
2783 -66 195 409 264 -197 -66 49 335 105 77 234 -9 -129 203 89 -46 -39 -127 125 35 -268 -182 52
2805 52 1 -8 11 177 -64 -76 -118 82 -16 -54 247 93 314 -83 -56 265 118 10 -297 -101 133 37 -165 1
2829 1 169 -134 -247 25 368 60 -280 27 -98 79 -187 -12 167 -60 -170 -145 193 232 -226 89 -220
2850b20L34o9k61M22m0m22J93K06l80J66J57m1l6o8r1K97l58K43Q5k2j59r7N4
2873a07K4M54k94J02q3J43k96j80K28r7J61k33P8O07n79l07L80L7r8j57J03K81
2895A67k17j89N06M2k79Q9q0P6k33p9J97M48l04l69L06m8j87Q4J21j01N0j82P3
2918a09J73ll85K84J71nk59K57K6J10m08J14r2J12K53k00K27k01O6l8M7l26J50
2941c6l57L07M89q3m49K14O6l14r4L03K28n70J55N28j46l39N8M2l41K33j4Q5R0
2964E5m6k35L88J48j91l66L33j41k2j2J60o5j65j86M14n4rq4j86K29J11J48k87
2987f3M76m60M9K28m12K95K40n89K43K5j30j96L00P7p9qK6p1o9m7K01p5o1l7L84
3012B47j37n07L11K29o2n3k09J77K87l19K38K94n45k58J02M8K23j02J27j00M2
$$ plain form
2850 -220 114 45 -216 206 166 -256 -63 143 -237 -71 86 45 9 -59 -150 147 -211 32 117 95 -64 -161 -107
2873 -107 -83 371 77 179 96 239 -57 -237 -9 -106 55 -178 -100 507 -72 -379 1 38 -60 -217 -114 167
2895 167 -50 -239 267 309 30 119 39 115 -118 -197 0 448 144 -225 81 33 -154 -70 51 -50 0 -182 -109
2918 -109 64 61 -324 -40 131 126 -133 124 150 260 -148 -34 -126 -14 239 39 266 65 131 93 140 -186 -36
2941 -36 -393 -86 403 320 -129 85 151 -163 -257 46 274 -296 -141 387 241 -98 -40 2 -339 -106 -120 -35 55
2964 55 9 -226 162 310 119 -247 86 -55 -77 -89 71 6 -159 -345 69 15 6 -78 -264 -35 76 224 -63
2987 -63 413 -47 2 230 -182 113 353 -236 7 32 -98 -294 6 83 4 -4 22 -49 -118 -165 36 -39 -100 -137 247
3012 247 110 -397 -86 143 81 28 -181 -4 283 -36 202 496 -49 -307 -205 -157 66 -36 91 -9 33
3033C3o0j15L3n8J04j78K44K60m93K32l9M3J9o9k45K52Rr8M2j43J55l7l8J84N4
3058I1p9o0K27j09j41K07k01J54j06r6J43J6r7k39K43K89m20J17J37m1P9k82q1
3081b49Q0K08j81lJ5j61J07r3J21k19M89j04j23J39j06j16K15K25k56J06j2J10
3103A92k4m54M02N6j76K08j33R9Q2l97L43k07l64N05k50Q5k56J91R1k7k32K86
3125B0j06J54N8o4j71J17o1l5O8OK4j57qL04l28R2J64o6N2j53L76l01M1R8j54
3150c0j10K24J62j13k16J27k2k28L94j88K7l5j00J79N3k19K6j0J19l03O2J50J5
3173c6l4J39p2K3rr1J97K2l98J85L48k64N1k19K16M1k60J32J07k20Q4k4L52l60
3197i0k8j70L58L6m79K45oJ05j7j14J75O5j48K2K83k11l51K13l7J65j74K03n1
$$ plain form
3033 33 -27 -142 -109 -167 -63 -241 3 263 -230 2 -37 6 25 -44 -289 -37 -28 -126 -84 -227 -72 -109 -147 37 91
3058 91 12 -48 179 70 -71 136 -65 89 -17 -113 30 46 -51 -290 -47 242 -178 -61 76 35 114 -168 -249
3081 -249 -169 39 -142 -145 -130 -291 -184 -277 -156 -375 114 10 -113 26 -80 -196 19 244 -12 94 82 192
3103 192 168 -286 116 172 -4 204 71 170 252 -145 198 -9 -373 132 -118 -33 -289 -98 -7 -34 -266 20
3125 20 -86 68 126 62 -109 8 -53 -88 -20 -14 10 -147 -155 149 -179 -87 77 11 63 -90 286 -15 26 124 -30
3150 -30 -140 84 246 133 -83 44 22 -206 188 0 27 -8 -108 71 124 -95 -69 -79 40 -263 -201 -51 -36
3173 -36 -70 69 -3 20 11 -80 117 139 -259 -74 274 10 61 -158 58 99 -161 -29 78 -142 -58 -82 270 -90
3197 -90 -118 -288 70 106 -373 -128 -134 -29 -46 -160 15 80 -68 -46 237 26 -325 -112 -149 16 -158 45 -6
3220fM9k74L21k5k7J3l46J72L38k42M6M0Rj4j16P6J5n8k02K52K0J42nl66M15k85
3246e8J67J01k97Q1j88K29k9j8m8k7K86o1K5o6Rj08Q8Mq8o0J88l61J53K90j84
3271B8J2J56k82q1M4N5J25o1j10Q4J36p8N8k93P5J11j7J04k2l31K7R3J08J38j76
3296i7J42J20j96J76j15K50l60M05j34Q5l77J70j97l2pLL29j99q7R4j37L42J35
3319C13k70n1Q9k58L46j23J25j40k33M97m73L76m24J93J60R8l97K44j15k42J82
3340a03K56M7K6m46J12L44O5l22l8R2P3l19P5K17jo0j39L26j41l91J49PJ78j15
3364a08J55J03J97k42k69K34L3M7r2m6J37m9j94l6J23J33j73k08K03J05R2k12
3386f7J60l36L65k10J75j16l09L10j98M04m04L17k53K18J17n83N97j68O4k34K83
$$ plain form
3220 -6 43 -231 90 65 38 51 -295 -123 215 -27 19 59 68 54 -62 14 29 -29 -231 21 41 183 178 -188 227 -58
3246 -58 109 210 -87 -6 -194 35 6 -12 -60 -87 199 138 163 97 106 -2 86 90 2 -58 130 -231 -78 212 28
3271 28 40 196 -86 -167 -123 -68 57 -4 -114 -30 106 28 86 -207 -132 -21 -38 66 44 -287 -260 -167 -59 79 -97
3296 -97 45 165 -31 145 30 280 -80 325 191 276 -101 69 -128 -160 -167 -164 165 -34 -121 -27 -164 178 313
3319 313 43 -8 81 -177 169 46 171 31 -202 295 -178 198 -226 -33 127 225 -172 72 -43 -285 -103
3340 -103 153 200 226 -220 -108 236 301 -21 -59 33 106 -213 -138 79 78 18 -121 205 64 -327 -178 -171 7 -108
3364 -108 47 150 347 105 -164 70 103 150 58 12 149 100 -94 -130 -7 126 -47 -255 -52 53 145 -67
3386 -67 93 -243 122 -88 87 -29 -338 -28 -226 178 -226 91 -162 56 173 -410 187 19 83 -151 132
3407A32k4L6j87j26L60j00k58r1K07l16K27K43k0j97k14L71O4Q9l43J05L3j22
3429a31J84k68L95J80j81j12J56o4k99J81j80J94j19k78L17j71K68l81N88j39
3449A40k19O5K06q7N6l48L23j07r9L0J03o3k70J77M8J12j83L21l2mj14Q3l40J21
3473h1k00K53K23m88N79k48r6K05m39K53L32k62k0j42k8L82q4J53k61L25k47j14
3495eM7j86Q0l14M14J85l22j62L30L28o21K75l9o5p7K20J22l24K08k00J20l1J99
3518A82n0q0J6l3j72J88l4j53q1k7K12L07m46K74j39r1J20j37j23L92q9M4p9j82
3542a81K49o6J48j95j12O2O7P9k80J51J00l7J05j39J96k68J57P3j22K3oj40J75
3565C9j91L1J03k19R0J4k22L95J21R6j11l3Rk44K2K18j91K72m81R2J25j0R4r4
$$ plain form
3407 132 108 144 -43 -169 191 91 -167 -258 -51 -367 -140 103 83 -114 -328 43 107 196 -147 -42 -9 -131
3429 -131 53 -215 180 360 179 67 223 159 -140 41 -139 55 -64 -342 -25 -196 72 -309 279 140
3449 140 -79 -14 192 105 161 -187 136 29 -70 -40 63 0 -270 -93 -45 67 -116 205 173 169 55 138 -202 -81
3473 -81 -281 -28 195 -293 286 38 -58 147 -292 -39 293 31 11 -131 -159 223 139 292 31 356 109 -5
3495 -5 42 -144 -64 -378 36 221 -101 -263 67 395 -226 49 10 -55 -132 88 210 -114 94 -106 14 -17 182
3518 182 132 52 68 35 -137 51 17 -136 -217 -244 -32 275 -171 103 -36 -127 -7 -144 -267 125 36 80 1 -181
3542 -181 68 2 150 -45 -157 -95 -28 51 -229 -78 22 -15 90 -49 147 -121 36 109 -13 10 4 -136 39
3565 39 -152 -121 -18 -237 -147 -133 -355 40 161 257 146 113 122 -122 -100 118 -73 199 -282 -190 -65 -75 19 -75
3589g5JP1K1o2M26m22j53K12Ok22n5J44NK59k37L6q8K71k00P0NR1j89K05j0j43
3615c3q0j75L06Nl4J17j10q3K72p8k88L88k48J7P3J24j80K03r3k7j44M3j21K45
3639I9j08o6J09k81M19m29L10p0N6oo0M5J21j01J53ol37J17J04rP5P4l19J41p5
3664d4P3J62k80J48J0r5j13R8qk00K12l4J18r6j44P1J54j58K53j58r1Q3J22L1
3688A14L3k01p6L5J49l97M00k0m9l4N8P6n4k64J16K14n6o3L36k25j12n5k8P7J44
3713A18m42N09m1l05k59N30%m4j47J44k38L65j08k48K36r3j9kK1K09l83q4L53
3736G2p0Q5l26J37K08j95j04L70j06k02J80o5J1K8K8q3n5J73j76K50n1j82j37
3759b10L92J4m30K73R2j64J15j99k7J21K27r4k89J66Nr8K37K05l02J34j76j45
$$ plain form
3589 -75 -74 -3 18 -44 382 -40 -193 19 25 -197 -252 -108 -103 156 -81 -45 -133 138 -62 8 13 104 -85 120 110 -33
3615 -33 -113 -288 18 23 -11 106 -4 -87 185 107 -181 207 -41 -24 49 173 -7 196 103 76 -68 -25 -146 99
3639 99 -9 -75 34 -247 172 -257 53 -17 39 33 -27 18 139 38 191 185 -152 -35 69 60 135 209 -110 31 -44
3664 -44 29 191 -89 59 69 -26 -139 -41 -49 -249 -37 -71 47 -49 -193 -122 32 -126 127 -31 -122 -39 83 114
3688 114 147 -54 -130 -95 54 -343 57 37 -12 -46 12 88 34 -230 -114 100 44 -19 317 92 -20 -75 -103 -26 118
3713 118 -324 185 144 -161 -420 110 110 66 -81 63 -175 190 82 -166 70 -23 -42 -44 -23 186 -197 -281 72
3736 72 2 87 -239 -102 106 -89 -193 177 71 -131 49 -16 -5 23 51 -32 -87 86 -90 160 109 -73 -210
3759 -210 182 196 -234 39 131 -33 82 -117 -144 -23 204 110 -179 -13 -8 -106 131 336 34 168 -8 -153
3781a53j2L52r8k72L11j80J23k5j09k68J59J78K76k15KK08m18P0p4K66j46J90
3803A65R6l07p4L27n60L94M3J6k5j35J32q7j11K7L42j54J01l28L02l61L35p4J13
3826A77r7O8K7O3l86K35J4k98J77J40k96J66j5J17L1J22j98nj44P6qR2j82L4K95
3851B05o8p3n4O7K8j25p3J83n0K96m14J08J66j74J09Qj50k1J15Qj99J35j55J59
3875C1k76L03P4k89J58L9O4m8j45J8J1j59K25p0mo6L28l72l2K04K2j18J1k67K61
3900i7J29k16J91p3K83m05K86o0l39J5M32J2K9l52r5J08K22j16r4K9N43m62J7
3923a3M0n5j6o5J26oj09K4r3M2R8J56O5j02j00L05j70J17m90K81J31l5j49N2n2
3948a8J58k51K07l36R5K10k39K0L04n1Mj44J67p3Q3j26O0j37k01K89j41J01j27
$$ plain form
3781 -153 -165 187 89 -183 128 -52 71 46 -63 -331 -172 6 282 67 69 277 -141 -71 -145 121 -25 165
3803 165 261 -46 -120 207 -353 41 84 100 75 -60 72 -15 -126 -99 243 89 190 -138 164 -197 138 64 177
3826 177 80 148 175 238 -148 87 101 -197 -20 120 -176 -10 -25 92 123 245 47 42 -102 -26 -34 58 -124 -90 205
3851 205 137 64 10 77 105 -20 -93 90 40 336 -78 30 196 22 131 139 -11 -32 83 91 -108 27 -128 31
3875 31 -245 58 132 -157 1 40 104 56 -89 -71 -60 -219 6 -64 -68 -134 194 -178 -210 -6 16 -102 -91 -358 -97
3900 -97 32 -184 7 -66 217 -188 98 38 -301 -286 146 158 187 -165 -260 -152 70 -46 -140 -111 432 -30 -13
3923 -13 27 -28 -44 -109 17 11 -98 -74 -167 -125 -27 129 194 92 -8 297 127 244 -246 35 166 131 -18 34 -18
3948 -18 140 -111 96 -240 -145 65 -174 -154 150 99 103 -41 126 53 136 10 70 -67 -268 21 -120 -19 -146
3971a46p1L23l37M55l0j39j06L8P9j92j90K91j13K53p9k42J65j25K21n0J13j02
3993A6j24Q0O1k56N47j56k06p7M5R1n6J8q1j06J17m9J75l18J86rR8R2k14K61j72
4018c7J77l23R4K74l65J7m0K66J46k41j05K79j92K32j64q2J37j30J45P2l20l9
4040a99K91l75N7L36q0M7Pj58m05N50q7M0O4J92k62p1J55l4K6j92j56L56j4j50
4064f2J26j12J45m8L6p0m3K46j00q3q3J69j28j55K09j42r2K26j00o5L21k35k6
4087f6J30N5l41j29J60pQ6O5j17K52j5K1j4J09l19q7K93k33P2K30k12j29Q3L31
4111B18j82L2k1j49J89k40J61O2m7l30N16l17L1J20K8j34K18k66j8O3j8J44n5
4134Ej48M36p1L6j66rj65J94J8l62M42k15j3j54J02O7oj03J73j36J7J12rRJ91
$$ plain form
3971 -146 -217 106 -231 224 194 55 -51 -13 66 -126 -316 -25 -138 115 36 -206 -41 -166 55 5 118 16
3993 16 -108 -28 33 -223 324 168 -38 -115 -70 21 -35 -17 -98 -204 -87 -136 39 -279 -93 -102 -4 88 -126 135 -37
4018 -37 140 -183 -89 185 -180 -163 -203 63 209 -32 -137 142 -50 182 18 -64 73 -57 88 160 -160 -199
4040 -199 92 -283 -226 110 30 77 84 -74 -479 71 -16 24 88 280 18 -53 102 68 94 -98 -254 102 88 -62
4064 -62 64 -48 97 49 85 15 -28 218 118 35 -48 121 -7 -162 47 -95 -187 39 -61 -126 195 -40 -66
4087 -66 64 119 -222 -351 -191 -198 -112 -47 -164 88 73 94 80 189 -130 -217 76 -157 -85 145 -67 -196 -113 218
4111 218 36 68 47 -102 87 -153 8 70 23 -307 209 -108 -77 43 71 -63 155 -111 -129 -66 -84 60 5
4134 5 -143 293 222 258 92 83 -82 112 130 -232 210 -5 -18 -172 -70 -3 -9 -112 61 -75 -58 54 45 54 245
4159B45m33K03n7j27K7J07J75l03l0K59q0j07Pqr4J68Lj29K21J72k22k01K23j2
4183Gm8k9K4K29m12K32N8L4P4r6r0j39K49j36L3o4l1J26m1J75l05J02L40n06J08
4208a06l5J05J3K3j75K84k10M26N4l17k29J66k1m9k1p4K45j78J4J03J30l49K11
4231A0OQ1r1k0q7K66R7j81j73K9Qo8J84lJ06k12K08k36J60k27o3j8L06Mk47R2
4257f9l2J75j26M4k24L9K56m40L98qM5P9k85L67m01J44Q2J23m46K97J0K39l39
4280g2J0L16j41k49J12O8J1j1k04N5K09j72L43L0k82Q1j83qJ07n0o2J02O7j39
4304f2J35k82K38J16k14O1K24m85K56N7q7J14j07j2O5j9K39j41j71L07r8m3k94
4327b03J13J49j8j90K2J21J05j20L2k4N2qM3r8o7K63p5J8k09K47q2j33k13J91
$$ plain form
4159 245 -188 15 -42 -169 -142 -35 140 -163 -193 66 -14 -121 -114 -122 -216 -48 -45 -174 47 219 -3 -204 19 7
4183 7 -41 -70 -46 183 -229 3 61 95 169 73 -17 -156 93 -43 -10 -74 -105 21 -20 155 -150 -48 292 -214 -106
4208 -106 -141 -36 -23 0 -175 109 -101 325 379 62 -167 -1 -22 -71 -92 -166 79 -99 -85 18 148 -201 10
4231 10 16 97 6 -14 -101 165 262 81 -92 -63 -55 -123 61 58 164 -48 160 -76 84 -143 -206 -224 82 86 -161 -69
4257 -69 -101 74 -52 -8 -232 -193 63 -377 21 13 58 137 -148 219 -182 -38 44 167 -279 18 28 267 -72
4280 -72 -62 254 113 -136 -24 44 55 44 -160 -105 104 -68 275 305 23 104 -79 -87 20 -30 -92 10 77 -62
4304 -62 73 -209 29 145 -69 -8 216 -269 -13 44 -43 71 -36 -48 17 -2 237 96 -75 232 134 91 -203
4327 -203 -90 59 41 -149 -127 -6 99 -21 11 -13 39 31 74 -24 -91 172 97 115 -94 153 71 -62 -275 -84
4351h4J55k83K7K33l5J54l7Q2k51N1j4P7J02N6k43k5K94k19J05k52J12k44J13
4374a26J62J22j19j53ON6j9N1J24j58K76k06p4K6J8M4J6J23l72P9J29N3O4p2k76
4399b26L20k63L07l14J43J67k23j43K32O6j62J24m0j63l9K14K95k52j58M5L1l8
4421g7K36j41q2k9K39j55R2k57MMQ5J41j78M1J34o4j97N5K85k8K2k0k44J46o7
4446e5K19j07j52J34m9j33L96k87J75j84L0M7j67K86pNk02P2R3j85j00P5J00J70
4470A74Rk67l2J65J67j28J37l68q9K44K65k75n7J98l9Q7j05L9J16k95J74k20J68
4493F8rj67j18K71K01m43L66K2k25Q1N9q0k98O10k85R1J4j46pn5k0J82J4k22J08
4518A2O9k75L05j78q3J89N6k78L48j56k95K11K49k64K46k32L05k62N1J64k01k9
$$ plain form
4351 -84 71 -212 -185 48 13 167 130 212 -39 12 -2 75 177 233 -10 -35 259 40 145 -107 5 -239 -126
4374 -126 36 158 39 -114 -108 -52 -71 -20 104 -54 222 16 -58 -32 -14 30 46 169 -203 -124 5 58 122 50 -226
4399 -226 94 -169 138 -176 -33 134 -89 -232 0 66 -96 28 -12 -175 -214 0 295 43 -115 -70 -39 -77
4421 -77 159 18 -64 -93 146 -9 83 -174 -170 -166 -81 60 -118 -77 57 -7 -204 -149 136 108 130 110 -134 12 -55
4446 -55 164 57 -95 39 -10 -143 253 -34 141 -43 -13 34 -133 153 146 151 -51 21 114 -71 -171 -96 4 174
4470 174 183 -84 -116 49 216 88 225 -143 -232 12 277 2 -55 143 104 191 86 125 241 -54 120 -100 68
4493 68 59 -108 -226 45 246 -197 169 191 -34 47 106 26 -272 338 53 144 158 12 5 -50 -70 112 126 -96 12
4518 12 81 -194 111 -67 -150 39 95 -183 165 9 -286 -75 174 -90 156 -76 229 -33 18 182 -19 -48
4540d8N9J96p5q4k77L01K1j56j67L01k42q8M83j24j14l1k29L90m1m5j94L9L32
4563B07k88j21N34l57j51O2j20L12k35N2O8K99k19k11M25l87K18j77K08J60k55
4584B4J14j67pP3R6k8o9j34J66l9Q4J2j65N8P3k66J15q4J37J45qj29j87K89p6
4609B7m6L5l4j63L14k4k35K71p2k07O0O7p8m3J21j00K09j20j84L03j71J32q3l4
4633e5K68j15J6O8j30QPO6j69J25m3jk0K37k06j11j42J80n9j78K60l14L36k43
4657b15L54j17J46j15Rj33K3m2L4kq1k1J09k1J3l9L51p6j09j11N3J36j16j05J57
4682H2j63p2K2K6q7J43O2j78L65l05Q5J27p9k8Q0m0k2o1K51j0j92K2o2j4J30k03
4708a21K43p6n7k4J34Q2l35K29l6J53l9l21L73l2l4l86M11k91J00J8m7Q3Q7r9
$$ plain form
4540 -48 11 207 132 48 -229 72 93 -63 -230 71 -171 -259 224 100 -14 -45 -274 116 75 30 -164 -125 207
4563 207 -81 -202 332 -25 -176 -114 -234 78 -157 -105 -37 262 43 -168 257 -130 88 -89 119 279 24
4584 24 138 -29 -36 37 133 105 36 -98 68 29 113 125 -40 18 91 -175 -60 -144 -7 138 130 1 -186 103 27
4609 27 -19 16 -18 -181 133 109 -126 145 73 -134 -74 -7 -85 -128 -7 -107 102 -18 -202 101 -70 62 -21 -55
4633 -55 213 98 114 182 52 60 67 133 -36 89 46 45 25 262 56 -55 -197 -17 -76 -254 6 -308 28 -215
4657 -215 139 22 168 53 62 -71 -48 -90 -56 -58 -139 -160 -51 -72 -59 -98 253 177 68 -43 10 146 30 -75 82
4682 82 -81 -153 -131 -105 -192 -49 13 -165 200 -105 -20 107 28 0 80 40 18 -43 208 198 6 28 -34 -48 82 -121
4708 -121 122 46 -11 -35 99 181 -154 75 39 192 153 -168 205 173 139 -247 164 -127 -27 -9 -56 27 114 15
4732A5Q3J04j68j9K09m50L4L86j21j27K7M8q1J66p0J5Nl0k1J16l88M35l08K4K76
4757A60j59l52K01J4J19k56J84Q4P9k37P1O7JJ38j22K83j19o8k14K29j57J60k73
4780a67M1M6rK23m4O1KJ56k61o2K55l77p2J95j23R1Q4n2R3k34%J98nk50J39NJ62
4807I5k5k15p9L60k03J24j11J90j57Q1PN0R6k43Q7nn6K6J02K68l89L6J18k42J85
4832A00j0lj00Rp2J8K01k82j49J74J56k31K87N5m3k2j39M0M12l06o8J83l16p2
4856a78J19j8L4O0%O2k51L05J94n00O2K78l1j74J3n9QJ43j74K01n0j53J82L7j51
4881d1P4NK23l43O7Q3o9L0r3m0J1L30j79k22L14p8l17K52J07j69l6J34k2j37J38
4906B2j21J17P7j00J85m04K30J06r1K3k7j24r2M03n83L10N8O2J5N6l14O0J90J12
$$ plain form
4732 15 98 202 34 15 224 -226 -192 194 73 -54 -27 21 -60 106 36 51 56 26 5 121 -267 168 -140 -116 160
4757 160 1 -351 -150 -136 -17 -273 -89 -5 74 -163 -92 -25 -24 114 -8 275 156 88 -126 103 -54 106 -167
4780 -167 -126 -80 -89 134 90 151 153 309 48 -14 241 -136 -208 -13 -136 -45 39 -13 80 -154 -154 44 39 -211 -72 -67 95
4807 95 70 -145 -224 136 -67 57 -54 136 -21 60 67 117 213 -30 57 52 -4 22 124 392 3 39 157 -85 100
4832 100 90 87 -13 -4 -76 -58 143 -139 -288 -114 42 -189 98 153 110 88 -51 -11 401 95 27 210 -106 -178
4856 -178 -59 -77 -43 17 17 79 -172 133 327 -173 -111 167 136 -38 -25 -84 -76 67 -107 94 44 -109 73 110 -41
4881 -41 33 38 261 -82 -15 68 -1 29 -64 -104 -93 237 58 -164 150 72 -245 7 114 -55 -91 43 21 -116 22
4906 22 -99 18 95 -5 180 -224 6 112 21 44 17 -107 -199 204 -379 -69 -11 51 66 122 -192 -132 58 170
4930A70j26J99J9j94l7j55K03l24J05K45j77J6O5m7M1J67j01rJ6q6K16j70o4R5
4954F7L0L3j03M3%m40K79J11K7k15L99n12L27k66J53J62N9j3J9n9M8o9j58L43
4978B65n02P3Q9K56k07L0KM7k82K19k1K03rr8j59P5lj12O3J44jlm0j49J07j77
5004a90Q5K41j68j18K01j27K30k04J32O6k18j16M61k04L2j50jN2k8m6J28j69j52
5027b63K97j35K23j68M0J23J30j66J4o2m0N8J3K3q6k9j11M15k60L04m86J26N0
5050A0J77o3r4j18K34J7q8k24R7J85L7m17L6L30r8J26j79j56m9L70n3R7o5o1R6
5075A47qj31j9j3j0K01k76P8K04p9k07R4K43k44K32n6k28L75l62J12J30N9l81
5098a39J65J56l8k20j15K11J29m6k25o4M43j01n53L45m3j45J25J25k52K48j37
$$ plain form
4930 170 44 243 262 68 31 -124 79 -245 -140 105 -72 -56 9 -38 3 170 69 60 76 -10 206 36 -28 67
4954 67 97 130 27 70 70 -370 -91 20 47 -168 231 -281 46 -220 -67 95 154 141 160 101 149 80 -78 265
4978 265 -237 -164 -75 181 -26 4 6 53 -229 -10 -31 172 163 65 -94 -19 -22 -134 -71 73 72 69 29 -120 -13 -190
5004 -190 -105 136 -32 -150 51 -76 154 -50 82 148 -70 -186 275 71 103 -47 -48 4 -24 -70 58 -111 -263
5027 -263 34 -101 122 -46 -6 117 247 81 95 33 -7 51 64 87 1 -28 -139 276 16 320 -166 -40 10
5050 10 187 124 30 -88 146 163 75 -149 -52 133 170 -247 -211 119 21 147 -32 -188 -237 133 80 177 112 51 147
5075 147 139 8 -11 -24 -34 167 -109 -31 173 94 -113 -19 224 -20 212 156 -72 303 -59 53 183 242 -139
5098 -139 26 182 144 -76 -191 20 149 103 -122 -186 257 156 -397 -52 -95 -240 -115 10 -242 6 -131
5119a31P8k05L60o7J17j3l57J83J82k32L37N8l58m2N8j4R8k26L53j38k06J80P3
5142H8j8J46j77M0j27j49L96l60J32J29k63J6K20J30O3l15Llk3n7l4L04l2j2m00
5167c03L81j32K6p2L76m02N4M7M1K35l23K45j24j57P9K8k3P0j07l0O2J90j23N8
5191I6j48J21r8no7j27j30N81j27k4k73K54r3J36j81J11J66r2mj83M4K48k32K6
5215aJ0j2P3l07J3J24p4m6K65k49k6L02L1j54p6J00m0j32J14J02k47kM38j52k64
5240b10K91l6l73O14l42K23l0k09J97l8r4j38J42j28J67k28j05K69KK24j24k89
5262b15K01J04jk90L24k18K92k01J62k52R7j2J87k83J33LJ1j74K32J10k12J22
5284A20orj03o4J52k30L74j62p1k23Q6J72j50J16j62l8J4k6R5P9K95k62j25K5
$$ plain form
5119 -131 -53 -258 102 35 152 139 -218 -35 147 -85 252 310 -48 -90 -32 -46 52 -174 179 41 -165 15 88
5142 88 70 216 39 79 -48 -197 199 -161 -29 100 -163 -147 73 203 266 -49 -46 -49 -72 -129 -163 141 109 97 -303
5167 -303 78 -54 -28 -100 276 -126 -72 -25 16 251 -72 173 49 -108 -29 -1 -24 46 -61 -91 -29 161 38 96
5191 96 -52 69 -29 -34 -101 -228 -358 223 96 72 -201 53 -40 96 -85 26 192 100 96 -87 -43 205 -27 -1
5215 -1 9 -3 70 -237 -224 -100 -174 -220 45 -204 -230 72 103 -51 -127 -27 -67 -199 -85 17 -230 -232 206 54 -210
5240 -210 81 45 -328 286 -56 167 137 -72 125 87 -7 -145 -3 -131 36 -192 -297 -28 -26 198 74 -215
5262 -215 -14 90 89 -201 123 -95 197 -4 158 -94 3 -9 178 -105 28 31 42 -132 100 210 -2 120
5284 120 114 105 2 -62 90 -140 234 72 1 -222 -136 36 -114 2 -160 -198 -184 -210 -115 -36 259 -3 -128 -103
5308a03K5L5Q3Q6j58J04N2j35J02r5P7j3J48p9l24M28L6l35QK05l30R4J25k99
5332b63K16K17k06L9J96l97J12R6q9M40k16k41l2J02Q2R1j85n8j0J55o7J84j03
5355F3j78N64l99m45M36J89k41j78K16pJ41J9k04J62P9k75J18O6k62j12J72k09
5377b85J77n5J18J08j86L58j38r6j36j35K76O0k19L7J03k3J51P1j84J14MK96o78
5400b62L05n6R3N9Q9k03p7Q8j44M3L7k01O9K14l8k52K69K29k34J10m0k5JJ21k04
5425ij74J14o8N1j15K64O3j45k8J29J45l79L57j53k41K02O3k7j54J29k00O7J47
5448C8j93J05J04m8J42k64j14J31O8Q1M0l28K34J50N9j2p3j83J0j65M39k90J05
5471C6k5j50K9l1J73j63J47J72k48P7JP9N2l7k5Q9k88R0K8J72j81j17J03K03l42
$$ plain form
5308 -103 -78 -43 40 126 -32 72 124 -11 91 -4 73 60 208 129 -195 233 269 -66 -58 147 -183 -89 36 -263
5332 -263 -47 170 -36 3 199 -198 -86 10 -79 361 145 -96 -128 -26 56 147 -38 -96 -106 49 -18 166 63
5355 63 -115 449 50 -395 41 230 -11 -189 27 20 161 180 -24 138 217 -58 60 126 -136 -248 -76 -285
5377 -285 -108 -163 -45 63 -123 235 97 1 -135 -270 6 66 -153 -116 -13 -36 115 186 2 116 120 416 -262
5400 -262 43 -13 80 139 228 25 -52 36 -108 -65 -28 -229 -160 54 16 -236 33 262 28 138 98 73 74 195 -9
5425 -9 -183 -69 -137 -86 -201 63 126 -19 -47 82 227 -152 205 52 -189 13 76 49 -105 24 -176 -109 38
5448 38 -155 -50 54 6 148 -116 -230 -99 -31 50 90 -238 -4 146 205 193 120 -63 -53 -218 221 -69 36
5471 36 11 -139 -110 -141 32 -131 16 188 -60 17 18 97 149 112 87 176 -112 -22 6 178 -3 -120 -17 186 -156
5496a56L68J44l11K12j92J04j78j48M9P1mr7Q9J68k25O7J33o6q4O1j92L62l02
5519a27R4J4N9q4J38j31j52K65k58J01l19O78l31J41P4j52J6j74j01J58J28k17
5541a80J60j42k6J29j11L05k32k3K82q7j52J23j51l6K60q6K1q2J07k09J50j0K13
5564B23j11N7k77P5J47j65j27J50J53l2Q4P1k76K07k58J99j29J01m49Q1J29J07
5586d0J87j83j00J45J9k02o6J96J54j05j65L08j93N2J1J30k81J34Nq4l8J83mj79
5610a16K52k70O7nM1k56K52j76M4K16m8r2J6k6J69j34J9J90J25l25L6J3p4j28
5634b10K38k85M10j03j0j75M57l87J05jq5K01r8j93j1R7J66l22j4K02l7k06K08
5657e3P6P3j28L19j80K18k24k07L10j64M4PJ50l33J53k75jK39N6j45J79m17M59
$$ plain form
5496 -156 212 356 45 257 65 169 -9 -157 -108 -37 -41 -138 -49 119 -106 -39 94 28 -56 5 -187 175 -127
5519 -127 -33 -19 40 -44 94 -37 -189 76 -182 -81 -400 278 -53 88 162 10 26 -148 -249 -91 37 -180
5541 -180 -20 -162 -188 -59 -170 135 -97 -120 162 75 -77 46 -105 -141 119 33 54 -28 79 -130 20 10 223
5564 223 112 169 -108 -33 114 -51 -178 -28 125 93 177 248 -28 179 -79 120 -9 92 -357 -276 -147 -40
5586 -40 147 -36 -136 9 28 -174 -240 -44 110 5 -160 148 -45 7 18 148 -133 1 6 -78 -116 67 63 -116
5610 -116 136 -134 -67 -72 -31 -287 -35 -211 -167 49 1 -91 -75 -101 68 -66 -47 143 268 -57 -21 -8 -82 -210
5634 -210 28 -257 153 50 40 -135 322 -65 40 39 -46 155 57 -136 -147 -50 116 -206 -220 -18 -55 -261 -53
5657 -53 23 96 -32 287 107 325 101 -106 204 40 84 91 241 -92 61 -214 -215 24 80 -65 114 -303 156
5680A56j45P4n9n2M19k76j24p8J07j1K26k63J4j0j64K97j28n7K9K28l96J90L9
5703A6j4K56k53j39J10P5N2j84%K76o1n9k78K38r5J65p6k29P6Q0J46R2l43L80
5727B31l67P1K25k80J82j05j05K54k68J78j2m4L40j87l47L89j71K64n65M14PJ55
5749B59l38r9J86J93r9j92L50k49p9q1K81k8j77J34Pl2p9J15q4j71L97j67k88
5772b41M06k07j08J33K16l84K15n1J24L5j02Q7l22K71P7p6on2J53n42K26J14L1
5795co1L7J08j0j45j83K94p7J67k82m4L9P5K03j23n5K97m16K32K3n4N6n3j83L15
5820A57k02L4j44L12j53L6R2j17N4j9p6N8J23l2j28K62j70j85J70k17K58j68J86
5843A31K6j91J66j92m1L08J1k88R0J01j98R8p3K63k40K18j9j96L8M59n96J05p2
$$ plain form
5680 156 11 85 26 -26 393 117 -7 -85 22 11 237 -26 -12 -22 -186 111 -17 -74 -45 183 -213 -23 16
5703 16 2 258 5 -134 -24 51 103 -81 -81 195 134 75 -203 35 -60 105 29 -200 -124 -44 102 194 -149 231
5727 231 -136 -65 160 -120 62 -43 -148 106 -162 16 4 -40 300 113 -234 155 -16 248 -317 97 104 259
5749 259 -79 -178 8 201 102 -90 260 11 -68 -149 132 104 -73 61 68 36 -43 72 -12 -183 214 47 -241
5772 -241 165 -42 -150 -17 199 -185 30 -21 103 138 36 123 -199 72 149 73 67 15 168 -374 -148 -34 -3
5795 -3 -64 -27 81 71 -74 -257 37 -40 127 -155 -199 -160 -85 118 -5 -60 237 -179 53 76 22 78 25 -158 157
5820 157 -45 -11 -155 157 4 40 132 15 69 50 -26 32 155 123 -5 257 87 -98 72 -145 113 -55 131
5843 131 157 -34 132 -60 -101 207 218 -70 20 121 -77 21 -52 211 -29 189 170 -26 12 471 -125 -20 -92
5866i2Q9k6K66m10j1K17L5N0k07q1J37l74N46k70j4L62q2K57n18J34j23O5Nn3
5890i8j47K79k54K10P6J3lJ2q5J27k02J40J55k34J45J2j48P5l2q8j42J19Q6R6
5914A12k06J56M0K9j84O6j22J25m6L6o2K48p4l61K83j91J50j7l20K91n2K21k28
5937a06J8J74o3j38J47J20M9l55O38l80m6j60J28N9j94O2K15o5k2m0K6n2k76K10
5961e1J09J35k67j1j14L01j49J13m7K00P5k18k01k4l3L22l59L5L04k05K14r1j22
5984h4j2o0J59J91k29M8J41j20j58PKk0Q7p5J09R4Mj14j81K02N1k7j95J1J8R4
6010e7L38l98L7RK18j99m1q7LM3J49O6K50k86O0k31J05jJ01J91p5k50J40j18j22
6035a55M94k25J8k96J4P3J3J00j95L1J39l1k4K07q6q9N1J2K4k44L04N8K0k20K05
$$ plain form
5866 -92 -3 -29 237 -173 -184 33 68 118 -89 -170 -33 -407 139 -131 -145 217 135 392 -126 8 -115 -50 -45 -98
5890 -98 -245 34 -220 -10 66 79 76 88 3 130 -72 68 223 -11 134 146 -2 73 41 -47 -189 -70 16 112
5914 112 -94 62 102 131 -53 13 -109 16 -30 6 -56 192 118 -243 40 -151 -1 -18 -338 -47 -99 122 -106
5937 -106 -88 86 23 -115 32 152 201 -154 484 104 58 -102 26 85 -109 -47 168 103 81 41 67 15 -261 -51
5961 -51 58 193 -74 -85 -199 102 -47 66 19 219 294 76 -125 -149 -182 140 -219 -184 120 -85 129 38 -84
5984 -84 -96 -156 3 194 -35 13 154 34 -124 -117 -115 -135 -48 -123 -14 80 84 -30 -211 -9 42 15 -180 -169 -151 -57
6010 -57 281 -117 -80 -71 147 -52 -93 -180 -177 -134 15 81 331 45 105 -126 -21 -22 79 270 195 -55 85 -33 -155
6035 -155 339 114 132 -164 -150 -77 -64 36 -159 -128 11 -20 -44 163 77 -12 39 51 75 -169 135 193 213 -7 198
6060A98l18m7J47j0L6J50r3K2J32j65N2k02J49j52L21k58Q3j00J0K37k47L38m79
6083a96J78J15k0k97K8K43n1P2j15K26k78J85p6J8l66K34K15l80M69l16j61J83
6105i0k80L28J61k10l1K09j41N3kj44J67R5j29j2k4k78N44j93p9J13q0j77N4q1
6129b27L21J0l21J23L11k32j62L52m00Q2M2K77l88M52l35K29j58m7O8j88N8J6
6151a17K6r4K01p6q5K90n0k7l16L78K6p8Q0k45k18J49P1K00j07o3Q3r4m6Q6K20
6176A94k43O1q1L26k76J96k88N4q3K05J68l10N1J73k05L1K26m47N08l09J97l19
6198a71J70J30k28M23j73k3N7k29J98k44P6J6J2r7R6j14L42m34J55P6k95J91L13
6221B47l61J28k23J23R1Q5N5k46O5Q6r1L49o66O19j62p7l2J32J29k83k32M02j46
$$ plain form
6060 198 -120 -167 -20 -30 6 156 63 85 217 52 104 -98 51 -101 220 -38 45 -55 -45 192 -55 283 -196
6083 -196 -18 97 77 -220 -192 51 0 72 -43 183 -95 90 14 32 -334 -100 115 -265 204 -112 -273 -90
6105 -90 -370 -42 119 -91 -122 87 -54 -1 -3 -147 20 115 -14 -26 -50 -328 216 23 -56 57 -23 -200 -146 -227
6129 -227 94 104 -217 -94 217 -15 -177 175 -225 -143 -101 176 -212 240 -95 134 -24 -71 -3 -191 -133 -117
6151 -117 -91 -185 16 -60 -145 145 95 68 -248 130 156 78 158 -87 -305 -156 -85 115 8 -55 28 -66 -112 -26 194
6176 194 -49 12 -69 257 -19 177 -111 -57 -140 65 233 -77 -26 147 -58 -27 199 -248 260 -49 148 -171
6198 -171 -1 129 -99 324 151 128 185 -44 154 -90 -14 2 14 -83 13 -101 241 -193 -38 38 -257 -66 247
6221 247 -114 14 -209 -86 5 90 145 -101 -36 50 -41 308 -358 261 99 22 -10 122 251 -32 -264 138 -8
6244hl4M4J05j08k00J07K2j79J03kK73j22j39J60N7r3J32j28K48k51m5L55l84
6267h7j16L82p8k02K62J09j29l0k85L53l24J59K03l9k17J01J30j67L7m3N0l47
6289b78M16k02J13k39J52L36k28j28K1l58L45L64m69J93r2Q4l8j41N6J85k90L26
6311A28p4l22K16J01J50l42K56Q1l04J22j15J18J18k3j15lp3L67q0k06k45K87
6333D2j90J08k41L29L4o4R0k49J90N3J54k38qj32K37o4k65L59r9j01J50k4j27
6356e6J00J77p9J53k42L1L9k98K11o7J83j84K86m9j62j05j00K43j40N8R4l63L79
6379A09p0j85J20j05O8Q0J83k24K6j30O7N9J37k95K4N6K11j04q7J14j0k34M79
6402B89l09J46k45J71Nk78Q8J71J60k1k51J81j01j94K46K70j73j91N0J5l94K32
$$ plain form
6244 -8 -42 2 107 -1 -201 -94 -72 -251 -148 -150 123 1 -138 22 79 -14 118 -10 238 -13 -58 297 -87
6267 -87 -203 179 101 -101 161 270 141 111 -174 179 -145 14 217 178 -39 62 192 25 62 19 69 -278
6289 -278 138 -64 49 -190 -38 298 70 -58 -37 -395 -50 314 -155 38 -54 30 -8 -149 -93 92 -198 128
6311 128 54 -268 -52 49 199 -143 113 194 -110 12 -103 15 133 110 -5 -8 -81 286 206 0 -245 42
6333 42 -148 -40 -281 48 82 18 108 -141 49 102 256 18 10 -122 115 51 -214 145 46 -55 95 71 -56
6356 -56 44 221 142 295 53 84 123 -175 36 -31 152 -32 254 205 43 -62 -162 81 -59 -1 93 -270 109
6379 109 39 -146 -26 -131 -63 17 200 -24 2 -128 -61 -2 135 -160 -136 -80 131 27 -60 54 44 -190 289
6402 289 -20 126 -119 52 57 -221 -133 38 198 177 -74 107 6 -188 58 328 155 -36 14 29 -365 -133
6424a33Q3j05J61O8j14j31N0N2K13j30R1j02J15j13Q2J2k47n5J37J21n9j1J24
6447A09o6p3l65L63K9j50p7P9J61p8K2j17N6M0P0O7J51n38K12P0J43p4j61N64
6471D37n50k35L54j71J84k64L55O4k33K21k54J93k17p6P4Q6N0j69J64o1r9L16
6493A69j96j29K02k84K68L2R7j61J36j1k11M20l48J12p2m7o7Rk85N09j33J01k4
6516H7n7k7r5L44l59R9j08O4n1J23n9L12k00l13L15pJ49J5j66N9k07J5J32j19
6540e4J14k57K57n5k40L08j95P0R1r3J03m62M04L00j83m5l31L76l1ql1L4k47J74
6564aj03L6J59K8k65N0k08L88L28m08r6M28j31j61Rj99o8L92j07R0j35l4J4p8
6588g2K79k31J59k95K31k08K59M6jOm2k45j29K24M3p2K80k78J61j75nR3q4P8j07
$$ plain form
6424 -133 -50 -155 6 74 -40 -171 -121 -69 144 14 105 3 118 5 87 99 -148 -203 -66 55 -4 -15 109
6447 109 43 -30 -395 -32 -3 -153 -230 -151 10 -68 -46 -163 -107 -67 3 70 221 -317 -105 -35 108 34 -127 437
6471 437 -113 -348 6 -165 19 -245 110 174 -59 162 -92 101 -116 -192 -118 -32 18 -151 13 -48 -147 169
6493 169 -27 -156 46 -238 30 62 159 -2 134 123 -88 332 -16 96 24 -23 -90 -81 -366 143 10 111 87
6516 87 30 3 -92 252 -107 -8 -116 -52 -103 20 -39 273 73 -240 75 68 217 232 66 125 -82 -67 65 -54
6540 -54 60 -197 60 5 -235 73 -122 -52 39 -54 49 -413 -9 291 108 63 -268 108 77 69 38 72 -175 -1
6564 -1 -104 -68 91 119 -146 -96 -304 84 412 4 -92 336 205 44 53 -146 -214 178 71 161 26 -8 6 -72
6588 -72 207 -24 135 -160 71 -137 122 168 167 173 131 -114 -243 -19 24 -48 232 -46 115 -60 -65 28 -56 22 -85
6613h5k27N02m20K29N7o0R4Qj16J4l5k74M43j41l1o0P2NJ79p3O3j44Jj74J13J9
6639d1k4j23J36k90M43j61L63m14K73p4k92K81k48K38j38J92j03j6O8j18R0K6
6661F8Q6l5j81R4J00j52o6M6J67j71L3K9J25j18j97j9K1J59J06j15q1m9j0K83
6685A23p8O1j41K09l6l68M9l2J55q0O9P4jK26k09j30n0J01%K3k6K12j54l0J35
6710A02o7J47j85J6M91n14l2j17P4K09r5L8J40j30N1j26J03k9l5mN0On3j83k5
6735a68K47P1j60L73j59J1Jk79L45n04K65n5J80k77l1L03l14O1L55k08l06J99
6757e0m4K6O5n5M32k31j16n9j16J07J14n9Q6j9p4J86j95J19O2m03O3K40j16j42
6781a79K67j63K23m3K9k03K0k26J00J44O2j0R5o6k56L30j64J95j72j36M9J56k
$$ plain form
6613 -85 -312 190 -230 -1 56 -4 90 98 -18 -4 -39 -313 130 -11 -42 -102 -30 -25 154 81 144 0 1 -173 -60 -41
6639 -41 -65 -188 -52 -342 101 -60 303 -111 162 88 -204 77 -171 67 -71 121 18 2 70 -48 42 68
6661 68 154 119 -62 32 132 -20 -86 -40 127 -44 -11 18 143 25 -172 -191 -170 -11 95 -20 -101 -150 -160 123
6685 123 45 106 -35 174 138 -230 -181 -213 -58 -138 -69 5 4 230 21 -109 -159 -58 -58 -35 -61 151 -3 -33 102
6710 102 35 182 -3 13 504 -10 -42 -159 -85 124 29 67 207 77 128 2 105 76 41 37 87 93 40 -143 -168
6735 -168 79 150 -10 363 204 215 216 -63 282 -222 43 -12 168 -109 -140 163 -151 -90 265 57 -249 -50
6757 -50 -94 -68 -3 -58 374 143 27 -32 -148 -41 73 14 100 81 7 193 -2 117 179 -224 -161 79 -37 -179
6781 -179 88 -75 148 105 134 -69 -49 -275 -175 -31 31 21 116 50 -206 124 -40 155 -17 -153 -104 52 50
6804E0j43r2M0J57Mj29L50l59J27JJ29l8J12k33j46K79k33Q6O7j18j04K71o5J3
6828B6p3J35M8j48J47j20K15l16j2J25l11J53J60K7l71K16J64k12J18K08k95K64
6850A48k57q3J02j1L17l2ok61K54q6r7J15j79j25K1J85K04k12O6J52n17L48m0
6873FP2O8k10J04m9L13k8k59N4m0k00O6J80j67J15J05K06O0n61J65J74O4j40k57
6897a59L50k06J23k24L9J24l06K81j25L2L43k51J64k74k9O1k3O1J14J4k2k19J52
6920B0l4j30L86k23J00l34M11J15k63k67K64o8J24J2O0j98Mj37K22p9K1j71K79
6943A14j1J23O7j48k41K04j07J8j94J56O5k01J97k7J60k72J52j07J68l04J47P7
6965C6k95K74m05L75J39j73J02J28k33j6j45j4J63K65k49j30j88M41J23j16k40
$$ plain form
6804 50 -93 -185 -145 12 16 -113 237 -122 5 6 135 97 209 -24 -170 109 -124 -38 29 -89 -193 78 13 26
6828 26 -47 88 136 -12 135 15 230 -86 -98 27 -284 -131 29 56 -315 -99 65 -147 -29 179 -116 148
6850 148 -109 -192 -90 -101 216 184 178 -83 171 85 -12 103 -76 -201 -180 5 209 -3 63 215 -302 46 6
6873 6 78 146 -64 40 -9 304 276 17 71 31 -169 -103 77 -90 25 130 336 396 -165 0 174 238 98 -159
6897 -159 191 -15 108 -116 -77 47 -259 22 -103 -71 272 21 185 -89 -118 -57 -80 -19 95 109 87 -132 20
6920 20 -14 -144 242 19 119 -215 196 311 48 -219 45 -23 101 113 173 -25 -21 -158 64 -15 6 -165 114
6943 114 103 226 293 145 -96 108 1 19 -175 -19 46 -155 42 15 175 -97 55 -52 116 -188 -41 36
6965 36 -259 15 -390 -15 124 -49 53 181 -52 -68 -213 -227 -64 201 -48 -178 -366 75 198 82 -158
6986a58J79K4J58m61J64J38j16L53n97K32j86K38J17j74J27k02J81p3L5j43L8
7007a26k1J54l0J08ml39L17k56L74k70K12j52M8L9J61k18J25K8k67PP0J19j54
7030g5o2j0J54K22l11M4J64r0q2L2j69R4R8J9J8k92K0J00K09k29m7K35j32k9n2
7055a71M30l40J04J3o4j06mK7J21K11j57j53m5P0j04M08k10L24l71q5K15J5j30
7078bP9j59j34L90j72J63l37M5Nj76K10K57l49J82j94j1L49l51q2K67m6n1o5r2
7102b74J59j93K96r9K88p3k29J88O6O1k07j0O3p3lJ86k29K34p1j65J43j81J35
7125A2j31M14k18r9N8O1L8k26J60q4R9j90J50j05j59L47P1r7k07n5J05L6L5j23
7149a08m2K29k06J06J23k50L78j90k40NNL4N16l04r3Q5n0L78n36K17O6j03l82
$$ plain form
6986 -158 21 45 203 -258 -94 44 -72 281 -316 -84 -270 -32 85 -89 38 -164 17 -56 -21 -164 -126
7007 -126 -147 7 -23 85 81 -258 59 -197 177 -93 119 -33 15 54 215 -3 122 150 -117 -110 -40 79 -75
7030 -75 -137 -147 7 229 -82 -38 126 36 -46 -14 -183 -89 9 28 46 -246 -226 -126 83 -146 -193 42 -90 -119 -171
7055 -171 259 -81 23 36 -28 -134 -138 -111 10 221 64 -89 -134 -64 -168 240 30 354 -17 -102 113 128 -2
7078 -2 77 -82 -216 174 2 165 -172 -127 -122 -298 -88 169 -180 2 -192 -203 146 -205 -287 -20 -66 -117 -182 -274
7102 -274 -115 -308 -12 -111 177 104 -125 63 129 190 -17 -27 36 -37 -40 146 -83 151 80 -85 58 -123 12
7125 12 -119 295 77 -22 36 97 135 -91 69 -15 84 -106 44 -61 -220 127 198 101 -106 -161 -56 -20 15 -108
7149 -108 -150 79 -127 -21 102 -148 230 40 -200 -195 -190 -156 360 56 -37 48 -2 376 -160 57 123 20 -362
7172c62L51J61m60K59l0O7Q7j37J50j77Q1Q7Nj89p2P8P5j80J80K73k66J53l3j41
7196d0Q7rl2M8k35J62m3J05l5k8J60Jk88k7M10k77p7%J68j09j93J54J02R3p1J3
7222C9j7o0J29j41l7M96j35m79L16k5l01K53J15j98J47j01j51P4Kj44M73k15k05
7245a65k40M93J42j75j18n3K38j4k9l47P2K1J70P5k03q9j1N30l43K62k16j83K09
7268B6m3Q9l86K61J02N9j46KN0l64L93M6K17m70J94j23K37p7R3k54K09j64j00
7291a49J83j24J36J07k23q4K91j9m0k03J69l1P4q7k4J6J58j51N0J72k74j8L02
7314B31r7j91k0N6N1j13j82j89M66K27l24K0J82k06p9J42j24J97O3k94K35Q5k41
7337a05L02l2l76J56K2N6j88J65j58K7L75m30J29J30j02r9J78p4k3M6j60O2j57
$$ plain form
7172 -362 -11 150 -310 -51 -81 -14 73 -64 86 -91 -10 77 82 -107 -179 -101 -26 -206 -26 247 -19 134 101 -40
7196 -40 47 38 6 54 -181 -19 -62 43 8 -20 140 141 -147 -174 236 -41 -118 -118 50 -59 -252 -98 4 97 26 39
7222 39 22 -38 91 -50 -87 409 274 -205 111 86 -215 38 153 -45 102 1 -150 -76 -74 -218 255 40 -165
7245 -165 -405 88 230 55 -63 -116 122 108 79 -268 -196 -175 -5 70 -133 -222 -233 297 -46 216 0 -183 26
7268 26 -17 72 -314 -53 49 108 -38 -36 14 -350 43 89 306 -164 30 -93 144 67 160 -94 115 -49 -149
7291 -149 34 -90 46 153 -70 -154 137 118 78 -125 44 13 87 0 -24 -8 150 -1 49 221 -53 -71 231
7314 231 134 -57 -77 -21 30 -83 -265 -454 12 239 -85 -65 117 -89 -168 -26 -150 47 110 -184 51 136 -105
7337 -105 197 165 -211 -55 -33 23 -165 0 -158 -131 244 -186 -57 73 -29 -128 50 -24 -47 -1 -161 -99 -256
7360b56M57r2j09Q9M6Qj04n3P5R4n38N08j65K59K4k18j50j89M36j05P4M2R0k63
7384d0l5J57R1l83J29N7j01J67L4q4j05j1J22M0J0j14M0K87k43K08l86J43L29
7407C12k33l35J58J08j2K7K5K11j5K06n30M01j71r2k37K97m0k02N9K32j5m34J62
7430a18N3O9oq8L23o0o4l8j2r7p9K69J4K5j52k81K96l70K46K91k35j75L14k52
7454a27l08N38Q8j78j06m6K42n2m4j64K95j81K60j03j65J7K26j90p6K19m21K57
7476a9j89N23k41O6l1k34K24O2j09j33P1oJ12r8m0r1J05K2J26K60n04K61j98j72
7500b33J37L1K32k32M6j98J51p3L64m4j48J43j13o7j7K2k41J34Pp3J25J39o4p3
7524d5J01j27Q9q9j08J03J96j12L60l79l01K41J58rm7k1J1J32ql27L77m12M44
$$ plain form
7360 -256 201 109 0 89 135 143 39 -14 61 155 -383 125 -40 219 243 25 -125 -314 122 17 91 133 223 -40
7384 -40 -75 82 173 -210 -81 -24 -125 42 76 -8 -113 -124 -2 38 48 -66 -26 261 18 226 -160 -17 312
7407 312 79 -256 -98 10 -2 25 50 261 246 452 -78 323 152 60 -177 120 80 -122 -63 169 154 -280 -118
7430 -118 -65 4 -2 -90 233 173 109 71 59 -38 -117 152 166 191 39 -242 54 -316 -70 221 -14 -189 125 -127
7454 -127 -435 103 191 13 -93 -139 103 51 7 -157 138 -43 217 114 -51 -34 192 2 -74 145 -276 -19
7476 -19 -208 315 74 140 109 -125 99 161 52 -81 -10 -16 96 -2 -42 -133 -28 -6 120 380 -124 137 -61 -233
7500 -233 -96 -65 167 -65 -19 -217 -66 -139 225 181 33 176 63 -4 -21 1 -240 -106 -99 -172 -47 92 28 -45
7524 -45 56 -71 18 -71 -179 -76 120 8 368 -11 -312 -71 87 78 31 10 21 153 145 -182 195 -217 227
7547B27k69j28m2J97n3L9Q2K7k31K81k13J57q6m0N2k52M10p7k90J24O4L03j15
7570A67k78K77k43J5J34Lj26J08m7J02l6J62k99p8k40L44q6K29k64K36k03M7l
7593g9K66j2n1k25m9J83J49l03J29r7M2J1J46k4q9K63j77k70n1K15n5K3Q5lK07
7618B34l24L8j50J21L63m50M1Q8j7K14j12k35N1J83R7k57K24k68J96J38j6j00
7640E9J72k78P1K1L0n7qJ10j90J34k59L32j54l7J08j01m08L44P3K41j88K6K20
7663B61r6k06J03J7k35J39P0K15l93M3p6N7J46j57j47J48p1J98j17K76j67j39
7685a31J16j98M63l29K21%k26J73p1j06J21k4J74k87K21k43K2J02j24jL4o9K19
7708E7Q0k8k53J37q8J33J1p0M8l15K85j72J80O3M8j33J30j75K87k92L03o0j29
$$ plain form
7547 227 -42 -170 -212 -15 -68 -29 53 80 -151 130 -83 74 -12 -52 0 -252 158 81 -209 -85 -21 282 167
7570 167 -111 166 -77 -62 72 75 -51 57 10 112 76 238 -61 -139 -379 -35 -121 108 -156 80 -123 -76 -79
7593 -79 187 175 124 -101 -150 33 182 -121 8 -89 -47 -36 110 86 -3 260 83 -187 -238 -23 -78 -55 30 27 234
7618 234 -90 -52 -202 -81 282 -168 -127 -39 -56 158 46 -189 -138 45 142 -115 109 -159 37 175 159 59
7640 59 231 -47 24 45 75 18 10 120 -70 64 -195 137 -17 -54 54 -47 -455 -111 -38 203 15 41 261
7663 261 165 -41 62 79 -156 -17 53 268 -125 -82 -158 -101 45 -112 -259 -111 -182 16 -101 175 8 -131
7685 -131 -15 -213 250 -79 142 142 -84 89 18 -88 33 9 183 -104 117 -126 -104 -2 -126 -127 -93 -162 57
7708 57 137 109 -144 -7 -95 38 49 -21 27 -288 -3 -175 5 68 116 -17 113 -62 225 -67 236 176 47
7731D7q9J00j54J60N4k46K52j13j45l9N2K40j22j04L01l81Q6N0K97j54j06M2k41
7754b13J75Q2J1K84l64%K4q0K24j31J44J21k18k65L11j44P2j03j30P1K67p6l07
7777b45J39k0R1k02K44j9j5M1K72n15J30L10l37K05p9j45M11k60r8L1M89k91o6
7800G1k4J08m81M19k57r5K41m8J45qj0rn6N9j34P6R3j94J96L2N7l96K37j95L44
7825A71j92K5L4J03k2k13j06J65p3K03j49L53j69l85k5K06K99j78p0J47J4k36
7847i8M7k5P0K7j11K0Q2J1M1p2lp7L29j62R7n9j27j4M9J61k29Q8J0K22j99l5j19
7874g6q5J79j1j42K27Q0j7j83NJ34k27j72L72l98K79R7q6K2L9p8J37j34L73l30
7898Ej76P2J33P1l67K80j3K5qj6O1q3K54k82J27m1j3j60J54P6M4k48K73j84n2
$$ plain form
7731 47 -42 58 -96 64 118 -128 124 11 -134 -173 -121 119 -3 -107 194 -187 -101 -51 246 92 -14 28 -213
7754 -213 -38 44 55 339 -25 -25 -1 -81 143 12 156 277 59 -206 105 -39 33 -70 -200 -129 138 62 -245
7777 -245 -106 -126 -35 -237 7 -12 -27 14 286 -229 -99 211 -126 79 0 -145 266 6 -92 -61 428 137 71
7800 71 47 155 -326 93 -164 -259 -18 -66 79 71 61 52 -4 55 -79 -3 90 -104 92 124 181 -215 22 -173 171
7825 171 -21 4 38 141 119 -94 -200 -35 -108 95 -54 299 130 -255 -280 -74 225 47 -23 124 138 -98
7847 -98 -51 -76 -6 21 -90 -70 12 23 64 -8 -11 -88 241 79 176 117 -10 -24 25 186 -43 45 55 277 78 43 -76
7874 -76 -161 18 7 -135 92 172 155 -28 -23 111 -116 -288 84 -314 -35 62 -24 -2 37 -41 96 -38 335 5
7898 5 -171 -99 34 105 -262 18 5 30 22 6 67 -16 238 -44 83 42 29 -131 23 99 143 -105 168 -16 -68
7923f8R0J82l38J38j45K30m0J60P8m04M0K54j10k20P6J83j91J21J34r2L14n53
7945a61J44J56J16j49j54J49k85K79k18j15K55j12L73j81j42L6J56j64Q1J16n2
7966A28l24K14P9k40J84J02j8P2j49m7j14J68J11N3l02J95j17m1l8K11n2J35k66
7989e6N2k5j32R5R2K4J9n3pJ02j42K50k37j01M8o9P2o0k2L34l24N6J87l3j9K8
8015G9k15NJ0K38k36K38j62PK35j90l33K48L55m80L58l04j5R8J17P1k68m7L16
8038A25j63Rj51J65k7L37j99j62P0j7Q0k05O6J58N3M9l50K44l79L12j00K12K94
8061D21m24P6j47P8j17o0K62j36J24J6N8l03N3J06k63K43P4k73K5K58OJ82m54
8084a95m7J98R9k72L50P8L8l09K58k28l4j6orN3l2J42J55l37R9k4J27j82O6m5
$$ plain form
7923 -68 22 204 -134 4 -141 89 49 209 287 -117 -77 177 67 -153 -77 106 -85 36 170 78 392 -161
7945 -161 -17 139 255 106 -48 101 -184 95 -123 -238 17 -95 278 97 -45 -9 147 -17 64 180 128
7966 128 -196 18 97 -143 41 143 125 197 48 1 -113 55 166 219 -83 112 -5 -46 -84 127 75 210 -56
7989 -56 -4 -29 -161 -66 26 50 69 16 9 111 -31 219 -18 -119 -71 -140 -68 -128 -150 184 -140 -84 103 70 51 79
8015 79 -136 -131 -121 117 -119 119 -43 -36 199 9 -324 -76 279 -201 157 -147 -162 -64 53 124 -144 -191 125
8038 125 -38 -29 -180 -15 -42 295 96 -66 4 -13 67 -138 -72 86 139 188 -162 82 -297 15 -85 127 421
8061 421 -3 73 -74 4 -113 -173 89 -47 77 93 151 -152 -99 7 -256 -13 61 -212 -187 71 77 259 -195
8084 -195 -242 -44 55 -217 133 211 249 -60 198 -30 -64 -80 -86 -95 -42 -74 68 223 -114 -15 -39 88 -94 -28 -73
8109g3M3j25K51l13K93m9j71K13j54J93o3P6k87L30J68l31n8J34o2K00k12j12
8131a09J67j71R6J4j14J65j8P7j23kK69k34N7M8j01k35K36j94K58j48N0k2nL00
8155B61k83j85J37k2K1L06m27R3j46M9L50o9j78n3K56j11J81j84j52K53J9l58
8177b42j0K07K80k68O9J12l27J59q0K7Q0l2PL10
$$ plain form
8109 -73 -30 -155 96 -217 76 27 -144 69 -85 108 45 121 -166 164 332 1 -57 77 15 215 3 -109
8131 -109 58 -113 -17 -3 -117 48 30 107 -16 -18 251 17 74 122 21 -214 22 -172 86 -62 -12 -34 -39 261
8155 261 -22 -207 -70 -92 -71 235 -192 -99 -245 -196 154 85 -93 -146 110 -1 180 -4 -156 97 116 -242
8177 -242 -252 -45 235 -33 36 148 -179 -20 -100 -73 7 -25 -18 292
8191B92
$$ Imaginary data points
##PAGE= N=2
##DATA TABLE= (X++(I..I)), XYDATA
0@%%%%%%%%%%%%%%%%%%Kj0J6j6J6j6J6k0K8l2L4m2M9n3O1o9P7q7R8j11J25j39
40g3J54j71J90k09K31k57K83l12L45l78M15m58N05n58O17o83P59q46R47j065J207
61F43j385J611j904K302k886L820n560R850l7964o2412Q6923M9372l6329o97Q2320
76H7704L0060n5327l0561M0297N955o1271l2082L8893J0743n2036k1876M0371
88H70P027m8344k1215K1072m879l7228n642L6810K6510N798J6065K8803J3557
101C9204p095j1543K581J3765N085n128N243J5669j9k1240j4876Q87o461k9206
115a3134k7936m66O359j8868j4001K8441K7708j6563j5784K1834J4842k0839p198
128c5605L4444L0177m082k933K5353J7443j9468k0773J2376J1409k3138k2963
$$ plain form
0 0 0 0 0 0 0 0 0 0 0 0 0 0 0 0 0 0 0 0 2 -8 8 -8 8 -8 8 -12 16 -16 18 -24 25 -28 33 -36 41 -46 52 -59 66 -73
40 -73 81 -90 100 -109 122 -135 148 -164 181 -197 218 -240 265 -293 324 -359 400 -446 501 -564 643
61 643 -742 869 -1035 1267 -1619 2201 -3359 6491 -31473 -93885 -6962 42410 6081 5384 87704
76 87704 117764 62437 31876 72173 78128 16857 -15225 23668 34411 -17625 -39501 870
88 870 7897 -40447 -61662 -40590 -45469 -82697 -88339 -51529 -25019 -19221 -3156 25647 39204
101 39204 32109 20566 23147 36912 41997 36869 42112 57781 57762 36522 21646 22533 16072 -13134
115 -13134 -41070 -41536 -35177 -54045 -68046 -39605 -11897 -28460 -44244 -22410 -7568 -28407 -35605
128 -35605 -1161 29016 24934 22001 47354 64797 45329 24556 36932 48341 25203 2240
140B240P040P097k0386j9704P836J0374j5726k0440l66P904m866r466R489K6096
154a2878J2298p950K246K2188R864j4694j52K5696J0061k1222r976J7673O031
167C9185k4180j4817J8593P206l2127k3513J7153P504l1471j4747L0463J5671
179e080k5592q701L1063J4908k2157o335L1020J5394k2322q267K7324J4730j9281
192A6704o040K4812P665k7697j7115J0898p56k2386p913J5996P264j2747p372
205a8687P967L600j0088r568N250J0059k44l654J0344J7342O505m951J76P985
219B2036j990j6362r408J0755Q924r172l814J6760P969k1758j7979Q428K849k2256
233b5018j0117K1632J5174j2246m807K2267J1953j9115j4174J4004P679j7603
$$ plain form
140 2240 9280 16377 -4009 -23713 -15877 -5503 -21229 -41669 -42035 -34131 -38997 -48463 -38974 -12878
154 -12878 -580 -8530 -6284 15904 25768 11074 10922 36618 46679 25457 15481 33154 39185
167 39185 15005 188 18781 25987 -6140 -29653 -12500 -4996 -36467 -51214 -20751 -5080
179 -5080 -30672 -39373 -8310 6598 -15559 -21894 9126 24520 2198 -6069 21255 35985 16704
192 16704 10664 35476 43141 15444 -1671 9227 8471 -13915 -21828 -5832 1432 -11315 -18687
205 -18687 -10720 -7120 -17208 -26776 -21526 -11467 -11711 -15365 -5021 12321 18826 13875 14051 22036
219 22036 20046 3684 -5724 5031 13955 4783 969 17729 25698 3940 -14039 -5611 -2762 -25018
233 -25018 -35135 -13503 1671 -10575 -15382 6885 18838 -277 -14451 -447 7232 -10371
245a0371q016K3844J8475j0079o650J5436M505k3325j7774O807N536j0931n091
258a7634J5395J5374n355j0701L740N616j2043j5774L190J3085J138m291J0026
271A766J7244J663j3598n739N883m519j7777l460J8052R779r262j57J7143K666
285A9684k2131j1908J1375J853j6883k872K2239J2756j0872l720J6163L517k1696
298b495j3127J2059O217j4367k884K0888J1210j2005p295R993J147j8249j1111
311b0019R182R264n163k102J3643J2050p070j0096L309M932q884j0940N212J2477
325E795L14o011M863J0040l564j4957m681O741j651j2835l37J5595N367j0111
339e432p07J3280J798j5414n559J2794M664j1202j364J6973Q424j1898n622J2379
$$ plain form
245 -10371 -18387 5457 23932 13853 7203 22639 27144 3819 -13955 -7148 -1612 -12543 -17634
258 -17634 -2239 13135 7780 -2921 819 6435 -5608 -21382 -18192 -5107 -3969 -8260 1766
271 1766 19010 20673 7075 1336 7219 2700 -15077 -18537 -485 9294 32 -125 17018 19684
285 19684 -2447 -14355 -2980 -1127 -18010 -20882 1357 14113 3241 -479 15684 19201 -2495
298 -2495 -15622 -3563 2654 -11713 -14597 6291 17501 5496 -1799 8194 9341 -8908 -20019
311 -20019 -10837 -1573 -6736 -8838 4805 16855 9785 -311 2998 7930 -954 -11894 -6682 5795
325 5795 6109 98 4961 15001 11437 -3520 -8201 -1460 -3111 -15946 -16283 -688 4679 -5432
339 -5432 -6139 7141 8939 -6475 -12034 760 5424 -5778 -7142 9831 18255 6357 735 13114
353A3114L285j6512r283J1160N281j3368n763J2692O712j1930p988R004N443j1125
367i278p767R785R032o350n597J0919J1437n705p212P082Q659o200r975M395Q821
382A2046m626j0091K737R504l194j1880p99Q285l580j3570j043J0953P79j0064
396a4543J906J4102L606q887n98J1667K505j1506k797J2317N362q854j981J3183
410A5482M666j3256p514O770M58j4268p172Q469N865q238m412J0010O745r552
424e947q067O100O207p567n409J0777J2458q14l596Q152Q104o970j1887J342O171
439I054m797q178M082J1116k257j0367o24N690o310j4543k057Q822L11p077M870
454a2265J4953M596q448p84Q475n69j1856j625J2872P169n812R91J2074K228j2601
$$ plain form
353 13114 16399 -113 -9396 1764 7045 -6323 -12086 606 7318 -4612 -12600 -3596 1847 -9278
367 -9278 -17045 -7260 1772 -4578 -10175 744 12181 6476 -736 6346 15005 8805 -1170 3225 12046
382 12046 7420 -2671 66 9570 6376 -5504 -6303 1982 -1598 -15168 -16211 -5258 -4479 -14543
396 -14543 -12637 1465 5071 -3816 -4414 7253 9758 -1748 -4545 7772 13134 4280 2299 15482
410 15482 20148 6892 -622 6148 6606 -7662 -14834 -6365 -500 -8738 -13150 -3140 3605 -5947
424 -5947 -14014 -7914 -1707 -9274 -14683 -3906 8552 7738 4142 12294 20398 13428 1541 2883 9054
439 9054 4257 -3921 161 11277 9020 -1347 -1971 3719 -2591 -17134 -19191 -10369 -10058 -17135 -12265
454 -12265 2688 7284 -1164 -1948 6527 5958 -5898 -7523 5349 12518 6706 7697 19771 21999 9398
469I398q900L871q49j2192o169Q945O226o267l891Q377M521r972r315M296N253
484f668n656k489J2322J3268m05m110N811N426q447j0742K543P624k181o942N448
499D802R400l927j1569r41M439p171j2920l45Q985L92n261N390J2595J843r009
514c297j951P099j26q538J665J2924O372m995n37Q162K70j1456o586M300O90r375
530e379m992P110M967o773m330O958L584r334q230N439O082l692k271J1313J0462
545A0914k770n877M464N722n315q230M516Q093l539q256L151P437m249r587N24
560c002N661n523j1011m7P834mn527L087J0723R65q333n71Q253J691o981J219
576a566J0343L089p259j750P582J951q238l506N549Q21j0808n956N847L876o137
$$ plain form
469 9398 498 4369 3520 -8672 -14841 -5896 330 -5937 -9828 -1451 3070 -6902 -16217 -11921 -6668
484 -6668 -12324 -14813 -2491 10777 10372 6262 12073 17499 9052 -1690 853 8477 6296 -646 4802
499 4802 14202 10275 -1294 -2235 2204 -4967 -17887 -18232 -9247 -8855 -14116 -8726 3869 5712 -3297
514 -3297 -5248 1851 1725 -6813 -5148 7776 14148 9153 8616 16778 17048 5592 -994 3306 3996 -5379
530 -5379 -10371 -3261 1706 -5067 -9397 -2439 1145 -8189 -16419 -10980 -4898 -8590 -10861 452 10914
545 10914 8144 2267 6731 12453 7138 -1092 3424 11517 7978 -278 2873 10310 6061 -3526 -3002
560 -3002 2659 -2864 -13875 -13922 -6088 -6092 -11619 -8532 2191 3156 -5177 -5748 2505 4196 -2785 -1566
576 -1566 8777 11866 4607 2857 10439 12390 4152 646 6195 7016 -3792 -9748 -3901 -25 -6162
591f162l640P378M536p652o358N385N396m149l350P601P675l042m623N818P386
606A2199l169o693K690N199n722r165K737P511j816o022J610N856m804j0672j259
621a1520O590k85o151L002R627J738o535Q01Q626O88p419j421P111J030o592l02
637a012R431M131o679l580L911r59j1123n259N747M727m487j700P611L841o819
652b219n520M235L961n277m140O090P052j712k927O659O945m286p960O61K726
667D288m986o745M125Q878ln375R47M068m990r641o54O636p3n271L070R106J515
684D895n790N96O518r50q656j676N976J830m880J355R458K803p334m467L185j559
700A304q444k950P051M808l778j298O195K623o325m840L519L218n218l534O091
$$ plain form
591 -6162 -9802 -2424 2112 -5540 -11898 -6513 -1117 -5266 -8616 -1015 6660 3618 -1005 4813 12199
606 12199 9030 2337 5027 10226 4504 -4661 -1924 5587 3771 -2251 -641 5215 411 -10261 -11520
621 -11520 -4930 -5215 -11366 -8364 1263 3001 -3534 -2733 5893 6581 -838 -2259 4852 5882 -710 -1012
637 -1012 8419 12550 5871 2291 6202 5243 -5880 -11139 -5392 -665 -5152 -6852 759 4600 -2219
652 -2219 -7739 -3504 457 -4820 -8960 -2870 4182 2470 -457 6202 13147 8861 901 1562 4288
667 4288 -698 -7443 -3318 5560 5557 182 1129 5197 207 -9434 -10088 -3452 -3525 -8796 -5726 3380 4895
684 4895 -895 -299 6219 5269 -3387 -5063 913 2743 -2137 -782 8676 11479 4145 -322 2863 1304
700 1304 -7140 -10090 -3039 1769 -2009 -3307 2888 5511 -814 -5654 -2135 1083 -4135 -7669 -1578
715a578O260j994k195M669M617n227p703Q46L420k891m261M322P716j258n658
730i15L65M419l456p505O83O534l66m727J815Q060L93n517p9N171j241p505j453
747e324N974J969m961M60P115J470p302k792L965L71n885j756O404L552m543j574
763b857N588K846n061l590M107K511m922l796M770M617k950l101L878L536m176
778A400n621J449L830k754m215L059O120j708m638K020N120j683n551J178N081
793C087j266n200J374O521Q02n313J15N295j233o948j668M854K82n266k92O294
809A438J421n407q04M994P90n497k371M882K604m162p29O173L138l249k673L013
825C561J822n151m082L075L350k789k812L622L761l359m806J479K632l375m592
$$ plain form
715 -1578 4682 2688 493 5162 9779 4552 -3151 -2305 1115 -1776 -6037 -1715 6001 4743 -915
730 -915 -550 3869 413 -7092 -6409 125 -241 -4968 -3153 4907 5300 -217 -296 4875 3634 -3871 -5324
747 -5324 650 2619 -2342 -1882 5233 6703 -599 -3391 574 945 -4940 -6696 -292 3260 -1283 -2857
763 -2857 2731 5577 516 -3074 1033 3544 -1378 -5174 -404 4213 1263 -1838 2040 5576 1400
778 1400 -4221 -2772 1058 -1696 -5911 -2852 3268 1560 -3078 -1058 4062 2379 -3172 -1994 3087
793 3087 1821 -3379 -2005 4516 5318 5 120 5415 4182 -2766 -4434 420 702 -4564 -4856 1438
809 1438 2859 -2548 -3352 1642 2432 -3065 -5436 -554 2050 -2112 -2841 3332 6470 3221 548 3561
825 3561 5383 232 -3850 -775 2575 -214 -3026 596 4357 998 -3808 -2329 303 -3072 -7664
840g664K418N431rl132K994N598j302n407M07M035j435n061J825O137Q58m677
856A016Q17M535j818p103k209L657n34m940L67O142K047l981q72M300L46n604
872c834k089M525K505k559o1O162L319l244k959K791O78n405l840K972L181k242
888a00k380L491L346l719m845N77K381l285m150L247N712Rk350L108M711j624
904D129n404M61L831r30m305K177N730K89l875k37L525j937o639j632L123m86
920b180l558L85N265J449l862p01L513N99m800j620M507K949k153l8N193K701
936G649l361k746K401R68m625l438L313K615k696k485K667K768l745m396J248
951c863K586l006k906L211M094J68k609K744L961j228m108O34M128r86l624J679
$$ plain form
840 -7664 -5246 185 176 -2956 38 5636 4334 -1073 -666 3369 1934 -3127 -1302 4835 5693 1016
856 1016 1833 6368 4550 -2553 -4762 -1105 -1639 -6579 -6212 -70 1977 -2004 -2876 1424 1770 -3834
872 -3834 -5923 -1398 1107 -1452 -1513 4649 7968 4724 1765 4556 5234 -171 -4011 -1039 2142 -100
888 -100 -2480 1011 4357 638 -4207 -3630 -1249 -4534 -8684 -5437 275 284 -2066 1042 5753 4129
904 4129 -1275 -814 3017 2087 -2218 -41 5689 5978 2103 1866 5391 3454 -3185 -4817 -1694 -2180
920 -2180 -5738 -5353 -88 1361 -2501 -3202 311 910 -3890 -5510 -1003 1946 -207 -245 4948 7649
936 7649 4288 1542 3943 4911 286 -3152 161 2776 80 -2405 262 3030 -715 -5111 -3863
951 -3863 -1277 -4283 -7189 -3978 116 284 -2325 419 4380 3152 -956 -322 3806 2820 -804 875
967H75M644o22l765J8K984j386n078j422L077l91m104L0M297J106l420m72L557
984g2M53l598r88M272J923k378l1M195K151k858j689K332J270l583k861K064J847
1001B449k893k641K766K434l131l062J485K014k498l152K207M019p63k317K823
1016b60M234j092l440J470L427j744l124J163L535n74l407R60L369j252m413j284
1032b432K021j151l803J80L772J052k387k36L395O12l332q63L197J500k418k94
1048a187M006K267k149r73K416J084l937k885J336J355k819j658L129K453k446
1063hk514P98J507k772l435K606L352m99j564K623L815j253k827J452K325j829
1079A777l157R48L271L6k336J115L247j694m465j063J567j105l257Q04L986O75
$$ plain form
967 875 5519 4897 1132 1150 4134 2748 -2330 -3752 -675 -1066 -5170 -5140 -843 263 -3157 -3629 -72
984 -72 381 -3217 -4205 67 1990 -388 -419 3776 5927 3069 1380 3712 4982 1399 -1462 602 2449
1001 2449 -444 -3085 -319 2115 -1016 -4078 -2593 -579 -3077 -6229 -4022 -3 -766 -3083 -260
1016 -260 3974 2882 -558 912 4339 2595 -529 634 4169 3595 188 1148 4517 3265 -1148 -2432
1032 -2432 -411 -1562 -5365 -5185 -1413 -361 -2748 -2984 411 1023 -2309 -3172 25 1525 -893 -1187
1048 -1187 2819 5086 2937 1964 4380 5464 1527 -1358 -22 1333 -1486 -3144 -15 2438 -8
1063 -8 -2522 -1724 -217 -2989 -6424 -3818 -466 -965 -2529 94 3909 2656 -171 1281 3606 1777
1079 1777 -1380 -432 2839 2875 539 1654 4901 3207 -1258 -2321 -754 -1859 -5116 -4312 -326 349
1095C49k387R4K878k22l406l43K652J234k273K01L795J816k108p93K479J48l857
1112B57k610J966J287j925r44K888K003k602l050J438R99k469k059K390K594q44
1128f81j496K496K902j103k438J049J721j633k893J096L655l03k033R69K388j546
1144B150l757q86J943m20k393P19L164M41k604O8K711Q8l096l18K799l3k068J78
1162a314L241J362k055p23K006O6l425j539K103J352j907p23K215J644k503j956
1178b156J458J750j924k020J679K105j280j088J633K866q17k595Q76J753j801
1193D39k802R31L068n8k609J118K250j158l172J55K619p89k615O28K513P3k093
1210a502N74L104J76k929m08J999o42k214J21L014J155k202m77J792M1k693j348
$$ plain form
1095 349 -2038 -1944 934 712 -2694 -3037 -385 849 -1424 -1223 2572 4388 2280 1487 3966 4114 257
1112 257 -2353 -387 900 -1025 -1969 919 2922 320 -2730 -1292 -293 -2762 -4821 -2431 163 -681
1128 -681 -2177 319 3221 2118 -320 729 2450 817 -2076 -980 2675 2372 339 1308 3696 2150
1144 2150 -1607 -2493 -550 -970 -3363 -2644 520 961 -1643 -1575 1136 1224 -1872 -2190 609 576 -1492 -1314
1162 -1314 1927 3289 1234 511 2517 2583 -842 -2381 -278 1074 -833 -1556 659 2303 -200 -2156
1178 -2156 -698 1052 -872 -2892 -1213 892 -388 -1476 157 3023 2206 -389 487 2240 439
1193 439 -2363 -1432 1636 1578 -1031 87 2337 1179 -1993 -1838 781 -8 -2623 -1995 518 591 -1502
1210 -1502 -928 2176 2352 -577 -985 1014 372 -1842 -1721 1293 2448 246 -231 1561 1602 -1091 -2439
1227b439J799J025j669p74K018J473j006j577J957J432j872k546J481J595j078
1242a81j461K193K928j216k537L94J479j464l259J202K814q47k189J058K937q14
1258A037k703P09K212j053l003P26L068O9j616J346K685l84l081p61J680p12k182
1275a963M98K291N32j518n90J570J8k107j310J445O73j379n47K204J665n00r39
1292D3J258J259k075k220J238J752p70j505J870K399j288k569J28J500j784k840
1308c604J178K744j073j951J371L210o33k985Q83K118j380k162O86L278j03j206
1324C71J151K183r47k909j9J424j031k248N06J989N1j376j88J391l8k310q30J164
1342a666Q08j000p8J794K041n47j249J311Q66j328k061J125K070r54j742J654
$$ plain form
1227 -2439 -640 385 -1284 -2058 -40 1433 427 -1150 807 2239 367 -2179 -698 897 -181
1242 -181 -1642 551 3479 2263 -274 120 1599 135 -3124 -1922 892 45 -2144 -1086 1851 1037
1258 1037 -1666 -957 1255 202 -2801 -2075 993 1062 -554 792 3477 3093 12 -749 931 219 -1963
1275 -1963 -1465 826 1358 -160 -750 820 838 -1269 -2579 -1134 -461 -1840 -2387 -183 1482 982 43
1292 43 1301 2560 485 -1735 -497 1255 485 -1020 850 3249 1961 -608 -480 1020 -764 -3604
1308 -3604 -2426 318 -755 -2706 -1335 1875 1242 -1743 -860 1258 -122 -2284 -1598 1680 1577 371
1324 371 1522 3705 2758 -151 -170 1254 223 -2025 -1519 470 521 -855 -1043 348 310 -2000 -2830 -1666
1342 -1666 -858 -1858 -1936 -142 1899 1352 103 1414 2280 952 -1109 16 2086 1132 -610 1044
1358A044J914j276k844N97J651j931k545P11K436m27k425J886K696r15k413J061
1374g80K189j330j887J314K867n25j772J574J931j319k441K81J114j116j757M30
1390a227J441j06j270q1J367l18j571o74R57P19m86n32J736J466k15p16O73J406
1408B569j222j967Q70J713r70j563J162J893j003k639P81J689j875k835J143J932
1424c22r22j811J607K632q65k142J452K059j527j930J545K375p08j545J525J950
1440C373j300j786M11Q25j526j817N11J319k09j122O44R73k79j225k95M96L48
1457f59q65L2J000J581r0n80Q61J324j056j982N12J455q07j639J064K339j165
1474A325k231J102J376k004k901J218K197j020k166K005K881j027k306J570J938
$$ plain form
1358 1044 2958 1682 -1162 -565 1086 -845 -3390 -2679 -243 -670 -3095 -1209 1487 572 -1841 -780
1374 -780 1409 79 -1808 -494 2373 1848 76 1650 3581 2262 -179 102 1216 100 -1657 -1227
1390 -1227 214 108 -1162 -1243 124 -194 -1765 -2439 -1482 -763 -1249 -1781 -45 1421 1206 490 1163 2569
1408 2569 1347 -620 250 1963 993 -570 592 2485 1482 -1157 -376 1313 -562 -3397 -2254 -322
1424 -322 -1244 -3055 -1448 1184 319 -1823 -371 1688 161 -1769 -224 2151 1443 -102 1423 3373
1440 3373 2073 287 698 1523 -3 -1820 -1309 10 -199 -1321 -677 296 17 -1208 -1503 -1007 -659
1457 -659 -1524 -1492 -492 1089 999 419 1280 2604 1548 -434 78 1533 726 -913 151 2490 1325
1474 1325 -906 196 1572 -432 -3333 -2115 82 -938 -3104 -1099 1782 755 -1551 19 1957
1489A957k205j957J669J848o04j347J796K053j353j729N65N41j005k060P91J140
1505A00n23m23N13Q70k67j388k58M69R2n48k95J509J209N8r58Q29J465j249j504
1524b99k1J533q98j568J352J936q26k003O74J492j804k333J140J903j519j198
1540b439J965K308j109k385J599J752j767j884J522K221j273j114J333J963j194
1555A498j769M84O22j238j067O34R46j29l62L90M77o2q80n53N90O6r95M7J067
1574b34J210o59j24P55Q11r91j983R40J234j073j099J293J932j274j801J143J318
1591A398j387k079J181J628j075j495J295K068j082j520J285J485j639j582J105
1606d14J419q01j284J731J306j119j203P17O41j409q76N33J166m91n47M62Q14
$$ plain form
1489 1957 -248 -2205 -536 1312 708 -639 1157 3210 1857 128 693 1234 229 -1831 -1040 100
1505 100 -423 -846 -333 537 270 -1118 -1376 -907 -815 -1363 -1658 -149 1060 1118 160 989 2454 1205 -299
1524 -299 -320 1213 315 -1253 99 2035 1209 -794 -120 1372 -432 -2765 -1625 278 -1241 -2439
1540 -2439 -474 1834 725 -1660 -61 1691 -76 -1960 -438 1783 510 -604 729 2692 1498
1555 1498 -271 213 835 -403 -1470 -836 110 -19 -381 9 486 424 -456 -1009 -419 -353 -1348 -1301 -234
1574 -234 976 317 193 948 1759 768 -1215 -275 959 -114 -1213 80 2012 738 -1063 80 1398
1591 1398 11 -2068 -887 741 -334 -1829 -534 1534 452 -1068 217 1702 63 -1519 -414
1606 -414 1005 204 -1080 651 1957 838 -365 352 993 -416 -1292 -759 407 -84 -631 -169 645
1623F45k72r21J97J50J66m88o11Q57O07n4n47P39J100r08j581O49J054r54j307
1642a479J435J477r70j493J013J575j580j456O11J763j116j784J577J882j059
1657C96j298J513J126j439j615P24J518j055r39J213J559j079j128N72O70q94
1673a56q64J43R30k52m24M80O46K81m08n86O89j87r52l00O14J039n26k81R48N15
1693A349j321r63L80R94q77j004J028J595q85j057J086J160j187j174M89Q59p82
1710c10j048J159J704p18j064Q24J099j354j566O45R33l08q86J194P39o62q79
1727d98M80L31l85q01kQ71l69m38P91J006J03o30m28J72K36j125l17J131O42m77
1747B93l96O98N12r97j201Q27O78r19p44J165P45n55q63R06J183j247j126P64
$$ plain form
1623 645 373 -548 -351 -201 -35 -523 -1134 -277 330 276 -271 468 1568 660 -921 -272 782 -172 -1479
1642 -1479 -44 1433 463 -1030 -17 1558 -22 -1478 -867 896 -220 -2004 -427 1455 396
1657 396 -902 611 1737 298 -1317 -593 925 -130 -1069 144 1703 624 -504 68 738 -156
1673 -156 -1020 -877 53 -199 -623 -143 503 784 376 -210 479 292 -660 -960 -346 693 167 -114 834 1349
1693 1349 28 -935 -555 439 -438 -1442 -414 1181 296 -761 325 1485 298 -876 -387 472 -310
1710 -310 -1358 -199 1505 787 -277 547 1646 292 -1274 -629 304 -4 -890 304 1043 381 -498
1727 -498 -18 313 -72 -873 -875 -4 -373 -811 -20 986 1089 459 31 203 439 -686 -1003 128 770 293
1747 293 -103 595 1107 110 -1091 -264 414 -505 -1249 -84 661 106 -757 149 1332 85 -1041 -277
1765b77P73q96p92J281J530p36r58Q01O57j152j184N25O01m69o32Q57P23l58q03
1784e09J08R99q06p30K06O01K36q91N88J099L29j145m43P36L1p09k21Q27N69p56
1804A19k18R13L44j380n07P82J70q70q51Q55Q07o08n05J009J332j140q74O24O28
1823F30n46q81J164Q29n87q74R08N19q13p26M2Q63o25j042P64O64l02o90M45Q05
1843E47n68j009m7R13n6l07K59J167j1p60p5Q49j74r68j03O87L02q02k09J038
1863F73L49r92p00N79N3p53o60P76P83n72k93R02Q49j120m81M81N38n44o65J162
1883C65P60n94p50O83P21n98p90k49Q35n72j048O76R80l06q38L07Q46m66j136
1902a174J88P60%k13J87Q30L68r00J51R37j49j166m33Q11O24r39l36J086L85j080
$$ plain form
1765 -277 496 -400 -1192 89 1619 883 -75 726 1383 231 -953 -428 173 -296 -928 -71 652 294 -509
1784 -509 -401 598 -208 -938 -732 -131 105 -786 -198 901 1230 85 -358 378 409 -300 -521 306 875 119
1804 119 -99 814 1158 -222 -729 53 223 -647 -1498 -643 164 -444 -949 60 1392 252 -622 2 630
1823 630 84 -797 367 1196 609 -265 643 1162 349 -377 -335 528 -97 -1139 -375 289 -13 -703 -258 547
1843 547 -21 -1030 -1077 -164 -220 -527 -268 899 888 128 53 902 728 -240 -343 344 646 -156 -365 673
1863 673 1022 30 -670 -91 -38 -791 -1451 -675 108 -464 -757 145 994 -126 -607 -126 412 -132 -797 365
1883 365 1125 531 -219 464 1185 587 -203 -452 383 -189 -1237 -561 419 113 -725 -418 428 -38 -1174
1902 -1174 -986 -226 -226 -439 -252 578 946 46 197 1134 985 -181 -614 197 821 -118 -454 632 1017 -63
1922f3o22M07J65m39r32O52Q11l15j87N16P69o24m98N64N31o44o11N31J178o11
1942E78l81N43N04n46j068L3M41l64n93L0J236k45p74J55R96k90j013j60O24K43
1962e1o91M09R06L01n67k6N76o8q05m97R77Q7r40J08Q38J70p19o10M18J54o86
1983g16m51O77N26o30J35Q13L01n19l75K71N89o48n04N34Q08k54o67O66L36l24
2003E68o58k36M16l59m43J42O75m01j91N9O32k70l36j90N24P9l70K36N76L29o72
2024A10j64P77j41p72k43R08j8p03k45Q09K95r32j56N48J35p72m68P68K48k71
2044b87j97L02P72o18j85L77O76o85n39N64N05l53n71N13N56m56l37r2K36o9p56
2065f44K46M60L50q28L82J90O7m94k29P51j06m11k66R31J24k34j73N16L1o40m64
$$ plain form
1922 -63 -685 -278 -113 -552 -1484 -832 -21 -336 -523 -7 762 138 -360 204 735 91 -520 11 1189 578
1942 578 197 740 1244 698 -370 -337 104 -260 -853 -823 413 168 -606 -451 545 255 -758 -918 -294 -51
1962 -51 -742 -333 573 874 307 281 857 789 -16 -513 464 551 -389 -281 557 727 8 -602 -184 -30 -716
1983 -716 -1167 -490 36 -594 -459 354 655 136 -239 32 621 -27 -531 3 811 557 -110 556 892 568
2003 568 -90 -326 90 -269 -712 -570 105 -296 -487 -428 204 -66 -402 -592 -68 11 -359 -123 453 782 110
2024 110 -54 723 582 -190 -433 475 457 -246 -491 318 613 -319 -475 73 208 -564 -1032 -264 -16 -287
2044 -287 -484 -182 590 -28 -213 164 840 155 -384 180 685 332 -239 274 830 374 37 -55 181 112 -644
2065 -644 -398 62 412 -416 -34 156 223 -271 -500 251 145 -266 -532 399 523 289 116 632 663 23 -441
2086d41O92n9n18M0L59L07o09j35M35Q8o18l04M86N27n85q2L43O41k18l74L75
2107C50L25p31l16K85M12k3l25L69M97n81l27k87M34j90n50J44O25J09o73J92
2127b61N53J06q38K02O70l60n07K83M99K3n15M8N76k10n74mL3L25m06j80Q17J89
2149D69o24r8M24K98p28l87N18O29p88k89Q66M26l77m57L58K70p98r7L46L58k46
2170G3k46K16M47k02o21J54J06j39l54K50K91J67m70N40K82k90j78k54M19M1o99
2191d67J70Q73j02m71k24N96l5p46k80P12J44o32J0L71L16m01M7J04N62q23k67
2212e43N78K90m92j70O87K76n62j5K86l2l91k11J71O36q13p8L71K78p4m48m9P94
2234D89m86o57L71M77R4m44J14N00J03p82K96L38k76l73Q5L63J33k66j06K5L61
$$ plain form
2086 -441 251 192 -326 -286 73 380 -229 -364 71 159 -459 -763 -277 250 -335 -417 -74 567 349 -25 350
2107 350 675 -56 -372 -87 325 302 -23 346 843 262 -65 -352 82 -108 -658 -514 111 220 -453 -261
2127 -261 292 398 -440 -238 432 72 -435 -152 347 370 -145 -97 479 269 -305 -309 -276 49 -357 -537 280 469
2149 469 -155 -253 171 469 -259 -646 -128 501 -287 -576 290 716 339 -118 240 510 -288 -385 -39 319 73
2170 73 -173 43 490 288 -333 -179 -73 -212 -566 -316 -25 142 -328 212 494 204 26 -228 191 232 -467
2191 -467 -297 576 474 3 -221 375 340 -406 -686 26 170 -462 -452 -81 235 -166 -119 -15 547 -276 -543
2212 -543 35 325 -167 -337 350 626 64 49 335 303 -88 -299 -128 508 -305 -383 -12 266 192 -256 -305 489
2234 489 3 -654 -283 194 288 -156 -42 458 561 -221 75 413 137 -236 -151 212 345 79 -27 -2 359
2255C59n86l71K94L31n27j5M85J03j84n6L61M30o76k26L8N03o5l70L85L44j93
2276C64m88M22j75K04q29K68J36l65K3L69L18k22j72q4K93k98k31K45N04J52n20
2297h6L78L56M2p47K01J89k35k70j08L93l8k33j93M59o1k34p9R9l6l53K34J74
2319a48K42Ok58L57J84k26l34L08K87n04k69Q73J8k93k86J96R0n4m95K41l58K86
2341a37m64L70K90k98r8L93O5l16j80L78L59n4l30R3K49Q7l06J5O0O9n79J83J61
2364A0M5m68L12K76Mm76l81K27L45k91R4m1N94k58pJ54K03k92j86N60k8j59m09
2387a72N14M5j00o82N89L44p32k66K75J16l97J13J51K87k14l21M71q6j41j11L2
2408b85M58O1l14L96L74l16k18K9J86l69k25O0K21L2k46N9L39K37q70N3K69j04
$$ plain form
2255 359 -227 -598 -304 27 -500 -515 -30 73 -111 -167 194 624 -52 -278 -240 263 198 -172 213 557 364
2276 364 -124 298 123 327 -502 -234 -98 -463 -440 -71 247 25 -147 -231 62 -236 -467 -222 282 434 -86
2297 -86 292 648 690 -57 144 333 98 -172 -280 113 75 -158 -351 108 47 -187 -266 -167 -203 -556 -322 -148
2319 -148 94 100 -158 199 383 157 -177 131 418 -86 -355 518 536 243 -43 153 243 189 -306 -65 -423 -137
2341 -137 -601 -231 59 -239 -337 56 121 -195 -375 3 362 308 -22 71 320 407 101 116 176 245 -334 -151 10
2364 10 55 -413 -101 175 179 -297 -678 -451 -106 -397 -303 -344 250 -8 -15 139 342 50 -136 424 396 237 -172
2387 -172 342 387 287 -395 194 538 -194 -460 -185 -69 -466 -353 -202 85 -129 -450 21 -65 -206 -317 -285
2408 -285 173 234 -80 316 690 374 156 185 371 2 -223 -163 58 90 -156 -97 242 479 -391 -338 -69 -173
2430a73k76R6M71P9k16o2M62j1j50j91nL52k40m08L11P7Pk72J56L79o15k06L47
2453h8L85n52P0K10N1m2k46M22J66l65l00J45L48n1k77J73L35K6k01j42M12n50
2475g1k90R3J25K54j15l98N26m5k60j86L09J70l60J88k02L66j87P7J16K95l00
2496A05k39j7M69j36m58L99jq2l37L11K34l12l15J57L28n88J82K54K44o2j54m
2518b2M6K53m41K59K26k86k12R3N50k19k89JJ73j13l18N5Q4J88k36N7L83r9k35
2541a02k51L63L45l97j74K35L6o7J0M23j1k65k2r8Pp9k83L68J93j87j07r2M81
2564C26k21n89M55j8p2p4K05J03J4k91K42J90p7k25p1J6J55m90M20M44l39k37
2586a34K16j80J38m11M7L74L21o06J59M17k06k54o2K61O6j97n2J67M57m70r4J44
$$ plain form
2430 -173 -449 -353 118 197 -19 -81 381 370 220 29 24 376 136 -272 39 116 123 -149 7 386 -229 -435 -88
2453 -88 297 -255 -185 25 76 34 -212 210 376 11 -289 -144 204 153 -124 49 384 410 209 67 479 -71
2475 -71 -361 -268 -143 111 -4 -402 124 79 -181 -367 -58 112 -248 -60 -262 104 -83 -6 110 405 105
2496 105 -134 -151 318 182 -276 123 122 40 -297 14 248 -64 -379 -222 106 -482 -300 -46 198 136 -18 -22
2518 -22 24 277 -164 95 321 35 -177 -84 466 247 -42 -41 132 19 -299 -244 -160 28 -208 -151 232 133 -102
2541 -102 -353 10 355 -42 -216 19 55 -12 -2 421 410 145 123 25 32 -47 -330 38 231 44 -63 -155 326
2564 326 105 -484 -29 -47 -119 -193 12 115 129 -162 80 270 193 -32 -103 -87 68 -422 -2 442 103 -134
2586 -134 82 -98 40 -371 -324 50 371 -235 -76 341 135 -119 -181 80 146 -51 -103 64 521 51 -43 101
2608A01K92j45m98L01K46k22m18K50K73l75n1J63M77m64pO4K6P3j73J90L91k18
2630B76j33K88k00k85p8K13l0R1n20J48K50K38l43k25J61p7N8n9M24k72j39L23
2652A09oK36k75q1L5j1l7j69K64k8q3jK86Q8r8l25J7K68j24l62K18J66J2o0L4
2677G3J14j66j44Q5R9p3k82L27pJ75l59K03K40J7k26l00L61j23L6k5K43m8k90
2700g0l8K05Rk74K44k8p1K2j78R6J86k59K65j77K01Q1m84O09j66k52J22m2L17
2723C18k41l36K34J46k62N2QM6q2j1L00p3K03n74J84K74j05k17N9L99k51j51L00
2746B20k1m71L63j0R6j82j35J89J82k31k02k1M47j0n94M26k16J50j64J55K02k0
2768A53j11pK81j17j04o77O19K65k77l13M57l5k06j14K04Q3k84k02J04L58p4j00
$$ plain form
2608 101 393 248 -250 51 297 75 -343 -93 180 -195 -246 -83 394 -70 -77 -13 13 86 -87 103 494 276
2630 276 143 431 231 -54 -132 81 51 142 -378 -230 20 258 -85 -310 -149 -226 -168 -227 197 -75 -214 109
2652 109 103 339 64 -17 18 7 -30 -199 65 37 -46 -47 239 327 229 -96 -79 189 65 -297 -79 87 99 39 73
2677 73 187 21 -123 -38 61 -12 -294 33 26 201 -158 45 285 302 76 -224 137 14 50 25 268 220 -70
2700 -70 -108 97 106 -168 76 48 -23 -1 -179 -83 103 -156 109 -68 133 214 -270 339 173 -79 43 1 318
2723 318 77 -259 -25 121 -141 -89 -81 -35 -117 -128 172 99 302 -272 -88 186 81 -136 -77 322 71 -80 220
2746 220 199 -272 91 81 177 -5 -140 49 231 0 -202 -223 224 214 -380 46 -170 -20 -184 -29 173 153
2768 153 42 35 316 199 95 -582 37 302 25 -288 169 134 -72 -186 18 101 -183 -385 -281 77 3 -97
2790i7K27J45m09K12P6J9p9l20l2L59pq9n0J26R5m41M38j6l71n8j27L88m7OM0
2815a2L6J6o4j37L6K22m0o6J2k4O6k7N5L6l39K8R3K33l7m95N27Q2J9l86L16j1
2841A39mm73K49L03k51j05J04K64o6k45J17M07m81J06J25j07k30oL91k6K8m10
2863a71Q2Q1Q0r7j39L79k98o5N9j8K68j36j58K34K24m20k01L04K13o2l9k30L97
2886B87j49k92J28J79j38k54K78J41n6jJ35j90k54j2L93L8n40L42j80K33l18L85
2908A55oJ31p62L70L92p8J0j02n0P2o4Q6k44j27O5j7J0J79k3O6lo6R3J04l49J24
2934c4Qj0J88k88R5O3Q6k4L05o25K52m1J67l92j35L41J32l02n7J49J88k89J01
2957a22K40R0p3l60L08O1k76j3K03J69k00j83K32K16n10N5L06Lk09J56qj48R2
$$ plain form
2790 -97 130 275 -134 78 154 173 94 -226 -258 101 94 5 -45 81 176 -265 173 157 -214 -272 -399 -11 -58 -52 -12
2815 -12 24 40 -24 -161 -125 97 57 -9 3 -21 45 18 73 109 -230 -202 -109 124 87 -408 119 201 220 -166 150 139
2841 139 135 -338 -89 214 -37 -142 -38 226 160 -85 32 439 -42 64 189 82 -148 -154 237 211 239 -171
2863 -171 -89 -8 72 -25 -164 215 -83 -148 -89 -107 161 25 -133 101 325 -95 -296 8 221 159 120 -110 287
2886 287 138 -154 -26 153 15 -239 39 180 124 123 258 68 -186 -198 195 233 -307 35 -145 88 -230 155
2908 155 149 280 -482 -112 280 202 212 110 60 132 68 154 -90 -217 -152 -169 -159 20 -3 63 60 -6 87 191 -158 -34
2934 -34 -26 -36 152 -136 -41 22 108 84 389 -236 16 -25 142 -250 -385 -44 88 -214 -271 -122 66 -223 -122
2957 -122 118 208 135 -225 83 144 -132 -145 58 227 27 -156 76 292 -218 -163 143 146 -63 93 85 -63 29
2980B9j96J28J37J29P6n01O36m76J20j94L38j81M5P6L3l14k8q0K74J56j37k96
3002b26K46J98j06j86j4J78p3K2n2K16p6l9j34J11j90J68j74J63j56qJ43J43m38
3025b84J00o2L85J00k21J29k4j48r5J89q7Jo0j39J80k11m4L36l5J22j46o4k3M14
3049C13k28j87m0L72l91K37J5J68l03l4J7M52m48J18k86M23k15p4Q9J25j42l0
3071d9j93L33k98j25R4M99O5o70O06j78q3l96N85j33j34m2J32j06L17l45k3L64
3093B20j15R4m01OM0L09p8r1O4Q9k21L14j42J1l15J06K41l56M98k53K87p91M09
3116g5O1L90l65k09M45k8k22k86R7J61k29J41M49l36k02K73j41K96q7k72J06L17
3138B84j24l96J09O3P8k49L05O3l96K15j5K4j39K38o9p1L9kk01K38K47k19j41
$$ plain form
2980 29 -167 -39 98 227 303 -198 438 -38 82 -112 226 45 90 166 199 -115 -143 -223 51 207 70 -226
3002 -226 20 218 112 -74 -88 90 17 39 -13 203 127 88 -46 65 -125 43 -131 32 -124 -132 11 154 -284
3025 -284 -184 -246 139 239 18 147 123 -25 -120 69 -18 -17 -77 -216 -36 -247 -291 45 10 132 -14 -78 -101 313
3049 313 85 -102 -142 230 -161 76 91 259 -44 -78 -61 391 -57 61 -225 198 -17 -91 -2 123 -19 -49
3071 -49 -242 91 -207 -332 -238 261 326 -344 262 84 1 -395 190 57 -77 -119 13 -93 224 -121 -144 220
3093 220 105 199 -202 -196 -156 153 75 -16 48 137 -84 230 88 99 -216 -110 131 -225 273 20 307 -484 -75
3116 -75 -14 376 11 -198 247 219 -3 -289 -192 -31 -260 -119 330 -6 -208 65 -76 220 133 -139 -33 284
3138 284 160 -236 -127 -64 14 -235 70 133 -263 -48 -63 -39 -178 60 -9 -80 -41 -43 -244 -6 241 22 -119
3161a19K98k54k7j22L03l8p1K4j82M60l64J3L7R9j74k20L96J2k42J75O5qL0j62
3185g1J92L6j57k53J77k0J97N2q0j99L44l75K12J57k78J06M0J09j53k52K86J1
3207H1rp1o2k65O97j69l04J85j15K15k02L0k43J22k08L16J83j94j5O6j38m2J2
3230a30p0K48l45rJ90J15k1l2k3M11l33j46L88n12M13l81M27N5j06j58j53K91
3252A19K8j29O0j67j35K61P8k87J19L10m26LR0j1K8K8n9j79j04L62O6n61M04K98
3276A96k29Q1l39J15M69n6k10m0K61l82N5J09l0l89J98M30k15j08q5K28L6l11
3298b16P4J59K56j29n7oM6m17K13R3R6k32n2O2M3j81N2K35O3j58L5j56J27Q2k46
3323b14Q9J41j92K7Q9J10J21k77K62p1j27Q7k15J31J06q1n7K19L7j78k5k46L70
$$ plain form
3161 -119 179 -75 -102 -224 79 41 -30 -6 -188 272 -92 -79 -42 57 -117 -337 59 71 -171 4 69 61 91 -71
3185 -71 121 157 0 -253 -76 -96 101 153 73 -126 218 -157 55 212 -66 40 80 189 36 -216 70 81
3207 81 72 1 -61 -326 371 202 -102 83 -32 183 -19 11 -232 -110 -318 -2 181 -13 -28 38 -100 -142 -130
3230 -130 -200 48 -297 -306 -116 -1 -22 -54 -77 334 1 -145 243 -269 144 -237 190 245 139 -19 -172 119
3252 119 147 18 78 -89 -224 37 115 -172 -53 257 -169 -166 -76 -87 -59 -31 -90 -269 -373 -11 55 -506 -102 196
3276 196 -33 48 -291 -176 293 237 27 -13 248 -134 -79 30 0 -389 -191 239 24 -84 -169 59 95 -216
3298 -216 -142 17 273 144 87 81 127 -290 -77 16 112 -120 -172 -110 -67 -248 -196 39 102 -56 -21 -177 -50 32 -214
3323 -214 -125 16 -176 -149 -60 50 171 -106 156 85 -42 45 -170 -39 67 -14 -71 148 185 7 -18 -264 106
3346A06l25R2R3k6p4m9J29Kk17Q8J6R7K2K15l11J25P9k87J27M29n35R8K2L6M2
3371fl43L7J98N40m77J12j41J02k34N48r8k88J13p5K29l93r8L1L54l33J75q0J15
3394a2J54k72K41J15r2l16K02j64J04K6j6J10K37l61j18J74p2J51k71J82R1j06
3416a3jm1K14q9k30J53N7l53J25J05L71k56k14l2O4J25k%K79k13p4rJ27p2J6%
3442C7P9r4J40q8j0J69k31j5L6K07m52R4J25l6j64J85J90k0j42J26j35j27K43
3465A17j05k31J88r6j13N50N6m43Q2L7l2j65m3K68J6l8l29J30R2Q4J42l68L81
3488A80j35j30J25j23Q8k13M27L8l15j87Q7L03k08N0j1N7p0j03J73m6j43M3J62
3511D9J89k73J46k20K56p2P9k01R1J24q6l32M83k54M3O7j40K22j99o7K30l62P4
$$ plain form
3346 106 -219 -127 -34 -60 -134 -183 -54 -52 -269 -181 -165 -68 -46 169 -142 -17 62 -225 -98 331 -204 -106 -84 -48 -6
3371 -6 -349 -312 -114 426 -51 61 -80 22 -212 336 238 -50 63 -12 217 -176 -274 -243 111 -222 -47 -127 -12
3394 -12 142 -130 111 226 134 -182 20 -144 -40 -14 -30 80 317 -44 -162 12 -60 91 -180 2 93 -13
3416 -13 -14 -55 159 70 -160 -7 50 -303 -178 -73 298 42 -172 -204 -140 -15 -17 -17 262 49 -25 -34 93 21 37 37
3442 37 116 22 162 74 64 233 2 -13 23 230 -222 -128 -3 -39 -203 -18 172 152 10 136 1 -126 117
3465 117 12 -219 -31 -127 -240 310 366 -77 5 42 10 -155 -198 70 86 48 -281 -151 -59 25 167 -201 180
3488 180 45 -85 40 -83 5 -208 219 257 -58 -245 -158 145 -63 -13 -24 33 -37 -140 33 -13 -156 -113 49
3511 49 238 -35 111 -109 147 75 154 -47 44 168 82 -250 233 -21 22 89 -51 171 -28 -95 135 -227 -153
3534a53K31j69K24j17J32p6l5j6k55L60q5l86M82P0k25L1k82L73M5j7j00l2R4
3557I4l39L09j91L49k43N3J92l15K57k00q9p2K56L28l46J20k32K6k61J58K62K8
3579A44p5O1m46K48J11J26n1J8K2k33K39j90K28j50J58k28n3J24k29K19j60o6
3601a83K65j14J7M48l02l68L22k8J3J6p3o8J64j31O0j60j8J80j08k07J83J43J
3624E2l3N4j84J40q8o0J17J4R5o2o4k28L17J18j59Nj26J37Q7k3j00K03Kj85j1
3649A8K86l27j87P6M68l93r7r5M14j24j95j40K60J85j97%J81k5R7j49j76r0L65
3672A55k35J77r8m3j59j2L78R4l44j8J96J9k63L69j16k09k52L43l2j09K03O4P0
3695A78r0j17M0j35J14L03k8m65M8j9L09q2j78J37J71l00J45k09J35K46k10l35
$$ plain form
3534 -153 78 -91 133 16 148 72 37 21 -234 126 41 -345 137 207 -18 13 -269 104 149 132 32 0 94
3557 94 -245 64 -127 222 -21 32 224 -91 166 -34 -123 -195 61 389 43 163 -69 -43 -304 -146 116 144
3579 144 69 130 -316 -68 43 169 118 136 158 -75 164 -26 202 52 210 -18 -71 53 -176 43 -117 -183
3601 -183 82 -32 -15 433 131 -237 85 57 70 86 13 -55 109 -22 38 -122 -140 40 -68 -275 -92 51 52
3624 52 19 73 -111 29 -59 -119 -2 12 107 45 -19 -247 70 188 29 34 -92 45 132 109 9 212 214 29 18
3649 18 304 -23 -210 -134 334 -59 -156 -251 163 39 -156 -296 -36 149 -48 -48 133 108 205 56 -120 -210 155
3672 155 -80 97 -1 -44 -203 -215 163 257 -87 -105 91 110 -153 216 100 -109 -361 -18 -50 -159 44 108 178
3695 178 88 -29 11 -124 -10 293 265 -200 -152 -171 138 56 -122 15 186 -114 31 -178 -43 203 -7 -342
3717c42J52K83J12O0l73p8K51o3j33L4R7O1Q7k21J77j88L1K6K62l05MJ1M5m5J80
3742A25J29k12N1l11J75Q9L3p0p9J06J81Q3m19J55j22J07j16L61p0j58r6k9K29
3765A42q3l18M58l9nk19j28K15J9M3j09J7N5k08N2L24k02p3j92J26oR8P8L2L9
3790A16q9L7L2n67K17K86k7J69m5l35r5M97k61R7j51J22j20LK43j78P6r0J06j4
3814B9n3Q0j7l62M84o9l8l55K10m2J02K01j06o6j26J44j13r8K95l05M3j58LJ60
3838a57K16k14J48J3P4j21J80M4k15J13K91l90j69K54r2N8j38L3J7M5j06L59j75
3861F8p2P8K03m16J00k72L77j41l5K2P4K41l00J72k16J50L72n41J38J15j09J6
3883B4j67O9J27j32K5J28JJ2k59L44j40M0j66p0L2L54m48K61j57J30o9L48n40
$$ plain form
3717 -342 -190 93 205 265 -108 -186 65 2 -131 -97 0 61 148 -73 104 -84 -53 -27 235 -70 -66 -55 -10 -55 125
3742 125 254 42 93 -218 -43 46 79 9 -70 36 217 300 -119 36 -86 21 -95 266 196 38 -58 -87 142
3765 142 59 -259 199 160 155 -64 -192 23 42 85 -24 -7 48 -160 -108 216 14 -59 -251 -125 -131 -33 45 77 116
3790 116 27 64 96 -471 -254 32 5 174 129 -206 -301 196 -65 32 -119 3 -117 -114 129 -49 27 -63 43 29
3814 29 -24 56 39 -323 161 92 54 -301 -91 -133 -31 170 64 -2 -128 16 -97 -195 100 -205 -162 -320 -317 -157
3838 -157 59 -155 -7 6 80 -41 139 183 -32 81 372 -18 -187 67 -25 33 -105 -72 -55 -10 -116 243 68
3861 68 -4 74 277 -139 -39 -311 66 -75 -110 -88 -14 227 -73 99 -117 33 405 -136 2 117 8 24
3883 24 -143 -74 53 -79 -54 74 75 87 -172 172 32 72 -94 -164 -132 222 -226 35 -122 8 -61 287 -253
3906b53L69j63k9J37K02m28J52J9j30R6q9K26l23K81j73M15l66o6J8m9K40qk16
3929a38N1J09j95J64k88R3M70l83M13m54J47j44J19J09k08m4Q4Q3N5j28J33j10
3951f2Q3j5J52l1j87k2j20K63k76Q4Q0j88K38N3n4L04j14l59L55j40J17J5m08
3974b32K63K9k9K7j8J9rn8j71K18K70j53j60P6p1j5J3J41k21J57K09j01j4j91
3998b1J65k27L5J40j42J4J90k6k36jJ83o8J81j91J09k20J1K24j22K5M6k38K54
4021H5p9k47J92J99k93KK24j15k37L7J70K25j54pM1k08K52j26J32j72J88j16j31
4044a38K84j27K36l97K90m2K0l16K34k46J77J2k0k09K98K4J75k78q4K39o5j11
4066d4k0J33k51L56J69l50R0j62R0j50J27j17M9J01K5n4j41K53n5j74J50M2k63
$$ plain form
3906 -253 116 -47 -76 61 263 -165 -13 6 -124 -28 -117 109 -214 67 -106 309 -57 -123 -105 -154 86 78 -138
3929 -138 -87 22 -173 -9 -297 -204 266 -117 296 -158 -11 -155 -36 73 -135 -179 -95 -12 43 -85 48 -62
3951 -62 21 6 158 127 -60 -82 -202 61 -215 -131 -51 -239 -1 52 -2 302 188 -171 184 44 161 176 -232
3974 -232 31 60 31 58 40 59 50 -8 -179 39 309 156 -4 72 1 -14 -1 140 -81 76 285 184 170 -21
3998 -21 144 -83 -48 92 -50 -36 154 128 -108 -109 74 6 187 -4 105 -115 -104 120 -2 23 69 -169 85
4021 85 6 -241 -49 150 -143 -141 83 -32 -269 -232 -62 163 9 2 43 -165 87 -39 93 -79 109 -7 -138
4044 -138 146 19 255 -142 148 106 126 -190 44 -202 -25 -13 -33 -242 56 80 255 -23 -107 132 67 -44
4066 -44 -64 69 -182 174 343 -7 83 -79 11 -139 -12 -129 -80 21 46 -8 -149 104 49 -125 25 67 -196
4089a96N3K05M7j92J03P4J5j02J4k39L00j56K76l97K45j14J10K02l39J29J49j04
4111H3j64J76j25R8M0j34k88P08n29K84l48J55R4j97K6K35p6J0J08j03r8k39L18
4134C4l1j28J46o5R1l44J40L87l34R4K68J8k87k04k0L68M4j69q6J47L03j51j96
4157B5M2j56K09l13p9M09q8j21J62j2k78M71j16j74P8j95K04j74K42j41J98q4
4179A09m48K62NlJ29N4k63J06J29j35J12R1k22J90l74M01p1k09K67o8J98m24K62
4202I8n0j24P1j13pK72l99K25P1M5K9k22K73k05K81k55nJ65L2m06K88Q1R%j88
4227c4p1P2K34j27J22j29J13j98J79j76l8J89n4j75P6j41K30j25K06r4j23J76
4249A12j18o9K71j75J33k20O1k23J80J7O2Ql9K9O9K54l88J0J1m4P9J07J07j40
$$ plain form
4089 -196 -143 62 109 -83 20 94 109 7 21 -218 82 -74 202 -195 50 -64 46 248 -91 38 187 83
4111 83 -81 95 -30 68 108 -26 -314 394 -135 149 -199 -44 50 -147 -121 114 38 48 156 53 -45 -284 34
4134 34 3 -125 21 -44 47 -297 -157 230 -104 -10 258 276 -11 -215 -235 133 177 8 -78 69 372 221 25
4157 25 67 -89 120 -193 -272 137 49 -72 90 78 -200 271 155 -19 59 -136 68 -106 136 -5 193 109
4179 109 -339 -77 -72 -75 54 108 -155 -49 80 -55 57 148 -74 116 -258 143 72 -137 130 62 260 -164 98
4202 98 48 -76 -5 -118 -125 147 -252 -27 44 89 118 -104 169 -36 245 -10 -15 150 182 -224 64 145 154 154 -34
4227 -34 -105 -33 201 74 196 67 180 -18 161 -15 -53 136 82 -93 -17 -158 72 -53 153 59 -64 112
4249 112 -6 -75 196 21 154 -66 -5 -228 -48 -31 31 39 0 29 98 352 -36 -26 -15 -59 20 127 234 94
4273I4O0j31j8p0o0l8M80m82O2K09r5m7L2J45j34m2j4p7J36K84l85J1k56L78J63
4298B05Nj0l35K25k4j46K28l29R9J10J78k1j72n3J98j57qj21M38l92N0Q7J9j53
4322g9J83j30K39L0l92l5J42J33K0K6l65J92J3J41J1N2m01J81M8N8Ll33M0K21
4346bK85k96m6j2J02P7j09J06m07M36l39M13n1k05J04j90M6L4r4J80l22J49l1
4369a72K20K60r6p1L6p8l23J74J00j78Pq8K80k09M3K1m2l9j4R1jQ4Q2Om9O8m5
4396F7j84M49l35J23k27J71k21j9K83k28J47K1k59M67j12k91K45m11L38K0j15
4417g1K14k02NQ6Omj32m7K55r9j63K07o5J90k66j0J89J59p2J00k57k6n6j64J61
4442f2K80j83K0k5k3J57k7k22J07k41N65m72J93J12q8k02J91j18O2k71K39J74
$$ plain form
4273 94 154 23 5 -65 -125 -163 317 -165 -103 106 11 -36 -4 141 7 -35 -49 -126 10 294 -91 -80 -336 42 205
4298 205 210 200 -135 90 66 -80 148 -181 -82 28 206 185 13 -40 158 1 -7 -128 310 -82 -32 55 74 -79
4322 -79 104 -26 213 243 -149 -184 -42 91 111 137 -228 -36 -23 118 129 181 -220 -39 9 67 70 -263 -223 -2
4346 -2 283 -13 -59 -71 31 108 -1 105 -302 134 -205 208 157 -48 56 -134 -88 -54 -148 32 -290 -141 -172
4369 -172 48 308 212 141 177 99 -224 -50 50 -128 -121 -209 71 -138 -95 -74 -116 -155 -169 -78 -79 5 87 93 44 112 67
4396 67 -117 332 -3 120 -107 64 -157 -176 107 -121 26 47 -212 255 143 -148 97 -314 24 44 -71
4417 -71 143 -59 -54 32 38 34 -98 -145 110 11 -152 55 -10 180 -86 -96 93 252 180 280 23 -3 -59 -223 -62
4442 -62 218 35 55 30 7 164 137 -85 22 -219 346 -126 67 179 91 -111 80 -38 24 -247 -8 166
4464A66j00k59L96l39L8k45K57P2o9P6m2J28J99r8l13J33m0k61J24M30j31j40
4486a8J41m5j04k8O2j3p6J45R1j00R4k46L9K69k04l0m7L17k57J83m65L47R1p8
4510F8j40L5P1J79l07J34K08j51r5J70k60j3M46k62j27k70M01p5K50k65J3n0J06
4533F6k54J95j36K17l35MjL63r2rj63K70o1k6m7O5K66l97J16k45N10k31j07j32
4557a64K28r7J81k00J11J51l28M10j67k7j11M9J9j60J16j27L09k23p5L77l66K93
4579A99k88k8Q0N1J50k19j40K68j16J05P2k22K57m47L98%m39L88J69j72j75K20
4601A11p6K12m50M12k86r8K08J60k83J27LqJ01k78p9j5L11l26J82J35k13P6M09
4624C35j03j66j57j26R2J14P7R5j45l0r2q9j31L57K34j81j96N08k20j98m5Q9N0
$$ plain form
4464 166 66 -193 203 -136 -98 -343 -86 -14 -83 -7 -49 79 278 180 -133 0 -40 -301 -177 253 122 -18
4486 -18 123 78 -26 -54 8 -5 -81 64 155 55 149 -97 -58 211 7 -23 -70 247 -10 173 -292 55 146 68
4510 68 -72 -37 34 213 -94 40 248 97 2 172 -88 -101 345 83 -44 -314 87 12 262 -3 10 -40 66
4533 66 -188 7 -129 88 -247 -243 -244 119 27 18 -145 125 64 38 -9 56 322 -75 41 -204 306 75 -32 -164
4557 -164 64 -33 148 -52 59 210 -118 292 125 98 -13 36 55 -105 11 -116 193 -30 -105 272 -94 199
4579 199 -89 -117 -37 14 164 -55 -195 73 -43 62 134 -88 169 -278 120 120 -319 69 238 66 -109 111
4601 111 35 247 -203 209 -77 -175 33 193 -90 37 40 32 133 -145 -224 -239 72 -254 -72 63 -150 -74 335
4624 335 232 66 -91 -217 -125 -11 66 161 16 -14 -106 -195 -326 31 265 84 -112 396 176 -22 -67 22 72
4647G2r8rM3J79k83j1l7L00j44K20j30k53J42p4J40k26J31j11K79q5k49J49R1
4670C6K9l13K97L4Q9k50o0j1M68m42m2K08q6J42k69L46r6J3L3l18K53J32L0j63
4694F0k54K00j48R1j09J42J50l08K27J90j10k91J25K84j64n4j08n0RL9k1J52K09
4717B61k1j93p6K71l45J04P4j29K59p6j85o3J49k21L5N7N5J90q9MJ22j48j64K
4741a27K55k41J64O2k26k0N9O7k3L7P4q1r7L18k79M9P9N4%j55K26m16N8R2J99
4766A28l69K35J84J21k83j72L08Kl40Q6J69o7O6l1Q2o8j60J42n7O3K86l04j38
4789a17K16j73R8j56K99j50j1R8Ll6j53J15j44L13k62P4p7J71j57J1J22m3M9j4
4813G6j4L4j97J31j70n3J93j90L21j08p0J40j09J07q3N9Q4k01O9r3L13k15j5J77
$$ plain form
4647 72 -26 -35 8 187 -96 -107 -144 156 12 232 102 -151 -9 -83 57 -169 -38 -149 130 45 -204 -55 36
4670 36 65 -248 49 83 172 -78 -138 -149 319 -123 -165 43 -43 99 -170 176 80 93 126 -192 61 193 223 60
4694 60 -194 6 -142 -51 -160 -18 132 -176 51 241 131 -160 -35 249 85 31 -77 -127 -118 -79 -100 52 261
4717 261 240 47 -29 242 -103 1 75 -54 205 129 -56 -119 30 -191 -156 -99 -44 146 57 61 183 35 -129 -127
4741 -127 128 -113 51 113 -113 -133 -74 -7 -30 7 81 0 -97 221 -58 -9 70 124 124 -31 195 -221 -163 -71 128
4766 128 -241 -6 178 299 16 -156 152 154 -186 -100 69 2 68 37 119 51 -109 33 -24 39 325 21 -117
4789 -117 99 -74 24 -132 167 17 6 104 107 71 -82 33 -111 202 -60 14 -63 108 -49 -38 84 41 90 76
4813 76 62 96 -101 30 -140 -193 0 -190 131 23 -47 93 -16 91 8 67 151 -50 19 -74 239 24 9 186
4837A86l24K14k61o7J86J66n33J59p6O16j70o4j6p6q7J33J14K7j18j44o7l1N80
4860C47l07lR7j09J2J1R4k95qK06q9qK04m92K56J19k01K11o0j04k8L36j37R3k73
4885a28J61j72K28m3l40L07K04l3Q4q3k37J39O2j00Nj80K3K47o6j51J12J01k7
4908A13kj52j37L12Q0q5k05o5J60M4J72l80J20j77K95o1J62j10L4j83R4k06L08
4931A31o3k98L58q5J1j76J41l47K12J55j39O8M7O5J41k25P8j66J7rJ79L8j77P5
4955C1L4N0l71K42J71J80m35j1K1j66Q9J56R0qk78N05p73L64l7K01L5l3j29J51
4979G9j41L0K80Q0k64l0N0J9n34L78J26N4k63K32j35J00j9j19L97n15K75j42k9
5002i1L09l80J64L3k93j07M05J66k46l16J85K82qk02rk05L47j00o6K23j3j51P8
$$ plain form
4837 186 -138 76 -185 -252 -66 100 -433 -274 -350 266 96 32 16 -60 -147 -14 100 127 9 -135 -202 -233 347
4860 347 40 37 134 25 37 48 142 -153 -161 45 -44 -52 152 -340 -84 35 -166 45 -15 -119 -147 189 52 145 -128
4885 -128 33 -139 89 46 -294 13 217 184 268 185 -52 87 149 49 54 -126 -103 144 78 -73 39 140 113
4908 113 111 -41 -178 134 214 129 -76 -141 19 63 235 -145 -25 -202 93 32 194 84 118 -65 29 -177 131
4931 131 68 -230 128 43 54 -122 19 -328 -116 39 -100 -32 15 80 221 -4 74 -92 -75 -84 95 133 -44 31
4955 31 65 115 -256 -14 157 337 -98 -109 -88 -254 -165 -9 81 73 -205 300 -473 -109 -146 55 90 57 -72 79
4979 79 -62 -32 248 328 64 34 84 103 -431 -53 73 127 -136 96 -39 61 42 -77 320 -195 80 -62 -91
5002 -91 218 -162 2 35 -258 -365 40 206 -40 -356 -171 111 103 -99 -108 -313 34 -66 -132 91 78 -73 5
5025EJ9j06J16pj74J4L80O5q0k69m9m4L49K1j26j40J03K53j51j62k75M41k82J7
5049h2N9J89m3n4r1R0k9k39M58o1P4l49L6J05l04P1J70P6N5k94J35j81R8j02R7
5074a16L3oO8N7q3r4n8P4l3M62m02J09J1j43J07K9j83Q5q5L17j78Ok80J36P9J26
5100C8O8l17L95k29j50J04J78k84L20p5j96K79JJ9k32K70l71M54m28K72L1k14
5122f7J47p1n3K12j18j53J58q3R5j03k31K72j25J39p2K0K06k08j63ML53P1j82
5145D8j8Pj44p2J69K7p9j04L66l75J9J17q8L40m21K45K47k16J17L3k76rj64J99
5169c2L6J75k74L2J84j88L79l88O7p2K27j7r6j73j56L73K84o5k22j22K83k48J20
5192A07j64k1J44k77L00n5L26l06q2j03L19o3l27L18q0J6N2%j57J56n1K51k37
$$ plain form
5025 5 24 -82 34 27 -147 -133 247 312 232 -37 -86 -130 219 240 114 -26 77 330 179 17 -258 183 -99 -82
5049 -82 -23 166 123 69 -22 68 39 -200 258 197 271 -78 -42 63 -241 -170 0 76 131 -163 -28 -209 -111 -213 -116
5074 -116 -83 -89 -21 36 -47 -141 -199 -125 -158 304 -98 11 22 -121 -14 15 -168 -83 -168 149 -29 -23 -303 -167 -88 38
5100 38 106 -211 184 -45 -195 -91 87 -197 123 48 -148 131 132 151 -81 189 -182 272 -156 116 147 -67
5122 -67 80 9 -44 168 50 -103 55 -28 67 -36 -267 5 -120 19 -53 -33 173 -35 -198 -194 159 230 48
5145 48 30 37 -107 -179 -10 17 -62 -166 200 -175 -156 -39 -127 213 -208 37 284 68 185 218 -58 -67 -231 -32
5169 -32 4 179 -95 -63 121 -67 312 -76 -9 -81 146 129 33 -140 -296 77 361 296 74 -48 235 -13 107
5192 107 -57 -78 66 -211 89 34 360 54 -28 -131 188 125 -202 116 36 52 104 104 -53 103 52 303 66
5215F6N5M7k09J53j52J20j68mJ99k71J72J91M3j70l6Q2k33J49q7P4Q7j29n0j27
5239a98J56m3k6kJ72j92K77j27J36k12L34l71j2J15p4K17j20m8K18k36J70k67
5261a33J21J16k78R2M8J87L2m2n5n6k09M74j59N6j39L3k11j11L82j13j37j56K01
5284e7J76o9J3M3j19L8k6m8m2O4k71J29K95j08l2R4j70Q3j34J72n4o2O5j77K34
5309C7k23L94j84j15k8J26r6j01K56o1K04j57J6j68J07o8l2P6L7J63j66P7j47
5332e3r6K70M1k45OL3J62jk1j81J50N2o9N9p0n5j24P3J78k42J48J19j13j29L2
5357g6J7j63K20J77N9l00RJ25j86K19p7k3j03L5K38Qj83R2J13j80Rl69M81n3k52
5382a63N2L4J33l0l44M8K25J4Jj29J64m52N06o3p8j79M82l35K8L9q7L54l86R6
$$ plain form
5215 66 121 168 -41 112 -40 80 -88 -92 107 -164 8 199 242 72 36 118 -115 34 -53 21 108 -21 -71 -198
5239 -198 -42 -85 -111 -113 59 -133 144 17 153 -59 275 -96 -108 7 -67 150 30 -18 200 -36 134 -133
5261 -133 -12 104 -174 -82 -34 153 185 143 88 32 -177 297 138 194 55 88 -123 -234 148 35 -102 -258 -57
5284 -57 119 50 63 106 -13 25 -1 -49 -91 -27 -298 -169 126 18 -14 80 -90 -7 -141 31 -23 -85 -20 -197 37
5309 37 -186 208 24 -91 -119 7 -89 -190 66 5 209 52 68 -100 7 -61 -93 -17 20 183 17 94 -53
5332 -53 -149 121 162 -83 -77 -44 118 117 96 -85 65 117 48 107 37 -18 -142 -69 109 -133 15 134 21 -108 -76
5357 -76 -59 -222 -2 175 234 -66 -57 68 -118 101 24 1 -102 -67 171 179 -4 88 201 21 30 -339 142 89 -163
5382 -163 -111 -77 56 26 -318 -270 -45 -31 -30 -159 5 -447 59 -4 -82 -261 221 -114 -86 -47 -134 220 -166 -70
5406g0K06j45L79l22J74l56L99j37k35O3M5k52k3M48p3j64J15j4R9r0J38n5l31
5429b01J89L09k50P1n1j98QL9l6K74j95j5J07k22J73K3j86L72l91J07P5k75L69
5452I6k28j3K97k47K56j05L2l4j40PK00O9j17J30m44j72N66k37qJ62J03l3k38
5475i8K55np1j21NL10Jk47n2M0J92j70O0q1J95j60O3m7r4l7K88j84k19J78l0j41
5501a70K67pk43L32j88L8k3ML05k68r4R0M7k11M6Q9j8K52k91N6j9J60k78P0N5
5526Ak30J25oQ9k0K82l26J93j87J5J64n6j52K76k02o5J79j65R8J15q4q8k12J13
5550a43M83m51K42l71K02n1K27m3j20J8L3j72K76j96j47Q4K00M4k09Q1j39J82
5572C0r6R9j69K12J02m8q3k51K86j65J90j17j43m8M43k45Oq4M3J65K9k40J34q
$$ plain form
5406 -70 136 -9 370 48 222 -134 265 128 -107 -44 1 -251 -274 174 101 -63 52 38 137 47 185 130 -201
5429 -201 -12 297 47 118 67 -131 -123 -84 -120 154 -41 -56 51 -171 2 25 -161 211 -180 -73 2 -273 96
5452 96 -132 -145 152 -95 161 56 88 54 -86 -79 121 190 73 203 -241 -413 153 -84 -92 70 173 140 -98
5475 -98 157 152 81 -40 -35 275 276 29 -23 17 209 39 99 18 213 53 116 69 -25 -62 226 42 -177 1 -29 -170
5501 -170 97 90 -153 179 -9 29 6 10 315 47 -47 43 90 -121 -75 14 -4 248 -43 13 -6 154 -124 -54 1
5526 1 -229 -104 -110 -21 -41 241 -85 108 -79 -64 100 44 -108 168 -34 -99 80 -85 13 128 44 -44 -256 -143
5550 -143 340 -111 131 -240 -38 -89 138 95 -25 -7 26 -146 130 -66 -213 -129 71 115 -94 -13 -152 30
5572 30 -66 33 -136 76 178 130 47 -204 82 -83 107 -10 -153 -201 242 -3 3 -81 -38 127 156 -84 50 42
5596D2Q9j09j81L13j22j9j5l3k13K29K80n5k19k85K96J2n3rK32k33K33j56j66
5619a42R1K73q3j27j70qJ50J95j65m3j12J84Q6P3q3k60N03m5k48L0j1j5l9O2j25
5644b9J49j83L7k20J23J01r2Q1O4K17l50MM7K1J66o4j72J07j88J36K5K09j84J36
5668A41mk4j68qJ32k06J13L5q8q8L87j6l55J20O1n5Rn3P2j80L30K4l11K75k48
5693a05j18K98j75J06n6K71k44k5K2J19k10J00q1J25l07J74J02P3j53J13m0Q9
5715G8n8k7L15m27J32n7O4M0j05j05J17J47k32J1j20j22M04k21J20r4J19M0l0
5738a1ql01N60l52L52l04M7J04Qk04J4Q4K48q3j96P2J10J52j03k55J20j46J06
$$ plain form
5596 42 131 22 -159 154 32 13 -2 -35 -248 -19 261 206 -13 -298 -2 10 -43 -52 180 -53 180 24 -142
5619 -142 -51 222 139 12 -158 -166 -16 179 14 -29 -141 43 129 202 119 -141 362 317 69 99 88 73 34 96 -29
5644 -29 120 -63 -26 -246 -123 -22 -114 -33 31 248 -102 -98 -51 -30 136 72 -100 7 -181 -45 -20 189 5 141
5668 141 137 113 -55 -63 69 -137 -24 11 -77 -165 222 206 -149 -29 32 -23 -14 -67 5 -175 155 179 -132 143 -105
5693 -105 -223 75 -100 6 -50 221 -23 -48 -26 93 -117 -17 -98 27 -280 -106 -4 69 -84 29 -11 78
5715 78 20 -7 308 -119 13 -44 20 60 -45 -150 -33 114 -118 -107 -227 -349 55 -166 -46 -140 -21 19 -11
5738 -11 -19 -320 240 -112 240 -64 -17 87 95 -109 -95 -11 237 154 -42 30 140 292 189 -66 54 -92 14
$$ [...]
8191f5
##END NTUPLES=NMR FID
##END=
