##TITLE=1H_LR-759-R2-K1
 DMSO-d6
 8 sc, 
 19.12.2022
##JCAMPDX= 6.0         $$ Bruker NMR JCAMP-DX V2.0
##DATA TYPE= NMR FID
##DATA CLASS= NTUPLES
##ORIGIN= UXNMR, Bruker Analytische Messtechnik GmbH
##OWNER= root
$$ XWIN-NMR		Version 3.5
$$ Mon Dec 19 14:02:59 2022 Russian Standard Time (UT+4h)  she@DPX200
##.OBSERVE FREQUENCY= 200.13135
##.OBSERVE NUCLEUS= ^1H
##.DELAY= (6, 6)
##.ACQUISITION MODE= SIMULTANEOUS
##.ACQUISITION SCHEME= undefined
##.AVERAGES= 8
##.DIGITISER RES= 18
##SPECTROMETER/DATA SYSTEM= spect
##.PULSE SEQUENCE= zg30
##.SOLVENT NAME= CDCl3
##.SHIFT REFERENCE= (INTERNAL, CDCl3, 0, 15.7039)
##AUDIT TRAIL= $$ (NUMBER, WHEN, WHO, WHERE, WHAT)
$$ ##TITLE= Audit trail, XWIN-NMR		Version 3.5
$$ ##JCAMPDX= 5.01
$$ ##ORIGIN= Bruker BioSpin GmbH
$$ ##OWNER= she
$$ F:/spectra/data/she/nmr/H-F/1/audita.txt
$$ ##AUDIT TRAIL=  $$ (NUMBER, WHEN, WHO, WHERE, WHAT)
(   1,<2022-12-19 14:01:28.09 +0400>,<she>,<DPX200>,
      <created by zg, POWCHK disabled, PULCHK disabled
       configuration hash MD5:
       00 E9 B6 7A A2 85 ED C7 34 08 36 98 17 FE 4E 26
       data hash MD5: 16K
       82 54 86 0B 4E 9B F0 01 66 D3 07 44 42 0B 1B 56>)
$$ ##END=
$$ 
$$ hash MD5
$$ 24 AA B9 D6 1D 0F E8 F6 48 80 D5 E3 E1 FA FE 50
##$RELAX= 
##$RELAX= 
##$RELAX= 
##$RELAX= 
##$RELAX= 
##$RELAX= 
$$ Bruker specific parameters
$$ --------------------------
##$DU= <F:/spectra>
##$EXPNO= 1
##$NAME= <H-F>
##$PROCNO= 1
##$TYPE= <nmr>
##$USER= <she>
##$AMP= (0..31)
100 100 100 100 100 100 100 100 100 100 100 100 100 100 100 100 100 100 
100 100 100 100 100 100 100 100 100 100 100 100 100 100 
##$AQSEQ= 0
##$AQ_mod= 1
##$AUNM= <au_zg>
##$AUTOPOS= <>
##$BF1= 200.13
##$BF2= 200.13
##$BF3= 200.13
##$BF4= 200.13
##$BF5= 200.13
##$BF6= 200.13
##$BF7= 200.13
##$BF8= 200.13
##$BYTORDA= 1
##$CFDGTYP= 0
##$CFRGTYP= 5
##$CHEMSTR= <none>
##$CNST= (0..31)
1 1 145 1 1 1 1 1 1 1 1 1 1 1 1 1 1 1 1 1 1 1 1 1 1 1 1 1 1 1 1 1 
##$CPDPRG= <>
##$CPDPRG1= <>
##$CPDPRG2= <>
##$CPDPRG3= <>
##$CPDPRG4= <mlev>
##$CPDPRG5= <mlev>
##$CPDPRG6= <mlev>
##$CPDPRG7= <mlev>
##$CPDPRG8= <mlev>
##$CPDPRGB= <>
##$CPDPRGT= <>
##$D= (0..31)
0 1.2 0 0 0 0 0 0 0 0.06 0 0.03 0 0 0 0 0.0002 0 0 0 0 0 0 0 0 0 0 0 0 
0 0 0 
##$DATE= 1671444087
##$DBL= (0..7)
120 120 120 120 120 120 120 120 
##$DBP= (0..7)
150 150 150 150 150 150 150 150 
##$DBP07= 0
##$DBPNAM0= <>
##$DBPNAM1= <>
##$DBPNAM2= <>
##$DBPNAM3= <>
##$DBPNAM4= <>
##$DBPNAM5= <>
##$DBPNAM6= <>
##$DBPNAM7= <>
##$DBPOAL= (0..7)
0.5 0.5 0.5 0.5 0.5 0.5 0.5 0.5 
##$DBPOFFS= (0..7)
0 0 0 0 0 0 0 0 
##$DE= 6
##$DECBNUC= <off>
##$DECIM= 32
##$DECNUC= <off>
##$DECSTAT= 4
##$DIGMOD= 1
##$DIGTYP= 9
##$DL= (0..7)
0 120 120 120 120 120 120 120 
##$DP= (0..7)
150 150 150 150 150 150 150 150 
##$DP07= 0
##$DPNAME0= <>
##$DPNAME1= <>
##$DPNAME2= <>
##$DPNAME3= <>
##$DPNAME4= <>
##$DPNAME5= <>
##$DPNAME6= <>
##$DPNAME7= <>
##$DPOAL= (0..7)
0.5 0.5 0.5 0.5 0.5 0.5 0.5 0.5 
##$DPOFFS= (0..7)
0 0 0 0 0 0 0 0 
##$DQDMODE= 0
##$DR= 18
##$DS= 0
##$DSLIST= <SSSSSSSSSSSSSSS>
$$ [...]
##$SUBNAM2= <"">
##$SUBNAM3= <"">
##$SUBNAM4= <"">
##$SUBNAM5= <"">
##$SUBNAM6= <"">
##$SUBNAM7= <"">
##$SUBNAM8= <"">
##$SUBNAM9= <"">
##$SW= 18.05172834244
##$SWIBOX= (0..15)
0 0 2 0 0 0 0 0 0 0 0 0 0 0 0 0 
##$SW_h= 3612.71676300578
##$TD= 16384
##$TD0= 1
##$TE= 0
##$TE2= 300
##$TE3= 300
##$TEG= 300
##$TL= (0..7)
0 120 120 120 120 120 120 120 
##$TP= (0..7)
150 150 150 150 150 150 150 150 
##$TP07= 0
##$TPNAME0= <>
##$TPNAME1= <>
##$TPNAME2= <>
##$TPNAME3= <>
##$TPNAME4= <>
##$TPNAME5= <>
##$TPNAME6= <>
##$TPNAME7= <>
##$TPOAL= (0..7)
0.5 0.5 0.5 0.5 0.5 0.5 0.5 0.5 
##$TPOFFS= (0..7)
0 0 0 0 0 0 0 0 
##$TUNHIN= 0
##$TUNHOUT= 0
##$TUNXOUT= 0
##$USERA1= <user>
##$USERA2= <user>
##$USERA3= <user>
##$USERA4= <user>
##$USERA5= <user>
##$V9= 5
##$VALIST= <valist>
##$VCLIST= <CCCCCCCCCCCCCCC>
##$VD= 0
##$VDLIST= <DDDDDDDDDDDDDDD>
##$VPLIST= <PPPPPPPPPPPPPPP>
##$VTLIST= <TTTTTTTTTTTTTTT>
##$WBST= 1024
##$WBSW= 4
##$XGAIN= (0..3)
0 0 0 0 
##$XL= 0
##$YL= 0
##$YMAX_a= 66975
##$YMIN_a= -84945
##$ZGOPTNS= <>
##$ZL1= 120
##$ZL2= 120
##$ZL3= 120
##$ZL4= 120
##$ABSF1= 10
##$ABSF2= 0
##$ABSG= 5
##$ABSL= 3
##$ALPHA= 0
##$AQORDER= 0
##$ASSFAC= 0
##$ASSFACI= 0
##$ASSFACX= 0
##$ASSWID= 0
##$AUNMP= <proc_1d>
##$AZFE= 0.1
##$AZFW= 0.1
##$BCFW= 1
##$BC_mod= 2
##$BYTORDP= 1
##$COROFFS= 0
##$CY= 11.3945322036743
##$DATMOD= 1
##$DC= 2
##$DFILT= <>
##$DTYPP= 0
##$F1P= 2.36226072786647
##$F2P= -0.459571619588291
##$FCOR= 0.5
##$FTSIZE= 0
##$FT_mod= 4
##$GAMMA= 1
##$GB= 0.15
##$INTBC= 1
##$INTSCL= 1
##$ISEN= 128
##$LB= 0.24
##$LEV0= 0
##$LPBIN= 0
##$MAXI= 10000
##$MC2= 0
##$MEAN= 0
##$ME_mod= 0
##$MI= 1.114404
##$NCOEF= 0
##$NC_proc= 0
##$NLEV= 6
##$NOISF1= 3.799351
##$NOISF2= 2.8
##$NSP= 1
##$NTH_PI= 0
##$NZP= 0
##$OFFSET= 15.70392
##$PC= 1
##$PHC0= -19106.24
##$PHC1= 10.20072
##$PH_mod= 1
##$PKNL= yes
##$PPARMOD= 0
##$PSCAL= 0
##$PSIGN= 0
##$REVERSE= no
##$SF= 200.130013532006
##$SI= 16384
##$SIGF1= 3
##$SIGF2= 2
##$SINO= 400
##$SIOLD= 16384
##$SREGLST= <1H.CDCl3>
##$SSB= 0
##$STSI= 0
##$STSR= 0
##$SW_p= 3612.71676300578
##$SYMM= 0
##$S_DEV= 0
##$TDeff= 0
##$TDoff= 0
##$TI= <>
##$TILT= no
##$TM1= 0
##$TM2= 0
##$TOPLEV= 0
##$USERP1= <user>
##$USERP2= <user>
##$USERP3= <user>
##$USERP4= <user>
##$USERP5= <user>
##$WDW= 1
##$XDIM= 8192
##$YMAX_p= 0
##$YMIN_p= 0
$$ End of Bruker specific parameters
$$ ---------------------------------
##NTUPLES= NMR FID
##VAR_NAME=  TIME,          FID/REAL,        FID/IMAG
##SYMBOL=    X,             R,               I
##VAR_TYPE=  INDEPENDENT,   DEPENDENT,       DEPENDENT
##VAR_FORM=  AFFN,          ASDF,            ASDF
##VAR_DIM=   8192,          8192,            8192
##UNITS=     SECONDS,       ARBITRARY UNITS, ARBITRARY UNITS
##FACTOR=    0.0002768,     1,               1
##FIRST=     0,             0,               0
##LAST=      2.2672688,     0,               0
##MIN=       0,             -84945,          0
##MAX=       2.2672688,     66975,           0
$$ Real data points
##PAGE= N=1
##DATA TABLE= (X++(R..R)), XYDATA
0 0 0 0 0 0 0 0 0 0 0 0 0 0 0 0 0 8 -8 8 -8 8 -11 16 -16 20 -24 24 -32 38 -40 48 -56 63 -71 80 -92 102 -116
37 -116 127 -143 160 -179 199 -220 244 -270 300 -329 363 -401 443 -486 535 -590 653 -720 797
56 797 -884 985 -1104 1240 -1407 1610 -1866 2201 -2657 3322 -4386 6364 -11330 53859 55398
71 55398 -33389 -7999 34561 56957 16770 -23281 -19260 31168 35939 -9629 -47759 -32892 -5752
84 -5752 -4334 -40506 -64506 -38812 8739 12668 -21303 -37690 -3499 37670 30256 -20136 -42263
97 -42263 -1684 57210 62804 15499 -13409 15736 51665 37079 -11618 -33464 -6468 28906
109 28906 19032 -23028 -34920 -3346 17484 -2075 -35685 -43504 -15591 9359 -7464 -37368
121 -37368 -26238 17696 40843 18734 -21873 -30023 7627 38753 19765 -15111 -10210 28156
133 28156 48023 22228 -17015 -19065 13745 27328 -1549 -30862 -20799 11480 20008 -5232
145 -5232 -27865 -16900 8883 9111 -21353 -42164 -21622 16810 26073 650 -20267 -8333 20858
158 20858 25251 -4647 -25762 -5921 28773 31765 4657 -13934 886 27484 23883 -9743 -26895
171 -26895 -6815 15630 8006 -16779 -22856 989 21990 8069 -24850 -32780 -8178 12392 5027
184 5027 -15688 -17617 6890 27665 15856 -12102 -17772 5406 23958 13404 -10717 -12384 12570
197 12570 29393 13415 -13364 -14329 7255 14864 -6265 -27038 -18728 8831 19566 -351 -21902
210 -21902 -15635 6619 10893 -8543 -23348 -12241 13533 22389 4823 -11892 -3111 17843 19750
223 19750 -728 -16432 -6622 15263 18545 -723 -13900 -730 17693 12335 -12633 -25859 -11345
236 -11345 9939 8669 -11437 -18867 -370 17227 9222 -12708 -19674 -3269 14103 9764 -7604
249 -7604 -10497 7028 21944 13977 -5558 -11525 1811 14412 5615 -12730 -14018 5522 19013
262 19013 7645 -13126 -16194 169 10709 -1847 -19819 -15837 6086 16915 3999 -11795
274 -11795 -8979 7268 13687 -69 -14767 -8951 10107 17132 4515 -7607 -2825 11600 14211
287 14211 -2040 -16795 -10006 8143 12061 -1905 -12816 -4975 10422 10632 -7159 -19516 -9525
300 -9525 7874 8403 -5651 -11835 -369 14571 11884 -5463 -13338 -1879 11114 7338 -5949
313 -5949 -8424 4449 16452 10848 -5396 -11534 -636 9710 3157 -10828 -12200 1622 13217
326 13217 6455 -9443 -12523 612 9414 -450 -13485 -11237 4628 13868 5139 -7770 -6054 7185
340 7185 11470 137 -11274 -7146 7001 13035 3745 -7108 -3409 8282 10247 -2539 -13379
353 -13379 -8452 4749 8476 -1527 -10469 -4419 8493 8507 -4568 -13925 -6709 6036 7519 -2851
367 -2851 -9167 -40 12470 10282 -3262 -9630 -1733 8495 6903 -4474 -8179 1934 12169 7818
381 7818 -4413 -9594 -1660 6458 2717 -8208 -10617 205 9847 5295 -6408 -9253 408 7673
395 7673 1671 -9367 -9536 3141 11726 5101 -4967 -4531 5051 9409 1349 -8411 -6674 4295 9981
410 9981 2704 -5599 -3974 5192 7873 -1030 -10193 -8171 2840 6829 -799 -7941 -3826 6237 7898
425 7898 -1865 -10200 -6122 4715 6885 -1670 -6942 -651 8770 8776 -1450 -7944 -2394 6475 5454
440 5454 -3488 -6937 243 8447 6612 -2886 -7698 -1755 5412 2554 -6027 -8650 -227 7705 5284
455 5284 -3861 -7331 -84 6096 2278 -6887 -7345 1642 8539 4896 -3712 -4714 2881 7557 1481
470 1481 -6619 -6002 2457 7327 2730 -4292 -3426 3933 6958 91 -7909 -6438 1759 5440 324 -5771
486 -5771 -3208 4624 6545 -919 -7840 -5075 2975 5287 -790 -5776 -1764 6283 7209 -330 -5800
501 -5800 -2267 4515 4422 -2081 -5920 -425 6861 6462 -1634 -5990 -1886 3512 2332 -4117 -6970 -1084
517 -1084 6029 4385 -2893 -5710 -775 4741 2148 -4599 -6646 125 6408 4251 -2719 -3518 2622
532 2622 6488 2284 -4686 -5572 1246 6055 2955 -3037 -2764 2675 5429 623 -6204 -5785 498 4435
548 4435 378 -4810 -3545 2814 5014 261 -5567 -4249 1982 4415 -446 -4651 -1739 5182 6444
563 6444 657 -4450 -2616 2981 3810 -1253 -4744 -1044 5201 5075 -716 -4894 -2121 3230 2674 -3062
579 -3062 -5677 -1728 4091 3599 -1568 -4516 -688 4097 2240 -3638 -5831 -912 4786 3972 -944 -3000
595 -3000 1062 5063 2062 -3775 -4804 513 4688 2729 -2582 -3136 1394 5205 1534 -4325 -4674 316
611 316 3163 228 -3913 -3218 2074 5070 900 -4470 -4240 839 3426 380 -3150 -1679 3672 5334
627 5334 1178 -3530 -2144 2587 3901 -275 -3621 -1612 3309 4508 -110 -3861 -1946 2089 2004 -2381
643 -2381 -5389 -2512 2762 3546 -497 -3795 -1118 2926 2363 -2216 -4350 -812 4011 3962 -798 -2690
659 -2690 663 4126 2674 -1861 -3668 -114 3123 2211 -1933 -3259 815 3826 1274 -3400 -4598
674 -4598 -838 2648 970 -2928 -2744 1481 4406 1269 -2993 -3214 884 3665 1061 -2662 -1821 2182
690 2182 4377 1588 -2356 -2092 1214 3037 -73 -3603 -2670 2006 3677 663 -2720 -2290 1363 1837
706 1837 -1137 -3789 -2036 2181 3435 318 -2498 -818 2725 2608 -570 -3195 -995 2577 2926 -219
722 -219 -2340 -235 3018 2529 -1728 -3780 -1488 1962 1992 -1203 -2586 103 2862 1656 -2198 -3867
738 -3867 -687 2093 1411 -1728 -2313 858 3468 2102 -1723 -2337 16 2781 977 -2330 -2170 1202
754 1202 3307 1637 -1960 -2355 284 2089 -29 -2854 -2413 1153 2971 770 -2017 -1990 1025 2195
770 2195 -242 -2789 -1773 1723 2927 415 -2181 -668 2337 2799 -432 -3100 -1616 1860 2341 -133
786 -133 -1862 -527 2089 1737 -1366 -3042 -1623 1317 1536 -1060 -2280 -401 2096 1918 -1130 -2723
802 -2723 -776 1614 1620 -1196 -1831 412 3376 2070 -815 -2103 -136 2131 1023 -1744 -1939 477
818 477 2727 1357 -1641 -2552 -8 1485 311 -2413 -2059 440 2266 911 -1328 -1259 669 2058
834 2058 175 -2163 -2072 1314 2540 797 -1127 -781 1562 2337 -196 -2285 -1455 1106 2007 96 -1852
851 -1852 -877 1230 1815 -631 -2630 -1777 977 1545 -542 -1911 -682 1518 1950 -483 -2064 -762
867 -762 1539 1328 -686 -1708 172 2357 2126 -360 -1929 -301 1509 1088 -1323 -2136 195 2121
883 2121 1229 -934 -1948 -267 1465 378 -1774 -2202 146 1936 1164 -937 -1394 538 1621 303
899 303 -1729 -1462 486 2004 923 -1087 -1051 864 2064 367 -1737 -1529 520 1833 394 -1441
915 -1441 -931 1095 1782 -219 -1955 -1321 710 1413 -592 -1504 -716 1596 1765 -142 -1676 -1241 802
932 802 1266 -580 -1538 -24 1707 1799 -73 -1319 -448 1067 850 -864 -1307 -306 1554 1378 -470
949 -470 -1372 -394 1266 576 -1291 -1718 -220 1476 1327 -482 -1051 230 1426 570 -1187 -1301 -102
966 -102 1509 1149 -733 -465 724 1266 287 -1290 -1529 172 1380 514 -1089 -1006 790 1558 317 -1573
984 -1573 -1375 514 1114 131 -1314 -699 717 1443 60 -1320 -866 617 1232 -177 -1372 -330 1247
1001 1247 1738 33 -1171 -446 885 819 -474 -1143 -331 952 1136 -124 -1185 -297 865 660 -880
1018 -880 -1375 -455 1104 1029 -500 -901 -126 1225 725 -919 -1358 -395 1263 1011 -296 -783 443 1361
1036 1361 746 -1146 -1199 11 964 558 -962 -750 429 1183 454 -993 -1147 53 861 38 -1027 -677
1054 -677 745 1138 497 -1070 -896 390 672 154 -1222 -753 694 1509 488 -861 -552 577 881
1071 881 -115 -943 -708 688 1071 -90 -1133 -388 589 943 -356 -1381 -573 627 1051 -143 -804 -383
1089 -383 1190 643 -542 -1098 -253 824 917 -242 -876 160 1089 878 -515 -1050 -132 1006 461 -641
1107 -641 -845 125 1020 505 -719 -1254 -156 758 195 -649 -722 524 1052 675 -649 -728 37 691 -40
1126 -40 -868 -782 133 1019 445 -572 -214 535 987 -118 -910 -533 481 1064 407 -765 -594 197 498
1145 498 -203 -772 -421 557 829 -70 -805 -218 319 539 -131 -1278 -194 543 544 -93 -746 -98 583 1093
1165 1093 -356 -858 -347 469 536 -285 -928 93 780 741 -419 -891 -5 664 405 -590 -598 63 965 660
1185 660 -388 -956 -157 701 333 -674 -836 320 1176 476 -258 -752 203 726 -8 -963 -754 468 728
1204 728 229 -526 -327 374 675 -90 -734 -694 363 473 318 -410 -293 488 648 -151 -874 -463 381 691
1224 691 -111 -643 -166 629 576 -35 -598 -514 418 566 -157 -520 51 517 615 -207 -655 -301 570 392 -349
1245 -349 -639 7 871 578 -377 -470 -258 623 423 -377 -616 -141 652 342 -512 -281 -64 804 175 -415
1265 -415 -536 75 643 466 -306 -546 287 704 433 -567 -527 155 597 135 -451 -246 147 569 -172 -521
1285 -521 -392 -36 501 -212 -436 -186 171 586 53 -656 -531 348 459 -118 -551 -136 453 1035 -114 -909
1305 -909 -301 202 293 124 -462 -227 665 447 -167 -896 -249 176 420 -233 -837 -196 436 577 -366 -661
1325 -661 -70 461 405 -402 -572 -82 545 257 10 -429 292 383 115 -474 -605 -69 638 346 -356 -564 57
1346 57 479 185 -522 -883 -88 452 -21 -184 10 241 520 157 -458 -376 -88 428 -75 -381 -571 510
1366 510 826 -53 -251 -430 393 369 -171 -587 -317 447 450 7 -673 -425 11 191 -662 -609 -238 534 427
1387 427 -135 -400 -175 529 405 -132 -765 -44 454 440 -152 -264 109 637 304 -369 -449 -67 385 127 -241
1408 -241 -447 306 562 252 -311 -771 4 451 257 -466 -314 38 524 340 -401 -464 95 121 -44 -257 -300
1429 -300 291 521 369 -393 -326 77 510 -26 -351 -437 133 457 182 -322 -440 298 88 -131 -428 -368 199
1450 199 337 39 -372 -75 346 508 -254 -238 -371 222 749 -212 -427 -144 576 284 -149 -589 28 371
1470 371 393 -143 -284 -156 492 172 -227 -428 -154 575 136 -490 -418 -104 310 293 -367 -40 -46 383 207 -289
1492 -289 -435 451 567 79 -101 -554 -127 256 124 -263 -314 26 344 317 -442 -156 -107 303 -80 -616 -6
1513 -6 103 302 265 -163 -194 310 154 27 -315 -301 234 474 57 -254 122 376 355 59 -669 -273 -92 223
1535 223 -348 -425 -115 282 343 -251 -724 32 323 105 -356 -501 -73 520 355 -77 -254 -48 290 267 -147
1556 -147 -450 128 525 371 -95 -176 -103 282 144 -525 -430 -6 188 102 -207 -215 100 269 -126 -399 -487 249
1578 249 385 -58 -499 -190 278 525 178 -139 -267 -25 291 -109 -481 -270 370 224 -196 -438 -367 103
1598 103 260 145 -251 -134 114 77 -234 -399 -26 145 92 12 -580 -152 553 395 -47 -199 -9 254 196
1619 196 -103 -243 109 296 20 -253 -251 -44 216 114 -357 -198 -11 314 306 -162 -68 -101 145 -33 -283 -76
1641 -76 87 512 205 -212 -326 -71 236 -74 -75 -153 334 526 206 -336 -272 368 355 308 -251 -302 -47 348 42
1664 42 -158 210 408 284 -99 -431 -264 253 280 130 -196 49 462 227 77 9 -85 94 479 -134 -311
1685 -311 81 172 171 -147 -199 30 120 -4 -104 -558 55 151 18 -47 -334 45 329 28 -187 -230 205 234 133
1708 133 -127 -312 33 512 203 -175 -207 57 130 149 -131 -264 -9 472 -306 -338 -36 -241 313 -13 -352
1729 -352 -149 178 242 -7 -75 -337 19 203 98 -152 -141 264 233 78 -274 -219 -22 153 -91 -269 -115 168
1751 168 157 -192 -138 -83 430 -125 -149 -222 8 260 112 -51 -315 63 260 148 -79 -267 -233 300 158 -124
1773 -124 -166 28 123 135 -241 -317 135 147 66 31 169 -89 352 -143 -244 -207 128 132 44 -326 -73 134 192 356
1797 356 -63 -316 9 267 -92 -322 27 129 108 -199 -193 4 32 148 -328 -237 -247 -172 36 -62 -258 -36 -41
1820 -41 194 -170 -245 -144 8 342 -41 -145 19 -150 232 169 -165 -77 248 65 -138 -403 241 218 311 -264
1842 -264 -228 -91 -13 -10 -292 -191 253 257 89 -264 -65 -54 419 58 -154 -77 16 463 184 -203 -181 -91 284 38
1866 38 -74 -242 330 179 141 -156 -139 -9 227 -264 -298 -76 220 195 -127 93 -137 145 -21 -216 -159 -100
1888 -100 262 145 159 3 -150 317 38 -173 -72 -222 289 110 -58 -167 26 180 404 100 -355 -52
1908 -52 186 172 -43 -229 -192 92 295 -77 -457 187 102 84 -238 -356 -41 112 176 145 -122 -20 -9 -25 -160
1931 -160 -283 57 -43 103 -363 -230 165 9 109 -194 84 42 67 -159 -226 -7 286 343 121 -240 -62
1952 -62 -11 111 -2 173 -258 -13 -271 -65 -28 127 250 248 454 -181 -209 -35 96 -67 -355 152 319 37
1974 37 151 -265 -13 -52 276 -38 96 -94 138 163 -89 52 74 271 5 -1 -196 64 -30 -98 -142 -55 173
1997 173 285 41 -284 -161 -64 144 32 -26 -256 97 201 -71 -335 -190 -240 64 -130 -207 -75 67 286
2018 286 233 265 -2 110 155 -143 -186 28 -100 134 -41 83 -95 -49 184 91 -161 -101 -19 230 31 -23 134
2041 134 216 239 -9 -89 116 100 256 -34 -147 183 8 207 -59 141 274 5 -17 -405 -273 195 269 357
2063 357 154 -247 42 -70 -66 -186 -345 34 4 101 39 -55 -137 202 157 -79 -238 -97 110 -111 92 -104 97
2086 97 27 -49 7 -97 38 177 115 -175 -6 -68 107 -123 26 -191 -13 309 174 -271 -84 82 31 -74
2108 -74 -252 -21 -125 46 -94 -400 74 215 -50 137 -103 13 192 27 46 -197 -27 4 0 -37 38 84 25
2131 25 -15 149 -43 -161 -113 -62 -28 -40 -42 -86 -96 -360 -281 -91 47 76 -146 159 96 108 -79 -303 -139 -151 -102
2156 -102 89 20 -155 243 86 155 1 -201 58 253 99 -130 -17 182 3 106 -162 -80 -67 286 -108
2177 -108 -54 -203 -104 89 -66 -67 -265 -113 217 40 -257 56 -73 -21 -1 -42 160 41 124 -87 -302 -122 221
2200 221 -33 6 -79 -80 123 42 116 -142 -94 -72 63 -212 66 -72 -97 0 -191 -245 117 190 227 95 -138 158
2224 158 278 101 85 -70 -87 -170 -36 -161 -43 256 -38 -87 -9 -104 -16 243 107 48 -70 -167 -83 133 -267
2247 -267 -188 377 -202 118 -290 -227 -69 -2 -48 81 132 -44 146 -158 -78 102 67 40 -40 -64 -44 -2 171 -196
2271 -196 -11 53 -18 145 -72 -43 -111 47 -135 6 -155 -53 255 89 -81 44 107 -9 120 22 -130 25
2293 25 -93 -154 54 -189 -165 -20 123 17 190 -13 206 110 -95 -100 70 100 1 -21 -39 -79 50 -40 -54 29 -37
2318 -37 167 218 -173 325 52 160 -58 21 -78 -71 -69 111 -160 47 47 115 191 32 127 163 113 158 -330 -71 -19 394
2344 394 54 -465 -198 -160 16 -77 -142 25 150 78 -14 -125 -90 189 48 13 -14 167 280 174 49 56 -199
2367 -199 71 53 -122 -83 -46 -95 6 -35 -201 19 83 94 -151 -193 -80 -95 0 90 -4 -214 -79 239 -106 -26
2391 -26 90 233 11 -338 -52 -34 222 -179 411 63 -17 7 -68 -98 -16 -25 -112 -38 -132 44 11 -1 88 -55 -160
2416 -160 78 -96 257 -34 -243 -92 -208 -156 -250 63 70 87 -42 23 180 128 -57 -177 -149 -101 -286 47 32
2439 32 -65 95 145 100 7 120 219 134 56 229 117 144 85 334 -105 90 7 11 83 -313 169 38 115 -2 -189
2464 -189 -144 196 52 133 87 -34 51 357 219 4 46 -205 -214 -231 39 156 -53 2 85 210 37 111 138 0
2488 0 -296 23 108 355 -12 -143 274 296 -171 252 -44 -172 -21 -259 -172 -174 118 -97 47 -271 -182 -11 -206
2511 -206 215 163 30 -33 -6 85 31 -314 -122 155 -50 75 -334 88 -72 18 84 -189 -284 19 195 -75 132
2534 132 83 -270 85 -76 -60 94 -220 -28 -164 -195 -126 50 -29 195 -216 30 13 -152 186 -26 -316 281
2556 281 85 -166 85 -74 -118 148 -124 50 28 148 86 -135 39 -175 -41 -122 -20 10 -50 114 212 169 68
2579 68 -209 37 60 -264 -165 -34 -15 130 -97 30 1 9 153 -30 -96 -115 -116 278 -41 -68 -96 -177 194 8 -308
2604 -308 102 -145 152 101 270 281 -167 147 159 -172 154 -95 -212 120 -20 354 14 -220 86 -366 78
2625 78 221 -127 58 118 62 -145 -220 -46 59 184 298 -174 90 -178 -118 -72 17 139 171 68 -25 -214 -250
2648 -250 66 225 111 -111 -31 227 3 4 107 68 66 341 -104 -59 -22 27 -144 113 -174 152 -52 -15 38 -223
2672 -223 188 -81 141 216 -129 -134 37 -58 37 -139 -149 151 105 -193 -13 -166 260 -10 -104 -262 -258 88 33 -164
2696 -164 -121 -97 117 193 -104 69 -98 16 -195 4 97 78 156 -3 48 26 -158 -35 -11 170 -61 186 -19
2719 -19 -66 117 -43 60 108 25 -279 49 -69 106 88 87 -85 359 62 -105 21 -46 190 -183 -182 -161 256 183
2743 183 26 164 -30 110 398 86 201 -50 1 31 -126 -67 49 113 -20 23 -23 -42 -98 -53 -47 -119 -138 -94 -116
2768 -116 -92 143 125 -210 -136 169 -33 105 50 181 82 -104 297 -64 -112 -39 123 -27 41 49 -19 -20 -133 18
2792 18 -140 117 -27 -202 221 -134 122 -35 -30 -10 133 -157 -143 3 -61 368 -3 -210 -161 236 43 -182
2814 -182 -12 -4 120 -56 -80 246 44 -329 235 275 -179 -47 -77 297 -158 -85 -226 -31 -16 45 36 74 -163 52
2838 52 -128 260 -47 -284 89 6 179 63 104 85 61 -175 152 21 118 -87 -128 -106 91 -49 2 128 110
2861 110 -78 -100 -9 -269 -85 -157 -164 -69 -80 153 29 170 20 -82 -31 150 -190 -18 -52 -3 20 -5 -198 -93
2885 -93 196 18 58 -171 -5 -36 176 169 33 -55 160 301 163 51 140 -27 -23 165 -157 -83 -210 -189 -94 -173
2909 -173 1 25 -193 -111 157 91 259 155 -44 -146 71 -147 291 73 79 -68 62 -25 -94 -150 -124 27 28 -218
2933 -218 -64 -224 112 40 75 -22 -37 -205 -335 -78 -143 28 124 -11 71 -210 72 265 -158 -17 122 -22
2955 -22 64 72 -95 -71 47 16 -58 -49 56 -108 -52 -72 -23 -164 2 -217 -88 230 75 -62 -44 66 -65 173
2979 173 -12 56 85 -304 -45 -137 -64 -30 -235 2 -109 -56 79 128 221 34 -9 -16 -95 1 -88 100 -23 -34 -219
3004 -219 -14 52 -189 57 380 -284 106 -117 25 417 175 -100 -153 74 -156 102 73 -56 -266 64 100
3025 100 -135 50 -33 -147 -120 253 -229 6 175 172 -67 -78 60 132 99 6 -196 -161 85 -5 34 69 20 -48 -99
3050 -99 -79 -137 -146 165 25 -49 -114 18 -23 54 -55 -14 -15 -71 118 -27 -183 199 81 77 -115 -205 -204 -170 41 61 59
3077 59 -158 -53 36 -96 66 -136 -69 -97 -76 -34 -227 -213 -21 -23 2 27 -129 190 -87 -31 -215 110 293 68
3101 68 61 52 156 -9 74 57 -25 112 123 -174 -137 96 -15 141 -16 159 -18 17 -165 45 -241 -80 137 -45
3125 -45 121 -131 -32 266 107 4 -141 43 -84 111 -5 -6 31 127 -96 -104 16 -74 127 -25 41 -20 -93 -55
3149 -55 44 9 -90 -77 104 -151 27 -227 -120 -186 -346 -125 -321 -19 -46 -254 9 56 -56 48 122 25 -113
3172 -113 -140 87 21 68 151 96 -12 -267 194 -382 104 136 -44 -24 141 -100 64 -244 24 -72 104 28 -219
3195 -219 68 14 149 -250 42 81 10 -110 -164 -3 -102 -123 230 -151 -13 -119 57 54 285 45 -24 -154 160
3218 160 -110 -165 -48 -206 245 -119 0 -94 -241 275 -23 297 39 22 -154 -111 -105 -277 462 -35 84 132
3240 132 15 171 58 -94 -53 -5 2 -283 -174 26 -150 -172 251 -95 101 -211 317 88 -109 70 60 -233
3262 -233 -69 56 -16 138 125 55 -92 96 -51 -63 17 -7 -167 -14 -18 161 -303 87 -180 37 94 67 61 26
3286 26 205 35 159 5 -47 98 168 197 -89 -97 -118 4 31 -31 -26 40 -152 -80 163 19 241 19 -276 66
3310 66 -49 -183 46 -344 -109 63 152 -120 -12 261 122 135 27 -65 -2 184 243 -152 -135 88 -86 -126 -320
3333 -320 30 11 -40 -197 110 -112 -70 157 -103 -112 -104 193 -67 301 -94 -24 176 240 -190 -54 -222 131 -136
3356 -136 162 -195 -25 -15 195 -137 -217 169 95 -29 -50 -134 102 -182 290 263 -159 218 -36 89 183 -104
3378 -104 98 -54 -159 -30 -276 -4 200 120 2 -173 56 -160 -26 -172 132 115 -1 275 -74 150 14
3399 14 -288 -28 -33 115 42 182 36 168 47 192 133 -9 220 -198 -52 286 -46 -236 189 132 -68 -105
3421 -105 -157 -52 50 -76 -167 46 201 -79 23 73 -192 23 145 -31 126 -38 164 6 83 197 -238
3442 -238 68 49 -119 -70 -55 -228 90 56 100 -9 -64 -262 -217 83 112 -118 181 45 -400 370 -222 329 57
3465 57 -17 144 59 -36 -94 16 -108 -15 31 18 120 -27 56 35 -204 59 3 -64 93 23 -200 -287 141 -66 170
3490 170 54 -203 61 13 174 -22 -55 64 35 20 414 112 78 214 236 -89 107 16 -100 -198 -14 -8 -58 -169
3514 -169 -262 -160 -133 184 175 15 43 -135 9 159 -11 -19 -120 186 -113 -66 164 65 -58 74 -50 164 -101
3537 -101 -167 -7 130 -58 -21 60 -44 -120 172 -61 -240 204 149 -179 -23 165 68 27 57 264 -297 162 -246
3560 -246 -178 164 -4 175 -69 63 129 121 -95 -85 166 6 315 -194 66 -116 -1 19 -166 -252 -236 197 64
3583 64 -101 -51 -130 271 73 21 -41 -177 -183 -350 -14 128 72 77 104 -97 19 -226 -107 -143 65 -244 -87 112
3607 112 126 117 270 66 78 122 166 -85 148 -269 -218 275 70 -250 -56 -129 35 -100 -163 194 325 -212 -116
3630 -116 264 150 -53 69 -102 54 25 -146 148 -224 -12 -52 -50 -338 -25 56 148 -281 60 17 -124 232
3652 232 -21 77 -32 214 -109 81 16 24 135 202 40 125 -213 -161 -6 12 -95 153 -179 66 -69 2 -59
3675 -59 -15 -203 -92 -163 -101 54 -136 -236 -159 -101 59 32 -99 78 -13 133 44 86 -141 24 -138 198 -139
3698 -139 112 157 165 -49 -24 -94 67 -4 168 -83 -125 44 55 260 -14 -96 149 284 -39 142 202 28 -53 -89
3722 -89 250 80 -135 192 4 135 -117 -219 -106 -38 -120 -162 -51 224 -200 0 -87 -35 125 -130 -181 152
3744 152 99 23 13 -33 -154 32 167 -304 -162 138 172 177 88 -49 190 16 -149 146 -114 -141 -165 -165 -124 22
3768 22 -15 -11 -67 -83 -69 77 138 -43 -283 -36 64 -49 -61 228 -199 -94 -114 90 6 -169 13 14 -74 150 -243
3793 -243 22 116 23 -166 102 192 121 27 -236 86 145 76 -335 107 104 350 -326 43 126 -187 149 -229 -148 262
3817 262 2 121 -142 -161 326 -184 -1 -45 95 17 43 160 101 275 -190 116 -128 44 -159 -177 184 -135
3839 -135 83 -99 -17 76 51 5 -50 203 -110 144 -54 4 30 2 -61 13 20 -26 82 260 141 137 293 33 66
3864 66 285 64 25 -77 -94 217 -226 -116 198 47 -99 209 -174 -87 -70 115 -192 59 113 45 -24 8 -33
3887 -33 5 -238 -22 1 210 3 4 -188 148 -18 34 189 -128 43 118 -40 -45 -71 -59 36 -228 1 112 -21
3911 -21 -51 -144 12 264 -32 186 59 -46 7 64 -126 -19 50 -92 61 107 89 -44 167 186 -141 -108 103
3934 103 -45 4 182 60 166 -63 8 108 -184 -259 -23 -68 238 -47 -35 259 -156 -250 -131 5 -16 -163
3956 -163 -8 -15 -291 -67 -119 134 212 158 -111 -56 65 -54 96 112 41 159 82 -132 -345 -160 53 94 32 16
3980 16 -261 -147 232 60 94 -164 -207 -114 124 13 43 -163 -1 113 127 157 -243 23 -146 194 300 -10
4002 -10 202 -199 -16 120 -98 -24 154 273 -11 -38 -202 -348 88 -120 4 42 92 -54 -67 42 39 90 19
4025 19 128 77 -50 86 103 38 -94 -101 -4 -254 37 -151 -54 110 213 -7 -108 160 -330 -2 71 56 -228
4048 -228 -49 -172 -1 -141 124 171 220 0 -39 132 -147 -60 -55 27 -225 -184 20 -6 -112 130 131 -89 -77 -182
4072 -182 -312 -59 157 26 -43 -93 -65 -99 -168 -77 -118 148 23 216 268 176 -102 40 256 -35 -68 -4 73 153
4096 153 -138 -38 46 -84 -190 -48 -50 29 -53 -92 98 -110 161 -103 -42 -143 182 -54 -123 -225 355 96 -101
4119 -101 -182 35 132 94 -93 103 -27 205 54 31 -14 -134 -15 98 4 -98 171 -107 -99 164 416 -100 60
4142 60 -161 -23 58 -104 189 83 41 -98 112 -191 -34 200 48 -35 -189 -33 297 -1 84 -117 10 30
4164 30 -108 -101 84 -147 -167 104 -44 -39 -183 22 -107 93 218 -34 169 0 52 -166 144 115 24 98 35 -342
4188 -342 -276 -282 84 -96 149 199 82 5 -6 -20 211 4 110 102 -85 97 -10 183 -57 -179 -84 191 -111
4211 -111 -24 -201 -88 -112 -95 -37 -7 16 -120 150 55 -72 47 218 2 -42 -122 68 180 -215 -234 -221 23 183
4235 183 68 -3 -108 112 -135 -103 90 -115 -63 -3 30 -13 -11 1 42 -76 118 -84 -75 30 -143 97 -71 -223
4259 -223 35 -83 42 339 266 151 -132 336 16 3 213 101 185 143 12 -90 -285 -40 47 -44 -101 -115 20
4282 20 159 31 -15 -146 -26 -48 -31 -303 39 -76 91 1 115 153 -378 13 178 79 7 -161 -21 67 -233
4305 -233 -12 108 90 -293 10 128 -125 -85 56 -99 10 71 20 9 102 -64 -16 7 -55 -239 29 -188 -178
4328 -178 28 -84 173 141 -132 69 -115 236 -17 109 77 77 -62 32 154 -51 -2 15 53 39 -152 19 107
4351 107 -52 99 53 -142 -106 -236 -74 -67 225 71 -75 6 -310 203 -111 22 -267 177 126 60 -24 49 -65
4374 -65 -28 -16 -57 -81 -206 99 -132 -319 5 -52 -7 164 105 -104 -28 133 -127 -29 17 -6 -5 -307 66 -74 -70
4399 -70 39 -78 69 131 65 -218 122 20 2 206 -33 -101 161 -168 -14 -225 101 142 57 -124 12 -405
4421 -405 130 108 210 79 -25 -226 -179 171 -105 -115 -8 -25 -239 218 -58 127 -2 170 41 -363 148
4442 148 -4 66 194 166 -258 -142 45 -97 43 22 -153 95 -88 -217 107 -136 24 -18 -139 -111 23 71
4464 71 -224 -151 11 69 -256 91 -83 87 -231 110 124 -137 84 116 49 -1 -242 -167 4 44 -189 47 -223
4487 -223 3 29 -52 -90 27 146 -166 -32 -234 -194 -55 45 -141 74 44 166 -134 -105 -135 -74 104 71 169
4510 169 -54 -316 39 -163 5 -104 -192 169 250 -137 -291 49 139 -12 5 29 -98 -71 11 -11 81 165 -30
4533 -30 -88 286 171 -97 200 -14 -41 -111 153 39 182 -40 115 -107 -8 239 12 138 36 78 -10 -136
4555 -136 274 160 -48 -78 -149 -51 -185 39 154 -91 -56 40 -41 59 240 113 -162 174 -32 -48 -19 159 -91
4578 -91 10 -247 204 64 -210 -38 -24 -38 27 43 -158 4 236 42 -280 121 -273 -115 -19 187 135 14
4600 14 -186 191 102 -9 -232 -167 -83 287 60 -190 232 161 69 34 -103 290 56 89 28 88 53 77 151 -58
4624 -58 98 -87 -43 -161 -35 -146 8 91 135 -163 -6 -173 110 256 -55 6 121 -197 257 -236 -190 -103
4646 -103 111 -188 -38 2 -187 71 -139 218 -31 -150 -65 -112 -255 -177 102 3 132 110 23 42 309 15 -92
4669 -92 -16 -62 -119 163 -86 -175 -34 154 -95 -66 88 -162 -133 -73 54 -39 190 113 84 45 -186 144 -21 -49
4693 -49 -233 -18 -76 -3 44 -242 35 115 -22 -43 101 109 32 -68 -36 12 -63 177 -169 78 -172 82 -294 3
4717 3 -15 60 -77 -142 -16 26 -57 -123 71 138 -7 64 -41 -24 181 -228 -217 79 45 64 -213 66 -83 -97 -208
4742 -208 208 -196 111 264 -64 -104 64 196 -250 -324 -88 175 116 -151 -11 124 -11 280 3 -162 -108
4763 -108 242 -109 40 -37 -141 -173 34 65 -320 85 203 254 -125 -63 -5 80 -89 80 -97 23 304 -95
4785 -95 -33 -6 -140 -69 280 53 17 42 61 18 134 -40 57 -337 116 -110 120 -85 -28 -67 -79 360 -212 -86
4809 -86 66 89 -104 -291 282 -63 -126 120 104 211 -211 101 -7 105 -19 35 33 -171 -119 -159 -179 -62 39
4832 39 -96 85 35 15 58 -71 221 123 -182 45 -61 150 -16 0 157 -93 183 -277 7 -152 -4 -266
4854 -266 -65 121 -80 166 88 87 -62 -60 -187 112 -66 54 39 21 226 -11 82 -124 -71 21 -119 74 -20 191
4878 191 -295 -102 15 -136 179 28 -30 124 -393 -103 -32 68 229 44 172 4 -21 -26 -12 105 2 6 -98
4901 -98 -243 115 -79 -145 -106 162 138 95 -35 34 -15 30 -263 -174 146 -76 -48 57 -194 80 -68 -206 -63
4924 -63 38 -39 -187 -99 176 -122 -71 -137 -167 -58 -19 90 51 -263 101 71 103 -95 145 -129 31 -1 -184 61
4948 61 -28 134 -105 -107 19 -11 137 7 -37 -301 173 -28 -114 -258 -156 -61 28 -91 -54 67 -91 -25 -203 -185
4972 -185 -101 -125 22 -93 -26 124 -19 22 241 32 -238 -97 -5 -42 54 -15 94 -57 -190 98 41 101 -81
4995 -81 -34 -41 -164 -30 -224 -97 -156 292 5 88 74 241 -54 -179 -336 88 -27 -124 -163 54 -146 9 275
5018 275 -75 193 -13 12 -101 -34 -73 66 -137 -73 -16 1 99 4 21 28 -206 29 -246 -52 307 49 -35 -17
5042 -17 155 238 -114 49 81 -92 -258 -132 12 28 16 -271 153 159 96 30 -14 30 16 -24 -119 -14 158 -145 -94
5067 -94 20 123 -1 -74 117 62 -376 -287 48 -182 84 80 -125 121 23 -37 -83 61 -16 -54 -61 -5 -106 144 -289
5092 -289 -147 214 -45 -74 -32 -68 -81 287 -1 -136 -98 -18 -7 301 -150 -116 12 107 -110 -44 91 21 -2 66
5116 66 -163 -97 159 201 71 22 -209 25 250 103 -58 88 -72 -316 105 132 -179 -20 -148 81 -107 -2
5138 -2 80 -112 -202 -181 -92 46 -34 -203 -82 -258 -6 -12 66 -94 43 -133 157 135 100 -43 -239 -160 95 -82
5162 -82 93 23 132 -87 -47 131 48 -141 35 112 -97 293 -199 -89 -221 39 -211 143 -176 -103 126 -70
5184 -70 -119 -142 286 -117 327 7 168 -167 233 -146 90 57 18 -50 -32 99 234 -136 -142 62 278 -8 -30
5207 -30 -31 -116 318 113 20 -49 -9 -111 -17 -81 -101 14 -350 -211 -20 -110 -64 259 -80 175 136 -218 134 86 -125
5232 -125 37 64 223 -84 -46 56 146 -59 -34 155 -142 63 16 -26 308 -33 -198 56 -138 68 103 -62
5254 -62 -100 75 -278 34 54 -39 24 -145 -47 196 -195 172 34 -245 -21 82 36 124 98 86 61 -156 -218 -40
5278 -40 14 171 -14 -239 2 188 165 62 -152 -46 66 199 24 202 80 -27 8 31 2 54 -202 32
5300 32 -96 98 -76 30 39 -89 35 76 177 -216 356 -83 148 -215 -125 71 24 -2 -32 89 -39 -122 96
5323 96 70 100 55 41 -243 -230 40 -69 70 -9 84 113 -46 -113 -217 -71 -139 -54 -97 151 117 -70 -29 -148 -49
5348 -49 46 406 -81 -19 -119 -106 29 140 27 79 -7 -128 -213 -31 157 42 142 251 -9 -119 47 133 -174
5371 -174 68 179 2 -4 221 -179 -84 -112 41 82 51 22 74 207 30 -114 79 -137 -84 37 188 244 164 -147
5395 -147 -104 12 160 -34 51 89 59 -277 -33 52 110 -50 -156 -34 15 45 -127 25 125 -53 -53 -77 55 403
5419 403 -59 -8 -23 -332 -17 71 -82 48 53 -111 -182 -327 160 139 90 126 192 41 -210 39 -118 -96 -5 -225
5443 -225 -56 -68 -58 119 334 233 -93 -298 -210 -7 -49 11 97 25 108 20 -182 -262 4 -103 -59 89 92 46 -299
5468 -299 -99 -60 120 195 138 -56 -105 -52 45 -46 -22 -69 109 -44 60 -32 -102 -177 91 26 -63 137 -38 -254 131
5493 131 -48 -242 -257 169 -33 71 54 -57 -103 115 -95 65 29 15 -98 -168 76 26 -278 34 -116 -215 106
5516 106 -148 -15 -55 72 -151 -23 104 -88 -48 22 -160 194 15 -52 -69 51 48 121 27 -125 6 -144 107
5539 107 -227 253 3 -100 -59 -23 131 63 36 67 30 28 -35 -147 -153 236 -199 82 -88 85 -70 295 205 187
5563 187 42 -251 103 -103 67 -29 -37 -164 29 -378 57 49 -29 -28 -28 -83 11 -73 -105 26 23 -57 57 -26 -141 -98
5589 -98 229 -135 89 12 -363 -10 -14 5 187 -134 212 -79 142 136 287 -111 -337 -96 -9 238 14 -35 -79
5612 -79 -160 -204 -232 149 -168 -42 -138 32 47 -190 -164 -67 151 -152 -10 -142 141 222 98 79 72 -187 23 289
5636 289 -30 -8 12 -149 43 137 -257 214 -131 220 -113 188 -89 -112 -160 121 44 -70 106 47 -80 -154 -303
5659 -303 31 -60 41 177 122 20 -53 -62 199 15 -30 -47 -170 -70 89 -44 -93 -45 -159 -32 131 -83 -88 -2
5683 -2 57 49 -104 3 -74 -125 -60 -107 51 -219 -8 266 -35 68 -23 -85 77 -182 -46 -16 195 -143 105 205
5707 205 -95 117 27 28 116 -264 -98 -205 -204 -103 -175 31 -215 -174 162 -171 -19 -147 -11 314 65 19 -63
5730 -63 -32 50 -105 -96 195 75 -56 -76 105 -13 22 -161 -66 -58 -155 -198 -52 132 -157 19 18 -168 -55 -19 98
5755 98 125 51 95 -193 -92 -5 51 -38 29 35 143 -132 -170 -91 -55 -74 8 306 101 -7 -12 165 -123 152 65 -115
5781 -115 -91 -47 146 -74 152 -107 190 -48 52 -60 47 72 -124 -283 -103 -26 -132 216 -261 102 93 77
5803 77 -136 -46 -183 -159 100 -30 -18 -21 -54 205 -65 276 113 -67 -99 -71 -67 -156 -129 136 -31 -23 282 -146 -54
5828 -54 72 1 17 147 -71 149 -241 73 88 -17 145 286 -89 -36 -320 -248 -75 -49 -14 -122 53 -258 64
5851 64 -62 -174 98 -53 -63 -23 -115 132 148 34 -229 344 31 -131 -21 81 -127 198 -149 -76 -22 -20 -158
5874 -158 -246 -30 70 -5 121 -11 -38 -159 94 -243 -9 -156 -58 215 -15 200 -162 -318 -24 132 77 -4
5896 -4 225 64 140 -190 22 -11 172 -181 83 -102 -15 -69 -40 -87 182 -9 -98 23 66 140 -115 65 -159 -261
5920 -261 -218 -83 -298 -274 155 -86 292 191 -232 -20 -180 -92 257 -257 -92 165 -66 78 21 99 -91 33
5942 33 -66 -269 1 -120 -70 205 45 -64 175 4 -24 -13 -124 64 20 3 61 -54 192 133 94 4 202 26
5966 26 41 167 105 -162 153 113 212 -175 165 35 -203 -207 -257 19 61 -45 -199 62 -5 2 15 68 236 -3 44
5991 44 240 -98 68 -127 111 -285 260 -161 123 -121 84 149 -47 -2 17 -32 13 96 155 -106 -72 66 -230
6014 -230 52 -346 91 -275 55 -15 -153 104 119 244 139 -77 304 -219 38 16 -37 -208 39 16 -47 -180
6036 -180 -112 -134 -171 5 -96 -205 -57 80 85 -194 89 86 243 33 -148 102 254 126 128 -52 -67 -93 166 -120
6060 -120 63 16 66 -133 124 60 -87 -10 -12 5 29 73 143 -141 -69 -86 -140 -76 -176 -58 291 7 -91 -48 -57 118
6086 118 -175 243 -150 78 254 115 -125 215 -66 -16 -79 149 121 60 50 -45 -25 -104 175 60 -269 80 -54
6109 -54 -64 -1 18 90 -262 19 150 269 -97 104 168 -78 7 -136 -73 -271 25 21 -10 16 230 -52 -84 -26 -274
6134 -274 -185 50 41 -254 258 189 -103 128 -45 -42 60 -123 -114 -1 -184 -129 159 177 170 -281 -22 -210 -142 157
6158 157 112 -26 17 89 -28 20 171 -39 -101 -80 158 86 224 -184 4 -68 0 -171 -53 -130 -204 -155 -7 -129
6182 -129 116 65 -256 165 -103 -65 -45 154 -281 -51 -62 17 91 26 43 -57 -2 65 -34 65 -24 259 -107 52
6206 52 -120 32 282 75 25 -142 -176 264 -227 202 -25 -43 19 -67 -102 -171 245 136 -62 4 -31 -12 -48 -31
6230 -31 -131 -243 -33 257 -317 -18 -95 -231 54 -6 -98 100 403 217 64 -61 21 -172 157 25 -68 -215
6252 -215 10 85 50 66 -91 -170 133 162 390 7 -16 198 219 33 111 86 -63 75 -30 156 101 299 90
6275 90 -137 -26 -53 -152 63 203 -265 -284 115 -53 -143 111 198 13 -27 -32 54 42 100 -24 69 -15 93 -21 20
6300 20 237 -64 -277 124 26 -291 -122 183 89 24 6 98 205 59 -161 -57 114 82 0 -206 -47 -6 4
6323 4 112 132 -228 50 -146 49 127 -7 -114 54 0 -24 113 79 51 94 271 82 -191 -179 135 -103 -75 -30
6347 -30 -10 28 -48 135 -14 -36 1 -1 -22 46 289 51 99 -61 140 36 33 -54 -30 80 10 145 -92 -141 6 -144
6373 -144 -295 124 -58 -29 -193 -21 -51 -165 -52 115 171 62 -208 17 120 102 142 -31 83 -21 -88 189
6395 189 140 52 -270 -192 126 -251 -46 -285 -45 263 49 95 60 30 -8 74 -118 -202 35 -136 -141 -97 311 152
6419 152 97 216 127 -75 116 142 -175 -31 -169 -12 15 -86 -210 182 13 81 -218 6 -131 2 -75 66
6441 66 -275 36 -69 -108 205 -547 184 130 -197 146 105 65 -240 -168 304 -28 209 52 114 155 56 143 93 2
6465 2 233 -68 -208 -80 -29 -75 -55 -107 -149 -173 5 -12 87 -69 185 46 -38 -1 -62 321 21 247 96 -75
6489 -75 488 288 -38 -218 -41 -211 -275 -154 108 95 -34 -228 147 185 -159 -231 28 -53 -27 -170 -251 262 -136
6512 -136 -185 -251 -17 235 -92 9 -30 -109 -3 -38 202 188 58 -186 -90 172 102 15 -63 34 -196 -423 -172 72
6536 72 32 -82 124 50 55 100 -101 -147 -91 -58 -127 -87 -90 136 -78 -44 141 -48 154 -103 86 44 346 22 165
6561 165 -36 -64 13 -132 296 246 76 50 -35 -134 102 48 -6 -178 114 119 -18 -207 26 197 11 -113 -59 -19
6585 -19 150 -154 62 47 254 -69 -51 -31 -112 -210 18 -160 -18 84 -138 -4 -82 105 1 103 -75 42
6607 42 -129 -54 102 -196 -155 -68 -62 62 56 329 87 -53 -178 28 -50 245 -131 163 -140 147 -138 203 -86
6630 -86 -47 40 -47 -47 -26 -79 18 -47 -57 -71 -1 57 -133 78 -41 -76 16 217 -163 11 -46 -29 232 63 282 196
6656 196 -233 63 28 88 -240 -237 49 8 -61 215 -56 -32 -165 -98 -96 -95 -183 -167 -151 8 36 -203 -103 151 44
6681 44 -68 -52 109 146 -90 34 -25 -35 53 173 130 -42 -25 -47 298 -39 -97 -235 -84 87 79 15 -115 67
6705 67 161 -33 -225 127 -87 -265 50 81 -126 -32 -234 -76 70 -200 -12 -39 -278 221 48 -76 202 -60
6727 -60 22 -57 -2 -20 38 -133 -67 -27 -162 -171 13 307 -343 153 -102 -299 124 313 -174 59 52 -7 -157 -89 -4
6752 -4 206 -48 -294 -37 -30 -252 401 11 -88 128 4 -189 -23 241 15 79 151 304 305 -324 147 -23 19
6775 19 15 -174 257 -192 253 -261 86 -264 -184 61 -57 193 186 105 -142 39 -188 24 6 165 26 16 -59
6798 -59 -25 7 -118 -63 -91 14 -39 -191 334 -84 -54 90 36 -92 220 -190 97 -313 42 10 -80 41 -6 50
6822 50 109 80 -114 -106 100 290 145 -40 -218 -121 40 -159 89 145 -110 139 142 129 213 -149 -17 -7 32 -15 152
6847 152 52 -60 -7 -77 5 -490 121 161 -74 -113 70 -73 7 258 137 20 -8 -46 -126 -22 -94 110 -19
6870 -19 39 187 3 64 -49 217 -235 -181 66 40 -119 53 194 53 -80 -9 313 -108 1 -179 -96 -139 -51
6893 -51 78 -246 -36 7 -39 -136 3 77 -34 -71 -72 -64 24 60 105 -20 23 90 -58 54 -398 44 225 -14 159
6918 159 -26 286 -211 -117 -297 -172 -40 236 90 293 280 17 65 -49 -62 -7 -223 186 157 -104 154 28
6940 28 113 -135 -91 -116 259 9 -275 -246 -51 13 -171 -225 -6 -21 -53 -21 199 -12 -84 167 53 -110 139 70
6964 70 -220 -140 226 73 137 87 -94 -110 173 -191 -149 74 -271 -123 36 -102 -173 -31 -116 -18 39 -95 121
6987 121 168 108 61 -39 93 -54 -31 -102 159 94 102 28 17 22 184 298 49 -114 -46 101 1 -74 -24 -65 69
7012 69 35 143 55 116 -162 -162 280 -18 -26 55 -107 77 73 95 -133 -90 10 196 -25 137 9 -1 -92 107 -14
7037 -14 11 -18 -40 30 -179 -59 -57 6 117 -120 213 -209 111 106 -92 -145 6 -111 -64 -221 73 29 -72 22 397
7062 397 4 32 63 212 155 41 -50 -50 84 -203 -54 101 162 167 -16 121 143 63 -123 89 47 -30 118 -19
7086 -19 350 10 -28 152 -225 176 267 69 119 136 -152 21 -142 -46 -55 -150 89 -124 -49 -61 86 25 172 5
7110 5 -166 156 69 -103 -28 -122 -210 123 9 -105 -164 84 17 50 182 -226 -120 -20 -51 -17 -21 22 194 -159 -240
7135 -240 8 -112 -27 193 48 71 -64 -78 -83 -157 85 -41 -158 -64 374 -271 -112 -180 -5 -75 346 -48 -45 61
7159 61 -13 164 -109 106 -98 -88 -124 -78 -61 163 -195 85 -87 24 -37 -58 -327 99 189 113 -302 27 242
7182 242 -1 -172 -118 -84 -144 -88 33 -155 -229 60 -37 -45 116 135 7 70 -67 156 -131 -59 -81 -47 -2 -81 -162
7207 -162 -35 69 -60 -45 27 12 28 67 -189 42 -85 5 327 -64 -33 162 25 -8 95 -77 -2 147 -28
7230 -28 9 -151 60 96 56 -90 -80 20 -2 99 -125 -146 -62 -139 -56 -110 -42 185 -43 43 18 -53 13 479 139
7255 139 268 124 220 -140 -47 -137 64 123 116 103 40 32 270 -40 -104 -170 -75 -111 37 187 111 259 -37 116 -35
7280 -35 -83 -110 -60 -70 -138 -11 -82 -42 -199 -38 406 83 150 -18 69 -1 92 -119 80 -235 45 -54 -10 -138 11
7305 11 91 13 -215 43 6 -111 -84 61 68 18 38 37 -112 -209 28 119 -60 36 299 -225 156 -176 74 -175 68
7330 68 159 85 -96 -95 224 -131 51 -219 -175 -68 17 -101 -105 -50 -189 233 175 -60 134 -69 178 25 131 -61
7354 -61 -171 -212 166 -90 33 61 49 179 73 -106 141 -1 107 -63 -152 168 -3 -243 9 -82 -156 19
7376 19 -57 -58 -133 293 -201 45 -128 -46 -113 318 230 -50 19 46 56 19 -182 128 -123 -27 102 -38 153 11
7400 11 213 -39 78 -72 -223 -32 -24 -32 -150 79 -194 71 144 129 -220 221 -228 117 131 146 -22 -118 -36 -78
7424 -78 43 -113 79 -86 -23 -93 -13 17 90 105 -300 -105 -14 4 -62 125 56 -43 99 -39 109 161 251 -84 69
7449 69 38 -54 -229 31 -47 -2 -176 177 -9 -139 -113 43 125 51 228 160 63 22 -70 185 31 23 -141 13 99
7474 99 130 -409 69 43 131 -18 -69 89 -148 -78 -35 -197 85 -52 -4 260 -47 307 47 93 -188 82 -74
7497 -74 18 -172 -111 -93 123 115 19 -332 18 149 165 126 78 -140 90 78 -108 -93 -131 100 -196 -161 112 41 11
7522 11 201 183 183 -153 224 -99 -105 217 14 87 -87 -12 -132 8 -26 -159 -94 104 200 -184 -48 109 -48 32
7546 32 -385 -75 62 48 112 86 -75 -85 74 6 215 -8 20 74 192 -135 100 71 15 -172 184 -86 146
7569 146 -56 85 40 101 -88 -23 -165 182 170 -7 147 60 144 95 -41 -118 -185 -65 92 -48 103 -47 25
7592 25 -78 -8 48 -355 -152 -60 165 61 -87 -127 33 -130 -32 84 63 -310 46 1 170 102 76 19 -282 47
7616 47 -129 -209 88 -52 -81 -88 -195 -136 -101 284 -137 74 -30 -48 234 122 -164 -144 150 94 126 234 -18 -152
7640 -152 71 138 -86 -45 -190 29 109 3 261 -219 12 98 26 -92 -80 289 -98 -183 169 199 191 -189 14
7663 14 -20 -101 -194 -173 184 247 -19 -100 -76 143 -138 329 -219 -193 -87 -13 129 -132 99 71 -145 7 -72 -35
7687 -35 226 -14 97 -259 -57 -100 176 88 70 341 -189 24 217 -352 -162 -87 13 102 72 57 36 -269 97
7710 97 84 -88 -71 264 -63 -145 -67 30 104 -87 -196 81 -42 -317 153 192 140 -14 -151 2 -107 -120 -79 -108
7734 -108 110 -9 202 -83 7 215 109 5 -43 117 39 276 56 46 -38 -225 55 63 -60 314 -173 -123 45
7757 45 -4 99 -237 -5 27 -51 -121 3 -66 -239 -57 -153 -193 -7 -189 46 -83 -57 20 106 -186 27 74 -15
7781 -15 -164 -22 -273 24 38 -81 35 -283 8 -287 -43 -42 46 -88 -30 194 72 -117 -7 -20 -77 -136 311
7804 311 -40 -103 -219 -251 -124 -146 120 210 -59 -123 190 110 -185 -210 11 -117 44 -181 -54 127 -168 -232 91
7827 91 -8 46 -22 -175 352 -25 -31 -19 -138 -51 -184 -151 -6 167 -35 -86 124 -166 79 40 178 13 29 -188
7851 -188 121 2 -47 169 -325 -151 205 88 66 110 -1 122 -21 -67 48 86 -178 -45 211 -107 -30 -185
7873 -185 -110 -379 -220 20 143 -132 42 -123 131 -1 -244 62 -36 -82 -4 110 80 -41 -142 168 103 27
7895 27 174 116 161 53 148 39 178 -263 -207 -222 -89 170 -78 322 15 52 108 -137 42 -53 -138 -34 -159
7918 -159 349 -69 -192 153 -15 -79 275 80 19 49 17 -54 -19 -45 -271 34 -4 -62 -101 128 -46 -35 -27 -112 295
7943 295 82 207 115 -135 78 -169 -56 48 96 132 146 109 -45 87 136 93 -42 90 253 72 51 109 61
7966 61 -112 169 179 64 -242 175 43 16 -107 27 49 83 20 50 115 150 -10 194 184 -60 -51 34 -171 216
7990 216 126 -33 46 -257 15 -301 -170 164 80 -116 175 106 62 89 67 -180 -45 183 -159 201 68 -140
8012 -140 24 -220 -147 191 120 -34 100 -60 295 186 -181 96 -136 58 -41 145 -88 140 -54 -119 55
8033 55 66 174 -84 -61 109 -60 -181 128 -18 94 113 162 138 -128 138 -100 -307 -208 -117 -175 10 -67 111
8056 111 329 155 -62 20 19 129 -85 -304 -107 -223 60 -102 156 -12 89 -163 -155 138 197 -16 127 -174
8078 -174 -22 48 -197 -74 -36 64 250 63 -48 -127 169 117 -37 21 -62 229 -214 140 -56 -298 23 -107
8100 -107 28 69 115 -118 -103 117 -6 -27 -351 -26 -58 46 473 66 137 -140 -45 108 -154 161 -25 -136
8122 -136 -196 -77 -106 150 -168 21 10 106 -143 -100 59 -49 -231 61 129 30 -237 95 51 113 -24 32 -13 69
8146 69 51 -65 251 18 60 -173 -91 -115 -26 -98 73 3 -262 12 -46 121 -2 -154 -146 243 170 88 43 90 18
8171 18 -56 53 -117 43 319 -31 22 78 143 -203 146 -25 -236 122 311 -53 197 154 -53 62
8191F2
$$ Imaginary data points
##PAGE= N=2
##DATA TABLE= (X++(I..I)), XYDATA
0 0 0 0 0 0 0 0 0 0 0 0 0 0 0 0 0 0 0 0 0 0 6 -8 8 -8 8 -8 8 -14 16 -16 16 -22 24 -25 32 -32 40 -43 48 -54 60 -65
42 -65 73 -80 89 -99 109 -120 131 -145 161 -176 194 -215 238 -264 293 -327 368 -414 472 -543 637
63 637 -759 931 -1192 1628 -2493 4879 -24459 -84945 -29548 39735 53715 16728 -7392 17093
77 17093 66975 65506 13157 -14325 12289 38892 27399 -10838 -28168 -1344 30990 13674
89 13674 -33440 -49498 -18380 8017 -15091 -62044 -64841 -10498 38596 25351 -25713 -41023
101 -41023 2240 39314 20567 -18960 -18783 24093 56582 38950 -2581 -6417 28238 40658 8993
114 8993 -24117 -21903 6382 20760 -4026 -33888 -19797 16425 19675 -17742 -52598 -44610 -857
127 -857 24146 -1155 -31769 -15780 24704 33972 1769 -28300 -14183 24697 34699 4647 -16534
140 -16534 3801 35456 33178 1104 -18077 -2803 19168 10611 -20449 -31725 -4911 25882
152 25882 18873 -16397 -34126 -15963 9517 5539 -23582 -34584 -5458 26705 20134 -10465 -20708
165 -20708 2205 26278 17396 -13253 -19282 9409 30879 17198 -7205 -7131 15939 27218 4529
178 4529 -26525 -25076 4347 19412 2763 -19331 -17109 5940 16241 -3835 -29521 -25535 2823
191 2823 17618 2537 -17582 -10759 16158 26825 6266 -16487 -9000 16071 20523 -1028 -15501
204 -15501 -126 24906 24681 -2167 -21486 -10823 10357 8267 -13935 -23828 -7106 14609 13642
217 13642 -9223 -22987 -9383 10878 8381 -12119 -19395 -1725 20026 18609 -2289 -10679 6089
230 6089 21633 10506 -12643 -16950 3685 21741 13199 -9236 -13502 4835 15869 660 -20934
243 -20934 -21464 -736 12712 2968 -13835 -12966 6249 15957 2512 -15325 -14021 4424 15030
256 15030 5040 -9535 -5012 15218 22574 5315 -14154 -11257 7671 13979 -1102 -16218 -7733
269 -7733 13141 16095 -2580 -17839 -10773 5342 7403 -7901 -17805 -6307 12249 13600 -1869
282 -1869 -11819 -3308 10598 9599 -6266 -14482 -1504 16851 15706 -1050 -9633 1065 13790 8524
296 8524 -10216 -17025 -2613 13067 8226 -8091 -12069 1185 11762 3214 -13798 -16732 -1162
309 -1162 10648 3821 -8587 -7264 6828 14331 4606 -10278 -10809 3661 12606 4288 -8021 -4985
323 -4985 9725 15930 3857 -11597 -10291 4040 9672 -2304 -13299 -6797 8467 11965 -927
336 -927 -12954 -8255 4998 6669 -5868 -12943 -4088 10321 11926 135 -8799 -2375 9597 8539
350 8539 -4505 -11263 -1323 11553 11192 -1031 -8248 -500 9918 5738 -8379 -13783 -2949 8791
364 8791 5984 -5933 -9653 488 9750 3619 -10465 -12400 -630 8816 4579 -5646 -5954 4981
378 4981 12162 5265 -7333 -8204 2319 8998 3591 -6205 -5707 5867 12113 3264 -8774 -8816 1891
393 1891 6886 -712 -10575 -6910 5854 10063 240 -9743 -6364 3988 6080 -2718 -9593 -4168 7746
408 7746 10287 957 -6170 -2068 6811 6682 -2624 -9058 -2851 8191 8925 -1094 -6848 -1173 6856
423 6856 4897 -5836 -11051 -3633 6533 5674 -3825 -7489 15 7645 3969 -6389 -9998 -1349 7293
438 7293 4602 -4095 -4877 3318 9366 4834 -5021 -7291 637 6901 2810 -5428 -5110 4095 9090 3203
454 3203 -6338 -7371 739 5775 -84 -7743 -5199 4262 8123 1398 -6858 -5585 2871 5440 -1444
469 -1444 -7669 -3897 5283 8004 1498 -5040 -2070 4710 5798 -1711 -7466 -3016 5761 7380 409
484 409 -5087 -1634 5388 4821 -3764 -8522 -3130 4777 4971 -2210 -6011 -955 5916 3944 -4532 -7867
500 -7867 -1865 5038 3492 -3091 -4656 1718 8149 4715 -3748 -6213 554 5196 2593 -3520 -3680
515 -3680 2758 7186 3452 -4528 -5834 29 4465 277 -5925 -5459 1976 6339 1612 -4975 -4479 1732
531 1732 4269 -754 -6235 -3979 3528 6539 2099 -3405 -1710 3922 4886 -770 -5414 -3040 3970
546 3970 6024 360 -4105 -1691 3843 4089 -2120 -6616 -3694 2748 3772 -1736 -5118 -971 4890
561 4890 3800 -2721 -6453 -2383 3544 3440 -1675 -3784 1642 6010 4068 -2094 -4971 -247 4321
576 4321 2627 -2683 -3951 1060 5572 3235 -2738 -4588 -15 3388 810 -5000 -4896 932 5182
591 5182 2058 -3356 -4204 725 3600 81 -5096 -3633 2752 5333 1865 -2933 -2210 2773 4853 512
607 512 -4088 -2665 2821 4473 281 -3052 -1674 3084 4175 -1251 -5815 -3571 1885 2946 -1005
622 -1005 -3598 -1425 3207 3432 -1741 -5307 -2374 3047 3429 -853 -3303 -27 4632 4323 -1102 -3867
638 -3867 -250 3292 2065 -1918 -3654 205 4702 3552 -1950 -4218 -914 2072 695 -3526 -4085
653 -4085 136 3927 2102 -2366 -3671 352 3292 943 -3004 -3042 1167 4303 2416 -1775 -1641 2298
669 2298 4081 839 -3893 -3337 1245 3793 937 -2707 -2140 1807 2940 -977 -4607 -3127 1136 2994
685 2994 48 -3176 -1318 2728 3490 -33 -3434 -1802 2224 3068 -357 -2717 -483 3396 3760 -234
701 -234 -3220 -1485 1743 1977 -1485 -3371 -412 3003 2515 -1327 -3328 -1018 1869 1393 -1987 -3493
717 -3493 -251 3288 2589 -908 -2327 583 2866 1626 -2174 -3164 495 3364 2065 -1266 -1956 843
733 843 2739 684 -2956 -3355 456 2715 911 -2230 -2249 1230 2980 48 -3135 -2756 453 2578
749 2578 291 -2329 -1261 2375 3362 767 -2589 -1930 1386 2339 53 -2251 -895 2521 3107 -8
765 -8 -2973 -1769 1287 1566 -1193 -3172 -1006 2076 2374 -633 -2481 -1029 1445 1502 -1428 -3126 -306
782 -306 2742 2569 -333 -2061 296 2505 1309 -1785 -2790 -126 2421 1518 -1245 -1893 260 2001
798 2001 828 -2250 -3163 -570 1863 1131 -1577 -2001 753 2478 912 -2249 -2294 430 2412 568
814 568 -1388 -925 1695 2731 852 -1707 -1801 750 2027 254 -2041 -1073 1526 2410 6 -2319 -1581
831 -1581 770 1306 -899 -2783 -1389 1546 2180 124 -1874 -1029 1617 1514 -711 -1917 -491 2115
847 2115 2188 -148 -1481 -300 1730 1471 -1020 -2298 -620 1747 1380 -784 -1774 -305 1723 1126 -1711
864 -1711 -2657 -592 1633 861 -1067 -1476 230 2151 881 -1471 -1900 -52 1926 925 -1155 -1375
880 -1375 1229 2336 850 -1099 -1755 361 1447 471 -1804 -1206 1249 2153 411 -1577 -1663 653 1111
897 1111 -466 -1890 -1166 1119 1668 323 -1383 -1093 919 1505 -317 -1994 -849 1325 2080 141
913 141 -1148 -551 1438 1469 -920 -1990 -920 1315 1258 -577 -1465 -47 1480 1070 -1205 -2314 -709
930 -709 892 1287 -600 -1358 218 1796 1001 -1129 -1696 -313 1188 964 -793 -1242 716 2067 1175
947 1175 -1058 -1471 -1 1464 484 -1094 -1160 457 1950 579 -1145 -1487 426 1124 192 -1526 -1378
964 -1378 712 1587 202 -1063 -765 595 1134 -161 -1594 -917 877 1742 141 -1065 -443 1005 1171
981 1171 -169 -1317 -930 985 1160 -348 -1291 -113 1273 1043 -648 -1694 -699 724 1288 -602 -1094
998 -1094 -165 1489 1019 -639 -1289 -291 718 663 -609 -1169 423 1424 987 -689 -1332 -8 1199
1015 1199 720 -1010 -1015 194 1255 702 -1129 -1262 58 1028 67 -1189 -1086 468 1212 493 -856 -723
1033 -723 346 1236 -4 -1229 -957 441 1465 787 -1071 -546 738 1457 -61 -1330 -819 512 1175
1050 1175 230 -1148 -641 1070 1285 -121 -1358 -764 244 801 -153 -1151 -399 1218 950 -462 -1124
1067 -1124 -557 797 854 -378 -991 -138 963 1089 -206 -690 -333 873 458 -565 -977 -162 1147 913
1085 913 -404 -1156 -168 859 337 -764 -1026 2 1033 589 -435 -894 261 601 735 -720 -750 152
1103 152 787 407 -520 -597 501 814 309 -1089 -777 266 792 390 -646 -450 339 891 -82 -1062 -763
1122 -763 161 694 -48 -1003 -635 915 937 -123 -467 -551 579 619 -197 -787 -227 702 707 -93 -762 -258 467
1143 467 446 -362 -665 -209 882 834 -155 -964 -93 666 555 -748 -1067 59 779 692 -597 -428 -203 792
1163 792 273 -730 -982 96 736 502 -481 -727 -56 691 665 -1186 -971 -32 829 262 -621 -369 441
1182 441 840 349 -757 -685 296 816 -44 -802 -395 550 792 393 -641 -620 407 563 -45 -779 -378 552
1202 552 702 -8 -680 -343 -24 492 -316 -819 -168 407 950 10 -526 -157 530 412 -25 -611 -148 673
1222 673 675 135 -451 -31 535 434 -530 -1120 -346 533 593 -401 -574 -96 677 259 -532 -703 -296 657 133
1243 133 -244 -538 134 812 414 -470 -988 -20 658 71 -156 -454 401 912 13 -694 -728 165 261 42 -730
1264 -730 -687 392 842 199 -541 -523 126 416 45 -514 -354 110 830 149 -254 -50 277 572 -231 -728
1284 -728 -68 588 488 -234 -468 -128 473 557 -140 -776 -466 252 347 -167 -623 -164 540 561 -440 -675 -205
1305 -205 323 424 -389 -261 -32 662 245 -433 -797 -152 452 24 -339 -568 49 745 445 -143 -405 83
1325 83 471 -13 -526 -352 120 492 392 -597 -410 334 489 24 -395 -444 499 657 261 -230 -306 243 633
1346 633 94 -547 -345 180 481 169 -504 -384 588 586 -468 -326 -382 291 447 -162 -432 -223 564 468 -208
1367 -208 -635 -354 398 450 -142 -564 -78 398 518 -144 -473 -22 643 472 -450 -614 -14 414 311 -174
1387 -174 -519 -126 162 7 -405 -541 -30 637 479 -224 -468 -61 355 40 -556 -374 238 376 244 -317
1407 -317 -362 386 495 -44 -661 -489 276 658 -19 -327 -142 419 346 -179 -661 -375 219 259 10 -641 36
1428 36 308 691 -42 -657 -399 6 324 -174 -255 -138 424 448 -61 -268 166 422 379 -267 -310 -97 357 356
1450 356 -357 -392 -115 180 229 -424 -449 59 321 243 -198 -308 16 568 158 -325 -330 1 483 306 -169 -304
1472 -304 37 522 406 -213 -466 64 66 233 -428 -286 338 341 -70 -494 -675 210 352 -203 -493 -178 172
1493 172 336 190 -178 -119 194 538 96 -370 -228 348 243 57 -415 -5 277 253 27 -360 -110 265 456
1514 456 -115 -596 -293 1 9 -307 -485 -4 328 302 -86 -332 -71 610 114 -187 -221 -121 230 187 -198 -323
1536 -323 -79 88 349 -251 -653 -50 402 208 -396 -308 -7 301 247 -422 -140 -26 207 243 -144 -288 -13
1557 -13 503 155 -400 -69 324 266 259 -397 -229 506 179 -351 -675 -409 84 307 1 -550 -417 303 268 43
1579 43 -387 -238 353 123 -98 -539 -98 191 260 -128 -201 320 572 154 -92 -108 62 177 153 -25 -203 -28
1601 -28 456 -37 -13 -219 -22 92 35 -234 -161 -16 256 134 -196 -396 -226 190 -28 -221 -278 179 412 410
1623 410 -303 -368 -32 -69 431 -503 -253 212 254 9 -243 -92 16 372 -82 -283 -235 -59 262 225 -459 -213
1645 -213 15 225 89 -546 -35 304 372 -120 -394 138 279 270 123 -116 -51 127 109 -52 -111 32 171 264
1667 264 162 -313 -260 83 87 30 -208 -49 411 153 -226 -276 -78 280 -12 -108 -17 207 320 288 -41 -218 -56
1690 -56 465 217 -194 -425 68 411 -133 -366 -130 -110 101 8 -161 -264 96 367 165 -353 -204 55 349
1711 349 -35 -391 -181 220 591 -37 248 -225 338 174 -152 -170 -168 180 422 133 -407 -204 490 442 -255
1732 -255 -312 -81 142 222 80 -170 100 48 508 -77 -108 -114 313 103 -73 -417 89 456 190 125 -110 -205 177
1755 177 -112 -190 -359 -101 184 42 -97 -275 71 247 -74 -325 -331 68 468 45 -35 -250 159 230 -140 -282
1777 -282 -44 61 424 92 -83 -117 583 59 -101 -427 -212 -48 165 -24 -269 -248 102 90 132 -109 -301
1798 -301 9 84 110 -138 104 476 24 -15 -167 20 47 202 -61 -338 -81 -70 129 -60 -12 -422 123 156
1820 156 -126 -339 85 68 193 -281 -111 30 271 207 -236 -1 -64 190 318 -236 44 193 54 -33 -379
1841 -379 108 6 223 194 -60 -13 43 142 -104 -285 -329 -189 151 42 -75 -79 207 23 151 -95 -128 362 162
1864 162 59 -454 -42 138 -15 53 14 -142 291 94 38 -151 -270 41 -170 14 -86 71 74 418 177 -262
1886 -262 -84 188 100 -99 -113 45 142 250 163 -447 -157 224 29 -226 -179 320 248 -17 -196 -215 20 144
1908 144 -53 -183 -275 87 93 -240 -420 -64 11 28 356 57 30 -140 130 -126 -19 -53 -150 2 87 20 -37 -147
1932 -147 -65 353 -304 -185 -166 232 -198 -427 97 -42 99 32 -301 181 66 75 11 -415 49 78 5 191 -191
1955 -191 63 96 212 -155 -334 9 -93 -56 11 -183 -45 25 155 -35 -94 -198 -158 2 34 -74 135 296
1977 296 -193 -154 -234 174 28 -25 -469 -10 323 274 -84 -66 -111 175 254 79 -272 -499 -3 254 100 -107
1999 -107 -163 -32 61 260 -265 -116 4 359 -101 -13 -10 -8 136 130 -137 140 49 105 -99 -270 -266 37 31 -33 -104 153
2025 153 28 266 151 -317 137 105 117 10 -307 -413 260 63 -138 -181 169 184 163 -147 -134 -117 -112 -122 118
2048 118 179 -174 117 -73 -138 -178 -182 -89 -142 -67 -323 184 117 13 42 -74 -302 -100 207 -79 -282 29 245
2071 245 259 -241 -109 130 72 -210 -265 -110 -11 -31 6 -22 -132 -34 322 -225 -49 -111 69 28 170 -228 -275 166
2095 166 19 14 16 -26 105 276 72 -101 -66 202 87 -182 -129 -45 -53 -16 59 102 -5 -88 119 51 -31 79 167 225
2121 225 -64 461 253 428 -58 90 -260 -267 136 44 43 -146 -151 90 208 -68 94 45 318 -115 -213 -189 82
2144 82 283 -55 235 129 42 -34 106 21 -2 139 23 31 -32 23 -13 85 191 -211 121 -262 204 -126 30 -102
2168 -102 71 68 1 -125 -29 117 16 0 61 83 78 93 48 21 -16 55 224 15 -47 112 171 50 -94 -90 -157 4
2194 4 -334 -83 -281 -103 63 91 -8 -28 137 124 111 249 -85 37 303 133 -201 -11 -74 210 312 26 -152
2217 -152 3 92 -117 -63 -166 71 280 67 -167 -109 110 74 35 -124 -44 104 -129 -64 -216 2 284 105
2239 105 -242 -163 -54 80 264 52 9 80 165 108 46 -172 -100 152 -25 118 -324 12 -45 13 26 191 41
2262 41 1 372 -146 -200 -89 383 -210 -151 -17 -56 -82 -285 2 -175 7 128 92 -94 -104 -55 34 230 7
2285 7 -208 -1 114 260 -212 -58 34 210 68 -69 -99 -36 220 -163 -115 -134 -175 14 -225 36 -4 -55 305
2308 305 197 36 -82 209 -11 140 54 -61 50 -113 -72 12 -72 8 169 -3 52 175 -7 122 325 -97
2330 -97 -40 57 243 -14 -8 160 72 146 -46 200 -269 -204 147 -272 147 -110 38 -178 5 -11 -250 10 83
2353 83 177 -104 99 19 198 -24 2 131 101 -132 -86 -45 171 -4 118 -49 109 66 138 -282 190 -263 -324
2376 -324 139 -154 107 -147 -57 26 104 -121 -131 -88 40 -30 203 14 -28 190 202 23 -216 -148 296 49 -116
2399 -116 140 53 19 58 169 -33 80 385 -50 -11 -80 83 215 25 -90 206 19 -68 -32 -226 -21 230
2421 230 105 -57 -37 -57 12 -221 104 30 58 54 168 -24 91 -86 -85 -100 46 -55 -212 103 -54 -42 73 -132
2445 -132 52 -112 -72 -29 245 81 87 -146 76 -7 168 -253 -80 -65 217 -146 -102 195 -214 149 -86 159
2467 159 -102 125 102 -39 -96 -19 26 52 84 13 63 -18 -273 -59 19 -78 117 14 -6 -68 -193 -92 202 -182
2491 -182 142 -107 -179 -130 133 -59 -334 55 198 97 0 -104 285 138 231 132 144 -79 424 22 -192 22
2513 22 -197 -5 15 27 -130 81 68 13 12 -172 -42 71 180 60 -123 -299 -23 53 -76 53 305 -20 -63
2536 -63 88 42 99 52 154 -136 88 -284 116 92 1 249 -143 66 -51 231 288 27 -293 4 60 178 -84
2559 -84 117 130 -144 -316 -105 23 128 50 119 -38 -136 43 52 -70 120 245 174 -226 293 146 28 41 -238
2582 -238 -131 -130 2 75 5 3 24 61 171 107 -39 -237 352 -172 -12 105 39 -30 -197 108 106 174 72 -34 -42
2607 -42 -75 84 26 215 -300 137 103 -6 131 -46 148 180 3 32 -103 -157 -36 -4 -158 238 82 -131 157
2630 157 -307 -148 13 208 -26 -21 -66 212 -149 248 83 144 122 107 129 162 176 266 -175 -96 63 -219 95 -73
2654 -73 -100 13 -131 -132 -23 -138 -132 16 -168 -307 -177 16 158 26 -70 -209 -43 72 16 41 32 -118 110 376
2678 376 86 -51 -2 131 4 6 -159 -46 -28 8 95 -251 108 303 -39 122 -104 47 226 128 -28 -5 -179
2701 -179 -57 16 136 104 -53 395 -24 -272 -122 -86 312 82 -108 31 -198 10 -46 -90 196 -54 112 99
2723 99 75 -23 -111 319 -56 -21 -7 33 167 109 -145 46 -39 171 -46 182 -38 174 -169 -22 -240 -214 -161 -63
2747 -63 144 -99 -108 13 122 -65 -67 -60 54 138 0 -99 -138 88 146 -30 -124 -251 150 -102 -56 180 -269 -84
2771 -84 116 26 127 -30 224 -31 16 23 -33 -32 -16 23 -137 34 114 -72 80 -160 -244 122 118 -145 67 276 105
2796 105 127 11 40 6 152 5 -99 2 -190 -239 170 -210 -136 1 -19 -43 -282 55 174 -43 -318 -150
2818 -150 -139 23 129 -101 269 -391 -173 177 -39 70 -86 -239 107 0 27 -189 76 247 136 -46 -97
2839 -97 -211 -136 213 -91 -164 136 -24 230 -110 -66 376 -50 192 89 34 237 -170 -281 -108 -242 105 119
2861 119 -203 -52 -23 -38 31 101 13 97 227 -193 67 -32 -166 -80 106 -153 -17 69 60 34 -45 108 26 -177 -131
2886 -131 88 -176 53 16 41 -263 -66 133 5 72 17 -127 -25 -102 -121 60 -50 71 -87 71 94 -186
2908 -186 -205 97 158 219 -60 -183 -268 1 -65 23 1 -360 113 206 -28 199 122 -45 -54 91 -136 -230 146 29
2932 29 -177 182 304 -291 106 -186 -122 96 -104 19 -123 56 272 -213 22 109 130 249 -126 -116 -22 152
2954 152 114 50 -98 -217 379 -29 11 -66 81 341 -149 -143 -89 -1 53 -22 -6 138 -65 -134 -5 -12 -85 -35 -52 -28
2980 -28 130 137 221 26 -11 -36 -20 -48 210 105 34 -175 -48 241 15 4 30 -93 73 -50 138 -170 -130 128
3004 128 42 200 -131 -30 285 -85 -39 40 -27 184 9 -43 -407 108 339 -86 0 199 -78 -142 78 -386
3026 -386 -160 -10 -21 24 -36 117 -287 95 262 -235 77 57 36 -121 66 -10 6 7 -25 -231 -157 -149 260 -53
3050 -53 57 92 349 328 43 -248 43 64 187 -259 115 216 -142 -92 -128 -98 -86 -46 -125 45 -66 -149 38 25
3074 25 -35 97 -94 246 92 173 -22 171 42 -136 109 43 164 -129 -71 -111 -343 -40 112 -113 -167 116
3096 116 58 33 7 208 -5 99 85 -161 -4 129 40 2 -165 -138 -14 -83 73 158 -302 -80 -57 -20 -112 93
3120 93 -64 89 146 -89 -86 142 110 -93 44 -98 48 46 -127 16 43 -17 28 28 60 34 -156 5 -207 12 -226
3145 -226 -188 94 -251 -180 -114 -337 29 136 158 3 101 63 82 147 -65 9 -1 92 26 -95 35 -115 97 108
3169 108 307 311 35 -21 46 5 -95 4 203 -70 116 253 -26 166 -162 -157 -26 120 -40 -38 -83 61 199 24
3193 24 18 -8 -200 -125 -85 79 -43 -39 -312 141 74 -127 154 108 -157 -27 -73 24 96 37 -27 -67 56 126 -164 -79
3219 -79 173 50 -182 94 273 -233 -384 98 -159 -131 70 29 129 -181 -45 146 145 -40 -273 133 242 106
3241 106 150 -17 -91 307 266 185 -23 -107 258 80 178 -185 248 114 -138 -78 -209 112 -127 -104 34 -68 -27
3264 -27 279 -107 18 9 -135 193 -10 61 18 77 -68 26 40 -35 146 -98 -24 26 -67 25 99 156 -4 25 339
3289 339 -81 -171 -94 -210 -25 -47 -143 -93 -54 -208 7 -23 -86 99 57 -128 -112 -120 112 128 -11 -161 -85 116 -4
3314 -4 27 42 -227 67 -66 -70 118 -98 -31 36 282 -125 -2 31 84 -185 -154 212 235 -153 24 38 -73 28
3338 28 146 70 107 -110 -100 164 -193 222 -120 24 -75 -124 -35 0 94 104 84 65 60 37 383 34 14 -163 143
3363 143 102 123 111 34 -31 124 -99 -87 -21 -177 142 31 36 2 185 -193 116 44 -93 211 98 0 70 68 76 35
3389 35 -31 -5 -43 35 -94 -1 81 -8 -157 -38 -175 -34 -193 90 121 -211 12 -220 34 134 -133 -119 -316
3412 -316 -13 68 219 -364 95 67 138 -28 -52 -58 264 -58 -21 12 246 99 -122 -87 60 27 -24 -37 116 76
3436 76 60 -3 -111 224 -79 -239 -258 0 -142 17 27 -7 -161 45 -221 -44 -110 126 -101 18 -149 -70 214
3459 214 97 21 398 -72 -51 -163 -93 40 -13 14 -236 44 -6 217 -15 56 -285 -181 -209 147 -5 -98 -65
3482 -65 -95 -38 -11 96 64 28 178 131 -9 -65 131 -142 138 79 -98 -97 -30 -42 -49 34 -85 41 81 -140 -102 -168
3508 -168 -110 -152 7 11 285 -84 138 -30 51 287 -86 -168 306 55 -41 -42 -27 -58 -3 10 -19 -162 189 -57 35
3533 35 -232 -188 -140 259 35 132 -32 62 75 -153 -58 -152 -17 -24 -109 -115 121 -53 -199 92 78 96 111 -381 63
3558 63 70 103 8 67 225 25 181 342 -18 194 6 31 19 -48 -128 50 42 234 -65 -87 27 134 152 -261 -103
3583 -103 -96 -23 -8 -116 -29 -33 356 170 99 71 -75 -152 55 -53 -65 -50 138 78 47 6 -3 168 -317 -65 2 -100
3609 -100 -58 141 64 32 43 1 -194 -92 154 22 -2 -32 49 15 -8 20 296 -110 119 20 -81 -151 -103 -94 42
3634 42 48 52 -176 -49 -16 99 -89 117 88 -71 -286 107 284 -39 -160 -156 156 -168 -64 -32 90 -7 -229 -16
3658 -16 77 140 -75 -76 39 136 174 -57 -106 -64 -314 79 -45 174 42 -38 -78 -80 103 235 -16 194 182 -5 124
3683 124 156 -56 -129 -49 -52 407 167 -206 158 50 154 187 -25 -134 -3 23 176 -55 -157 9 39 -139 -147
3706 -147 -11 -20 200 56 179 -194 -15 359 -70 97 18 198 -34 -71 78 -319 -135 39 127 -120 -63 79
3728 79 -127 8 -158 -94 -20 146 -235 590 188 65 -156 119 5 97 95 24 15 81 -105 46 20 -122 -76 -298
3752 -298 207 -97 96 -395 -85 89 -84 30 -72 -26 140 19 75 116 128 -40 391 4 -145 -120 39 -29
3774 -29 -94 47 158 53 174 -64 -170 -211 218 159 -325 -114 87 -5 95 -71 -81 -48 -147 -60 90 -26 23
3797 23 -249 -185 55 -83 -29 61 -2 84 -1 -8 271 213 67 -54 47 50 -240 65 -42 -207 274 31 146 81
3821 81 -128 82 -137 145 -189 55 -184 -82 145 36 98 17 -111 -96 171 -2 -19 -69 20 -105 84 40 203
3844 203 -125 -12 -95 23 17 143 22 -173 92 11 89 79 -250 -178 216 -36 41 122 198 -165 79 111 18 283
3868 283 337 77 -121 -266 -40 -128 207 57 74 -39 8 -20 124 71 117 203 -164 145 114 184 5 -135 -41 98
3892 98 -73 6 30 110 -175 33 -53 119 -155 -222 3 -196 -22 -3 130 -17 32 -107 0 -18 5 112 -26
3915 -26 -134 76 174 121 83 13 32 -99 47 -8 -171 204 108 -319 131 50 -18 -109 -110 210 -37 88 30 -68 14
3940 14 47 -64 5 -130 28 53 -28 168 85 68 39 131 93 -28 47 -15 -38 382 30 -106 -47 -118 60 28 38 132
3966 132 109 188 113 -143 -141 353 220 -199 -22 -90 177 -28 -205 137 309 34 -58 73 4 -123 40 100 -152
3989 -152 95 -31 3 -5 122 86 -43 169 -47 272 -108 -191 -432 -11 -85 -175 -47 32 -165 69 -109 9 50
4012 50 82 -34 -25 -351 104 101 121 94 182 55 37 141 90 104 94 -186 351 -117 -146 -103 272 -32 6 131 -68
4037 -68 66 -2 400 -265 8 25 67 280 4 -67 131 -127 -298 156 15 -221 -125 -80 44 -178 -134 -6 114
4060 114 -17 105 -61 109 -204 29 92 -143 11 -71 -108 347 44 -104 1 -210 -372 -103 -79 102 -38
4081 -38 159 102 -12 -63 165 118 -215 32 30 -169 -109 37 -24 411 -134 -141 -10 130 -51 88 55 0 15 21 -3
4106 -3 45 387 61 36 148 -129 112 1 60 -28 207 -62 -45 -197 2 -113 -63 174 4 -16 -113 -93 79 78
4130 78 130 -142 -143 55 -65 -217 198 95 -80 133 -280 -163 76 -53 -30 -142 -37 134 221 -127 -99 160
4152 160 83 27 -75 -98 -34 139 96 75 -123 -121 -140 -116 -259 209 16 -12 -23 -35 285 -116 -76 -26 -91 -326 35
4177 35 -274 126 -16 128 -32 74 -173 184 -128 157 -224 -7 -11 -177 75 30 187 10 -278 -81 -22 47
4199 47 -278 -70 58 -8 -27 47 -4 34 65 -7 35 -46 -136 24 23 -157 16 -32 -39 -209 60 -105 12 166 -56
4224 -56 -132 182 -39 -149 37 -129 -276 -64 -106 24 -58 187 46 -15 268 -129 233 -29 -270 -111 210 56
4246 56 2 -85 94 65 -46 59 67 -121 90 236 -71 256 43 275 -139 8 180 256 110 194 -52 61 -36
4269 -36 25 205 175 -113 202 -238 -421 -112 72 132 80 -138 -17 -96 132 -86 -140 239 161 77 130 98 -17 -67
4293 -67 73 -78 156 271 86 143 210 -74 -46 106 -334 -166 130 -151 -197 -191 67 -225 50 14 -77 -51 104
4316 104 -298 -38 19 -16 32 36 -58 2 29 -96 108 88 -88 -45 -180 -129 123 -235 -11 28 69 10 160 98 -116
4341 -116 124 -54 9 -81 -24 -98 65 145 -40 -87 -7 -28 -44 74 -334 176 -35 35 6 181 12 38 -187 311
4365 311 -157 135 128 -24 -153 -58 228 5 82 -195 142 131 -64 90 31 -71 -269 -105 169 182 -1 -168
4387 -168 116 -126 5 176 -66 93 -237 7 105 76 -76 -36 -38 63 -41 -82 -49 27 -160 -179 -90 100 148 -151
4411 -151 25 229 81 180 96 129 194 -158 106 -69 -35 102 -127 -318 158 82 98 217 39 170 -128 -148 -79
4434 -79 68 -13 173 27 71 93 98 -120 -73 128 13 89 272 31 93 -234 -174 -125 -218 13 103 84 -165 -205 44
4459 44 70 -80 173 2 -154 -97 123 79 -126 208 104 -105 -58 -129 -8 -92 -105 221 -30 -311 296 58 60
4482 60 225 174 -103 -24 95 -128 -27 -48 0 -28 -24 -117 15 -74 -93 -37 106 -40 -62 -273 -10 167 -65 38
4506 38 17 228 -50 28 62 -199 272 -183 -59 -85 -155 -133 -50 -110 57 -80 65 29 288 55 62 39 12 28 -242
4531 -242 -50 51 172 -20 24 -136 -7 278 176 -147 -32 54 -228 105 120 7 33 -26 169 -243 -86 -124
4553 -124 30 173 17 323 244 -119 57 127 67 124 92 244 -180 -41 250 93 108 -232 83 8 396 -170
4575 -170 116 -31 -71 -68 -5 145 17 -45 199 10 -48 50 51 310 28 54 119 52 143 105 52 11 -7 -102 112 189
4601 189 164 91 -85 44 -20 71 68 117 14 -19 28 79 17 19 3 310 37 -70 62 -105 231 -228 -75 -218 -151
4626 -151 -30 -59 -130 -196 -177 -11 -215 93 199 -180 48 28 -112 -5 -10 190 -269 -69 320 128 260 22
4648 22 235 12 210 61 29 72 118 347 -2 108 -116 59 -29 58 94 98 -97 -14 -182 -396 -33 -36 -96 185
4672 185 268 -2 212 123 153 116 -27 44 173 341 166 87 33 22 -126 89 32 -25 63 -82 -114 37 -41 -93 -299
4697 -299 -161 82 -76 -19 -161 147 -260 -99 -55 99 -255 127 -4 55 83 145 68 67 122 -167 81 -6 -76 -160
4721 -160 63 -14 -103 -49 -187 -118 115 254 146 -80 -191 -126 -4 -236 -19 -97 110 -64 -8 -3 8 176 -78
4744 -78 -11 97 81 65 -34 324 -148 -55 58 -212 -34 142 -71 -184 59 30 -269 -18 152 -81 -80 149 -51
4767 -51 123 179 108 60 58 221 29 -164 70 49 82 132 -141 -72 66 -199 -172 -11 -8 -106 -89 93 -218 28 298
4792 298 33 5 110 201 92 -210 127 47 -74 -133 60 -41 -88 -113 -27 -86 -237 32 175 -62 -199 -105 60
4815 60 31 52 -26 106 184 3 -231 -97 199 14 247 -251 -76 -174 -130 -73 -103 70 113 36 -118 34 138 137
4839 137 -71 184 -31 -128 -116 -169 -91 -275 -27 16 5 334 -145 121 -108 269 263 119 122 -24 186 190 114 50 130
4864 130 -111 -90 -48 84 -62 77 -87 -90 202 -82 -12 24 -69 -167 22 -141 -72 -96 25 -107 -19 143 -64 129
4888 129 -337 282 84 -11 -84 170 207 -186 61 -35 60 -148 -129 277 99 -186 -94 63 -115 52 -149 -35
4910 -35 434 -43 -44 -141 128 -138 -226 216 -27 -168 159 220 289 78 244 -270 -46 16 45 83 27 -11 -283 -25
4934 -25 61 -64 253 -231 -220 -68 65 156 130 -131 10 28 4 249 -70 46 -107 15 -115 -34 -286 -159 109
4957 109 81 -212 -46 -8 -135 33 -68 -10 -12 -141 180 89 -103 -8 -116 -176 -74 5 -81 -343 -67 116 39 3
4981 3 -119 -56 -19 -9 72 -96 -6 83 139 79 340 93 28 36 104 174 56 -4 -48 -267 -75 -79 231 159 -22 -141 -42
5008 -42 46 112 76 -40 -54 66 -95 -182 68 6 -141 138 -35 217 -5 57 134 -77 0 -169 -16 -14 44 -123
5032 -123 -126 -17 -98 90 161 55 48 97 137 50 -2 0 35 -115 -352 -9 -89 227 -101 -212 52 -118 115 -169 4
5057 4 10 46 -134 -3 -126 22 -81 17 -14 107 118 -3 84 133 34 61 -205 -107 21 161 376 -522 28 103 14
5082 14 -88 39 -163 -385 153 23 -71 51 99 -36 87 105 83 -39 102 59 -89 45 96 -7 128 190 -188
5105 -188 43 101 -32 105 14 119 -217 -120 101 108 -332 -99 -65 73 -57 -50 -41 10 368 52 88 -116 -228 -116
5129 -116 -17 54 -91 32 -400 160 -88 300 -151 44 -8 204 220 175 -119 122 225 -120 -203 161 -39 -124
5151 -124 118 -66 105 -195 -122 51 -116 -188 288 192 27 -126 198 67 -157 -52 -120 -100 -72 134 70 122 159
5174 159 80 -58 -86 -114 -132 110 22 -244 57 -150 201 -52 -27 153 179 -12 165 53 76 187 -112 -26 -52
5197 -52 2 93 8 -323 82 25 49 -382 17 -2 32 13 -57 225 7 -28 160 -85 115 -256 82 -13 111 178
5221 178 150 29 -147 -140 38 31 -6 207 -157 90 309 46 -159 116 18 50 78 -131 -34 342 -24 -39 -43 28 -132
5246 -132 -130 -154 49 -45 52 -42 7 -318 -54 -196 -167 -136 -232 -223 -252 38 -145 -113 4 114 -97 -219 -159 -6 -120
5271 -120 64 231 189 93 284 175 -113 -242 3 -120 324 -30 -30 250 -158 -58 339 68 170 -65 57
5292 57 -99 -82 42 175 129 -6 76 10 224 -23 204 102 10 -12 39 18 112 -168 24 96 72 50 -80 95
5316 95 35 66 146 -97 17 -234 -116 -40 -106 284 80 -42 242 -73 -97 157 73 210 -56 109 -19 74 -262
5339 -262 110 -18 95 113 -66 211 -99 270 -201 5 33 101 117 -133 -14 -21 -22 55 210 116 -88 7 -14 -37
5363 -37 -47 -197 333 -140 36 134 -171 6 -18 254 -260 82 165 -15 199 -128 -171 96 -164 22 -84 113
5385 113 -68 183 -87 -112 41 169 113 217 -45 142 -127 94 -18 -7 151 52 -35 183 175 93 -26 44 -134
5408 -134 -4 80 184 189 -14 -33 -187 -157 75 -282 122 137 67 -190 -92 -125 81 197 86 35 -8 47 161 124
5432 124 15 -204 -281 -76 6 174 -125 40 213 10 165 66 -113 -40 -17 83 136 -61 44 135 -17 -204
5454 -204 -35 -111 -201 -211 90 24 -394 89 -134 8 -4 -145 93 8 59 -207 -187 109 13 44 -124 92 -11
5477 -11 124 123 260 -37 -1 74 -14 -31 -258 66 19 -16 174 176 130 -211 205 219 -329 22 -71 -177 7 -42 310
5502 310 -118 15 -26 -2 168 153 95 176 -133 125 28 301 -32 -7 166 -11 -15 -13 -19 -76 170 170 -5 -8 59 -344
5528 -344 28 -15 95 61 142 4 -3 57 155 8 -47 -66 -108 74 1 -160 221 100 -331 -238 -137 168 117 -228
5552 -228 -53 -6 41 51 -78 -34 -55 84 78 -38 -321 122 234 -109 85 -261 -62 131 63 142 21 -78 -32 -222
5576 -222 -100 -1 -61 168 35 38 149 150 124 71 -17 131 -60 103 263 109 -150 -11 -354 -87 255 77 -5
5599 -5 -88 -42 105 118 -187 39 -48 109 -6 -126 -27 -99 125 158 -66 -86 -144 -99 160 -112 -131 -99 18 72 141
5624 141 -76 -39 171 -68 -90 -90 -88 98 26 -13 -1 129 501 -11 -68 50 276 -78 -101 35 7 -23 16 149 -263
5649 -263 106 22 -143 -210 -86 57 -8 -95 -44 -43 221 -26 37 69 -33 473 46 -55 -241 -167 219 39 69 218
5673 218 62 -162 -140 -4 33 -138 -266 -46 10 132 -5 280 6 179 0 -183 148 139 -174 -332 -40 -81
5695 -81 99 -259 -63 286 33 110 65 148 39 121 -95 -182 140 -116 -67 -24 95 -15 21 88 190 -116 89
5718 89 186 212 -280 225 -36 -47 78 -41 75 -94 132 -45 -16 280 244 126 -77 152 331 20 -79 -95 -156
5741 -156 -143 -249 -26 -83 134 -65 44 -269 129 127 -125 277 23 97 -5 28 85 -28 99 -30 112 68 17
5764 17 -65 -133 71 122 213 126 95 -116 13 173 -86 -11 -106 63 123 139 -115 -56 141 -344 -198 -181 114 -53
5788 -53 50 105 132 87 -85 -41 -144 -90 -110 118 -133 239 -58 -6 -130 -90 -117 175 168 43 107 -39 76 217
5812 217 -110 -139 109 -249 1 105 159 -74 96 77 -60 -138 -59 64 -122 -65 8 55 139 13 -105 -335 72
5835 72 175 272 76 -106 -124 41 169 -204 -51 -70 170 -8 -221 81 -35 -119 46 -1 -1 -33 275 159 28
5858 28 -85 -234 -29 -218 -73 -166 -69 65 65 65 -60 -121 2 20 220 -60 72 -55 -81 -155 -187 -42 119 3
5882 3 -217 -89 180 -168 95 93 -235 -178 -104 -36 52 93 -104 152 18 28 230 102 -8 -102 -44 216 -74 -127
5906 -127 -159 -54 102 53 -89 99 56 -374 70 143 -109 -138 -49 -141 -114 -115 139 -11 -184 88 2 -7 -50 169 35
5931 35 96 257 47 93 -22 -15 -77 -33 266 -292 -18 195 18 -16 177 201 -226 134 -118 -138 -154 129 -150 111
5955 111 209 93 4 167 185 47 -289 139 295 1 120 -8 67 -89 87 236 -178 39 -171 129 -84
5976 -84 183 159 60 -201 72 284 104 49 -54 -95 -26 -153 -103 44 -15 83 107 21 -27 -84 42 83 -250 -28 118
6001 118 1 -164 119 52 -76 160 129 138 -49 -4 135 -60 114 -16 -26 25 79 176 -194 -44 51 -59 162
6024 162 129 122 187 85 -59 77 25 -314 56 -279 70 -199 -156 -41 -239 123 -247 52 47 -86 138 -2 93
6047 93 146 -74 165 95 182 -104 -18 166 -118 132 -12 150 -44 -152 11 187 31 -228 -156 -43 63 47
6069 47 262 -305 -160 77 -114 -49 -69 148 -29 -244 -73 12 9 40 207 219 41 53 24 27 -174 391 -20 1
6093 1 40 -235 170 -273 -39 231 -19 -330 -160 89 -38 -159 223 -164 -187 -22 134 -129 -40 -163 -186 47
6115 47 16 25 269 -57 68 -232 -131 17 71 -255 -326 77 39 -212 17 -113 36 125 -71 12 -46 -184 -263 37
6139 37 42 -90 83 -129 202 264 -61 39 -79 96 23 -50 -3 62 16 -206 -101 -146 240 -168 33 19 -63 -134
6163 -134 -88 137 -82 43 -251 160 12 -125 87 224 36 162 35 278 -251 -363 111 -71 156 219 -206
6184 -206 -75 189 -67 -66 -309 -19 -188 -105 -123 -48 -7 63 64 70 -65 -203 52 239 58 -38 -67 11 -424 -28 33
6209 33 50 -21 -48 -149 110 5 128 -97 -106 -136 7 138 104 2 154 133 70 120 -22 -78 -23 -46 80 144 198
6234 198 -290 -217 21 67 168 195 -100 -126 82 -108 231 84 -120 -189 -27 305 48 105 92 -254 128 78 212
6257 212 144 -147 -3 29 -53 14 80 -233 128 105 -16 47 137 30 -124 97 -51 -51 68 147 129 -77 -155 67
6281 67 -286 188 22 82 104 137 -250 -95 -40 -12 19 14 3 2 165 -237 9 -73 161 -72 -85 164 27 -161 -53
6306 -53 128 8 -303 7 201 110 178 137 -38 -20 -119 -53 111 144 -57 -54 74 174 65 47 40 9 129 -159 19
6331 19 28 251 -60 -254 84 -38 164 -119 -65 -24 140 -132 -240 -85 -104 177 -132 -6 91 -139 155 -118
6353 -118 226 264 -254 -170 50 -38 255 80 -150 -136 -143 -202 151 394 -92 -116 -211 18 249 216 -68 60 61 4
6377 4 23 -256 56 90 91 -102 -42 119 110 205 -38 101 -73 112 -59 85 6 204 11 -115 219 -29 -152 -250
6401 -250 204 166 -108 79 -46 65 105 -211 -180 -63 -224 223 35 -70 119 206 -31 296 87 10 69 -16
6423 -16 41 68 401 -42 -5 243 164 231 -168 -279 -19 226 -237 -57 45 -121 -68 -23 -239 -60 -99 -30 -135
6446 -135 -176 14 18 178 94 -154 -75 71 1 -114 -259 -205 -13 -24 -288 9 229 37 -191 -140 -23 85 39
6469 39 28 150 50 -61 -93 209 62 74 -30 64 -362 121 -44 -157 -67 129 98 184 171 185 83 -53 86
6492 86 -180 13 71 -90 262 40 217 -40 54 192 -78 -50 -30 -57 214 86 -41 -62 -26 90 115 139 208 253
6516 253 259 39 85 71 -214 -127 -64 71 79 236 -5 50 83 68 -177 0 18 94 -109 -114 74 64 34 179 50 30
6542 30 -105 45 191 -4 -158 -9 -183 -116 -2 149 -124 105 41 -76 173 -43 -69 -12 -116 66 -2 -10 54
6565 54 141 49 1 -85 91 259 -37 13 29 52 83 88 83 -106 284 106 298 66 -87 -57 -158 -254 -136 21 15 144
6591 144 50 22 -106 -60 287 -71 91 -58 44 88 -104 29 237 -195 154 -17 -118 -107 212 -98 67 -39
6613 -39 -119 -231 -64 -175 -67 -208 -33 -53 -77 131 -24 -7 49 239 49 70 -118 -60 -147 103 -32 43 -335
6636 -335 111 -175 -17 -22 -211 -82 -59 -84 90 145 177 -104 29 95 -10 -88 -135 -99 -56 -117 -8 120 -119 -196
6660 -196 -300 34 84 133 115 55 108 -47 75 11 27 -41 -79 -89 -12 -59 221 -60 84 -129 -3 76 340 124
6684 124 111 78 -49 39 -50 1 -67 -191 -114 145 -114 -108 42 -59 140 16 99 -189 189 -108 155 -69 -136 -5
6708 -5 -33 310 32 23 40 -148 -92 -118 37 -249 56 -40 22 -25 -73 126 91 -37 -325 -200 10 8 140 50 119 19
6734 19 70 0 21 -157 10 -75 18 -3 -4 0 128 -176 47 -84 -69 133 60 197 275 -219 -250 -49 -38 158 -80
6759 -80 106 67 94 -55 151 19 -10 -13 101 70 57 203 90 240 72 386 -85 20 -29 -15 -98 105 16 89
6783 89 196 124 51 84 -187 -129 -16 -30 70 44 47 -39 82 -50 -262 1 -120 162 165 -72 -31 -22 398 92 -79
6808 -79 -117 -88 -10 -83 121 26 -7 56 187 76 68 152 -117 199 -67 39 -50 -104 -90 147 -264 -127 183 68 -37
6833 -37 95 1 83 -39 -5 282 331 5 -209 256 99 10 -112 -91 45 219 -7 198 154 111 -145 10 -137
6856 -137 -293 -102 229 112 -38 67 -144 -307 -19 -16 -63 -166 162 -150 146 223 -54 -188 164 -42 -26 -87
6878 -87 -97 -195 30 244 -43 -27 154 124 127 19 -100 260 118 -58 -36 237 -29 -5 -129 -148 113 -123 99
6901 99 -47 24 -142 75 0 -177 12 66 -201 117 21 -23 99 243 -204 -136 200 -80 -23 155 -234 56 -15
6924 -15 15 260 -252 92 -100 166 -72 -198 -66 12 78 -280 217 -78 -172 -3 -49 121 51 11 21 -169 139
6947 139 127 284 71 94 79 113 135 -64 -26 120 -37 -34 -71 -155 -259 43 -160 48 84 -16 63 23 15 354 26
6972 26 -78 160 -12 -179 -85 39 -428 87 166 118 80 -141 104 24 36 29 77 -104 15 -80 -40 250 -30 202
6996 202 -64 126 -99 87 -11 -9 29 207 200 -113 -123 234 95 115 11 209 -78 80 -23 -48 15 47 -46 53
7020 53 184 63 -220 193 -118 -177 -203 52 -248 122 99 -130 -219 -42 -38 -69 140 148 -80 46 -69 -120 -29 -164
7044 -164 -102 -19 -26 -167 -324 133 -53 -23 206 54 -175 372 -312 65 -154 141 -135 -102 270 -79 61 53 98
7067 98 17 -137 -8 -62 28 -253 -13 -58 266 -2 -84 64 -246 19 -94 -284 47 10 57 161 -90 -112 -10
7090 -10 79 100 104 -92 41 -115 31 -78 -12 88 118 -28 109 245 -66 188 16 22 -33 -93 101 -55 -39 -187
7114 -187 -259 -7 198 329 -111 28 -124 142 -40 216 -81 -269 103 70 60 92 146 -132 103 25 -73 -8 -85
7137 -85 -147 -17 -149 201 -162 21 -68 -178 -14 49 71 -312 -47 -123 72 -317 43 -3 -43 153 -33 -22 145
7160 145 -54 20 -10 41 -35 -102 45 155 -29 -113 26 111 224 -112 -183 -21 345 233 99 -200 133 106 138
7183 138 -4 79 -14 284 -44 -188 -66 1 194 163 -64 167 -107 -215 9 -232 -232 106 114 -86 123 -96 -75
7206 -75 -108 -297 138 -44 -127 -158 76 213 1 191 144 22 22 -105 91 28 -263 93 -246 51 144 -51 138
7229 138 103 -36 -70 -156 -49 -159 3 55 100 82 64 50 -26 272 -23 -128 172 138 271 21 176 4 205
7252 205 -7 7 151 137 45 161 -80 53 -26 -197 14 107 225 2 69 -72 -178 141 16 140 236 59
7274 59 70 -88 -111 -7 53 -58 -296 -41 -127 231 234 -90 0 63 -49 -157 35 205 -219 145 52 107 -38 -106
7298 -106 71 49 157 -149 27 -166 10 -91 -172 147 -106 -43 -87 74 204 144 -26 -153 329 76 -59 6
7320 6 -104 -74 -157 -81 -32 294 -317 319 79 -147 197 276 13 -48 -18 -130 68 -111 65 -43 50 -88 -114 129
7344 129 30 -70 190 123 119 -203 -58 20 -75 119 -142 65 80 -84 45 -167 48 -315 -59 65 -139 150
7366 150 -3 -122 91 61 -68 200 339 -158 -57 168 -106 -184 233 15 -72 101 23 -60 36 231 -148 -6
7388 -6 -42 -139 3 -92 -12 38 -61 -31 -29 302 56 64 -114 147 92 -100 -218 9 -91 134 -96 -23 -95 161 -235
7413 -235 -189 -153 -87 84 -86 28 132 260 87 -185 -53 102 -214 104 37 225 -279 -42 -65 -314 91 16
7435 16 85 102 236 248 24 -142 -187 -31 -82 85 187 -113 112 -71 -139 -69 46 97 164 -38 115 342 91
7458 91 50 138 153 -156 13 182 -33 306 -74 73 -145 28 72 -91 156 -206 89 -112 -273 -59 -78 -21
7480 -21 74 -29 -226 5 62 84 38 -76 -37 0 157 187 128 -111 -247 -258 139 -104 5 -75 -58 91 -204 256
7504 256 148 -177 -76 115 -8 79 -234 126 -143 9 237 98 -78 -97 225 147 94 -33 -1 73 -64 -220
7526 -220 -80 92 -68 -144 140 204 106 157 159 8 -29 331 -123 15 -162 23 25 132 38 -130 -8 180 -3
7549 -3 -68 -29 -334 30 -137 212 -60 200 -87 -116 151 -11 246 140 -170 -19 41 -101 -16 -162 -140 104 -95
7572 -95 -112 59 -40 -72 70 78 108 -39 -68 28 -134 92 264 -370 62 -127 -1 -38 257 190 -14 47 -231 -127
7596 -127 -7 -316 -74 65 -166 255 -233 92 15 -133 97 74 -30 -99 81 61 157 367 83 75 -16 187 130
7619 130 211 182 -66 279 -301 -1 -60 24 22 -44 48 46 93 79 169 191 70 45 245 482 -82 193 -15 -193 67
7644 67 -69 -129 -146 -95 188 230 -18 -158 -31 117 97 -160 -61 -101 69 -89 45 26 134 -44 75 -61 -108
7667 -108 -29 170 -198 -37 228 -53 -17 -112 -101 -11 289 -70 121 -113 -67 -73 34 41 5 -50 -202 11 6 -7 -119
7692 -119 -21 -245 -83 -104 -36 -134 83 -33 -174 152 16 -85 0 -31 61 66 108 -10 -90 -161 112 86 234 92
7716 92 236 -497 274 246 -29 148 -235 -213 48 89 -128 -46 15 -75 -6 -217 -113 99 -105 175 -19 97 83
7739 83 -180 62 22 187 40 70 -132 3 85 -83 72 7 -23 45 112 343 -44 -16 -47 76 118 149 -136 98
7763 98 41 -76 -106 -80 3 -94 -188 -44 -82 198 -80 -60 -161 -27 145 88 -9 73 38 217 -61 -274 -113 30
7787 30 187 169 -121 -61 114 -2 154 115 -7 126 -31 44 3 197 208 131 -147 -150 2 -68 279 103 28 50
7811 50 -26 -89 14 46 -123 1 116 33 252 -65 172 34 -60 293 -93 -162 -10 107 118 43 -154 -112 67
7834 67 -225 27 316 15 109 267 31 -212 -115 152 315 220 74 40 315 208 66 -67 232 -1 78 189
7856 189 7 14 88 54 43 -17 -38 -216 -209 60 128 24 -15 -304 -145 41 144 -75 10 -77 269 16 -55 -53 107
7881 107 -132 12 -85 -129 87 220 -139 73 86 -62 124 -40 98 18 52 -159 -120 73 59 -188 153 -39
7903 -39 -82 80 -104 96 12 -237 167 96 -7 -175 -34 -19 -34 -104 45 320 -100 -53 6 -105 86 -41 -108
7926 -108 -29 43 5 199 -91 191 -7 76 1 -91 206 23 110 78 26 4 18 -149 -139 51 -175 0 -118 33
7950 33 85 150 135 -6 47 -76 -10 194 -236 -66 40 66 -208 114 193 -24 -13 36 -21 -49 272 -85 140 62
7974 62 123 -44 -74 -54 80 6 68 -91 -129 -320 -296 153 -168 -99 268 -159 -272 -73 -50 25 69 76 -25 51 76
7999 76 -120 -6 234 -91 -263 25 -135 280 -214 153 9 -6 -37 50 160 142 -32 -198 111 147 112 -97
8021 -97 -92 133 -50 165 142 82 -87 149 65 32 212 -152 -122 -42 146 245 -150 -187 44 166 -59 104 122 124 -117
8046 -117 78 68 66 -112 84 -32 211 15 -104 -60 168 -97 -180 40 -120 68 80 -11 -88 -13 32 -275 -138
8069 -138 -80 -17 91 5 -79 -31 -186 193 349 -42 -52 70 -61 -85 72 146 -32 -157 207 205 -89 259 -73
8092 -73 -71 13 75 43 -164 -166 -89 -5 -153 -42 -88 32 -107 -25 137 -7 -85 6 -53 70 -6 49 -72 -78 -57 -15 -52
8119 -52 22 102 -25 80 -84 2 155 356 69 106 139 -64 -148 -209 -32 84 178 192 -60 -89 110 64 36 -81
8143 -81 123 28 -94 -54 87 -101 -136 130 203 -51 12 131 -14 -215 150 207 183 43 1 -82 179 -35 115
8166 115 -87 -10 78 -103 -124 162 -122 -67 45 149 110 -34 -14 -217 186 -203 12 -39 90 45 154 -38 -160
8189 -160 -115 -159
8191a59
##END NTUPLES=NMR FID
##END=
