##TITLE=1H_LR-759-C1-CH2Cl2
 CDCl3
 8 sc, 
 24.3.2023
##JCAMPDX= 6.0         $$ Bruker NMR JCAMP-DX V2.0
##DATA TYPE= NMR FID
##DATA CLASS= NTUPLES
##ORIGIN= UXNMR, Bruker Analytische Messtechnik GmbH
##OWNER= root
$$ XWIN-NMR		Version 3.5
$$ Fri Mar 24 14:32:30 2023 Russian Standard Time (UT+4h)  she@DPX200
##.OBSERVE FREQUENCY= 200.1305
##.OBSERVE NUCLEUS= ^1H
##.DELAY= (6, 6)
##.ACQUISITION MODE= SIMULTANEOUS
##.ACQUISITION SCHEME= undefined
##.AVERAGES= 8
##.DIGITISER RES= 18
##SPECTROMETER/DATA SYSTEM= spect
##.PULSE SEQUENCE= zg30
##.SOLVENT NAME= CDCl3
##.SHIFT REFERENCE= (INTERNAL, CDCl3, 0, 15.7039)
##AUDIT TRAIL= $$ (NUMBER, WHEN, WHO, WHERE, WHAT)
$$ ##TITLE= Audit trail, XWIN-NMR		Version 3.5
$$ ##JCAMPDX= 5.01
$$ ##ORIGIN= Bruker BioSpin GmbH
$$ ##OWNER= she
$$ F:/spectra/data/she/nmr/H-F/1/audita.txt
$$ ##AUDIT TRAIL=  $$ (NUMBER, WHEN, WHO, WHERE, WHAT)
(   1,<2023-03-24 14:30:05.78 +0400>,<she>,<DPX200>,
      <created by zg, POWCHK disabled, PULCHK disabled
       configuration hash MD5:
       00 E9 B6 7A A2 85 ED C7 34 08 36 98 17 FE 4E 26
       data hash MD5: 16K
       D1 E0 70 22 94 2F 97 CC 7F 34 54 A6 17 D1 FA 04>)
$$ ##END=
$$ 
$$ hash MD5
$$ DE E2 A6 EA 41 31 68 E6 57 A3 E0 23 9F D2 71 D8
##$RELAX= 
##$RELAX= 
##$RELAX= 
##$RELAX= 
##$RELAX= 
##$RELAX= 
$$ Bruker specific parameters
$$ --------------------------
##$DU= <F:/spectra>
##$EXPNO= 1
##$NAME= <H-F>
##$PROCNO= 1
##$TYPE= <nmr>
##$USER= <she>
##$AMP= (0..31)
100 100 100 100 100 100 100 100 100 100 100 100 100 100 100 100 100 100 
100 100 100 100 100 100 100 100 100 100 100 100 100 100 
##$AQSEQ= 0
##$AQ_mod= 1
##$AUNM= <au_zg>
##$AUTOPOS= <>
##$BF1= 200.13
##$BF2= 200.13
##$BF3= 200.13
##$BF4= 200.13
##$BF5= 200.13
##$BF6= 200.13
##$BF7= 200.13
##$BF8= 200.13
##$BYTORDA= 1
##$CFDGTYP= 0
##$CFRGTYP= 5
##$CHEMSTR= <none>
##$CNST= (0..31)
1 1 145 1 1 1 1 1 1 1 1 1 1 1 1 1 1 1 1 1 1 1 1 1 1 1 1 1 1 1 1 1 
##$CPDPRG= <>
##$CPDPRG1= <>
##$CPDPRG2= <>
##$CPDPRG3= <>
##$CPDPRG4= <mlev>
##$CPDPRG5= <mlev>
##$CPDPRG6= <mlev>
##$CPDPRG7= <mlev>
##$CPDPRG8= <mlev>
##$CPDPRGB= <>
##$CPDPRGT= <>
##$D= (0..31)
0 1.2 0 0 0 0 0 0 0 0.06 0 0.03 0 0 0 0 0.0002 0 0 0 0 0 0 0 0 0 0 0 0 
0 0 0 
##$DATE= 1679653805
##$DBL= (0..7)
120 120 120 120 120 120 120 120 
##$DBP= (0..7)
150 150 150 150 150 150 150 150 
##$DBP07= 0
##$DBPNAM0= <>
##$DBPNAM1= <>
##$DBPNAM2= <>
##$DBPNAM3= <>
##$DBPNAM4= <>
##$DBPNAM5= <>
##$DBPNAM6= <>
##$DBPNAM7= <>
##$DBPOAL= (0..7)
0.5 0.5 0.5 0.5 0.5 0.5 0.5 0.5 
##$DBPOFFS= (0..7)
0 0 0 0 0 0 0 0 
##$DE= 6
##$DECBNUC= <off>
##$DECIM= 32
##$DECNUC= <off>
##$DECSTAT= 4
##$DIGMOD= 1
##$DIGTYP= 9
##$DL= (0..7)
0 120 120 120 120 120 120 120 
##$DP= (0..7)
150 150 150 150 150 150 150 150 
##$DP07= 0
##$DPNAME0= <>
##$DPNAME1= <>
##$DPNAME2= <>
##$DPNAME3= <>
##$DPNAME4= <>
##$DPNAME5= <>
##$DPNAME6= <>
##$DPNAME7= <>
##$DPOAL= (0..7)
0.5 0.5 0.5 0.5 0.5 0.5 0.5 0.5 
##$DPOFFS= (0..7)
0 0 0 0 0 0 0 0 
##$DQDMODE= 0
##$DR= 18
##$DS= 0
##$DSLIST= <SSSSSSSSSSSSSSS>
$$ [...]
##$SUBNAM2= <"">
##$SUBNAM3= <"">
##$SUBNAM4= <"">
##$SUBNAM5= <"">
##$SUBNAM6= <"">
##$SUBNAM7= <"">
##$SUBNAM8= <"">
##$SUBNAM9= <"">
##$SW= 18.0518050122584
##$SWIBOX= (0..15)
0 0 2 0 0 0 0 0 0 0 0 0 0 0 0 0 
##$SW_h= 3612.71676300578
##$TD= 16384
##$TD0= 1
##$TE= 0
##$TE2= 300
##$TE3= 300
##$TEG= 300
##$TL= (0..7)
0 120 120 120 120 120 120 120 
##$TP= (0..7)
150 150 150 150 150 150 150 150 
##$TP07= 0
##$TPNAME0= <>
##$TPNAME1= <>
##$TPNAME2= <>
##$TPNAME3= <>
##$TPNAME4= <>
##$TPNAME5= <>
##$TPNAME6= <>
##$TPNAME7= <>
##$TPOAL= (0..7)
0.5 0.5 0.5 0.5 0.5 0.5 0.5 0.5 
##$TPOFFS= (0..7)
0 0 0 0 0 0 0 0 
##$TUNHIN= 0
##$TUNHOUT= 0
##$TUNXOUT= 0
##$USERA1= <user>
##$USERA2= <user>
##$USERA3= <user>
##$USERA4= <user>
##$USERA5= <user>
##$V9= 5
##$VALIST= <valist>
##$VCLIST= <CCCCCCCCCCCCCCC>
##$VD= 0
##$VDLIST= <DDDDDDDDDDDDDDD>
##$VPLIST= <PPPPPPPPPPPPPPP>
##$VTLIST= <TTTTTTTTTTTTTTT>
##$WBST= 1024
##$WBSW= 4
##$XGAIN= (0..3)
0 0 0 0 
##$XL= 0
##$YL= 0
##$YMAX_a= 272158
##$YMIN_a= -320189
##$ZGOPTNS= <>
##$ZL1= 120
##$ZL2= 120
##$ZL3= 120
##$ZL4= 120
##$ABSF1= 10
##$ABSF2= 0
##$ABSG= 5
##$ABSL= 3
##$ALPHA= 0
##$AQORDER= 0
##$ASSFAC= 0
##$ASSFACI= 0
##$ASSFACX= 0
##$ASSWID= 0
##$AUNMP= <proc_1d>
##$AZFE= 0.1
##$AZFW= 0.1
##$BCFW= 1
##$BC_mod= 2
##$BYTORDP= 1
##$COROFFS= 0
##$CY= 11.3945322036743
##$DATMOD= 1
##$DC= 2
##$DFILT= <>
##$DTYPP= 0
##$F1P= 2.36226072786647
##$F2P= -0.459571619588291
##$FCOR= 0.5
##$FTSIZE= 0
##$FT_mod= 4
##$GAMMA= 1
##$GB= 0.15
##$INTBC= 1
##$INTSCL= 1
##$ISEN= 128
##$LB= 0.24
##$LEV0= 0
##$LPBIN= 0
##$MAXI= 10000
##$MC2= 0
##$MEAN= 0
##$ME_mod= 0
##$MI= 1.114404
##$NCOEF= 0
##$NC_proc= 0
##$NLEV= 6
##$NOISF1= 3.799351
##$NOISF2= 2.8
##$NSP= 1
##$NTH_PI= 0
##$NZP= 0
##$OFFSET= 15.70392
##$PC= 1
##$PHC0= -19103.72
##$PHC1= 9.600781
##$PH_mod= 1
##$PKNL= yes
##$PPARMOD= 0
##$PSCAL= 0
##$PSIGN= 0
##$REVERSE= no
##$SF= 200.130013532006
##$SI= 16384
##$SIGF1= 3
##$SIGF2= 2
##$SINO= 400
##$SIOLD= 16384
##$SREGLST= <1H.CDCl3>
##$SSB= 0
##$STSI= 0
##$STSR= 0
##$SW_p= 3612.71676300578
##$SYMM= 0
##$S_DEV= 0
##$TDeff= 0
##$TDoff= 0
##$TI= <>
##$TILT= no
##$TM1= 0
##$TM2= 0
##$TOPLEV= 0
##$USERP1= <user>
##$USERP2= <user>
##$USERP3= <user>
##$USERP4= <user>
##$USERP5= <user>
##$WDW= 1
##$XDIM= 8192
##$YMAX_p= 0
##$YMIN_p= 0
$$ End of Bruker specific parameters
$$ ---------------------------------
##NTUPLES= NMR FID
##VAR_NAME=  TIME,          FID/REAL,        FID/IMAG
##SYMBOL=    X,             R,               I
##VAR_TYPE=  INDEPENDENT,   DEPENDENT,       DEPENDENT
##VAR_FORM=  AFFN,          ASDF,            ASDF
##VAR_DIM=   8192,          8192,            8192
##UNITS=     SECONDS,       ARBITRARY UNITS, ARBITRARY UNITS
##FACTOR=    0.0002768,     1,               1
##FIRST=     0,             0,               0
##LAST=      2.2672688,     0,               0
##MIN=       0,             -320189,         0
##MAX=       2.2672688,     272158,          0
$$ Real data points
##PAGE= N=1
##DATA TABLE= (X++(R..R)), XYDATA
$$ plain form
0 0 0 0 0 0 0 0 0 0 0 8 -8 8 -8 16 -16 24 -24 32 -40 48 -57 72 -88 104 -120 136 -160 184 -216 248 -280 320
32 320 -364 412 -464 524 -589 660 -737 823 -916 1017 -1128 1251 -1382 1528 -1686 1860 -2050
49 -2050 2259 -2484 2740 -3019 3330 -3680 4073 -4521 5035 -5631 6332 -7176 8206 -9503
63 -9503 11191 -13484 16805 -22061 31672 -55075 237443 182751 -91185 246418 40515 -125386
75 -125386 113735 153314 -83469 31472 51268 -126727 -99667 -17165 -149769 -137607 -75782
86 -75782 -134021 -107700 -15725 -66354 -39442 41974 9027 14754 93539 51953 56132 134266 79996
99 79996 24788 89949 60325 20064 92437 63993 -22940 21770 -12445 -131035 -74629 -25649
111 -25649 -121443 -80076 7806 -79430 -83012 26974 -32244 -80870 31059 24312 -43790 50296
$$ packed form
0@%%%%%%%%%Qj6J6j6K4l2M0m8N6p2Q8j05J29j60J92k24K56k96L44m00M64n28O00
32C20o84P76q76R88j113J249j397J560j739J933k145K379k633K910l214L546l910
49b050M309m743N224n759O349p010P753q594R556j0666J1963j3508J5382j7709
63i503K0694k4675L0289l8866N3733q6747K92518n4692k73936L37603k05903j65901
75a25386K39121L9579k36783J14941J9796j77995K7060Q2502j32604J2162O1825
86g5782n8239K6321R1975n0629K6912Q1416l2947N727P8785m1586M179P8134n4270
99G9996n5208O5161k9624m0261P2373k8444q6933M4710l4215j18590N6406M8980
111b5649r5794M1367Q7882q7236l582J09986n9218m8626J11929o747o8102R4086
$$ plain form
123 50296 91567 15481 59522 110614 29768 20736 73576 24921 -4699 34811 7469 -29644
135 -29644 -9541 -25211 -50171 -25607 -28999 -47875 -28086 -33585 -53164 -26650 -17119 -26847 8161
148 8161 27312 8928 31089 48362 17052 21448 43382 13479 8005 40620 21936 1514 26552
161 26552 9841 -28301 -12415 -11324 -43631 -28216 -6640 -30868 -28768 -3669 -18373 -25782 -49
174 -49 1242 -7386 12564 18559 7761 16061 22100 13011 16098 22322 15820 13284 12805 3471 -2072
189 -2072 -6135 -14130 -13088 -10625 -15337 -11171 -5549 -14010 -15648 -7753 -13101 -14920 544 4426 694
204 694 13028 18012 7276 10641 16902 6107 4250 14650 7628 673 8299 5015 -7267 -4772
218 -4772 -2148 -11879 -11773 -4730 -9568 -13088 -6242 -6497 -10260 -3599 1409 -74 3111 8327 6635 4284
$$ packed form
123E0296M1271p6086M4041N1092q0846r032N2840m8655k9620L9510k7342l7113
135b9644K0103j5670k4960K4564l392j8876J9789n499j9579K6514R531r728L5008
148H161J9151j8384K2161J7273l1310M396K1934k9903n474L2615j8684k0422K5038
161B6552j6711l8142J5886J091l2307J5415K1576k4228K100K5099j4704p409K5733
174d9J291q628J9950N995j0798Q300O039r089L087O224o502k536m79r334n543
189b072m063p995J042K463m712M166N622q461j638P895n348j819J5464L882l732
204F94J2334M984j0736L365O261j0795j857J0400p022o955P626l284j2282K495
218d772K624r731J06P043m838l520O846k55l763O661N008j483L185N216j692k351
$$ plain form
234 4284 6561 7448 5514 5944 9146 8537 4989 3430 1893 -3730 -7074 -5646 -6815 -8958 -4818 -2725
250 -2725 -6775 -5672 -2463 -6284 -7185 -514 677 -1620 4777 8251 3637 4996 9150 4941 3014
265 3014 7691 6026 771 2836 2869 -3591 -3939 -605 -3564 -5913 -2150 -2930 -7063 -5813 -3979 -6264
281 -6264 -5069 -90 1021 864 4462 5515 2693 2766 4536 2607 1767 4911 5148 2504 2813 3497 -728
298 -728 -3088 -1112 -2794 -5805 -3637 -1778 -4809 -4499 -1407 -3109 -4253 -164 929 -1440 1037 3586
314 3586 625 920 4794 3722 2149 5158 5606 1685 1740 2585 -1262 -3128 -403 -1532 -3627 -1251
330 -1251 -127 -3614 -3725 -1560 -3529 -4592 -1480 -338 -1693 378 2964 1213 793 3829 2638 523
346 523 3002 3557 1150 968 2911 961 -928 1238 383 -2159 -1633 -726 -3048 -3683 -1507 -2345 -3348
$$ packed form
234D284K277Q87j934M30L202o09l548j559j537n623l344J428j169k143M140K093
250b725m050J103L209l821r01O671J191k297O397L474m614J359M154m209j927
265C014M677j665n255K065L3o460l48L334k959k349L763p80m133J250J834k285
281f264J195M979J111j57L598J053k822P3J770j929q40L144K37k644L09O84m225
298g28k360J976j682l011K168J859l031L10L092j702j144M089J093k369K477K549
314C586k961K95L874j072j573L009M48l921N5Q45l847j866K725j129k095K376
330a251J124l487j11K165j969j063L112J142j355K071K586j751m20L036j191k115
346E23K479N55k407j82J943j950j889K166q55k542N26R07k322o35K176q38j003
$$ plain form
363 -3348 -745 519 -1266 -618 2030 241 -855 1730 1865 79 2021 3752 1357 1236 2987 1011
379 1011 -1308 574 565 -1999 -811 1010 -1597 -2354 -15 -1348 -3066 -1100 -658 -2236 -1407 989 -485
396 -485 -636 1727 1786 -112 1554 2559 786 376 2173 985 -666 760 1435 -588 -49 1411 -614
413 -614 -2069 -308 -656 -2749 -1420 160 -1689 -1092 777 -144 -1378 595 575 -1153 336 1980 455
430 455 94 2216 1389 -488 1269 1731 -659 -291 1103 -489 -1195 397 -401 -1815 -641 39 -1576
447 -1576 -1370 314 -600 -1553 -187 263 -671 15 1581 472 5 1076 862 -71 481 1481 1 -137
465 -137 1575 610 -519 558 457 -1245 -1184 226 -1280 -1873 125 -1 -1527 -371 447 -1187 -497
482 -497 775 120 -775 770 1021 -36 675 1526 11 211 1530 489 -390 200 302 -659 -443 312
$$ packed form
363c348K603J264j785O48K648j789j096K585J35j786J942J731k395j21J751j976
379A011k319J882rk564J188J821k607p57K339j333j718J966M42j578Q29K396j474
396d85j51K363N9j898J666J005j773m10J797j188j651J426O75k023N39J460k025
413f14j455J761l48k093J329J580j849N97J869r21j234J973k0j728J489J644j525
430D55l61K122q27j877J757M62k390L68J394j592p06J592p98j414J174O80j615
447a576K06J684r14r53J366M50r34O86J566j109m67J071k14r33N52J000j480j38
465a37J712r65j129J077j01j702O1J410j506n93J998j26j526J156Q18j634O90
482d97J272o55q95J545K51j057P11Q51j515K00J319j041q79N90J02r61K16P55
$$ plain form
500 312 -373 -1004 -43 -353 -1311 -802 96 -1096 -979 416 182 -694 340 1035 -151 -47 912 416 -76
519 -76 998 1031 6 287 1266 -109 -337 949 -277 -1214 -137 91 -1342 -820 535 -888 -1088 366
537 366 -221 -1051 47 384 -480 18 936 315 234 798 670 162 619 1226 85 -131 646 323 -675 -13
557 -13 419 -796 -790 29 -399 -1074 -152 -77 -694 -55 516 -485 -407 1033 478 -518 828 946 -557 100
577 100 1503 161 -306 796 394 -582 56 490 -971 -635 166 -593 -840 98 -176 -757 -75 299 -432
596 -432 -247 382 127 109 517 971 8 413 887 305 -221 409 525 -282 -235 372 -390 -782 67 -177 -965
617 -965 -409 137 -995 -317 645 55 -357 496 323 -774 258 834 88 45 1267 -89 -350 596 372
636 372 -429 237 149 -381 -332 304 -470 -623 -124 -30 -461 -297 72 -160 -260 91 284 -57 -137 454 261 -40
$$ packed form
500C12o85o31R61l10r58N09Q98j192J17J395k34q76J034O95j186J04R59m96m92
519g6J074L3j025K81R79j375k28J286j226r37J077K28j433N22J355j423k00J454
537C66n87q30J098L37q64M98R18o21q1N64j28n08M57O07j141k16P77l23r98O62
557a3M32j215OQ19m28o75R22P5o17O39N71j001P8J440n55r96J346J18j503O57
577A00J403j342m67J102m02r76O38M34j461L36Q01p59k47R38k74n81O82L74p31
596d32J85O29k55j8M08M54r63M05M74n82n26O30J16q07M7O07p62l92Q49k44p88
617i65N56N46j132O78R62n90m12Q53j73j097J032N76p46m3J222j356k61R46k24
636C72q01O66q8n30M9O36p74j53M99R4m31J64L69k32j00L51J93l41q0N91j93l01
$$ plain form
658 -40 659 530 -8 156 601 -66 -342 859 -32 -815 159 246 -676 -281 497 -708 -991 193 -14 -822
678 -822 318 145 -553 119 936 -129 45 667 237 -128 502 436 -18 258 396 -17 -218 115 125 -455
698 -455 -112 -179 -13 -304 -311 -101 -487 -218 264 -222 -111 608 427 -14 496 474 -50 6 771 20 -367 387
720 387 162 -734 -36 361 -599 -118 112 -567 -616 82 -309 -746 -178 175 -430 -180 598 -192 134 608 276
741 276 -60 279 607 -20 247 323 -91 99 -99 134 -182 -320 122 -380 -316 -216 78 -105 -52 0 -255 -251
763 -251 -61 22 -420 65 537 -113 188 741 129 -158 272 68 -92 119 457 -264 -115 308 154 -393 43
784 43 54 -471 -105 241 -392 -260 340 134 -25 316 261 36 256 119 101 -197 230 203 -261 -91 133 87
806 87 -407 123 -32 -309 4 21 -387 -339 334 123 -349 346 181 -190 96 492 -126 -108 402 91 -475 316
$$ packed form
658d0O99j29n38J64M45o67k76J201q91p83R74Q7r22L95P78j205k83J184k07q08
678h22J140j73o98O72Q17j065J74O22m30l65O30o6m54K76J38m13k01L33J0n80
698d55L43o7J66k91pK10l86K69M82m86J11P19j81m41N10k2n24N6P65p51l87P54
720C87k25q96O98L97r60M81K30o79m9O98l91m37N68L53o05K50P78p90L26M74l32
741B76l36L39L28o27K67P6m14J90j98K33l16j38M42n02O4J00K94j83N3N2k55M
763b51J90Q3m42M85M72o50L01N53o12k87M30k04j60K11L38p21J49M23j54n47M36
784D3J1n25L66L46o33J32O00k06j59L41n5k25K20j37j8k98M27k7m64J70K24m6
806H7m94N30j55k77L13J7m08M8O73k11m72O95j65l71K86L96o18J8N10l11n66P91
$$ plain form
828 316 187 -343 60 301 -165 -250 14 -75 -362 -236 41 -357 -200 116 -151 -390 132 123 -224 -74 211 101
850 101 -26 279 92 -70 275 232 58 -165 143 -103 -191 194 -183 -165 -259 128 -235 -326 -190 -104 -543 133
872 133 178 -101 -136 316 -115 -144 477 -66 -53 261 216 -131 -26 167 5 102 -34 34 -273 -29 -134 -333 -340
895 -340 300 -191 -219 -14 -27 -34 -139 349 46 -28 132 307 35 190 256 16 16 296 -17 -224 -91 221 -125
918 -125 -38 -204 -146 -390 -31 194 -563 -140 -69 -115 -116 -117 105 -216 230 287 -240 -234 120 -110 -284 174 20 -34
942 -34 53 81 -133 -33 70 -211 -276 -101 104 -114 -65 24 9 -342 322 143 -79 61 227 76 134 344 224
965 224 -52 107 -7 -57 -57 206 -291 -389 102 -157 -214 3 82 -300 -130 145 -230 -472 112 27 -124 134 211
988 211 67 63 307 -2 55 -16 354 -263 -139 109 -15 -232 250 28 -308 153 -38 -425 -190 66 129 112
$$ packed form
828C16j29n30M03K41m66q5K64q9k87J26K77l98J57L16k67k39N22rl47J50K85j10
850A01j27L05j87j62L45m3j74k23L08k46q8L85l77J8r4L87l63r1J36Q6m39O76
872A33M5k79l5M52m31k9O21n43J3L14m5l47J05J93j62R7j36O8l07K44j05j99p
895c40O40m91k8K05j3pj05M88l03p4J60J75k72J55O6k40%K80l13k07J33L12l46
918a25Q7j66N8k44L59K25p57M23P1m6jjK22l21M46N7n27OL54k30j74M58j54n4
942c4Q7K8k14J00J03k81o5J75K05k18M9Q9j5l51O64j79k22J40J66j51N8K10j20
965B24k76J59j14n0%K63m97r8M91k59n7K17P9l82J70K75l75k42N84q5j51K58P7
988B11j44mK44l09N7p1L70o17J24K48j24k17M82k22l36M61j91l87K35K56O3j7
$$ plain form
1010 112 72 178 -50 171 -48 -333 -28 360 200 -36 138 224 42 44 105 2 3 -64 -169 -248 54 46 -117 -93
1034 -93 364 -150 -322 115 33 -128 -114 11 -190 -161 11 5 38 -81 81 -117 257 -96 -83 -39 364 -276 -16
1057 -16 -75 35 15 -175 -77 25 -91 -116 80 -47 167 -172 77 -176 118 131 129 93 113 38 -177 67 -135 66
1081 66 21 -7 150 -163 -26 -280 -30 275 -257 -103 91 126 102 14 -258 -99 141 20 -41 -211 -138 208 -136
1104 -136 -101 -229 -64 -92 103 -47 126 -162 -15 281 -192 259 253 -85 -22 -37 79 122 -92 -18 68 -78 403
1127 403 -54 15 90 69 -198 211 198 -339 107 40 -71 23 -10 -110 -155 338 217 -194 55 -127 111 -104 190
1150 190 1 -54 -109 -47 -172 -195 103 -87 -292 207 -52 18 40 32 -254 -237 76 -230 53 33 529 -221 -97
1173 -97 98 -129 -78 62 -185 -32 -92 -131 290 -76 190 -40 -162 226 16 25 -97 103 -153 241 128 -125
$$ packed form
1010A12m0J06k28K21k19k85L05L88j60k36J74Q6j82KO1j03Jo7j05p9L02qj63K4
1034i3M57n14j72M37q2j61J4J25k01K9J72oL3j19J62j98L74l53J3M4M03o40K60
1057a6n9J10k0j90R8J02j16k5J96j27K14l39K49k53K94J3kl6K0p5k15K44k02K01
1081F6m5k8J57l13J37k54K50L05n32J54J94L5k4q8k72J59K40j21o1j70P3L46l44
1104a36L5j28J65k8J95j50J73k88J47K96m73M51ol38O3j5J16M3k14P4Q6j46M81
1127D03m57O9P5k1k67M09j3n37M46o7j11R4l3j00m5M93j21m11K49j82K38k15K94
1150A90j89n5n5O2j25k3K98j90k05M99k59P0K2qk86J7L13l06K83k0M96p50J24
1173i7J95k27N1J40k47J53o0l9M21l66K66k30j22L88k10Rj22K00k56L94j13k53
$$ plain form
1195 -125 -327 127 154 -123 174 22 193 80 129 117 -54 -282 -24 -100 -130 61 -97 -176 201 -29 -56 -23 -58
1218 -58 22 -182 33 162 243 -11 84 -430 146 144 101 -153 -135 -226 226 -71 175 -66 -69 -21 -21 215 89 75 -107
1243 -107 -116 -271 257 90 -44 330 62 -204 243 -55 -5 4 -6 -157 141 -35 100 -102 -20 74 -84 108 58
1266 58 -15 54 -333 -273 75 -113 137 -27 -97 100 -6 291 83 -90 -115 154 -39 -62 -50 -33 74 -187 68
1289 68 -105 -82 106 176 -285 -269 -72 -70 69 -74 92 -169 -16 -158 195 28 498 91 -136 -38 23 -108 -50
1312 -50 51 -193 153 -1 -125 -236 7 117 26 -139 74 54 -221 -158 150 50 -284 -136 -90 -138 39 -230
1334 -230 -59 150 91 -115 217 172 -108 28 74 62 106 118 -118 -16 32 94 -300 -230 9 -180 -194 53 117 17
1358 17 64 -286 221 -176 79 316 134 -155 138 -61 -70 183 83 92 41 290 119 162 225 67 -46 67 205
$$ packed form
1195a25k02M54K7k77K97j52J71j13M9j2j71k28K58p6l0J91j58p9L77k30k7L3l5
1218e8Q0k04K15J29Q1k54R5n14N76km3k54J8r1M52k97K46k41lM8%K36j26j4j82
1243a07rj55N28j67j34L74k68k66M47k98N0Rj0j51K98j76J35k02Q2R4j58J92n0
1266E8p3O9l87O0L48j88K50j64p0J97j06K97k08j73k5K69j93k3J2J7J07k61K55
1289F8j73K3J88P0m61J6J97KJ39j43J66k61J53j42L53j67M70m07k27R8O1j31N8
1312e0J01k44L46j54j24j11K43J10r1j65K13k0k75O3L08j00l34J48M6m8J77k69
1334b30J71K09n9k06L32m5k80J36M6j2M4J2k36J02M8O2l94P0K39j89j4K47O4j00
1358A7M7l50N07l97K55K37j82k89K93j99rK53j00Rn1K49j71M3O3j58j13J13J38
$$ plain form
1381 205 -234 -90 -27 151 102 -126 69 -48 236 11 -68 -185 2 -94 -255 296 34 -177 -199 -187 -327 138
1403 138 204 -30 36 125 133 123 0 191 223 -45 -77 112 135 -47 396 203 -76 114 -136 32 437 -21 83
1426 83 32 186 -107 -186 -31 10 212 31 210 153 -252 124 -211 -80 -143 -108 124 64 194 -168 -201 -186 100
1449 100 -38 -2 72 133 -82 -240 63 -177 21 98 14 379 230 -188 -17 -82 -31 -89 28 180 -411 -63 -84
1472 -84 -229 -100 -114 173 68 -116 356 65 12 35 52 -135 173 -62 4 83 78 -22 -7 65 -103 -185 -60 11
1496 11 -23 -127 186 60 -103 -21 263 6 142 232 -70 -13 104 103 -211 88 -98 -168 107 -44 -170 43 -69
1519 -69 -124 50 59 -155 -211 -75 -26 -137 60 -181 101 -32 55 -31 50 -93 46 -121 -49 126 -180 -3 83 51
1543 51 -75 -361 -96 -77 -87 2 90 -84 43 -130 42 -150 -50 178 68 -66 -177 53 -50 -171 116 119
$$ packed form
1381B05m39J44O3J78m9k28J95j17K84k25p9j17J87r6j61N51k62k11k2J2j40M65
1403A38O6k34O6Q9Qj0j23J91L2k68l2J89K3j82M43j93k79J90k50J68M05m58J04
1426H3n1J54k93p9J55M1K02j81J79n7m05L76l35J31o3L5K32o0J30l62l3J5K86
1449A00j38L6P4O1k15j58L03k40J98P7q4L65j49m18J71o5N1n8J17J52n91L48k1
1472h4j45J29j4K87j05j84M72k91n3K3J7j87L08k35O6P9nj00J5P2j68q2J25P1
1496A1l4j04L13j26j63Q2K84k57J36R0l02N7J17jl14K99j86p0K75j51j26K13j12
1519f9n5J74Rk14n6J36M9j11J97k41K82j33Q7q6Q1j43J39j67P2J75l06J77Q6l2
1543E1j26k86K65J9j0Q9Q8j74J27j73J72j92J00K28j10j34j11K30j03j21K87L
$$ plain form
1565 119 114 306 64 95 -48 -94 181 192 15 35 59 146 -177 -186 311 206 -14 141 -21 98 47 -46 77 -31
1589 -31 -51 -23 32 32 -198 208 -113 -442 63 -105 228 90 -147 6 325 -83 -190 122 -180 17 -122 -295
1611 -295 29 -220 -38 -8 179 -140 30 -81 7 129 -195 38 212 -102 30 -120 -9 117 69 104 -145
1632 -145 37 -223 -6 111 190 -88 -245 -87 85 -10 -6 140 141 10 104 -210 -76 146 182 209 -109 -81 90
1655 90 -176 -96 -128 -111 -151 82 -44 -87 -31 -65 54 -170 -96 225 93 -194 143 -113 -23 121 71 283 64 -89
1679 -89 -16 6 -108 164 46 59 -43 -75 50 -187 -132 87 169 52 -25 -72 116 153 -82 31 67 -169 155 -179
1703 -179 14 -55 128 -18 -286 9 -170 266 -95 -22 -302 -64 108 -199 25 -260 -301 -11 -63 205 -386
1724 -386 -124 -53 -24 144 161 262 -13 237 -81 56 61 61 -72 -124 -52 -37 -226 174 215 29 16 -100 103 -241
$$ packed form
1565A19nJ92k42L1j43m6K75J1j77K0K4Q7l23rM97j05k20J55j62J19n1r3J23j08
1589c1k0K8N5%k30M06l21l29N05j68L33j38k37J53L19m08j07L12l02J97j39j73
1611b95L24k49J82L0J87l19J70j11Q8J22l24K33J74l14J32j50J11J26m8L5k49
1632a45J82k60K17J17P9k78j57J58J72r5MJ46Jj31R4l14J34K22L6K7l18K8J71
1655I0k66Q0l2J7m0K33j26m3N6l4J19k24P4L21j32k87L37k56R0J44n0K12k19j53
1679h9P3K2j14K72j18J3j02l2J25k37N5K19Q2j17p7m7J88L7k35J13L6k36L24l34
1703a79J93o9J83j46k68K95j79M36l61P3k80K38J72l07K24k85m1K90n2K68n91
1724c86K62P1K9J68J7J01k75K50l18J37N%j33n2P2J5j89M00M1j86j3j16K03l44
$$ plain form
1748 -241 -57 167 -139 -308 -236 -149 -31 76 -129 192 -321 102 3 -137 288 120 215 56 -246 -51 -164
1769 -164 -39 -116 329 -287 28 120 -88 -53 -34 -45 109 -10 -67 34 -44 -253 280 17 71 -244 165 224 -201
1792 -201 -35 -39 99 127 104 -47 33 111 -185 117 201 40 158 -149 186 267 -66 45 100 -152 -49 -169 126
1815 126 -251 -4 -299 -3 -126 -83 -106 -141 162 27 126 -139 -139 33 -36 -142 -44 -190 -145 -166 -40 -95 0 -54
1839 -54 68 71 -186 -81 32 -44 -128 -144 -73 -305 42 -217 42 13 227 -193 98 85 -117 -76 62 24 130 37
1863 37 94 -55 -54 135 274 173 -129 16 123 -14 -166 -7 -140 -217 21 241 16 -124 159 -19 -91 76
1885 76 269 -94 -138 -180 -316 98 -261 126 -198 -100 -38 -105 54 -98 -86 110 -78 100 -177 166 128 -162 -6
1908 -6 -199 -17 -254 19 -70 18 23 54 -256 -63 70 82 -195 -203 -109 -86 -186 -20 260 -209 237 184 235 18 -88
$$ packed form
1748b41J84K24l06j69P2Q7J18J07k05L21n13M23r9j40M25j68R5j59l02J95j13
1769a64J25p7M45o16L15R2k08L5J9j1J54j19n7J01p8k09N33k63N4l15M09N9m25
1792b01J66mJ38K8k3j51Q0P8k96L02Q4j61J18l07L35Q1l33J11N5k52J03j20K95
1815A26l77K47k95K96j23M3k3l5L03j35R9k65%J72o9j06R8j46M5k1J26n5R5n4
1839e4J22Lk57J05J13p6q4j6P1k32L47k59K59k9K14m20K91j3k02M1J38l8J06r3
1863C7N7j49JJ89J39j01l02J45J07j37j52J59j33p7K38K20k25j40K83j78p2J67
1885G6J93l63m4m2j36M14l59L87l24R8O2o7J59j52J2J96j88J78k77L43l8k90J56
1908fj93J82k37K73q9Q8NL1l10J93J33J2k77qR4K3j00J66K80m69M46n3N1k17j06
$$ plain form
1933 -88 204 132 59 48 -46 95 5 -94 -283 103 -18 -6 -61 43 51 -187 219 -175 -12 108 14 312 95 -1
1957 -1 69 125 158 48 -80 19 208 -4 117 -40 137 160 -246 54 33 -51 257 -63 40 -46 -47 -192 -154 -338
1981 -338 56 -163 -242 108 175 74 22 -112 40 -138 -26 -412 92 -137 -147 152 -111 47 27 -11 -271 16
2003 16 -186 -73 -49 87 63 -107 -19 -3 63 -189 58 -115 -8 -142 -160 -103 85 356 6 16 -212 117 67
2026 67 -115 -16 71 216 -229 -165 146 33 -348 91 9 -118 107 -156 -87 -168 30 65 -60 55 -72 202 -104
2049 -104 -75 -11 165 -98 -99 -97 -45 349 95 76 -100 -130 -91 19 316 34 28 83 117 32 -167 339 -19 249 -82
2074 -82 -25 -89 89 -35 -164 -66 152 38 114 -205 -2 -167 -167 -65 -5 -82 234 34 -125 -31 -186 216 109
2097 109 -367 113 -75 -217 -445 -169 -204 171 91 -163 123 -105 -34 -81 -95 9 -26 69 148 -151 -129 -63 40
$$ packed form
1933h8K92p2p3j1r4J41r0r9j89L86j21J2n5J04Qk38M06l94J63J20r4K98k17r6
1957aP0N6L3j10j28R9J89k12J21j57J77K3m06L00k1q4L08l20J03q6jj45L8j84
1981c38L94k19p9L50O7j01n2j34J52j78J12l86N04k29j0K99k63J58k0l8k60K87
2003A6k02J13K4J36k4j70Q8J6O6k52K47j73J07j34j8N7J88K71l50J0k28L29n0
2026F7j82R9Q7J45m45O4L11j13l81M39q2j27K25k63O9q1J98L5j25J15j27K74l06
2049a04K9O4J76k63jKN2L94k54j9j76l0L9J10K97k82oN5L4q5j99N06l58K68l31
2074h2N7o4J78j24j29R8K18j14P6l19K03j65%J02O0p7L16k00j59R4j55M02j07
2097A09m76M80j88j42k28K76l5L75q0k54K86k28P1m7j4J04l5R5P9k99K2O6J03
$$ plain form
2120 40 204 254 -7 -1 225 88 69 12 -256 -16 -94 12 191 44 -121 -25 150 -230 152 206 161 -16 27 70
2144 70 -111 -249 36 -141 53 -178 213 82 148 99 -116 -217 166 195 -1 -68 -35 -100 2 -81 -177 49 -159
2167 -159 -177 -44 -33 -162 192 -239 -2 -180 -247 -248 -98 10 332 15 -89 119 46 41 -280 182 108 -181 -12
2190 -12 -214 125 -172 -39 77 -97 -102 197 -20 -79 -136 69 -97 301 -12 28 132 162 -47 158 41 53 113
2213 113 -113 -52 -19 -109 109 211 66 -114 79 149 -116 7 -89 43 -49 188 -132 -239 -458 -177 148 119
2235 119 71 -78 48 0 -91 -272 -49 -26 215 127 53 -67 -34 65 -182 195 131 -27 -126 -13 -438 -17 161
2258 161 -7 -45 32 4 -143 52 -65 -116 -99 -65 -162 33 23 139 111 68 -168 -203 156 211 -76 102 -151 130
2282 130 -379 -98 91 -3 175 -152 -126 -46 208 -145 -38 -53 162 -177 166 99 23 -194 229 27 145 100
$$ packed form
2120D0J64N0k61OK26j37j9n7k68K40p8J06J79j47j65R6J75l80L82N4m5j77M3M3
2144G0j81j38K85j77J94k31L91j31O6m9k15j01L83K9j96o7L3o5J02q3r6K26k08
2167a59j8J33J1j29L54m31K37j78o7jJ50J08L22l17j04K08p3nl21M62p4k89J69
2190a2k02L39k97J33J16j74nK99k17n9n7K05j66L98l13M0J04L0k09K05j17J2O0
2213A13k26O1L3r0K18J02j45j80J93P0k65J23r6J32r2K37l20j07k19K81L25k9
2235A19m8j49J26m8r1j81K23K3K41q8p4j20L3R9k47L77o4j58r9J13m25M21J78
2258A61j68l8P7k8j47J95j17n1J7L4r7J95j0J16k8m3k36l5L59N5k87J78k53K81
2282A30n09K81J89r4J78l27K6Q0K54l53J07j5K15l39L43o7p6k17M23k02J18m5
$$ plain form
2304 100 -207 164 -99 -251 172 125 11 -248 144 -13 11 -131 -19 -3 -148 -185 135 -305 -1 -70 -96 147
2326 147 5 93 26 -403 158 -92 -129 -40 -146 66 95 -73 126 185 -38 46 -122 189 -58 -41 203 -4 23
2349 23 -158 -192 140 -162 3 133 -81 -95 28 110 -190 -83 86 -264 -8 47 235 70 264 -207 -224 -90
2371 -90 -34 -176 -21 -21 -236 300 67 30 -33 -294 26 118 70 -44 -103 31 203 185 -59 266 -39 -77 -15 -181
2395 -181 175 90 50 104 -227 -319 2 -11 84 52 126 -183 181 -104 -116 27 1 -196 262 -74 119 206 -49 -262
2419 -262 -78 -160 -4 145 -29 -99 70 -132 9 -219 -67 36 -49 -25 -3 -9 -24 93 199 -239 -66 245 6
2442 6 -149 -80 -258 -3 122 -127 -27 148 8 -7 -105 -4 -8 61 100 140 -24 -43 80 -70 161 -127 -125 0
2466 0 106 16 43 -75 108 -18 -132 61 -161 -163 -215 -171 214 -102 98 263 14 132 242 208 -5 286 48
$$ packed form
2304A00l07L71k63j52M23m7j14k59L92j57K4j42J12J6j45l7L20m40L04o9k6K43
2326A47j42Q8o7m29N61k50l7Q9j06K12K9j68J99N9k23Q4j68L11k47J7K44k07K7
2349B3j81l4L32l02J65J30k14j4J23Q2l00J07J69l50K56N5J88j65J94m71j7J34
2371i0N6j42J55%k15N36k33l7o3k61L20R2m8j14n9J34J72j8k44L25l05l8O2j66
2395a81L56q5m0N4l31r2L21j3R5l2P4l09L64k85j2J43k6j97M58l36J93Q7k55k13
2419b62J84q2J56J49j74p0J69k02J41k28J52J03q5K4K2oj5J17J06m38J73L11k39
2442Fj55O9j78K55J25k49J00J75j40j5r8J01mO9L9M0j64j9J23j50K31k88KJ25
2466@J06r0K7j18J83j26j14J93k22kn2M4L85l16K00J65k49J18J10l4k13K91k38
$$ plain form
2489 48 97 -86 -105 43 94 -146 -73 -47 -144 24 13 -184 -118 -13 91 -62 104 -29 158 39 -194 -143 -124 61
2513 61 -59 -48 -123 -154 -168 260 -66 43 37 -48 -15 101 84 -226 -42 9 -111 5 97 -57 77 -114 -127 -98 -86
2538 -86 81 36 34 -75 32 57 9 299 -45 -178 3 -126 -86 48 -90 -290 151 -96 188 -101 -122 171 -111
2561 -111 83 58 -91 -49 58 -54 49 -123 102 -71 208 -55 -28 130 159 -223 -58 41 -366 318 69 -3
2583 -3 52 -25 31 -286 -251 -19 -1 -209 44 -1 326 -8 15 423 -48 -18 -112 50 161 182 185 76 -275 -85 -61
2608 -61 -235 163 -52 -4 45 -156 8 -43 116 -31 33 -126 35 78 -92 63 -75 -32 14 -72 -18 -86 190 84
2632 84 -98 -12 190 -62 114 129 54 52 29 43 -97 -22 -95 -92 -109 269 9 93 -111 14 -6 -156 80 30 350
2657 350 265 -248 99 62 -47 -147 201 -124 -107 -4 70 -120 28 -78 -176 12 165 -26 -319 -260 -109 142
$$ packed form
2489D8M9j83j9J48N1k40P3K6r7J68j1j97O6J05J04j53J66j33J87j19k33N1J9J85
2513F1j20J1p5l1j4M28l26J09oq5L3J16j7l10J84N1j20J16R2j54J34j91j3K9J2
2538h6J67m5kj09J07K5m8K90l44j33J81j29M0J34j38k00M41k47K84k89k1K93k82
2561a11J94k5j49M2J07j12J03j72K25j73K79k63K7J58K9l82J65R9m07O84k49p2
2583cN5p7N6l17L5K32J8k08K53m5L27l34K3M08m71L0r4J62J11K1Lj09l51J90K4
2608f1j74L98k15M8M9k01J64n1J59j47O4j59J61M3j70J55j38M3M6q6N4o8K76j06
2632H4j82Q6K02k52J76J5p5kk3J4j40P5p3Lj7L78k60Q4k04J25k0j50K36n0L20
2657C50q5n13L47l7j09j00L48l25J7J03P4j90J48j06r8J88J53j91k93N9J51K51
$$ plain form
2679 142 -66 54 -219 -179 -121 165 147 -274 276 -31 -72 -8 8 -93 -144 60 -66 60 -25 -5 -111 -29 -99 62
2703 62 -132 125 -86 63 163 2 -19 -195 66 -247 171 75 -94 139 41 -3 22 -57 110 -29 -43 63 -162
2726 -162 50 36 162 -38 -81 84 -114 -100 -243 -71 -222 60 -322 -38 66 -31 76 51 -18 80 180 -253
2748 -253 222 31 4 104 -57 -136 305 156 1 -90 -130 -16 44 -43 -41 -53 -77 -124 315 -77 -205 -22 85 33
2772 33 69 -291 -95 27 -15 44 -143 32 116 206 166 110 -17 -55 66 204 -243 -46 39 220 -84 -160 -46 -50
2796 -50 165 -17 87 94 -63 -192 159 174 121 -96 60 72 -198 205 150 -92 211 -184 -164 235 -207 -31 192
2819 192 57 -125 403 -107 192 72 -14 47 167 -233 -64 -3 -109 -46 87 100 180 2 220 -285 -130 23
2841 23 26 99 -40 -130 79 -146 148 116 -66 -34 45 244 210 43 -22 54 19 144 487 101 28 33 39 -66 -32 -19
$$ packed form
2679A42k08J20k73M0N8K86j8m21N50l07m1O4J6j01n1K04j26J26q5K0j06Q2p0J61
2703F2j94K57k11J49J00j61k1j76K61l13M18r6j69K33r8m4K5p9J67j39j4J06k25
2726a62K12j4J26k00m3J65j98J4j43J72j51K82l82K84J04r7J07k5o9R8J00m33
2748b53M75j91k7J00j61p9M41j49j55r1m0J14O0q7Kj2k4m7M39l92j28J83J07n2
2772C3L6l60J96J22m2N9j87J75Q4R0m0n6j27l8J21J38m47J97Q5J81l04p6J14m
2796e0K15j82J04Pj57j29L51J5n3k17J56J2k70M03n5k42L03l95K0L99m42J76K23
2819A92j35j82N28n10K99j20q6O1J20m00J69O1j06O3J33J3Q0j78K18n05J55J53
2841B3LP3j39r0K09k25K94l2j82L2P9J99l4j67o5P6l5J25L43l86p3NOj05L4J3
$$ plain form
2867 -19 30 200 -80 228 -8 23 200 -16 70 89 -81 88 -21 -82 34 6 -7 -179 -126 78 41 217 -162
2890 -162 -206 198 -166 -180 -2 -24 52 96 191 64 120 -88 182 154 75 121 -125 -366 -243 -164 -8 176 43 -102
2914 -102 -98 176 302 63 -61 51 -47 39 115 112 35 114 -64 251 -134 -48 -175 -45 48 -64 -102 93 258 0
2938 0 19 202 -151 -101 -14 -298 0 -2 40 148 -192 129 -138 -291 -143 -6 -99 -43 -216 176 -129 284 174
2961 174 55 35 114 281 62 23 -20 -72 -73 405 -86 241 11 -7 -176 -2 -8 -106 -52 -73 -2 -187 98 121 -41
2986 -41 -61 6 121 -213 167 -64 -77 176 -21 60 -9 -243 50 -92 73 65 110 74 -33 169 -125 -110 14 -55
3010 -55 -50 194 -65 -42 -168 -49 48 11 30 -289 -41 278 -246 -43 9 -308 -156 -123 -151 -39 117 -90 28
3033 28 57 -48 -110 -27 91 245 -96 85 205 134 -207 292 199 25 -1 132 79 160 43 -55 74 -277 17
$$ packed form
2867a9M9J70k80L08k36L1J77k16Q6J9j70J69j09o1J16k8j3j72N3K04l7J76l79
2890a62m4M04l64j4J78k2P6M4R5j27N6k08K70k8p9M6k46k41J23P9J56J84j33j45
2914a02MK74J26k39j24J12r8Q6P6lp7P9j78L15l85Q6j27J30R3j12l8J95J65k58
2938@J9J83l53N0Q7k84K98kM2J08l40L21k67j53J48J37r3N6j73L92l05M13j10
2961A74j19k0P9J67k19l9m3n2jM78m91L27k30j8j69J74or8N4k1P1j85K85K3j62
2986d1k0O7J15l34L80k31j3K53j97Q1o9k34K93j42J65qM5l6j07K02k94J5J24o9
3010e5NK44k59K3j26J19R7l7J9l19K48L19n24K03N2l17J52L3k8J12J56k07J18
3033B8K9j05o2Q3J18J54l41J81J20p1l41M99r3j74k6J33n3Q1j17r8J29l51K94
$$ plain form
3056 17 -66 461 -73 138 -8 137 -40 -38 182 292 -1 228 -277 -61 -31 -15 -29 -7 124 221 -4 -12 159 290
3080 290 -45 181 103 -38 105 7 7 313 41 -121 -259 84 -121 -127 272 -30 153 244 -45 -167 -116 148 239
3103 239 -137 102 -151 222 -42 184 -246 -239 28 42 96 -96 -42 118 265 -186 76 331 -14 -293 109 337
3125 337 -34 2 77 -75 -56 29 149 -27 -186 77 -8 51 -173 -4 -7 -215 9 -137 236 205 11 -50 -124 -118
3149 -118 157 141 -201 41 8 -55 152 155 -75 -18 -284 28 -65 202 -73 -132 -44 -57 -21 24 -101 -260 185 14
3173 14 -29 148 -138 -135 34 257 -223 -123 12 -182 3 81 191 115 189 -92 198 121 -177 189 -186 -100 105
3196 105 -29 -71 76 -12 -145 85 135 211 -53 47 -122 59 119 -9 199 87 122 -43 95 -100 150 25
3218 25 -12 -69 259 -101 -25 -36 34 -37 -66 76 -360 13 189 -41 -145 -291 114 128 -12 -193 -10 52 125 -165
$$ packed form
3056A7q3N27n34K11j46J45j77KK20J10k93K29n05K16L0J6j4K2J31R7k25qJ71J31
3080B90l35K26p8j41J43r8%L06k72j62j38L43k05oL99l02J83R1k89j22N1K64R1
3103B39l76K39k53L73k64K26m30PK67J4N4j92N4J60J47m51K62K55l45k79M02K28
3125C37l71L6P5j52J9Q5J20j76j59K63q5N9k24J69lk08K24j46L73l1j94o1p4O
3149a18K75j6l42K42l3o3K07Lk30N7k66L12r3K67k75n9Q8j3L6M5j25j59M45j71
3173A4m3J77k86LJ69K23m80J00J35j94J85P8J10p6P4k81K90p7k98L66l75Q6K05
3196A05j34m2J47q8j33K30N0P6k64J00j69J81O0j28K08j12L5j65J38j95K50j25
3218B5l7n7L28l60P6j1P0p1k9J42m36L73J76k30j04j46M05J4j40j81J83O2P3k90
$$ plain form
3242 -165 -18 68 55 56 -11 -139 24 -75 -39 -74 238 19 -16 -118 -116 92 -269 -186 40 213 -189 161 -53 47
3266 47 152 237 219 -281 34 191 3 261 -244 -30 -268 -181 -65 -1 -480 -23 -141 -132 -78 -38 85 -43 -273
3289 -273 144 1 36 123 9 -56 117 42 46 -8 88 115 42 55 -168 136 -46 65 29 50 95 22 186 -67 -83
3314 -83 18 -162 -248 -67 -89 -20 239 369 16 253 -197 -95 -8 201 12 122 -12 -95 -102 77 222 -61 -316
3337 -316 -89 22 -145 -60 72 -7 13 -42 27 131 -106 -146 -79 -5 -221 154 150 149 -34 0 -65 -101 -34 -21 -54 137
3363 137 -193 -29 75 118 -70 -142 119 77 66 -35 194 -40 1 9 -78 -14 -33 -101 77 -175 176 -132 188 -100
3387 -100 -72 51 71 -10 95 149 -211 -32 192 -91 220 -59 105 171 350 179 269 49 -5 113 -107 19
3409 19 -73 137 -303 254 106 -77 48 4 -100 -11 -65 8 -43 -21 112 36 40 86 -28 191 21 18 180 61 -227
$$ packed form
3242a65J47Q6j3Jo7j28J63r9L6l5L12k19l5j02KK08l61Q3K26J73m02L50k14J00
3266D7J05Q5j8n00L15J57j88K58n05K14k38Q7J16O4m79M57j18RN4M0J23j28k30
3289b73M17j43L5Q7j14o5J73p5Mn4R6K7p3J3k23L04j82J11l6K1M5p3J64k53j6
3314h3J01j80q6J81k2O9K59J30l53K37m50J02Q7K09j89J10j34q3pJ79J45k83k55
3337c16K27J11j67Q5J32p9K0n5O9J04k37m0O7P4k16L75mjj83L4o5l6O7J3l3J91
3363A37l30J64J04M3j88p2K61m2j1j01K29k34M1Qq7O4j9o8J78k52L51l08L20k88
3387a00K8J23K0q1J05N4l60J79K24k83L11k79J64O6J79j71R0k20n4J18k20J26
3409A9r2K10m40N57j48j83J25m4j04Q9n4P3n1K2J33p6MM6j14K19j70lJ62j19k88
$$ plain form
3434 -227 -160 -43 10 -128 108 -34 18 106 72 61 -212 224 -79 59 290 -47 50 73 48 78 61 -113 321 -118
3458 -118 -130 7 252 138 293 37 -37 44 -50 107 -170 -80 -221 -32 108 -146 -130 17 25 -65 -90 24 164
3481 164 -54 -60 -62 22 84 -37 443 -122 -135 102 166 -218 -137 106 281 130 114 -83 -91 87 -58 -160 114 62
3505 62 19 -54 105 6 -255 52 42 74 10 -60 -89 -54 40 68 40 -253 -26 74 67 117 -52 123 -166 92 -2 -8
3531 -8 141 -197 -278 -27 150 -122 -59 134 107 -242 -76 1 -54 40 149 36 17 167 203 -184 204 -190 -191 -277
3555 -277 -19 88 -57 161 -31 -118 133 57 296 -75 -21 148 -220 -44 261 312 38 42 157 -183 -207 -6
3577 -6 197 -130 -124 -60 -255 148 -94 84 -18 66 -32 -169 -139 85 55 33 130 62 -14 -33 109 186 57 -172 -176 12
3603 12 229 -42 -78 -195 -117 33 75 -120 -26 -138 -180 182 -191 -41 97 172 -237 13 -11 56 -241 -189 9
$$ packed form
3434b27O7J17N3j38K36j42N2Q8l4j1k73M36l03J38K31l37R7K3k5L0j7j74M34m39
3458a18j2J37K45j14J55k56p4Q1r4J57k77R0j41J89J40k54J6J47Qr0k5J14J40
3481A64k18okQ4O2j21M80n65j3K37O4l84Q1K43J75j51j6j97qJ78j45j02K74n2
3505F2m3p3J59r9k61L07j0L2o4p0k9L5R4K8k8k93K27J00pN0j69J75k89K58r4o
3531hJ49l38q1K51J77k72O3J93k7l49J66P7n5R4J09j13j9J50L6l87L88l94jq6
3555b77K58J07j45K18j92q7K51p6K39l71N4J69l68J76L05N1k74MJ15l40k4K01
3577fK03l27OO4j95M03k42J78j02Q4r8j37L0K24l0k2R7o8p6j9J42P7j29k29mJ88
3603A2K17k71l6j17P8J50M2j95R4j12m2L62l73J50J38P5m09K50k4O7k97N2J98
$$ plain form
3626 9 71 -169 52 -203 -138 197 -64 3 -37 223 4 69 -33 -196 306 77 -179 80 234 -220 -30 -132
3648 -132 60 -115 -125 -79 35 -16 33 -62 -35 -19 94 93 -165 -129 107 116 -66 210 -183 21 54 65 44 52 -105 67
3674 67 60 40 -65 20 -99 174 214 9 -130 -84 27 29 105 170 -2 -185 78 -44 38 241 181 -82 166 145 -224
3699 -224 65 -89 -81 233 -128 -196 -4 153 -124 70 8 203 -30 -159 -71 -149 -20 -108 -80 -133 55 40 271
3722 271 116 -115 -133 -74 87 -88 -206 59 -87 254 -68 59 97 -58 -137 39 -102 87 25 -17 95 -137
3744 -137 -42 274 -67 78 0 13 102 -155 -71 -10 -118 115 -3 -131 -76 79 -15 90 39 -62 -47 110 49 -41
3768 -41 140 339 -302 67 -10 83 244 -126 -105 110 -215 -25 52 90 -57 64 -131 127 80 -3 285 -266 -51
3791 -51 56 113 68 -109 11 101 20 279 162 279 -222 -184 66 -100 -41 16 16 199 -22 -164 205 -49 -108 -36
$$ packed form
3626IO2k40K21k55O5L35k61O7m0K60k19O5j02j63N02k29k56K59J54m54J90j02
3648a32J92j75j0M6J14n1M9r5K7J6J13jk58L6K36Rj82K76l93K04L3J1k1Qj57J72
3674F7pk0j05Q5j19K73M0k05j39M6J11KP6O5j72j83K63j22Q2K03o0k63K48k1l69
3699b24K89j54QL14l61o8J92J57k77J94o2J95k33j29Q8p8J29q8K8n3J88j5K31
3722B71j55k31j8N9J61j75j18K65j46L41l22J27L8j55p9J76j41J89o2m2J12k32
3744a37R5L16l41J45p8J3Q9k57Q4O1j08K33j18j28N5J55r4J05n1j01J5J57o1r0
3768d1J81J99o41L69p7R3J61l70K1K15l25J90P7L8j47J21j95K58m7q3K88n51K15
3791e1J07N7m5j77J20R0q1K59j17J17n01L8K50j66N9N7%J83k21j42L69k54n9P2
$$ plain form
3815 -36 -107 165 84 -131 117 -43 -150 39 290 75 -121 1 -187 113 189 -16 -2 -77 -83 111 110 -216 144
3838 144 -120 -235 21 101 -231 -149 119 163 -187 -24 104 -203 114 -77 -84 57 -34 -132 47 -170 52 27 -16
3861 -16 21 33 188 36 68 -66 -6 -3 65 -36 64 -32 24 201 -37 -167 38 -71 -192 98 -157 -224 108 114
3885 114 -12 20 -74 -5 38 -30 2 141 -209 -236 241 31 44 246 -127 -213 -255 -362 -8 -60 -189 171 -105 -43
3909 -43 -27 134 98 -240 -146 51 284 44 -26 30 -113 163 15 12 -83 338 -5 -20 -78 52 -153 -8 9 95
3933 95 36 23 -12 -8 17 -180 -23 -95 -87 108 -266 -97 -99 -33 -257 -40 -184 -132 21 50 -24 342 81 111 218 2
3959 2 58 56 -96 -171 -79 110 -144 129 -75 -107 200 -199 -17 15 -90 -270 -125 -150 -251 227 -32 -401 -168
3982 -168 137 41 -100 -4 195 318 36 -9 1 -6 -152 34 -76 -386 -210 35 -122 148 63 -105 -140 19 -209
$$ packed form
3815c6p1K72q1k15K48j60j07J89K51k15j96J22j88L00P6k05J4p5oJ94jl26L60
3838A44k64j15K56Q0l32Q2K68M4l50J63J28l07L17j91pJ41r1r8J79k17K22k5m3
3861a6L7J2J55j52L2j34O0LO8j01J00r6N6J77k38j30K05j09j21K90k55o7L32O
3885A14j26L2r4O9M3o8L2J39l50k7M77k10J3K02l73q6m2j07L54n2j29L60k76O2
3909d3J6J61l6l38R4J97K33k40p0N6j43K76j48lr5M21l43j5n8J30k05J45J7Q6
3933I5n9j3l5MK5j97J57p2QJ95l74J69kO6k24K17j44N2J53K9p4L66k61L0J07k16
3959BN6kj52p5R2J89k54K73k04l2L07l99J82L2j05j80J45k5j01M78k59l69K33
3982a68L05r6j41R6J99J23k82m5J0pj46J86j10l10J76K45j57K70q5j68l5J59k28
$$ plain form
4005 -209 -185 243 -21 23 282 -138 -13 178 -50 -92 -31 51 124 83 -75 130 -37 50 68 -207 76 100 51 85
4029 85 20 -140 -97 -26 24 49 39 61 -50 -72 48 -76 -236 148 -90 -151 109 90 79 -7 -69 73 177 -258 95
4054 95 47 3 172 -73 -13 100 -7 163 -7 149 256 176 272 166 113 235 286 -305 -123 94 -133 -61 -43
4077 -43 -74 29 92 125 7 -80 101 80 -165 -68 -50 36 159 -187 116 104 109 -102 -143 158 45 213 -97 111
4101 111 48 -95 -18 92 81 -50 25 -15 -132 -67 -191 14 38 40 -126 22 -58 93 84 291 187 11 161 186
4125 186 -63 -302 0 121 -103 -1 104 42 83 151 46 5 114 99 233 48 186 60 107 -91 -40 86
4147 86 -20 219 116 -151 -88 124 11 -127 -117 146 91 124 -171 195 46 -113 -53 199 -185 -54 210 -130
4169 -130 -114 -151 171 409 -139 34 19 -22 137 -214 -59 -108 -130 -185 -115 23 -96 52 146 113 86 -214 130 -55
$$ packed form
4005b09K4M28k64M4K59m20J25J91k28m2O1Q2P3m1j58K05j67Q7J8k75K83K4m9L4
4029H5o5j60M3P1N0K5j0K2j11k2J20j24j60L84k38o1K60j9j1q6o2J42J04m35L53
4054I5m8m4J69k45O0J13j07J70j70J56J07q0R6j06n3J22N1n91J82K17k27P2J8
4077d3l1J03O3L3j18q7J81k1k45R7J8Q6J23l46L03j2Nk11m1L01j13J68l10K08
4101A11o3j43P7J10j1j31P5m0j17O5j24K05K4Kj66J48q0J51rK07j04j76J50K5
4125A86k49k39L02J21k24J02J05o2M1O8j05m1J09j5J34j85J38j26M7j98N1J26
4147H6j06K39j03k67O3K12j13j38J0K63n5L3k95L66j49j59O0K52l84J31K64l40
4169a30J6l7L22K38n48J73j5m1J59l51J55m9k2n5P0J38j19J48R4l3k7l00L44j85
$$ plain form
4193 -55 -25 96 2 58 -16 -78 162 -100 -169 145 -61 85 203 -92 -37 201 110 -58 -90 123 -320 -27 78
4216 78 -23 125 -219 -7 -43 257 46 216 -4 188 -99 66 -171 85 68 111 -71 -209 48 -40 -26 95
4238 95 -252 -57 21 -236 134 -113 172 167 -20 -194 19 52 -167 -190 -140 64 -315 -19 47 154 247 139 -246
4261 -246 -121 -113 -59 -271 81 -4 51 -42 9 184 -144 -45 226 -35 -75 14 -56 -34 104 -95 210 -253 -104 -86
4285 -86 -65 45 41 -12 -196 -46 87 115 92 79 -51 -19 194 62 -198 -212 30 -33 164 13 -26 -97 -191 -177 23
4310 23 32 146 4 -75 47 243 116 -134 81 129 -63 -122 4 -35 -71 -82 -366 21 -123 -145 28 -87 4 112
4334 112 68 -127 153 -50 -84 -129 153 35 188 6 66 -86 137 -180 38 -81 -167 152 -70 87 72 -48
4356 -48 263 -73 442 52 86 128 40 -48 85 98 109 89 90 126 -96 6 -70 103 89 -67 -35 180 263 -70 47
$$ packed form
4193e5L0J21r4N6p4o2K40k62o9L14k06J46J18k95N5K38r1j68l2K13m43K93J05
4216G8j01J48l44K12l6L00k11J70k20J92k87J65k37K56j7M3j82j38K57q8J4J21
4238I5l47J95P8k57L70k47K85nj87j74K13L3k19k3N0K04l79K96O6J07R3j08l85
4261b46J25QN4k12L52q5N5r3N1J75l28R9K71k61m0Q9p0K2J38j99L05m63J49J8
4285h6K1J10mn3j84J50J33K8k3j3j30L2K13j32k60j4K42o3J97j51l9p1r4J4K00
4310B3RJ14j42p9J22J96j27k50K15M8j92n9J26l9l6j1k84L87j44k2J73j15R1J08
4334A12m4j95K80k03l4m5K82j18J53j82O0j52K23l17K18j19q6L19k22J57j5j20
4356d8L11l36N15l90L4M2q8q8J33J3J1k0JL6k22J02p6J73j4j56L2K15Q3l33J17
$$ plain form
4381 47 2 -132 70 2 153 -252 -15 118 -211 -62 127 -192 71 177 196 -171 -261 -21 39 -238 -147 -60 -93
4404 -93 25 -137 -103 -273 -66 -161 253 129 109 -299 -11 -202 -90 -10 74 41 30 -75 -140 -53 201 -97 19
4427 19 -1 101 158 47 -7 345 208 -145 67 49 -192 -224 86 -50 -32 -53 147 -85 -23 -93 97 -230 -106
4450 -106 -81 54 117 190 -170 -169 63 -120 139 -281 -144 -3 176 41 39 -107 136 -120 -151 -33 174 -145 -163
4473 -163 -175 -279 -3 -40 -102 -284 216 26 28 -39 -233 70 67 64 93 224 59 7 155 24 -32 144 -68 1 -73
4498 -73 -177 64 22 -115 -185 -45 -216 -25 -120 -175 67 -81 147 -140 223 -48 182 -102 -79 111 -157 -141
4520 -141 56 28 -140 -25 74 41 155 63 -96 103 125 -336 -48 90 -148 84 159 -190 122 -3 145 -215
4542 -215 -42 -139 78 -102 185 139 -1 -153 17 60 1 150 -3 -74 -2 -18 -178 94 112 191 -92 221 -184
$$ packed form
4381D7m5j34K02o8J51m05K37J33l29J49J89l19K63J06J9l67r0K40O0k77R1Q7l3
4404i3J18j62L4j70K07r5M14j24k0m08K88j91J12Q0Q4l3j1j05o5Q7K54k98J16
4427A9k0J02N7j11n4L52j37l53K12j8k41l2L10j36J8k1K00k32O2p0J90l27J24
4450a06K5J35O3P3l60JK32j83K59m20J37J41J79j35kj46K43k56l1J18K07l19j8
4473a63j2j04K76l7o2j82N00j90Ko7j94L03llK9J31j65n2J48j31n6J76k12O9p4
4498g3j04K41m2j37p0J40j71J91r5n5K42j48K28k87L63k71K30k84K3J90k68J6
4520a41J97k8j68J15R9l3J14r2j59J99K2m61K88J38k38K32P5l49L12j25J48l60
4542b15J73r7K17j80K87m6j40j52J70M3n9J49j53p1P2j6j60K72J8P9k83L13m05
$$ plain form
4565 -184 175 14 -45 -11 -77 154 72 -48 -152 151 -184 221 -1 -39 -98 175 -50 -103 -73 140 98 -61 49
4588 49 -102 70 -100 53 8 153 -33 13 114 263 -103 -44 -103 257 1 -82 127 2 -177 -96 -105 -95 31
4611 31 -149 -1 -99 -57 -196 -132 127 210 50 -25 -95 137 36 -91 77 128 -17 162 -195 -185 87 28 -157
4634 -157 26 -90 54 103 209 -88 103 -1 149 20 -150 -105 -185 -156 103 9 27 380 -82 -39 247 -88
4656 -88 -125 29 119 -50 -115 -58 40 -5 -82 -155 -292 -89 10 -127 -286 120 -71 -61 -38 -77 39 154 86 265 -294
4681 -294 -205 -32 217 209 85 -1 -8 -2 151 96 67 202 -16 -134 -21 99 -77 -16 -148 -242 -299 4 -264 -224 -318
4706 -318 61 -55 7 -90 167 341 -25 208 -172 30 -174 13 82 175 -289 81 255 225 -2 19 -43 -83 184
4729 184 -72 -43 -90 382 57 200 -177 -95 93 283 154 40 94 -14 -7 230 88 126 234 -82 -161 157 223
$$ packed form
4565a84L59j61n9L4o6K31q2j20j04L03l35M05k22l8n9K73k25n3L0K13m2j59J10
4588D9j51J72j70J53m5J45j86M6J01J49l66N9n9L60k56q3K09j25j79Q1rJ0J26
4611C1j80J48r8M2j39O4K59Q3j60p5p0K32j01j27J68N1j45J79l57J0K72n9j85
4634a57J83j16J44M9J06k97J91j04J50j29j70M5q0K9K59r4J8L53m62M3K86l35
4656h8l7J54R0j69o5N7R8m5p7p3j37K03R9j37j59M06j91J0K3l9J16J15o8J79n59
4681b94Q9J73K49qj24q6pOJ53n5k9J35k18j18J13J20j76O1j32r4n7L03k68M0r4
4706c18L79j16O2r7K57J74l66K33l80K02k04J87O9R3m64L70J74l0k27K1o2m0K67
4729A84k56K9m7M72l25J43l77Q2J88J90j29j14N4j08PK37j42L8J08l16p9L18O6
$$ plain form
4752 223 47 94 78 90 -49 35 -349 -127 -167 -13 -81 -153 115 300 192 45 138 111 202 -135 -228 105 -191 42
4776 42 60 52 -124 -199 -99 28 -181 30 -43 338 -223 -104 -57 25 151 74 156 54 -160 69 -90 48 170
4799 170 245 84 -126 107 -90 -18 12 -15 419 64 129 30 -8 45 -182 -64 -107 47 -30 111 78 -76 -73 25 209
4824 209 132 101 -32 -194 20 264 -70 147 -228 -81 -289 65 75 -49 25 -136 -68 266 113 -174 -40 111
4846 111 -252 90 -22 77 -129 121 -148 27 -219 52 -167 -226 -131 -13 63 154 -135 -50 -112 -101 -19 20 41 6
4870 6 35 -60 43 58 32 125 61 -183 -125 51 -131 279 -98 83 -101 50 78 -139 2 -73 321 127 -131 -33
4894 -33 102 -105 79 -26 -58 -78 16 99 154 119 181 -131 -114 -34 -149 -14 144 48 -64 17 -218 49 -61 -138
4918 -138 113 -142 9 174 117 -146 194 -129 4 -63 118 -133 48 -38 -130 190 187 50 -135 -15 153 1
$$ packed form
4752B23j76M7j6J2j39Q4l84K22m0J54o8p2K68J85j08j47R3k7R1l37r3L33k96K33
4776D2J8qj76p5J00J27k09K11p3L81n61J19M7Q2J26p7Q2j02k14K29j59J38J22
4799A70P5j61k10K33j97P2L0k7M34l55O5r9l8N3k27J18m3J54p7J41l3j54LR8J84
4824B09p7l1j33j62K14K44l34K17l75J47k08L54J0j24P4j61O8L34j53k87J34J51
4846A11l63L42j12R9k06K50k69J75k46K71k19n9R5J18P6R1k89Q5o2J1Q2L9K1l5
4870FK9r5J03J5k6R3o4k44N8J76j82M10l77J81j84J51K8k17J41p5L94j94k58R8
4894c3J35k07J84j05l2k0R4Q3N5l5O2l12J7Q0j15J35J58r6j12Q1k35K67j10p7
4918a38K51k55J51J65n7k63L40l23J33o7J81k51J81q6r2L20lj37j85J20J68j52
$$ plain form
4940 1 53 -340 144 155 68 -96 -73 15 198 81 -241 75 -81 16 -64 151 -2 236 191 -17 -120 41 68 92
4964 92 66 132 -56 205 -26 -166 170 105 -93 -177 -71 -121 140 144 126 131 63 -366 142 -11 121 -155 108 115 -41
4989 -41 142 -84 26 106 47 -255 -243 32 -70 -150 123 -138 6 363 23 -20 -158 -73 -164 -82 -67 -125 21 98
5013 98 186 71 -73 140 -159 -39 128 -166 -91 90 134 88 280 -9 -26 152 -100 26 105 -267 -104 -71 28
5036 28 170 67 -369 92 41 -374 -37 120 37 125 96 -40 -19 -120 -90 0 -73 -178 -300 -106 273 -22 110
5059 110 204 -121 123 -136 -263 169 156 -115 -18 32 12 182 -163 47 133 -60 -131 165 95 -90 118 -100 -90
5082 -90 -62 -272 104 -79 -111 39 213 -94 -164 -9 28 318 129 -34 -32 -164 84 -44 81 -25 -6 163 252
5105 252 -182 -2 85 165 -127 77 17 245 -61 -85 -33 -72 72 -296 64 -58 -94 256 -62 -16 33 -117 -1
$$ packed form
4940AN2l93M84J1q7j64K3Q8J83j17l22L16j56R7q0K15j53K38m5k08j03J61K7K4
4964I2k6O6j88K61k31j40L36o5j98q4J06n0K61Mj8No8m29N08j53J32k76K63Pj56
4989d1J83k26J10Q0n9l02J2K75j02q0K73k61J44L57l40m3j38Q5r1Q2J5n8J46P7
5013I8Q8j15j44K13k99J20J67k94P5J81M4m6J92k89j7J78k52J26P9l72J63L3R9
5036B8J42j03m36M61n1m15L37J57q3Q8k9j36K1j01L0R0p3j05j22J94L79k95J32
5059A10R4l25K44k59j27M32j3k71R7N0k0J70l45K10Q6j93p1K96p0j85K08k18J0
5082i0K8k10L76j83l2J50J74l07p0J55L7K90j89j63Kj32K48j28J25j06J9J69Q9
5105B52m34J80Q7Q0k92K04o0K28l06k4N2l9J44l68L60j22l6L50l18M6M9j50J16
$$ plain form
5128 -1 196 44 129 -121 119 69 -144 148 -10 5 -54 238 -113 -143 -86 -75 -95 -24 203 -157 -37 158 148 13
5152 13 216 132 -52 -74 -195 118 -118 46 60 33 2 -144 13 -71 -65 -8 -248 -41 249 96 167 242 -174 -175 37
5177 37 -52 -160 -48 -163 -39 70 -381 75 267 -4 216 -21 -108 -22 -95 218 127 220 225 -142 -86 -22 185 10
5201 10 75 347 -184 -168 107 -27 165 21 -30 -58 -164 -139 -31 43 -301 -13 -186 116 -176 -13 227 6
5223 6 -73 -18 -44 -87 66 -220 259 75 200 66 -212 62 181 -124 -230 -170 184 185 -32 -122 -123 162 18 -45
5247 -45 -25 -47 -196 -137 175 29 -45 -141 41 -2 -165 -68 33 -25 -15 -35 154 -20 53 -6 110 96 -46 -70 -136
5272 -136 -158 -250 -42 -4 -8 -59 -116 90 -172 -302 -33 -15 -237 -203 0 -100 202 63 -106 -173 167 -273 -125
5295 -125 -176 192 127 -7 126 -342 121 -182 60 -176 -140 28 -232 -80 -11 16 -89 25 80 -228 31 145
$$ packed form
5128aJ97j52Q5k50K40n0k13K92j58J5n9K92l51l0N7J1k0P1K27l60J20J95j0j35
5152A3K03q4j84k2j21L13k36J64J4k7l1j46J57q4ON7k40K07K90j53P1P5m16jK12
5177C7q9j08J12j15J24J09m51M56J92k71K20k37q7Q6p3L13r1R3Nl67N6O4K07j75
5201A0O5K72n31J6K75j34J92j44n1k8j06K5J08P4l44K88j73L02k92J63K40k21
5223Fp9N5k6m3J53k86M79j84J25j34k78K74J19l05j06O0L54Jk17r0jK85j44o3
5247d5K0k2j49N9L12j46p4r6J82m3j63R7J01n8J0k0J89j74P3n9J16j4j42k4o6
5272a36k2r2K08L8mn1n7K06k62j30K69J8k22L4K03j00L02j39j69o7L40m40J48
5295a25n1L68o5j34J33m68M63l03K42k36L6J68k60J52O9K7j05J14N5l08K59J14
$$ plain form
5317 145 150 -251 26 145 19 -29 142 -7 -145 -120 98 24 6 22 -161 9 199 102 -69 -361 108 87 -127
5340 -127 -96 112 102 4 18 -12 88 -184 15 78 347 -63 130 128 30 392 61 5 46 -198 8 -61 94 -39
5364 -39 -84 -223 4 66 -72 59 -140 -58 -115 52 151 -73 -155 250 -58 54 291 143 311 49 39 18 17 -172
5388 -172 -83 -103 -227 256 104 53 444 -48 -33 -151 -118 -31 -132 -143 -7 -80 173 102 41 -125 79 -6 -145 -57
5412 -57 41 117 36 8 135 60 -111 14 255 -262 89 10 185 70 117 220 -75 -110 65 43 -60 -19 340 -15
5436 -15 261 84 102 178 142 -19 69 3 -172 -108 84 -107 52 -56 280 -94 -137 119 -186 -82 -175 -63 -51
5459 -51 41 -55 -28 -62 218 239 -145 -314 -129 15 -222 -51 128 -21 -7 153 67 39 188 -123 -116 92 -35 307
5483 307 191 26 -68 -158 5 -177 -145 -2 -168 147 202 -70 56 47 95 310 -38 -3 2 42 145 47 -36 -111 -34
$$ packed form
5317A45Nm01K77J19j26m8J71j49j38K5K18p4j8J6j83J70J90r7j71k92M69k1k14
5340a27L1K08j0r8J4l0J00k72J99O3K69m10J93kr8L62l31n6M1k44K06o9J55j33
5364c9m5j39K27O2j38J31j99Q2n7J67R9k24q2M05l08J12K37j48J68k62j0k1jj89
5388a72Q9k0j24M83j52n1L91m92J5j18L3Q7j01j1J36p3K53p1o1j66K04q5j39Q8
5412e7R8P6q1k8J27p5j71J25K41n17L51p9J75j15M7J03k95l5J75k2j03M1L59l55
5436a5K76j77J8P6l6j61Q8o6j75O4J92j91J59j08L36l74m3K56l05J04r3J12J2
5459e1R2r6K7l4K80K1l84j69J85J44k37J71J79j49J4J60q6k8J49l11PK08j27L42
5483C07j16j65r4r0J63j82L2J43j66L15N5k72J26rM8K15l48L5NM0J03r8q3p5P7
$$ plain form
5508 -34 182 205 -162 99 64 -177 -147 112 36 -58 -244 -146 -52 251 102 -163 1 -168 -36 173 29 -137 -75
5531 -75 23 52 183 119 -90 -129 -68 -86 -71 -168 -151 -294 0 -47 179 122 23 -81 -258 -147 115 -1 -91 161 -45
5556 -45 174 -307 -52 -28 51 -97 173 135 0 -264 27 -61 128 124 -61 125 96 95 63 27 -69 18 -159 70 63
5581 63 -86 -91 -75 -111 63 42 154 6 -55 10 -104 -95 -61 88 98 -117 -174 -77 -93 45 84 270 -55 -239 -310 74
5607 74 -46 70 145 -67 -408 47 14 226 180 -171 16 1 -144 -86 5 141 -6 -112 -13 272 -307 -103 -69
5630 -69 22 113 27 96 298 -20 -172 78 -137 -103 -264 -86 -92 274 80 20 198 124 -100 153 -75 -50 34 51
5654 51 171 -82 17 45 15 35 -262 37 -224 290 50 70 -113 76 -5 -62 -50 -272 -130 109 -78 -74 80 -114
5678 -114 -229 -13 -121 145 -51 0 33 82 0 98 -114 199 -144 -18 22 220 46 62 -132 -134 11 225 15
$$ packed form
5508c4K16K3l67K61l5k41L0K59p6r4j86R8R4L03j49k65J64j69J32K09j44j66O2
5531g5R8K9J31o4k09l9O1j8J5r7J7j43K94m7K26n7r9j04j77J11K62j16r0K52k06
5556d5K19m81K55K4P9j48K70l8j35k64K91q8J89mj85J86k9jl2l6r6Q7j77K29p
5581F3j49nJ6l6J74k1J12j48o1O5j14RL4J49J0k15n7R7j6J38L9J86l25j84p1L84
5607G4j20J16P5k12l41M55l3K12m6l51J87j5j45N8R1J36j47j06R9K85n79K04L4
5630f9R1R1q6O9K02l18j52K50k15L4j61J78oL66j94o0J78p4k24K53k28K5Q4J7
5654E1J20k53R9K8l0K0k97K99k61N14k40K0j83J89q1n7J2k22J42K39j87MJ54j94
5678a14j15K16j08K66j96N1L3M9q2R8k12L13l43J26M0J98j74J6j94kJ45K14k10
$$ plain form
5701 15 -284 -86 -201 -59 15 -116 -87 21 -141 -91 -64 -58 20 -5 46 228 45 50 -126 -96 200 -89 68 -104
5725 -104 232 -159 -78 132 31 259 149 -235 221 -144 32 -94 -52 18 53 5 -350 225 -217 90 96 238
5747 238 -241 2 91 56 155 295 -115 -14 -63 -69 -60 -86 91 -224 -48 -92 -151 235 17 -43 -39 7 206 -12 -223
5772 -223 -15 -169 -14 37 129 -64 84 -224 94 181 49 28 142 137 -17 -34 -28 248 138 7 71 104 -38 -115
5796 -115 -87 -58 94 -25 -76 -81 -193 78 227 27 -393 83 131 -145 118 -29 -175 -191 -18 14 -135 183 205
5819 205 -213 -257 -155 57 183 88 101 -26 21 -77 -74 -151 19 -73 -193 189 14 -59 214 -122 205 -89 34
5842 34 -67 137 71 -8 -144 -24 -59 -60 -141 -108 29 95 -305 124 -44 66 265 151 103 -25 8 88 8 -67 99
5867 99 238 100 -85 41 -104 127 -203 104 -65 -156 85 -89 244 102 -38 61 -189 48 -6 194 -21
$$ packed form
5701A5k99J98j15J42P4j31K9J08j62N0K7OP8k5N1J82j83Nj76L0K96k89J57j72
5725a04L36l91Q1K10j01K28j10l84M56l65J76j26M2P0L5m8l55N75m42L07OJ42
5747B38m79K43Q9l5R9J40m10J01m9oRk6J77l15J76m4n9L86k18o0MM6J99k18k11
5772b23K08j54J55N1R2j93J48l08L18Q7j32k1J14nj54j7OK76j10j31O4L3j42p7
5796a15K8K9J52j19n1nj12K71J49k00m20M76M8k76K63j47j46j6J73L2j49L18K2
5819B05m18m4J02K12J26r5J3j27M7r8Lp7J70r2j20L82j75p3K73l36L27k94J23
5842C4j01K04o6p9j36J20l5jq1L3J37O6m00M29j68J10J99j14m8j28L3Q0q0p5J66
5867I9J39j38j85J26j45K31l30L07j69r1K41j74L33j42j40R9k50K37n4K00k15
$$ plain form
5888 -21 -79 -20 -439 66 -69 253 201 -58 -123 95 123 4 -33 134 280 175 31 208 -123 19 101 6 28
5911 28 79 -3 -28 210 -144 19 42 40 -78 244 -41 24 178 34 96 -121 44 8 -61 -141 -53 194 -86 105
5935 105 -60 -197 39 -5 -123 115 197 -187 27 167 -339 -106 275 227 -214 -38 260 -1 304 -43 -190
5956 -190 -34 229 28 169 -257 -117 -123 96 -56 121 -82 87 -213 55 243 -48 -106 199 141 -198 -239 125
5978 125 -48 -77 -10 255 127 -26 -12 -144 353 70 -97 -59 25 -29 77 269 157 -79 -185 139 168 173 -137
6001 -137 83 -201 169 -25 -95 22 19 -43 11 132 -53 -243 198 75 6 8 91 88 -23 -47 -174 -108 31 -190
6025 -190 -52 70 138 161 -229 -24 169 108 -120 30 -79 -136 1 324 -61 -154 92 258 132 67 87 -91
6047 -91 41 -310 125 -186 182 -81 -147 -67 -26 -300 40 77 -163 -34 -82 -152 22 -133 -4 163 168 41 -190
$$ packed form
5888b1n8N9m19N05j35L22n2k59o5K18K8j19l7J67J46j05j44J77l31J42Q2r5K2
5911B8N1q2k5K38l54J63K3kj18L22k85O5J54j44O2k17J65l6o9q0Q8K47k80J91
5935A05j65j37K36m4j18K38Q2l84K14J40n06K33L81m8m41J76K98k61L05l47j47
5956a90J56K63k01J41m26J40oK19j52J77k03J69l00K68J88k91n8L05n8l39m1L64
5978A25j73k9O7K65j28j53J4j32M97k83j67L8Q4n4J06J92j12k36j06L24K9Nl10
6001a37K20k84L70j94p0J17lo2N4J21j85j90M41j23o9KQ3lj11k4j27O6J39k21
6025a90J38J22O8K3l90K05J93o1k28J50j09n7J37L23l85r3K46J66j26o5K0j78
6047i1J32l51M35l11L68k63o6Q0M1k74L40L7k40J29m8p0J74j55J29J67Nj27k31
$$ plain form
6070 -190 175 -32 268 176 112 -89 98 -18 -9 -60 54 148 -27 48 -39 74 -62 -25 -123 8 -133 165 -182
6093 -182 213 74 289 102 5 97 -5 -290 334 -52 112 7 -102 -13 343 213 -137 -166 9 29 11 -63
6115 -63 91 -140 59 -362 -173 235 138 74 176 188 251 123 -19 -96 -9 -23 -43 -15 62 -69 -21 -64 138 184 -287
6140 -287 -262 328 -106 44 11 81 2 -39 396 -188 38 -60 -18 -184 98 -13 -119 17 115 195 -129 117 52
6163 52 -17 -104 60 -30 -26 -38 101 100 -74 -244 -19 -29 -4 -371 37 72 -86 -41 -21 38 -95 138 2 55 109 308
6189 308 -74 -122 220 98 119 -30 -120 -37 -95 9 -327 -204 -320 -323 -169 -93 25 -156 -221 78 8 33 -185 191
6213 191 -158 29 163 -85 -3 184 83 -60 -27 74 73 74 12 54 -167 -39 40 -25 -26 23 -72 -254 -66 -173 6
6238 6 -87 -295 88 -190 97 -114 69 -113 151 92 -152 -117 -155 -93 31 154 155 -63 -46 -29 -31 120 -228 32
$$ packed form
6070a90L65k07L00r2o4k01J87j16Rn1J14R4j75P5q7J13j36L7r8J31j41K98l47
6093a82L95j39K15j87r7R2j02k85O24l86J64j05j09Q9L56j30l50k9J75K0j8p4
6115f3J54k31J99m21J89M08r7o4J02J2O3j28j42p7Q7j4k0K8P7j31M8m3K02M6m71
6140b87K5N90m34J50l3P0p9m1M35n84K26r8M2j66K82j11j06J36R8Q0l24K46o5
6163E2o9q7J64r0Mj2J39jj74j70K25j0K5l67M08L5j58M5K0N9j33K33j36N3N4J99
6189C08l82m8L42j22K1j49r0Q3n8J04l36J23j16lJ54P6J18j81o5K99p0K5k18L76
6213A91l49J87J34k48Q2J87j01j43L3J01jJo2M2k21J28P9o5jM9r5j82J88j07J79
6238Fr3k08L83k78K87k11J83j82K64n9k44L5l8O2J24J23Jk18J7J7kJ51l48K60
$$ plain form
6262 32 -60 -189 48 76 -173 173 152 45 85 515 35 -107 14 -215 184 -323 -67 82 -126 -9 86 89 24
6285 24 58 -3 -394 8 99 -7 9 -308 34 -164 -125 -248 -5 40 50 252 -211 -148 117 79 149 -75 126 96
6309 96 106 -21 -127 -141 -8 90 354 -76 -60 -124 59 105 -83 78 -236 -201 185 104 186 -146 -242 55 -197 -101
6333 -101 -193 -53 146 -90 -104 -35 137 231 150 5 61 -111 -117 101 155 -27 -172 -155 126 77 131 48 142 109 270
6358 270 -27 18 254 -32 8 -162 -80 -152 -29 -370 170 -9 -201 271 38 -27 -102 -76 -135 -21 -116 153 171
6381 171 -24 -137 192 -249 -192 10 143 -190 -37 -227 11 -83 -380 7 107 -60 -5 12 93 -105 -181 -41
6403 -41 133 -17 -41 192 40 108 181 -133 -97 -68 44 -8 397 72 -318 -307 -60 -24 187 14 -46 -78 165 -254
6427 -254 220 -127 307 359 -141 -38 138 77 -104 71 14 -27 213 -173 -23 -147 122 143 47 -54 107 107 206
$$ packed form
6262C2r2j29K37K8k49L46k1j07M0M30m80j42J21k29L99n07K56J49k08J17R5Lo5
6285B4L4o1l91M02R1j06J6l17L42j98L9j23K43M5J0K02m63O3K65l8P0k24K01l0
6309I6J0j27j06j4J33R8K64m30J6o4J83M6j88J61l14L5L86q1Q2l32r6K97k52R6
6333a01r2J40J99k36j4O9J72R4q1j45N6j72oK18N4j82j45J7K81m9N4q3R4l3J61
6358B70k97M5K36k86M0j70Q2p2J23l41N40j79j92M72k33o5p5K6n9J14r5K69J8
6381A71j95j13L29m41N7K02J33l33J53j90K38r4k97L87J00j67N5J7Q1j98p6J40
6403d1J74j50k4K33j52O8P3l14L6K9J12n2M05l25l90J1K47L6K11j73o0l2K43m19
6427b54M74l47M34N2n00J03J76o1j81J75n7m1K40l86J50j24K69K1r6j01J61%R9
$$ plain form
6450 206 224 333 129 -93 105 58 3 102 127 66 22 -76 -252 60 -112 101 23 -81 270 200 -173 39 -177
6473 -177 -183 173 -162 -176 162 101 -199 -109 179 -74 154 -84 -29 -176 -24 -162 77 147 140 140 -71 -86 136 -10
6497 -10 -43 -213 -120 81 -36 26 -292 -79 -47 -131 61 265 -67 -167 -9 189 -139 401 -69 56 271 -52
6519 -52 -222 33 -90 -193 -99 158 80 13 92 -212 273 248 109 -3 33 166 -161 63 99 87 269 -161 -260
6542 -260 -42 -146 -128 3 -66 -252 -273 196 -276 -55 -108 -127 -193 -79 93 132 -7 226 81 133 -115 40 -82
6565 -82 147 -506 -96 108 -103 -142 123 82 131 39 -97 -47 -118 34 -90 -86 76 13 -14 349 -20 203 -29 -102
6589 -102 -28 -232 70 8 -30 -20 -40 75 247 195 162 88 -108 -167 -54 -26 18 120 -152 -84 147 -36 271 -55
6613 -55 24 99 95 147 -72 13 83 -15 -169 -147 -78 -185 279 23 -137 -74 120 -153 -43 -21 -244 -4 -255 121
$$ packed form
6450B06J8J09k04k22J98m7n5R9K5o1m4r8j76L12j72K13p8j04L51p0l73K12k16
6473a77oL56l35j4L38o1l00R0K88k53K28k38N5j47J52j38K39P0p%k11j5K22j46
6497a0l3j70R3K01j17O2l18K13L2q4J92K04l32j00J58J98l28N40m70J25K15l23
6519e2j70K55j23j03R4K57p8o7P9l04M85k5j39j12L6J33l27K24L6j2J82m30r9
6542b60K18j04J8J31o9j86k1M69m72K21n3j9o6J14J72L9j39K33j45N2k48J55j22
6565h2K29o53M10K04k11l9K65m1M9r2j36N0p1J52j24MJ62o3k7L63l69K23k32p3
6589a02P4k04L02o2l8J0k0J15J72n2l3p4j96n9J13K8M4J02k72O8K31j83L07l26
6613e5P9P5mN2k19Q5P0r8j54K2O9j07M64k56j60O3J94k73J10K2k23K40k51L76
$$ plain form
6637 121 -92 -41 -115 -316 -85 128 -39 89 -123 -167 -83 21 47 153 -36 230 48 81 -59 -63 96 64 -75
6660 -75 -84 -186 -96 152 -30 -200 65 365 -52 87 81 -2 -37 126 217 -218 -196 74 193 42 -111 -89 -222 -262
6684 -262 144 -61 -143 78 -70 -8 28 -17 304 -236 80 159 11 47 -227 460 -132 -319 -21 -192 -259 37
6706 37 174 76 -27 -116 17 231 -184 57 -253 -273 209 -198 108 87 102 6 178 -138 189 -211 21 28 11
6729 11 278 -15 -61 -89 -181 76 75 -74 117 96 -193 -42 131 238 -120 -198 -27 239 -89 -397 331 23 68
6752 68 139 -290 87 269 130 32 -178 115 -167 -39 255 -27 -153 142 113 -80 -109 -92 -59 -30 152 -9 164
6775 164 81 105 159 -53 -142 -253 120 34 -37 178 15 -71 -93 -213 -170 -104 149 -18 -130 94 148 -240 57 -50
6799 -50 -127 134 -131 113 201 -51 -10 290 -40 -164 -112 -82 86 -164 24 114 89 -26 -130 -162 -95 137 161 129
$$ packed form
6637A21k13N1p4k01K31K13j67J28k12m4Q4J04K6J06j89K66j82L3j40mJ59l2j39
6660g5rj02R0K48j82j70K65L00m17J39oq3l5J63R1m35K2K70J19j51j53K2j33m0
6684b62M06k05q2K21j48O2L6m5L21n40L16P9j48L6k74O87n92j87K98j71o7K96
6706C7J37r8j03q9J33K14m15K41l10k0M82m07L06k1J5r6J72l16L27m00K32Pj7
6729A1K67k93m6k8r2K57jj49J91k1k89J51J73J07l58p8J71K66l28l08P28l08M5
6752F8P1m29L77J82j39r8k10K93k82J28K94k82j26K95k9j93k9J7L3K9J82j61J73
6775A64q3K4N4k12q9j11L73q6p1K15j63q6k2j20M3O6K53j67j12K24N4l88K97j07
6799e0p7K61k65K44Q8k52M1L00l30j24N2L0J68k50J88R0k5j15j04l2O7K32K4l2
$$ plain form
6823 129 -154 7 -140 108 116 -114 85 9 -80 33 -89 -12 230 -17 -11 297 -70 -259 109 -71 -80 -17 199
6846 199 119 -16 59 115 287 216 -73 -103 -96 -175 61 -143 -130 59 -30 -175 -27 160 72 -9 -141 -174 -91 -110 73
6871 73 -113 -20 -69 216 21 86 30 -104 54 -85 -45 31 63 27 -209 -60 303 -210 -18 -118 -76 -1 1 -194
6895 -194 -55 -53 118 -177 -263 335 -234 -265 -32 32 -310 103 169 -86 182 136 296 49 -118 309 130 110 -176
6918 -176 -97 10 -30 -121 286 -137 3 215 -12 46 -103 171 100 -161 -387 135 101 19 38 148 267 53 165
6941 165 -255 100 -74 43 -17 -131 83 -229 270 -162 -120 -5 -74 -99 -48 33 169 -91 -141 55 -65 32 179
6964 179 89 47 147 28 102 213 -178 -144 298 7 281 -226 -98 -69 -165 107 -276 -267 -122 -174 -84 -146 -141 -7
6988 -7 25 6 -148 -52 -9 -40 114 164 80 167 144 -208 -58 -176 7 277 66 -55 100 21 -30 -56 11 -51 -66 -14
$$ packed form
6823A29k83J61j47K48Qk30J99p6q9J13j22P7K42k47OL08l67j89L68j80rO3K16
6846A99q0j35P5N6J72p1k89l0Pp9K36k04J3J89q9j45J48J87q8q1j32l3Q3j9J83
6871G3j86R3m9K85j95O5n6j34J58j39M0P6L2l6k36J49L63n13J92j00M2P5Kj95
6895a94J39KJ71k95q6N98n69l1K33O4l42M13O6k55K68m6J60k47j67M27j79k0k86
6918a76P9J07m0r1M07m23J40K12k27N8j49K74p1k61k26N22l4q2J9J10J19k14J12
6941A65m20L55j74J17o0j14K14l12M99m32M2J15o9k5N1Q1J36k60n0J96j20R7J47
6964A79r0m2J00j19P4J11l91L4M42k91K74n07J28K9r6K72l83RJ45n2R0o2NJ34
6988gL2j9j54R6M3l1J54N0q4Q7k3l52J50j18J83K70k11j21J55p9n1k6O7o2j5N2
$$ plain form
7014 -14 -189 -230 43 -252 -24 -15 -105 -60 208 -33 83 -4 -9 -131 -10 -103 -107 -93 -66 150 96 -43 -46 74 7 -18
7040 -18 -205 -132 -120 17 122 120 19 -438 155 -250 -175 -23 -233 -76 -38 -40 -35 16 69 187 64 -24 -60 152 94
7065 94 190 -113 276 9 19 35 -47 124 -94 -95 87 -70 -41 -20 346 124 -38 -3 -93 55 -27 160 85 84 84 70
7091 70 13 -57 -46 10 -30 121 -196 140 50 -57 -299 125 38 11 141 136 -96 -25 19 -32 31 -100 110 -12 -167
7116 -167 -57 -213 45 46 -41 -165 163 -41 36 60 -3 -143 -181 -164 316 -85 -134 115 202 26 20 144 354 -200
7140 -200 -15 -60 86 20 -148 -88 -87 -11 190 76 -164 9 -176 107 -44 -165 221 -27 -57 217 -36 5 -129
7163 -129 -142 26 198 -58 -132 191 198 31 94 116 119 -185 -15 70 -84 272 111 88 -133 -67 72 -131 -22 30
7187 30 38 220 -292 39 30 0 -288 -160 196 112 -226 235 6 -106 -26 32 -4 121 -65 -104 9 19 70 -97
$$ packed form
7014a4j75m1K73k95K28Rr0M5K68k41J16q7nj22J21r3mJ4K7K16n4j39lJ20o7k5
7040a8j87P3J2J37J05kj01m57N93m05P5J52k10J57L8kNN1N3J18j23q8l6K12n8
7065I4R6l03L89k67J0J6q2J71k18jJ82j57K9K1L66k22j62L5r0J48q2J87p5j%j4
7091G0n7p0J1N6m0J51l17L36r0j07k42M24q7k7J30nk32P1M4n1O3j31K10j22j55
7116a67J10j56K58Jq7j24L28k04P7K4o3j40l8J7M80m01m9K49Q7j76oJ24K10n54
7140b00J85m5J46o6j68O0JP6K01j14k40J73j85K83j51j21L86k48l0K74k53M1j34
7163a29j3J68J72k56p4L23Pj67O3K2Ll04J70Q5j54L56j61k3k21O6J39k03J09N2
7187C0QJ82n12L31rl0k88J28L56q4l38M61k29j12Q0N8l6J25j86l9J13J0N1j67
$$ plain form
7211 -97 142 141 -104 -67 109 22 -47 118 -39 -55 100 -92 242 -85 -70 -382 54 263 133 10 121 19 -75
7234 -75 163 -112 34 -65 17 139 4 -193 -80 76 -189 128 71 66 126 24 62 -73 64 -209 87 -135 209
7257 209 16 38 63 59 5 169 -3 -267 -73 -215 115 82 34 -10 7 59 -5 -21 -123 162 -194 -40 -140 61
7281 61 29 -16 -139 35 8 123 283 -66 -145 -9 74 -64 12 -82 -2 161 135 94 -98 141 203 -55 -39 86
7305 86 109 -61 -115 26 7 129 -42 176 106 339 -46 52 -63 -73 130 -45 51 27 -189 48 37 -169 43
7328 43 171 101 -52 -14 -13 -68 173 126 -100 220 256 45 224 -180 289 152 14 -45 -103 118 -37 146 130 -164
7352 -164 -77 -148 -209 24 -55 18 52 -335 95 -82 -50 -126 190 39 125 -275 -18 70 167 6 -37 209 255 176 6
7377 6 4 -145 -225 -21 -161 136 101 -17 86 -109 -114 -208 -22 251 48 151 -30 -62 -109 141 9 98 -105 -124
$$ packed form
7211i7K39jk45L7J76q7o9J65j57j6J55j92L34l27J5l12M36K09j30j23J11j02r4
7234g5K38k75J46r9Q2J22j35j97J13J56k65L17n7nO0j02L8j35J37k73K96k22L44
7257B09j93K2K5mn4J64j72k64J94j42L30l3m8m4J7N2o4j6j02K85l56J54j00K01
7281F1l2m5j23J74k7J15J60l49p9J36Q3j38P6r4Q0J63k6m1j92K39O2k58J6J25
7305H6K3j70n4J41j9J22j71K18p0K33l85R8j15j0K03j75R6k4k16K37j1k06K12
7328D3J28p0j53L8Jn5K41m7k26L20L6k11J79m04M69j37j38n9n8K21j55J83j6k94
7352a64Q7p1o1K33p9P3L4l87M30j77L2p6L16j51Q6m00K57Q8R7j61m3K46M6p9j70
7377Fkj49q0K04j40K97l5j18J03j95nr4J86K73k03J03j81l2m7K50j32Q9k03j9
$$ plain form
7401 -124 52 122 76 47 -123 19 -73 -86 -156 -10 107 8 12 -37 242 6 6 -43 13 -44 -65 -105 39 70 -128 145
7427 145 233 274 18 -4 172 249 -90 -95 -396 -209 -113 95 -68 -105 80 -68 134 -64 -4 -103 68 67 -51 252
7451 252 21 6 0 -30 2 38 121 -7 -323 -132 -263 184 -338 -164 85 37 37 -182 18 -114 2 79 65 -38
7475 -38 -53 61 72 235 22 -323 -11 111 151 -124 26 62 349 -102 6 -58 -57 103 76 -137 -105 -37 -138 49
7499 49 114 14 -35 19 -54 -98 -96 -100 102 -113 -126 -21 70 196 -33 56 48 187 -151 -21 -140 -73 -149 62 -62 -71
7525 -71 -70 151 -4 9 100 -99 105 78 -154 14 5 -80 -44 44 -63 55 209 23 -63 -316 105 -193 -141 102
7549 102 260 -41 -171 200 -96 170 40 27 1 -73 176 37 253 36 29 -71 92 -59 41 -206 -88 36
7571 36 -50 -182 -84 127 -3 141 86 -102 9 -55 62 -201 -102 -160 242 -64 -219 114 -59 209 -211 -158 -176
$$ packed form
7401a24J76P0m6k9j70J42r2j3p0J46J17r9Mm9K79k36%m9N6n7k1m0J44L1j98K73
7427A45Q8M1k56k2J76P7l39nl01J87R6K08j63l7J85j48K02j98O0r9J71jj18L03
7451B52k31j5ol0L2L6Q3j28l16J91j31M47n22J74K49m8%k19K00j32J16P7j4j03
7475c8j5J14J1J63k13l45L12J22M0k75J50L6K87m51J08o4JJ60k7k13L2O8j01J87
7499D9O5j00m9N4p3m4KmK02k15j3J05R1J26k29Q9qJ39l38J30j19O7p6K11j24r
7525g1JK21j55J3R1j99K04k7k32J68rq5L6Q8j07J18J54j86q6k53M21k98N2K43
7549A02J58l01j30L71k96K66j30j3k6p4K49j39K16k17pj00J63j51J00k47J18J24
7571C6q6j32R8K11j30J44n5j88J11o4J17k63R9n8M02l06j55L33j73K68m20N3j8
$$ plain form
7594 -176 114 394 237 118 257 41 10 -285 99 75 164 36 -21 113 17 -189 6 119 -116 -35 -289 148
7616 148 -84 -8 -194 -248 -263 -14 -217 86 -97 -44 113 49 69 8 9 -42 -33 282 149 41 -93 -228 59 67 -161
7641 -161 -61 45 -116 -57 -57 6 -155 -124 248 150 78 266 -211 227 80 -129 38 -205 125 111 -104 -3 -83
7664 -83 -23 -42 34 -4 182 -10 180 200 -107 218 178 249 29 -27 347 -55 30 -57 -45 -141 -6 -57 -60 98 68 -212
7690 -212 -64 69 81 -58 88 69 -183 81 -23 -59 261 71 -64 110 -16 -2 -128 46 171 -10 -75 171
7712 171 -20 74 59 54 40 22 -48 4 -114 90 -60 -167 -27 -90 104 42 51 -98 -186 101 -51 -382 34 58 42
7737 42 23 313 82 188 66 -176 -69 -38 291 -172 99 -87 -68 139 46 -3 19 -193 -202 -91 272 115 142
7760 142 164 -188 -104 112 66 16 -153 211 114 -158 44 171 -35 -88 134 -89 -38 -80 -27 -35 -59 7 -31 -70 -145
$$ packed form
7594a76K90K80j57j19J39k16l1k95L84k4Q9j28n7J34r6k06J95J13k35Q1k54M37
7616A48k32P6j86n4j5K49k03L03j83N3J57o4K0o1Jn1RL15j33j08j34j35K87Qk28
7641a61J00J06j61N9%O3j61L1L72r8p2J88m77M38j47k09J67k43L30j4k15J01q0
7664h3O0j9P6l8J86j92J90K0l07L25m0P1k20n6L74m02Q5q7J2r6J35n1lJ58l0k80
7690b12J48J33J2j39J46j9k52K64j04l6L20j90j35J74j26J4j26J74J25j81o5K46
7712A71j91R4j5nj4j8p0N2j18K04j50j07J40o3J94o2Rj49q8K87j52l31M16K4j6
7737D2j9K90k31J06j22k42J07L1L29m63K71j86J9K07r3m9K2k12rJ11L63j57K7
7760A42K2l52Q4K16m6n0j69L64r7k72K02J27k06n3K22k23N1m2N3qk4O6l8l9p5
$$ plain form
7785 -145 50 59 -81 -77 -20 39 50 -183 -160 -12 29 -202 44 -221 79 -69 -183 238 -59 103 -26 172 -72
7808 -72 -344 -56 123 -258 316 -93 -64 -68 -54 74 68 36 56 36 0 111 -93 41 93 81 192 -76 -109 -75 -122
7833 -122 -74 120 24 -271 66 -61 122 -86 -79 215 95 -6 264 46 -86 -122 -26 165 106 -15 174 212 -162
7856 -162 -120 74 120 -38 -90 -48 25 145 12 -283 178 16 70 60 21 20 -58 12 105 111 -85 104 -47 -197 -88
7881 -88 43 154 90 -154 -30 -62 -44 -157 65 64 30 67 4 -139 -23 -118 -151 -9 212 -14 7 310 74 66 160
7906 160 45 78 -226 -81 202 85 33 107 -204 270 179 -75 99 -190 -58 -27 28 170 107 172 238 207 245 -113
7930 -113 214 -119 37 -222 -166 -59 80 91 53 -15 -17 -135 157 175 90 -70 -38 172 135 -154 145 80 -140 -132
7954 -132 -183 -105 -389 -257 -210 143 -298 61 -81 -46 -25 97 -34 207 15 -255 71 -46 122 36 59 87 212
$$ packed form
7785a45J95Rj40MN7N9J1k33K3J48M1k31K46k65L00j48j14M21k97J62j29J98k44
7808g2k72K88J79l81N74m09K9mJ4J28ol2K0k0l6J11k04J34N2j2J11k68l3L4m7
7833a22M8J94r6k95L37j27J83k08PK94j20j01K70k18j32l6R6J91n9j21J89L8l74
7856a62M2J94M6j58n2M2P3J20j33k95M61j62N4j0l9jp8P0R3Oj96J89j51j50J09
7881h8J31J11o4k44J24l2J8j13K22jl4L7o3j43J16r5l3J42K21k26K1L03k36qR4
7906A60j15L3l04J45K83j17n2P4l11M74r1k54J74k89J32L1N5J42o3O5O6l1L8l58
7930a13L27l33J56k59N6J07J39J1l8o8kj18K92J8q5j60L2K10l7k89K99o5k20Q
7954a32n1P8k84J32M7L53m41L59j42L5K1J22j31K41j92k70L26j17J68q6K3K8J25
$$ plain form
7977 212 -5 185 288 126 248 92 39 -94 110 -30 97 -211 109 71 -98 -187 58 -47 -17 -96 36 -154
7999 -154 14 86 25 105 -210 48 -9 325 202 -269 -142 -122 -37 131 175 -303 -65 -104 -76 -6 35 -136 -37 126
8023 126 -8 15 137 140 -265 -36 258 -42 -227 -56 -141 104 -136 -56 284 -261 -146 38 -200 -211 72 64 115
8046 115 -36 -80 122 53 0 125 163 21 -265 -147 59 -167 133 -56 68 -238 -5 -77 -83 -262 16 43 -98
8069 -98 -9 -10 136 31 -45 143 -74 -126 -58 8 21 -251 157 16 -45 -42 45 44 -19 -47 -227 -19 158 -149 91 98
8095 98 -244 -249 -41 -115 -180 251 -153 69 -87 -158 99 27 66 75 -94 -25 279 -68 -15 432 207 118 9 -109
8119 -109 24 -14 -102 -45 15 -133 -217 147 -42 -276 45 154 -338 92 82 121 -32 -71 37 -6 -49 -2 207 -149
8143 -149 -12 232 99 -292 -67 -100 72 157 21 198 133 -160 295 -115 345 55 16 26 57 248 34 195
$$ packed form
7977B12k17J90J03j62J22j56n3j33K04j40J27l08L20l8j69q9K45j05L0p9J32j90
7999a54J68P2o1Q0l15K58n7L34j23m71J27K0Q5J68M4m78K38l9K8P0M1j71R9J63
8023A26j34K3J22Lm05K29K94l00j85J71q5K45k40Q0L40n45J15J84k38j1K83qN1
8046A15j51m4K02o9n3J25L8j42k86J18K06k26L00j89J24l06K33p2oj79K78K7j41
8069i8Q9jJ46j05p6J88k17n2O8O6J3k72M08j41o1LQ7jo3k8j80K08J77l07K40P
8095I8l42nK08p4o5M31m04K22j56p1K57p2L9Rj69O9L04l47N3M47k25q9j09j18
8119a09J33l8q8N7O0j48q4L64j89k34L21J09m92M30j0L9j53l9J08m3m3M7K09l56
8143a49J37K44j33l91K25l3J72Q5j36J77o5k93M55m10M60k90l9J0L1J91k14J61
$$ plain form
8165 195 -97 -128 -76 -39 170 -44 -36 239 -249 -96 -74 -21 44 85 -23 -104 26 31 221 92 -320 -4 -74 99
8189 99 -149 -209
$$ packed form
8165A95k92l1N2L7K09k14QK75m88J53K2N3O5M1j08q1J30NJ90j29m12L16p0J73
8189I9k48o0
8191b09
$$ Imaginary data points
##PAGE= N=2
##DATA TABLE= (X++(I..I)), XYDATA
$$ plain form
0 0 0 0 0 0 0 0 0 0 0 0 0 0 0 -8 8 -8 8 -8 16 -16 16 -24 24 -32 33 -40 48 -55 63 -71 80 -93 103 -117 133
35 133 -149 165 -184 205 -229 253 -283 313 -346 381 -421 464 -511 563 -621 684 -753 831 -917
54 -917 1016 -1128 1256 -1405 1581 -1791 2049 -2374 2793 -3358 4162 -5394 7482 -11674 23182
69 23182 -116091 -320189 111993 118592 -118100 130263 272158 37465 107155 228756 47658
80 47658 21071 131896 11405 -40555 42896 -22099 -67917 -5323 -71409 -120451 -57250 -94031
92 -94031 -133474 -60792 -75034 -99431 -12162 -17527 -64920 28790 68964 34050 106409 122481
104 122481 34282 69680 92989 -3334 35837 116914 21451 744 79017 -12586 -83462 3994
116 3994 -41079 -136189 -47813 -24310 -114801 -49955 18641 -60969 -44918 35002 -19898 -36596
$$ packed form
0@%%%%%%%%%%%%%qJ6j6J6j6K4l2L2m0M8n6O5p3Q8j03J18j34J51j73J96k20K50
35A33k82L14l49L89m34M82n36N96o59P27q02Q85r75J074j184J305j437J584j748
54i17J933k144K384k661K986l372L840m423N167o151P520r556J2876j9156L4856
69B3182j39273k04098M32182O599k36692K48363J41895k34693O9690J21601j81098
80D7658k6587J10825j20491n1960Q3451o4995m5818O2594o6086m9042O3201l6781
92i4031l9443P2682j4242k4397Q7269n365m7393R3710M0174l4914P2359J6072
104A22481q8199L5398K3309r6323L9171Q1077r5463k0707P8273r1603p0876Q7456
116C994m5073r5110Q8376K3503r0491O4846O8596p9610J6051P9920n4900j6698
$$ plain form
128 -36596 48771 38757 6645 62494 65894 25340 50407 55601 22909 36729 35972 -1945 -2197
141 -2197 -7712 -40428 -30635 -19185 -42489 -29534 -13009 -41164 -37139 -12794 -36091 -35425 3542
154 3542 -4067 -8129 35459 35927 12018 38000 39540 3471 18894 36718 6694 9901 32478
167 32478 3890 -13742 4551 -11274 -33599 -15226 -12682 -31764 -20337 -10800 -24531 -18619 -3778
180 -3778 -7681 -2891 11231 10096 9494 15697 13295 11606 14808 13009 14603 18174 12497 8606 9189
195 9189 -2633 -12095 -7379 -11872 -18918 -8689 -5427 -15233 -9639 -4114 -14665 -13353 -697 -4485
209 -4485 -4443 10582 11306 4822 13657 16186 5435 7793 14036 5827 2362 8635 3102 -4905 -1565
224 -1565 -3202 -10119 -7408 -4223 -8974 -9921 -6285 -8099 -10262 -6413 -2278 -1282 1163 6259 7682 5482
$$ packed form
128c6596Q5367j0014l2112N5849L400m0554K5067N194l2692J3820p57l7917k52
141b197n515l2716R793J1450k3304J2955J6525k8155M025K4345k3297O66L8967
154C542p609m062M3588M68k3909K5982J540l6069J5423J7824l0024L207K2577
167C2478k8588j7632J8293j5825k2325J8373K544j9082J1427R537j3731N912J4841
180c778l903M790J4122j135o02O203k402j689L202j799J594L571n677l891N83
195I189j1822r462M716m493p046J0229L262r806N594N525j0551J312J2656l788
209d485M2J5025P24o484Q835K529j0751K358O243q209l465O273n533q007L340
224a565j637o917K711L185m751r47L636j814k163L849M135R96K445N096J423k200
$$ plain form
240 5482 5584 6955 5174 3748 7121 8323 5014 6096 6463 -439 -3775 -2305 -6586 -9804 -5003 -3989
256 -3989 -8262 -5169 -1719 -6373 -6159 -97 -1224 -2855 3650 5250 1125 4394 7850 3523 3781 8116
272 8116 5795 2445 4536 3301 -2386 -3126 -1242 -4206 -5203 -1693 -2378 -5093 -4010 -3252 -6332 -6093
288 -6093 -2327 -1783 -1479 2729 4964 2823 3650 5702 3379 1504 4632 4729 1877 2712 4114 13 -1561
305 -1561 542 -1722 -4666 -2466 -2069 -5565 -4758 -1810 -4169 -4830 -205 118 -1909 1282 3117 197
321 197 285 3555 2113 799 4352 5093 2318 3266 4429 25 -1556 327 -1463 -3775 -1682 -685 -3390
338 -3390 -2861 -593 -2680 -4053 -1092 -834 -2770 -93 1831 97 500 3215 2762 963 3306 3862
354 3862 1225 1307 2880 862 -800 1361 431 -1660 -485 289 -2099 -2835 -1183 -2483 -4166 -1626
$$ packed form
240E482J02J371j781j426L373J202l309J082L67o902l336J470m281l218M801J014
256c989m273L093L450m654K14O062j127j631O505J600m125L269L456m327K58M335
272H116k321l350K091j235n687p40J884k964r97L510o85k715J083P58l080K39
288f093L766N44L04M208K235k141Q27K052k323j875L128R7k852Q35J402m101j574
305a561K103k264k944K200L97l496Q07K948k359o61M625L23k027L191J835k920
321A97Q8L270j442j314L553P41k775R48J163m404j581J883j790k312K093R97k705
338c390N29K268k087j373K961K58j936K677J924j734M03K715m53j799K343N56
354C862k637Q2J573k018j662K161r30k091J175P74k388p36J652j300j683K540
$$ plain form
370 -1626 -501 -2257 -653 1734 69 -780 1954 1151 -662 1838 3095 741 1383 3154 1571 -274
386 -274 1985 869 -1760 -151 276 -2033 -1942 239 -1389 -2610 -622 -139 -1998 -1144 494 -911 -1418
403 -1418 930 738 -453 1490 2570 642 775 2346 1148 -315 829 1209 -836 -418 1411 -368
419 -368 -1071 380 -189 -2301 -1167 -238 -2371 -1545 696 -273 -1635 906 987 -1360 152 1711 -399
436 -399 120 2166 997 -174 1773 1317 -339 595 1384 -516 -1023 862 -98 -1738 -756 282 -1411
453 -1411 -1025 337 -553 -1418 -266 36 -971 -354 1259 341 122 1546 1159 -165 941 1680 79
470 79 -247 1423 761 -520 675 834 -1366 -627 476 -1008 -1502 -52 -528 -1588 -391 102 -1420
487 -1420 -548 1050 -194 -443 1116 590 -467 635 1354 355 269 1330 774 -164 636 531 -563 -323
$$ packed form
370a626J125j756J604K387j665q49K734q03j813K500J257k354O42J771j583j845
386b74K259j116k629J609M27k309R1K181j628j221J988M83j859Q54J638j405n07
403a418K348j92j191J943J080j928J33J571j198j463J144L80k045M18J829j779
419c68p03J451n69k112J134R29k133Q26K241r69j362K541Q1k347J512J559k110
436c99N19K046j169j171J947m56j656R34P89j900n07J885r60j640R82J038j693
453a411L86J362q90q65J152L02j007O17J613r18k19J424l87j324J106P39j601
470G9l26J670o62j281J195J59k200P39J103j484m94J450m76j060J197M93j522
487a420Q72J598j244k49J559n26j057J102P19r99q6J061n56r38Q00j05j094K40
$$ plain form
505 -323 339 -337 -1110 192 -106 -1344 -702 9 -1078 -1111 289 -361 -1171 528 831 -470 -53 1134
523 1134 235 183 1130 818 -322 902 1357 -506 -95 1334 -89 -705 210 53 -1371 -720 21 -785
541 -785 -1035 380 -450 -819 195 568 -518 -5 1004 183 8 1084 1058 -26 465 1002 119 -53 710
560 710 264 -557 312 326 -926 -486 389 -619 -1466 182 -135 -1225 -235 723 -798 -474 736 358 -188
579 -188 749 682 -334 419 1080 77 5 853 128 -597 391 186 -549 -186 59 -549 -766 -218 -286 -695 -253
600 -253 39 -594 -420 258 -6 -268 580 556 160 210 914 607 -85 773 894 -468 -45 793 -396 -590
620 -590 269 -342 -859 -85 -240 -890 -246 661 -488 -486 508 44 -354 303 650 -514 384 622 -194 -74
640 -74 701 400 -273 355 551 -240 -460 21 -348 -654 -387 63 -360 -385 -62 -10 -433 131 132 -212 -169 453
$$ packed form
505c23O62o76p73J302k98j238O42P11j087l3J400o50q10J699L03j301M17J187
523A134q99n2R47l12j140J224M55j863M11J429j423o16R15j57j424O51P41q06
541g85k50J415q30l69J014L73j086N13J009q21j75J076k6j084M91N37q83j72P63
560G10m46q21Q69J4j252M40Q75j008q47J648l17j090R90R58j521L24J210l78n46
579a88R37o7j016P53O61j003p2Q48p25p25R88k05p35L63K45o08k17N48o8m09M42
600b53K92o33J74O78k64k62Q48k4l96N0P04l07o92Q58J21j362M23Q38j189j94
620e90Q59o11n17P74j55o50O44R07j149KR94m64l98O57L47j164Q98K38q16J20
640g4P75l01o73O28J96p91k20M81l69l06K67M50m23k5L23N2m23N64Jl44M3O22
$$ plain form
662 453 7 -14 853 576 -248 650 483 -426 -136 617 81 -601 472 31 -960 -207 298 -790 -404 432
682 432 -526 -673 424 89 -545 475 460 -150 3 346 205 -10 537 485 72 199 494 -126 -260 93
702 93 -157 -294 -256 -24 -417 -693 -68 -153 -819 -261 343 -258 -261 345 369 -391 101 534 -82 384 713 -179
724 -179 112 664 -122 -146 361 39 -650 -29 185 -439 -499 161 -382 -642 179 -76 -432 -164 244 -22 -137
745 -137 271 22 -39 115 308 67 -107 378 219 -136 160 358 -121 -341 62 -348 -502 -77 214 -412 -5
766 -5 245 -169 -294 326 129 -534 316 440 -395 82 518 -312 -41 436 449 -469 101 279 -448 -159 280
787 280 -452 -451 103 -209 -292 187 113 -290 -278 29 -202 -224 385 252 -235 -22 447 193 -38 134 318 -132
809 -132 134 173 -131 -380 145 166 -460 20 288 -420 -130 274 -63 -458 307 442 -150 75 271 -232 237
$$ packed form
662D53m46k1Q67k77q24Q98j67r09K90P53n36o82J073m41r91P53N05j088L86Q36
682D32r58j47J097l35o34J020j5o10J53L43j41k15N47n2m13J27K95o20j34L53
702I3k50j37L8K32l93k76O25q5o66N58O04o01lO06K4p60M92M33o16M66L29q92
724a79K91N52p86k4N07l22o89O21K14o24o0O60n43k60Q21k55l56K68M08k66j15
745a37M08k49o1J54J93k41j74M85j59l55K96J98m79k20M03m10j54M25K91o26M07
766eK50m14j25O20j97o63Q50J24q35M77M36q30K71M77J3r18N70J78p27K89M39
787B80p32JN54l12q3M79p4m03J2L07k31k2O09j33m87K13M69k54k31J72J84m50
809a32K66L9l04k49N25K1o26M80K68p08K90M04l37l95P65J35n92K25J96n03M69
$$ plain form
830 237 423 -158 -271 475 27 112 148 131 -212 -179 434 -209 -299 68 158 -96 -246 101 -31 -251 124 -37
852 -37 -112 86 171 105 -37 452 357 -12 287 334 -193 -145 457 -213 -135 364 173 -351 -48 44 -375 -494 119
875 119 -19 -272 28 21 -191 -108 140 -177 -314 515 100 -17 338 262 -19 47 377 23 210 84 179 -213
897 -213 -117 146 -375 -246 63 90 -418 126 39 -56 -76 463 -110 -325 432 418 76 139 323 106 -61 380 279
920 279 -219 -34 141 -266 -76 356 -61 -255 -140 -52 -297 71 344 -219 -107 196 -220 -57 416 88 -40
941 -40 -4 258 -69 -50 412 25 -11 -107 135 -381 97 250 -65 -289 47 -226 -58 -71 172 58 -25 -4 178
964 178 -209 120 145 -76 -139 561 -168 101 89 157 86 77 309 -398 54 59 -267 -469 -252 112 -291 44 35 -21
988 -21 -338 18 114 -224 190 162 161 -194 145 200 -310 217 267 16 101 49 70 -214 136 -44 -300 48 361 -121
$$ packed form
830B37J86n81j13P46m48Q5L6j7l43L3O13o43r0L67R0k54j50L47j32k20L75j61
852c7p5J98Q5o6j42M89r5l69K99M7n27M8O02o70P8M99j91n24L03R2m19j19O13
875A19j38k53L00pk12Q3K48l17j37Q29m15j17L55p6k81O6L30l54J87j26R5l92
897b13R6K63n21J29L09K7n08N44q7r5k0N39n73k15P57j4l42O3J84k17j67M41j01
920B79m98J85J75m07J90M32m17j94J15Q8k45L68K73n63J12L03m16J63M73l28j28
941d0L6K62l27J9M62l87l6r6K42n16M78J53l15k24L36k73J68j3K43j14q3K1J82
964A78l87L29K5k21o3P00p29K69j2O8p1rK32p07M52Nl26k02K17L64m03L35rn6
988b1l17L56R6l38M14k8jl55L39N5n10N27N0k51Q5n2K1k84L50j80k56L48L13m82
$$ plain form
1012 -121 -69 23 -93 83 3 25 -50 -167 143 -14 96 52 141 25 147 -84 -218 7 3 17 -242 175 -24
1035 -24 -141 81 101 45 -186 -46 60 -114 72 224 123 240 175 -122 -135 -129 280 -32 -182 80 -24 -137
1057 -137 186 -244 180 -212 -4 7 -114 -4 -169 -170 9 47 -203 -144 107 -342 -175 43 172 -21 142 240
1079 240 -82 182 257 -263 -70 122 99 -214 396 107 -12 50 36 -188 -56 132 27 120 52 -21 -162 -126 -6
1102 -6 217 89 133 106 -126 -133 -66 -29 -144 195 70 -114 -7 336 23 43 55 -158 -73 -4 145 -141 148 276
1126 276 -68 7 175 -7 139 161 80 -72 240 7 -89 -106 2 233 -17 -34 132 21 -306 -11 -53 -215
1148 -215 63 154 35 84 107 -67 211 -193 -106 -167 -106 37 -83 -52 24 38 -105 -24 140 110 16 39 -209 68
1172 68 289 75 74 -60 394 43 -80 134 86 -58 201 -209 -3 -25 -33 -104 -199 -153 69 -37 -79 236 -27 29
$$ packed form
1012a21N2R2j16J76q0K2p5j17L10j57J10m4Q9j16J22k31j34K25mJ4k59M17j99
1035b4j17K22K0n6k31J40J06j74J86J52j01J17o5k97j3OM09l12j50K62j04j13
1057a37L23m30M24l92K08J1j21J10j65jJ79L8k50N9K51m49J67K18J29j93J63R8
1079B40l22K64P5n20J93J92k3l13O10k89j19O2j4k24J32J88j05R3o8p3j41L6J20
1102fK23j28M4k7k32pO7L7j15L39j25j84J07L43l13K0J2k13Q5O9J49k86K89J28
1126B76l44P5J68j82J46K2q1j52L12k33r6j7J08K31k50j7J66j11l27K95m2j62
1148b15K78R1j19M9K3j74K78m04Q7o1O1J43j20L1P6J4j43Q1J64l0r4K3k48K77
1172F8K21k14jj34M54l51j23K14m8j44K59m10K06k2qp1r5M6K22j06m2L15k63N6
$$ plain form
1196 29 15 92 134 -20 -109 110 39 -36 -242 -37 204 -264 -87 55 103 -47 37 64 -200 19 191 -123 -40 295
1220 295 217 -249 -206 114 -71 56 183 -91 -183 -190 22 -248 -362 12 -230 143 9 -23 -97 125 57 -56 157
1243 157 140 -77 -12 15 -194 -29 -265 -81 136 23 69 -30 69 126 157 112 117 -176 -148 3 -307 0 -66 51
1267 51 36 24 -70 115 55 -424 41 13 -343 231 22 -373 60 26 104 -235 -6 404 55 285 -22 30 -271
1290 -271 105 164 -138 -35 79 -231 -38 34 120 -57 -30 -23 -70 -35 -307 9 231 -69 175 227 -67 117 54
1313 54 30 284 -116 -41 -38 64 -97 -69 25 -50 -174 129 62 -88 -27 114 -172 -57 138 139 -82 -83 189 -162 129
1338 129 -28 18 64 -61 89 172 12 182 96 -300 -8 -4 -119 -107 350 -449 -129 172 27 -97 41 -122
1360 -122 -244 1 187 -222 73 307 -98 -220 195 30 25 -94 77 -278 -15 -49 -158 126 25 -68 -378
$$ packed form
1196B9j4P7M2j54q9K19p1p5k06K05K41m68J77J42M8j50Q4K7k64K19J72l14Q3L35
1220B95p8m66M3L20j85J27J27k74r2pK12k70j14L74k42L73j34l2p4K22o8j13K13
1243A57j7k17O5K7k09J65k36J84K17j13M6r9R9N7L1m5Nk93K8J51l10L07o6J17
1267E1j5j2r4J85o0m79M65k8l56N74k09l95M33l4P8l39K29M10l49K30l07N2l01
1290b71L76N9l02J03J14l10J93P2Q6j77K7Pm7L5k72L16K22l00K44N2k94J84o3
1313E4k4K54m00P5LJ02j61K8R4p5j24L03o7j50O1J41k86J15J95Jk21jK72l51K91
1338A29j57M6M6j25J50Q3j60J70q6l96K92Mj15J2M57p99L20L01j45j24J38j63
1360a22j22K45J86m09K95K34m05j22M15j65nj19J71l55K63l4j09K84j01r3l10
$$ plain form
1381 -378 -2 -2 276 -60 -18 133 -167 -38 -89 -32 91 -251 -19 -231 99 37 128 -19 -130 -30 -9 26 -171
1404 -171 99 -190 8 -374 -114 -69 222 120 -14 -82 -159 21 168 38 -307 103 25 53 -20 150 64 185
1426 185 102 89 201 0 -117 146 36 -78 104 -128 335 123 75 188 -83 -91 50 21 149 -172 -207 -175 -59
1449 -59 98 73 2 251 135 -159 -42 16 230 18 12 27 -103 -70 211 296 38 69 -127 314 49 -154 233
1472 233 -116 116 -240 -243 51 185 -199 -125 -93 51 -195 54 81 -16 327 -49 7 70 75 79 143 54 165 -164 -146
1497 -146 95 340 -75 -15 258 -41 -136 -55 -215 79 44 111 -31 -83 87 -127 -50 172 -173 160 267 5
1519 5 106 -130 136 -112 -263 131 187 89 -199 45 125 105 35 -6 -26 75 -63 157 -122 228 258 90 54 -2
1543 -2 -76 -263 131 63 -197 -275 -148 94 52 -71 37 512 324 110 201 -34 -53 -113 -251 34 20 83 -61 39
$$ packed form
1381c78L76%K78l36M2J51l00J29n1N7J23l42K32k12L30o2R1j47j11J00K1L5j97
1404a71K70k89J98l82K60M5K91j02j34o8p7J80J47j30l45M10p8K8p3J70q6J21
1426A85q3j3J12k01j17K63j10j14J82k32M63k12m8J13k71qJ41k9J28l21l5L2J16
1449e9J57k5p1K49j16k94J17N8K14k12oJ5j30L3K81Q5k58L1j96M41k65k03L87
1472B33l49K32l56lK94J34l84P4L2J44k46K49K7r7L43l76N6O3NMO4q9J11l29J8
1497a46K41K45m15O0K73k99r5Q1j60K94l5O7j42n2J70k14P7K22l45L33J07k62
1519EJ01k36K66k48j51L94N6r8k88K44Q0k0p0m1k0J01j38K20k79L50L0j68l6n6
1543bp4j87L94o8k60p8J27K42m2j23J08M75j88k14R1k35j9o0j38K85j4O3j44J00
$$ plain form
1567 39 -45 -33 -59 -154 -98 -31 -98 -88 207 239 -44 211 69 -237 66 280 -15 56 218 -123 -87 110 -170 -140
1591 -140 47 48 9 -49 216 260 248 84 174 -6 82 74 -119 72 1 -97 -34 -117 -130 -111 -84 269 84 -89 -32 118
1617 118 -140 -121 -92 -129 -129 -132 49 -8 38 182 120 124 5 1 10 -39 45 -40 -86 12 -61 -5 82 179 30 -51 124 -104 -127
1646 -127 85 199 -28 54 -96 -72 16 70 277 164 -53 101 55 -70 115 140 230 -144 -24 56 123 -26 -8
1669 -8 -82 48 33 -283 100 151 -76 173 168 -86 82 201 83 -114 -129 143 -34 125 -3 215 357 107 55
1692 55 -158 66 -263 -50 106 200 77 -24 -184 73 -99 267 -40 6 -171 28 130 -66 -41 67 1 184
1714 184 94 -100 -61 132 23 -138 -192 211 -288 -130 -19 -89 188 81 -140 337 231 2 -109 -74 -156 -65
1736 -65 -14 178 25 68 -101 49 -2 -112 -60 -2 -38 150 -90 -108 37 111 -46 15 185 142 96 61 150 -80 34
$$ packed form
1567C9q4J2k6r5N6O7o7J0K95L2k83K55j42l06L03K14k95P1J62l41L6J97k80L0
1591a40J87Jl9n8K65M4j2j64R0j80Q8qj93J91p1r8O3q3j3J9K7L53j85j73N7J50
1617A18k58J9K9l7%lJ81n7M6J44o2Mj19mRm9Q4q5m6R8p3N6Q7R7j49q1J75k28k3
1646a27K12J14k27Q2j50K4Q8N4K07j13k17J54m6j25J85K5R0l74J20Q0O7j49J8
1669hp4J30j5l16L83N1k27K49nk54J68J19j18j97j5K72j77J59j28K18J42k50n2
1692E5k13K24l29K13J56R4j23j01j60K57j72L66l07M6j77J99J02j96K5J08o6J83
1714A84r0j94L9J93j09j61n4M03m99J58J11p0K77j07k21M77j06k29j11L5q2R1
1736f5N1J92j53M3j69J50n1j10N2N8l6J88k40j8J45P4j57O1J70m3m6l5Q9k30J14
$$ plain form
1761 34 1 -323 -293 39 -176 329 -137 186 69 89 174 -287 69 161 -170 42 -10 -92 258 -46 -70 -47 227
1784 227 58 69 51 -251 -42 -274 -38 -115 246 186 14 166 236 101 127 7 88 1 31 187 110 -35 84
1807 84 -63 359 -101 -20 58 -220 141 300 64 -168 82 23 254 20 27 -160 195 -229 -242 -232 -8 -120 -60
1830 -60 209 184 141 68 217 -4 30 -28 44 -37 87 45 33 81 67 -74 -104 -59 75 69 -43 -23 -23 -42 -12 41 7 179
1858 179 -157 -254 12 67 6 -58 -13 64 -56 -262 131 99 -71 80 68 -176 -74 103 190 49 -89 -180 45
1881 45 -162 -1 -47 72 85 106 67 172 90 71 64 -196 -125 106 69 26 126 -92 -179 86 -11 -158 286 58 108
1906 108 -63 -14 -5 0 221 -199 -293 66 171 57 60 258 -53 -59 95 48 -48 89 192 55 -137 57 87 -77
1930 -77 383 34 -26 -125 5 3 -42 -66 -67 -6 -154 262 257 -39 11 70 -2 -166 -133 230 -122 83 161 6 35 7
$$ packed form
1761C4l3l24L0L32k15N05m66L23j17K0Q5m61L56R2l31K12n2q2L50l04k4K3K74
1784B27j69J1j8l02K09k32K36p7L61o0j72J52P0j35K6j20Q1q7L0J56p7j45J19
1807H4j47M22m60Q1P8k78L61J59k36k32K50n9K31k34Pj87L55m24j3J0K24j12O0
1830f0K69k5m3p3J49k21L4n8P2q1J24m2j2M8j4j41l0M5J34oj12K0%j9L0N3l4J72
1858A79l36r7K66N5o1o4M5P7j20k06L93l2j70J51j2k44J02J77Q7j41j38r1K25
1881D5k07J61m6J19J3K1l9J05q2j9pk60P1K31l7m3J00k18q7K65r7j47M44k28N0
1906A08j71M9RNK21m20r4L59J05j14LJ98l11oJ54m7r6J37J03j37j92J94L0j64
1930g7M60l49o0r9J30km5k4jO1j48M16nk96N0N9p2j64L3L63l52K05P8j55K9k8
$$ plain form
1956 7 -238 71 98 39 335 -129 -56 64 154 -155 37 70 130 -194 -15 -22 9 -101 205 -69 145 -106 214 -12
1980 -12 -33 -2 -94 -63 231 -110 -64 178 130 -94 -301 306 -134 218 -42 -177 154 211 150 344 -96 205 -72
2003 -72 -190 -61 -8 152 -70 179 -33 204 -37 -88 242 -118 21 14 84 -90 77 131 94 148 162 -92 83
2026 83 129 56 56 424 172 201 65 -144 129 -155 -154 115 266 -25 145 -43 -29 -132 90 -169 -10 -318 -91
2049 -91 0 218 201 -72 -155 208 -75 116 -80 -114 -184 -29 -101 173 229 0 -122 -63 3 119 56 -99 -194 178
2073 178 -10 207 -41 113 182 -92 151 11 161 179 293 28 -64 219 -348 -154 118 46 -170 -270 -109
2094 -109 60 59 -56 -70 -190 118 -55 -154 108 127 -95 7 -144 -278 -11 -294 -68 329 39 -52 193 -178
2116 -178 -257 13 -135 177 89 -40 -363 -188 -182 -20 -56 216 147 -122 -16 84 130 533 -46 -168 85 -47
$$ packed form
1956Gk45L09K7n9K96m64P3J20R0l09J92L3O0l24J79pL1j10L06k74K14k51L20k26
1980a2k1L1r2L1K94l41M6K42m8k24k07O07m40L52k60j35L31N7o1J94m40L01k77
2003g2j18J29N3J60k22K49k12K37k41n1L30l60J39pP0j74J67N4l7N4J4k54J75
2026H3M6p3%L68k52K9j36k09K73k84JK69J51k91J70j88J4j03K22k59J59l08K27
2049i1R1K18j7k73q3L63k83J91j96l4p0J55p2K74N6k29j22N9O6J16o3j55r5L72
2073A78j88K17k48J54O9k74K43j40J50J8J14k65r2K83n67J94K72p2k16j00J61
2094a09J69jj15j4j20L08j73r9K62J9k22J02j51j34K67k83K26L97k90r1K45l71
2116a78p9K70j48L12q8j29l23J75OJ62l6K72o9k69J06J00M6M03n79j22K53j32
$$ plain form
2138 -47 109 54 183 -109 2 33 -120 108 229 -84 149 -181 177 10 40 -319 -47 -110 -164 44 67 -94
2160 -94 100 98 -20 211 -150 -79 63 -22 119 -57 27 118 4 -13 -42 227 -107 108 99 -142 -118 -162 -100 97 25
2185 25 -17 218 13 -114 35 157 -138 97 7 131 5 91 -212 -65 -147 -65 168 119 36 -196 137 -133 16
2208 16 -247 -97 188 -69 100 -65 -102 117 104 211 80 32 -20 -181 -50 -62 133 184 146 -36 -4 -97 -86 -19
2232 -19 -25 -53 -139 -92 -114 126 34 -98 74 28 26 162 49 -204 94 87 -165 9 89 -258 -33 -118 -148 163 57
2257 57 -70 200 198 -24 -140 -67 96 59 -25 52 -21 -224 18 194 43 -121 -131 -381 100 186 -92 -234 66
2280 66 63 86 -17 -15 -98 120 -38 -102 -132 -2 -48 -47 133 -254 103 -138 41 -326 -323 229 119 -66 194 -159 -242
2305 -242 77 75 -55 -97 -5 74 -110 -4 -66 -122 16 -13 -1 -166 68 118 -19 -102 51 84 2 -1 16 -25 406 20
$$ packed form
2138d7J56n5J29k92J11L1j53K28J21l13K33l30L58j67L0l59K72o3n4K08K3j61
2160i4J94kj18K31l61P1J42q5J41j76Q4R1j14j7k9K69l34K15rk41K4m4O2J97p2
2185B5m2K35k05j27J49J22k95K35r0J24j26Q6l03J47q2Q2K33m9q3k32L33k70J49
2208A6k63J50K85k57J69j65l7K19j3J07j31m8n2j61J31j2J95N1l8j82L2r3J1O7
2232a9ok8q6M7k2K40r2j32J72m6kJ36j13k53K98pk52J74Q0l47K25q5l0L11j06
2257E7j27K70kk22j16P3J63l7q4P7p3k03K42J76j51j64j0k50M81Q6k78j42L00
2280F6lK3j03Kq3K18j58o4l0J30m6JJ80l87L57k41J79l67LN52j10j85K60l53q3
2305b42L19kj30m2R2P9j84J06o2n6J38k9J2j65K34N0j37q3J53L3q2lJ7m1M31l86
$$ plain form
2331 20 121 158 -180 29 -18 -18 28 -137 -238 42 -65 302 32 8 40 15 -131 -118 15 130 65 -92 140 156
2355 156 -60 64 70 236 128 -78 30 194 119 -189 -168 -49 107 -60 -98 81 80 84 72 -81 129 -126 -33 -118
2379 -118 129 208 -84 68 105 35 75 203 -55 267 -20 156 212 77 -52 159 55 366 140 154 -49 -2
2401 -2 -37 218 -84 -7 -23 109 49 172 12 -65 -69 36 145 -49 -70 287 -90 -176 390 -39 -63 146 70 80 263
2426 263 -34 -251 65 121 84 -133 167 -81 -103 -108 -164 -356 -22 -233 -349 -3 209 -146 -65 -118 -120 8 -16 187
2450 187 147 -188 200 -92 -134 42 166 54 15 8 61 5 47 234 281 47 -106 90 -5 -85 178 88 81 -35 -79
2475 -79 -159 152 120 121 61 -207 186 186 260 -161 -7 28 156 72 146 166 -267 -80 -76 -114 -68 187 -28 -205 -159 -68
2501 -68 -77 -101 0 -44 -20 268 -16 -34 238 -210 218 -18 -167 -123 12 71 -24 -230 -18 -112 275 17 49 -5
$$ packed form
2331B0J01L7l38K09m7%M6j65j01K80j07L67k70k4L2k5j46J3J33J15o5j57K32J6
2355A56k16J24OJ66j08k06J08J64p5l08K1J19J56j67l8J79jMj2j53K10k55R3q5
2379a18K47P9k92J52L7p0M0J28k58L22k87J76N6j35j29K11j04L11k26J4k03M7
2401bl5K55l02P7j6J32o0J23j60p7mJ05J09j94k1L57l77q6N66m29k4K09p6J0J83
2426B63k97k17L16N6l7k17L00k48k2nn6j92L34k11j16L46K12l55Q1n3kJ28k4K03
2450A87m0l35L88k92m2J76J24j12l9pN3n6M2J87M7k34j53J96r5q0K63r0pj16m4
2475g9q0L11l2Jo0k68L93%P4m21J54L5J28q4P4K0m33J87Ml8M6K55k15j77M6R1
2501f8rk4J01m4K4K88k84j8K72m48M28k36j49M4J35N9r5k06K12r4L87k58L2n4
$$ plain form
2525 -5 107 14 -89 -74 -19 98 30 -61 -297 139 113 -100 85 -90 27 48 -5 351 324 -108 49 -246 -244 -195 105
2550 105 68 5 235 -46 78 -28 178 17 136 -88 65 41 45 -125 -74 -16 77 43 108 161 149 -148 -47 199
2574 199 -24 -79 -76 194 26 98 -1 39 85 117 26 -19 -263 159 69 249 105 -34 -90 75 21 -25 -10 -254 81
2599 81 128 140 -130 -43 156 317 187 112 106 62 233 -61 4 142 55 -213 104 -88 274 145 -149 58 -176
2622 -176 69 -53 317 -240 127 -33 42 -25 14 -14 -101 129 85 -65 83 110 -132 -182 -84 -128 195 76 88 -55
2646 -55 -345 3 25 -8 -169 300 -96 98 -26 154 16 -210 -130 -1 -14 -288 179 -372 38 -10 -28 94
2668 94 -95 81 125 101 -83 164 14 100 83 13 -29 117 59 121 -6 -223 -136 130 264 -88 -174 -68 -82 72
2692 72 -32 24 126 -121 148 343 81 -136 81 -22 -234 -72 106 183 85 -55 -112 112 102 -97 166 269
$$ packed form
2525eJ12r3j03J5N5J17o8r1k36M36k6k13J85j75J17K1n3L56k7m32J57k95KM9L00
2550A05l7o3K30k81J24j06K06j61J19k24J53k4Mj70N1N8R3l4O5N3j2k97J01K46
2574A99k23n5LK70j68P2r9M0M6L2r1m5k44M22r0J80j44j39n6J65n4m6J5k44L35
2599H1M7J2k70Q7J99J61j30p5om4J71k94O5J38q7k68L17j92L62j29k94K07k34
2622a76K45j22L70n57L67j60P5o7L9k8q7K30m4j50J48K7k42n0R8m4L23j19J2j43
2646e5k90L48K2l3j61M69l96J94j24J80j38k26Q0J29j3k74M67n51M10m8j8J22
2668I4j89J76M4k4j84K47j50Q6j7p0m2J46n8O2j27k17Q7K66J34l52q6J06j4J54
2692G2j04N6J02k47K69J95k62k17K17j03k12J62J78P7r8j40n7K24j0j99K63J03
$$ plain form
2714 269 22 -157 234 -88 7 80 166 96 162 218 249 -267 -114 120 9 -33 223 107 276 -196 -143 96 153
2737 153 -83 -69 32 56 -291 -240 -128 -270 -307 -178 -164 -104 119 167 37 -148 220 -27 -31 89 16 -160 -20
2760 -20 124 92 202 241 97 -17 68 210 42 176 82 -78 169 -216 113 -125 -74 76 11 123 35 7 234
2783 234 -32 -212 -93 -92 41 107 126 -81 -69 -136 135 -6 49 -10 -223 155 165 -103 -32 89 285 -177 -191 -119
2807 -119 -6 40 -241 268 -22 -6 -20 105 111 -133 57 -104 60 92 -152 -113 296 -179 113 27 -227 -190 64
2830 64 133 74 -111 42 184 -262 -225 -266 93 288 -20 -206 -211 -68 -5 56 54 -109 241 -179 -93 76 124 261
2854 261 58 -54 -324 51 -68 -77 -160 -2 -49 -322 256 10 96 -67 -23 -96 258 238 25 -126 -26 100 156
2877 156 -23 13 115 -241 -271 -81 71 0 34 166 44 -135 158 -268 -30 46 -39 -82 254 53 78 195 53
$$ packed form
2714B69k47j79L91l22R5P3Q6p0O6N6L1n16J53K34j11m2K56j16J69m72N3K39N7
2737A53k36J4J01K4l47N1J12j42l7J29J4O0K23M8j30j85L68k47mJ20p3j76J40
2760b0J44l2J10L9j44j14Q5J42j68J34r4j60K47l85L29k38N1J50o5J12q8k8K27
2783B34k66j80J19JJ33O6J9k07J2o7K71j41N5n9k13L78J0k68P1J21J96m62j4P2
2807a19J13M6k81N09k90J6j4J25Ok44J90j61J64L2k44L9M09m75K92q6k54L7K54
2830F4O9n9j85J53J42m46L7m1L59J95l08j86nJ43O3O1kj63L50m20Q6J69M8J37
2854B61k03j12k70L75j19rq3J58m7k73N78k46Q6j63M4p3L54k0k13j51J00J26N6
2877A56j79L6J02l56l0J90J52p1L4J32j22j79K93m26K38P6q5m3L36k01K5J17j42
$$ plain form
2900 53 7 22 -134 -74 33 322 27 18 -100 42 -26 131 -45 -161 55 -93 -105 -150 93 44 -66 71 53 -92
2924 -92 -65 -196 -192 -275 -130 -64 -51 17 104 95 53 -9 114 12 191 -34 127 -215 -74 -30 -6 54 189 344 -32
2949 -32 69 -180 -211 27 79 -76 134 -225 -231 -270 17 180 -158 164 242 -36 -68 -4 17 -33 127 88 170 125 -269
2974 -269 202 -49 -15 -57 212 -53 4 62 -186 315 -27 85 -84 -187 -156 45 -221 -46 -77 164 278 75
2996 75 -269 182 -62 -18 -139 29 12 229 151 -18 7 -110 -82 -134 -45 132 -288 -177 -61 64 86 264 29
3019 29 -173 133 -14 -14 61 9 -112 -52 107 -218 44 -215 -77 70 58 -24 -107 -8 -86 191 21 -95 -166 265
3043 265 -157 5 -37 86 -71 47 23 48 10 -39 181 39 200 101 -65 79 106 -87 -14 55 38 174 -45
3066 -45 192 -38 -142 120 139 -105 189 -154 100 64 201 -323 140 -18 -13 147 -199 34 -178 37 -81 -27
$$ packed form
2900E3m6J5j56O0J07K89k95rj18J42o8J57j76j16K16j48j2m5K43m9j10J37j8j45
2924i2K7j31Mq3J45O6J3O8Q7rm2o2J23j02J79k25J61l42J41M4K4O0J35J55l76
2949c2J01k49l1K38N2j55K10l59ol9K87J63l38L22P8k78l2O4K1n0J60l9Q2m5l94
2974b69M71k51L4m2K69k65N7N8k48N01l42J12j69j03L1K01k66J75l1K41J14k03
2996G5l44M51k44M4j21J68j7K17p8j69K5j17K8n2Q9J77m20J11J16J25K2J78k35
3019B9k02L06j47%P5n2j21O0J59l25K62k59J38J47j2q2q3R9p8K77j70j16p1M31
3043B65m22J62m2J23j57J18k4K5l8m9K20j42J61r9j66J44K7j93P3O9j7J36k19
3066d5K37k30j04K62J9k44K94l43K54l6J37n24M63j58NJ60l46K33k12K15j18N4
$$ plain form
3088 -27 75 34 81 -45 149 -138 -88 -9 -182 148 -53 -171 59 -235 285 17 -175 -109 -74 -18 48 -11 109
3111 109 105 174 260 130 125 -66 41 -56 -152 10 -7 56 -16 144 3 -311 -247 109 189 -211 142 -106 309 -54
3135 -54 97 34 -1 3 144 -50 -159 -64 -18 -93 -73 126 18 251 72 44 -152 -25 -26 -79 69 -327 21 326
3159 326 92 107 40 55 -30 106 130 -6 22 -183 -61 -102 -133 38 186 133 112 254 49 261 119 19 204
3182 204 -21 -95 33 267 -72 37 51 -88 -19 -6 -42 143 233 19 65 162 -149 -175 -205 2 67 187 190 -182
3206 -182 -28 104 -303 133 2 11 146 -21 -130 445 -44 69 162 22 -66 -122 -13 33 5 -5 -71 -14 245
3229 245 38 184 -210 -100 -54 119 -166 92 -29 -327 144 -130 3 -47 -251 -38 37 -101 -128 -184 5 -95
3251 -95 -89 -25 26 7 292 -83 -49 -224 245 -177 -131 56 -182 40 -187 -93 77 136 -106 60 229 199 3 80
$$ packed form
3088b7J02m1M7j26J94k87N0P9j73L30k01j18K30k94N20k68j92O6L5N6O6n9J20
3111A09mO9Q6j30nj91J07r7r6J62j7O3p2J60j41l14O4L56Q0m00L53k48M15l63
3135e4J51o3l5MJ41j94j09R5M6p5K0J99j08K33j79k8j96J27jn3J48l96L48L05
3159C26k34J5o7J5q5J36K4j36K8k05J22m1l1J71J48n3k1J42k05K12j42j00J85
3182B04k25p4J28K34l39J09J4j39O9J3l6J85R0k14M6R7l11k6l0K07O5J20Ll72
3206a82J54J32m07M36j31RJ35j67j09N75m89J13R3j40q8n6J09M6k8j0o6N7K59
3229B45k07J46l94J10M6J73k85K58j21k98M71k74J33n0k04K13P5j38k7n6J89j00
3251i5OO4N1j9K85l75L4j75M69m22M6J87k38K22k27R4J70N9k42J66J69l0j96P7
$$ plain form
3275 80 80 -57 132 120 -385 -102 268 129 51 154 -29 34 -39 -234 -175 76 70 -19 -76 310 -349 -29 -18 -94 57
3300 57 -100 92 195 48 -7 -109 -47 -116 -52 376 44 74 -75 -1 20 136 307 -95 1 -161 53 171 -136
3323 -136 -43 -239 249 -131 -222 27 -106 133 125 124 -70 57 -102 -16 164 -146 62 -95 162 -94 -231 -113
3345 -113 -70 -189 -40 -54 11 21 -156 33 -28 -485 -142 -182 -249 103 -152 86 -61 -237 -154 -169 295 31 -169
3368 -169 -2 -20 150 -17 48 -350 148 24 -103 95 60 77 -78 -266 -130 300 -159 43 -271 -256 131 224
3390 224 158 10 -50 137 -327 346 125 -50 156 -72 82 214 133 262 20 -405 49 -57 126 98 -58
3411 -58 196 -156 -54 181 16 238 9 -153 -100 -72 101 -56 -59 196 -83 205 203 124 -239 194 -136 -188 16
3434 16 -62 118 -17 -69 -200 -12 248 -33 -85 145 284 47 -131 -77 31 395 -66 -3 57 105 -151 -179 49
$$ packed form
3275H0%j37J89j2n05K83L70j39p8J03j83O3p3j95N9K51oq9n7L86o59L20J1p6J51
3300E7j57J92J03j47n5j02O2o9O4M28l32L0j49P4K1J16J71m02R6j62K14J18l07
3323a36R3j96M88l80r1K49j33K39qjj94J27j59Q6J80l10K08j57K57k56j37J18
3345a13M3j19J49j4O5J0j77J89o1m57L43m0o7L52k55K38j47j76Q3j5M64k64k00
3368a69J67j8J70j67O5l98M98j24j27J98l5J7j55j88J36M30m59K02l14J5L87R3
3390B24o6j48o0J87m64O73k21j75K06k28J54J32q1J29k42m25M54j06J83k8j56
3411e8K54l52J02K35j65K22k29j62N3K8J73j57lK55k79K88kp9l63M33l30n2K04
3434A6p8J80j35n2j31J88K60k81n2K30J39k37j78N4J08L64m61O3O0M8k56k8K28
$$ plain form
3457 49 -399 64 117 -238 -42 -220 80 -27 -153 -172 -86 170 166 56 -77 5 54 -79 -25 148 202 -48 92
3480 92 -116 110 -66 -311 106 -50 42 -276 -166 19 53 193 -5 -261 -96 74 173 -117 107 135 78 -74
3502 -74 -112 27 50 -72 6 11 -12 -222 -62 227 26 124 -44 155 28 27 128 -292 55 121 -282 -114 26 62
3526 62 19 -23 44 -80 31 92 243 172 25 -18 -60 -112 -33 5 21 416 267 8 92 169 46 -150 11 224 108
3551 108 -53 -199 61 219 -4 -200 4 139 -30 29 177 50 -35 -26 -73 -163 -44 -24 36 -147 -240 110 -102
3574 -102 50 -174 24 -17 -97 -151 -58 218 -73 119 125 271 -7 27 70 -139 -105 -261 -24 -235 35 345 142
3597 142 228 41 23 -212 -20 45 -155 -196 -281 -95 -82 102 159 143 -20 -97 119 97 -85 52 48 -16 193 -29
3621 -29 -38 267 70 -266 -13 -160 -50 -46 -16 -203 -200 -206 98 109 -7 88 -98 -6 -17 33 46 210 -24 -24 57 -206
$$ packed form
3457D9m48M63N3l55J96j78L00j07j26j9Q6K56mj10j33Q2M9j33N4J73N4k50J40
3480I2k08K26j76k45M17j56R2l18J10J85L4J40j98k56J65J70R9k90K24K8n7j52
3502g4l8J39K3j22P8Nk3k10J60K89k01R8j68J99j27jJ01m20L47O6m03J68J40L6
3526F2m3m2O7j24J11O1J51p1j47m3m2n2P9L8J6L95j49k59Q4P7j23j96J61K13j16
3551A08j61j46K60J58k23j96K04J35j69N9J48j27q5Rm7r0J19K0O0j83r3L50k12
3574a02J52k24J98m1q0n4R3K76k91J92OJ46k78L4M3k09L4j56K37k11K70L10k03
3597A42Q6j87j8k35J92O5k00m1q5J86J3J84N7j6j63p7K16k2j82J37mo4K09k22
3621b9rL05j97l36K53j47J10ML0j87LoL04J1j16R5j86R2j1N0J3J64k34%Q1k63
$$ plain form
3647 -206 -95 38 0 -223 56 50 -102 193 -78 -169 -121 -229 -16 -73 265 -281 -86 -113 -14 -192 -121 112 -44
3670 -44 242 -64 148 33 -36 -90 179 14 -28 -31 20 44 167 143 101 -159 217 104 -99 -38 -8 -200 -85 -17
3694 -17 155 -232 -151 186 10 -62 -149 23 163 -232 -21 -142 190 -280 92 -358 157 79 -230 364 216 -67
3716 -67 36 -79 -28 -144 81 54 -74 19 68 22 -195 247 10 63 -285 38 -315 229 -136 -174 -79 14 40 -40
3740 -40 -80 44 93 92 313 -227 -181 15 -108 -27 58 34 -267 39 70 159 67 -61 -71 -80 161 -165 -142 35 -56 -187
3766 -187 138 -196 22 62 2 -93 -170 -100 -27 158 -35 -46 -3 57 -127 38 99 -65 -98 285 -182 -15 -182 -190
3790 -190 -252 -162 -86 61 128 -67 80 -118 174 -184 -24 98 28 157 14 171 4 -37 12 74 304 186 -5
3813 -5 -72 87 -55 -21 31 -80 43 284 -142 34 34 -118 -128 -46 -62 114 205 119 151 169 177 -67 119 5 128
$$ packed form
3647b06J11J33l8k23K79oj52K95k71r1M8j08K13n7L38n46J95k7R9j78P1K33j56
3670d4K86l06K12j15o9n4K69j65m2lN1K4J23k4m2k60L76j13k03O1L0j92J15O8
3694a7J72l87Q1L37j76p2q7J72J40l95K11j21L32m70L72m50N15p8l09N94j48k83
3716f7J03j15N1j16K25k7j28R3M9m6k17M42k37N3l48L23l53N44l65l8R5R3K6q0
3740d0m0J24M9jK21n40M6J96j23Q1Q5k4l01L06L1Q9r2j28j0rK41l26K3J77r1j31
3766a87L25l34K18M0o0r5p7P0P3J85j93j1M3O0j84J65O1j64l3L83m67J67j67q
3790a90o2R0P6J47O7j95J47j98K92l58J60J22p0J29j43J57j67m1M9O2K30j18j91
3813eo7J59j42L4N2j11J23K41m26J76%j52j0Q2j6J76R1q6L2J8Qk44J86j14J23
$$ plain form
3838 128 99 30 -24 59 -3 -134 -111 24 -190 130 119 15 90 92 33 212 40 15 122 61 235 183 116 31 38 -136
3864 -136 -108 30 84 -192 168 22 143 -50 -18 -67 -113 193 241 248 116 -238 87 142 86 -148 -86 65 -88 16
3888 16 -30 137 -50 -87 -54 82 235 -42 -33 -54 -158 -69 -150 221 -48 -50 -8 80 -42 -49 -134 239 279 -134 197 -13
3914 -13 479 115 31 83 59 124 155 134 -159 126 -130 48 216 92 11 112 249 136 -14 175 -123 -163 -51
3937 -51 55 -67 44 -134 -54 87 -85 36 -3 51 134 154 80 96 118 -100 35 -169 -92 232 -80 -158 236 -28
3961 -28 -164 -41 -69 14 -15 277 89 130 -14 -233 -204 -20 -92 166 100 -50 123 155 167 114 -414 -234 -93 189
3985 189 -64 159 -19 -105 -178 -157 61 -223 51 -249 24 313 -187 -110 29 71 -2 -19 203 175 107 -112 -64
4008 -64 -28 -45 109 -126 -37 -24 -80 -250 -172 -43 152 107 102 78 -93 -267 -109 106 -97 26 252 299 83 -72
$$ packed form
3838A28k9o9n4Q3o2j31K3J35k14L20j1j04P5Kn9J79j72k5J07o1J74n2o7q5Pj74
3864a36K8J38N4k76L60j46J21j93L2m9m6L06M8Pj32l54L25N5n6k34O2J51j53J04
3888A6m6J67j87l7L3J36J53k77Rk1j04Q9q1L71k69kM2Q8j22pq5L73M0m13L31k10
3914a3M92l64q4N2k4O5L1k1k93K85k56J78J68j24q1J01J37j13j50J89k98m0J12
3937e1J06j22J11j78Q0J41j72J21l9N4Q3K0p4J6K2k18J35k04P7L24l12p8L94k64
3961b8j36J23k8Q3k9K92j88M1j44k19K9J84p2K58o6j50J73L2J2n3n28J80J41K82
3985A89k53K23j78q6p3K1K18k84K74l00K73K89n00P7J39M2p3j7K22k8o8k19M8
4008f4L6j7J54k35Q9J3n6j70P8J29J95m5nk4j71j74J58K15k03J23K26M7k16j55
$$ plain form
4032 -72 76 56 12 -330 85 4 -64 -181 88 8 -25 124 -62 75 -130 86 204 -46 5 -23 -13 -23 -151 -216
4056 -216 -130 183 116 30 88 -74 -164 -68 -5 41 350 92 -47 -82 45 208 -35 -313 160 160 150 152 123 47 245
4081 245 69 65 150 -45 178 -164 -326 265 -7 -154 156 -169 77 -12 21 100 125 -89 64 -180 123 146 191
4104 191 206 -112 -131 99 -10 32 -4 156 -30 11 216 197 102 -73 124 -223 -122 84 177 -111 -5 148 -139
4127 -139 -16 48 243 114 -203 -265 -5 -161 41 0 60 -8 61 -74 27 -250 -43 125 49 49 -81 173 101
4150 101 -42 118 82 -4 -135 20 -46 -212 354 28 -19 -49 118 -226 -46 221 17 175 27 67 184 -244
4172 -244 -206 -23 -94 -153 167 54 197 -118 -126 148 123 82 83 -1 -10 59 108 39 -34 199 -206 51 -115 126 210 -95
4198 -95 94 -84 132 213 51 -115 385 8 13 87 91 68 237 129 107 271 -125 -96 -204 -243 -39 0 -49 180
$$ packed form
4032g2J48k0m4l42M15q1o8j17K69q0l3J49j86J37k05K16J18k50N1k8J0j0j28o5
4056b16Q6L13o7q6N8j62r0R6O3M6L09k58j39l5J27J63k43k78M73%j0Kk9p6J98
4081B45j76mQ5j95K23l42j62N91k72j47L10l25K46q9L3P9K5k14J53k44L03K3M5
4104A91J5l18j9K30j09M2l6J60j86M1K05j9r5j75J97l47J01K06R3k88J06J53k87
4127a39J23O4J95j29l17o2K60j56K02m1O0o8O9j35J01k77K07J68p6%j30K54p2
4150A01j43J60l6q6j31J55o6j66N66l26m7l0J67l44J80K67k04J58j48M0J17m28
4172b44L8J83p1n9L20j13J43l15qK74k5m1Jq4rO9M9o9p3K33m05K57j66K41Q4l05
4198i5J89j78K16Q1j62j66N00l77NP4Mk3J69j08k2J64l96K9j08l9K04L9m9K29
$$ plain form
4222 180 -22 0 102 142 120 186 3 -93 -134 -94 -17 76 260 -143 -169 -100 -94 84 50 -105 138 253 179 -137 -46
4247 -46 -124 -29 -91 44 -78 -228 -158 -136 -25 139 -297 123 -248 -121 21 -153 -37 -43 49 -1 -15 106 203 211 135
4272 135 44 38 21 -72 0 33 255 -108 -176 -298 -146 35 16 -59 -126 63 198 -6 196 70 -64 -232 57 -33
4296 -33 179 126 25 45 124 -7 147 -184 -119 -126 -174 -112 -179 16 410 109 85 18 111 -60 -104 68 -183 -46 123
4321 123 -16 -28 -3 32 23 -164 211 146 128 -114 28 -35 -128 86 46 -49 -64 -194 154 65 -261 -304 -248 187 56
4346 56 51 138 -117 -180 49 124 -85 181 76 -129 -157 -221 198 -97 -92 47 121 66 77 -32 188 136 64 77 -29
$$ packed form
4222A80k02K2J02M0k2O6j83r6m1M0P7R3J84m03k6O9OJ78l4j55K43J15p4l16R1
4247d6p8R5o2J35j22j50P0K2J11J64m36M20l71J27J42j74J16oR2n0j4J21R7Qp6
4272A35r1oj7r3P2L3K22l63o8j22J52J81j9p5o7J89J35k04K02j26j34j68K89r0
4296c3K12n3j01K0P9j31J54l31O5pm8O2o7J95L94l01k4o7R3j71m4J72k51J37J69
4321A23j39j2K5L5rj87L75o5j8k42J42o3r3K14m0r5j5j30L48q9l26m3N6M35j31
4346E6nQ7k55o3K29P5k09K66j05k05k8o4M19k95NJ39P4n5J1j09K20n2p2J3j06
$$ [...]
8191B14
##END NTUPLES=NMR FID
##END=
