##TITLE=1H_LR-758-R8-RMC2
 CDCl3
 8 sc, 
 31.10.2023
##JCAMPDX= 6.0         $$ Bruker NMR JCAMP-DX V2.0
##DATA TYPE= NMR FID
##DATA CLASS= NTUPLES
##ORIGIN= UXNMR, Bruker Analytische Messtechnik GmbH
##OWNER= root
$$ XWIN-NMR		Version 3.5
$$ Tue Oct 31 15:28:43 2023 Russian Standard Time (UT+4h)  she@DPX200
##.OBSERVE FREQUENCY= 200.13135
##.OBSERVE NUCLEUS= ^1H
##.DELAY= (6, 6)
##.ACQUISITION MODE= SIMULTANEOUS
##.ACQUISITION SCHEME= undefined
##.AVERAGES= 8
##.DIGITISER RES= 18
##SPECTROMETER/DATA SYSTEM= spect
##.PULSE SEQUENCE= zg30
##.SOLVENT NAME= DMSO
##.SHIFT REFERENCE= (INTERNAL, DMSO, 0, 15.7039)
##AUDIT TRAIL= $$ (NUMBER, WHEN, WHO, WHERE, WHAT)
$$ ##TITLE= Audit trail, XWIN-NMR		Version 3.5
$$ ##JCAMPDX= 5.01
$$ ##ORIGIN= Bruker BioSpin GmbH
$$ ##OWNER= she
$$ F:/spectra/data/she/nmr/H-F/1/audita.txt
$$ ##AUDIT TRAIL=  $$ (NUMBER, WHEN, WHO, WHERE, WHAT)
(   1,<2023-10-31 15:27:22.31 +0400>,<she>,<DPX200>,
      <created by zg, POWCHK disabled, PULCHK disabled
       configuration hash MD5:
       00 E9 B6 7A A2 85 ED C7 34 08 36 98 17 FE 4E 26
       data hash MD5: 16K
       31 7A EC 46 76 1C 1C 7F E6 D3 89 5C 1B 9C 5F 01>)
$$ ##END=
$$ 
$$ hash MD5
$$ 3B D7 5E 78 AC 63 1B D4 C2 09 53 34 B5 8B 98 41
##$RELAX= 
##$RELAX= 
##$RELAX= 
##$RELAX= 
##$RELAX= 
##$RELAX= 
$$ Bruker specific parameters
$$ --------------------------
##$DU= <F:/spectra>
##$EXPNO= 1
##$NAME= <H-F>
##$PROCNO= 1
##$TYPE= <nmr>
##$USER= <she>
##$AMP= (0..31)
100 100 100 100 100 100 100 100 100 100 100 100 100 100 100 100 100 100 
100 100 100 100 100 100 100 100 100 100 100 100 100 100 
##$AQSEQ= 0
##$AQ_mod= 1
##$AUNM= <au_zg>
##$AUTOPOS= <>
##$BF1= 200.13
##$BF2= 200.13
##$BF3= 200.13
##$BF4= 200.13
##$BF5= 200.13
##$BF6= 200.13
##$BF7= 200.13
##$BF8= 200.13
##$BYTORDA= 1
##$CFDGTYP= 0
##$CFRGTYP= 5
##$CHEMSTR= <none>
##$CNST= (0..31)
1 1 145 1 1 1 1 1 1 1 1 1 1 1 1 1 1 1 1 1 1 1 1 1 1 1 1 1 1 1 1 1 
##$CPDPRG= <>
##$CPDPRG1= <>
##$CPDPRG2= <>
##$CPDPRG3= <>
##$CPDPRG4= <mlev>
##$CPDPRG5= <mlev>
##$CPDPRG6= <mlev>
##$CPDPRG7= <mlev>
##$CPDPRG8= <mlev>
##$CPDPRGB= <>
##$CPDPRGT= <>
##$D= (0..31)
0 1.2 0 0 0 0 0 0 0 0.06 0 0.03 0 0 0 0 0.0002 0 0 0 0 0 0 0 0 0 0 0 0 
0 0 0 
##$DATE= 1698751641
##$DBL= (0..7)
120 120 120 120 120 120 120 120 
##$DBP= (0..7)
150 150 150 150 150 150 150 150 
##$DBP07= 0
##$DBPNAM0= <>
##$DBPNAM1= <>
##$DBPNAM2= <>
##$DBPNAM3= <>
##$DBPNAM4= <>
##$DBPNAM5= <>
##$DBPNAM6= <>
##$DBPNAM7= <>
##$DBPOAL= (0..7)
0.5 0.5 0.5 0.5 0.5 0.5 0.5 0.5 
##$DBPOFFS= (0..7)
0 0 0 0 0 0 0 0 
##$DE= 6
##$DECBNUC= <off>
##$DECIM= 32
##$DECNUC= <off>
##$DECSTAT= 4
##$DIGMOD= 1
##$DIGTYP= 9
##$DL= (0..7)
0 120 120 120 120 120 120 120 
##$DP= (0..7)
150 150 150 150 150 150 150 150 
##$DP07= 0
##$DPNAME0= <>
##$DPNAME1= <>
##$DPNAME2= <>
##$DPNAME3= <>
##$DPNAME4= <>
##$DPNAME5= <>
##$DPNAME6= <>
##$DPNAME7= <>
##$DPOAL= (0..7)
0.5 0.5 0.5 0.5 0.5 0.5 0.5 0.5 
##$DPOFFS= (0..7)
0 0 0 0 0 0 0 0 
##$DQDMODE= 0
##$DR= 18
##$DS= 0
##$DSLIST= <SSSSSSSSSSSSSSS>
$$ [...]
##$SUBNAM2= <"">
##$SUBNAM3= <"">
##$SUBNAM4= <"">
##$SUBNAM5= <"">
##$SUBNAM6= <"">
##$SUBNAM7= <"">
##$SUBNAM8= <"">
##$SUBNAM9= <"">
##$SW= 18.05172834244
##$SWIBOX= (0..15)
0 0 2 0 0 0 0 0 0 0 0 0 0 0 0 0 
##$SW_h= 3612.71676300578
##$TD= 16384
##$TD0= 1
##$TE= 0
##$TE2= 300
##$TE3= 300
##$TEG= 300
##$TL= (0..7)
0 120 120 120 120 120 120 120 
##$TP= (0..7)
150 150 150 150 150 150 150 150 
##$TP07= 0
##$TPNAME0= <>
##$TPNAME1= <>
##$TPNAME2= <>
##$TPNAME3= <>
##$TPNAME4= <>
##$TPNAME5= <>
##$TPNAME6= <>
##$TPNAME7= <>
##$TPOAL= (0..7)
0.5 0.5 0.5 0.5 0.5 0.5 0.5 0.5 
##$TPOFFS= (0..7)
0 0 0 0 0 0 0 0 
##$TUNHIN= 0
##$TUNHOUT= 0
##$TUNXOUT= 0
##$USERA1= <user>
##$USERA2= <user>
##$USERA3= <user>
##$USERA4= <user>
##$USERA5= <user>
##$V9= 5
##$VALIST= <valist>
##$VCLIST= <CCCCCCCCCCCCCCC>
##$VD= 0
##$VDLIST= <DDDDDDDDDDDDDDD>
##$VPLIST= <PPPPPPPPPPPPPPP>
##$VTLIST= <TTTTTTTTTTTTTTT>
##$WBST= 1024
##$WBSW= 4
##$XGAIN= (0..3)
0 0 0 0 
##$XL= 0
##$YL= 0
##$YMAX_a= 227561
##$YMIN_a= -396990
##$ZGOPTNS= <>
##$ZL1= 120
##$ZL2= 120
##$ZL3= 120
##$ZL4= 120
##$ABSF1= 10
##$ABSF2= 0
##$ABSG= 5
##$ABSL= 3
##$ALPHA= 0
##$AQORDER= 0
##$ASSFAC= 0
##$ASSFACI= 0
##$ASSFACX= 0
##$ASSWID= 0
##$AUNMP= <proc_1d>
##$AZFE= 0.1
##$AZFW= 0.1
##$BCFW= 1
##$BC_mod= 2
##$BYTORDP= 1
##$COROFFS= 0
##$CY= 11.3945322036743
##$DATMOD= 1
##$DC= 2
##$DFILT= <>
##$DTYPP= 0
##$F1P= 15.7292609196834
##$F2P= 12.9074282941183
##$FCOR= 0.5
##$FTSIZE= 0
##$FT_mod= 4
##$GAMMA= 1
##$GB= 0.15
##$INTBC= 1
##$INTSCL= 1
##$ISEN= 128
##$LB= 0.24
##$LEV0= 0
##$LPBIN= 0
##$MAXI= 10000
##$MC2= 0
##$MEAN= 0
##$ME_mod= 0
##$MI= 1.114404
##$NCOEF= 0
##$NC_proc= 0
##$NLEV= 6
##$NOISF1= 3.799351
##$NOISF2= 2.8
##$NSP= 1
##$NTH_PI= 0
##$NZP= 0
##$OFFSET= 15.70392
##$PC= 1
##$PHC0= -23877.72
##$PHC1= 16.45271
##$PH_mod= 1
##$PKNL= yes
##$PPARMOD= 0
##$PSCAL= 0
##$PSIGN= 0
##$REVERSE= no
##$SF= 200.130013532006
##$SI= 16384
##$SIGF1= 3
##$SIGF2= 2
##$SINO= 400
##$SIOLD= 16384
##$SREGLST= <1H.CDCl3>
##$SSB= 0
##$STSI= 0
##$STSR= 0
##$SW_p= 3612.71676300578
##$SYMM= 0
##$S_DEV= 0
##$TDeff= 0
##$TDoff= 0
##$TI= <>
##$TILT= no
##$TM1= 0
##$TM2= 0
##$TOPLEV= 0
##$USERP1= <user>
##$USERP2= <user>
##$USERP3= <user>
##$USERP4= <user>
##$USERP5= <user>
##$WDW= 1
##$XDIM= 8192
##$YMAX_p= 0
##$YMIN_p= 0
$$ End of Bruker specific parameters
$$ ---------------------------------
##NTUPLES= NMR FID
##VAR_NAME=  TIME,          FID/REAL,        FID/IMAG
##SYMBOL=    X,             R,               I
##VAR_TYPE=  INDEPENDENT,   DEPENDENT,       DEPENDENT
##VAR_FORM=  AFFN,          ASDF,            ASDF
##VAR_DIM=   8192,          8192,            8192
##UNITS=     SECONDS,       ARBITRARY UNITS, ARBITRARY UNITS
##FACTOR=    0.0002768,     1,               1
##FIRST=     0,             0,               0
##LAST=      2.2672688,     0,               0
##MIN=       0,             -396990,         0
##MAX=       2.2672688,     227561,          0
$$ Real data points
##PAGE= N=1
##DATA TABLE= (X++(R..R)), XYDATA
0@%%%%%%%%%%%%NnQj6J6j6K0k8L2l6M4n0N8o8P6q8J03j18J34j52J73j93K17k46
36a30K75l06L39l79M23m67N16n71O31o98P68q44R32j026J128j244J372j514J676
55H81j862K073k318K608k954L377l904M583n495O783q723J1941j8164L4137j43479
70a20516k76474M42190O4081j47071K55555j13045l95272K27269K63619j43801
80E6535K7589K2019k46084O2506K44745n9819p0544J2055j21109K1086J50608
91I9587k0302m2619k1872r7110M4984J03539m2729L884N266j28840K9781J33332
103F6901o4110k3376P5753j14896m8862J65485j7867q9685R3165m9148j14550
114a21190J45622N8996j25560M5103K1849j16443P8824J10305r1916k2124L7696
$$ y = [0, 0, 0, 0, 0, 0, 0, 0, 0, 0, 0, 0, 0, 5, 0, 8, -8, 8, -8, 12, -16, 16, -20, 24, -26, 32, -36, 40, -48, 55, -63, 71, -81, 92, -101, 116, -130, 145, -161, 178, -201, 222, -245, 271, -300, 331, -367, 401, -443, 489, -537, 591, -653, 719, -795, 881, -981, 1092, -1226, 1382, -1572, 1805, -2099, 2484, -3011, 3772, -4951, 6990, -11174, 22963, -120516, -396990, 45200, 109281, -37790, 217765, 104720, -290552, -63283, 200336, 56535, 84124, 106143, -139941, -77435, 167310, 107491, 36947, 49002, -72107, -51021, 99587, 79285, 36666, 14794, -82316, -37332, 66207, 23478, 27362, 32628, -96212, -66431, 66901, 2791, -20585, 55168, -59728, -108590, 56895, 39028, -50657, 42508, -6640, -121190, 24432, 83428, -42132, 2971, 24820, -91623, -12799, 97506, 5590, -16534, 21162]
125B1162p4596K8247J14175n2202n9582L7079l5477L64R5927k6423o8678K9209
137I205j4918o705P6162k3813o9544L1993M594j8136N4478j1110p1696K6044L0083
150A6637k9835K7534J0726o8831J1947N5407l2790l071L0170n0512o274O2884
162B3992j9259k8355K9114j8852j7264M7475K137l4586J3651K720j8997K9637
174A1413J6323l6145R99J5246j8565J5085K1517k7948o667J3000j3377J0017J9164
187B0062k0529r207J0053q906M539K0186j1265j7853R947p44l052K1960l515k5149
201a3473Q227O430o746K0799J334k8206K673J1074m090J3352N212k4021p915J3424
215a926L714M689P603j8645j6324J4594R414K3P772j3214j8532J0926J1578L099
$$ y = [21162, -53434, -25187, 88988, 36786, -22796, 14283, -21194, -20830, 75097, 48674, -20004, 9205, -5713, -12418, 63744, 39931, -29613, 2380, 6974, -11162, 43316, 32206, -39490, -13446, 16637, -13198, 14336, 25062, -43769, -31822, 23585, -9205, -12276, 17894, -32618, -38892, 23992, 4733, -23622, 5492, -13360, -30624, 16851, 18988, -15598, -1947, 773, -18224, 11413, 27736, -8409, -7410, 7836, -10729, 4356, 25873, -2075, -8742, 4258, -9119, 898, 20062, -467, -9674, 379, -8527, -3988, 16198, 4933, -12920, -2973, -3717, -6769, 15191, 11676, -13473, -5246, 1184, -5562, 15237, 16571, -11635, -8962, 2112, -1978, 11374, 16586, -7435, -15350, -1926, 1788, 6477, 14080, -4565, -20889, -6295, 3119, 3142, 10914, -2300, -20832, -9906, 1672, 4771]
229D771N364j1989j4709N976J1355P117J856r786j2752K004J2185P988Q92q172
243B100j5258J243J4623M670J653n437j8468Q46J6256M316J885m696j6980j465
257a4712J5349Q581r12n588r835n195J1919J3557l690p000n116o324Q800J4321
271A4155l679r561n591j707O984Q517R77p891j0795O31P074M500L717n781j0727
286i177n5O600M476J167l162m000l957M100Q023j853l737N47l286K295P343j892
302C432l285n84r38Q04K346L303j933n442J183P63j438M287Q46m879n31P3l06
319b299J607J614n28l379J156M264l323q93L287k872J510N025l639l174J817J613
335A786J448O73r41l606j617N779J816m635j307j921L9N667Q52m840m711j113
$$ y = [4771, 10135, -1854, -16563, -10587, 768, 7885, 9741, -45, -12797, -10793, 1392, 9380, 10272, 2100, -13158, -11915, 2708, 7378, 9031, 3594, -14874, -14028, 2228, 6544, 8429, 3733, -13247, -14712, 637, 9218, 8306, 2718, -7117, -12312, -393, 13164, 9474, 2474, -2642, -8966, -166, 14155, 10476, 915, -4676, -6383, 601, 9118, 10095, 2204, -8591, -7960, -886, 3614, 7331, 1550, -9177, -9232, -2632, 1844, 3011, -151, -4151, -8108, -4008, 4015, 2162, -1575, -1028, -4314, -2019, 5324, 3432, 147, -437, -1375, -571, 1775, 5078, 3145, -2297, -1114, -351, -1789, 2498, 3344, -1535, -2066, -1993, -2299, -692, 922, 394, -2985, -1829, 2435, -888, -1781, 1506, -1366, 144, 5169, 1530, -1644, 173, 1786, 3234, 3907, 2966, -640, -2257, 3522, 5338, 703, -604, -2525, -2486, 3181, 4033, -807, -5518, -6631]
351f631M253L728J270k369q071j444P590K904J248l44p495k632N432N051K074
366D564k289l739m031K183Q401J376l804k138n012O55R079K164l812m558m421
381e382J944P003M404k020p970m376L300N568N902j038q266m688J597P128O563
396I669k584n911n381o91Q481O027l813n227o195j049Q678O004k680p215o263
411h150R98O320O674j084q933m652J407M647Q268N64r648m021J457M265P781K75
427F168o434n043K15N453N658R48m546o887r1O145L087J125m124p212K80M464
443g94M318J472o300n689N86L098N901J030o516m207L43L930N414J208m679n076
459e961K81O357L241M3k160o944O03P716J679r35j445o279o92O628K960k318l676
$$ y = [-6631, -2378, 1350, 2620, 251, -7820, -9264, -1674, 1230, 2478, 2134, -5361, -7993, -2561, 2490, 4564, 2275, -1464, -5495, -3312, 5089, 6465, 2661, 523, -4489, -3834, 5245, 7409, 3597, -961, -5382, -3438, 3565, 7969, 5949, -2021, -6397, -3097, 2471, 8373, 7335, -931, -5619, -4022, 3106, 9669, 7085, 1174, -4207, -4898, 3583, 9610, 5797, 570, -5625, -6674, 2004, 8008, 5328, -1887, -8150, -7152, -832, 5842, 4758, -4175, -8827, -7420, -2773, 5495, 6059, -3589, -7610, -6153, -1888, 5893, 6168, -266, -5309, -5094, 359, 6017, 6965, 2419, -4468, -4559, 1586, 4673, 5798, 1674, -5538, -5258, -794, 3524, 4996, -1304, -6993, -6407, -3309, 2592, 3622, -2894, -7101, -6758, -2828, 2586, 3794, -885, -5961, -5680, 677, 3918, 3961, 1801, -5143, -4540, 3176, 4855, 3920, 2475, -3804, -4496, 2132, 5092, 2774, -902]
476i02k454j589M278N321l063n324j89j139L077N683k562m794j198N39M166L011
492B861j161l519l172J863M815J486j203l744k880K192M336K277k100n123k54
507c326K234K290M028k605o902M05L513K560L150k249o006j432M259M679N02r58
523D142m590m791M837O697j423j665l525n328L869O733l43l803m715k878K333
538d450O205K333n857n890k70K593N240K925n301n234j147L691P102J543m238
553g55m042j973M567Q037m6m314l258j472M245O912R91n192n207N81L184M669
569F927L099o772p003K423K079L794L594o627o846R60K909L855K240m501n952
584e821j148M781L861J68j701o242j464N310M256O79k175o753o01N365L974J691
$$ y = [-902, -3356, -4945, -667, 4654, 1591, -3733, -3922, -5061, -1984, 3699, 1137, -3657, -4855, -4316, -150, 2861, 1700, -1819, -4991, -3128, 1687, 3173, 1970, -1774, -4654, -2462, 1874, 4151, 2051, -3072, -3326, -1092, 1198, 5226, 2621, -4281, -3876, -363, 2197, 5347, 3098, -2908, -4340, -81, 4598, 5100, 4142, -448, -5239, -402, 6295, 4872, 3207, -318, -5646, -1777, 4956, 4613, 810, -3905, -6783, -4450, 1755, 4088, -1769, -7659, -7929, -5336, -96, 2829, -2472, -7706, -8853, -5162, 1940, 3483, -755, -4797, -6770, -2203, 5834, 5788, 1474, -1784, -3256, 989, 7901, 8892, 3700, -1507, -926, 2258, 6927, 10026, 3254, -3749, -1326, 753, 4547, 8141, 1514, -5332, -4372, -1463, 2392, 4632, 131, -5821, -6969, -2188, 1673, 1841, 140, -6102, -7566, -2256, 2000, 2679, 504, -6249, -6850, -1485, 2489, 4180]
600D180l355o261J80M390M474J614m391n054m96N449M587o69l247l707j424N951
616B221N095k517k336l298j807O107M802k321l544k923q34L688M220n40n286k723
632a996J45J800M123J71n766k759O32J784L601l17l877k659l49L556K968l81k377
649a701l072J7M916K546o95j511l066K84L567K872J085l785l176J396K414K907
665D998M50m173k727L12J879L421j56l140l554p87M169K374j159j665l545j377
681d680M874K731j359j464k767j389L448L698n11l425j024o33O69N140j12m630
697a434p96J7J99L864R66l890k121J02J578K844P66k516l092l18K941K494J489
714C093k619l534M74K499K908J584l441k763P20P13L575K074m152l139N85Q87
$$ y = [4180, 825, -5436, -5256, -866, 3608, 5222, 831, -4223, -4719, 730, 5317, 4648, 1401, -2306, -3730, 2221, 7316, 4799, 2463, -835, -2642, 3465, 8267, 5946, 2402, -521, -1355, 2333, 6553, 6013, 727, -1996, -1851, -51, 4072, 4243, -1523, -4282, -3650, -1866, 1735, 1418, -2459, -5118, -5467, -1911, 1057, 676, -1701, -4773, -4756, 160, 2706, 2011, 500, -2566, -2282, 1285, 4157, 5242, 1457, -1719, -323, 2091, 4998, 5448, 1275, -1452, -1140, 739, 4160, 4004, 864, -2690, -3477, 692, 3066, 1907, 242, -3303, -4680, 194, 2925, 1566, 102, -2665, -4054, -606, 3092, 2581, -844, -1868, -2501, -1832, 3308, 3196, -1434, -2230, -2213, -2014, 1850, 2816, -1074, -3195, -3093, -1515, 1329, 2095, -421, -3513, -3831, -890, 1604, 3093, 474, -3060, -2586, -87, 2821, 4405, 964, -1799, -1079, -366, 3209, 5283, 1131, -2008, -1423, -536]
730e36K879J599k825m151k7L046P90J146n98n161q90M356Q95Q18K26m385j451
747d269L565K386R62j413k810j106J864L464J041k305j971j439J318L457O49j537
763A856l264k127L014K284J0k23l736k193L296K185M28q92k921j450K349K907
779A523P97k361j365j027M89M365J399l474r16n02l75L658J360k241k176j317
795b163J630J868J011p31l486j005K235P70Q95%l297n31J345J985J325j700j444
812a293m20L80K772J024j999q58o63P01K024R18j104j756r43J300Q31N61m1k838
830a404m80J688M96J19J36k385n63J549R72L43p49j025n11L65K325L39j545l7
848c67n61L29K049L1j091p47k46J241N59o6r5j834m7J742J59K21p44k047N55J056
$$ y = [-536, 2343, 3942, 1117, -3034, -3061, -15, 775, 1921, 1323, -3838, -4728, -372, 523, 1341, 1567, -2818, -4269, -704, 1682, 2644, 1231, -1579, -2685, -821, 2643, 3684, 1379, -592, -2031, -713, 2744, 3393, 1856, -1408, -3535, -521, 1763, 1773, 1550, -2186, -4379, -1083, 1102, 1530, 638, -2283, -3733, -1384, 1523, 2320, -41, -1406, -2433, -1944, 2421, 3820, 346, -570, -1072, -1447, 2211, 3571, 1330, -846, -2163, -533, 1335, 2346, 1615, -1871, -2876, -641, 129, 1024, 1024, -2273, -2804, -1459, 526, 1851, 151, -1293, -1713, -1333, 1439, 2463, 464, -394, -1057, -356, 1668, 2586, 1482, -274, -1217, 83, 914, 1475, 1434, -1404, -1884, -196, 300, 419, 555, -1830, -2393, -844, 128, 471, -278, -1303, -1814, -1449, 876, 1215, -330, -367, -928, -599, 1450, 1481, 390, -357, -603, 638, 1197, 1131, 1036, -798, -845, 897, 1056, 1277, 533, -1514, -959, 97]
868I7K50M87j750n52N38Q97J725q49k036O10K57Q99J155r84j233P3M05J358jo42
888G04p11j373J072J567r08o09m63j279J277J167m01q32p68k00J120O77O23r88
906c25j366Q22N58Q81J363j653j031P53O16J390J17j370p91m74J479J598j107
923A460p14j205r64J934J330o43j403j219o8J268N61P17j836j504J196L61J150
940D21J052k124j525J383Q19J134K53j467j176M8K223R50j096m39j456l05K426
957A121O89j068r13j244P1J578Q96J2j559j846J122J037J388j6j769j266Q17J371
975D21J224n02r64q66m83K371J108j674m80j138p75K742J198j369j529q95K85
992a326J162J273m04k271m89Q13P52J218m8k344j68Q16P72J632l89j904q2J52
$$ y = [97, 347, 834, -916, -1468, -930, -33, 1692, 843, -1193, -583, -326, 573, 1728, 744, -489, -416, -11, 1347, 1346, 704, -7, -1380, -308, 1259, 351, -258, -721, -2000, -723, 444, 43, -789, -1557, -1757, -637, 40, 663, -325, -1691, -869, -311, 570, 1933, 280, -751, 2, 618, 2008, 2125, 755, -36, -510, 969, 2567, 1460, 746, -459, -1423, 511, 1841, 1198, -205, -1424, -1492, -224, 337, 1054, -782, -2286, -1090, -729, 421, 1473, -651, -2176, -793, 26, 1160, 1413, -54, -1230, -1182, 1041, 1991, 895, 456, -1000, -1305, 1121, 1810, 742, -171, -1415, -1344, 234, 1130, 1142, -417, -2263, -1141, -104, 1284, 1268, -501, -1767, -950, 421, 1645, 1143, 179, -687, -1170, 1201, 2309, 635, 155, -983, -1758, 984, 2182, 813, -716, -1611, -1326, -164, 1109, 705, -1566, -2055, -1242, -490, 728, 680, -1664, -1832, -1016, -244, 1388, 999, -905, -987, -835]
1010h35J721J448j127j378l54j38J899R80r39j634r28Q71J014O70n2k249j007
1027b038J623P8R10M96k580o32J437O99M85J65j337j161J159J809L17o29q49j407
1045a455J254J970j27m56j133j264J182J478K42l66j716j057J356J166j37m76
1061D61j328j075J041J606M07j268r93k71J84K373M73j809l76m39J76K363J16
1078A641j800l43o62Q36J572K14j117j487l70J248R07R07j378j810K55R78J043
1095F34R14j704j043P6M96J735M70j428j275L99P43J887k48j161j012m30J279
1112C32J313p6q67j927K0J510L10N54j060k135L26Q78J100O24j329j500%J034
1130h93J476K23j201r11o92J789J504p2o49j426k68J452J403j4q21j509k90J393
$$ y = [-835, 886, 2334, 1207, -171, -525, -663, 1236, 2216, 1277, -357, -1285, -414, 600, 1270, 1218, -1031, -2038, -415, -337, 573, 1069, -1511, -2143, -706, -7, 478, 643, -694, -1855, -696, 1113, 1430, 801, -48, -1455, -201, 1769, 1642, 1186, 53, -1211, -29, 1449, 1691, 1325, -391, -1448, -92, 1074, 937, 461, -867, -1942, -901, 705, 1112, -156, -1149, -1420, -1236, 1137, 1610, -199, -575, -1014, -838, 1525, 1641, -159, -502, -1164, -328, 1244, 1458, 341, -1146, -1516, -268, 639, 1546, 168, -1642, -1387, -409, 634, 1548, -156, -1199, -1123, -627, 1108, 1578, 150, -1125, -726, 17, 1904, 1656, 495, -517, -947, 332, 1645, 1569, 702, -1225, -1205, 305, 615, 1169, 109, -2026, -1700, -822, 278, 902, -427, -1927, -1927, -893, 583, 806, -395, -1306, -1998, -209, 1295, 1223, 574, -852, -1120, 332, 1735, 1721, 900, -609, -899, 494]
1148D94O23O49j084j685O8J005R39L22j189j196k86Q41J500j33j281q09k66O97
1166g91J789j46j025q80l44J196J451j07q64j208k6J136O18M33r01j290Q9P12
1184a58Q27Q01j340j488l3R59J272P7j059r22J3O20J614j03j116m46n66Q68J642
1203A462j70r32p89j13J111O23N67j063j534O49L34O29N73j426j030M33L31N44
1221A99L75j200n62j71P44J360l62p67p33j08J011R35j07k34j012QJ146L5P74
1240A331p71j216O18N80J86M89q05j106N8N37Q16k70p30o02k18P94Q41m64l09
1259b41p96k73J300P97o77j70o73j19J157M53M0o54o13K95O60L26Q4q33o78K58
1279c57M72R19n82q57j78k94O61R96o78n84r3m38P57J043n00n05p01K31Q63N34
$$ y = [494, 1117, 1766, 682, -1003, -935, 70, 1009, 1331, 142, -1054, -1340, -499, 1001, 868, -413, -1222, -1488, -791, 998, 852, -173, -1053, -1397, -201, 1250, 1143, 279, -929, -955, 181, 799, 1232, 331, -959, -870, -158, 669, 1470, 130, -1358, -1391, -432, 840, 917, -142, -1064, -1051, -431, 1183, 1080, -36, -482, -1048, -180, 1462, 1292, 360, -429, -542, 569, 1192, 1759, 696, -838, -189, 145, 774, 1347, -79, -1109, -676, -345, 199, 574, -626, -1188, -1359, -615, 745, 383, -384, -1117, -1225, -214, 721, 614, 380, -632, -624, 522, 557, 1331, 560, -656, -38, 542, 728, 1217, 412, -694, -636, -99, 717, 447, -283, -885, -1103, -309, 532, 68, -241, -1037, -1310, -10, 787, 110, -60, -733, -852, 305, 758, 798, 144, -469, -174, 486, 812, 896, 63, -615, -357, 115, 1034, 452, -405, -583, -877, -216, 780, 102, -482, -575, -1013, -256, 787, 287, -218, -919, -688, 175, 709]
1299G09K6p12p11O16M73Q57R9j324m75L92L19O60l12p25n53K77L06N32k73n51
1319c70o18J2R28K26J97o58r35M42R40L04Qm45r01L35Q00M37K34j114m16O72M46
1340E24M33o9q92o23O9Q89L91m57l82r74J40J442o9o09j61p82J50J504j60Q8r30
1361d78m66M22J101N18l30j377K45M30K44P48l93j027l30M62M53J021j075o11
1379d43k49K03R74P6o48m55o16N05N99K45k1p59l70M49L07J024j60j499L43N34
1399C9K70R73o50o91k30M48N25J90m37m98o40L50O72K42n47l29n34K28P90J9l36
1420a46m00k56L32O00Q7J24q82l5L44N08K23O2q20Q2J93M40K03m56r1l94K69P36
1442G23k58p31k4k09K21N77j15r3o03j01K77M19K50l19o69N03nK19L80k41m09
$$ y = [709, 735, 23, -688, -72, 401, 1258, 1357, 33, -442, -50, 269, 929, 617, -108, -661, -384, -78, 454, 181, -370, -988, -976, -48, 178, 375, -283, -1218, -776, 164, 468, 476, 31, -870, -535, 265, 702, 936, -178, -594, 78, 524, 957, 888, -4, -627, -558, 331, 722, 265, -117, -1091, -951, 491, 422, -187, -348, -1130, -980, 524, 364, 452, -478, -944, -522, 579, 1097, 767, -610, -365, 65, 309, 1057, 664, -363, -693, -231, 222, 1243, 168, -443, -692, -489, 485, 561, -87, -542, -1158, -653, -54, 191, 170, -589, -959, -510, -203, 821, 661, -838, -495, 39, 309, 1282, 632, -59, -289, 159, 684, 874, 437, -61, -701, -351, 321, 563, 16, -313, -847, -619, 171, 190, -146, -546, -802, -470, 130, 217, 341, -541, -576, -232, 276, 499, 561, -259, -177, 16, 456, 659, 203, 112, -282, -13, 723, 465, -266, -290, -499, -278, 299, 184, 91, -512, -613, -336, 83, 333, 14, -655, -152, -157, 62, 442, 201, -208]
1463b08j24O15k9K86n27J30k62K32N05k11o64L74m60K99M69o39j59J55j68N00
1483A14j31m41J68m34M93L10j84p2r5pN12M5K24k38k33j1L66J57J01m85l79J21
1505i9j6N22L7o80P7k01M30J22k5n84k71oO57J28L6k18k68J58L00L19j64k48l29
1528c23N86J28M2K55n99l66L80J41L71r9q06J50k56K76L16j20m40j43k25O07K61
1549A36j57l52l93M54O58r5K56o83j01L51L79L2j46m12j14K32J77M41j31o52q2
1570b02M4L30O09q90r8k71r8N82K22k67r5o66M96N13k2p1l00n10N25M55P9M9m94
1593h0nO3L90N8j16m32o0J39L43J73m58k36k23j03O63L11k80l22l98j99Q71P5
1615A74J5m35k94N2O07J45r8n11L35j49K01L34j94Jr3R4m3M75m25J08k83k76J80
$$ y = [-208, -332, 283, 254, 540, 13, 143, -119, 113, 618, 407, -257, 117, -343, -44, 425, -214, -373, -218, -386, 114, -17, -458, -290, -724, -231, 79, -105, -177, -272, -279, 233, 278, 502, 264, 31, 20, 386, 543, 644, 159, -220, -99, -115, 407, 444, -236, -159, -360, 70, 192, 167, -417, -688, -694, -37, 91, 127, -91, -359, -201, 99, 418, 254, 6, -323, 263, 391, 433, 688, 89, -277, 103, 244, 615, 516, -290, -140, -396, -120, 196, 76, -364, -507, -732, -125, 136, -21, -373, -766, -312, 346, 251, 507, -176, -277, 74, 453, 485, 339, -73, -187, 45, 222, 663, 532, -120, -202, -158, 172, 781, -109, -207, -478, -576, 6, 228, -39, -134, -800, -304, 209, 187, 116, -184, -694, -169, 286, 365, 414, -80, -85, -22, 368, 426, 310, -122, -182, -43, 300, 473, 15, -221, -444, -547, 116, 427, 147, -175, -573, -772, 99, 174, 189, -246, -540, -488, 119, 264, 166, -345, -10, -159, 42, 376, 182, 183, 90, 184, 141, 616, 191, 299, 16, -260, -80]
1638h0K91k38Q3m99j00L14J9J02J38m03J74K7J30K28m35J16K61j69N52k06o49
1659c44L41J96k21M49q7l02j24m2J55M1P6l02j93m1O32j66m7ml93k1L18l0K1j86
1683b74J55M8J23K79j73k36q5K13PK68j60k9k54N06m9m0j46j13m02J42N78m82
1705a24K83o27j07J60K27J80L7l11l5J50jM98j00l86OJ22M25M9k44k2l30J71M44
1728D65m5j83L70p64K15J80j44J4k42K5k47L58j17k7k37K59M1k04M19K01m61j7
1750a41kK38q5P7k39K04j11M06j85q2k7j52J17J70j67J02M5j86R9K4l27J28k41
1773c35R4Q4k52M77l65K18j3J11R3L78l03j92q7j1M84l21K70m28J53N5K42o9K2
1796C05l09l21P3J55j96L09l34Q8J4n8P5K14j35o6L22j53J94j95k33o4L12L33
$$ y = [-80, 211, -27, 56, -443, -543, -229, -210, -108, 30, -373, -199, -172, -42, 186, -249, -133, 128, -41, 511, 305, -344, -3, 193, -28, 421, 334, 32, -92, -134, 21, 62, 138, -164, -357, -398, 234, 68, 21, 17, -376, -397, -79, -109, -88, -274, -119, -71, 52, 331, 158, -78, -163, 50, 57, 325, 165, 136, -118, 388, 339, 299, 153, 40, -362, -220, 358, -124, 159, -468, -575, -415, -188, -8, 29, -282, -317, -167, -168, 330, 230, -156, -150, -28, 397, 446, 202, 180, -150, 21, 465, 420, 237, 607, -157, 58, 238, 94, 108, -134, -109, -356, 2, -115, -142, -379, -120, -79, -283, 136, 337, -124, -141, -143, 95, 10, 87, -152, 52, -59, 347, 162, 80, 53, -99, 18, 188, 21, 123, 168, -18, 81, 105, -222, -94, -335, -241, -157, -409, 68, -297, -79, -92, 19, 112, 490, 187, -5, -92, -103, 381, 60, 330, -98, 55, 110, 352, 283, 305, -4, -325, -252, -97, -293, 16, -318, -230, -216, -274, -199, 15, -120, -186, 136, -17, 177, -18, -251, -315, -3, 330]
1818C30j48K03j98j23J0K5Q0J92m20%J48J40K3l03k5n5O8J7J2m0Q2l54J10j73
1842c99N33l56J32j6o5K02o2J97N4k94J23J43K10k23k02O7R3J12J75l33k97J22
1864h4o8J85j1r6N0k49l0J73N5j89r5L14j97N48k45J79j17j54K97jJ86o2p3l55
1888c9J92j43J80j6j13J97l06o9J41r7P1l0m28L36o2O6R7k83L4M4M2J16J05l34
1912b99M49J3l55M26k45Q1K25j87J33k69j3K56j94L8n9j1o7J8r9K14j59p3Nk5
1936a97K45Mq5K04j35k8K05k63K29o0j54R4nk7M5O5J62j26O8j01J82m78J10L05
1960B59j46N0k49k05J81l6K2n7k54J06J68J7J64K32p12L03J5J16N85n98M13l09
1982F5O4p3J83l9K7k06k38M80k61L13m42l28J40O01m40M0j4j41J45j34N32m50
$$ y = [330, 182, 385, 187, 64, 74, 99, 179, 371, -49, -49, 99, 239, 262, -41, -66, -121, -53, -36, -24, -64, 18, -336, -226, -399, 134, -222, -90, -106, -171, 31, -31, 166, 220, -74, 49, 192, 402, 179, -23, 44, 137, 249, 424, 91, -206, -84, -152, 33, 22, -74, -24, -273, -303, -130, -75, -264, -359, -45, -242, 306, 61, 240, 123, -31, 266, 265, 451, 389, 316, -39, 153, 10, 190, 174, 61, 258, -48, -117, 24, -73, -2, -32, -460, -124, -186, -120, -23, -306, -272, -228, -186, -70, 35, -299, 150, 163, -192, 234, -11, 70, 295, 108, 241, -28, -41, 215, 21, 59, 0, -11, -78, -60, -159, 55, -104, -177, -172, -197, 48, 52, -33, 171, 36, 8, 213, -50, 179, 119, -35, 59, 54, 27, 72, 137, 299, 173, 241, 140, 322, -156, -46, 259, 113, 163, -86, -291, -110, -146, -124, -181, -435, -329, -161, -144, 20, 252, -460, -157, -142, -26, 559, -39, 374, 65, 129, 56, 239, 200, 227, 21, -217, 263, 2, 315, -127, -455, -315, 286, -154, -114, -128, -269, -124, -258, 274, -176]
2004a76O2N4r6J25J73j72Q8l03J57K97K5J24K1l42N1l4K33j1k45j41J21m5m2o9
2028a45k25O4J73rK20r3k97n6L79K80k73j53R7R6J2J04K9l26L56j66J57N6p3j96
2052A1J07P1l67J04K62j91J8j20K12m69N09n23M9J36J32J9P6j54j09M23m8k13
2074f5J03J68l24J49R3k22m3L35O4j32K70m84R8k72K9L72l8r9n3k07N0J50j12
2097a70o4J89j76K85M9k04J95k77J05J47P2J05J25m09K70k82L25J21k11q3r5j15
2119i8LK81j51o6m13M62k39L24j75K04n20L30k4Q8L5j05j98L24J88k57Q1Om8J13
2143A45R0j35J58j37Q6k60L12j18l94K37N9N5j27j97M80m13k4J11j23J52r1l00
2165d34K69L12j98J51j12r2K49ML0N0k03J30j96K1K73k00k87J30J06k43P5J14
$$ y = [-176, -114, -60, -156, -31, 142, -30, 58, -245, -88, 209, 234, 358, 379, 37, 88, 54, 287, 276, 31, -110, 11, -34, -76, -145, -370, -306, -133, -142, 78, -15, -312, -368, 11, 291, 18, -135, -38, 58, 70, 174, 203, -123, 233, 67, 224, 280, 207, 11, 118, 189, -178, -74, 188, -3, 15, -105, 107, -362, 147, -376, -327, -191, -59, -40, 36, -118, -227, 196, 148, -65, 38, 206, -118, 31, 124, -98, -141, 194, 258, 126, 396, -88, 10, -262, -233, 139, 101, 2, -51, -258, -208, -58, -170, -234, -45, -221, 64, 113, -91, 104, -173, -68, 79, 151, 256, 381, -28, 242, -40, 285, 406, 195, 112, 17, -98, -95, 186, 35, -31, -444, 18, -221, 103, -72, 132, -388, -58, -82, 6, 41, -64, -262, 62, 250, -7, 74, 80, 32, 145, 235, 100, 258, 121, 207, -53, 259, 141, -253, -16, 43, 98, -29, -226, 254, -159, -183, -72, -195, -43, -134, -434, -165, 147, -51, 100, -12, -104, 145, 149, 179, 229, 26, 156, -40, -19, 254, 54, -233, -103, 3, -240, -165, -51]
2187e1J52k86j4o9L23Q7k62J18l86M14j12p2K64l59J16J62j74N51m25l5K08j08
2209D2J25j7k51J08P9J22j57J4j5r4O1K39k95j25K3J21J70q5k04Q9p6J1K17j10
2233hQ8pJ06k21J6J58Q6q0k94N33j07j8k63J94k08K13j70L50l81m9l16L74j44
2256a48L01j54l56R5K02l50L68J90k65n3NP7M4K58q1k89J79R6K0JN3m8j40K89
2280B94l10J93j31K0j48J88k51Q1O0j71k50L45J63N6J05l69j28J76K8J77L1m0
2302A19j95P2J29J88k44N0j57j7R3J21j10q4j35J67L4j92J94r8q0k0J16J5jO7
2326C2K29l68K86R8l29J13j14J81nN6j47k55p9L08P8j47%OJ51n1j05K52m2k60
2350a12k77N70j12m2k04p5K25j31K8J51J08l11J79M2K6J0P0k45l4J19K25%r7J00
$$ y = [-51, 101, -185, -199, -268, 55, 142, -120, -2, -388, 26, -86, -158, 106, -253, -137, 25, -149, 402, -23, -58, 150, 42, 167, 150, -101, 7, 86, 208, 51, 65, 50, -44, 17, 256, -39, -164, -141, -20, 150, 65, -139, -50, -126, -115, 102, -8, 80, 73, 179, -42, -26, 132, 218, 138, -156, 377, 270, 252, -11, 183, -25, 188, 18, 368, -13, -62, -378, -4, -148, 153, -1, -357, -262, -60, -410, -42, 148, -117, -170, -165, -88, -44, 214, 133, -156, 23, 119, 139, 140, 193, 145, 5, 294, -16, 177, 46, 66, -82, 106, -145, -64, -4, -175, -425, -80, 83, 139, 244, -125, -253, -77, -49, 128, 159, 119, -76, -4, 125, 313, 69, 119, -38, -55, 38, 159, 49, -35, -170, -3, 31, -161, 33, -65, -145, -165, -49, -34, -35, 32, 261, -107, 179, 277, -52, 61, -53, 128, 123, 179, 32, -223, -302, 6, 84, -63, -63, -57, 94, 43, -62, 190, 148, -112, -389, 181, 69, 27, -177, -252, -27, -158, -130, 21, 129, -182, -3, 39, 65, 75, 145, -100, -134, -15, 210, 210, 113, 213]
2374B13l29K11m0j29j42L4J0K02LO7k56P9l8P9J10O4l44rQ2K36K61l46J37l07
2398a52M6K35K5J2Q5j56k3J54K06j92j73k05O8O4K6j72O1j26K06k90L06j82J36
2421d1k17j76K33J17O3j36R1j88L87J90q8r6j52j80L48J09m04M6J31l09L65N5
2443A48j1k50q4K8J98j37J43j35l8J73p3K39j69l19L73l54K30K13o8N0k00k2L4
2466c1q8L53k49j64L26k9l47M06m47K7R0J27l66M12j10k00J72J4N7J83m42L74
2488F8m70O14k67Q1N2NpJ5R9k1J2j93J0K6j57K69l11K30o3j68J25j7o4J6J24j50
2514a42J89K4k92J71k37J74N4j50L03J33k44J58k9J74n08j9K15K1K24j3k85mL66
2537B83l28M12l73j7m8p7J25Q4N3Rj84j04J19K6L2l43L03r7K60q4J1m6m2O7k1
$$ y = [213, -116, 95, 55, -74, -216, -182, -172, 30, 33, 100, -156, -77, -115, -36, 74, 138, -206, -215, -133, 103, 364, 18, 155, -152, -106, 129, 154, 166, 251, 95, 72, 226, 432, 240, 67, -138, -70, -6, 20, -152, -91, -217, -11, -301, 5, -177, -41, -258, -434, -201, -84, -21, -157, -66, -254, 133, 323, 235, 139, -13, -193, 155, 264, -140, -94, 37, -272, 93, 148, 137, -113, -197, -169, 29, -108, 35, -100, -138, 35, -38, 201, 32, -287, 86, -268, -38, 175, 107, 157, -43, -65, -31, -119, 234, -15, -179, 147, 118, -229, 177, -270, -243, -153, -26, -392, 20, -90, -290, -118, -104, -47, 136, -306, 68, -402, 212, -55, 26, 78, 83, 76, 91, 190, 169, 181, -12, -2, 24, -133, 136, -175, 55, -8, -176, -51, -68, -132, -116, 8, -142, 47, 71, -221, -50, -287, -113, -59, -209, 94, 227, -17, 141, 112, 286, -222, -241, -26, -5, 219, 206, -79, -83, 283, -45, 367, -6, -23, -71, -148, -23, 61, 114, 123, -61, -165, -46, -20, 12, -331, -28, -125, 135, 51, 62, 16, -26, 41, 20]
2562B0K75j10l33K8J72J49j49l0q4J15L0j75K51Pl57k06K38J98Ok17J04M2k61
2585b87N11j60j10K48j33J43j41K34k89K56l02K64j51R9J07m23J51M9n2J46k87
2606a27n4LK8l1J35J04k39N0O7J2R4j56K78k58O1Q3j26j2j7J37k59J88L26M8k20
2631A15o3J14n0l17P6K6q6R9l3J50j63j54J70J30N3P8k24k29L29j30L48j29j13
2654cM1j06K63K0j16P1j78L3J96k63L49j2n62M37j36j35K76l57K20l7j07M77m89
2677a18o4L22n44M59O3k05J18q2Q4j16%J03J10J04p1k34J42j10N1j22o2K67l15
2700b20M94l97j54L49l6l4m8l1Q1j58L41m26K25rj12J56R0m7j27J03L4n9P6J11
2724B02jk13j31J6J76L8J26l94L97j42k9n7K24l07j36K14j90J84j49M05n27J24
$$ y = [20, 295, 185, -148, -120, 52, 201, 52, 22, -62, 53, 83, -92, 159, 166, -191, -397, -159, 39, 45, -172, -68, -26, -287, 224, 64, -46, 202, 69, 212, 71, 305, 16, 272, -30, 234, 83, 182, 289, -134, 17, 66, 14, 160, -127, -181, -178, -150, -181, -46, 58, -181, -131, -64, -52, 42, -114, 164, -94, -33, 50, -76, -88, -105, 32, -227, -39, 287, 335, 115, 52, 166, 116, -201, -125, -99, -185, -86, -119, 31, -132, -286, -116, 14, 67, 145, -79, -308, 21, -109, 239, 110, -3, 38, -68, 195, 215, 99, 170, -8, 25, 221, -42, 307, 295, -267, 170, 34, -101, 175, -182, 38, 1, -106, 371, -118, -182, 140, -404, 55, 118, -87, 31, -51, 33, -83, -83, 20, 130, 234, 163, -71, 71, -39, 12, -110, -172, 95, -220, 274, -123, -277, 72, 36, 2, -46, -77, 4, -154, 187, -239, -14, -23, -135, 21, 111, 64, -63, 40, 74, 15, 91, 202, 201, -12, -143, -127, 49, 87, 213, -181, 216, 74, 45, -12, 212, -95, -231, -17, -207, -23, -172, 233, -294, -170]
2746a70M85l19N0m23L01L21j37k47K36q8r8K25Q9p7j44N8j21n6M05n5k80Q0q8
2769e3J15k16K62j64m9k4J09P4J24j06j02j8j42M35k38j05J78j93m1J26M10m60
2791g8K9o9P8M4J58j63j1j01J76n4j31J37n6O4k28J58j5l2l60L21L15k01R5j46
2815g0J15L0o9m8J18L4q5J16n2L25m47R6p4l41N45j69J31l71J76K39k27k9K17
2838A60r7O5q6j91K26k16j5O8m3J30K85j78l9k23J93K17o2R5j37j05j97L20O5
2861B35k20j41J20K5j89J65Q6l87J17MM13K4p1l87Q1L04k77M5Q7q1j10J51p7L08
2885B25N8n37J12J03Q8J21j23j23k5M8L17m22L6n5j74K81q4L79l04K9q4J44O1
2908G1r1r4J30j85L64q8j11k09J8k6K66N5L16l13j19j68J91J52O7m17K01l9m4
$$ y = [-170, 315, -4, 46, -377, -76, 245, 108, -139, 97, 9, -89, 136, 225, 148, 4, 62, -59, -115, 290, 235, -45, 35, -53, 62, -154, 108, -56, -105, -129, -20, 54, 178, 72, -30, -48, -190, 245, 7, -98, 80, -113, -154, -28, 382, -78, -49, -118, -40, 4, 162, -1, -12, -113, 63, 9, -122, 15, -41, 23, -205, -47, -62, -94, -454, -133, 182, -19, 76, -70, 45, 75, 6, -42, 76, 110, 25, 141, 89, 414, -33, 63, -11, -352, 193, 24, 155, -216, -40, 199, -28, -57, 160, 63, 128, 42, -149, 77, -139, -154, -86, -129, 1, 286, 108, 69, -154, 39, 256, 194, 289, 152, 47, -150, 170, 235, 15, -126, -6, 19, -170, -5, 81, -306, -189, -185, 228, 252, 181, -206, -125, 179, -98, -53, 34, -47, -157, -6, -83, 225, 283, -254, -142, -39, 49, 170, 47, -76, -101, -53, 264, -158, -122, -177, -351, -70, -154, 225, -79, -50, -134, 10, 71, -20, -114, 16, -169, 195, 107, -4, -213, -195, -221, 45, 100, 416, 103, -16, -184, 7, 159, 226, -191, 10, -29, -73]
2931g3K46Ml16j25K56q3K71j40J05q6l54QK57L06k78n2j84K92j38J0M6K43l75
2954a60J30L59k15p3L0j99J91j87K20k8k91l9K21JJ65j13K1j1l3L14j47m5k99
2977a88M4M7J59K2j42j17M12l67L18k03J50j26Q7m2J63j82k42j06L32j08n8J29
2999a8k07J77r2L45k95K74j06k54J57LM8q7J38j63J71J5o6Q4j26k96J51j12K09
3022e0L79j76k1j41N4j41M6J3j27P8rL7K48k19M1O6p3L0P1p6j67lJ32J08Q7n4
3048A33j02p4K27j01J32l30K3K31p4n0J61k92l3o1J75j9M8k94P4J74M2J33k04
3071h1k18J58Q2K18q6J45j66k66Q6K30p6K06m14J41M7j16M39j01m46k3K78R4J2
3094A43k01q0l53M93L0j13P5l5j35K80m5N5k9n0k10M6k2K91K4j58J29k62J62O1
$$ y = [-73, 173, 177, -139, -264, -8, -91, 180, 40, 145, 59, -295, -287, -30, 276, -2, -54, -238, 54, -84, -74, -28, 215, -160, -30, 329, 114, 41, 71, -128, 63, -124, 96, 68, -223, -262, -41, -40, 125, 12, 33, 22, -11, 303, 156, 111, -188, -144, -97, 62, 84, -58, -175, 237, -130, 188, -15, 135, 9, 96, 54, 217, 35, -207, -313, 19, -89, -147, -18, -225, -48, -140, 205, -90, 184, 78, -176, -19, -16, 32, -55, 83, -80, 91, 106, 40, 124, -2, -298, -147, -259, -50, 329, 153, 132, -9, 45, -96, -50, -37, -164, -86, -95, -58, 190, -29, 12, 78, 5, 35, 106, 30, -137, -140, -8, 100, 187, 133, 31, -43, 184, 83, 215, -115, -92, 139, 65, 15, 176, -116, -149, -210, -35, -54, -6, -300, -226, -52, -10, 123, -81, -299, -141, -59, 159, 73, 218, 52, -214, -128, 102, 26, 232, -182, -41, 6, -110, 329, 228, -218, -241, 37, 131, 143, -58, -138, -491, 2, 32, -81, -6, -41, -176, 104, 59, 114, 85, 35, -175, -129, -151, 140, 164, 6, 135, -127, 35, 96]
3118I6K5k20J02k57M74o3J9k75J71l36R5K2K46j78j2J33k67N74j29k36K08k44
3140e2J88j31r4K07jj78J73o3l3J2j90K11k53K27O1l20J15rM03j97K2j32m3J9
3164e8k40K90j32K10j48J20j00J5J72l15K01o8K14O7l23K63k65o6K10pM2k50P6
3187i2J39j4P4m9k28J0L99o0k45j41Q3K15J17k96P0J69l64K02o1K17J09l47k05
3210b98M17J0j73j9K23J50o52L15J46k86J76j23J74k66J83n9n9j21N23j68l9J68
3232B22l71L3M5J67j48l6J43J74l56L67l07K84q3j8k13M33k27j89N9O1j93j06
3254b59M01j29l15J48L18l28K95j07j00n7k23M55K7J6j00j57k03K30J84J13Q4
3275B93k41J32j92J34N1k9j85R6q7Q3J59m54J02K32M8j17j43N9K3K80l90O5k4
$$ y = [96, 121, -99, 3, -254, 220, 157, 176, -99, 72, -264, -169, -147, 99, -79, -91, 42, -225, 349, 220, -16, 192, -52, 136, 5, -89, 118, 117, -61, 112, 49, 16, 28, -162, 49, -204, 23, 84, -236, -121, -130, 273, 76, 98, -34, -77, -58, -298, -8, -140, 70, -78, 42, -58, -43, 129, -186, 15, -53, 161, 228, -95, 168, -97, -163, 47, 40, 82, -168, -92, 47, 33, 107, 58, -170, -160, 239, 179, -66, -207, -124, 91, 208, -88, -18, 151, -213, -11, -72, 145, 254, -93, -298, 119, 129, -44, -63, 160, 310, -342, -27, 119, -167, 9, -114, 60, -206, -23, -82, -141, -262, 261, 93, 54, 222, -149, -116, -71, 96, -52, -88, 55, 229, -127, 240, -67, 217, 134, 116, -97, 336, 109, -80, -21, 40, -153, -259, 142, 13, -302, -154, 164, -164, 131, 24, -76, -133, -356, 99, 126, 142, 42, -115, -318, -88, 96, 209, 293, 52, 184, -8, 126, 177, 148, -37, 59, -28, 55, 214, -240, -138, 94, 142, 25, -118, -59, -36, 244, -146, -81, -105]
3298a05k1n3J29o8J24J55m5m48M54k8J98q9R4k50l1l32M23N3j27Q8j11O3JO5l43
3323b04J98k89J67J07K0J9N1j84N1K23lj16K7j18J38L0r4L0k3J89k38J80n5l69
3347b63K55K3L64n83K22Qj20J68l38K17J20m6l16J73J75q2j81Q6J71r5n6K30j12
3370B0r7m2K61l6o0M5J6l1r0Q6K1k16K8qK8L82k32k60O3n2L22l00J8P9NK8jL00
3398B77r5j21j4m9L9Jl3J32o6Q3j4lM8k18pJ76J15k20l7l67M13j49K1K43k05j61
3424b11K2J34n2J73l7j80J44j51K81J47m41K39r6k9L9M1K05k74J1O2Q7%q4o5p1
3449a06R6m7K53j59l9K5j50J99j9mR8k38L55l5j92J50l02R8K10J6l7N8j59k53
3473a82J44qL77k45j56R0j02o5Q6Q4o4J0j31J11K70o2Nl65J38o9J81j47K84j42
$$ y = [-105, -126, -179, -50, -118, 6, 161, 116, -332, 122, 94, 292, 203, 297, 47, 16, -316, 107, 160, 33, 121, 10, 73, 74, 139, -204, -6, -295, -128, -21, -1, 18, 69, -115, -64, 159, 156, 40, 67, -51, 87, 117, 23, 53, 30, 219, -19, 161, 106, -263, -8, 15, 379, -204, 18, 26, -94, 74, -264, -47, 73, 27, -289, -116, 59, -23, -204, -118, 53, -42, -98, 132, 20, -77, -119, 142, 106, 46, 91, 107, 76, -14, 72, 93, -123, -95, -103, -75, 307, 75, -185, -122, -174, 148, -152, -134, -55, -50, -22, -23, 277, 182, 61, 47, -2, 37, 38, 5, 137, 71, 154, 140, 137, 185, -33, -40, 136, 251, 31, -6, -373, 40, -109, -88, 155, -50, -211, -189, -55, -107, 66, 29, -151, -7, -158, 123, 270, -171, 68, -28, -57, -18, 23, 228, -46, -35, 27, 114, 114, 30, -35, -106, -10, -57, 196, 37, -2, 23, -127, 72, 53, 49, 147, -91, 264, 229, 37, 187, -115, -17, 193, 209, 172, 230, 71, -182, -38, -46, 331, 86, -70, 20, -82, -147, -61, 23, -41, -31, -162, -51, 219, 157, 162, -203, -65, -134, 47, -100, 184, 42]
3497D2k08J38J44K4j82J30m4q4L00j09k34J64r4o5L1l9j05K90k14L51Rk18j27
3520a00k5j4L5J30j00L20k98J8R8m5J17j92k65M62j53j09Q5JL6r6L66j66J73k70
3544Hl32N43k51J58j64K8j67K81o7J3J00k14m7j73J27J08N5N9J01j3n9K19Q7m63
3568f3J44mj03J54j31K15m41K90p6J0j9j86lK33j7n1j65L13l50J29Q3J48O4k20
3592d6L62m07N06o6m91Q9j10O4K37j98J58r2J04j57J21J30q1j93oRO7R5Jk15Q3
3617c6j37K13r7L0O1k65M72n3l34M3J24l47K36K87j85K71j00J06k94N9J04j61
3639cJ96r2K1m64Q4K84q7L3J76r7k7RO3k06mJ42K75l87q7M90m04N1J48K2k33N2
3665d5Q3j11K55J79m91J85l2q8K28k74J5J1L09j53j81K76q5j14J99j9p4q9j37
$$ y = [42, -166, -28, 116, 140, -42, 88, 44, -40, 260, 151, -83, 81, -13, -78, -47, -86, -191, 99, -115, 236, 245, 27, -100, -125, -139, -104, 26, -74, 246, -52, -34, 64, 19, 136, -56, -321, 141, -12, -121, -36, -35, 1, -95, 271, 105, 278, 8, -324, 219, -32, 126, -38, -10, -177, 104, 37, 50, 150, -64, -111, -284, -157, -49, 6, 65, 166, 153, 94, 313, 400, -63, 81, 77, -26, 128, -3, 212, -229, 61, -15, -5, -24, -210, -213, 20, 3, -48, -213, 100, -250, -121, -38, 110, 174, -46, 316, -91, 415, 349, -142, -53, -163, -99, 138, -60, 98, 6, 110, -47, 74, 204, 123, -70, -76, -67, 0, 95, 96, -119, -36, -173, 40, -57, -27, 34, -231, 241, 188, -146, -103, 21, -326, -90, 197, 12, 283, 183, 289, -5, 54, 158, -3, 193, 101, 122, -342, -258, 26, -61, -28, 148, 51, 24, 33, 96, -110, -114, 28, 303, -84, -171, 319, -85, -34, 114, 136, -97, -45, 38, -73, 182, 361, -130, 55, 23, -65, 163, -111, -96, -85, 224, 71, -110, 166, 81, -33, 166, 147, 73, -16, -153]
3688a53J18J28m4J22q0k41K07J26L2k76k91K31K71j19J02k19j72K92p1j43J47
3709c3p2K95k71n8K71j67o4k3J68R5k69J99l40j7M22J3m5Q0j81J84l14J02J37
3732A12k6j82K5K06k83K39k01QL3J4L5n4p5J85J60m49K41m8K61j18q3N6p5L07
3756B88k89k33J11O6j17J71L84k03k15j47K17J4m5J80r2n6N7Q7k7j90J16j17j74
3779b14J00Q3R3j78p6L16j76J31J65k71L1J72k05Q1j5Oj25j91J37J7NkJ55K20
3803B59k39o1P4l16K75J77k72L10m07j19M36j02q3k33M45l69J96k7J87j39k80
3824b88J96Q0K35j04P6r1j21P1KK7J04l06O3J8o2j0R8k91L73k46K16j57n2J83
3848A4n4l2J91k25j1j67J12J77O1q7p1j59J85Q0M6j53O5p3J4M6j01J60J11k15
$$ y = [-153, -35, 93, 49, 171, 91, -150, 57, 183, 215, -61, -352, -121, 150, 31, 133, -86, -258, 34, -37, -180, -33, -105, 190, -81, -139, 132, -35, -99, -122, 46, 141, -128, 71, -269, -286, 136, 149, 104, 184, 3, 187, -127, -25, 112, 86, -96, -71, 135, -148, 91, -110, -102, -69, -55, -20, -74, -149, 36, 196, -253, -12, -60, 201, 83, 0, 56, -19, 288, -1, -234, -123, -57, -174, -3, 381, 178, -37, -184, 33, 47, 2, 182, 90, 34, 91, 178, 151, -39, 77, -40, -214, -114, -31, 62, -116, -192, 124, -52, 79, 244, -27, 4, 176, -29, 52, 37, 43, -82, -273, -136, -119, -114, -116, 39, 259, 20, -41, 33, -283, -8, 169, -103, 207, -200, -319, 117, 15, -68, -301, 144, -225, -29, -56, 131, -8, -288, -92, -12, 223, 119, 195, 104, -17, 54, 56, 83, 187, -119, -56, -38, -100, -110, -12, -303, 70, -176, 40, -117, -169, 14, -40, -72, 119, -106, -117, -284, -172, 5, 66, -21, -92, -251, -66, 14, 60, -93, -28, -101, -87, -41, -142, 18, 129, -86]
3872h6mM8M0j36K62k22J56l55N03j20Pj86LJ80J12j01j26L01m92K79J17j38K28
3895B70n6k90K18j47m2K09l50J58j55K73j6O2k13R5j53k21M82J38k95%J01l4K0
3918E4Q8l29J21N2L0J30l49J82O0n5j42J80l13L16J06j61j56P1J04M9N7o3l08
3941b76M32n7Q7j05Lq7J8k8j01M08m36L38l1j25n1pJ22n1j19J21j11j89L28O3
3965A46k53R3J63J03l59R4j8j4K06l04J69l16MP4K30K3J29p8j22j39J89o4Q3o9
3989c0q3K14j02K5m6r1j08K33J70j53J59j2k15j1J72k43J53J20J27k24L9k53J02
4012e7K59k17M2o0K4n2O2J8J51j75j20K37mJ07k38J18k61J89L06k61j85j9R6O7
4036B7r7Q6J07l2p2K1j41r4R0M5J39j73j1Q9M2NL6J2j21n7j04K23K18j60l4j55
$$ y = [-86, -90, -42, -2, -138, 124, -98, 58, -297, 206, 86, 93, -93, -90, 90, 202, 101, -25, 276, -216, 63, 180, 42, 270, 214, -76, 142, -5, -47, 162, -188, -30, -185, 88, 72, 134, -79, 16, -137, -358, 124, 262, -33, -33, 68, 34, 54, 142, -187, -66, -14, 16, 146, -203, -21, 39, -16, -158, 22, -291, 25, 131, -30, -186, -115, -11, 38, 95, 32, -276, 156, 99, 186, 81, 84, -3, 15, -13, -114, 294, -142, 196, 165, 40, -11, -18, 104, 53, -66, 55, -56, -245, 83, 146, -107, -14, 149, 252, -107, -13, -31, -45, 161, -143, 26, -290, -286, -212, 18, 41, 170, 92, -30, -169, 20, -44, 39, -30, -113, 101, -1, 24, -22, -113, -221, 12, 182, 29, 188, 176, -39, -50, 122, -121, 32, 152, 279, 55, 94, -159, -57, 202, -15, 27, -33, -9, -61, 1, 19, 170, -5, -125, 112, 108, 215, -23, 95, -166, 23, 329, 68, -117, -136, -40, 27, -70, 16, 123, 91, 19, 40, -101, -195, -105, -60, 79, -94, -105, -16, 26, 31, 67, 79, -42, -99, -203, 20, 238, 78, 44, -111]
4062a11K8P6r0o5K47j17M9r1K34j79J34j89J84K2k55J39J42q4K36l08o4J44j35
4085e3J2J16j64K65j24k90K52Ql87K93O8J84k05L88n86K65p0j40L26j43k96K74
4107gL1J77k93j87L11K6O5j63O3p2mn8L01o9k28J15j39M1L12j76j13J0k86L14
4131b9l7J21M2m35J76J74j4J47Q1l81l3P5J65O1k0j48K61k25P8P1j90M9o4L21
4155B46k77k3L9J60j76o2R2j15K78k54K90m07K77P7Rl30L37m26K72p4l2j99L20
4178B2J0Q5Q8l08P3J95l79K77L02j25k40J83J79n11K67o1n2J30j05pm2o0n5j71
4202c05K12K41n5k2M4k20K12j59j8m2K18k34j5K52r9J72J34l18J42l9L05l64n0
4225hJ99k78l3L24l23P3J6Q7j95K47k51J75J67m2j08m6L26l98P0q8p8J64r3k53
$$ y = [-111, -83, -7, -97, -162, 85, -32, 17, -74, 160, -19, 115, -74, 110, 132, -123, 16, 158, 74, 310, 2, -62, 82, -53, -41, 75, -89, 176, 52, -238, 14, 22, -365, -72, -4, 180, -25, 363, -223, 42, -28, -168, 158, 15, -281, -7, 24, 201, -92, -279, 32, 58, 123, -40, 23, -49, -53, -111, 190, 121, -107, 8, -131, -90, 222, 46, -67, -57, -343, -29, -66, 55, 97, -338, -162, 12, -2, 145, 226, -155, -188, -113, 52, 113, 93, -55, 206, -19, 59, 130, -60, -11, -75, 246, -31, -54, -15, 145, -31, -93, -1, -116, 162, -92, 198, -209, 68, 145, 154, -176, 161, -265, 7, -67, -99, -298, 22, 32, 117, 205, -103, -30, 165, -214, 63, 365, 240, 0, 183, 362, -149, 118, 57, 5, 135, 30, 23, -19, -79, -134, -305, -93, 148, 93, 71, 115, -105, 107, -52, -70, -112, 106, -128, -143, 109, 10, 182, 316, -2, 140, 101, 406, 42, -8, 191, -87, -120, 204, -119, -46, -30, 57, -138, 109, -142, 33, 200, 158, 50, 4, 330, -68, 2, -86, -164, 0, -93, -346]
4249c46M80j95m9L1l34M83j48L5J06R9j33j3J23j43J1j18R8j44K82j79ml5K67
4272A74n7k32L07j17l55K29lJ16j31o9J07J46m6k04m1K19j39J11j35K7J15j01
4294g9Q9N8O6k87J50r3J65l41L76l11L81j29j23M8nm2o4L47k29J2L3j61J82l9
4318DJ27Q7j54j5O7j16P6j14K07q5p1K10k54K51k05M4K93l84J94o8m1J00j19j23
4342h9J61r6j9J91r0k05K11P0j18q6N0j78K31Q0l94L81m12L75q6j06L8K43Pk87
4366a28K91j87j24L02j20N4j89J84J02k17L8J56l02K39m22N61l29k7J44K8p9N6
4388C1rO0O7j69j88j06M29j12j03J11j28L42l86K74n0M5k66M2K60l5j14mM5N1
4412H7K09m08M33j95l34L04q5N4k44J56qM8L84n45K05l7k66K03l5j7RK7J37R4
$$ y = [-346, 134, -61, -110, -79, -413, 70, -78, -43, 63, 162, 29, 16, 139, -4, 7, -111, -13, -157, 125, -54, -58, -93, 174, 117, -115, 192, 75, -280, -51, -54, 62, -69, -138, -31, 115, 69, -135, -176, 43, -96, 15, -120, -93, 22, -79, 10, 68, 134, -153, -3, -96, 69, -272, 104, -207, 174, 45, -78, -30, -35, -77, -141, 206, -23, -11, 22, -139, 43, 4, 131, 218, 64, 49, 116, 0, 76, -38, 169, 84, 13, 223, -31, 220, 15, 59, 352, -32, 162, 94, 53, 153, 34, -89, 72, -24, -43, 148, 58, -147, 64, 134, 16, -70, -20, -198, 33, 113, -281, 100, -312, 63, -23, -129, -91, 152, 159, -128, 163, -24, -148, 154, 34, 88, -101, 83, 185, -32, 6, 162, -140, 99, -323, 238, -91, -118, 26, 54, -25, 31, 22, 82, 149, -20, -208, -314, 115, 3, -100, 11, -117, 225, -161, 113, 63, 108, -158, -116, 144, 109, -5, -9, 36, 87, 296, -112, 321, 126, -208, 96, 11, 65, -179, -23, -31, 17, 401, -144, 61, 24, -242, -39, -74, -91, -82, -55, 82, 176]
4436A76k87P1j62r2L23pJ11l43L39j75j14L37k84q7L78k85j53l3J94k18M05m5
4458D9N5j04j01M35l69j84P0N5j32J19K02j05K47l0k81K73j42j29J31j80J25r7
4480i3J46j48R2k9J86m69L96m01N15l46K81m44O8J57J60j73K8J2J19q8o5J55q3
4503b4O7r2oM7P5q9P4j38L69j42j61k62L82m5j61L30k81K19q2q4J29j65j34Q1
4527i3M1j85R0J02q9K35j74J54j21P1J27j7l04J96N0k56L01j16j08Q8J41l29K97
4550A01m9k92J86K35k13n1P2J67L4l71K86p5J91j88Q7r5j00qk3K66k99K13m0k45
4574b11K96p5j20L10j16o9K29k24O4q8J22k24p8K12l76L43o0K1j07J51R3j87N6
4597c8m6q3J54J22k28J09K10l92M2M12n11K37L12k91m7R5j33r7r4M66m8k06j1
$$ y = [176, -111, -40, -202, -294, 29, 22, 133, -210, 129, -46, -160, 177, -107, -194, 184, -101, -254, -287, -93, -311, 94, 49, 104, 0, -101, 334, -35, -219, -149, -94, -226, -107, 95, -10, 237, 207, -74, 199, 57, -72, 59, -121, 4, -93, 53, -95, -3, -32, 154, -315, 81, -320, 195, -151, 130, -314, -246, -89, 71, -102, -74, -62, 57, -31, -96, 59, -24, 43, -49, -55, -8, 67, -22, 52, -86, 283, 141, -20, -282, 100, 55, -106, 224, -57, 162, 80, -4, 125, -40, -174, -93, -52, -237, -147, -45, -134, 101, -73, 81, -40, 31, 158, 141, -163, 33, 83, -173, 128, 12, -96, -8, 133, -196, 101, 52, -240, -54, 181, -32, -83, -11, 156, 190, -181, 105, 30, 221, 33, 120, 25, -75, -83, -106, 160, -139, 74, 34, -211, 85, 10, -110, 200, 84, 15, 244, 20, 84, -4, 118, -106, -184, 28, -348, -5, -65, -44, -151, 0, 93, -94, -38, -84, -167, -13, 109, -119, -10, 200, -192, -150, 262, -249, -12, 300, 9, -38, 57, -76, -173, -267, 199, 151, -55, -66]
4620f6K67l35L42l31O2j18L8j1L48n11M97m5q1K41j12n64L53j12J07L39k42j08
4642d2l11N06k62J48j11J34j48K82j56j61Q7K30l32J76K14j97k6N0O1j73N5r7
4664g3O0K3J89l25J66j78L02k89J86j92J73m2p3J12N5jj34J77j12J25r5R1j26
4687A9k04K79r4J18j73j4P7qN9rJ7j79J36j20k29M12j68J76m6k80M00j36o6j85
4711b18M52k07j03O1O4l52N16J28l83j1j89O2L64j27K19k42k8j87J06K87j94j47
4733a29J47r3p6R6Q3J0j19j08MJ89J05k31Q2j94K4M27nn10K87lk57K61k51M73
4757B12l56K28l5P8N4k49Q6Mk02N80n47K33k69j34M46k38K40k33K43Pm51P7L52
4780A26j17j55L15j97m1k59K91O4j96J67R1k53L38k41q9J18P1R0M7r9K52k60J18
$$ y = [-66, 201, -134, 208, -123, -61, -179, -141, -152, 196, -315, 182, 137, 56, 297, 185, -379, -26, -138, -31, 308, 66, -42, -353, 153, -109, 39, -72, 62, -86, 196, 40, -121, -34, 196, -136, 40, 254, 57, 31, 81, 142, -31, 24, -73, -13, 10, 199, -126, 40, -138, 164, -125, 61, -131, 42, 0, -73, 39, 94, 93, -41, 136, 24, 149, 54, 145, 19, -185, 94, 0, 118, -55, -69, 8, 0, 59, 50, 67, -112, 24, -96, -325, 87, -81, 95, 49, -231, 169, 33, -33, -218, 234, 27, -76, -15, 49, -303, 213, 341, -42, -53, -242, -180, 184, 57, 276, 34, 6, -181, -75, 212, 18, -129, 18, -75, -151, -55, 28, 38, -81, -189, -185, 4, 109, -122, -40, -234, -210, 217, 212, -298, -11, -14, -271, -10, -261, 212, -144, 84, 49, 127, 181, -68, 18, 22, -180, 400, -147, 86, -183, -317, 129, -109, 131, -102, 141, 148, -303, -226, 126, 9, -146, 169, -28, -69, -328, -37, 27, -169, -2, 89, -164, 174, -67, -156, -38, 33, 123, 170, 71, 323, 63, 181]
4803A81j80J06j80k86L24K59k40j73M73k66k84J86J48k22L02k45J98j05n8L33
4823B71l62J37j32J38r7J86k1j49K22k09k3J15k81N38ko29L36n0J11n4J37l5l30
4846a83K46l50J81m2q5M7J33J60J61k75j15K50l50K44Q2q2r9M66l25j05J81l02
4868a62L28m3r0k99M22j79o8J41k8Rk21N97k85k4K9k77Q0K62k19n7k1k0K65k54
4892a14K34m40L11Lj59J82l01J10J91Q7r6k06q8J57m5L06j40k87L19r6J99l09
4914a82M32l07l2K40k85J12j75JK57j07k03L57o5k4n3P3J23r3j71j3m2L52n0q5
4938F0j8k20J77l5m5J46k48J83j0n4L6M5l3K08j99K6r9M2M75m52k24J79kL3j20
4963a49K09j22j75J97j44P2M8o2L16k37Q6m8k11L33l01M22j47q0K0l0K07l74J81
$$ y = [181, 1, 107, -73, -359, -35, 224, -16, -189, 284, 18, -266, -80, 68, -154, 148, -97, 101, -4, -62, 271, -91, 46, -86, 52, -45, 141, 120, -29, 193, -16, -39, 76, -205, 333, 331, -298, 38, -12, 99, 45, 182, 147, -183, 63, -287, -106, -148, -233, -186, -53, 107, 268, -7, -122, 128, -222, 22, 104, 22, -77, 389, 64, -41, 140, -162, 166, 123, 33, -266, 156, -23, -91, 50, 22, 31, -190, 407, 122, 98, 127, -150, -70, 192, -27, -84, -105, -125, 140, -114, 120, -320, -9, -6, -165, 17, -284, -174, 17, 104, 8, -198, -286, -129, -174, 132, -8, -295, 24, -72, 127, -182, 250, -57, -89, 151, -134, -22, -197, -196, 61, -46, -249, 108, 43, 19, -34, 39, 162, 69, -102, -115, -157, 195, 145, 60, 42, -178, -1, -36, -81, 65, -183, 0, -10, -64, -28, 17, -16, 192, -7, 19, -80, -38, 437, -15, -239, -60, -62, -29, -149, 60, -62, -237, -40, -184, -112, -64, -126, 190, -47, 39, -9, -220, 113, -188, 234, 87, 7, 27, -3, 204, -170, 11]
4986A1J53j54J15k71K49l84J93J24j04l6M3K8QpN5l6J35q6J2m0l6P5k4P2j60j12
5012a77Q9m0J62m47Q2L90M8L7J15l40nJ58j37J08n9J37j20j3J30J10m06K56k48
5035a70M40l76K13k18J96j2M9N0J14m91J31K17r7J31m23M15k04n9q5K50J3p0o6
5058e2j15K85Qk33J33j10m5l3K90j77O2O0O3p6J45k35j51R9j33L49Rj70r0LM2
5083g2J09r8J69j99J6j33J89j82O1N9k2n8J11m6J2O0P4k11K42j14K74k96KK20
5107A67M8k53k6k0N9R3jN2O0qj0K2k12J45K1n5j49Q9j6J31p8n3K9P2l10J27M5
5134c1K00k12QP8J8k7K09j40k14k0l7K49O4k65L90m56K45j95J94o4n0J55j87J0
5158g8K48k30K9P0K7k43K78k6r9R0L5n3J65j52l1n2J96l71L02M4r1k18j60j37
$$ y = [11, 164, 10, 125, -146, 103, -281, -88, 36, -68, -104, -61, -33, -25, -32, 23, -13, 122, 36, 48, 8, -28, 47, 23, 95, -65, -177, -88, -128, 34, -413, -331, 59, 107, 144, 259, -81, -86, 72, -65, 43, -16, 121, 1, -12, 118, 228, -178, 78, -170, 270, -106, 107, -111, 85, 73, 122, 172, 286, -205, -74, 143, 46, 177, -246, 169, -35, -94, -179, 71, 84, 14, -52, -167, 118, 126, -107, 26, -84, -129, -162, 128, -49, 13, 73, 136, 60, 205, -30, -181, -82, -215, 134, 143, -27, -117, -114, -72, 37, -61, 108, -91, -75, -208, -19, -201, -140, -81, -103, -161, -50, -96, -84, -24, 50, -161, 81, -33, 241, -55, -53, 167, 215, -38, -64, -84, -25, 68, 67, 119, 179, 171, 161, 183, -29, 116, 137, 82, -67, 22, 6, 137, 59, 6, 35, 107, -203, -76, -31, 169, -43, -35, 43, 61, 34, 243, 103, -111, -131, -168, 81, 145, -120, 270, -186, 59, -136, 58, -6, -56, 99, -88, -78, 170, -60, -31, 39, 66, -177, 101, 75, -24, 66, 101, 48, 213, 61, 30, -22, 174, -197, 105, 149, 58, -160, -320, -457]
5182d57Q0K31L23j02p8M6o3J0K18k67j64K44j83J67K5L8m8K13k13O7k12J21K99
5205B95j40l95L33j41Q3J58n4j82o4J66p7r3k4J93o1p9j43L2R9K87p7l36J9n4
5229b55J86o7j4P3n0L31%l17P4M0J00k09j9o3J98K3j73K08kJ83k48k4J14j02k53
5254b66l8L57K8J10l70L0J94k54j61L97J35R2k95J6J17j06j2K85m29K48j67L44
5276B55m20K1p1P3Q8J64N1j93K12k60J96j47J28j25L30m01O2K6q4L13k79K66m53
5299b48K25k06J08n2N9PJ41o1jJ10N4j38N0p4J67j98J27K56l25m4J08J35m35J43
5323i2J94r1l0r5K46M2o1n7k12J06j4k0J96j58j49O3K67n2l25M9K74N4J26l86
5347a25J1K88q3k26J20K0P6Kl15L50Oj32j29L72j01j13R1k3J7k2j12j23m3R1J97
$$ y = [-457, -377, -146, 177, 75, -3, 43, -20, -10, 208, -59, -223, 21, -162, 5, 30, 68, 20, 233, 20, 87, -125, -4, 295, 155, -240, 93, -48, 35, 193, 139, -43, -107, 59, -18, -111, -135, 58, -3, -82, -225, -193, -94, 193, 116, -220, -201, -255, -69, -136, -150, -77, -127, 204, 204, -113, -39, 1, 101, -108, -127, -190, 8, 31, -142, 66, 64, 247, -1, -25, 89, -13, -266, -304, 53, 81, 191, -179, -149, 45, -209, -370, 27, 162, 254, -41, -25, 92, -14, -26, 259, -170, 78, -89, 255, -165, -144, -215, -142, -54, 110, 161, -32, 180, -80, 116, -31, 97, -28, 302, -99, -37, -11, -95, 218, -61, 205, -248, -23, -229, -121, -173, -114, -107, 34, -27, -28, 82, 136, -2, 48, -26, 141, -57, 70, 326, 1, -43, 65, 200, -235, -92, 102, 11, -19, -114, 132, 174, 113, 56, -156, -50, -64, -84, 112, -46, -195, -132, 135, 83, -242, -193, 81, 135, 261, -125, -114, 174, 91, -135, -15, 5, 81, 83, -232, 118, 124, -8, -137, 235, 134, 21, 112, 89, 106, 84, -28, -151, -194, -103, 94]
5372I4Mjj83J67j68K8J86j40k5rpl9j13L58j9k74PJ67K31L9o2j64Q2lp1k13J30
5399Bj66M0J54J84k01J52k47P9K7j80J3K18J03l00L38k67K45l64K1oM34l09m1
5422g1P9R1j8j72M20k76j45J17j03L12k37K39j51o5j12o2L14l4r2J81l51K31J63
5445B58l01r4j37K78l13J3J12J05jJ32J73l78J25K00j21J22k11pJ48k83J71j89
5467a98K85J3k30K3J04k7q8K81k7j76J3K3J66j61n8J17p2k51L90j94L2J6M5P0
5491I6P4q8q5K81k40k36J82o4n8K1J54M6K67l72j25K34j62J84k36J64J72k91o4
5514a46K07k26J72J04j68l0K5M1r3N5P2K68n93M90j83j79K14l9O4n4J27M7m7k15
5538h7O9j87K97R0j49j35M45m53K89k65J58k32L27J46k67M4r6P8k27J76r4K25
$$ y = [94, 98, 97, -86, 81, -87, -59, 127, -13, -38, -47, -54, -93, -206, 152, 133, -141, -134, 33, 264, 303, 241, 77, 159, 156, 85, -128, 2, -164, -124, 30, 214, 13, 165, -82, -3, 24, -156, -143, 75, 178, -122, 216, -51, 194, -170, -149, -155, 279, -30, -71, 8, 99, 81, -91, 329, 53, -92, 25, -78, 234, -3, 236, 85, 20, -92, -154, 160, 126, 34, 215, -136, 95, 258, -43, -137, -274, 4, -309, -296, -184, -79, -80, 52, 225, -153, -28, 172, 51, 173, -38, -45, 103, -180, -9, -198, 87, 100, -130, -107, -3, -30, -118, 163, 136, -40, -27, -4, 162, 1, -57, 60, -12, -263, 127, -67, -35, -19, 26, 96, 170, 82, -3, 278, 38, -198, -16, -80, -138, -117, 37, 83, 350, -22, -147, 87, -75, 109, -127, 37, 209, -82, -146, 61, -165, 7, 111, -57, -87, -62, -21, -114, -59, 13, 281, -312, 178, -5, -184, 30, -9, 55, 1, 128, 175, 128, -87, -18, -205, 92, 182, 33, -102, 343, -110, 179, -86, 72, -160, 167, 313, 46, 90, -6, 72, -155, 21, -73, 152]
5560A52k51j45K97N7m6M7j87P2j10J67p5K40k22L9j60L1J3K21j74l5R6j56L50
5583B21l90R0J31j33R9j25Mo9J80J73n5k12M0L35l07n6J04k33K63j05k7Q1n3j08
5607a52J70K6j96j6K0q1K52j71K19j16P4rJ61l32N1L5j86l9K90M3r9K9j7jr5J11
5633b9L5PK6l07L40k16MM3J91j71m2R6M8J76k59j8O6L27k14J2l2J36l51J53L2
5658E3q5o6j08K23j35K77l98N19j63j23l8o8R8J11N6m3l33M02j94j95M71r3k51
5681h3j18M63k92M9j11m7p1K18J4m1M3j30J09p4K3J51j45J61k9j92m3J89l8l5
5705b9j3j85J02J79J61l38P8K26n8L8j25j57J41L5j72J10R1j33N5N6k42Q6Q6J35
5729A27l5k8M7j22j87j3J11L4Pj10K45l10M75m03J45k75L91k97L44j2k32K42j76
$$ y = [152, -99, -244, 53, 110, 64, 111, -76, -4, -114, 53, -22, 218, -4, 35, -125, -94, -81, 140, -34, -69, 27, -129, 221, -169, -79, 52, -81, 18, -107, -103, -172, 8, 181, 126, -86, -46, 289, -18, -74, 30, -203, 60, -45, -72, 9, -44, -152, 18, 44, -152, -168, -148, -229, 23, -148, 71, -45, 29, 20, 181, -151, -100, -65, -251, -290, 0, 43, -56, -27, -44, -45, -140, -29, 6, 13, 39, -268, 72, -144, -140, -97, 94, -77, -119, -23, 25, 201, -58, -76, -10, 317, 103, 115, 83, 219, -132, 21, 53, -32, -98, -206, 17, -118, 159, -239, 280, 117, -6, -44, -112, -14, 97, 153, 110, -223, 179, -15, -210, 261, 168, -83, -201, 262, -30, 19, -92, -139, -210, 8, 22, -19, 24, -106, 3, -71, -48, 103, -42, 119, 90, -102, -145, 44, 6, -29, -42, -227, -125, 54, 215, -123, -45, 181, 123, 161, 36, -121, 20, 55, -117, -7, 84, -49, 6, 62, -180, -94, -8, 127, 92, 64, 111, -11, -198, -211, -100, -66, -59, -169, 76, -234, 241, -162, -17, -292, 99, -198, 146, 134, -98, 144, -32]
5752c2j00j58L23Q3J2j02p6N0K47k44J43j96m3o9OJ37J40j31m5N5j05MJ61j37
5776g7M1K5r5j0K05q5J16j44qj09J09J05p1k26L68l50K46j69J56J9j12j21j29
5799c16J42J78n7j69L23j89M0j21L43l74K66j45k06L35J05k18j00M65l76J40j04
5820c8J90m58L32r1m1R4o8J82k67J74j79n1J86n9N8N7LL00l6m35J69j2J7J1J27
5845A65l2j26J6k61K30o6O9Q1r3P2j51J58j04K8J11P6j97n3O7K00k96n2M33j56
5869A19k08L3K14k66J87k41J53J70j96m1jo7L41j59K21k53rm2N2r2mJ59o1J50
5893A59ok70K82K0j08M4n6l21J82K50m77L05j30j1J42k10J59j63J81Q1R5j79P6
5916D5r5P8L8J21k1j09k42O0J09M0M9j43o6M50l52k08L06J54j76R1j77K5P6j05
$$ y = [-32, -132, -290, 33, 116, 128, 26, -50, 0, 247, 3, 146, -50, -93, -162, -156, -19, 121, -10, -55, 0, -105, -101, 60, -77, -36, -11, -106, -116, 89, 4, 120, -24, -32, -141, -32, 73, 2, -224, 144, -206, 40, -129, 27, 46, -66, -187, -316, -174, 4, -53, -222, 101, -88, -48, -169, 174, -200, 66, -79, -285, 50, 155, -63, -163, 302, -74, 66, -38, 152, -306, 26, -65, -106, -12, -80, 102, -165, 9, -170, -221, -35, -94, -36, 21, 24, 324, 288, -147, 22, 10, 27, 38, 165, 133, 7, 23, -238, -8, -74, -5, 76, -17, 55, -96, 62, -42, -14, 97, 173, -24, -77, -10, 190, -106, -158, 275, 119, -89, -56, 158, -108, 79, -162, -9, 161, -35, -76, -77, -144, 197, 38, 259, 6, -3, -45, 7, -85, -89, 70, 9, 159, 153, -117, 165, 185, 77, 121, 65, -256, -74, 176, -301, 4, -126, -137, 5, -205, -46, -209, -28, 53, 148, -31, 45, -50, 28, 66, 187, 166, 57, -185, -125, -16, 24, 73, -70, -136, 314, -38, -246, 60, 214, 38, 129, -48, -23, 53, -52]
5940e2jj10N7r0R7P3j0J72k49K07m75L81qQ3j4j9r6J8K30k30J5K37k48n7O5J64
5966A40nj20J23k03J2O3N8N1j31J81jj07l5qj94K44k25q8L87k08p9J45Q5j76K3
5991f8L65m15R2o7Q8n6j00J69J52l44K66n3k14J94p3K44k53j43M06k07j9K50l23
6014a09J56k0J53k47P9J56m49L54J9J0j08R5n4J19o6k20M26j21j3j85K19k33J90
6037A51J4j35k4J21l11R0JJ2O1j45K52k9lN2j78K04k86N0L6P8M1K5Kj02k56J58
6063a21K19k68J56l7J17J20j49m9M4r4R0j02j31P5J11j08J14N8q4J6M7m5L46k58
6087F7j50L9j60J23J80j51J75O1n05L69j1J09k06J48j26rK94l49K89j3j59J48
6109A63n0j69%j71K61j74J02O4j51O3R9k2K1j47J28j58J14o2J58k10N0K13j31
$$ y = [-52, -53, -163, -106, -196, -99, -26, -36, 136, -113, 94, -381, 0, -8, 75, 61, 42, -54, -36, 194, -36, -21, 216, -32, -89, -24, 140, 135, 15, 138, -65, -53, 10, 68, 119, -12, 169, 168, 61, 26, 18, -176, 68, -157, -245, 142, -66, -145, 0, 85, -91, -68, 297, -118, -26, -93, -5, -61, -161, 8, 160, -184, 82, 29, -185, 9, -64, 180, -73, -216, 190, -17, -36, 214, -109, 47, 27, 180, -67, 12, 168, -281, 73, 92, 102, -6, 89, 35, 154, 88, -132, 294, 173, 160, -25, 194, -39, 151, 165, 30, 6, 127, -184, -94, -93, -81, -20, -165, 87, 58, 55, 107, -71, 133, -153, -103, -67, 11, 52, 77, 79, -23, -279, -121, 98, -170, -14, -51, 66, 186, 37, -12, 32, -62, 28, -74, -205, -130, -19, -127, -13, 45, -39, -23, 24, -21, 325, 67, -83, -44, -204, -81, 99, -52, 123, 184, -321, 48, 37, 146, -60, 88, -38, -47, 247, -102, 187, 174, 15, 163, 113, -56, -56, -227, 34, -140, -38, 26, -125, -62, 37, 15, 36, -111, 17, -141, -27, -89, 69, -141, -91, 122, -9]
6132iq2J0J4Q2J63K2j43ll4J59K1j14j15KJ01l11M60k20Nj07l3J07j3K22l37K65
6158A12Q8p4k68J48Rj4Q1j88M8p3O2L0o7N2M6P4R8q7k27N3K12K15k09k3j39K27
6184A86l27J38KJ87l10K9j0J58p3K20q9q2j68J43j59Q5J60k27K73m7K3l20J69
6207c9J08J35j79J83m71K68N9q1J72Q5p7j48j74L85l07j05J63o0K9j89M28j61
6229B4j64J97N4KK67j90j97L5L6M3j8l1j08j50K61j97J10O0J48j56J80k66O5j22
6253a17L3L5K68j30l82J02R7L0J10J07J6j66k32M16L9k8o3q0O5Rk51J69j20L4
6277c9j71L77m1k71R6O3J54o7m2j62J64O4k76K1r9J55K5J75m3j32Q5j50l6J23
6301b7r1J77j18K25l37J01N5r4L35q6l3j92o2K85lj34Q0r1J52o9m8q5k84N80l40
$$ y = [-9, -91, -81, -67, 15, 178, 200, 57, 54, 20, 179, 200, 86, -29, -27, 74, -237, 223, 3, 8, -99, -132, -25, -38, 184, -153, 112, 200, 126, -142, 6, 15, 1, 82, -106, -58, -131, -69, -39, -106, -54, -8, 66, 164, 77, -150, -97, 115, 330, 121, 98, -41, 186, -141, -3, -1, 186, -124, -95, -105, 53, -20, 200, 111, 29, -139, 4, -155, -70, 90, -137, 136, 89, 112, -208, -39, 69, 204, 25, 208, -263, 5, 64, -17, 155, 240, 163, 15, -159, 226, -81, -186, -23, -83, -54, -243, 185, 24, -140, 57, 111, 113, 380, 190, -7, 28, 64, 107, 89, 58, -50, -200, 61, -136, -26, 34, 182, 26, 206, -60, 5, -117, -84, -49, 219, 89, -293, -191, -94, -64, 46, 153, 169, 3, -229, 187, 226, 198, 135, 55, 120, 129, -122, 47, -73, -39, -210, 167, 126, -145, -49, 14, 168, 101, 59, -103, 61, 125, -151, -130, -229, -74, -49, 126, 83, -49, 36, -114, -150, -27, -118, 59, -59, 166, -171, -70, -15, -109, 226, 140, 107, -85, -147, 138, 135, 1, 81, -10, 142, 73, 25, -60, -344, 236, -104]
6326a04J86J07k05N6j8K4r3J30k80QJ50j34Q7J99k06J80p2j93J45K21r4l7j66
6349a09J73j3j39R1j07K43j87O8R8k93L27k39K63j74Q4j33k32Q8J66l9K02j89
6371e1kN2m07L01J79r5k03L11l15M9K75J9j78J34p0q1J12J50k56J63l25K39m8
6394d7O4n8K4j12k34J74j56K34K7q5J31K72n35J96j7j14K15m4r8J57J39j95J34
6417G2j07p3j2N4j38l5J15J36K8j15J11L5OJ60l56R5o8K54j01J51r8j63Q5j76
6441a40K0k6O7j9K28k05n1J33mK3K17j58j32j32J03O6Q6Rj75L8J7m4M82n67m7
6466b11J52J5K12m0m62N62J8l73J75J53k08q6J76r7L09l93J97j39m5Pj7k18M11
6489I8q9R0j42Q6j24J40j30N8M0J47l56K02M7o5J44k41K80r1J43J9k12k44L19
$$ y = [-104, 82, 189, -16, 40, 22, 46, -47, 83, -197, -189, -39, -173, -86, 113, -93, 87, 15, -178, -33, 188, 94, 57, -109, 64, 51, -88, 3, -104, 139, -48, 20, 118, -175, 152, -87, 176, 2, 86, -47, -279, -191, -25, -64, 138, -51, -53, -1, -408, -107, 72, -23, -226, 85, -230, -181, 94, 113, -65, 69, -1, -82, 30, 180, -76, 87, -238, 1, -47, 17, -41, -17, -129, -363, -189, -345, -111, -84, -169, -38, 234, -301, -105, -122, -236, -21, -65, -163, -6, 133, -62, 72, -35, -108, -120, -66, -204, -239, -124, 12, 40, -75, 36, 71, 77, 237, -119, -24, -92, 162, 61, 212, 114, -49, 36, -140, -120, -146, -79, -98, 130, -75, -126, 7, 3, 26, 243, 85, -47, -179, -76, -10, 76, 85, -90, -52, -35, -79, 403, -164, -211, -59, -44, 168, 128, -334, 228, 246, -127, 48, 201, -7, -93, 83, -14, 295, -98, 99, -40, -85, -78, -95, -313, 98, 9, 99, -43, 43, -81, 59, -71, -13, 27, 174, -182, 20, 67, 2, 146, -95, 185, 94, 237, 256, 44, -200, 119]
6512A19kr9J23Rk81Q4m7o3j24K67k5R1k45K94j93L3M4K47j21j75J19m2J14k39
6536a12N0J31p0p4O8k3P3j04J0M0J23l91K19K0J12L6k19J92j68j04J94J00j0M4
6560A37k79N7r5L27Jm11K64J07j65k10K74j16K57N9j81K54m97K09j03L03m9k14
6582g1j65j02J39L22o8k5j90J09%O3k3j1j32K68O9j66j18M0L5Q7P0k48J65j27
6606g9L7O0j67J64j95q0L26k95M86j16m11L61l07L19j57J56k76Q1K25l91L72j35
6628b2K55L9m00J69m5j4o4J50Rk63K24m3j47J77O9k10K34n3K0k09L9J01N3J19
6652A88j82k82K41m8Q6L3M5K14k71J60K7l37K11j39M6L5k6Q1j02J4J60p0j36K04
6676A52m2k6l8j19K62j24l94L32R1K33j91l67K84k18L25j36k7j49j8O3J30j11
$$ y = [119, 117, 18, 141, 150, -131, -47, -94, -157, -281, -14, -39, 52, -193, 101, -92, -59, -15, 232, 111, -64, 55, 13, 127, -112, -62, 69, -1, -75, -7, -30, 43, -61, -51, -11, 112, -279, -60, -40, 72, 108, -111, 81, -87, -191, 3, 103, 93, 137, -142, -85, -180, 147, 148, -263, 1, 108, -57, -267, 7, -109, 148, 207, 26, 280, -217, -8, -111, 192, 143, -71, -236, -338, -199, 123, 55, 30, -160, -51, -51, 12, -11, -22, -154, 114, 183, 17, -101, -61, -26, 61, 131, -117, 48, -79, -42, 18, -149, 15, -180, -260, 66, -229, 257, 141, -270, 91, -216, 103, -54, 102, -174, -93, 132, -259, 113, -22, 233, 272, -128, 41, -4, -18, -82, 68, 77, -186, 38, -5, -152, 25, 94, -116, 118, 65, 85, -124, -85, 16, 69, 188, 6, -276, -35, -83, 3, 36, 81, 295, 24, 184, 211, -126, 85, -54, -8, 27, 1, 82, -20, -6, 154, 84, -52, 152, 110, 84, 46, -73, 189, 65, -329, 3, 94, 327, 136, -231, 53, -165, 160, 24, -3, -152, -170, -107, 23, -88]
6698h8P4RL2P5P2k70Q7P8J03r3j39KmJ5J6rj04J42K60l24j68L25p7l3K66k28L
6725B2r3N1Mk22L05j15ORK2K07k61J82p0j46L14k26J2j25J49r8On8J62L30l79
6750a2m2R8L05n31K92J95o58K85K0p7j43L72o0m13M07J1m3k6k11K79k09K00m2
6773cK56l67l3K53k00J39j74R2j87L11R6k25K13p4L0k54J74o9O0j72J6n2K01R1
6797A22m70M51j16J75k91k52J73K5l7R0P7J04K25j80J14l8j22L9K1Q9j67p0K14
6820A76k03R2l44K51q1k5K44q2K6j98k1L92j68Q1j39K85n83L94j68K80k85k1L
6843i4J57j05o0K77L6j16MN2m19K99j31L4Q6Q1j10o4j47J39j07j0J65k01J86K23
6867A75r6j30qj28R8J16k08M3NQ8J75m5R0l14K09J6J2k48J49j76J14q3R3p7J80
$$ y = [-88, -14, -5, 27, 102, 174, -96, -9, 69, 172, 79, -60, -58, -62, -47, -31, -40, -144, -2, 258, -66, -234, 91, 14, -19, 247, 19, 22, -71, -20, -16, -238, 67, -48, -42, -33, -11, 196, -65, 117, 47, -99, 215, -11, 1, -124, 25, -73, -67, -125, 37, 367, -12, -54, 44, 349, -182, 110, 305, -353, -68, -48, -125, -268, 104, 44, -369, 38, 49, 6, -20, -231, 48, -161, 39, -3, 253, -114, -147, 106, -94, 45, -129, -37, -224, 87, 183, -42, 171, 97, 127, -127, 47, -22, 38, -134, -118, -170, 31, 122, -348, 103, -13, 162, -129, -381, -208, -183, -220, -130, -53, 51, 276, 96, 210, 172, 50, 89, 110, 199, 32, -38, 176, -27, 65, -279, -28, -109, -134, 110, 28, 54, -144, -165, 227, 59, 140, 1, 286, -297, 97, -71, 209, -76, -97, -94, 63, -42, -102, 175, 211, 95, 99, 151, -268, 31, -100, -66, 20, 101, -9, -73, -220, -81, -188, -198, -33, -234, -48, 175, 79, -51, -59, -187, -89, 27, -181, -138, -133, -45, 130, 85, 175, -139, 70, 86, 98, -150, -1, -177, -63, -146, -53, -130, 50]
6892E0M0p5J73m51K00J29j93k19O85l18L0Kj60J02J34J6k61l6J88N6N3l32J88
6915Ak8j1K9J54m7m1J14m2m2l06K54J18k01j22J63Q5k6j44N4j07K21j60J0lJ22
6940D5j31M9K1l6J80k28J17R8l66M66p5k4n6k02J21O6j04j23J66J55O9q8r0J4
6964D4l0P3K7J3q7Mm3j45L7L1J82Q6l1k87M58l75r8J18L65l73J00j25L4q5J29
6989B2k31J6K06j67M57k07j44J49m10L21QJ39p7K65k63j0K76j18n04K66J31j18
7011GK7j82K98m2j02j12L9K65l42K40j35km7K25J13k83r8j07L98k26RK95l65J14
7035a3P1j00K67l04k43K30J71J36r7j91K41k7j58k21K56M6O6k44J62j48O9M3k9
7058a7N1j24R5J67p5j70q5L4O2M4m4j74K93R3j38o1j76M94p3l29Q1J47j27l0K24
$$ y = [50, 90, 15, 188, -263, -63, 66, -127, -346, 339, 21, 51, 53, -107, -5, 129, 145, -116, -152, 36, 92, 145, -187, 1, -27, -38, -9, 145, 98, 57, 171, 129, 87, -219, 35, 153, -48, -170, -7, 78, 52, -92, -38, -145, 76, -84, -74, -77, 45, -86, -37, -16, -52, 128, -100, 17, 115, -251, 215, 140, 116, 60, -142, -21, 45, -59, -182, -16, 139, 208, 120, 30, 44, 14, 87, 114, 127, 40, 44, 1, -144, -107, -76, 106, 192, 161, -126, 332, -43, -141, -23, 342, -31, 69, -56, -22, -107, 22, -209, -193, 13, -154, 303, 96, -48, 101, -309, 12, 20, 159, 82, 347, 84, 74, 350, 232, -272, -6, 125, 7, 34, -148, 150, 108, 6, -106, -67, 198, -144, 96, -39, -41, -88, 137, 250, -33, -131, -238, 160, -66, -57, 238, -127, -13, 58, -42, 225, -79, -322, -92, 79, 215, 118, -73, 168, 141, -17, -238, 18, 64, 130, -114, 48, -100, -31, 12, -17, 34, -90, 5, 172, 97, -73, -158, -124, -62, -18, -62, -236, 57, 150, 12, -49, -225, 269, 196, -133, -52, 95, -32, -62, 162]
7083A62J86m29j6m1K00j52J16K13j54k01p4J00J31j49J20J8j3k8l1N9j97K50L2
7106A02j27J5%J07J2l46N2M07k10n2LJ20k34J51q9J03J65Rp7j07J39n7j43O1L4
7131C8m2J04k45Q1n4J36j90J86j98J41kK08k58M72n45K92j78l5J97n9j06P4j48
7154a31L71l61K41j76j40K91j43J37Lp1N6j09J52j08j2K45k70K08q5Q0k55N7J93
7177A73j88l2L61j30j62r4K53j62q9K66k22Nj76J30m6J72%M4j10O3o1j83O2J75
7201D9J24kP1k94j02k7P3J24m9J25p8J12k24J6K46jK4j45j19J40j53O8m0Q1j46
7226a27J49kK5j29L66l83R0J4P0j6N8j0j73J34j27j79K60j08J23K33l33l6K44
7249A43k58j23K48J61qp6k00m8J31k3p6J94k50L28k98o7M10j75J05p0J19l33K05
$$ y = [162, 348, -81, -97, -138, 62, -90, 26, 239, 85, -116, -190, -90, 41, -108, 12, 30, 17, -11, -42, 17, -180, 70, 102, -25, -10, -10, 97, 109, -237, -185, 222, 12, -40, -37, 83, -151, 0, -89, 14, 179, 188, 111, 4, 143, 86, -57, 4, 38, -4, 100, -145, -64, -118, 18, -172, 14, -184, -43, -45, 163, -95, 377, -168, 124, -54, -89, 108, 49, -57, 17, -131, 240, -121, 120, -56, -196, 95, -48, 89, 92, 21, 77, -32, 120, 12, 0, 245, -25, 183, 98, 178, -77, -20, 173, -15, -47, 314, 184, 22, -72, 181, 19, -70, 196, -26, -21, -197, -67, -113, 59, 59, 103, -7, 56, -5, -188, -126, 49, 173, 171, 242, -52, -154, -181, -108, 16, -33, 92, 14, 126, -98, -82, 164, 163, 187, 42, -77, 63, -90, -22, -62, 19, -127, 22, 20, 45, -84, 282, -101, -11, 3, 73, 57, 115, 105, -68, 66, -61, -240, 20, -88, 35, 268, -65, -101, 143, -115, -238, 10, 171, 163, 87, -113, -161, -30, -53, -129, 65, -185, 143, -155, -222, 188, 13, 118, 48, 167, -166, 39]
7272C9o3O8J6m3N4j61L46n4k68K15p0k35M24j54l29K8n0J60K81k25R4j94l0L4
7296a17K45j49Q2j58K71k17J31k05L82l80j72J87j0J40L2n2k36M56m38R4k8J17
7318b5l35L93p5k05Q4k3J93L3j1k25J57J7k39K71L18K4k47J5nm8qj05k27J68J11
7343FR8Q3k16r1K29j67R0J82k33j53L61m4l20L67l13k9rM84o2l20J60r2mo4N9
7368Bj85K44l06K29N9P1k20J05N8j74J93J4n9n7J55N1j37l8K30k45Ok03R4K5j24
7393b12K46j07K03pk51K93k10j45R0J61j56K05k24j5K01j81n1J80J91j24J4q6
7415A5K00l15o9J57k11J48J70M0k94J41n5p5J13J59k68K04j81J78j62j59L89j83
7437e8o2J07L02k93q3p9J3p4K27J6k19K83K83m70K60Q8j73J09q9m7N2l90K85k8
$$ y = [39, -24, 44, 60, 17, 71, -90, 256, 202, -66, 149, 79, -156, 268, 114, -215, -187, -237, -77, 204, -21, 73, -121, -151, -117, 128, -21, 61, -97, 174, -43, 88, -117, 265, -115, -287, -100, -110, 30, 62, 10, -226, 230, -208, -114, -142, -25, -360, 33, -42, -247, -163, -186, 7, 40, 29, -196, -39, -22, -261, 10, 328, 352, 105, 120, 115, 67, 59, -46, -273, -105, 6, 104, 187, -29, -120, 109, -58, 32, 214, -19, -172, 189, 145, -175, 192, -121, -150, -159, 325, 263, -57, 103, 11, 7, -57, 2, -183, 61, -245, -16, 43, 114, -106, -1, 57, -117, 76, 90, 31, -26, 129, 180, 43, 5, 235, -10, -4, -207, -113, -88, -212, 34, -73, 130, 123, -128, 165, -45, -190, -100, 61, -95, 110, -114, -129, 72, -109, -160, 20, 211, 87, 101, 15, 215, -100, -169, -12, -223, -75, 95, 135, -159, -18, -73, -148, -35, 124, -144, 60, -121, 57, -105, -264, 125, -58, -120, -13, 289, -4, -87, -166, -153, -227, 0, 16, -203, 80, 363, -107, 153, 241, 68, 177, 88, 41, 93, -297, -12, -40]
7461d0R8O7o8k0R5N5j94q7K58k89M37l46J82k04nK17k76J12N2j2J50o5J79n6j93
7486D7k25K14J94n6m20L4K11L3K8o6j54J52r5J35p3j49J45R5j24K02k25J44k27
7509a80M89m91R1M3J13j66PK90l6j00K8k05O6K20r1j72j1J17j48K57j01R6l26
7532b10L77q5l52L53N3j72N5J25o5K7j05L5k82l2j92O69j91Q1j46K8M8l3M8P4
7556A08q1j45J77k53K95j80Q3J15r1o9r7j0K25k13J79J53l76J35r3J96J91k66
7578a7J9j18J20j33J29k0Q6j30K07j44o0R2J19o9l04K29l06M82o8k11j74K76K1
7601B6J35m47K56Lj29K98k8l25N8J82RJ8k05K50R7p9k86K42k45J7L43k24l3l5
7625a02K38k56J20k08L59o06M66J52k90K26k3j83k9K26j0J28j81Nl1r1K73j9q3
$$ y = [-40, 58, 125, 57, 37, 132, 187, -7, -94, 164, -125, 312, -34, 148, -56, -61, 156, -120, -8, 44, 32, 182, 117, 296, 240, 47, -178, 36, 230, 174, -246, -212, -1, 32, 60, -6, -160, -8, -103, 32, -41, -190, -45, 50, -74, 128, -97, 47, -180, 309, -182, -91, -48, 65, -101, -94, 196, 160, 60, 88, -117, -51, 169, 78, -94, -105, 12, -136, 121, 20, 116, -210, 167, 82, -270, 83, 136, -36, 19, 144, 79, 106, 1, 36, -246, -278, -470, 199, 8, 89, -57, -29, 19, -14, 34, 108, 27, -118, 59, -194, 101, -79, 4, 119, 28, -41, -138, -148, 77, -136, 43, 196, -180, -45, -138, 58, 249, -17, 2, -116, 4, -129, 0, -20, 66, -64, 143, -1, -61, 31, 150, 81, -223, 6, -300, 182, 114, -97, -271, 5, 26, 161, -286, -30, -27, -156, 142, 114, -211, -153, 29, 38, 56, -149, 101, 198, 119, -167, 75, -170, -153, 190, -34, -67, -102, 136, -120, 0, -208, 151, -455, 11, 163, -127, 99, 76, -107, -136, 90, 80, 208, 27, 32, 1, -90, 183, 164, 81]
7648H1j15J00k14R7k8J71j89P6O4R5l1j88K54pp2j55J16p5r8m3J26r3J06l5L8
7673a9q4K20l98J74N5OJ99j79l4l9J50%j9R6j01j99J78k79pK62l0j49J70J50l32
7698b09J24k02L74O9k71N65m40J59k77K68l90K58N7j40J39J01j41K72k87j45K75
7719A59j02q5RM8J27R0l08p4K04k40m0J60j01l9k2K01ML3Q8j48QJ16j48J57j78
7744h1O7K1M2J38j14q2MJ33k08J70j19K16l7k40k3K02n7J29l53J62M46l65j01
7767e0K61l76J33p4J94j08J69P8K3m04L42m2r4O7k09j5j20M5J18m9n3J08K32k66
7791i0j44K83O3j27p8K24k19J32j50M6K91j91l8O1j04j6J45k17N7J80L9L9j89
7814cJ10m93L32J35j01k64M32m0J72j83J29j71q6Q8m1q5N3j5p3J80k38K99j67
$$ y = [81, -34, 66, -148, -51, -79, 92, -97, -21, 43, 138, 107, -81, 173, 166, 94, -61, 55, -20, -118, -161, -35, -128, -22, -57, -19, -103, 117, -281, -107, -52, -46, 153, -26, -60, -99, 51, 51, 32, 128, 27, -172, 6, -273, -280, -18, -48, -197, -27, 123, -209, -85, -287, 87, 156, -115, 450, 10, 169, -108, 160, -230, 28, 85, -55, 84, 185, 44, 316, 29, -116, 159, 57, -28, -19, 29, 156, 246, -62, -136, 68, -172, -212, -52, -153, -192, -214, -13, -9, 24, 112, -36, -28, 88, -60, 97, -81, -14, 7, 49, 187, 73, -9, -5, 128, -80, 90, -29, 187, 150, -90, -113, 89, 32, 161, -192, -30, 416, 51, -50, 211, -165, -32, -106, 88, -20, 149, 227, 250, -154, 188, 146, 52, 119, -90, -105, -225, -180, -62, -111, -164, -56, 176, -90, -234, 49, 112, -15, -93, 131, -88, 44, -106, -60, 231, 40, 2, 63, -41, -57, 88, -129, -72, 108, 147, 186, -3, 107, -386, -54, 81, -20, -284, 148, 108, 280, 97, 226, 55, -31, 57, 16, -69, -16, -31, -104, 76, -162, 137, -30]
7837c0k67L43j53L36k02J05n2j6l50M71r9j33j86L44R7l59J83q1J91k49K17n3
7859E7J05l41K99j54q3J07J46j63K2k21K56k3l7j40K74n3l06M17l84L24r5q1j68
7882b42L87l4n4j7o1J16n0N8q2n6%J6J7o0J73j63j04K13J17l05j01K61j11L40
7906B58J15l70P8j95R2K43k09r5kK53k11k49K66J24r8O7k31J54N1n0j67K74j32
7929c4J02j16J4J24k36L00r7R5Lp6j16J19rl24L49J01k11J10l5k81L59q2J41L5
7953B35M9k66j94J20k7L9K32j0m02L39l60M7K84k27K42J75m63K75J48m45L15l8
7975F8k21N2K20Q9k68K29q4j2l8j25L17p9j99J10j9N1j54k53L24L65l81j48L48
7998A92k0j63K6j05%m2O1j90M78m41M17p0r7p4p8QQ4j3J16k02K95K4j85k19K10
$$ y = [-30, -297, 46, -107, 229, 27, 132, 80, 64, -286, 185, 86, -47, -233, 111, 208, -151, 32, -49, 142, -107, 110, 57, 162, -179, 120, -34, -117, -10, 136, -27, -5, -226, 30, 7, -30, -170, 104, 51, -255, 162, -222, 102, 7, -74, -242, 145, 111, 57, 40, -21, 95, 45, 103, 21, -35, -35, -19, -2, -62, 111, -52, -156, 57, 174, -131, -232, 29, -82, 258, 373, 3, 81, -114, -22, 221, 12, -83, -85, 168, -43, -292, -26, 98, 0, 67, -164, -10, 41, -9, -176, 98, -34, 68, -48, -34, 90, -146, 154, 57, 152, 155, 79, -37, 82, 73, -251, 98, 199, -12, 98, 63, -218, 141, 59, 200, 235, 284, 18, -176, -56, -83, -44, 188, 178, -224, 115, -245, -198, 86, -141, 101, 276, -187, 88, 236, -209, 106, 68, -153, -101, 119, 208, -60, 169, 85, 73, 35, -90, 227, 148, -51, 59, 40, 91, -63, -316, 8, 373, -8, -156, 192, 172, 9, 35, -70, -70, -112, -51, -241, 237, -204, 213, 143, 46, -28, -106, -98, -14, -27, 89, -113, 182, 206, 21, -198, 12]
8023A2Q2n0k4P3K3o5J75l40J26q8J24p4P2J62j69k47K38k4j04K06J08j87k58M15
8047A86k10M3J81p5j46o9J6Q4k06J82n4n8L39q4k52J50qj26N7P1K72k68r6P5J42
8072A46j45m7j7J02O7K6j95K6j26J15R7ll3j46J73k13P4Q1P6k58K96l14J68M7
8096cj06J40J04O4o9m78K86M3m9J97j90J57K1k55J98J26P6m58L79k12j15J96k04
8119a52n1K13k54K27P8Q7k35p1K55l08M13k31m6K67j09mM8q3r8o6K10l17M09l20
8143a38J80j8m7j05J55p0J88j21j88K95j09k1O8k1n3o0k5J71Qk94L77k77nK26
8167A16j87j09K84j74R6K4J10l23K38k24L0J29J5K7j28MJ45k01m9J63m6j39J3
8190a86q7
$$ y = [12, 94, 44, 20, 93, 116, 51, 226, -114, 12, -76, 48, -26, 46, 208, 39, -208, 30, 6, -98, 108, 216, 29, -229, 186, -24, 19, 200, 125, -21, -90, -74, 10, -196, -14, -68, -126, 213, 129, -123, 27, 19, -107, -50, 21, 293, 25, -71, 4, 146, 1, -46, -63, 39, 106, 132, -63, -37, -163, -48, 49, 46, 13, -133, 40, -173, -99, -18, 58, -200, 96, -218, -50, -3, -109, 31, 135, 199, 130, -348, -62, -19, -68, 129, -61, 96, 117, -138, 60, 186, 262, -196, 183, -29, -144, 52, -152, -203, 10, -244, -17, 61, 148, -87, -158, 97, -211, 202, -29, -75, 192, 83, 79, 127, 44, -54, -120, 90, -227, 182, -138, 42, 24, -23, -128, 27, -43, 145, 24, -164, 131, 22, 1, 69, 48, -5, -65, -90, 81, 89, -205, 172, -105, -110, 116, -71, -180, 104, -70, 26, 50, 160, -163, 75, -149, -119, 10, 25, 52, -76, -72, 73, -128, -177, -14, -60, -199, -186, -273]
8191b73
$$ Imaginary data points
##PAGE= N=2
##DATA TABLE= (X++(I..I)), XYDATA
0@%%%%%%%%%qJ6j6J6k4L2m0M8n6P2q8J04j24J48j76K08k41K81l28L77m33M97n69
32c04O49p35Q31r38J055j185J326j480J651j836K037k257K499k762L048l365L709
49A943m084M499m956N462o024O653p359Q155r064J0113j1343J2805j4573J6770
63H997j9582K3328k8592L6590n0348Q0433k64170J46873K94032l62904J45474
74A0131k2142l29335J81998L83798k09816j05078P6018j42744K7256K88931p1480
85H7537j58275L7778k6207P824J66638k8735j04420k051l2351L3972J22076n0565
97E3221n8669K3322p4222R707J48248n1945r0569P0085n1948p0452J54602J7644
109G9024j42064N6976K1245j14131J08322R4255j51716r891P7803q9624L5379
$$ y = [0, 0, 0, 0, 0, 0, 0, 0, 0, 0, -8, 8, -8, 8, -16, 16, -24, 24, -32, 40, -48, 56, -68, 80, -96, 112, -129, 152, -176, 201, -232, 265, -304, 345, -390, 441, -497, 558, -627, 699, -781, 870, -966, 1071, -1186, 1313, -1449, 1599, -1766, 1943, -2141, 2358, -2598, 2864, -3160, 3493, -3866, 4289, -4775, 5338, -6005, 6800, -7773, 8997, -10585, 12743, -15849, 20741, -29607, 50826, -213344, -66471, 227561, -135343, 10131, -12011, -341346, -159348, 224450, 14634, -90444, -14426, -157170, -129914, 159017, 87537, -70738, -32960, -59167, -51343, 115295, 86560, -17860, -19911, -52262, -18290, 103786, 53221, -5448, 17874, -56348, -46641, 101607, 49662, -40907, 29178, -22770, -93222, 61380, 79024, -63040, -6064, 15181, -98950, 9372, 103627, -48089, -57980, 19823, -69801, -34422]
120c4422J24942r6407p2998P0829k9009j699J06220m5943r6280M9800J3858j7676
132b8785P6878j3820r1298L4118L1190j7999N4348q366q0696L2489M1934k6382
144C611K9658M824o9494K0589N6345l0713j555K1269n4364p99O7249k6002l3572
157a2954L3590k8319k1644O1786r001n1266K5543K981k5640L6456R294m5446O336
170a8284K0318j7087J5793K0007l6042q245K9196j0359J452K3326k4473j5185
182a9583K3504l668k33J9139j7857j6348J7323M17k757J6060r550k1475J1167
195c861R836p047J2012o42k6507O551J7954p861Q332M026k7104J195K2465l020
209F329K339M747k1291o682K1104P113m224J073j3157j3267J7986J4963q313j643
$$ y = [-34422, 90520, -5887, -78885, -8056, -37065, -38764, 67456, 21513, -74767, -24967, -11109, -28785, 48093, 34273, -57025, -22907, 8283, -9716, 44632, 36266, -44430, -11941, 29993, 3611, 33269, 38093, -31401, -10812, 45533, 14820, 13265, 34534, -19830, -20629, 46620, 20618, -12954, 20636, -7683, -29327, 32459, 23458, -27808, -2265, 716, -24924, 11532, 20826, -24620, -18284, 2034, -15053, 740, 20747, -15295, -23540, 5656, -4703, -3251, 20075, -4398, -19583, 3921, 253, 20, 19159, 1302, -15046, 2277, 2694, -63, 15997, 6447, -15028, -3861, 5975, -1072, 10940, 10298, -16209, -9658, 8296, 435, 8767, 12793, -14311, -13116, 9349, 6329, 8668, 13415, -7876, -14558, 6546, 13659, 9435, 10508, -2649, -15916, 2070, 17033, 8720, 7077]
223G077q167j5603J3393J6709m974l757r910j1614J0054J4952L18n141j0320q448
237a5431P077J4436M098o193r255q711N663J7232K343p598n152j1917L497J9850
251I939K106q562n280j1699K299J7916N446r118q550n909L71J2421J1029q700
265C709j1898n24J070Q307J2420p216j2631q76M748P968O359l396q897p078M614
280c321J1191K081k374o348q556K690R530K310l405m855l504j386M661O364l467
295A611p104J393k9R97O112k019n786J294J577J217K694J016j718m500J564L976
311B295j062J936J760n569j211K595K37P90N84j747l051N23L790k690k935L595
327a60j114j102M464l293m220L357K572K23J72r96k286N21M908K567n285j687
$$ y = [7077, -1090, -16693, -3300, 13409, 8435, 4678, -5232, -16846, -6792, 8160, 8478, 3337, -6983, -15431, -8354, 6082, 10180, 3987, -5268, -13979, -8316, 8916, 11259, 3661, -1491, -13408, -9911, 9939, 12045, 3483, -1797, -13496, -11197, 6719, 12165, 3047, -5503, -11412, -11041, 1380, 12409, 3709, -8189, -8713, -7643, 664, 13084, 5868, -6763, -7639, -2891, 5077, 11436, 8040, -857, -7935, -3321, 7870, 9951, 7577, 1229, -7327, -4637, 4893, 7203, 3798, -1057, -4561, -5947, -1286, 5078, 1611, -5493, -4100, -4129, -3132, 2980, 961, -4825, -3531, -1954, -737, 1957, 2973, 1255, -3245, -1681, 2295, 1233, 3169, 4929, -640, -1851, 744, 981, 1771, 2355, 608, -2443, -1920, 1870, -820, -3755, -160, -1274, -2376, 2088, -1205, -5425, -2068, 504, 727, 899, -97, -2383, -1862, 3046, 5613, 328, -1359]
343a359K200P22M369M5o101l024J833N129K685k524l949n906j61R003J920m039
359H43k086n471j239P281M548j848m730l713l66L793P230K63p259k316J30J887
375c053Q551R10p795l477q33M002O957J200n373p099j533O344N966J422m004q383
391f198k072O114O519L190n364o897q97L055Q383M443p269o092q71K194Q818M232
407A1288o974p238k030M450P368L088m753r661k740N927N143L365k251j1013k755
422h786O154M860L725k517q359k979L739O522L556k690n350l961L048P979K005
437F946k606m203m438K607O882K049j603o308m429M189M897K449j528p232l778
452f106L607M365K535k061o045l327K590O552J598l601k973l810J772Q535R23
$$ y = [-1359, 841, 1563, 5932, 5977, -124, -3148, -1315, 3814, 6499, 3975, 26, -5880, -6041, 2962, 4882, 843, -1243, -6714, -7953, -672, 3876, 2028, -2702, -6415, -6781, -2988, 4242, 4505, -2754, -5070, -4940, -3053, 5498, 6408, -1387, -4864, -5697, -1695, 5262, 6462, 1089, -6010, -7543, -1199, 4767, 6189, 2185, -6198, -8270, -2156, 4363, 7553, 2189, -4708, -5605, -2550, 5833, 10276, 3007, -3085, -3956, -1762, 7056, 11288, 4314, -2924, -4954, -504, 6864, 9952, 5199, -4462, -7202, -1275, 3868, 7233, 4982, -6031, -8786, -2632, 2228, 5953, 3436, -4923, -7902, -4163, 2359, 5915, 3225, -2125, -6086, -3038, 4941, 6946, 4340, 137, -4301, -1694, 5188, 7237, 5634, -674, -5103, -914, 3983, 6432, 4904, -2328, -6106, -2499, 1866, 4401, 2340, -3705, -7032, -4442, 2110, 3708, 107, -2866, -6676, -4904, 3631, 4554]
467D554m533j368l268J292P669K036m561l382p71J923L874L901l936o422J443
482a549K237J622L817l597o097L61K834K867J196l495m030r44K962M661l06l668
498a129k694j259L527L926K15l318m100P11M289J758P03k385o298J840O033R68
514B787j57k676n178N69N803L402j359l328k928j867N847O722l218m484j197j936
530c198M853O972j961n836k560L93M492M475r9o581n357K992M429K612j12o731
546a217n543J975M228M394j804p423k921J045M392N589k465o783k509K107M800
561b135N246j501o401l037L866N522K941P36o306n314N196N864J413Q85n370o125
577d520M059N586J956j030m820m580J005O067K670l196l592m058K67O510L360
$$ y = [4554, 21, -1347, -4615, -3323, 4346, 6382, 1821, -1561, -2332, -409, 3465, 7366, 3430, -2992, -1549, 688, 2310, 6127, 2530, -3567, -3206, -372, 2495, 3691, 196, -3834, -4778, -1816, 2845, 2539, -1129, -3823, -5082, -1555, 2371, 2586, -732, -4832, -4121, 168, 1926, 2629, 244, -6054, -4214, 1819, 2787, 2630, -46, -5224, -4655, 1148, 4550, 3191, -137, -3065, -4932, 915, 7637, 4419, -65, -1262, -3198, 1655, 8627, 6666, 830, -1730, -1337, 3155, 7630, 7531, 950, -4407, -1415, 3014, 5626, 5514, -1217, -6760, -4785, -557, 3837, 2033, -5390, -8311, -7266, -2874, 2715, 250, -6533, -9042, -6935, -2135, 3111, 1610, -4791, -7828, -3962, 1560, 4501, 5237, -1069, -6383, -1187, 4677, 6090, 6975, 1605, -4520, -461, 5125, 7081, 6051, 1231, -3349, -2344, 3723, 6393, 3197, -395, -4453, -4186, 2324, 5684]
592E684l716l689m169Q98O731J950k181l660n245J886O242K594k029m834l931
607g469J818N709L473l225n091j730R90N606L967m923l931m00O46O083L905m444
623I84m251j05J823M491K876j771m852j517L383K918K252p73n886j947L839K024
639C488J233r48m797j681J416K971J600k418l707j561L52M526J724l047k744j643
655e236J392M023J574j356l398k105K992L574J378o86m034j570K848K827J993
670D216j145l684j837J539L968K114l493k387j271j86M689K446l951k561p34O
686b271L599K930k132m058o49J549J577L127n08n069r73K940M96K561J42m883
702a622j633K264K011J841j269l121k133R28L313J700j436k876k680J537L930
$$ y = [5684, 1968, -1721, -5890, -4992, 1739, 3689, 1508, -2152, -7397, -5511, 731, 3325, 1296, -3538, -7469, -5651, 58, 3531, 306, -4785, -6515, -5525, 81, 4048, -875, -4806, -5206, -4560, 1523, 5428, 984, -3267, -3372, -1549, 2942, 5818, 4047, -805, -2322, 1061, 3979, 6231, 5458, -428, -2375, 1464, 3488, 4721, 3773, -1024, -2705, -1289, 1682, 3282, 864, -2843, -4404, -4052, 474, 2198, -849, -3593, -5236, -3844, 179, 1753, 397, -3001, -5106, -2114, 1460, 2838, 2152, -1882, -3452, -604, 2223, 4216, 3071, -613, -2450, -911, 3057, 5171, 1678, -709, -1980, -2166, 2523, 4969, 1018, -1543, -2277, -2271, 1328, 4258, 2126, -1932, -2581, -1032, 545, 3672, 3164, -1905, -2878, 62, 558, 3119, 3261, -1622, -3255, -991, 1020, 2861, 1592, -1529, -3662, -2734, 579, 2279, 843, -2033, -4713, -3176, 754]
717G54J134k21l690k558K701K127J712J395m114l137L194K185J573M53l330l259
733c081J727M088M32j087j259l397p16N258J087k396p55l205o02M391J871j313
749A043k462k061K07K749K683ql378j564Q58K166K962j46l297j498j87L299K475
766C841j700j165k217j220M150K261k249j744j953r02K861K680j100l084j584
781c125O38J472L015O61m421j197J442Q88K619J148l500j922P03K305J712j27
797B311j473k704L6L162J013j019o37k796j69K898J218r36j864j849Q80J112J813
814I96M55k825j023J158Q14J897M96k317q26J17J776J308o39l84j619o12K957
831A729N66j133O0k048k86J853R28p32j366q34K50K91J484p7k565j76J067pJ642
$$ y = [754, 1888, 1667, -2023, -4581, -1880, 247, 1959, 3354, -760, -3897, -703, 1482, 3055, 3508, 178, -3081, -1354, 2734, 3166, 2079, 820, -2577, -3293, 1965, 3052, 656, -99, -3304, -3906, 485, 2356, 1043, -1419, -3480, -3273, -524, 2159, 2151, -1227, -2791, -1933, 233, 3195, 3049, -248, -1746, -1933, 1366, 3841, 2141, 976, -1241, -2461, 1689, 3950, 1701, -43, -1996, -2898, -37, 2643, 1543, -1541, -3125, -2487, -1015, 2000, 2661, -1760, -2957, -1515, -627, 1992, 3140, -360, -2282, -1579, 726, 2438, 2311, 838, -1866, -1830, 1332, 2345, 1326, 689, -2107, -2276, 622, 1840, 904, -960, -2809, -1929, -817, 996, 1451, -1374, -2397, -1239, -425, 1472, 1968, -349, -1175, -1058, 718, 2026, 1387, 1003, -616, -1228, 1729, 2295, 1162, 1222, -826, -1112, 741, 1669, 937, -429, -1263, -1013, -722, 762, 685, -1880, -2056, -989, -996, 646]
850F46q5k161J71P00J145N61o87l44r19N29J810K40r85j88j396J013J443j79q08
869E06j393l13J063Q37L12j039j792N92J403J85O23q02j447M62R03J315k57j054
887A04m36o9J013J690j238q66Mr02J297J471j286j156l93k4R14N35j74j621j120
906b257R38J180l5L28j580j140J397J146M86j93j177o61R38J254J367j109j127
923b45M1j00J849J257j466j405o54Q01J412L68l95j490j636J725J098k88J30k176
941a174j200K051J128L25n89j456o43Q92J475J161k137p41n2k0K310J075k208
958A97r66n21Q28J924L64j298j370j102J719J421k00n43j818p00J295J510K34
975I74p90j506l4M24K025J055k191r70L03J62K108J227k590r78J05O25J516M35
$$ y = [646, 561, -1600, -1429, -729, 416, 977, 290, -54, -973, -444, 1366, 1606, 621, 433, -963, 50, 1493, 1314, 506, -887, -1200, -137, 700, 1012, -27, -1819, -1227, 176, 361, 984, 182, -1265, -803, 100, 1415, 1158, 104, -332, -401, 612, 2302, 1064, 198, 202, -700, 597, 2068, 782, -374, -767, -791, 123, 658, 484, -1137, -2257, -1319, -139, -174, 154, -1426, -2566, -1169, -23, 463, 270, -907, -1568, -630, 624, 1991, 882, -245, -204, -304, 1545, 2802, 1336, -69, -723, 78, 1490, 1858, 1463, -27, -1663, 62, 1160, 872, 1002, -1174, -2374, -323, 805, 1130, 541, -915, -1558, -666, 809, 1970, -167, -908, -960, -980, 1330, 2405, 197, -769, -1290, -462, 1462, 1826, 528, -842, -1944, -225, 1196, 996, 453, -1365, -2065, -770, 740, 974, 184, -1322, -1356, -932, 1093, 2148, -43, -1013, -710, -548, 1560, 2787, 197, -781, -676, -51, 1465, 1900]
993A900p65k063m75J644P14K07m86k482j06J618N65K36q41j919L54R11J408Q53
1011A273j821j137J95J118J071R15j485j315K8J489J058O6n10j953m73K368N24
1028A411r09L99k403o41K601N38m11o11j724l89J464J325q9j536m70n74J123K295
1046A399n75j521k20n36J255J966n95r31r10k84J498J684p94j138r76j97J403
1063E28R93k17j735r85L71O85J808j71k363m47L89N75J880m7k651k82R23O77J706
1082A637m15j758p70L60J430J011p92p23j462M70J610L56K7j264j752J052J259
1099B76N26K85k067j065J187O55J097j46j358o78N31J215J185p65p55j173L48
1116g02K072O15m57q88j666O76J677K88l20j211j530N85J267P68m89j796p67L12
$$ y = [1900, 1135, -928, -1403, 241, 955, 1162, 676, -1806, -1912, -294, 271, 507, -334, -2253, -1899, -988, 420, 1273, -548, -1685, -1490, -372, 699, 1614, 129, -1186, -1158, 331, 1389, 1455, 945, -1008, -1481, 887, 1411, 502, 901, -1502, -2143, 458, 996, 585, -26, -1750, -2139, -675, 650, 561, -975, -1445, -2019, -896, 1399, 824, -697, -917, -1453, -198, 1768, 1173, 242, -668, -952, 546, 2230, 1436, 298, -678, -875, 528, 1521, 1304, -431, -1416, -1045, -360, 1448, 1277, -1086, -1533, -1144, -569, 1311, 1264, -1387, -1669, -746, -69, 1637, 1222, -536, -1306, -946, 484, 1495, 703, -20, -1482, -1012, 598, 954, 981, -283, -2035, -983, 276, 802, 1087, -980, -2045, -858, -203, 894, 748, -610, -1288, -757, 458, 1643, 878, 123, -1050, -702, 1370, 1985, 1528, 640, -1026, -350, 1327, 1615, 1295, 84, -1446, -861, 406, 1174, 685, -1111, -1878, -1566]
1134a566J399J393j226j426l10N9J368J510p44j404m37N3J838J012l93j203r63
1151a040M91J638M65k76j506p56Q45J045O33o25j334l26K55P46J182p62j425m32
1169a182K17J087J150p81j422l65P34J071O32k73j271p87P72J139K93K50j564
1186c00j203J358N95M75q8j712l07K86Q23J038o09j450j86J45J046J051r46j107
1204a091KL38J075M57j08p70j028Q88J183J36M0r41r08J097Q33j79J56j575k51
1223f46L38N57O17o52r80k27J18Q15N64m16p17o92N30R08J42j63m21j198J264
1242b59R40r3O7o95j092J054J122K3j02j091k92J09J068M51n39j195j18l31J245
1261B72P09j061n04k10j98J201N40p97l90n86O00R15O7l6j011j35O79N34P73o26
$$ y = [-1566, -167, 1226, 0, -1426, -1736, -1677, -309, 1201, 457, -947, -1384, -1331, 507, 1519, 1126, -77, -1040, -549, 1089, 1554, 1278, -228, -984, -139, 906, 1539, 914, -420, -746, -491, 255, 1437, 675, -750, -1182, -965, 122, 1272, 491, -931, -1296, -562, 509, 1141, 868, -403, -1190, -418, 721, 1014, 1264, -300, -1503, -145, 450, 925, 837, -875, -1182, -896, -73, 965, 356, -1094, -1280, -1135, -89, 962, 16, -1091, -1089, -751, 324, 781, 673, -97, -1125, -237, 946, 1082, 1122, 181, -727, 370, 1203, 1024, 1180, -395, -646, -308, 249, 866, 214, -766, -993, -875, -60, 504, 88, -629, -1321, -791, 117, 259, 96, -325, -1523, -259, 681, 588, 655, -40, -1132, -78, 1044, 1067, 965, -126, -418, -309, 759, 1210, 671, -524, -642, -973, 272, 981, -80, -584, -794, -992, 209, 749, -48, -438, -1024, -424, 491, 558, 522, -489, -624, 55, 589, 1362, 736]
1281G36j138J57L64P3J254j148p33K07k33N87O09r31m99k59O04N76K36k56j022
1300h16m35R39N89L50L0j017n42R77M29K22j29j003M5P69M89J10m09p67k73M19
1320b3P10J77p30o49k83M04R64k76l51p96k31Q49O25k97kq31j90R02Q28l00j77
1341C23o78j46L75R73L85r25p39O3L61J178j4j288l21j04l9J433k56q39o30j4
1361i02M47P51J87p62p50J92J030K16L93m44j310P76M55L86L16l59r98J44N00
1380B68Q95l74q37l41l08O86O83k4n88q42k70Q05M41K73p16o95r3J052K42L5k51
1401D1q97L14N74N75L7l92o00p0N62O33K2o36k36j72J65J050n14o33l8l41M58
1422i8N00k91j60q25J71N78P2M10l87o21J18O82Q4K02m69m15K03q1J150k0p53
$$ y = [736, -402, -245, 119, 192, 1446, 298, -435, -228, -461, 126, 735, -196, -695, -954, -350, 226, 462, 206, -816, -1251, -312, 277, 627, 657, -360, -902, 75, 504, 726, 597, -406, -361, 408, 897, 1007, 598, -169, -442, -23, 687, 864, 134, -515, -798, -394, 570, 294, -57, -853, -1084, -235, 390, 93, 91, -740, -930, -28, 800, 500, 323, -355, -501, -126, 847, 1232, 307, -432, -369, -8, 1170, 1156, -132, -453, -557, -596, 837, 581, -258, -888, -902, -455, 296, 483, -279, -1029, -837, 193, 409, 802, 358, -952, -176, 279, 665, 981, 622, -376, -232, 268, 1163, 789, -48, -389, -697, -11, 672, 648, 60, -782, -1052, -247, 194, 467, -249, -944, -1037, 15, 257, 292, 41, -856, -542, 32, 607, 644, 252, -348, -418, 144, 777, 799, 163, -73, -245, -80, 970, 456, -177, -215, -556, -98, 402, 111, -49, -874, -703, -125, -53, 357, -30, -651, -533, 149, 233, 435, -34, -449, -246, -327, 823, 803, 50]
1443E0m2j10J17P32m19m62m86M51K66J58r2n73l66K55N49L9j21j79o39O70L45
1464A43q4k9k24J2K02K79J32j51l04K98k26L42oj98k0l1j16M43m21j31j69j77
1486d36J82L01l44Q3J5k33N51j02j38l3l68L88Q8K80P3k90k05L78J42R1L0p92
1508c39K41M25j46L72j15o24P7J16J65n7k37l87k10M13O45k60k61k47n2K65K54
1529C8m7J31l43j88L85K15r4R4m20J60K15L50J89m47k26k83Q4N22J46p71j84J34
1551c40J63O04m36L5n23j30K67M47R9k59o11L11L00K31J49j36l41L9N21m9J09
1572D50l40k10q0J98M41J58n35m9l36k1Q51o3p78k23k10L21P47l92k54O3q1M58
1594A15o3J49j19l16j16N38J84R9k38k23L35j32J81K20m59j99j08J30N12l17j10
$$ y = [50, 8, -102, 15, 747, 328, -134, -620, -169, 97, 255, 163, -410, -776, -521, 28, 67, -54, -233, -872, -202, 143, 59, 30, -194, -182, 20, 299, 431, 280, -24, 274, 48, 390, 384, 186, 166, 135, 19, 462, 41, -90, -259, -436, -254, 47, -297, -214, -199, -432, 119, 17, -121, -154, -522, -134, -46, 234, 307, 17, -188, 190, 332, 423, 453, -339, -98, 327, 181, 553, 438, -186, -109, 7, 172, 115, -122, -509, -719, -306, 339, 79, -182, -429, -481, -216, 38, -9, 122, -221, -409, -24, 191, 97, 191, -229, -69, 146, 496, 685, 238, 12, -271, -187, 335, 481, -290, -474, -340, -177, 427, -9, 26, -497, -627, -360, 87, 186, -73, -684, -373, -73, 158, 307, 171, -170, -131, 390, 341, 450, 110, -100, -180, 18, 459, 617, 82, 33, -303, -324, 527, 464, -314, -537, -747, -426, 321, -71, -325, -262, -343, 115, 52, 201, 82, -234, -350, 188, 372, 471, 233, 10, 345, 213, 394, 614, 155, -44, -152, -22, 490, 173, 63]
1615F3n11n3L35K84K50k99m76l33N74L3L21K7o52K25J7K82L60o0m76Q9N7K84J06
1638D47k89j60J40j71L62o2m37K02m08L83r2L88k99l21k41M95r7K04J3o26L00
1659b69L30o0J10l3k17NK74K21r3n2o2j79Q2M36l30q9j14P2J17j11R4m67J89m1
1683a87O1p0J12K21n92L88j70J23k0K43l90K23N4M44L2j98k94m3j10O24j3l98
1705D0N6j97k5Q0K79k78K04o32L12P4J23k42l99L84O3%M60m51j49L54j08L96k70
1728G4k01K60N8JR7k22J13nl31L60L5j71M7l68m7M5K56m3P4o41K68J20J54l4j57
1753b58P8J53k65M59j19j84l0O4N00m2j42k30J06K08P9k07R5l48K18j08JJ34P7
1776B39l76j14L09k23r6L37k43l12N61l33K52L6k36J60M9r2L72j20j93L2P7l5
$$ y = [63, -448, -501, -166, 118, 368, 69, -407, -740, -166, -133, 188, 215, -437, -212, -195, 87, 447, 387, -89, 0, 57, 341, 447, 158, -2, 138, -33, 329, 267, -170, 32, -376, 7, -85, 303, 4, -317, -558, -63, -160, 44, 57, -569, -269, 61, 1, 111, 78, -139, -134, 140, 361, 268, 216, 154, -25, 57, 493, 163, 74, -40, 32, 149, 38, 132, -335, -146, -187, -126, -196, -84, 137, -455, -67, -237, -114, -134, 109, -281, -58, -4, 440, 472, 274, -20, -63, -173, 451, 438, 40, 96, -101, -126, -46, 233, -45, 159, -473, -161, -87, 36, -206, -605, -221, -158, -158, 302, -149, -298, 56, -52, 344, 74, -127, 133, 191, 192, 289, 67, 180, 175, -156, 204, 239, 68, 115, -253, -300, -255, 1, -42, 32, -609, -341, -221, -67, -101, -258, -180, -27, -292, 167, 48, -136, -166, -102, 398, 356, 214, -16, 90, 298, 377, 170, 265, -83, 135, 27, 28, 162, 239, -137, -251, 58, -165, -261, 76, -167, -479, 82, -251, 1, 37, -199, -39, 10, -82, 290, 170, -23, 9, 86, 51]
1798E1J47J25m03K7O3K97Kj08l46P0oJ74j15k5k00r8Q7K57j38J71k38m6p1L88
1822F5K39l81J37k40R2K84k04J39L59k79J0j05P8K8o2l33J28n1K58k55J07k06
1844a92K01k64L91k42m0Kj97L80J11j76R3j28J61M2O2k15J24J39k10QK11j27%
1867A34j94K91l30J55J39m05K27k56k60L34K31j35j01j67R9M25k03J25k79j39
1887c09L33P4J64p8j08J59k90L50l2q8o6M0j71R1K08k20j31L8j08L07l34p2J36
1910a07j90L04r9L6P7J8j5J33l02j81L67k3N6kJ83j75j21l7J11j12J87J55l62
1933i9K60N2k79J04j44j51L46k27J6J9j50J86j95L07JP8m45L28J57k57L37j15
1955A29l37K46L07l25M0l8N08o85J72l4J27j51J72l80M04j42n6k0j74o9Q3K66
$$ y = [51, 198, 323, -80, -53, 10, 307, 309, 201, -145, -75, -81, 93, -22, -47, -247, -345, -258, -1, -139, 32, -206, -252, -323, 65, 304, -77, 60, -180, -88, 196, -8, 131, 490, 211, 221, 116, 194, 222, 160, -173, -45, -96, 162, -93, 14, -192, 9, -255, 136, -106, -146, -144, -341, 39, 150, -26, 67, -61, 100, 142, 204, -11, 113, 252, 42, 50, 261, 134, 134, -60, 231, -99, 56, 195, -210, 17, -239, -499, -165, 66, -69, -170, -337, -238, 187, -16, 109, -170, -309, 24, 98, 262, 184, 76, 235, -55, 295, 263, 175, 109, 149, -22, 69, 277, 57, -74, -36, -144, 163, -171, -243, -107, -297, 7, -92, -56, 21, 39, 24, 157, -145, -326, 41, 18, 74, 72, 255, 80, -41, -78, 33, -79, 108, 263, -99, 161, 213, -66, 38, -106, -257, 89, -138, -122, -103, -253, -67, -262, 45, 46, 124, -321, 7, 164, -93, 244, 129, -208, 38, 345, 20, 60, 22, 530, -155, 17, -17, 110, -41, 131, -249, 155, 13, -43, -63, -237, -306, -223, 43]
1977D3Jl2k73L73j71K81O2k73j32O0K80J23q9k97K3MmJ06M0o0j02j64N8J64j36
2002a15K64j23l14M26k16K48k50k67N20k07J94k30l6N9J37j15R5M02m15j08J71
2023A20l47L83j75K03j59K27pl2M4k7l92N5pJ9J85l23J1J13j60J57L2J34j04j73
2047b23J71L4NJ94k73L62M7Jo11K58M87j38j12r6m7P5j03O8n4k49K26j15N6J66
2071A29k59%K9k76L92q1R3K07k53K9L9j84L11Nk86J57p9K62j01j78J83j22k18
2094b01N27l13n5Rl00J63J37n1o6k19L01R7l54N23k44k45L53O5l02M87j57m16
2116b61L53j03J66J11j59k53l6K07J99l7r7j65J58K24j35m69K17L1j61M16l7j63
2138FK51n27L18O7k1R4k91M2J77R6KJ1k16q0L76k96K72k31k53L60o6kJ39k55j93
$$ y = [43, 44, 12, -261, 112, -59, 222, 284, 11, -121, -61, 219, 342, 253, -44, -21, -17, -21, 85, 125, 65, -37, -201, -143, 21, -115, 149, 26, -288, 138, -78, 170, -80, -347, 173, -34, 160, -70, -106, -47, 90, -25, 70, 472, 57, -51, 120, -227, 156, -19, 184, 25, 252, 245, 213, 257, 230, -162, -107, -114, -95, 90, -233, -222, -109, -269, -112, -80, 54, -50, -223, -52, -18, -13, 181, -92, 270, 317, 318, -293, -35, 452, 314, 202, 106, 59, 134, 31, 99, 45, -204, 22, -93, -37, 129, -130, -130, -101, -377, 15, -66, 27, 234, -19, 10, 49, -135, 176, 181, -105, 52, -27, 235, 134, -44, 139, 17, -201, 326, 13, -42, -33, -333, -170, -33, -84, -150, -369, -68, 29, -325, 198, -46, -291, 62, 127, -175, 312, 155, -261, 92, -11, 155, 266, 107, -146, -182, 25, 224, 187, 90, -75, 83, 307, 172, -297, -80, -49, -210, 206, 169, 6, 257, -270, 48, 115, 94, 188, -103, -61, 116, 212, 214, 225, 9, -71, 305, 9, 281, 50, -203, 157, 91, 89, 228, -27, -220]
2163b20L4j54L67k40k5Q3j59J03M2K06j81k0K67j33k11M29j59m3J71k16J85p6
2185E0j03R7j97K96j29K88l88J21M2o4J37l34O9J4l03L07O3q6K96l66J19K59l74
2208a86L1K76k15J57lj64K5M05Q6l35R1l5J93l31J86j69l4L33l83j20K77j25J64
2231A24J6qj04j96r7K15R7j8K85j85j62R1J94O3k08J5o1J82l67K01l09Q2K35J58
2255B43k02NR6k24J6n9K23j98L7j79j71M05j84M8M02m29K40q9Q1l8K11j38j84
2278h8M7L50k29l71L57k14J98M22k12m12J8J39R1k5j78K31m15q0L58m0Q7q1l04
2301c51J21J36J11n0l66K25K30j6K76o1o2P8l52p2O32j47m85K58K6k7l2j11J33
2324I4j71j60K70M8J29k76k69K24Q6M7j50l3K17j71j61M04j03J03k46j70L09P0
$$ y = [-220, -186, -340, 27, -213, -238, -155, -314, -211, -169, 37, -144, -164, 103, -30, -241, 188, 29, -14, 157, -59, 126, 50, -53, 44, -153, 143, 14, 302, -86, 35, 77, 13, 150, -184, -115, -101, -404, -97, -34, -120, 176, -190, -71, 188, -186, -155, 121, -94, 63, 60, -104, -79, 326, 412, 77, 168, 133, 326, -5, 181, 12, -22, 311, -72, -192, 85, -40, 124, 140, 132, 28, -168, -265, -50, 47, 29, 314, 129, -33, 58, 252, 315, 107, 122, 61, 243, -124, 77, -232, -150, 85, 243, 41, 46, 142, -82, -66, -125, 98, -100, -63, -242, -413, -8, -192, -144, 258, -171, 69, -20, 61, 23, 234, 96, -88, -41, 309, 80, -291, 66, -148, 50, 472, 260, -152, -134, 5, 96, 71, -107, 124, -291, -371, -13, -53, 34, -47, -351, -230, -94, 17, -33, -399, -174, 56, 40, 316, 255, 193, 271, -81, -153, 479, 332, -153, 105, 131, 104, 72, -39, 94, -77, -237, 33, 81, 210, -66, -335, -111, -25, 22, -128, -161, 56, -115, -276, 128, 25, 128, -118, -288, 21, 91]
2346I1N8m1J38j48J9K02l16l0Q3k4p4j03L17l88r7L25j00K05J95n28K48l04L35
2369F3J30j37m01K35O8N1J75p7q3J11k85K64M16o38K37j21J36q2n4k22K39j16
2391i1k48L87m8J92k29l26K03l1N09np22N96k31K9J79Q7j92jl00rL88j52K26l07
2415i6K39p9m7o3j56J65L5L2R8l87J1K32q8R1K96l88n4j0J30m0L60l09q2O0j01
2440a51K89O8j00p9n0o5J61N4L6j72J37j44J13k05J2j25j62M55l7q2jJ78m76K78
2464f8j28L54J58n42RJ36M34l54Kj97K92q3K54k19J99m11l2K98j92L84q9j90p7
2487f2K66k61J56n4n20K02J71K21j22l7n5ml0K86J30k09J8J50j47j80P4R7K3k06
2511i3J72P6j19r1Qj60l2L71L2k75k46M37k04p4L35k26J28l20L79M0o8l07J83
$$ y = [91, 149, 108, 246, 98, 117, 319, 3, -27, 56, 32, -42, -145, 172, -216, -313, 12, -88, 117, 312, -216, 32, -272, 63, 193, 56, -345, -110, -42, 9, 184, 107, 24, 135, -150, 114, 530, -108, 129, 8, 144, 62, 8, -214, 25, -91, -339, 48, 0, 192, -37, -363, -160, -191, 318, 313, -409, 187, -44, -15, 164, 251, 59, 58, -242, -251, 137, -15, 211, -96, 143, 64, 17, -46, -202, -37, -2, 30, 128, -259, -248, -16, -104, -13, 283, -105, -159, -169, -39, -79, 281, -28, -110, -50, -151, 138, 206, 106, 27, -23, -88, 73, 127, 163, -9, 128, -16, 97, -108, -96, -221, -383, 72, 35, -47, -48, 130, -346, -68, -196, 158, 316, -226, -217, -81, 353, -1, 1, -196, 96, 13, 267, 48, 247, -164, -196, 102, -90, 294, 205, 15, -62, 204, -57, 99, 45, -475, -273, -102, 119, -3, -40, -95, -99, -129, 157, 287, 78, 96, 246, 99, -81, -7, 90, 113, -93, 79, 155, 36, -55, -47, -207, -239, 132, 164, -111, -357, 80, -124, -198, 137, -89, 39, -281, 98, 138, 70, -237, -54]
2534e4%K8K73l51O6J52R3Kk34J59k82j36L52j85M17k08p3p9j01P9K42j96q1r5
2558b12J27l6M32m00J08K15l42J97R6j82J01q5k44L62J66M1j42k41k31O47j52
2579B25k2m36J63mr2L42n3m67L5J67Q7J62k12m3J77j55P6LM3o6k46K31K49r6J61
2604B29k3l87R7K42j62K73k19j0l2L1K96l84o7J39p8J07P1r9j14J59k75K43j17
2627h0j3j92K53o0J90O0j74q8J52K17r7O1Q2l14O3l9N9l5J28k61k88L56j18J19
2651a9J56m00R7R2L0J88l69K85k51L64k9j20n7k0O6OK63p8j88J9K54k95J03r7
2675@N5k76L1J80k04L77r3k29K07l03K70n0j23j23k9L46K23j73j66j1J95K8J02
2698B34Km78M61k94K21j08J74j37n8O8r7ML70n11o6J17J59j05J38k8k71O7n2J45
$$ y = [-54, -54, -26, 247, -104, -38, 114, 207, 209, -25, 134, -148, -284, 68, -117, 300, 92, 19, -60, -161, -82, 160, -36, -117, -212, -85, -121, 311, -89, 19, 234, -108, 89, 185, 3, 104, 19, -225, 137, 303, 344, 202, -39, -270, 377, 225, 203, -233, -70, -74, -166, 176, 123, -344, -309, -142, -55, 107, -105, -148, 29, -126, -50, -47, -4, -70, -316, -85, 164, 68, 229, 206, -181, -84, 158, -4, 269, 50, 40, 8, 39, 335, -49, -116, 23, -55, 52, 123, 24, -90, 69, -206, 37, -80, -93, -285, -32, -92, 98, 158, -16, -104, 48, 265, 168, 229, 311, -3, 60, 21, 80, 45, 173, -88, -376, -20, -138, -19, 137, -263, -166, -74, -44, 144, -225, 60, -191, 173, 144, 24, -33, -53, 13, 19, 282, 204, 16, 35, 289, -6, 97, 0, 55, -221, -190, -10, -214, 163, 70, -159, 48, -255, 15, -35, -158, -281, -310, 36, 259, 86, -80, -91, 104, 132, 234, 236, -242, 219, -75, 146, 38, 212, 75, 17, 85, -12, -8, 362, -149, -215, -98, 61, -44, 94, 66, -205, -138, -190, -45]
2722d5N8P1k38p8M4K61j20M01l12j09L16k5l2j26Rp9K5K82o7j27N7j96p9J73Q2
2747A46j86j52J94R3N4j76j75N7K14P0M3l52J13J74M5o9K2o2j40J46J18L5j33
2770G9p2lj96K00l66L89rq4l88L22J99j95M4O5k3k31M40j4j39j72K16k26M19l82
2794a27K76m01J48P6j21M34j88j96R6L2r7J65j22m5L2K78j87M4j19k31R1j9J33
2817d8J44l6r5k53K18J27o9J82l27J09J48j07J51j52j98J86L3J70q6j6k16KK59
2840A26j6j53K3j27j57J84J72M6j61m5n7k4K04l1J27l74J79q3K92J29k19j44m2
2863a51K91P6K0j61j09o5N7K67j51M2J6k80J96J04k15r6J25K7pJ28k33J74ok60
2887b11M75k42J31j13j21J31j4k6N0Nk47J67k67L56Jk15oJ34l4J8kj21R4p3J15
$$ y = [-45, 13, 84, -154, -232, -188, 73, -47, 354, 42, -67, 249, 224, 192, 66, 75, -4, 21, 303, 236, 109, 166, -30, -109, 64, 146, -40, -192, 2, 95, 149, -27, -202, -145, 69, 139, 182, -170, -57, 117, 162, 93, 115, 53, -87, 59, 177, 212, 79, 7, 4, -192, 8, -358, 31, 22, -62, -450, -128, 71, -124, -80, -15, -38, -269, 171, 157, 18, -154, 62, -164, 255, -127, 149, -252, -104, -28, -149, 285, 97, -99, -3, 29, -68, 97, -25, -70, -38, 240, 53, 97, -22, -253, -162, -181, -48, 96, 60, -35, -288, -70, 57, -12, 170, -157, -48, 100, -7, 144, -8, -206, -20, 13, 183, 97, 81, -135, -133, 126, 110, -43, -20, -147, -304, -120, 52, 98, -63, -108, -165, -189, 15, -16, 111, -263, -84, -167, 125, 254, 35, -109, -151, 140, 216, 236, 75, -34, -99, -42, 225, 74, 116, 132, -148, 48, 152, -63, -159, -34, -7, -14, 114, -119, 55, 49, -211, 264, 22, 153, 40, -81, 50, 36, 10, 60, 65, -182, -15, -282, 74, 75, -140, -146, -12, -46, -28, -30, -151, -57, -130, -15]
2912a5K23j44M5l18O0K98Q3l81K63k57JO4K23J56l48J39R5l67K48k8j63q0l4K13
2936b4J87j89q5J09j49K04L8j23j17Mn6M47l65J90k7o5L1J59m71M13L0n1qK2J8
2961A22k45K26j5j93M56k10j11j40j40K31j99M91l88J93m28o2M47j50L42j72k34
2982a79K08p1K50j39k56L01M0n4K51j65j86M0o2K9K14k49P7k2M4L5p9k22n0K60
3006A5k51K03j09K05l40L46j39J99j11L2K6k0k52M03k47j59R8j47J97K16ml13
3028a52Q7P0K01o9j48K4J26k65K5Q3J97l16J12k13J30M75m53k8jj03K82r7K29
3051A96l19j17L12k20K56M6j81J52p2m05L44N7j9M0m11L36n4K10k24l0k42K56
3073h9k2n0J49J04k72P4K01P6j47n1k86L96j32K35k90P2j32N0J62M7J1l80O9J36
$$ y = [-15, 208, 64, 109, -209, -149, 149, 232, -149, 114, -143, -142, -78, 145, 301, -47, 92, 187, -180, 68, 40, -123, -203, -237, -24, 163, -26, -111, -2, -151, 53, 91, -32, -149, -145, -201, 246, -119, 71, 44, -21, 10, 169, -302, 111, 141, 90, 82, 104, 122, -123, 103, 88, -105, 351, 141, 30, -110, -250, -19, -218, 273, -115, 78, -350, -412, 35, -115, 227, 55, -179, 29, -42, 208, 69, -187, 114, 154, 100, 351, 186, 0, 40, -22, 7, 221, -28, 49, 27, 71, 106, 27, -195, -245, 15, -236, -33, -142, 63, -277, 69, -70, 129, 18, 50, 76, 56, -196, 207, -40, -199, -101, -248, -51, 165, 161, -152, -65, 5, 206, 137, -11, 13, 139, -126, -101, -18, 179, -137, -25, -238, -108, 367, -86, -114, -115, -218, 64, -33, 196, -123, -240, 72, -148, 108, 154, -27, 125, 53, -352, -8, 49, 30, 70, -341, -5, -59, 151, -73, -103, -345, -89, -111, -161, -12, 92, -180, -106, 95, 171, 24, -27, -313, 83, -49, 186, -104, -32, -164, -114, 48, 95, 106, -274, -205, -69]
3097f9%K51p5l41M42l84K58j07L67n49J16j74K14J99k28j45M6K93j67n9K75j24
3119C9L0Q5J36k05m52L88j89M43m10K13k11J93Mj47k3O3J99n57N48J00m37M30
3141B40n51J97J41OL3K09k01n7p9J74J19j44M4m27K49k05J83M7J14J32m9l68L91
3164A98j4r2l02l6L18j99L81l60M5j2K15N0Q9k82O6k6o6Q2p2P2l3r5O7J19k92
3189a79K92n5j34M4J38k48jJ02o2K41k0L1l22Q1J12L1J60k40o7n7n3M53k18j72
3213a43K62j69L1J90L0p0j58j00R0L38j9j79l62j01J43M81m01l5J75n7K81Q6k76
3236C7K8l69L65j68O5J62o5k10K35j9j9M8k75J93m8j72J53J64l27K38l6k8K75
3259B27j07J8k74M9M4R4J04k81k8J44J2Rq9J69k61J68j7j00K08m45M47r2J22J80
$$ y = [-69, -69, 182, 107, -234, 208, -176, 82, -25, 342, -207, -91, -265, -51, 148, -80, -225, -179, 114, -53, -112, 163, 39, 69, 154, 290, 85, -367, 21, -168, 275, -135, 78, -133, 60, 64, -83, -106, -43, 156, -401, 147, 247, -190, 240, -311, -114, 27, 33, 66, 275, 74, 17, -62, 112, 231, 87, 131, -296, -47, -252, -69, -22, 92, 224, 175, -193, 198, 184, 92, -210, -246, 72, -127, 254, -106, -61, -73, 142, 192, 281, -1, 65, 39, -27, 55, -17, 55, 22, -73, -6, 113, -179, 113, 58, -76, -32, 106, -142, -143, -41, -103, 138, 118, 149, -173, -92, 20, 51, 211, -29, -96, -153, -206, 247, 29, -143, 119, -50, -19, 171, 201, 131, -27, -127, -37, 301, 282, 103, -259, -360, -217, 264, -137, -172, 3, -54, 227, 313, 37, 65, -304, 61, -107, -42, 120, 55, -155, 80, 61, 42, 90, -185, 8, -40, -212, -59, 105, -222, 16, -20, -48, 227, 120, 138, -136, -87, -43, 51, 155, -126, -154, -10, 2, 11, -78, 91, -170, -2, -19, -119, 89, -356, 91, -1, 121, 301]
3283C01m8l2j32j25l8J60k68J8J94k16J40NPk4k02K96k37J94M5j99J86m0k4K01
3307A62k94K33j79K5J05j83K19r8K48l96M2K23l42R1J30k47K17J23j16j17K34
3328H0l07J2K99O3r2l84K64M6o3K15j02j33J50N4k41L58j18p7j63J70K64j21q8
3351H6j00J24J36r8j56N9j26j96M05m72L68j8j15J19K94k28k60m0L06Qq9M1j99
3374a51p7K80k37k9J34J56j33Ro5LK40M0J5k67o4K62k11j29N70m18O2j86M8K89
3398A41k67N1j51K23M9L9k46P4J41q9J4lJ16O9j68l3M61k94k00K20l50K33L0j41
3422h1k12J55n2L60j60p9O9J2J45j94Rnj01J55j30M85l13M2J19k90K25j36P3q0
3446A6j8l8J99l06L98k52Qr2j05K92j55rr8K61j62K15m8k48K88k77K81K8k69J01
$$ y = [301, 253, 221, 89, -36, -74, 86, -182, -164, 30, -186, -46, -41, -34, -58, -260, 36, -201, -7, 38, -161, 25, -15, -39, 162, -132, 101, -78, -53, 52, -131, 88, -10, 238, -158, -116, 107, -235, -144, -14, -261, -44, 79, -37, -154, 80, -227, -215, 84, 147, 55, -329, -65, -19, -82, 133, 31, -102, 48, 102, -139, 219, 101, 24, -139, 31, 295, 174, 86, -14, 110, 246, 148, -8, 51, -75, -271, 134, -338, 30, 12, -103, 16, 310, 82, -178, -218, 88, 96, 7, 48, -151, -228, 52, -185, -214, -80, 76, -57, -48, -113, -110, 130, 170, 185, -82, -146, 116, -95, -224, 346, -72, -10, -196, -148, 141, -126, -75, -226, -3, 46, 85, -161, -87, 54, -35, -21, -24, 92, 161, -7, -40, 421, 127, -73, 147, -203, 30, 60, -81, -293, -138, -190, 170, 10, -69, 0, 12, 157, -37, -28, -33, -134, 21, -109, 376, 63, 105, 224, -66, 159, 23, 96, 16, -2, -40, 159, -147, 251, -1, 7, -85, -190, 102, -53, -62, -160, 101, -61, 154, 106, -142, 146, -131, 150, 178, -91, 10]
3470A0r9N5M2J92j00j4j2J93j08J00k41P8j53o7K13j72K46j09n4j05j79J25Q9
3493g0J81k84K60j67K79k44J89l4k50J58K32j71m1L5l59K38K93j83P3r8K52l59
3515g0K40m4j0j26p6K81l02J74j73k8K64k74K14J00k27j08j46N56l20j99L13j63
3537a24J47j65L71k14L43j28l91L7L71j65J6J72k40j57J25j15K10q9k91M79k03
3558a1m5j27J53J23j83P0o3K06j66Q2J53N8k65Q2l8j4Q1k21L23j67j48J87j60
3581i0J47K36k21j14N6J60l21J93L64m33O8j49J29j09J83j29k2m8K69j07K8j48
3603e8L3j36R8K47j25M4m33J03J07J82j09j7p2K54k26M02k50k49J11m3K7R0R2
3626G2k32J23k06J62Q9L7m0K8j3k9J68J0m29J22K85j95L06l89J07J71j94J17P3
$$ y = [10, -89, -34, 8, 200, 100, 86, 74, 267, 159, 259, 18, 96, -57, -124, 89, -83, 163, 54, 0, -105, -284, -159, -70, 111, -173, 87, -80, 199, -45, 144, 110, -140, 18, 250, 79, 38, 73, -286, -48, 245, 62, 135, 37, 289, -70, 170, 126, 116, -10, -86, 195, -107, 67, -106, -134, 130, -144, 70, 170, -57, -165, -311, 245, -75, -274, 39, -124, 23, -142, 229, 15, 358, 230, -161, -124, 247, 82, 98, 270, 30, -127, -2, -117, 93, 4, -287, 192, -11, -56, -183, -30, 93, -90, -20, -83, 123, -43, 39, 192, 250, -15, 67, 29, 15, 96, -125, 198, 31, -117, 70, -90, 57, 293, 72, -42, 14, 174, -147, 46, 410, -23, 45, -104, 25, -84, 99, -30, -52, -100, 169, 62, 90, -58, -25, -161, -63, 184, 59, 103, -330, -227, -120, 62, -47, -64, -136, 118, -108, 294, 44, -205, -94, -137, -110, -20, 72, -160, -37, -243, -81, 8, 45, 5, 33, 20, -9, 159, 169, -260, -138, 147, -48, 258, -131, -24, 147, -47, 70, 143]
3649A43jm2j42N8j02K66j78L1j44K09J0j87J73l13K71q2J8J62m37J06K05J25J25
3672B74k56J01p1j12M8R9j71K36O6j09O5j47k3J88l53p1L08j2j34M6r9J9N7nJ65
3697A09o7r8N0R0J20J17q1k65p7J69n7J18p1k20NL55k30J64l6k57K20O2o7l18
$$ y = [143, 142, 100, -42, 16, -86, 180, 2, 33, -111, 98, 108, -79, 94, -219, 52, -30, -12, 150, -287, -181, 24, 149, 274, 18, 119, 48, -64, -16, 83, -88, 148, 214, 105, 170, 23, 0, 188, -165, -236, 72, 60, -74, -28, -127, -108, -51, -56, 109, 42, -56, -6, 84, 204, 321, 240, -25, -102, 67, 10, 128, 57, -163, -158, 197, -33, 131, 95, -162, 58, 120, 53, -265]
$$ [...]
8191g5
##END NTUPLES=NMR FID
##END=
