##TITLE=1H_LR-758-R8-RMC1
 CDCl3
 8 sc, 
 30.10.2023
##JCAMPDX= 6.0         $$ Bruker NMR JCAMP-DX V2.0
##DATA TYPE= NMR FID
##DATA CLASS= NTUPLES
##ORIGIN= UXNMR, Bruker Analytische Messtechnik GmbH
##OWNER= root
$$ XWIN-NMR		Version 3.5
$$ Mon Oct 30 13:46:37 2023 Russian Standard Time (UT+4h)  she@DPX200
##.OBSERVE FREQUENCY= 200.13135
##.OBSERVE NUCLEUS= ^1H
##.DELAY= (6, 6)
##.ACQUISITION MODE= SIMULTANEOUS
##.ACQUISITION SCHEME= undefined
##.AVERAGES= 8
##.DIGITISER RES= 18
##SPECTROMETER/DATA SYSTEM= spect
##.PULSE SEQUENCE= zg30
##.SOLVENT NAME= CDCl3
##.SHIFT REFERENCE= (INTERNAL, CDCl3, 0, 15.7039)
##AUDIT TRAIL= $$ (NUMBER, WHEN, WHO, WHERE, WHAT)
$$ ##TITLE= Audit trail, XWIN-NMR		Version 3.5
$$ ##JCAMPDX= 5.01
$$ ##ORIGIN= Bruker BioSpin GmbH
$$ ##OWNER= she
$$ F:/spectra/data/she/nmr/H-F/1/audita.txt
$$ ##AUDIT TRAIL=  $$ (NUMBER, WHEN, WHO, WHERE, WHAT)
(   1,<2023-10-30 13:45:10.68 +0400>,<she>,<DPX200>,
      <created by zg, POWCHK disabled, PULCHK disabled
       configuration hash MD5:
       00 E9 B6 7A A2 85 ED C7 34 08 36 98 17 FE 4E 26
       data hash MD5: 16K
       87 37 B7 2F 18 0F 35 1B 50 66 CA 0B 5B 0A 11 F4>)
$$ ##END=
$$ 
$$ hash MD5
$$ C6 A9 7C 54 06 05 2A 47 2A 5F DA AC 0A A2 9D 40
##$RELAX= 
##$RELAX= 
##$RELAX= 
##$RELAX= 
##$RELAX= 
##$RELAX= 
$$ Bruker specific parameters
$$ --------------------------
##$DU= <F:/spectra>
##$EXPNO= 1
##$NAME= <H-F>
##$PROCNO= 1
##$TYPE= <nmr>
##$USER= <she>
##$AMP= (0..31)
100 100 100 100 100 100 100 100 100 100 100 100 100 100 100 100 100 100 
100 100 100 100 100 100 100 100 100 100 100 100 100 100 
##$AQSEQ= 0
##$AQ_mod= 1
##$AUNM= <au_zg>
##$AUTOPOS= <>
##$BF1= 200.13
##$BF2= 200.13
##$BF3= 200.13
##$BF4= 200.13
##$BF5= 200.13
##$BF6= 200.13
##$BF7= 200.13
##$BF8= 200.13
##$BYTORDA= 1
##$CFDGTYP= 0
##$CFRGTYP= 5
##$CHEMSTR= <none>
##$CNST= (0..31)
1 1 145 1 1 1 1 1 1 1 1 1 1 1 1 1 1 1 1 1 1 1 1 1 1 1 1 1 1 1 1 1 
##$CPDPRG= <>
##$CPDPRG1= <>
##$CPDPRG2= <>
##$CPDPRG3= <>
##$CPDPRG4= <mlev>
##$CPDPRG5= <mlev>
##$CPDPRG6= <mlev>
##$CPDPRG7= <mlev>
##$CPDPRG8= <mlev>
##$CPDPRGB= <>
##$CPDPRGT= <>
##$D= (0..31)
0 1.2 0 0 0 0 0 0 0 0.06 0 0.03 0 0 0 0 0.0002 0 0 0 0 0 0 0 0 0 0 0 0 
0 0 0 
##$DATE= 1698659110
##$DBL= (0..7)
120 120 120 120 120 120 120 120 
##$DBP= (0..7)
150 150 150 150 150 150 150 150 
##$DBP07= 0
##$DBPNAM0= <>
##$DBPNAM1= <>
##$DBPNAM2= <>
##$DBPNAM3= <>
##$DBPNAM4= <>
##$DBPNAM5= <>
##$DBPNAM6= <>
##$DBPNAM7= <>
##$DBPOAL= (0..7)
0.5 0.5 0.5 0.5 0.5 0.5 0.5 0.5 
##$DBPOFFS= (0..7)
0 0 0 0 0 0 0 0 
##$DE= 6
##$DECBNUC= <off>
##$DECIM= 32
##$DECNUC= <off>
##$DECSTAT= 4
##$DIGMOD= 1
##$DIGTYP= 9
##$DL= (0..7)
0 120 120 120 120 120 120 120 
##$DP= (0..7)
150 150 150 150 150 150 150 150 
##$DP07= 0
##$DPNAME0= <>
##$DPNAME1= <>
##$DPNAME2= <>
##$DPNAME3= <>
##$DPNAME4= <>
##$DPNAME5= <>
##$DPNAME6= <>
##$DPNAME7= <>
##$DPOAL= (0..7)
0.5 0.5 0.5 0.5 0.5 0.5 0.5 0.5 
##$DPOFFS= (0..7)
0 0 0 0 0 0 0 0 
##$DQDMODE= 0
##$DR= 18
##$DS= 0
##$DSLIST= <SSSSSSSSSSSSSSS>
$$ [...]
##$SUBNAM2= <"">
##$SUBNAM3= <"">
##$SUBNAM4= <"">
##$SUBNAM5= <"">
##$SUBNAM6= <"">
##$SUBNAM7= <"">
##$SUBNAM8= <"">
##$SUBNAM9= <"">
##$SW= 18.05172834244
##$SWIBOX= (0..15)
0 0 2 0 0 0 0 0 0 0 0 0 0 0 0 0 
##$SW_h= 3612.71676300578
##$TD= 16384
##$TD0= 1
##$TE= 0
##$TE2= 300
##$TE3= 300
##$TEG= 300
##$TL= (0..7)
0 120 120 120 120 120 120 120 
##$TP= (0..7)
150 150 150 150 150 150 150 150 
##$TP07= 0
##$TPNAME0= <>
##$TPNAME1= <>
##$TPNAME2= <>
##$TPNAME3= <>
##$TPNAME4= <>
##$TPNAME5= <>
##$TPNAME6= <>
##$TPNAME7= <>
##$TPOAL= (0..7)
0.5 0.5 0.5 0.5 0.5 0.5 0.5 0.5 
##$TPOFFS= (0..7)
0 0 0 0 0 0 0 0 
##$TUNHIN= 0
##$TUNHOUT= 0
##$TUNXOUT= 0
##$USERA1= <user>
##$USERA2= <user>
##$USERA3= <user>
##$USERA4= <user>
##$USERA5= <user>
##$V9= 5
##$VALIST= <valist>
##$VCLIST= <CCCCCCCCCCCCCCC>
##$VD= 0
##$VDLIST= <DDDDDDDDDDDDDDD>
##$VPLIST= <PPPPPPPPPPPPPPP>
##$VTLIST= <TTTTTTTTTTTTTTT>
##$WBST= 1024
##$WBSW= 4
##$XGAIN= (0..3)
0 0 0 0 
##$XL= 0
##$YL= 0
##$YMAX_a= 215705
##$YMIN_a= -359968
##$ZGOPTNS= <>
##$ZL1= 120
##$ZL2= 120
##$ZL3= 120
##$ZL4= 120
##$ABSF1= 10
##$ABSF2= 0
##$ABSG= 5
##$ABSL= 3
##$ALPHA= 0
##$AQORDER= 0
##$ASSFAC= 0
##$ASSFACI= 0
##$ASSFACX= 0
##$ASSWID= 0
##$AUNMP= <proc_1d>
##$AZFE= 0.1
##$AZFW= 0.1
##$BCFW= 1
##$BC_mod= 2
##$BYTORDP= 1
##$COROFFS= 0
##$CY= 11.3945322036743
##$DATMOD= 1
##$DC= 2
##$DFILT= <>
##$DTYPP= 0
##$F1P= 15.7292609196834
##$F2P= 12.9074282941183
##$FCOR= 0.5
##$FTSIZE= 0
##$FT_mod= 4
##$GAMMA= 1
##$GB= 0.15
##$INTBC= 1
##$INTSCL= 1
##$ISEN= 128
##$LB= 0.24
##$LEV0= 0
##$LPBIN= 0
##$MAXI= 10000
##$MC2= 0
##$MEAN= 0
##$ME_mod= 0
##$MI= 1.114404
##$NCOEF= 0
##$NC_proc= 0
##$NLEV= 6
##$NOISF1= 3.799351
##$NOISF2= 2.8
##$NSP= 1
##$NTH_PI= 0
##$NZP= 0
##$OFFSET= 15.70392
##$PC= 1
##$PHC0= -23869.11
##$PHC1= 19.25271
##$PH_mod= 1
##$PKNL= yes
##$PPARMOD= 0
##$PSCAL= 0
##$PSIGN= 0
##$REVERSE= no
##$SF= 200.130013532006
##$SI= 16384
##$SIGF1= 3
##$SIGF2= 2
##$SINO= 400
##$SIOLD= 16384
##$SREGLST= <1H.CDCl3>
##$SSB= 0
##$STSI= 0
##$STSR= 0
##$SW_p= 3612.71676300578
##$SYMM= 0
##$S_DEV= 0
##$TDeff= 0
##$TDoff= 0
##$TI= <>
##$TILT= no
##$TM1= 0
##$TM2= 0
##$TOPLEV= 0
##$USERP1= <user>
##$USERP2= <user>
##$USERP3= <user>
##$USERP4= <user>
##$USERP5= <user>
##$WDW= 1
##$XDIM= 8192
##$YMAX_p= 0
##$YMIN_p= 0
$$ End of Bruker specific parameters
$$ ---------------------------------
##NTUPLES= NMR FID
##VAR_NAME=  TIME,          FID/REAL,        FID/IMAG
##SYMBOL=    X,             R,               I
##VAR_TYPE=  INDEPENDENT,   DEPENDENT,       DEPENDENT
##VAR_FORM=  AFFN,          ASDF,            ASDF
##VAR_DIM=   8192,          8192,            8192
##UNITS=     SECONDS,       ARBITRARY UNITS, ARBITRARY UNITS
##FACTOR=    0.0002768,     1,               1
##FIRST=     0,             0,               0
##LAST=      2.2672688,     0,               0
##MIN=       0,             -359968,         0
##MAX=       2.2672688,     215705,          0
$$ Real data points
##PAGE= N=1
##DATA TABLE= (X++(R..R)), XYDATA
0@%%%%%%%%%%%%%%%%%mJ1j4J5j6J6j6J7k1K6l0L3l7M1m5N2n8O4p2Q0q8R7j07J18
$$ 0 0 0 0 0 0 0 0 0 0 0 0 0 0 0 0 0 0 -4 7 -7 8 -8 8 -8 9 -12 14 -16 17 -20 21 -24 28 -30 34 -38 42 -46 51 -56 62
41F2j30J43j58J74j89K07k27K49k76L03l33L68m07M54n09N73o51P45q62J012j209
$$ 62 -68 75 -83 91 -98 109 -118 131 -145 158 -175 193 -214 240 -269 304 -347 398 -464 548 -661
62f61J477j858K432l361N032q552J8448r0100k82825L64233J22899j57669K35457
$$ -661 816 -1042 1390 -1971 3061 -5491 12957 -77143 -359968 4265 127164 -30505 204952
75B04952m8413l83265J34553K63051j06157J4795M4990k26864j076K34388k1973
$$ 204952 156539 -226726 -92173 170878 64721 79516 124506 -102358 -103434 130954 108981
86A08981p5655J4342j07153m240J40325j0375l6120j1076j00429K6448J08182
$$ 108981 33326 47668 -59485 -63725 76600 66225 30105 19029 -81400 -54952 53230
97E3230l1400J582Q550j23459J6607J36674m4816l7344P0266q7264o6102J48487
$$ 53230 21830 23412 31962 -91497 -74890 61784 16968 -20376 49890 -37374 -103476 45011
109D5011J1041r7132P2981k7735j20023J28958P7104j28354K5568L8747j02259
$$ 45011 56052 -41080 31901 4166 -115857 13101 90205 -38149 -12581 26166 -76093
120g6093N8707J06725p6691l1553L4945n8544J7200J04827m0074p0077L6188j3742
$$ -76093 -17386 89339 12648 -18905 16040 -42504 -25304 79523 39449 -30628 5560 -8182
132h182j0688Q1319j6863o7656L0185q443j3909P0673j9500o9501K8496P988j4825
$$ -8182 -18870 62449 45586 -22070 8115 -328 -14237 56436 36936 -32565 -4069 3919 -10906
145a0906M6072j2610o4387K1926L0806k5352K0005J7776n9694J660N5347k5679
$$ -10906 35166 22556 -41831 -19905 10901 -14451 5554 23330 -36364 -34704 20643 -5036
157e036o858L2074m8128r817O4339j9919l1728K9179j3898j5139M1331L515k9838
$$ -5036 -11894 20180 -27948 -37765 26574 6655 -25073 4106 -9792 -24931 16400 19915 -9923
170i923Q004K323j6499K6415K2148l5346q964J7643j5564J1870K3837k6407o217
$$ -9923 -1919 404 -16095 10320 32468 -2878 -11842 5801 -9763 2107 25944 -463 -6680
183f680J2683j7823J1053K2239j7895q424N474p345O615J2984j0150j2615Q293
$$ -6680 6003 -11820 -767 21472 3577 -4847 627 -6718 -103 12881 2731 -9884 -1591
196a591k72p053J7524K222k3539P272O778q454K1242j91k9109Q400J0698q832
$$ -1591 -1863 -8916 8608 10830 -12709 -5437 1341 -7113 14129 13938 -15171 -6771 3927 -4905
210d905J2866M902j9458o794Q167M843N985P026j4288j8534J3928J0786m883R653
$$ -4905 7961 12863 -6595 -13389 -5222 -379 5606 12632 -1656 -20190 -6262 4524 -359 9294
224I294p568j9428Q275P336K998J0528j1638j5084N907Q608R144J102j0476o020
$$ 9294 1726 -17702 -9427 -2091 907 11435 -203 -15287 -9380 -772 8372 9474 -1002 -7022
238g022O03O711P830J541m998j3915k712J5336M316N28l871j9287K539J7085j663
$$ -7022 -6419 292 8122 9663 4665 -9250 -11962 3374 7690 8218 4347 -14940 -12401 4684 3021
253C021L877J22j8938k884J3111Q744K702p095j0870m193J0977J4674n951p305
$$ 3021 6898 7020 -11918 -14802 -1691 7053 9755 2660 -8210 -12403 -1426 13248 7297 -8
267hN67q299N460J6237l684q164o458m849J1333Q867k448p960j1262L349Q760
$$ -8 559 -7740 -2280 13957 10273 2109 -4349 -9198 2135 11002 8554 594 -10668 -7319 1441
282A441Q85L543l996j2262J127P224O376N28q880k711J185M986P818o693o059
$$ 1441 2326 5869 1873 -10389 -9262 -2038 4338 4866 -4014 -6725 -5540 -554 7264 571 -5488
297e488N779k857J269R228l952n702p53M75N478R78j744k063m205N073Q76o716
$$ -5488 291 -2566 -1297 7931 3979 -1723 -2476 -2001 3477 4455 2711 648 -3557 1516 2392 -4324
313d324N964J120o594K849M07j142M16k300K198J571L26K327o334p35P100l939
$$ -4324 1640 2760 -3834 -985 -578 -1720 -1304 -3604 -1406 165 491 2818 -3516 -4251 2849 -1090
329a090J357P009o095m534J191K897N906j731m058k594j180P421J889p485J343
$$ -1090 267 7276 1181 -3353 -2162 735 6641 4910 852 -1742 -2922 4499 6388 -1097 246
344B46j525l172P941J532n452n466l711O829O614j191l362r034R26J0279l80J293
$$ 246 -1279 -4451 3490 5022 -430 -5896 -9607 -2778 3836 2645 -717 -9751 -8825 1454 1074 2367
360B367J652r353k157N812N128L449m574n696lK417O851m73n487K469l533k427
$$ 2367 4019 -5334 -7491 -1679 3449 6898 2324 -3372 -3375 -958 5893 5420 -67 2402 -1131 -3558
376c558R081J050m093l599n086M505N759p35j222n487k103M106J23N871K935q278
$$ -3558 5523 6573 2480 -1119 -6205 -1700 4059 3324 2102 -3385 -5488 -1382 -1259 4612 7547 -731
392g31l605J647M784O631l305m775j378k604N672L790k856K45o206m409R227M676
$$ -731 -4336 -2689 2095 8726 5421 646 -732 -3336 2336 6126 3270 3515 -2691 -7100 2127 6803
408F803k606m662o156J569M688K619O33o420l484N77K16R027M085r946k916J462
$$ 6803 4197 -465 -6621 -5052 -364 2255 2888 -3532 -7016 -6439 -6223 2804 6889 -3057 -5973 -4511
424d511K215P792k08m062k676k618L246M017J697rq512l147P146K910R34k341
$$ -4511 -2296 5496 5288 1226 -1450 -4068 -822 3195 4892 4883 -3629 -6776 370 3280 4214 1873
440A873p254L66K815K576L966m966n425j018M31Q319L507q568l325N82K919P281
$$ 1873 -5381 -5015 -2200 376 4342 -624 -6049 -7067 -6636 1683 5190 -3378 -6703 -6121 -3202 4079
456D079O30l670l883k210N561L676J264j035r922j319R873J722r39k033p383Q50
$$ 4079 4709 1039 -2844 -5054 507 4183 5447 4412 -5510 -6829 3044 4766 3827 1794 -5589 -4739
472d739O138K307Q49m475m489j337K569Q919j673q996o16K64L137O789l091n129
$$ -4739 1399 3706 4555 80 -4409 -5746 -3177 5742 4069 -4927 -5543 -5279 -2142 4647 1556 -3573
488c573n14j078N346M351r92l769o667J406Q803N45k224m072m291L871M708J605
$$ -3573 -4087 -5165 181 4532 3540 -229 -6896 -5490 3313 3858 1634 -2438 -6729 -2858 1850 3455
504C455K93o331k126L074L042O224l157j0424J152M186K640M204m266n928n90
$$ 3455 3748 -2583 -4709 -1635 1407 7631 4474 -5950 -4798 -612 2028 6232 1966 -3962 -4552
519d552K386N934K090k022m442o684N275R643l091l181l209m876M956N313o85
$$ -4552 -2166 3768 5858 3836 -606 -7290 -2015 7628 4537 1356 -1853 -6729 -1773 3540 2855
534B855j691n528l237L604N809L889o308q454K473K950L946K996o512l890m91
$$ 2855 1164 -4364 -7601 -3997 1812 5701 -607 -9061 -6588 -3638 308 3304 -3208 -7098 -7589
549g589J715P495K376m749l658k806O434Q532k884l999j649j912N135M931l13
$$ -7589 -5874 1621 3997 -752 -4410 -7216 -782 7750 4866 867 -782 -2694 2441 7372 7059
564G059l234n325O3M189M033K960p855o267M878J297J893K578o484m228J213J23
$$ 7059 3825 -1500 -1437 2752 6785 9745 1890 -4377 501 1798 3691 6269 -215 -4443 -3230 -3107
580c107M398J704m543m347j174N825L895k868r39k261j826M951J540L31l87n883
$$ -3107 1291 2995 -1548 -5895 -7069 -1244 2651 -217 -1156 -3417 -5243 -292 1248 1579 1192 -4691
596d691o20M997K060K378m109n399L005K295J653K362l554l164J6K092M328l53
$$ -4691 -5311 -314 1746 4124 15 -5384 -2379 -84 1569 3931 377 -2787 -2771 -679 3649 3296
612C296l306k401j087O267L407m557K27j205k130N571K423k102p05m373n39M279
$$ 3296 -10 -2411 -3498 2769 6176 1619 1846 641 -1489 4082 6505 4403 3698 -675 -1214 3065
628C065J992l51m903k302K520n50K230J102m398j404L51m78L989j97l479j359
$$ 3065 5057 4706 -197 -2499 21 -529 1701 2803 -1595 -2999 -2648 -3126 863 666 -2813 -4172
644d172n35L784J551k683J101j117j333M065J350l26M33l975N41M152J575Q3l581
$$ -4172 -4707 -923 628 -2055 -954 -2071 -3404 661 2011 1685 2118 -1857 -1316 2836 4411 4494 913
661I13k136K405K3K221J390m263j429k56R66M645n85m507j435q21L934J982l331
$$ 913 -1223 1182 1205 3426 4816 553 -876 -1132 -166 4479 3894 -613 -2048 -2869 1065 3047 -284
678b84M82k063k673N104J559j122n44l421M37L469J579o04m001L78J947k025L398
$$ -284 198 -1865 -4538 566 2125 1003 459 -2962 -2525 944 2523 1919 -2082 -1704 243 -1782 1616
695A616J436n756R45L16r61N053o55m944j6Q73J782J271p16m20k622q25L977R54
$$ 1616 3052 -2704 -1759 -1443 -2404 2649 1994 -2950 -2966 -2093 -311 960 244 -176 -2798 -3623 354 1308
713A308P53j089m417K143K997J66J445k939j490K482j655K469K493m617j625J415
$$ 1308 2061 972 -3445 -1302 1695 1861 3306 367 -1123 1359 -296 2173 4666 49 -1576 -161
729a61M70K244k93k856j774N72K913p37q05J940m505j552N352m36j27Q64m377
$$ -161 309 2553 2260 -596 -2370 -1798 1115 378 -427 1513 -2992 -4544 808 372 245 1109 -3268
746c268N72L656k77P15p07j337J4p83L334J595k764k49j030N5K954j090j097K05
$$ -3268 -2696 960 683 1398 691 -646 -632 -1415 1919 3514 750 501 -529 -474 2480 1390 293 498
764D98k184J393R81j007J788k765k819L839O93p46M14k083K3J101Q86J282r09
$$ 498 -1686 -293 688 -319 1469 -1296 -4115 -276 417 -329 85 -1998 -1975 -874 12 1294 385
781C85k11q30j906M313K150m123N28m96j340L231M82r77M3k380j63N98J656J786
$$ 385 174 -656 -2562 1751 3901 -222 306 -190 -1530 1701 2183 1206 1249 -1131 -1294 -696 960 2746
799B746m212j472K417o87J434Q20k807N24J3j02K699k54j199j066j190L441J489
$$ 2746 -1466 -2938 -521 -1208 226 1046 -1761 -1237 -1224 -1326 1373 1119 -80 -1146 -2336 1105 2594
816B594k741L44m40j313K924J17J26o50k368O50J245P59J325l821j469K683p25
$$ 2594 -147 197 -243 -1556 1368 1485 1611 961 -1407 -757 488 1247 2572 -1249 -2718 -35 -760
833g60O02J475k700j02J34k4K339l81p22j165r91L459O43k591J493j029q11K720
$$ -760 -158 1317 -1383 -1485 -1351 -1375 964 583 -139 -1304 -2295 1164 1807 -784 709 -320 -1131 1589
851A589m35m18N04k215O45J749O62Rk980l55K373o86O40l26k559R81m5M04J792
$$ 1589 1154 736 1240 -975 -330 1419 2081 2090 -890 -1245 1128 442 1082 756 -1803 -822 -867 -463 1329
870A329j542j166J52k33L012n36k411J201j39J01J924j561j75M19j199J858P11
$$ 1329 -213 -1379 -1227 -1460 1552 1016 -1395 -194 -333 -232 1692 131 -44 375 -824 1034 1745
887A745j207l38j733J623K394k106j59l19j764J656O71q68P23j802p42J031O28
$$ 1745 538 200 -1533 90 2484 378 219 -100 -1864 -208 463 -405 318 -1484 -2226 -1195 -567
904e67J725j365j964K015j36L26J930k341k11J040o69J776L39j071o48r64K023
$$ -567 1158 -207 -2171 -156 -292 34 1964 -377 -588 452 -217 1559 1898 827 179 -785 1238
921A238J841k220l18m34j295K252M20j261P1k201l4J666M77J003k495j721K683
$$ 1238 3079 859 541 107 -1188 1064 1484 223 294 -1907 -1941 -275 202 1205 -1290 -3011 -328
938c28J10N25J265k511o14J534k2J716o8j797l81m72K798J089k667k2o00l85K654
$$ -328 -218 307 1572 -939 -1553 -19 -41 1675 1607 -190 -571 -1043 1755 2844 177 155 -445 -830 1824
957A824k11j247Kj996K80K052k86L84k310j385K623K72L34O66k161J40J230n2
$$ 1824 1613 366 368 -1628 -1348 704 418 802 -1508 -2893 -270 2 336 1002 -1159 -1019 211 159
975A59J784n91j461k97m29K859N65l137Q41k78j376K524M23j455J85j717Q7J934
$$ 159 1943 1352 -109 -406 -835 2024 2589 -548 293 15 -1361 1163 1586 131 316 -1401 -1314 620
993F20J84m40k170n58K196l91O63K29k427Q45N93J95K332r93k066N09K70K012
$$ 620 804 364 -1806 -2364 -168 -559 104 333 -2094 -1249 -656 -461 1871 878 -1188 -679 -409 1603
1011A603N93k355ml1m57J948K57o83p40j683J057J503j43j65k201j30K211j200
$$ 1603 2196 -159 -163 -194 -651 1297 1554 871 131 -1552 -495 1008 865 700 -1501 -1631 580 -620
1029f20N76R89k769K46P80J18J449j36j731J41M12J656J09j103P90j222p0K148
$$ -620 -44 945 -1824 -1578 -798 -680 769 633 -1098 -957 -545 1111 1220 117 907 -315 -385 1763
1047A763n72L1n72k175J299J790o20J89j573r59J816l75M80N13k520k74R35Q95
$$ 1763 1191 1222 650 -1525 -226 1564 944 1133 -440 -1399 417 42 522 1035 -1485 -1759 -824 71
1065G1J315j735j041M09k61K337K21j984J106j251m80K860k76q07l90j941J564
$$ 71 1386 -349 -1390 -981 -1242 1095 1316 -668 438 -813 -1293 1567 1291 484 94 -1847 -283
1082b83J880n37m92j602m21J457K49R99k25k939M51O88Q78J547j839j762J051
$$ -283 1597 1060 568 -1034 -1455 2 251 1250 1025 -1914 -1463 -775 103 1650 -189 -1951 -900
1099i00J24J637O50j779j1o95L30K773l74j106p56j217J868J199o06j85j922l91
$$ -900 -776 861 1511 -268 -279 -974 -644 2129 1755 649 -107 -1324 544 1743 1137 952 -970 -1361
1117a361J902n13J010n74k815O44J129M35J352k029j619Q82L00J886o4j422o0
$$ -1361 541 28 1038 464 -2351 -1707 -578 -143 1209 -820 -2439 -1557 -1257 629 565 -857 -917
1134i17q73J072K284o18r07m65j378K708J432q06n20j425l98J729L35P10r46k626
$$ -917 -1790 -718 1566 948 41 -424 -1802 906 2338 1532 1012 -413 -811 918 1253 1963 1017 -1609
1152a609R31R03M90O70k035r20Q64L39J354q03j266N70j064Q17K091j012o01m17
$$ -1609 -678 225 715 1385 -650 -1570 -706 -367 987 184 -1082 -512 -1576 -759 1332 320 -281 -698
1170f98p95K186R33j271K1r31R7J017j4N96o86j956J177M76M37N59j686q25Q85
$$ -698 -1493 693 1626 355 376 -555 -458 559 545 1141 455 -1501 -324 152 589 1148 -538 -1363 -478
1189d78k7Q63j78r60M45j059R55J768j173k47k39q46K010K86r69L77o35K02O16
$$ -478 -505 358 180 -780 -335 -1394 -439 1329 156 -91 -330 -1176 834 1120 151 528 -107 95 711
1208G11j13P27p72j316J262N3m25J012j582m10J005q68Q52R7j061M60j120P34
$$ 711 598 1325 553 -763 499 552 127 1139 -443 -853 152 -716 136 233 -828 -368 -1488 -754
1226g54J298j007K41k49n90J237k53j22R74j076j69J031n76J541n29j447Q68p1
$$ -754 544 -463 -222 -471 -1061 176 -77 -199 775 -301 -470 561 -15 1526 997 -450 418 347
1244C47K7J097j509k73J97m23P76O01q74l70j154Q28J232j081N99l36j175J357
$$ 347 374 1471 -38 -311 -114 -537 239 840 -34 -404 -1558 -730 502 -579 20 -316 -1491 -134
1262a34K86k65J018j238o03J179J99P11l60j566R96KP90J24r06l98l07m1J566
$$ -134 152 -113 905 -333 -936 243 442 1153 793 -773 223 225 1015 1139 233 -165 -472 -513 1053
1281A053k96j059k06r75Q26J386j043J96m18j134J435N10J69L9j331n6J032M37
$$ 1053 757 -302 -508 -1483 -657 729 -314 -118 -536 -1670 -235 275 444 483 -848 -904 128 565
1299E65Q18j065j049P31K3Q45P95j729J07M1m70J602o1j454j94n93Q94J005q34
$$ 565 1383 318 -731 0 23 868 1663 -66 41 82 -388 1214 1153 -301 -495 -1088 -194 811 -23
1318b3l28q83j82J463J71o5Q3j955Q50J160K84M28j283j071J597K55M43L86j722
$$ -23 -351 -1234 -1416 47 218 153 236 -1719 -869 291 575 1003 -280 -1351 246 501 944 1330 -392
1337c92j19N87K09J628r83j176o7mJ198J70j203j94o64j06J818l21n69j64j235
$$ -392 -511 76 285 1913 930 -246 -313 -317 881 1051 -152 -346 -1010 -1116 702 381 -188 -352 -1587
1356a587Q58J618n88j82p36p51J487L59L93j3j733L36N31O08J094q48j508N55
$$ -1587 -729 889 301 119 -617 -1368 119 478 871 858 -875 -539 -8 600 1694 846 -662 -107
1374a07J22Q51L80j454j58l89K67J452q05o62K73j295J109Q61l26j77o04l59J244
$$ -107 15 866 1246 -208 -366 -755 -488 964 159 -503 -230 -1525 -416 445 119 -58 -662 -1021 223
1393B23q3L18R2j192M98M34mJ006j057r59Q78K06L29K52q31k53j27q6J294r78
$$ 223 140 458 550 -642 -144 290 286 1292 235 -724 154 360 689 941 110 -143 -270 -356 938 -40
1413d0l42L04j120P43M20k46l42m36J58R42l82N6N16r80O84K59L7N47n74m68N69
$$ -40 -382 -78 -1198 -455 -35 -281 -623 -1059 -901 41 -341 -285 231 -749 -65 194 231 778 204 -264 305
1434C05j90O29l9p36L42j94q1P03q32k48N72j193O82L70l42Q5j76l09M41m78O83
$$ 305 115 744 705 -31 311 117 36 739 -93 -341 231 -962 -280 90 -252 -167 -343 -652 -211 -689 -6
1455fj4n89M81j50L13M45l68j61O09m60L10J99n8J75n54k58R60n88m9J4j035M83
$$ -6 -20 -609 -128 -278 35 480 112 -49 560 100 410 609 551 726 172 -86 874 286 237 251 -784 -301
1477c01N67m39J19n16n9J96j9L80M4o80N44J28P3M90q67p0P27k15M17J84n30J12
$$ -301 266 -173 -54 -570 -629 -433 -452 -72 -28 -708 -164 -36 37 527 -340 -410 317 102 519 703 173 285
1499B85m46J92J090o90q3j27p16Q23K82j092O26o34L01K45n70L48l20n67O07L24
$$ 285 -161 31 1121 431 348 221 -495 328 610 -482 144 -490 -189 56 -514 -166 -486 -1053 -446 -122
1519a22%M65j152K39Q60k06O63l95m14n3m3P43Q85j237m87J15j26J158J51j298
$$ -122 -122 343 -809 -570 290 84 747 352 -62 -115 -158 585 1470 233 -254 -139 -265 893 1044 -254
1539b54J05j89J94P69m38m64o20m60J247L12l07J17j160K98J041l4L15l64r32
$$ -254 -149 -338 -144 625 187 -277 -897 -1357 -110 202 -105 12 -1148 -850 191 157 472 108 -824
1558h24O47L57Q19R4j031m89K58L76R70l98j139M6J32L40O62n15m58p52j26J373
$$ -824 -177 180 999 1093 62 -427 -169 207 1177 779 -360 -314 -182 158 820 305 -153 -905 -1031 342
1578C42J8j83l52j132O84J116o63M32n45p08O48R19L93k3j308J45K14L21J114
$$ 342 360 177 -175 -1307 -623 493 -170 262 -283 -991 -343 576 969 946 -362 -217 -3 318 1432
1597A432r84o75L62m80O85O22p56n05k47k24J314k38m74j13p08M66P01l98j25
$$ 1432 448 -227 135 -345 340 962 206 -299 -546 -770 544 306 -168 -281 -989 -523 178 -220 -345
1616c45p3l18O04j21O90P5j106K74N23P2O15o69m49Q60n94P54R3r45K7j28j05
$$ -345 -418 -736 -132 -253 437 512 -594 -320 203 275 890 221 -228 632 38 792 885 -60 -33 -161 -266
1637b66P19k89m04P0q56R23K38n01L45l55l07O27J33j45J35o65O97K68m35N16
$$ -266 453 164 -240 -170 -1026 -103 135 -366 -21 -376 -683 -56 77 -68 67 -598 99 367 -68 448
1657D48l34j67N63j96k01M91o54L12k72J10K99m05l7no27M19K48p87O77l3j62
$$ 448 114 -53 510 314 113 604 -50 262 -10 100 399 -6 -43 -48 -675 -256 -8 -795 -118 -151 -313
1678c13J75k28J08J69j84K01k20j43O93r4k78R60q13K9P9O8J30k41j17M92l74
$$ -313 -138 -366 -258 -89 -273 -72 -292 -435 258 164 -114 846 33 62 141 209 339 98 -19 473 99
1699I9J8N40r82J73J11l57O19n00k34J89l1J92L50o85K79j14P2O10m12J0J82n94
$$ 99 117 657 -325 -152 -41 -398 221 -279 -513 -324 -355 -163 187 -498 -219 -333 -261 349 -63 -53 129 -465
1721d65M69P36m11K8o35j0R05m95J78K87r74M48l9k25P01n95n02K92J20MM72p74
$$ -465 4 740 329 357 -278 -288 617 122 300 587 -387 61 22 -203 498 -97 -599 -307 -187 -183 289 -485
1743d85k9J67J92O56n12o3J48n65P08N20o66K10n40J07J025n50j69J74q21Q37
$$ -485 -514 -347 -155 501 -11 -74 74 -491 217 737 71 281 -259 -152 873 323 154 328 -493 344
1763C44J96m14K41o00n61Q55o2K56l65o92Q08j80N0L59m79m13M72j91O27K4n07
$$ 344 540 126 367 -233 -794 61 -1 255 -110 -802 6 -174 -124 235 -244 -657 -185 -376 251 275 -232
1784b32j4q6M34O57m43k83K29n89O01N72o43K92q58L5P76n13M32o03l02N05l6
$$ -232 -246 -332 102 759 316 33 262 -327 274 846 203 495 -363 -328 448 -65 367 -236 -538 -33 -69
1805f9q8N13q34j60M59j65O69j16m83K58l3J62L46m57J04l4j59R54m01n43O81
$$ -69 -157 356 -478 -638 -179 -344 325 209 -274 -16 -49 113 459 2 106 72 -87 867 466 -77 604
1826F04m70j33M66m20k19L06p08P66k85k30L88o61K43K88j35L78m64p1K42K3K5
$$ 604 134 1 467 47 -172 134 -574 192 -93 -323 65 -596 -353 -65 -200 178 -286 -357 -115 -92 -67
1847f7L98k56L7M9k82N19j80k8r8N4n4L76l59O9k47k1O19q65J88K25o25M53J12
$$ -67 331 75 112 161 -121 398 218 190 92 146 92 468 109 178 -69 -90 529 -336 -148 77 -548 -95 17
1870A7n99N58%m98P25l18k63L19L0J99J31o07O16k93J31N30m10n1J24k22L72l21
$$ 17 -582 -24 -24 -522 203 -115 -378 -59 -29 170 301 -306 310 17 148 678 268 217 341 119 491 170
1892A70k44M06n56J07L72m31Q5R3p11N07J62k84K59l92j75O78o8L14l91r6L46
$$ 170 -74 332 -224 -117 255 -176 -91 2 -709 -202 -40 -324 -65 -457 -632 46 -22 292 -99 -195 151
1913A51l28N08N27q98j51M73k27O93l45o35K52J24n1K68m00k04J25l77M85J92
$$ 151 -177 331 858 -40 -191 282 55 748 403 -232 20 144 93 361 -39 -243 -118 -495 -10 182
1933A82p50M56j66J6L39l28J98j35l24J025n49l5j44J16L52O3k33J47m11K11K92
$$ 182 -568 -112 -278 -262 77 -251 -53 -188 -512 513 -36 -71 -215 -99 253 316 83 230 -181 30 322
1954C22N1j34J14n83K99R0j46N17o32n61O78l71M68kl10j94N7k39Q98p3n05K8
$$ 322 373 239 353 -230 69 159 13 530 -102 -663 15 -356 112 110 -200 -394 -337 -576 322 249 -256 -228
1976b28k10Q29p3q8pn09K74N78j37j6k21p12M83L21jK37n42n59L24M58M39n69
$$ -228 -438 391 318 230 223 -286 -12 566 429 413 192 -520 -37 284 283 520 -22 -581 -257 201 640 71
1998G1p89J83K03M84K50m66k96r5N4P10K2n15J12r1J40P34j64m13O4o02O76J12
$$ 71 -718 -535 -332 152 402 -64 -360 -455 -401 309 331 -184 -72 -163 -23 711 547 134 198 -404 272 384
2020C84k65K07l87p1M08l43L93k74q17O70p2k0M02n02j63L70j96M38j9n98N71
$$ 384 119 326 -61 -132 276 -67 326 52 -765 -95 -167 -187 215 -287 -450 -80 -276 162 143 -455 116
2041A16j97rJ95j3j56J08j17M81J33p54M28m60M35J24l58K38j47o20Q35m02J31
$$ 116 -81 -90 105 92 -64 44 -73 408 541 -213 215 -245 190 314 -44 194 47 -573 262 -140 -9
2062im2l26n3O40m99L12j07m61O15k0o2%j96K51L48k75L89l50k47M58r0K4J22
$$ -9 -51 -377 -430 210 -289 23 -84 -545 70 50 -12 -12 -208 43 391 116 505 155 -92 366 276 300 422
2085D22n42q8J89L0J42j64l37J43k35L91K77l56j35L8l82R31j99o7J49r78O13
$$ 422 -120 -208 -19 11 153 -11 -348 -205 -440 -49 228 -128 -263 -225 -607 324 125 58 207 -771 -158
2106a58K27J82J31l01l1J78j18k3M26o32K68j2m41M71k06l62L03l26L36L55n38
$$ -158 69 251 382 81 50 228 110 87 513 -119 149 137 -304 167 -39 -401 -98 -424 -88 267 -271
2127b71M2j48q3N45j41k4l57k65O30K35j97J06j26K7M81k84K68k76k81M14l23
$$ -271 -229 -377 -460 85 -56 -80 -437 -702 -72 163 -34 72 -54 -27 454 170 438 162 -119 295 -28
2148b8K33j9q5k16M82l61K16l14k17J72K7l72P91p35N9M22O9J22m83J03J84j72
$$ -28 205 186 101 -115 367 6 222 -92 -309 -137 -110 -482 309 -426 -367 55 124 246 -237 -134 50 -122
2170a22P7J59j02P8J67k61M88k03j54J65k08J61k4k08J56j54n5K29j55l95L17
$$ -122 -45 114 12 90 257 -4 484 281 127 292 84 245 221 13 169 15 -40 189 34 -361 -44
2191d4Kk32L21k38J66k45l43L53J50O7J19k29N9M12l25J76n0k33N67j22J03K1
$$ -44 -42 -274 47 -191 -25 -270 -613 -260 -110 -43 76 -153 -94 318 -7 169 119 -114 453 331 434 455
2213D55m42R3p3Oo3k66N7K74j18jP6m79K17K85k87O4n0j4K79m21O30j69j60L33
$$ 455 13 106 33 39 -24 -290 -233 41 -77 -78 -2 -481 -264 21 -266 -202 -252 -266 13 -408 222 53 -107 226
2237B26k60j0L32j76J74K26n31M90l22k34J2J92r4M70p18L82j96n33L74L90k94
$$ 226 -34 -44 288 112 286 512 -19 471 149 -85 -73 119 25 495 -223 159 -37 -570 -196 194 -100
2258a00j0k50j55L98j32K09K12m50N08k54K5M86n49J51M7n0K79J7l49O1P2m5j9
$$ -100 -110 -360 -515 -117 -249 -40 172 -278 230 -24 1 487 -62 89 136 86 365 382 33 94 166 121 102
2281A02Mj2k01m03R35j73k89k87j51J9M71M5J20l21n11M55l8K64M17n15k31K79
$$ 102 106 94 -107 -510 425 252 -37 -324 -475 -456 15 60 180 -141 -652 -197 -235 29 446 -69 -300 -21
2303b1l1K74O6j90o7K7M20j85l48n1m3l0M36l21k55J97pJ44J75k40j54p6j66M14
$$ -21 -52 222 288 98 31 58 478 293 -55 -106 -149 -179 257 -64 -319 -122 -129 15 190 -50 -204 -280 -446 -32
2327c2P8r7M5k31Q2R3J07L08k66J17R3l27L27Pl28m8J81j18J35J26m05K16k11
$$ -32 46 -51 -6 -237 -155 -62 45 353 87 204 297 -30 297 304 -24 -72 109 -9 126 252 -153 63 -148
2350a48J41L3qk9j01l65L32m3J48J00l72M28j41K28J02l57j75M65j74J99J02m22
$$ -148 -7 26 18 -11 -112 -477 -145 -188 -40 60 -312 116 -25 203 305 -52 -227 238 64 263 365 -57
2372e7K52n3n0L42k78K13o6l04j35K22o2L1p4k15K49k92K01q0o1R3J19j45K55
$$ -57 195 142 92 434 156 369 303 -1 -136 86 24 55 -19 -234 15 -277 -76 -156 -217 -124 -5 -150 105
2395A05nj08L25p29N54L14m26L00k75R9J24k62J23K17j77l75J52lL30k28l13K17
$$ 105 100 -8 317 -412 142 456 30 330 55 154 278 16 139 356 179 -196 -44 -47 283 55 -258 -41
2417d1j10K68m0l07j08L37j59L44Pl61J64n3k08O36j40j95N2k22L96K6P4k0l29
$$ -41 -151 117 77 -230 -338 -1 -160 184 191 -170 -6 -59 -267 369 229 34 86 -136 260 286 360 340 11
2440A1J76J19k54P3Ml33J72m1K22k11l10J96M7o0J95j12j97Q3Q5J54K97j10m4
$$ 11 187 306 52 125 129 -204 -32 -73 149 -62 -372 -176 -129 -189 6 -106 -303 -220 -135 19 316 206 162
2463A62l80K33J77r1J04K6k57K36J57r5ol20r0M73k49j40L32o89R6K18k18K60
$$ 162 -218 15 192 101 205 231 -26 210 367 272 266 -54 -144 329 80 -60 272 -417 -321 -103 -321 -61
2485f1j02k65N66k98K57J95m16N3l5J16J37Pl81L51q2R6J74l70K1K37j96J79q9
$$ -61 -163 -428 138 -160 97 292 -124 -71 -106 10 147 154 -227 124 42 138 312 -58 -37 200 4 183 94
2508I4r4J7k75K39M12n82J71k87Q4R3M2MJ50k82rj31K99K51j13q4O8O5l1K15l84
$$ 94 0 17 -258 -19 393 -189 -18 -305 -221 -128 -86 -82 68 -214 -223 -354 -55 196 83 -1 67 132 101 316 -68
2533f8J38J07K3JJ7q6Rl31K04l1m8J62l55m8K93n7k01M17n63K01k28J90M92l67
$$ -68 70 177 200 201 218 132 141 -190 14 -17 -65 97 -258 -306 -13 -70 -271 146 -417 -216 -444 -254 238 -129
2557a29k28K20Q7L26q1k24K3Q2J29J39m2n0l11k59M13J24l22K26k00k82N20l51
$$ -129 -357 -137 -50 276 195 -29 -6 76 205 344 302 252 -59 -318 95 219 -103 123 -77 -359 161 -190
2579a90L46m3l18p1J56l8J34k13L12j22j06J03L80k03k11J28j64K38JQ1m3k52
$$ -190 156 113 -205 -276 -120 -158 -24 -237 75 -47 -153 -50 330 127 -84 44 -120 118 119 200 157 -95
2601i5K29J4n23M75r5n6L69l44J39L9l56n4Q3J79l3j84J12N3k79K49nL7J6K4k78
$$ -95 134 148 -375 100 5 -51 318 -26 113 152 -204 -258 -175 4 -29 -213 -101 -48 -327 -78 -83 -46 -30 -6 -284
2626b84M32k4j9k2j92L14j14O5J24m54P5J16K6J36k92J06k65N5K69L8l10O1l03
$$ -284 148 124 105 83 -109 205 91 156 280 -174 -99 17 43 179 -113 -7 -272 -217 52 90 -220 -159 -462
2649d62Q5M78o2Pq5j65L3K03N3N4j52l6J08J16J51j41l46J19L8r2K16j86r4J65
$$ -462 -377 101 39 46 -39 -204 -171 32 85 139 -13 -49 59 175 326 185 -161 -42 -4 -96 120 -66 -160 5
2673Ej30K35O1m11K46k05j44L43r1j55K61k48J80K69L3j93q5j88M60j08J43N7
$$ 5 -125 110 171 -240 6 -199 -343 0 -91 -246 15 -233 -53 216 249 56 -29 -217 243 135 278 335
2695C35p31O29l8n2j49J24k46rK22k0k0j60J2k22L12k7Q1l77L11k32N4J35J20
$$ 335 -396 233 195 143 -6 118 -128 -137 85 65 45 -115 -103 -325 -13 -40 41 -336 -25 -257 -203 -68 52
2718E2k81M6J40K22L36m82q7L4j92L64O8j19k31j39M30J4K0m1j13j46Q9L9K45
$$ 52 -229 -183 -43 179 515 33 -54 -20 -212 152 220 101 -130 -269 161 175 195 154 41 -105 -16 23 268
2741B68n67K34k68K58L8KL7k88L78j91M71j21j01j66j95J36R2n4O7P5j79N18k98
$$ 268 -299 -65 -333 -75 -37 -35 2 -286 92 -99 372 251 150 -16 -211 -75 17 -37 30 105 -74 444 146
2764A46j59L25m50%J72j99J73l6l10J32k22L91J90j88j68N7r9L47p4R1k39PJ52
$$ 146 -13 312 -138 -138 34 -165 8 -28 -338 -206 -428 -37 153 -35 -203 -146 -245 102 28 119 -120 -113 39
2787C9N2K2J37l69m3M06k98J65K0n60L74J47r2Q6j81j98L52k07J13J11j41L9k77
$$ 39 91 113 250 -119 -162 244 -54 111 131 -429 -55 92 0 86 -95 -293 59 -148 -35 76 -65 -26 -303
2810c03L8L33j19j40J96k77J06J67J39j08m8r8L65J91o4m30j06K91o5j04J2j01
$$ -303 -265 68 -51 -191 5 -272 -166 1 140 32 -16 -114 251 442 378 -52 -158 133 68 -36 -24 -125
2832a25q0R7J6J09q5Q1k92J02Q9j48K40l87K10K7J68J4J0J30k89J30P8O0J08j96
$$ -125 -205 -108 -92 17 -68 13 -279 -177 -88 -236 4 -383 -173 -146 22 36 46 176 -113 17 95 155 263 67
2856F7m1k7NJ58J09m25J48k67K86m1J84m37J51l0J21o9j55J88j09j1l19O91m01
$$ 67 26 -1 4 162 271 -154 -6 -273 13 -28 156 -281 -130 -160 -39 -108 -263 -75 -184 -195 -514 177 -224
2879b24L94j99l4K62q0l9j71j12J44K49k39P2o0j38J68J33J33N2l26MR1m95N54
$$ -224 170 -29 -63 199 119 80 -91 -203 -59 190 -49 23 -37 -175 -7 126 259 311 -15 -11 80 -415 139
2902A39o9k39j20P1K16j66J15jl72K28J32r5K32%J1q9J26K11k53j22K38q8j31
$$ 139 70 -169 -289 -218 -2 -168 -53 -54 -426 -198 -66 -161 71 71 82 -7 119 330 77 -45 193 105 -26
2925b6J26j8k47J72l8o1K22l2m62R4L1J43L19k98J77j88k41L10J14j47q0j71K29
$$ -26 100 82 -165 7 -31 -92 130 98 -364 -270 -239 -96 223 -75 102 -86 -327 -17 97 -50 -130 -301 -72
2948g2J42Q2O0m23K53L73m39M11l73K5K2M1j85K98m22N9L0K1K74Qk60N1k71J35
$$ -72 70 152 212 -211 42 415 -24 387 14 39 61 102 -83 215 -207 -148 -118 -97 177 185 -75 -24 -295 -160
2972a60J62j31Q8j9n5L4K8K26j86k63K88q0K11N3rn0L0m20K00K13l08K54l06k7
$$ -160 2 -129 -41 -60 -115 -81 -53 173 -13 -276 12 -68 143 196 187 137 167 -253 -53 160 -148 106 -200 -227
2996b27L29j11k25L02k42O5L1k11L55j8k35K07J18k5J09k52J3J04p0N5p1J57M7
$$ -227 102 -9 -234 68 -174 -109 -78 -289 66 48 -187 20 138 113 222 -30 -17 87 17 72 1 158 205
3019B05j35K88l69K24j80p1K06P7l50K6N5k62J16J87K4j58K11k1L1k29P9k2j04
$$ 205 70 358 -11 213 33 -38 168 245 -105 -79 -24 -286 -170 17 41 -117 94 73 104 -125 -46 -68 -172
3042a72L00j93J25K02J7m68L23j09J72nk31J28j42J13q4K29l18N37o05p8L99l75
$$ -172 128 -65 60 262 279 -189 134 25 197 192 -39 89 -53 60 -24 205 -113 424 -181 -259 140 -235
3064b35k8J37Q8jk47K67j38J96k98L28L6k97J54m5J24j9oJ60p0J20k15k20N16
$$ -235 -263 -126 -38 -39 -286 -19 -157 39 -259 69 105 -192 -38 -83 41 22 16 176 106 226 11 -209 307
3087C07m67p5L22k36J95K38l50L18n10j27L53l32L41j44r9q3L47K0R1j96O7j46
$$ 307 -160 -235 87 -149 46 284 -66 252 -258 -385 -32 -364 -23 -167 -266 -349 -2 18 109 -87 -20 -166
3109a66j5RK91L2o0n0k5K84j34L1j41k19K19J70k16j04j94K65J28r6O2k16j11
$$ -166 -181 -172 119 151 91 41 16 300 166 197 56 -163 56 226 10 -94 -288 -23 105 9 71 -145 -256
3132b56L75J47j10j09o8q3O5j7J15K5r6n8QK21L45m01J3j88r6N26k97O9m38L36
$$ -256 119 266 156 47 -21 -104 -39 -56 59 84 -12 -70 -62 159 504 103 116 -72 -168 358 61 130 -308 28
3156B8l77L86j8rjp2J93O5n82O15m68K72J15j59N8Nl7J74k29M0LJ25j95L9J13
$$ 28 -349 37 19 10 9 -63 130 195 -387 228 -240 32 147 -12 46 51 14 188 -41 -1 2 127 -68 -29 84
3181H4l1J38j26j52j04K09K11k98M9j62k07N34k69j45K15k91J25K35l2K22m06
$$ 84 53 191 65 -87 -191 18 229 -69 -20 -182 -389 145 -124 -269 -54 -345 -220 15 -17 205 -201
3202b01m4J59K49m0L3j77o5J30q9L46j25k54J45j50J36m4M8oj65m1M60l69j76
$$ -201 -245 -86 163 123 156 -21 -86 44 -45 301 176 -78 67 -83 53 9 57 51 -114 -155 305 -64 -240
3225b40J40k38L82j2N5l7m04J35J61O1K68l92m8J0J14M2K81K7j86J66k07j57K08
$$ -240 -100 -338 44 32 87 50 -354 -219 -58 3 271 -121 -169 -159 -45 -3 278 305 119 285 78 -79 129
3248A29r3J10o3k02J40N6m2K1k92r1J85Q0m7M5j72P2Qj5J40J7L45l90Q4L90m03
$$ 129 36 146 83 -119 21 77 35 56 -236 -327 -142 -62 -109 -64 -236 -164 -156 -171 -31 -14 331 -59 25 415 12
3273A2p0m2K22j27P8Q9l13J20q1L21r7J1j65r9P2J06N4l38L51o8j97M45l96K48
$$ 12 -58 -100 122 -5 73 162 -151 -31 -112 209 112 123 -42 -141 -69 37 91 -247 104 36 -161 284 -112 136
3297A36k21P0K38l70J88j17k6J44p8O5m0J16j9l27L49J03N0k03J18l70J08K15
$$ 136 -85 -15 223 -147 41 -76 -102 42 -36 29 -11 105 86 -241 108 211 261 58 176 -194 -86 129
3319A29o1p0r5J06k98K55p6R4j76J72l7m5L82q5n05M07j07J58k86M1M2JM0O2J2
$$ 129 68 -2 -97 9 -289 -34 -110 -16 -192 -20 -57 -102 280 195 -310 97 -10 148 -138 -97 -55 -54 -14 48 60
3344F0j18J5j18K12J19j82j11m3K16L5j05nj33j98K49K08j11Q5L3p7j87J54R7
$$ 60 -58 -43 -161 51 170 -12 -123 -166 50 85 -20 -25 -158 -356 -107 101 -10 75 108 31 -156 -2 95
3367I5J24J1l22J64j10N28m21m3j95M5M2K37j87L6j04j99L42o0R2m70L48Jm9M0
$$ 95 219 230 -92 72 -38 490 69 26 -169 -124 -82 155 -32 4 -100 -299 43 -17 75 -395 -47 -46 -95 -55
3391e5K8J33j11j94Q2K67o6j33q5K66j35K16n86M05J6k38J56J63j76K61j86k7
$$ -55 -27 106 -5 -199 -117 150 84 -49 -134 132 -3 213 -373 32 48 -190 -34 129 -47 214 28 1
3413AK50n49L75m3o1k7l5J51j31kj94P3N6m8N7j0P0lK16L8j44K4L9J04J24k42
$$ 1 251 -298 77 34 -27 -54 -89 62 -69 -71 -265 -192 -136 -184 -127 -137 -67 -70 146 184 40 64 103 207 331 89
3439H9j91o8NK99j87L11k44o7l9L6M6j67K90k26M9K70m7j11q9M0J5j42K15k46
$$ 89 -102 -170 -165 134 -53 258 14 -53 -92 -56 -10 -177 113 -113 -64 206 159 48 -41 -1 14 -128 87 -159
3463a59L17j77m5l2M03k85K07l35K7J95m0j46K8L0J05o2j66N0J15j52j37j4J81
$$ -159 158 -19 -64 -96 307 22 229 -106 -79 116 76 -70 -42 -12 93 31 -135 -85 30 -122 -259 -273 -92
3486i2J7J78n13J73K05j08K06k12J21j38J87K01J20l37P4j9N5k6N0J56j81j49
$$ -92 -75 103 -410 -237 -32 -140 66 -146 -25 -163 24 225 345 8 82 63 118 92 142 298 117 -32
3508c2O2K0M4l46M68l09J20kM8lj22j85L7J73J0P4j12M1QJ59R9m2j54j98L03k03
$$ -32 30 50 94 -252 216 -93 27 25 73 70 -52 -237 -200 -27 -17 57 -55 -14 -6 153 252 210 56 -142 161 -42
3534d2M7K96k29k6K38l0r5j13j60p7J84J01M8j6k49j17J74k3J19N1j48p0L19j43
$$ -42 5 301 72 46 284 254 159 46 -114 -191 -7 94 142 126 -123 -240 -66 -89 30 81 -67 -137 182 39
3558C9Pm1m7j21n9K93m3K72k33j66J11R6j30J27J0l41L12k76L47m14N3J40j99
$$ 39 46 5 -42 -163 -222 71 28 300 67 -99 12 108 -22 105 115 -226 86 -190 157 -257 -204 -64 -263
3581b63K01j14L38k26K6j33J89K1p1K9m8J54rRR2j54k60K54J55j37P0j29O4j24
$$ -263 -62 -176 162 -64 -38 -171 18 39 -32 -3 -51 103 94 103 195 41 -219 35 190 53 123 -6 58 -66
3605f6K37q8P8l90L22j77J78q1Q0j56Q0K02j52l02L98l11J16J05l9J31j65K2j62
$$ -66 171 83 161 -229 93 -84 94 13 93 -63 17 219 67 -235 163 -148 -32 73 34 165 0 22 -140
3628a40K29K04l79Q8j36K51k96M47k32o1mJ10j4j55J93k23NK05r4Q9j85j8P3L7
$$ -140 89 293 -86 2 -134 117 -179 268 36 -25 -29 81 67 -88 105 -118 -113 92 -2 87 -98 -116 -43 -6
3652fR0j57k3m5L79l14L3L53j60J58k87J45k9k15J51Q5j34k4J04k20J59l92L90
$$ -6 84 -73 -96 -141 238 -76 -43 310 150 308 21 166 137 -78 73 158 24 0 104 -116 43 -349 41
3675D1M8n8Q9k01J28j3J09m10J36K65k88J76P2m6j04j92K20J27k24L33k27J91
$$ 41 89 31 120 -81 47 34 143 -267 -131 134 -154 22 94 48 -56 -248 -28 99 -125 208 -19 172
3697A72j19NJ39l1P0m03K60j68M0k06M31k24J0J23k96J7K77q3r2J08r3J10k46
$$ 172 53 58 197 166 236 -167 93 -75 -35 -241 190 -34 -24 99 -197 -180 97 14 -78 30 -63 47 -199
3720a99J89R9N6L7l41O5K43J9j25l1K27j3k39N5p5M1j03LK22j63L9l9N7j60oP5
$$ -199 -10 89 145 182 -159 -94 149 168 43 12 239 226 -13 42 -33 8 -95 -92 130 -33 6 -33 24 -136 -142 -67
3746f7j79l2K60J29k05K8Q9k0l2j16K41lKj99K65j49P6p3M9J71j57P5j08o0J04
$$ -67 -246 -278 -18 111 -94 -66 23 3 -29 -145 96 93 95 -104 161 12 88 15 64 235 78 153 45 -15 89
3771H9j24k0m1q7K90j60L73k31o1l4J67l38K58m5l28L45J13j80K3j12r9Q9J15
$$ 89 -35 -55 -96 -183 107 -53 320 89 28 -6 161 -177 81 36 -292 53 166 -14 9 -103 -202 -113 2
3794BJm0J88k78L61l02k62J81J96P4k60K38p9O3m7K8J04K6k70r1K67k11kJ59q7
$$ 2 3 -37 151 -127 234 -68 -330 -149 47 121 -139 99 20 83 36 64 168 194 -76 -167 100 -111 -113 46 -41
3819d1J18j56J23j84J69o1o5K03K2j68R6R1p9m5j0J30m3l9j05J86p8J1j79L0n9
$$ -41 77 -79 44 -140 29 -32 -97 106 128 -40 56 147 68 23 13 143 100 61 -44 142 64 75 -104 -74 -133
3844a33J93j45M6q6K85j5r9j76L13k39K45Ll62J05L25j52k36K92J6j47j7qQ4o4
$$ -133 60 -85 -39 -125 160 145 46 -130 183 -56 189 192 -170 -65 260 108 -128 164 180 33 16 8 92 28
3868B8K00m08J14R0j25r8LK53Q2j39PQJ96k85J44k26M02k57K13j63J35L3n1j55
$$ 28 228 -180 -66 24 -101 -199 -196 57 139 0 7 15 211 -74 70 -156 246 -11 202 39 174 207 156 1
3892AJ91q4k86P0n6M9J10l38M79j28J90J4l12j36K21j3p6L51k10K90l48N8kO1
$$ 1 192 108 -178 -108 -164 -115 -5 -343 136 8 198 212 -100 -236 -15 -28 -104 247 37 327 -21 37 35 96
3916I6j01L24l37K02r1j86J83k13j8J40J96l59k35L65K83n52%M70l70J69N0k06
$$ 96 -5 319 -18 184 93 -93 90 -123 -141 -1 195 -164 -399 -34 249 -303 -303 167 -203 -34 16 -190
3938a90K50j5R4j44l4M8O7j99J14L46k30q7k01L1p3J58Q5rN9j07M0l07L24j15
$$ -190 60 45 139 -5 -39 9 76 -123 -9 337 107 20 -181 -150 -223 -65 20 11 70 -37 3 -304 20 -95
3962i5p1Q4j18L18M1j81J10k15J52jk12J90L0J17l21K30j68J22j00N7n8j5q4L01
$$ -95 -166 -82 -200 118 159 -22 88 -127 25 24 -188 2 32 149 -172 58 -110 12 -88 -31 -89 -104 -188 113
3986A13l64L95n3N4j75j46L77Mk55j2K85j33J20p9j31q0M4J89j4j30Q9j98K62
$$ 113 -251 144 91 145 -30 -176 201 205 -50 -62 223 90 210 131 0 -80 -36 153 139 9 98 -100 162
4009A62k45m3K2K15k38R4J37j51J87J59l22J64k77L16j37K02j90q1j75J50J98
$$ 162 -83 -126 -104 111 -127 -33 104 -47 140 299 -23 141 -136 180 43 245 55 -26 -201 -51 147
4030A47k62M8j26K49R8j03n0J43j47J77j84o2o1J92n7N9QO5l6k20J75j78J00L06
$$ 147 -115 -67 -193 56 154 51 1 144 -3 174 -10 -72 -133 59 2 61 69 134 98 -122 53 -125 -25 281
4054B81k67j8R4j21l1j04O2K80l54K72k45K12p2k8J88k21j2J84N6l17L34Jk46
$$ 281 14 -4 90 -31 -62 -166 -104 176 -178 94 -151 61 -11 -39 149 -72 -84 100 156 -161 173 174 -72
4077g2J32j04l2Q5j13L60j23k01J5K35k68nJ91j01m2N2N1J39j74k5j66J73k90
$$ -72 60 -44 -76 9 -104 256 133 -68 -53 182 -86 -91 100 -1 -43 9 60 199 25 0 -166 7 -283
4100b83L20j90J64K33m18L1J08P5QJ0p0P0j29L65j29k21j85K64L8j82L60k40k2
$$ -283 37 -153 11 244 -174 -143 -35 40 48 58 -12 58 -71 294 165 -56 -241 23 61 -121 239 -1 -23
4123b3K02j21J61R1o16K49p7K73j2j78k8r6K95k95O0J77o9LJ40j07P0l21J70K3
$$ -23 179 58 219 310 -306 -57 -134 139 127 -51 -79 -175 120 -175 -115 62 -7 -4 136 29 99 -222 -52 -29
4147b9k87J32J99j78J37R4j6N8j86J53K02m80N01m31J22K48k29Q1j88k5K12q0
$$ -29 -316 -184 15 -163 -26 68 52 110 -76 77 279 -201 300 -131 -9 239 10 91 -97 -122 90 10
4169A0j07M5R0K85j76J68k81K5j41N2J22M2n1j26p5N69p54L45J64k28M0j5oK2
$$ 10 -97 -52 38 323 147 315 34 59 -82 -30 92 134 83 -43 -118 451 -303 42 206 -22 18 3 -3 19
4193A9j7L1Kj64P2O7j4j88K64j05K86k81J58j76n7l0K00N3k20K15j2l6j93K0K0
$$ 19 2 33 35 -129 -57 10 -4 -192 72 -33 253 -28 130 -46 -103 -133 67 120 -100 115 103 67 -126 -106 -86
4218h6N6k17K71K1k5o6J8j24L7L20l13j36K10j04J39j05o7J39j4L6Q8l51J97J67
$$ -86 -30 -247 24 45 20 -46 -28 -152 -115 205 -108 -244 -34 -138 1 -104 -171 -32 -46 -10 78 -273 -76 91
4242I1k47J85K16k76K48j33n6R5j40O4L6j8o3o1P9K07l43O2j44J19J34n7oK11
$$ 91 -156 29 245 -31 217 84 28 123 -17 47 83 65 2 -59 20 227 -116 -54 -198 -79 55 -2 -8 203
4266B03L3k29J2%o9L8lP3j13J45j71L9J85j23r4n6O3j54L00k40J07P4j09J7j85
$$ 203 236 7 19 19 -50 -12 -15 58 -55 90 -81 -42 143 20 -74 -130 -67 -221 79 -161 -54 20 -89 -72 -257
4291b57K88L7j12p5J96k24K15l39K78kk02M6J78o5r7R1J67q0l1j66J92l20K53
$$ -257 31 68 -44 -119 77 -147 68 -271 7 5 -197 -151 27 -38 -135 -44 123 43 12 -154 38 -282 -29
4314b9J65k6m33L14M0k01L3J48J33j5l23jL23q0P8j80P8k2L0j80j20R6M8J26k8
$$ -29 136 110 -323 -9 31 -170 -137 11 144 129 -194 -195 128 48 126 -54 24 2 32 -148 -268 -172 -124 2 -26
4339b6M4J03j41J56l80K79j37L06k91l3J05j64K55o7l3J87L5k37J91l08P4J15
$$ -26 18 121 -20 136 -244 35 -102 204 -87 -120 -15 -179 76 9 -24 163 198 -39 152 -156 -82 33
4361C3k5J45j1k59K54k69L09k95L69k35k7J71r4j38J62m2l5M2J8j1l03K08j27
$$ 33 8 153 142 -117 137 -132 177 -118 251 16 -11 160 66 -72 90 48 13 55 73 62 -241 -33 -160
4384a60K58k18J29j27O1n2J11O9J40r5N6j72m2j38L84r1r0J45k09J65l74L5K5
$$ -160 98 -120 9 -118 -57 -109 2 71 211 116 172 0 -42 -180 204 113 23 168 -41 124 -250 -215 -190
4407a90J27j11j5J52J69k7j04j81K68j30mR6j79L53l63n9n5L2k9J51J75ol2r0
$$ -190 -63 -174 -189 -37 132 105 1 -180 88 -42 -46 50 -129 224 -139 -198 -253 -221 -250 -99 76 70 38 -52
4431e2Q9j80k8K20O6O5m6k81K63r4j06J38L1oK2j44r2L12j90l6m3L4j4Q4m1P4
$$ -52 37 -143 -171 49 115 180 134 -147 116 22 -84 54 85 79 101 -43 -135 177 -13 -49 -92 -58 -72 12 -29 45
4457D5K9j02j49m0n7M37j02k67J30K56k79O1n0K98l07J21l7o9J6k88L28j32M4
$$ 45 74 -28 -177 -217 -274 163 61 -206 -76 180 -99 -38 -88 210 -97 24 -13 -82 -66 -354 -26 -158 -114
4480a14n6K71j35K0l2k44J51K25j68K13j88n3J77j80N7M1JM1k02J36j58N8L16
$$ -114 -170 101 -34 -14 -46 -290 -139 86 -82 131 -57 -110 67 -113 -56 -15 -14 27 -175 -39 -197 -139 177
4503A77j47j97J5K32O4j47l8j31K4K68o2q4Q7j53q5J61j59N16j37j40m9j01J05
$$ 177 30 -167 -152 80 144 -3 -41 -172 -148 120 58 -26 61 -92 -177 -16 -175 341 204 64 15 -86 19
4526A9R2j66J95j59L4j36K19J33l43L19j42l1K52k89k72L54qJ55k43J50k34J24
$$ 19 111 -55 140 -19 15 -121 98 231 -112 207 65 34 286 -3 -275 79 71 226 -17 133 -101 23
4548B3P5k42J1J8J25l30L47o0N8k03L27l16J00P4r3K14j16j29J27k21M1Q8Q6R2
$$ 23 98 -144 -133 -115 10 -320 27 -33 25 -178 149 -167 -67 7 -86 128 12 -117 10 -211 -170 -82 4 96
4572I6k78K18Q0L5l97J79J43j31J51k22J24J3l07K09J35j75o2K67k7J84j81k4
$$ 96 -182 36 116 151 -246 -67 76 -55 96 -126 -2 11 -296 -87 48 -127 -189 78 51 235 54 30
4594C0q0P3m3p2J4j8J96M4n18K76K01r2J34rk97K27k44J88q4K15j03k62R7J81
$$ 30 -50 23 -20 -92 -78 -96 100 144 -374 -98 103 11 145 136 -161 66 -178 10 -74 141 38 -224 -127 54
4618E4K6j27N4P2n3o7j08j89M30Q4j11p7k74M16j11N0L2p4kl7N0r9K38j75k0K5
$$ 54 80 -47 7 79 26 -41 -149 -338 92 176 65 -12 -286 130 19 69 101 27 25 -12 38 -61 177 2 -18 7
4644GJ4k3j7O3k02N3J32K55k25Q7j30Q1k64qK17j27O6J93k43Q0J06p4l9J36r2
$$ 7 21 -2 -19 44 -158 -105 27 282 57 144 14 95 -169 -177 40 -87 -21 172 -71 9 115 41 2 138 46
4669D6Q0J31j21m13K41j01J14o2rp7J14K8RJ26k44J83j54K20r8j09j12K27P7q8
$$ 46 126 257 136 -277 -36 -137 -23 -85 -94 -171 -57 -29 -20 106 -138 45 -109 111 13 -96 -208 19 96 8
4693HQJ8k92J33M1J64p8q8N9J18k5j40K80q3J29l25J60j77J54o3L9j1k44K62l
$$ 8 16 34 -258 -125 -84 80 2 -86 -27 91 66 -74 206 123 252 -73 87 -90 64 1 40 29 -215 47 44
4718D4j7J84k21J01M8R8m97L79j87N3K7j2K4L0j91Q4J22j20J81k49l8L4L7n5k3
$$ 44 27 211 -10 91 139 237 -260 119 -68 -15 12 0 24 54 -137 -53 69 -51 130 -119 -157 -123 -86 -141 -164
4743a64J27J58j81N9K1r8J58j7k80J75K00q1j45O8j31K20O6k51P5j4p3J75j28
$$ -164 -37 121 -60 -1 20 -78 80 63 -217 -42 158 77 -68 0 -131 89 155 -96 -21 -35 -108 67 -61
4766f1R5k14K22J66l89q6L97k57K70J3j48m5L01k06l25J37K1J17k58J23K3K30
$$ -61 34 -180 42 208 -181 -267 130 -127 143 156 8 -37 264 58 -267 -130 -109 8 -250 -127 -104 126
4788A26j1l6n0k1P5nl79J95N21n79K72o5k54p1N9M75l76K03n2q1n9J83r3O3j47
$$ 126 115 79 29 8 83 78 -301 -106 415 -164 108 43 -211 -282 -223 252 -124 79 27 -54 -113 70 -23 40 -107
4813a07P5q7L54m39K59k0Q3K02l65N8Q2j6j64R8N8j43r0O7MJ13m5O7j25O2o1k
$$ -107 -32 -119 235 -204 55 35 118 320 -45 13 95 79 -85 13 71 -72 -162 -95 -91 22 -23 44 -81 -19 -80 -82
4839h2j9J87l56J57J30K02l33K00m2j43J18j1P3k0j17K67j93o3Q4r5J18p7r0P2
$$ -82 -101 86 -270 -113 17 219 -114 86 44 -99 19 8 81 61 -56 211 18 -45 39 -56 62 -15 -105 -33
4863c3J47j99J59l91R9M28j88p9J27j43J00L3J63m9l41J21j62J84J10j45J2j18
$$ -33 114 -85 74 -317 -218 210 22 -57 70 -73 27 60 223 174 -167 -46 -208 -24 86 -59 -47 -165
4885a65JJ24K50j86J51k63O2M8P4K7l27J83j63R5J50k94K99k4n6J11k4m3j49K29
$$ -165 -164 -40 210 24 175 -88 -26 22 96 123 -204 -21 -184 -89 61 -233 66 42 -14 97 73 30 -119 110
4909A10M0j24Rj1J54R8J11l20j83j4M69J7m41Q0j26J69J11n28M9K90q4O3k95Q1
$$ 110 150 26 35 24 178 276 387 67 -116 -130 339 356 -85 -5 -131 38 149 -379 -330 -40 -124 -61 -356 -275
4933b75K94M0lR4j65l0j03K47p8j08N7J7J9j14P0J37J37l16J09J29j82p9K33p7
$$ -275 19 59 56 150 -15 -45 -148 99 21 -87 -30 -13 6 -108 -38 99 236 -80 29 158 -24 -103 130 53
4957E3k19J83Mj26J97j41J39Q5j66J56m09J61J8K36r7J9N2Q9Mk34R6j8l82L95
$$ 53 -166 17 21 -105 92 -49 90 175 9 165 -244 -83 -65 171 74 93 145 234 238 4 100 82 -300 95
4981I5J9k31J38nj40O3j5n4j2K46k70J07nq8K46j39J40k92J90o9J72m25R1L53
$$ 95 114 -117 21 16 -124 -61 -76 -130 -142 104 -166 -59 -64 -152 94 -45 95 -197 -7 -76 96 -329 -238 115
5005A15p9k18K19k47J14K46r9j51k20K10l7J28J56k24K5J4K31k18PJ0l4K29j98
$$ 115 36 -182 37 -210 -96 150 51 -100 -320 -110 -147 -19 137 -87 -62 -48 183 -35 -28 -18 -52 177 -21
5028b1j83J45K38k63N15l37m9K39l92M1m2K45j43O9l84L80k34K05j51P5mQ2k51
$$ -21 -204 -59 179 -84 431 94 45 284 -108 -67 -109 136 -7 62 -322 58 -176 29 -122 -47 -51 31 -220
5051b20M01j09j91R1p4L41l37K55j42K8n6J42l0P1m55L69p1P2j18j85MN6R1N3
$$ -220 181 72 -119 -28 -102 239 -98 157 15 43 -13 129 99 170 -285 84 13 85 -33 -218 -214 -158 -67 -14
5075a4J5p9J4J44l00L43k97K19O9k55R2L6L3l6Q4k87K87o1J85l51KJ01P4o7r7
$$ -14 1 -78 -64 80 -220 123 -174 45 114 -141 -49 -13 20 -16 68 -219 68 7 192 -159 -157 -56 18 -49 -146
5100a46Q8L53k55l1L1j75O2o9K03j54N3k12K14J09j74P8K4J86l69K93r3qL3j67
$$ -146 -58 295 40 9 40 -135 -73 -142 61 -93 -40 -252 -38 71 -103 -25 -1 185 -184 109 16 8 41 -126
5124a26K9K50L1jj69J28r7j6l6j68K10o4P1O8k64L39l73J63N5l1K0o3j01K10j47
$$ -126 -97 153 184 183 14 142 45 29 -7 -175 35 -29 42 110 -154 185 -188 -25 30 -1 19 -44 -145 65 -82
5149h2N7r8j28K47O9o7k9J64k10O4k9Q3j23k3K75k82J82M6j46k43L02J43k63n3
$$ -82 -25 -123 -251 -4 65 -2 -31 133 -77 -13 -42 41 -82 -105 170 -112 70 116 -30 -273 29 172 -91 -144
5173a44L43k02j25L15j97K11j38q1j1K77k42j7J7L03l11L0j41o1K13j84K36J17
$$ -144 199 -3 -128 187 -10 201 63 -18 -29 248 6 -11 6 309 -2 28 -113 -174 39 -145 91 208
5195B08l37j36n5K39r7q9L11l0L6j20K33j65j04K85k70L7O2j83J05J03j56L1K41
$$ 208 -129 -265 -320 -81 -178 -267 44 14 50 -70 163 -2 -106 179 -91 -54 8 -175 -70 33 -123 -92 149
5218A49l75K87j34j64L87k05L1J32Q7l56L28j64J21m1l54M88j61k77K07KO6j80
$$ 149 -226 61 -73 -237 150 -55 -24 108 195 -161 167 3 124 83 -271 217 56 -221 -14 -12 54 -126
5240a26J72j21K1J92k28K02l71J94P5J88l78l4J85P8R3p9j91K08J90l37J09l1
$$ -126 46 -75 -54 138 -90 112 -259 -65 10 198 -180 -214 -29 49 142 63 -128 80 270 -67 42 11
5262A1k67N17l27O4p8M4j02K73l40K37K05j95L0j32R1J40k55J13J4n3q%k87J14
$$ 11 -256 261 -66 -2 -80 -36 -138 135 -205 32 237 42 72 -60 31 171 -84 29 43 -10 -18 -18 -305 -191
5286a91O7P3K80j46j30j5m2J45j07j8L6O9j12L6J95p7N8k46K20j42k84J44K87
$$ -191 -124 -51 229 83 -47 -62 -104 41 -66 -84 -48 21 -91 -55 140 63 121 -125 95 -47 -331 -187 100
5309A00j30k0J46Lj78J37j00mm2J30r9J16j30J73k00j45J15K99m56M96j67k26
$$ 100 -30 -50 96 99 -79 58 -42 -46 -88 42 -57 59 -71 102 -98 -243 -128 171 -285 211 44 -182
5331a82M57l76K91j57Q5r3L93l89j40J46l2K1MK62l68o7J20j3Qj18O7j09Q6K97
$$ -182 275 -101 190 33 118 25 418 29 -111 35 3 24 28 290 -78 -145 -25 -38 -30 -148 -81 -190 -104 193
5355A93k68J51k06O5o0J12n0K20k84J57N3j71Q8o7J03n0J42k78K43M8nj78lj9
$$ 193 -75 76 -130 -65 -125 -13 -63 157 -127 30 83 -88 0 -67 36 -14 128 -150 93 141 136 -42 -45 -64
5379f4RN1J1M2J61l77M46j21k63J86k12J34j77Q1q2O7K33J50k64K43k97O0l2R2
$$ -64 -55 -4 7 49 210 -167 279 158 -105 81 -131 3 -174 -93 -175 -108 125 275 11 254 -43 17 -15 77
5403G7l4k8p8J88k4j52J23k39N2M3L23k78p4J74j27R2M8j6k16K25J07k54N9Jk66
$$ 77 43 15 -63 125 101 -51 72 -167 -115 -72 251 -27 -101 73 -54 38 86 70 -146 79 186 -68 -9 -8 -274
5428b74J44J44K57j5m39L22l99K47rJ82K3l22J94J70l34RJ66j80NJ56n7Nk24J20
$$ -274 -130 14 271 256 -183 139 -260 -13 -22 160 183 -139 55 225 -109 -100 66 -114 -109 47 -10 -5 -229 -109
5452a09J43Mj9L9j11j20K84l14L39k73J44J69l89K68m7j57J53P7m6J08k25K0J35
$$ -109 34 38 19 58 -53 -173 111 -203 136 -137 7 176 -213 55 8 -149 4 81 35 143 -82 -62 73
5475G3P8k82J22r3P6n9J6J30p5p0J29j57M1J25J06j38K5K9r6R0j08O6k79L81k82
$$ 73 151 -131 -9 -102 -26 -85 -69 61 -14 -84 45 -112 -71 54 160 22 47 76 -20 70 -38 28 -251 130 -152
5500a52J75K69j22j14n9j07L06j97J04j24j31P5J44j51mJ93k00k1k6K71R7m8k26
$$ -152 23 292 170 56 -3 -110 196 -1 103 -21 -152 -77 67 -84 -88 105 -95 -116 -142 129 226 178 -48
5523d8k9R4k6p5J19j74L34k39m3M8P3j15K39k83l8k7K85k59J81r9o3K78k01k09
$$ -48 -77 17 -9 -84 35 -139 195 -44 -87 -39 34 -81 158 -125 -163 -190 95 -164 17 -82 -145 133 -68 -277
5547b77L05J60qk07q5OR1jK0qp6K72j33j17J69k17M3k6pJ8p6J33J46k15k42M01
$$ -277 28 188 180 -27 -112 -106 -15 -16 4 -4 -80 192 59 -58 111 -106 -63 -89 -96 -78 -154 -21 125 -90 -332 69
5573F9l53L02r4p0J54M1n6K42k60l74L81K1l69L66J29r1O2k8j20O1m5R4J74k55
$$ 69 -284 18 -76 -146 8 49 -7 235 -25 -399 -18 3 -366 0 129 38 100 72 -48 13 -32 62 236 -19
5597a9R6k94L74j41j7r1j7K87l54J26J21j06J02r3K5k1M6OjJ35r9J34k11j20J13
$$ -19 77 -217 157 16 -1 -92 -109 178 -176 -50 71 -35 67 -26 -1 -22 24 30 29 164 65 199 -12 -132 -19
5622a9m5R0L24l92q6L5J48j8q8N3Q7N5M0j84J7j1l7K7j34K40j64o2K83j57K10
$$ -19 -64 26 350 -42 -128 -93 55 37 -51 2 89 144 184 0 17 6 -31 -4 -138 102 -62 -124 159 2 212
5647B12j80k1o5K53k45M8n0R5r7L5M31n48J35q0L10j56q6j86L02m8k9Q3J4r9J31
$$ 212 32 11 -54 199 -46 2 -48 47 -50 -15 416 -132 3 -77 233 77 -9 -195 107 59 30 113 127 28 159
5672A59r9j03R0q0N7p5K34l43J89J61j14r6m7K47k65K64o1L2j43P8P8k42Q5k71
$$ 159 60 -43 47 -33 24 -51 183 -160 29 190 76 -20 -67 180 -85 179 118 150 7 85 163 -79 6 -265
5696b65J15J28k72K35n4Qq5M41k08p9J10Lj65M9j47J75m2J54j90L01j5l18Q9j0
$$ -265 -150 -22 -294 -59 -113 -105 -190 251 43 -36 74 77 -88 -39 -186 -11 -53 101 -89 212 197 -121 -32 -42
5720d2R7k65J59J01N6j95Q1j66J55N4k7k47L64j21j20K07j14k31J40M3M4p9o0
$$ -42 55 -210 -51 50 106 -89 -8 -174 -19 35 8 -239 125 4 -116 91 -23 -254 -114 -71 -27 -106 -166
5743a66J15J43k46P9Q7j78K71j82Q9p9K07j23M7L0j17R7j14j04L21j35p9j44M8
$$ -166 -51 92 -154 -75 12 -166 105 -77 12 -67 140 17 64 94 -23 74 -40 -144 177 42 -37 -181 -133
5766a33J79n0np8JJ77j80O7L4j24J09J79j03j58J54or8M4L2j52J12J06j36N3k49
$$ -133 46 -4 -9 -87 -86 91 -89 -22 12 -112 -3 176 73 -85 69 63 -35 9 41 -111 1 107 -29 24 -225
5791b25K95j24O9j5Oj7J83l05J41O7j81J27p6j3K89m28L93j61j4P1N2k14RQ3m9
$$ -225 70 -54 15 0 6 -11 172 -133 8 75 -106 21 -55 -68 221 -207 186 25 11 82 134 -80 -71 12 -37
5816c7ML82l09p4L7R2L08n39%L82l82K45k66J77L9j5j24Q6k48J66N5j4K9n4m2
$$ -37 -33 349 40 -34 3 95 403 -136 -136 246 -136 109 -157 20 59 44 -80 6 -242 -76 -21 -35 -6 -60 -102
5841a02J65k86K90k03N07l10j10J63m7l09j51N91n1l2j00k5j10k9J84Q9J7j52
$$ -102 63 -223 67 -136 371 61 -49 114 67 -242 -393 198 147 115 15 -10 -120 -149 35 124 141 -11
5863a1J64o8L6o9m2m9K38l36K63p4k10R8N8q9R2KM55l51j77N3J60l13K73m8P9
$$ -11 153 85 121 52 10 -39 199 -137 126 52 -158 -60 -2 -91 1 3 458 107 -70 -17 143 -170 103 55 134
5888A34n2j38M9j10j00J14N4O9j53K37j30j2K04k7l01L81j81k15L25l5k04P2J9
$$ 134 82 -56 -7 -117 -217 -103 -49 20 -133 104 -26 -38 166 139 -162 219 38 -177 148 113 -91 -19 0
5911@O2N8k38J08k46L6J36L6Lj6KP3j86K49qj61j0J64MJ9k5p5m2K06k05K05J68
$$ 0 62 120 -118 -10 -256 -220 -84 -48 -45 -61 -59 14 -172 77 69 -92 -102 62 66 85 60 -15 -57 149 -56 149 317
5938C17k26O4%j19J45m09M02k4k92J5P1o6K70j92Nk04K30Q6q4l5L72l77J68l72
$$ 317 91 155 155 36 181 -228 174 150 -142 -127 -56 -122 148 -44 -39 -243 -13 73 -11 -46 326 -51 117 -255
5962b55J79J6K6J23Q8j43J40p2k28K73j05P0k45N5j41P5L35j05j7l04m6L34Q2
$$ -255 -76 -60 -34 89 177 34 174 102 -126 147 42 112 -133 -78 -219 -144 191 86 69 -235 -281 53 135
5985A35k85P6q3m9R4M8M6k0J77R3k64J25q4j49k2J65J55j86J2o5M0M2j08k1J47
$$ 135 -150 -74 -157 -206 -112 -64 -18 -38 139 232 -32 93 9 -140 -162 3 158 -28 -16 -81 -41 1 -107 -128 19
6010A9J73Jl39O0k21M34j07M7l7k28K49j31j30J09K05J2l15K11j18m8J84J23l27
$$ 19 192 193 -146 -86 -307 127 20 67 30 -198 51 -80 -210 -101 104 116 -199 12 -106 -154 30 153 -174
6033a74J88J93k15J77l35M22j84K5K00m11O5onP0P4j22L1J44j30L7j28N7RM0O0
$$ -174 14 207 -8 169 -166 256 72 97 297 -114 -49 -55 -60 10 84 -38 -7 137 7 44 -84 -27 -18 22 82
6058H2O0J4k42K26k68J88j66K38j11k7p3q1J41j56J31J37j36K42k31J10j74K80
$$ 82 142 156 -86 140 -128 60 -106 132 21 -6 -79 -160 -19 -175 -44 93 -43 199 -32 78 -96 184
6080A84j06J51K4m80J57n9P1k8J87p4pj01Q5k4L15l40l5K52p8j09p9N8J63m5J4
$$ 184 78 229 253 -227 -70 -129 -58 -86 101 27 20 -81 4 -20 295 -45 -80 172 94 -15 -94 -36 127 82 96
6105I6r2J61l12J71L8j53Nm5L03j30j25J75j51K22N3k55K75l85P2r6K30j20J24
$$ 96 4 165 -147 24 62 -91 -86 -131 172 42 -83 92 -59 163 216 -39 236 -149 -77 -173 57 -63 61
6128F1Pj46o4Q1K34l17J72j72J27k70M65j95J04L1n1o0j65K03j44J35k01M19j84
$$ 61 68 -78 -142 -61 173 -144 28 -144 -17 -287 178 -17 87 118 67 7 -158 45 -99 36 -165 254 70
6151G0J1J39m06K63l02L15q0j36O0J03j65Q4K18j07P0k46j31K25k39M28j86J03
$$ 70 81 220 -186 77 -225 90 10 -126 -66 37 -128 -44 174 67 137 -109 -240 -15 -254 174 -12 91
6173I1K34l01kl9P5j12J31K86j59k7l04K96P4l99J44Q5k03P1pj28K41k34K83J16
$$ 91 325 24 22 -17 58 -54 77 363 204 177 -127 169 243 -156 -12 73 -130 -59 -66 -194 47 -187 96 212
6197B12k81O8j30J13J92k65J80q4l5L26m59J9J81J04k24j36L64l61K06P3J7k90
$$ 212 -69 -1 -131 -18 174 -91 89 5 -30 296 -163 -144 37 141 -83 -219 145 -216 -10 63 80 -210
6219b10L11j60Q0K6n4K58k03N6k95K99J51l46K57q0J26l54k9J51k96K96j41K49
$$ -210 101 -59 21 47 -7 251 48 104 -191 108 259 -87 170 90 216 -138 -167 -16 -312 -16 -157 92
6241I2k04Q8j66J17k03K26K13m7Kk47L59k24K99k85J34l21J13rk0O0K6pJ05l92
$$ 92 -112 -24 -190 -73 -276 -50 163 116 118 -129 230 6 305 20 154 -167 -54 -63 -83 -23 3 -4 101 -291
6265b91L13K26m11J26L0Q0L8Q1l8j26Nj32K00k04P1o3J23P0j11N1J44j25j32J76
$$ -291 22 248 -163 -37 -7 73 111 192 154 28 33 -99 101 -103 -32 -95 28 98 -13 38 182 57 -75 101
6289A01N5j30j64J00o6J61j71L50L2j73k88N0K18l17K93j68R8K42p5p7r4k09M51
$$ 101 156 26 -138 -38 -104 57 -114 236 268 95 -193 -143 75 -242 51 -117 -19 223 148 71 -23 -232 219
6312B19k77J12j69K04n3k36N5J26J10k27N9K9K56k72J69k43J24L0LK03m15j37
$$ 219 -58 54 -115 89 36 -200 -145 -19 91 -136 -77 -48 208 -64 105 -138 -14 16 19 222 -193 -330
6334c30O46k47L1lj75J91r8r6J57l7L8k12J63J06J06j74j99Jl3J9L08l57J19J67
$$ -330 316 69 100 97 -78 113 15 -81 76 39 77 -135 28 134 240 66 -133 -132 -165 -146 162 -195 -76 91
6358I1k0J46j03mj63j33M9j18J25n3J35K22j74j89L47k97q2L01j78l2l2L45k62
$$ 91 71 217 114 110 -53 -186 -137 -255 -130 -183 -48 174 0 -189 158 -139 -221 80 -98 -130 -162 183 -79
6381g9lK31j7Kj80O3j9q2J0l4J8K99p0k33J4K13p8r6M25l44m7J02j13r1O8J79
$$ -79 -82 149 132 134 -46 17 -2 -84 -74 -108 -90 209 139 -94 -80 133 55 -41 384 40 -7 95 -18 -109 -41 138
6407A38k31M6j23K3R5q5J50j4J27l45J76N7J09j10o1J21j77J99j56lK5J81j51
$$ 138 -93 -47 -170 -147 -52 -137 13 -1 126 -219 -43 14 123 13 -48 73 -104 95 -61 -64 -39 142 -9
6430iO9l03L95m6l45M43j41n8Q1j95L49k3k98QK6J74j1k97K97k34J12j21K15q9
$$ -9 60 -243 152 106 -239 204 63 5 86 -109 240 217 -81 -73 -47 127 116 -181 116 -118 -6 -127 88 -1
6454aj06J38Jq8n5j46J94J4j92L92l46K60j00l9J79M9l83M05k00M5p2J0M9l9j45
$$ -1 -107 31 32 -56 -111 -257 -63 -49 -241 151 -195 65 -35 -74 105 154 -229 176 -24 21 -51 -41 8 -31 -176
6479a76L66k27o4N1J26r5n5J27P5O0o2k8M5L5N2m07P7J1K12l7k36J69q3j38L7
$$ -176 190 -37 -101 -50 76 -19 -74 53 128 188 126 98 143 178 230 -177 -100 -89 123 86 -150 19 -64 -202 -165
6504a65J32q8J14K09j72j62m5J6K60j60L49j73k50Q5J40j72j17J23J77J4o0L1
$$ -165 -33 -121 -7 202 30 -132 -177 -161 99 -61 288 115 -135 -50 90 -82 -199 -76 101 115 55 86
6526H6L57m35L4J06j65N3l1J90j25p5r4J81Nn5j8j64J35R9j29j73J06rK4O1j78
$$ 86 443 8 42 148 -17 36 5 195 70 -5 -99 82 87 32 14 -150 -15 84 -45 -218 -112 -121 -97 -36 -214
6551b14L54j78K78k79J92m0N8j42j85K41j83o8J46J26K5l22L37o7k59Q7K2K97
$$ -214 140 -38 240 -39 153 113 171 29 -156 85 -98 -166 -20 106 131 -191 146 79 -180 -93 -71 226
6573B26j94k87J27K8J69n6j21J84j20K87k33l0K11r9o5p4P2K4K1j40O2P6j39l5
$$ 226 32 -255 -128 -100 69 13 -108 76 -44 243 10 -20 191 92 27 -47 25 49 70 -70 -8 68 -71 -106
6597a06k3K22j07j6K99k73r0J70p3J7K47l51j9O3K37n22L84j37P5J03l32K33J40
$$ -106 -129 93 -14 -30 269 -4 -94 76 3 20 267 -84 -103 -40 197 -325 59 -78 -3 100 -232 1 141
6620A41j61OK63n28N22l78J52n7k24L62p8q8o5j81M52k34K17J5j86O7k3l9q6o3
$$ 141 -20 -14 249 -279 243 -135 17 -40 -264 98 20 -68 -133 -314 138 -96 121 136 -50 17 -6 -45 -131 -194
6644a94K0O6J06N3J76k54j77J15L4l2PR9j49M53k73o6N1J23l47Q3K75J69m31k
$$ -194 -174 -108 -2 51 227 -27 -204 -89 -55 -87 -80 19 -130 323 50 -16 35 158 -189 -106 169 338 -93 -95
6668i5k2K48N4l63L10j88K11O7j51R4nk18J75k27J17j73o7L75j61K18k43r8K49
$$ -95 -117 131 185 -178 132 -56 155 222 71 165 160 -58 117 -110 7 -166 -233 142 -19 199 -44 -142 107
6691A07j32P9k48J6K80j05r3M5R2K5R7q0k22P5K34k09r1Q9k04KL32J73l75J74
$$ 107 -25 54 -194 -178 102 -3 -96 -51 41 66 163 83 -139 -64 170 -39 -130 -41 -245 -243 89 262 -113 61
6715F1l3j39jj24L35j16n6M4j60L58j72m3J67p0j76K44J9k52M8q7K21J71m14J33
$$ 61 28 -111 -112 -236 99 -17 -73 -29 -189 169 -3 -46 121 51 -125 119 138 -114 -66 -153 68 239 -175 -42
6739d2j24J75r6j5J41k40L82j50j65K40J13o0l04L3R4P8j87J74j55K0J85q6k35
$$ -42 -166 9 -87 -102 39 -201 181 31 -134 106 219 159 -145 -112 -18 60 -127 47 -108 -88 97 11 -224
6762b24J00K74j86j30K23l17L09jj09J47k1L1j23j57K21J50m48J66jK29K7l2M7
$$ -224 -124 150 -36 -166 57 -260 49 48 -61 86 65 96 -27 -184 37 187 -261 -95 -96 133 160 128 175
6785A75j57Rl5l1J18m9q1R1O2k45J62K77k21l5j5N8k65J50r5L88l10j63O1J44
$$ 175 18 27 -8 -39 79 30 -51 40 102 -143 19 296 75 40 25 83 -182 -32 -127 261 -49 -212 -151 -7
6809gK0p4n1M2j14K5L22k37lk6K91j28j58M8K0p2j5J02j46j8R4k88M5K77n3R7
$$ -7 13 -61 -112 -70 -184 -159 163 -74 -77 -103 188 60 -98 -50 -30 -102 -117 -15 -161 -179 -85 -373 -328 -51 -104 -7
6835gM7J53j05j8J22k66N8K41r0m9l14K95p4p1m2J26J98l53O8K37m8m2j62%J28
$$ -7 40 193 88 70 192 -74 -16 225 135 86 -228 67 -7 -78 -120 6 204 -149 -81 156 108 66 -96 -96 32
6860C2J41n8j84j4L6J41j05N2Q2n5p1J4k8k5p8L61k12J38k67J15j69L6K39m4m32
$$ 32 173 115 -69 -83 -47 94 -11 41 123 68 -3 11 -17 -42 -120 241 29 167 -100 15 -154 -118 121 77 -355
6885c55K92m7K06O8l38J34j29O7o4J46L2%Qj11J21J3L5J31k27K5r1j07J84J54
$$ -355 -63 -110 96 164 -174 -40 -169 -102 -166 -20 12 12 20 -91 30 43 78 209 -18 7 -84 -191 -7 147
6909A47p9K7o4P1k71J22J1m2q9P1K27n5J46p0l83M76j80n7qp4M2K9J32J4j57L21
$$ 147 68 95 31 102 -169 -47 -36 -78 -167 -96 131 76 222 152 -231 245 65 8 0 -74 -32 -3 129 143 -14 307
6935C07l20R4j08L39l40O5k14J73n2O5K22k18j3j6j01J13k23L47Q1k23R1j77K49
$$ 307 -13 81 -27 312 -28 37 -177 -4 -56 9 231 13 0 -16 -117 -4 -227 120 201 -22 69 -108 141
6958A41j48pK5K27P9n02J78%N8Mo5j46j62L61o1J27J60j44r7n7J94J06k57O7R5
$$ 141 -7 -14 11 238 317 -185 -7 -7 51 55 -10 -156 -318 43 -18 109 269 125 28 -29 165 271 14 81 176
6983A76M5j15m2J9J28k59L5k43L43k76L57P6m37k5r6K67M0k1Nj23J97p1p2j6K55
$$ 176 221 106 64 83 211 -48 -13 -256 87 -189 168 244 -193 -218 -314 -47 -7 -28 -23 -146 51 -20 -92 -108 147
7008A47k71L67m06L8J78K24k89R2K26k24O9k27K00j52K3J43o0M7k96K73k2p7J69
$$ 147 -124 243 -163 -125 53 277 -12 80 306 82 151 -76 124 -28 -5 138 78 125 -171 102 80 3 172
7031A72j9j72m0J67Lo3K18l39N0J26K52l08M1k7O5j95N7o5R9r7j40K1K26J18j61
$$ 172 153 -19 -59 108 111 48 266 -73 -23 103 355 47 88 61 126 -69 -12 -77 22 -75 -215 -194 32 150 -11
7056a1K11m3j40m0J47r5j09K81m88J69nK33j90M1J73K0j07J05N0l51L8K45j06
$$ -11 200 157 17 -23 124 29 -80 201 -287 -118 -123 110 -80 -39 134 154 47 152 202 -149 -111 134 28
7079B8J33l19K96k53O9m2O4J46K7j43k6j10J94k12J28R4j7n8J78k63J16l1R2J16
$$ 28 161 -158 138 -115 -46 -88 -24 122 149 6 -20 -130 64 -148 -20 74 57 -1 177 -86 30 -1 91 207
7103B07l04J29J03j15j62O9Lj36K71j41L6K45l58L14k0j94Qk9j1J38l18J23J4
$$ 207 -97 32 135 20 -142 -73 -70 -206 65 -76 -40 205 -153 161 141 -53 -45 -74 -85 53 -265 -142 -128
7126a28L12m06K26M3m9p1J43k61J44j17Q1N4K04k78K86k73Q7K02l35J05K07M4
$$ -128 184 -222 4 47 -2 -73 70 -191 -47 -164 -83 -29 175 -103 183 -90 -3 199 -136 -31 176 220
7148B20k24Q5R8j06K8l06J46K55l59R0J96j19J1qN2k0Q1k54K09K03k30N0j63k27
$$ 220 -4 81 179 73 101 -205 -59 196 -163 -73 123 4 15 7 59 39 120 -134 75 278 48 98 -65 -292
7172b92O98m57q2M7L18k69%j16J05Q5M5p2J5k20L26r0o2K22l42K30j36P7k43J84
$$ -292 406 -51 -133 -86 232 -37 -37 -153 -48 37 82 10 25 -195 131 41 -21 201 -141 89 -47 30 -213 -29
7196b9j29n2L53j29m1J1j32M0m9N00k38j96j21K94j14L6j1O6J18j63k46N4J32
$$ -29 -158 -210 143 14 -27 -16 -148 -108 -157 343 105 -91 -212 82 -32 4 -7 59 177 14 -232 -178 -46
7219d6o1L21%j32j26J10m0l60M26j08j26R2J24Jj20M0%k83L0L31L9R3l6j16l2
$$ -46 -107 214 214 82 -44 66 26 -334 92 -16 -142 -50 74 75 -45 -5 -5 -288 -258 73 112 205 169 53 21
7244B1Nk31L58p4oJ5j19K58l28K39k80J99QR1O6j83O0l09M49k83j26j34J52J27
$$ 21 26 -205 153 79 73 88 -31 227 -101 138 -142 57 65 156 222 39 99 -210 239 -44 -170 -304 -152 -25
7268b5P6J5o5m0J1K7j16M1J29k24l5J72r8J21k0J80k48L7r5J89P0nl36K78k91
$$ -25 51 66 1 -39 -28 -1 -117 -76 53 -171 -206 -34 -132 -11 -31 149 -99 -62 -157 32 102 97 -239 39 -252
7293b52M24q3LO8r1L9p0k2M6m3R3k58M5K28j16Q5Q2j51j61K65k75K62k75L91l17
$$ -252 172 89 92 160 69 108 38 16 62 19 112 -146 -101 127 11 96 178 27 -134 131 -144 118 -157 234 -83
7318h3K90o3j10lr0J88j87K21l23K51l66L62j08K06l15K08l34M50J40m20K63l60
$$ -83 207 144 34 31 -59 129 -58 163 -160 91 -275 87 -21 185 -130 78 -256 194 334 -86 177 -183
7340a83J27K85l5j47p4L0L48l15mL4p4j22J3q3K91j67K63k51J69Lo4k00J42N6
$$ -183 -56 229 194 47 -27 3 351 36 32 66 -8 -130 -117 -200 91 -76 187 -64 105 108 44 -156 -14 42
7364D2p4Q4p7j23J64k42L68k80n6L22l0j44j60J72Q3j00q5o3L76l88j5J64P6l85
$$ 42 -32 52 -25 -148 16 -226 142 -138 -194 128 98 -46 -206 -34 49 -51 -136 -199 177 -211 -226 -62 14 -371
7388c71N12n9L5q1j57k4J90j68J0K25k86J25L4q1J31j15J44m8J59j16j44R9j22
$$ -371 141 82 117 36 -121 -145 45 -123 -113 112 -174 -49 -15 -96 35 -80 64 16 175 59 -85 14 -108
7411a08O1n9R5k2j71M39j31r4k3J8p8L61j62j4l64K48j19K26o7j06N1J68l97L76
$$ -108 -47 -106 -11 -33 -204 235 104 10 -13 5 -73 288 126 112 -252 -4 -123 103 36 -70 -19 149 -248 128
7435A28j54K22j94k01L43l30j56L46j35N7L1L8l10L12j83K40k20q8L55j77j49
$$ 128 -26 196 2 -199 144 -186 -342 4 -131 -74 -43 -5 -315 -3 -186 54 -166 -254 101 -76 -225
7456b25J79K46j80P9j40J03k4k0N7O4j15p1J21mj7O8j99O3K23n8n9m2m7O9J8J31
$$ -225 -46 200 20 99 -41 62 38 18 75 139 24 -47 74 70 53 121 -78 -15 208 150 91 49 2 71 89 220
7482B20l17K68m9J1l45L11o7j60n8K46k09L02l36J50J30m94L19k1J63j14J59r4
$$ 220 -97 171 122 133 -212 99 32 -128 -186 60 -149 153 -183 -33 97 -397 -78 -99 64 -50 109 15
7504A5L6J10m9j66J15k67K19j70R6J99k75J94N7Ll84L45n8J9o6n7K01k90K45j98
$$ 15 51 161 112 -54 61 -206 13 -157 -61 138 -137 57 114 117 -267 78 20 39 -27 -84 117 -173 72 -126
7528a26n3M9J62o4o7R7N9Q8l49K74l53L68l96J99J19j08L34j71M6j60q9J04M1
$$ -126 -179 -130 32 -32 -99 -2 57 145 -204 70 -283 85 -311 -112 7 -101 233 62 108 -52 -141 -37 4
7551DJ61k86j5K63m30M19K3j99j07K22n3j62L08j32L04j77K6k30J96j44K8J38
$$ 4 165 -121 -136 127 -303 116 139 -60 -167 55 2 -160 148 16 320 143 169 -61 135 -9 19 157
7573A57k45K11j09J42K8j95J32q3k15J06k8l3J71n9ORl14K64j57M52k36n2k1J46
$$ 157 -88 123 14 156 184 -11 121 38 -177 -71 -99 -132 39 -20 -14 -5 -319 -55 -212 240 4 -48 -69 77
7597G7j00J44j53l5L93k41L1K20n58J85N6K02j41K6KMPQ5q1j98K53k47K35j80
$$ 77 -23 121 -32 -67 326 85 116 336 -222 -37 19 221 80 106 108 112 119 204 123 -75 178 -69 166 -14
7621a4o8Q1J3n6j6M4k35K55J46j96N2j53L53j80n4j48j1J31K18l23K40r5LK55
$$ -14 -82 -1 12 -44 -60 -16 -251 4 150 -46 6 -147 206 26 -28 -176 -187 -56 162 -161 79 -16 -13 242
7645B42l37L1P8k2l6j36J1M60k71j73J26P2n3rk09K23n8J66q8M8j34L51m31N3
$$ 242 -95 -64 14 -8 -44 -180 -169 291 20 -153 -27 45 -8 -17 -226 -3 -61 105 17 65 -69 282 -149 -96
7669i6J42mJ80j00k11K0J01j56j0J06N0m9J03m5Q5j14O2j24L0n7J28j96J42p2
$$ -96 46 42 222 122 -89 -69 32 -124 -134 -28 22 -27 76 31 116 2 64 -60 -30 -87 41 -155 -13 -85
7693h5K01j71J80L2k15J23j59O3J08m1k53J35J22k47M00k23J51L2j72P3O5q7l67
$$ -85 116 -55 125 157 -58 65 -94 -31 77 36 -217 -82 40 -207 193 -30 121 153 -19 54 119 32 -335
7716c35J58K61J75l37P9J18q5m4j62J33n8Q9j97J74L5P0j05L49p81M88o3J43j08
$$ -335 -177 84 259 -78 1 119 34 -10 -172 -39 -97 -8 -205 -31 4 74 -31 318 -463 25 -38 105 -3
7739cj82l4K86k54R4k01K64k64K92J56m43L87J09k82K80k21j01L7l9O3q6J01M6
$$ -3 -185 -219 67 -187 -93 -294 -30 -294 -2 154 -289 98 207 -75 205 -16 -117 -80 -119 -56 -142 -41 5
7762EK19l08R2j37K15nl07Q9k8K04J8j43NJ8J98n7j2j84J73N9j36j42j05J52m9
$$ 5 224 -84 8 -129 86 81 -226 -137 -165 39 57 -86 -81 -63 135 78 66 -118 55 114 -22 -164 -269 -117 -166
7787a66J70o5J51nJj55j25J84j25K73o4k81k8J75K0J70j17K1R8k81J1P4K46L3
$$ -166 4 -61 90 85 86 -69 -194 -10 -135 138 74 -207 -235 -60 -40 130 13 34 132 -149 -138 -64 182 215
7811B15j68l7j48L0M31m23J00j33k7O4j1J43O7j59J05J11k89j59K08J80k8K8j97
$$ 215 47 10 -138 -108 323 -100 0 -133 -160 -96 -107 36 103 -56 49 160 -129 -288 -80 100 72 100 -97
7834i7M9k2J28J78k00J52k00n9J71k09j21J99o6K22J03l87J38l7J43ok11K07o8
$$ -97 -48 -70 58 236 36 188 -12 -71 100 -109 -230 -31 -97 125 228 -159 -21 -58 85 79 -132 75 7
7857Gj88L13j56rk4J80k42L3Q6n2J81k71P9O5m5K2J55R7j50j32K5M5j01L2j92
$$ 7 -181 132 -24 -33 -57 123 -119 -86 0 -52 129 -142 -63 2 -43 -21 134 231 81 -51 -26 19 -82 -50 -242
7882b42J35J50j60K48J9l60N5J7K63oN4l21oM43k02jk26pJ39J72M4k33R3j16m5
$$ -242 -107 43 -117 131 150 -210 -155 -138 125 119 173 -148 -154 289 87 86 -140 -147 -8 164 208 -25 68 -48 -93
7907i3K0J10n2M6r7k10K63K9l8m9j23K95kl92N34l91L70j46q5Nm29K02K74k28
$$ -93 -73 37 -15 31 -66 -276 -13 16 -22 -71 -194 101 99 -293 241 -150 220 74 -11 -6 -435 -233 41 -187
7931a87K75N2k80J00L5R2q2j35L01m02K01Rm9j7P1p9K09j76J1L86l01J78k40J69
$$ -187 88 140 -140 -40 -5 87 5 -130 171 -231 -30 -21 -70 -87 -16 -95 114 -62 -51 335 34 212 -28 141
7955A41j23k46RK78j00q3l4q1L74l49J12K19j01j82J44m9M6M0p1L8j08K64o7j25
$$ 141 18 -228 -219 59 -41 -124 -158 -239 135 -214 -102 117 16 -166 -22 -71 -25 15 -56 -18 -126 138 71 -54
7979e4J41q1K05l69J05J70k15M4J61m3j30j16P9K84j71N0k58L63m4j63r4j6K59
$$ -54 87 6 211 -158 -53 117 -98 -54 107 64 -66 -182 -103 181 10 60 -198 165 121 -42 -136 -152 107
8002A07k13K23q9j23L39J6k43l7n9J83q8j7J07j21l46N93l27m8Q0J22j08K69k87
$$ 107 -106 117 28 -95 244 260 17 -20 -79 104 16 -1 106 -15 -361 232 -95 -143 -63 59 -49 220 -67
8025f7j21K72m2k77J49J89k59J95Qj60J3J63m7L1R8l35Q6R5O9qj23K9j1J2J22
$$ -67 -188 84 42 -235 -86 103 -156 39 47 -113 -100 63 16 47 145 -190 -104 -9 60 52 -71 -42 -53 -41 81
8050H1l57M42k39K6J15l71L39n0K18j90J0j4L5j39J27j84r9L19Q0l5j74M5L78
$$ 81 -276 166 -73 -47 68 -303 36 -14 204 14 24 10 45 -94 33 -151 -250 69 149 114 -60 -15 363
8073C63o31J46j7o7K18o3j60K78l41P6P9O9M9M0o4K4m5Q6l2q9JJ63j16j40K06
$$ 363 -268 -122 -139 -206 12 -51 -211 67 -274 -198 -119 -50 -1 39 -25 -1 -46 40 8 -81 -80 83 -33 -173 33
8098C3j06k15J22N14m38k9J6Q5J13Q4k57J21J94l09J64k26L31m72K94k03L05k90
$$ 33 -73 -288 -166 348 -90 -119 -103 -18 95 179 -78 43 237 -72 92 -134 197 -275 19 -184 121 -169
8120a69K21%r3K3l9K22p4L9k91J40K5P1J40k22j01L02l00J36j1n4j35K43j41j5
$$ -169 52 52 -41 -18 -57 165 91 130 -161 -21 4 75 215 -7 -108 194 -106 30 19 -35 -170 73 -68 -83
8144h3K15l41R5J6P6j00J27%J15j13j63J05m8O6j09Q2j3O9r7J64j58L88l61o4
$$ -83 132 -209 -114 -98 -22 -122 5 5 120 7 -156 -51 -99 -33 -142 -60 -73 -4 -101 63 -95 293 -68 -132
8168a32M87l04Jj32J97r8K3J31k57J60J03m58K84J6j7m5m0Q4Q3k39kJ82R0
$$ -132 355 51 52 -80 117 19 42 173 -84 76 179 -279 5 21 4 -41 -81 3 86 -153 -155 27 117
8191A17
$$ Imaginary data points
##PAGE= N=2
##DATA TABLE= (X++(I..I)), XYDATA
0@%%%%%%%%%qJ6j6J6k4L2m0M8n6P2q8J04j21J45j76K08k41K81l28L77m33M97n68
$$ 0 0 0 0 0 0 0 0 0 0 -8 8 -8 8 -16 16 -24 24 -32 40 -48 56 -65 80 -96 112 -129 152 -176 201 -232 265 -303
32c03O46p31Q28r33J046j174J314j465J632j816K017k236K475k736L021l334L675
$$ -303 343 -388 440 -493 553 -621 693 -772 860 -956 1061 -1175 1300 -1436 1585 -1749 1926
49A926m048M458m912N414n969O591p291Q084q988J0033j1259J2716j4484J6683
$$ 1926 -2122 2336 -2576 2838 -3131 3460 -3831 4253 -4735 5298 -5961 6755 -7729 8954
63H954j9504K3273k8595L6732n0848Q2145k76452Q7994L52006l24361J10392K1611
$$ 8954 -10550 12723 -15872 20860 -29988 52157 -224295 -136301 215705 -108656 1736 23347
75B3347l12195R7123L78210j38211j11124O8990j25842k4506K70931j5313j57245
$$ 23347 -288848 -191725 186485 48274 -62850 6140 -119702 -144208 126723 111410 -45835
86d5835J9500j6127j2047J52222r010r7386j377l8854J6331J24872l5601o2135
$$ -45835 -26335 -42462 -54509 97713 88703 -8683 -10060 -48914 -32583 92289 56688 -5447
98e447J7855p0985O24J45356l4071r7947N6767k7792p4842J32054M5203j35057
$$ -5447 12408 -58577 -57953 87403 53332 -44615 12152 -15640 -90482 41572 86775 -48282
110d8282L1359L8595j06958Q6767J06996j45336l0861Q8503p2545J5721J15682
$$ -48282 -16923 21672 -85286 1481 108477 -36859 -67720 20783 -51762 -36041 79641
121G9641p7708p4926O1841j5095n758R1321l2241r6835M1104L1119k4260N6294
$$ 79641 1933 -72993 -11152 -26247 -32005 59316 27075 -69760 -28656 2463 -21797 34497
133C4497j907q3396K9364L5694k3165M8027j269p8004K9078M3257k3107K3070
$$ 34497 32590 -50806 -21442 14252 -8913 39114 37845 -40159 -11081 32176 9069 32139
145C2139L20o2481J8398N1100k5984p676K1384m5219j0744O2830j5169l5750L2352
$$ 32139 32459 -30022 -11624 39476 13492 5816 27200 -18019 -28763 34067 18898 -16852 15500
158A5500k3731k4572O2326p183n4229K6687O767k4635L1428Q270l9590L166J8069
$$ 15500 -8231 -32803 29523 22340 -31889 -5202 1565 -23070 8358 16628 -22962 -19796 -1727
171a727j1363J4447K2057l3325j7158K9495l106k496K3087k2334j7573K2802o831
$$ -1727 -13090 1357 23414 -9911 -27069 2426 -680 -3176 19911 -2423 -19996 2806 -4025
184d025M68K3342j6927j5784J3912j05K349J1750r378j3769R017P087q783Q586
$$ -4025 -3557 19785 2858 -12926 986 881 3230 14980 5602 -8167 850 7937 -846 7740
198G740M998k3902K408J8043r630Q236N613k8587N713K2884r455K473O515j8829
$$ 7740 12738 -11164 -8756 9287 -343 7893 13506 -15081 -9368 13516 4061 6534 13049 -5780
212e780n596J4922O727q54k5j1271j4213J5817J6990j0738q18k074j7588R553
$$ -5780 -11376 3546 10273 9419 9394 -1877 -16090 -273 16717 5979 5161 3087 -14501 -4948
226d948J4689m219J770r497j5232R816J2458J809l588j2028l643O940P579N416
$$ -4948 9741 5522 7292 -2205 -17437 -7621 4837 6646 3058 -8970 -12613 -5673 1906 7322
240G322l308o830p704J305J7349M290r342l966j1668L169K1194k715p402P76j4224
$$ 7322 4014 -2816 -10520 -9215 8134 12424 3082 -884 -12552 -9383 11811 9096 1694 2470 -11754
255a1754m96J7708N622n193j0008q598K083J1393J0800q454j2830L403l47L382
$$ -11754 -12250 5458 11080 5887 -4121 -12719 -10636 757 11557 3103 -9727 -6324 -6671 -3289
269c289J5144n252j3269m42K046J0710Q068p931q689m780N320J2197j680l333
$$ -3289 11855 6603 -6666 -7108 -5062 5648 13716 5785 -2904 -7684 -2364 9833 8153 4820
283D820l375r746L395J0516J770l303q947k893N604L251M149o267q598P353J767
$$ 4820 1445 -8301 -4906 5610 7380 4077 -4870 -7763 -2159 1092 5241 -1026 -9624 -2271 -504
298e04k663P658l485q013K764L153M456R90m545o30j780L975M129o495K628M506
$$ -504 -3167 4491 1006 -7007 -4243 -1090 3366 4356 -189 -819 -2599 1376 5505 -990 1638 6144
314F144p368N64M316k718r7j409O81K396k236Pl404k434P745j399l231N945m867
$$ 6144 -1224 -660 3656 938 841 -568 113 2509 273 280 -3124 -5558 2187 788 -2443 3502 -1365
331a365n965N104L253L247k093n842L90J485N723K592q199R2L644k011N487K129
$$ -1365 -7330 -2226 1027 4274 2181 -3661 -3271 -1786 3937 6529 -1670 -1578 2066 55 5542 7671
347G671p854l116M90O075N753n517n931n054R66J1018o49n419J213o942j553Q759
$$ 7671 -183 -3299 -2809 3266 9019 3502 -2429 -7483 -6517 4501 3852 -1567 -354 -7296 -8849 -90
363i0L333n78n446n496L219L844M300m07p250J712J972k209P764J747p290j607
$$ -90 3243 2665 -2781 -8277 -5058 -1214 3086 2679 -4571 -2859 -887 -3096 4668 6415 -875 -2482
379b482j131M207O614l134m388l466j377N625R97R29O47q324l422O124M385L989
$$ -2482 -3613 594 7208 4074 -314 -3780 -5157 468 1465 2394 3041 -5283 -8705 -2581 1804 5793
395E793m271o534J880J412M904M055n490j868j559k290R076M768o496m302k340
$$ 5793 1522 -5012 -3132 -1720 3184 7239 1749 -119 -1678 -3968 5108 9876 3380 -922 -3262
410c262L552O806N9k276o038l599M129J312M016J703j1446m088O208K709M668
$$ -3262 290 7096 7155 4879 -1159 -4758 -629 683 4699 6402 -5044 -9132 -2924 -215 4453
425D453j163o967n99J040L810M802j141k362m973j937Q966L415l637k450n003
$$ 4453 3290 -3677 -4276 -3236 574 5376 4235 1873 -3100 -5037 3929 7344 3707 1257 -3746
440c746J756N920J108L34m115o065K555K566M859J721j0627m510M466L031M448
$$ -3746 -1990 3930 5038 5372 1257 -4808 -2253 313 5172 6893 -3734 -8244 -3778 -747 3701
455C701k055o395j700J173N580M263k516k635n436j61J1491J635o037j778m407
$$ 3701 1646 -4749 -6449 -5276 304 4567 2051 -584 -6020 -6181 5310 6945 908 -870 -5277
470e277J802Q167O30k282m087k823K495M163M863j789j0343K11M912J816L705
$$ -5277 -3475 4692 5322 3040 -1047 -3870 -1375 2788 7651 5862 -4481 -4270 642 2458 6163
485F163l875p342J452J824L513L548l728m229k938L135Q957j123o105k799j959
$$ 6163 2288 -5054 -3602 -1778 1735 5283 1555 -2674 -5612 -2477 6480 5357 -748 -3547 -5506
500e506M395N193k095k380m245j521O120K641J928k656r265K524Q368Q91Mm450
$$ -5506 -1111 4082 1987 -393 -4638 -6159 -39 2602 4530 1874 -7391 -4867 3501 4392 4396 -54
516e4n532K163L986M323o2n092k819k322N554R914m566o975J6j153N288O268m163
$$ -54 -5586 -3423 563 4886 4824 -268 -3087 -5409 145 10059 5493 -1482 -1466 -2619 2669 8937 4774
533D774m204k540j252N715M382M4o310p455M942O457O98l10o446m825L099K405
$$ 4774 570 -1970 -3222 2493 6875 6919 609 -6846 -1904 4553 5251 4941 -1505 -6330 -3231 -826
549h26L775k92p845l175O13M849P161n112p239J340J418M285M380l027l696k675
$$ -826 2949 2657 -5188 -8363 -7750 -2901 4260 -852 -8091 -6751 -5333 -1048 3332 305 -3391 -6066
565f066K253O329K366l07n889n192P703N091j299J433m877m270M675K447J113
$$ -6066 -3813 2516 4882 4575 -1314 -6506 1197 6288 4989 6422 1545 -2725 1950 4397 5510
580E510N23n803l599J327M522L067m930l082l1p95M635K147l051j118l615k62
$$ 5510 6033 230 -3369 -2042 2480 5547 617 -2465 -2496 -3291 1344 3491 440 -678 -4293 -4555
596d555O829R17j589l558m661M156M199r26M57l297l161K317K747K563j661m874
$$ -4555 2274 3191 1602 -1956 -6617 -2461 1738 812 1269 -2028 -5189 -2872 -125 2438 777 -4097
612d097q18R52M483K873o361j764J854r87M599L036m213r84r91J003N601J355
$$ -4097 -4915 -3963 520 3393 -2968 -4732 -2878 -3865 734 3770 -443 -1427 -2418 -1415 4186 5541
628E541k166l668j643M448J479q21J688m083j846K935k71K056k45m840o98J120
$$ 5541 3375 -293 -1936 2512 3991 3170 4858 775 -1071 1864 1593 3649 3404 -1436 -2134 -1014
644a014K137J181m130j244Q59j897L013J309k519l98k005P10M974N47j917k222
$$ -1014 1123 2304 -1826 -3070 -2211 -4108 -1095 214 -2305 -2703 -4708 -3998 976 1523 -394 -2616
660b616j167L584J841l57J449m012j638K815J010L181p85n022k60J747L251J230
$$ -2616 -3783 -199 1642 1285 2734 -1278 -2916 -101 909 4090 3305 -1717 -1977 -230 3021 4251
676D251m178p98L94j795L804K038l680j009j411N25M118N36k398k594J19L678
$$ 4251 73 -725 -331 -2126 1678 3716 36 -973 -2384 -1859 2259 2795 397 -2197 -2078 1600
692A600p95N48J959n231m51L413q08K343K35n842J53L361O63Q54k362p23j050
$$ 1600 805 1353 3312 -1919 -2370 1043 235 2578 2813 -3029 -2876 485 1148 2002 -360 -1083 -2133
709b133r20L924Q24j839j169l187K035L984r41m61j960j644L939k4k74K963l767
$$ -2133 -3053 871 1695 -144 -1313 -4500 -2465 1519 578 117 -1843 -3487 452 428 154 3117 -650
726f50k246L686J121P77n38l092j61J575K220n43k172J012k176j815N475K07l665
$$ -650 -2896 790 1911 2688 2150 -942 -1103 472 2692 2149 -23 989 -1187 -3002 2473 2680 -985
743i85P52k692j15M719j049j238l00j514Q71K64J954J719l440q58J498j27L191
$$ -985 -233 -2925 -3040 1679 630 -608 -908 -2422 -1551 -1287 667 2386 -1054 -1912 -414 -541 2650
760B650o79k452J372j026O43J753j287P54j390k998L799J546k569qj692l62K116
$$ 2650 1971 -481 891 -135 508 2261 974 1728 338 -2660 1139 2685 116 108 -1584 -1946 170
777A70K61K54j278j346N54p17K940K455m780q84K089j134K807R30k477P6n41J27
$$ 170 431 685 -593 -1939 -1385 -2102 838 3293 -1487 -2371 -282 -1416 1391 2321 -156 -80 -621 -494
795d94K120N73O41l113k034L075Q22r26R59k845n40J972p68J167O2k598L63k39
$$ -494 1626 2199 2840 -273 -2307 768 1590 664 1623 -1222 -1762 210 -558 609 671 -1927 -1564 -1803
813a803K298J890l478n73R35m99K378N38j703J91j573Q85K325lM74k505j827L586
$$ -1803 495 2385 -1093 -1666 -731 -1230 1148 1686 -17 174 -1399 -514 1811 1808 2282 -223 -2050 1536
831A536K79j136J378k542j083J737k39R89k99j963l34l83K340J412l401N01N70
$$ 1536 1815 679 2057 -485 -1568 169 -70 919 620 -1343 -1677 -2060 280 1692 -1709 -1208 -638
848f38j336K424J73j689P17r87L48K560o34l62j752j68L235%j072K28k183R28
$$ -638 -1974 450 623 -1066 -349 -1336 -988 1572 938 576 -1176 -1344 1891 1891 819 1047 -1136 -208
866b08J543q14J130j558k034J242L17J442K5l409J222J506j306J681q96j279J333
$$ -208 1335 521 1651 93 -1941 -699 -382 1060 1085 -2324 -1102 404 -902 779 -117 -1396 -63
883f3o62J039J181j900o4l74Q15K961k153j082Q03r02J460J242j825M2o32j226
$$ -63 -725 314 1495 -405 -469 -843 -28 2933 780 -302 501 -401 1059 2301 476 518 -114 -1340
901a340J652K87K27j467k191J760P83p21J391j802o33J810o01J150O65k266L00
$$ -1340 312 599 826 -641 -2832 -1072 -289 -1010 381 -1421 -2054 -244 -845 305 970 -1296 -996
918i96Q1J271K147k359q63J072o40K100R25k170k2o17j01J976p0m82j626k410
$$ -996 -915 356 2503 144 -719 353 -287 1813 2738 568 546 -71 -172 1804 1734 1252 -374 -2784
936b784L230Q27j592J069k225q47K412m2L92J97j852j16Q71J581J158l139l20
$$ -2784 446 1273 -319 750 -1475 -2322 90 48 440 637 -1215 -1331 -460 1121 2279 -860 -1180
953a180J525p74K195J02k099M33o30J66K517p99o64j500j471K905N54j812N55
$$ -1180 345 -429 1766 1868 -231 202 -428 -262 2255 1456 792 -708 -2179 726 1280 -532 23
970B3j688n14K024j85Q42o52j647N15P72J636R32k978k91J791j154J730O49k093
$$ 23 -1665 -2179 -155 -340 502 -150 -1797 -1282 -510 1126 2058 -920 -1211 580 -574 1156 1805 -288
988b88L7p3J37K331m96j213j549k18K567j00j172M06j979J0J984p14Q17o14k496
$$ -288 -251 -324 -187 2144 1648 435 -1114 -1332 1235 1135 -37 369 -1610 -1600 384 -330 487 -127 -2623
1007b623J180R12R75N99k519P0J361m52J304N94j731k99k44R23J550m02n85j295
$$ -2623 -1443 -531 444 1043 -1476 -1406 -45 -497 807 1401 -330 -629 -873 50 1600 1198 613 -682
1025f82p37K954m66j047J057k217o00K029l37M22m20k275O12J118R94K40k252
$$ -682 -1419 1535 1069 22 1079 -1138 -1738 291 -46 376 -44 -2319 -1707 -589 405 645 -1607
1042a607M20L63l78K214j08j677M48j044J110K271j297o02l27p28K196L83j081
$$ -1607 -1187 -824 -1202 1012 904 -773 -325 -1369 -259 2012 715 113 -214 -942 1254 1637 556
1059E56O90j878k68J808J54M58j958j190Q96N18J029J79k542N29M58r51K792P6
$$ 556 1246 -632 -900 908 1062 1520 -438 -1628 -732 -214 815 994 -1548 -1019 -561 -1512 1280 1356
1077A356k460L6o1Q91K231j383j084m71qJ782J68l10J63k502Q32J508L76N50k051
$$ 1356 -1104 -1068 -1129 -238 1993 610 -474 -945 -953 829 997 687 850 -1652 -820 688 1064 1614 -437
1096d37j993J884L92N91N08k325l24R18j50J823K21j955m33Q3J744J595j434l67
$$ -437 -2430 -546 -154 437 945 -1380 -1704 -786 -936 887 1108 -847 -1280 -1197 547 2142 708 341
1114C41r84J54K318j01m52lk411O15K390n23p1j305j703J646P46K56l44j901k94
$$ 341 -643 -489 1829 1728 1276 1273 -1138 -523 1867 1344 1273 -32 -1735 -89 657 913 569 -1332 -1626
1133a626L78N44K167j323k236M52m60K402J253j912n35o33K62K272K56m04m53
$$ -1626 -1248 -704 1463 140 -2096 -1644 -2104 298 1551 -361 -896 -1529 -1267 1005 1261 857 404
1150D04j747J166J830k64J42j817p97J507L33O81n57j789J60L68K10J929j376
$$ 404 -1343 -177 1653 1389 1531 -286 -1083 424 757 1438 881 -908 -748 -380 -170 1759 383
1167C83j918P76k38J329J104j953l40qJ98J592k11k44m61j699J430J437k34q8
$$ 383 -1535 -759 -997 332 1436 -517 -857 -865 -667 925 714 470 9 -1690 -260 1177 943 855
1185H55j261m52J307q0L38k14j418J20K94Q2J631j221j324O48k76Q82R42j265
$$ 855 -406 -858 449 369 707 493 -925 -805 -511 -429 1202 -19 -1343 -695 -971 -89 853 -412
1203d12j91q5j37J167j22R2j59j382J360J090q25R28r94q99J706n85J25O08j268
$$ -412 -603 -688 -825 342 220 312 153 -1229 131 1221 396 1324 330 -569 1137 552 677 1285 17
1222A7k49J73j25J124q85r11P19q50Q07N12j221N75k55m52Q16j24N40j13j460
$$ 17 -232 -59 -184 940 55 -856 -137 -987 -180 332 -889 -314 -569 -1021 -205 -329 211 98 -1362
1241a362J064R67p71J227p04r49J298p97M88P29p85o48J7L91J419j310l43j79
$$ -1362 -298 669 -102 1125 421 -528 770 -27 461 1190 405 -243 -226 165 1584 274 -69 -248
1259b48j048J323N97j120M50p53p65J575J02o3n5j449R31R05l01R36j276j11N47
$$ -248 -1296 27 624 -496 -46 -799 -1564 11 113 50 -5 -1454 -523 382 81 1017 -259 -370 177
1278A77m22J460L40j521J17l53J16J864j267j142N67j124J057J294j396j67o18
$$ 177 -245 1215 1555 34 151 -202 -86 1778 511 -631 -64 -1188 -131 1163 -233 -400 -1018
1295a018k94J598L2R1q80j181J584N19k40P31j636l14J012P3J137J67k035M18
$$ -1018 -1312 286 318 409 -471 -1652 -68 451 211 942 -694 -1008 4 77 1214 1381 -654 -236
1313b36M90O11P22j110q37J58JQ24J76o53j84j139J58J919o02p78j16j146J534
$$ -236 254 865 1587 477 -360 -202 -201 623 799 146 -38 -1177 -1019 900 298 -480 -596 -1742 -208
1332b08Q89m50J67j164p22J577K31O19j15j703K93P98J082J35j401j37K09j72
$$ -208 681 231 398 -766 -1488 89 320 939 824 -879 -586 212 1294 1429 28 -109 100 -72
1350g2J337k98j533K11n52M95J408o46j030k29n96J468P17n13l73j008L91J057
$$ -72 1265 967 -566 -355 -907 -412 996 350 -680 -909 -1505 -37 680 167 -206 -1214 -823 234
1368B34k10R17j320j013J194Q32J18M50j464q9Q37k76J055m63j008Q4m23N59J221
$$ 234 24 941 -379 -1392 -198 634 752 1202 -262 -351 486 210 1265 802 -206 -122 -545 14 1235
1387A235j157p11j49j05J219j8m85Nr42Q1J451m93K85k27j206R90K63M46R5j079
$$ 1235 78 -633 -782 -887 332 314 -171 -166 -1108 -1027 424 -69 216 -11 -1217 -227 36 482 577 -502
1407e02K49N18J8Q32n67m69O0m6R4J046j150l46J66m62Q89k76l44K95p93K37O64
$$ -502 -253 265 283 1115 548 79 139 93 187 1233 83 -263 -97 -559 330 54 -290 5 -788 -551 113
1428A13o32O79l31p57P05K97j64J23l6K82j62k10P33k49k01L57m42l0P21o45p0
$$ 113 -519 160 -171 -928 -223 74 -90 33 -3 279 117 -93 640 391 190 547 105 75 796 151 81
1449H1J83m13M72m28o6K98o81j57Q04n47P99n74o20R01j73p9K91m63K33Lk10J072
$$ 81 264 -149 323 -105 -171 127 -554 -711 93 -454 345 -229 -849 52 -121 -200 91 -372 -139 -136 -346 726
1471G26k74l16M20n96L33P35r86J69K79p57N75l64q1M72r20L08N68o49O01n98
$$ 726 452 136 556 -40 293 1028 42 211 490 -267 308 -56 -137 335 -585 -277 291 -358 243 -355
1491c55n50O09K22l7J99n40L33J71l15J046m52o55O14k95M44O30j183K67J28m72
$$ -355 -905 -296 -74 -111 88 -452 -119 52 -263 783 331 -324 290 -5 439 1069 -114 153 281 -191
1511a91Q56k52m22J43n62L76M95l83l30m11r4R59o5l45K29q19M76L93J53L77q73
$$ -191 665 413 -9 134 -428 -52 443 60 -270 -681 -775 184 119 -226 3 -816 -340 53 206 583 -290
1532b90m72P85K89L71M49j337m14Q78j63P88l06o84r1l29J288K07r45j17o31J05
$$ -290 -762 23 312 683 1132 -205 -619 259 96 884 578 -106 -197 -526 762 969 24 -93 -724 -619
1552f19J486q84k31j47p33O73N95N9K53j224k58J115K72M26k80r55K35K45M31
$$ -619 867 -17 -248 -395 -1128 -455 140 199 452 -772 -1030 85 357 783 503 -452 -217 28 459
1571D59O12r12l99j26J88R21M57j119m65m47K88J652q62o52l03m23Q51N63n3l84
$$ 459 1071 159 -240 -366 -178 743 1200 81 -384 -831 -543 1109 247 -405 -708 -1131 -280 283 230 -154
1591a54o19k34J042K69M54o68j069O56N57J70Q34j314q8K53n7Q99j86j110J15
$$ -154 -773 -1007 35 304 758 90 -979 -323 234 404 1238 -76 -164 89 32 931 745 -365 -250
1610b50q0Q2J079n46m81k38l39P00MJ63l71n29Q9R06n65M92k87p14R65J37n5M14
$$ -250 -330 -248 831 285 -196 -434 -773 -73 -69 94 -277 -806 -717 189 -376 116 -171 -885 80 217 162 576
1632E76p13j2M91l38N27n8q37N75r1P7M47o81k48L0k11O07J4l88J06m70J58M23
$$ 576 -137 -149 342 4 531 473 -364 211 120 197 644 -37 -285 -255 -466 141 155 -233 -127 -597 -439 -16
1654a6o32O26l09m11R26m6k89L69j38R9Q8k47K64J30l47M32m24J85M01q67K13
$$ -16 -648 -22 -331 -742 184 138 -151 218 80 179 267 20 284 414 67 499 75 260 661 -206 7
1675GJ48n57O05m67M2M53l49r1L83p63O12j01l86K65l01K11N29l25o8K82k96K90
$$ 7 155 -402 203 -264 -222 231 -118 -209 174 -589 23 -78 -464 -199 -500 -289 240 -85 -153 129 -167 123
1697A23q6M0M03l46M6M19l62L69j53p31K47J51L5K07q54j41M63k99M86J40q07
$$ 123 37 77 480 134 180 599 237 606 453 -278 -31 120 155 362 -492 -633 -170 -469 17 157 -650
1718f50J52j81L45O76m00p8n5l06R39k15r3J9k13L43N13m73J67j91p96N44K98
$$ -650 -498 -679 -334 342 -58 -136 -191 -497 442 227 134 153 -60 283 796 323 490 299 -497 47 345
1739C45j09j8n50J16K72l3M79m37p41K24K4J01N76n54K4j91p6R27j67k91O6k0
$$ 345 236 218 -332 -216 56 23 502 65 -676 -452 -428 -327 249 -305 -281 -472 -548 379 212 -79 -13 -33
1761c3Q0O58l87J46m20l61O93K70l17l43m53L72K21K59P2o77n37N50j00M95Pr28
$$ -33 47 705 318 464 44 -317 376 646 329 -14 -467 -95 126 385 457 -220 -757 -207 -307 188 195 -733
1783g33K47k52M20P99l80p12N45k68L61P41o20J01l04Q8R07k91l51j74k27N35
$$ -733 -486 -738 -318 481 101 -611 -66 -334 27 768 148 249 -55 33 940 649 298 124 -103 432
1803D32J39k42j66m67j55K95N5l7K04p21J82M10m5K22j24k19K41j40K45J91l84
$$ 432 571 329 163 -304 -459 -164 -109 -146 58 -663 -481 -71 -116 106 -18 -237 4 -136 109 300 -84
1824h4K02l8j06P05n90J79M5k74K76L00n08K81m01k57P40n96L3J16p05M51K56
$$ -84 118 80 -26 679 89 268 313 39 315 615 107 388 -13 -270 470 -126 -93 23 -682 -231 25
1845B5m88M00k41j30O42o78L22K1j70O03k49l68M98L3m3N3q4J35o4J7K45m83K00
$$ 25 -463 -63 -304 -434 208 -470 -148 -127 -297 306 57 -311 187 220 177 230 146 281 217 234 479 -4 196
1868A96K22p30K60P2k34K19J00o12N92p9k97L73n34K14J57l68O36j54o09P01j46
$$ 196 418 -312 -52 20 -214 5 105 -507 85 6 -291 82 -452 -238 -81 -449 187 33 -576 125 -21
1889b1O6N54p41K02K3K87K97k09m97N23m27K29J01m52N0k62j97Q83p66L43j17
$$ -21 45 599 -142 60 83 370 667 458 -39 484 57 286 387 -65 -15 -277 -474 409 -357 -14 -131
1910a31n97O64j1J22K7l70n5M72m25L52K67m51K57O5J7K0N4l17K01m6P5K90o30
$$ -131 -728 -64 -75 47 74 -296 -351 121 -304 48 315 -136 121 186 203 223 277 -40 161 115 190 480 -150
1933a50L37l08J3P96p80j47J29n13O31j24k58K47j80O3L16k65p3j8J11K65K72
$$ -150 187 -121 -108 688 -92 -239 -110 -623 8 -116 -374 -127 -307 -244 72 -193 -266 -284 -173 92 364
1954C64l72J68j75O5L85k50K76k71m78N02J88k46K30n02j29K72m2R5o5o36L90
$$ 364 -8 160 -15 50 435 185 461 190 -288 214 402 156 386 -116 -245 27 -15 80 15 -621 -231
1975b31J04k21O39n76o1j9k1O92M6l58J99o52M31P63l19Kk81o58R86r1p9o5m46
$$ -231 -127 -348 291 -285 -346 -365 -386 306 352 -6 193 -459 -28 735 416 418 137 -521 465 374 295 230 -216
1998b16j05M75r1N33p25n86O34j98K68%j32m75L16P6O04k72n87K63ML53N21o75
$$ -216 -321 154 63 596 -129 -715 -81 -279 -11 -11 -143 -618 -302 -226 378 106 -481 -218 -214 139 660 -15
2020a5K6k15R5O43j90k40K4l16PN29j74P8m14l20O82l53lJ35l51p3N39j49J59
$$ -15 11 -204 -109 534 344 104 128 -188 -181 348 174 252 -162 -482 200 -153 -156 -21 -372 -445 94 -55 104
2043A04l87j87M69m5k2M83m98%J89o1N42m67j62M82o13N63R5n81P1j78J04L72
$$ 104 -283 -470 -1 -46 -68 415 -83 -83 106 45 587 120 -42 440 -173 390 485 -96 -25 -203 -99 273
2065B73n81m9N41o68N64P7k87r6k57K99L10j38j09J98m34M25L14l94L04m17R1
$$ 273 -308 -357 184 -484 80 157 -130 -226 -483 -184 126 -12 -121 77 -357 68 382 -12 292 -125 -34
2086c4L83L3j80j14p1j51M18j06L80m41k26K16l36O90j21r66N17k12j85Q87m12
$$ -34 349 382 202 88 17 -134 284 178 558 117 -109 107 -229 461 340 -626 -109 -321 -506 381 -31
2107c1p7j17j59K23J33l6J98l74K44K87k85M03l58k52M35P0J7L7k92R9R6l13K27
$$ -31 -108 -225 -384 -161 -28 -64 134 -240 4 291 6 409 51 -201 234 304 321 358 66 165 261 -52 175
2130A75Rm05L10M1k46P2j60R4j08j99N06l12O2J43j80J41J87J09k44J79n34N56
$$ 175 184 -221 89 130 -116 -44 -204 -110 -218 -417 89 -223 -161 -18 -198 -57 130 239 -5 174 -360 196
2152A96k25L18j60j79K38l4k21K67N8l53K68j02k72K04l34J04J11j34K64j31j90
$$ 196 -29 289 129 -50 188 154 -67 200 258 -95 173 71 -201 3 -331 -227 -116 -250 14 -117 -307
2173c07L33k56J44L01m94J80J99k59N38j78k28K90m06K61j6j05L75l02J19K28
$$ -307 26 -230 -86 215 -279 -99 100 -159 379 201 -27 263 -143 118 102 -3 372 70 189 417
2193D17l77J30j27l72L77L8l64K01O2j36J44l30N3O44m43p0K03l20K72J33N0J07
$$ 417 40 170 43 -329 48 86 -278 -77 -15 -151 -7 -337 -284 360 -83 -153 50 -270 2 135 185 292
2215B92k64J42J16k65J64J39k24K23n68R3M25j32j03q4m24L43M6o2L7k62Q6K37
$$ 292 28 170 286 21 185 324 100 323 -245 -152 273 141 38 -46 -470 -127 -81 -143 -106 -368 -282 -45
2237d5J1l00K01j99K39n6k1M02o00M33J40m60N75n1k97k14K07J72K32m87j2J87
$$ -45 -34 -334 -133 -332 -93 -149 -170 232 -368 65 205 -255 320 269 -28 -242 -35 137 369 -118 -130 57
2259E7l15O27j83j73j22k06J20Q6q2J65j49l35M14K12q1p8l50K86J27J70J78m52
$$ 57 -258 369 186 13 -109 -315 -195 -109 -191 -26 -175 -510 -96 116 35 -43 -393 -107 20 190 368 -84
2281h4J34J56l83K30K05r5n1l06j37N98L3k68l8l14Q9K65j39J22k39l64N27L7
$$ -84 50 206 -177 53 258 163 112 -194 -331 267 300 32 -6 -320 -231 34 -105 17 -222 -586 -59 -22
2303b2O2j25j34R3K00k50M24k13J75R4l44M06j10l05R4J33j15J63N6m81J90l17
$$ -22 40 -85 -219 -126 74 -176 248 35 210 304 -40 366 256 -49 45 178 63 226 282 -199 -9 -326
2325c26M14o2k70M22l22m69O93k03r0R2j56R9J83j17J92Ok60J74jK03L98n19n6
$$ -326 88 26 -244 178 -144 -613 80 -123 -213 -121 -277 -178 5 -112 80 86 -174 0 -1 202 600 81 25
2348B5L8j16L95m83L39k9l18L87k30k57K49m04RO10k56j74l0l49M00mNL06m53
$$ 25 63 -53 342 -141 198 169 -149 238 8 -249 0 -404 -395 215 -41 -215 -245 -594 -194 -198 -193 113 -340
2371c40L69O8m2K3J55k56J81j33K8L21l71J87J96m81K80J77m54R9J05l14K67k65
$$ -340 29 97 55 78 233 -23 158 25 53 374 3 190 386 -95 185 362 -92 7 112 -202 65 -200
2393b00P9q5L1K81l72J26J89j28M0R9j62J51J7j25M23l42k86N16K69l79m8N5o8
$$ -200 -121 -206 -175 106 -266 -140 49 -79 -39 60 -102 49 66 -59 364 22 -264 252 521 142 94 149 81
2416H1J35j47K3k45k21M04k29L40j59j23M3l06J53P30n60l66M30j42K34P1k30
$$ 81 216 69 92 -153 -374 30 -199 141 -18 -141 -98 -404 -251 479 -81 -447 -17 -159 75 146 -84
2437h4L0Q8j82L95k42L62j45m17N08o4J8j70r9J1L20r4j82L6m78K29r2J27M39
$$ -84 -54 34 -148 247 5 367 222 -195 313 249 267 97 -2 9 329 235 53 89 -389 -160 -252 -125 314
2460C14m84N9J41k99L44j19k54L76l79M08J78l32J24M3l15K94J65P4j76j18J2
$$ 314 -170 -111 30 -269 75 -44 -298 78 -301 107 285 -47 77 120 -195 99 264 338 162 44 56
2481E6rJ68K15k57l51M5K59k47J20k30qJ62J17o6j2k57L00j67J43J32l19L27p0
$$ 56 47 215 430 173 -178 -133 126 -121 -1 -231 -239 -77 40 -26 -38 -295 5 -162 -19 113 -206 121 51
2504E1j94K58R6J95k88l89P0M72j31R2m63QM42l00J49q0j8k81M20k7k7l78k11
$$ 51 -143 115 211 406 118 -271 -201 271 140 232 -231 -223 219 -81 68 -12 -30 -311 109 82 55 -323 -534
2527e34O30k84J61J09k58J77j69j7M18j58lJ07k56J81M51o54N6K76n70O05N6k14
$$ -534 96 -188 -27 82 -176 1 -168 -185 233 75 72 179 -77 104 555 -99 -43 233 -337 268 324 110
2549A10n7l53O1M0J52N13n74j29N0L61j56P8l22r9K93k37L95R7l32L63n27M96
$$ 110 53 -300 -239 -199 -47 466 -108 -237 -187 174 18 96 -226 -325 -32 -269 126 223 -109 254 -273 223
2571B23J7n3mm13m1N72j76j99L43o44K45K15p3R7l67q5N01l65M11o3k25l08K63
$$ 223 240 187 183 -230 -271 301 125 -74 269 -375 -130 85 12 109 -258 -343 158 -207 204 141 -84 -392 -129
2594a29qL49n1k40J74k25j14M08q8K72l13k90N47j72M3J40n05J16L38k11M3l18
$$ -129 -137 212 161 -79 95 -130 -244 164 76 348 35 -255 292 120 163 303 -202 -86 252 41 84 -234
2616b34j16K29J29m7J69m81K38L9n7J57L6J75m28M0K65L59k49m7k66j29K24P2
$$ -234 -350 -121 8 -39 130 -351 -113 -74 -131 26 62 237 -191 -151 114 473 224 177 -89 -218 6 78
2638G8J66K9l17j46N36p2O2m24n9K60m01K70J30n09K20j01L31q8J07k77P3k29
$$ 78 244 273 -44 -190 346 274 336 -88 -147 113 -288 -18 112 -397 -177 -278 53 -35 72 -205 -132 -361
2660c61M21K95l51Q4j71J60n5M9K09l64j24L64p7J64M1k34j38J16l0K78l98K19
$$ -361 60 355 4 88 -83 77 22 71 280 -84 -208 156 79 243 284 50 -88 28 -2 276 -122 97
2682I7m34J80n1L52l44N8p6J72m7J65k28K00Pj4K92m17J29J05m53J88L72j19K25
$$ 97 -337 -157 -208 144 -200 -142 -218 -46 -93 72 -156 44 51 37 329 -88 41 146 -307 -119 253 134 359
2705C59n41o9L93n0Q1k40Mr0nN5L2K33n13Q8pN04l7l51K02m28O3M57l64J65j97
$$ 359 -182 -251 142 92 173 -67 -63 -153 -158 -103 -71 162 -351 -263 -270 234 197 -154 48 -380 -317 140 -224 -59 -256
2730b56j5N47j18j33R0m36L84Q3l1q8n9k82J86J1J55j28n2K04k24K01J01j07l04
$$ -256 -271 276 158 25 115 -321 63 146 115 27 -32 -314 -128 -117 38 -90 -142 62 -162 39 140 33 -271
2753b71M90k22j39L41k6k33J41k4MJ89j12j31oK7J17j18k1N8j03Q5Km1J08k94
$$ -271 219 -3 -142 199 173 -60 81 57 61 250 138 7 1 28 145 27 6 64 -39 46 48 7 115 -179
2777a79J72j9j35R5J43k96J03R2j22J19k12o9K33M9J22l5j19M19k02m23M07p1
$$ -179 -7 -26 -161 -66 77 -219 -116 -24 -146 -27 -239 -308 -75 -26 96 61 -58 361 159 -264 143 72
2799G2J61k76j36L34j56m0J31M3J14n9P0l73J78j84Lj4J71O1n76L56Q8j72J08
$$ 72 233 -43 -179 155 -1 -41 90 133 247 188 258 -115 63 -121 -118 -132 39 100 -476 -120 -32 -204 -96
2822i6J40l2P9q8n5L02k20j2Q5k95K47R3j04J77l41M27Pn32M09P9k86j83J28K8
$$ -96 44 12 91 3 -52 250 30 18 103 -192 55 148 44 221 -120 307 314 -218 191 270 -16 -199 -71 -43
2846d3K05n66J23K21l7J39L5m23L35k43L59K58l26K24k09m3j25L80j00J21m80
$$ -43 162 -404 -281 -60 -97 42 77 -346 -11 -254 105 363 37 261 52 9 -116 264 164 285 -195
2867a95K85N2m8j81J34p6j54K55P4J40j54k66k4J08N1j63J34m8o8J99K16k87J03
$$ -195 90 142 94 -87 47 -29 -183 72 146 286 132 -134 -158 -50 1 -162 -28 -76 -144 55 271 -16 87
2890H7l75L57p0J32k11L84o64N15J61m16L93j22l26m8J57P7M8o4l44K5J21J21
$$ 87 -288 69 -1 131 -80 304 -360 155 316 -100 293 171 -155 -203 -46 31 79 15 -329 -304 -183 -62
2912f2jL6q9M7k2K76k53J9K6k3l7M74j00N4l98L1j13K70kp2k85K35k88M40L09
$$ -62 -63 -27 -116 -69 -91 185 -68 -49 -23 -46 -83 391 291 345 -53 -22 -135 135 133 61 -224 11 -277 163 472
2937D72o12K7j07n2L23k08J75K6l46K34L75k85j50K75l11K70j43L04k71j07J04
$$ 472 -140 -113 -220 -272 51 -157 18 44 -302 -68 307 22 -128 147 -164 106 -37 267 -4 -111 -7
2958gJ21R8J22j79m31K83j97M17L3l74mK2m9K38q9J38k27j65K21j88Q0N0o7P0
$$ -7 114 212 334 155 -276 7 -190 227 260 -114 -118 -96 -145 93 4 142 -85 -250 -29 -217 -137 -87 -154 -84
2982h4J93q0n1MM3l2K35p2l7j6j76L58k85k8J03l96M34l16J97J90j09M3k15j18
$$ -84 109 29 -22 -18 25 -7 228 156 119 103 -73 285 0 -28 75 -321 113 -203 -6 184 75 118 -97 -215
3006b15M63k75Pk9j94J14Q2j46j52M35m07L73Q8M0j7m12J67L5k48K52J03l24L74
$$ -215 248 -27 -20 -49 -243 -129 -47 -193 -345 90 -317 56 144 184 167 -245 -78 -43 -291 -39 64 -260 114
3029A14k6J33r1j84j1P0k39M00L4k44J63l25K14J36l23J44N0P5J37j14j70n7j16
$$ 114 88 221 130 -54 -65 5 -234 166 200 -44 119 -206 8 144 -179 -35 15 90 227 113 -57 -114 -230
3052b30R0k6L34k0p1J14j82K4o1K99j52o5K3k11J82n5k3Lp5J26R4l25J75r9O3
$$ -230 -140 -166 168 148 77 191 9 33 -28 271 119 54 77 -134 48 -7 -30 -27 -102 24 118 -207 -32 -131 -68
3077f8J08r6NN2j17p2J16J54j96M76l09K00l35K8K67m89L42j47N9K01K8l79K13
$$ -68 40 -56 -51 1 -116 -188 -72 82 -114 362 53 253 -82 -54 213 -276 66 -81 -22 179 207 -172 41
3100D1l88J58L11n49L77L0k76J58J02O2O0k81N3K82l04J33J00m14M37j19J99p
$$ 41 -347 -189 122 -427 -50 -20 -296 -138 -36 26 86 -195 -142 140 -164 -31 69 -345 92 -27 172 165
3122A65j03j89J60l7Q2K24l15k07K07j72J11L77k19q8k81M83m56J37K99o25K32
$$ 165 62 -127 33 -4 78 302 -13 -220 -13 -185 -74 303 84 -4 -285 198 -258 -121 178 -447 -215
3143b15K72P2l6j4j62j36L7M40q6k83K66J06l19J02K29l46j10J03K2K29R7k03
$$ -215 57 129 93 79 -83 -219 -182 258 172 -111 155 261 -58 44 273 -73 -183 -80 -58 171 268 65
3165F5k11k13M76n6n0k9j40j39M44K4j74Q0j43O3R1LK13l28q6K26N4Mk9p3k8o0
$$ 65 -146 -359 117 61 11 -18 -158 -297 147 171 -3 77 -66 -3 88 91 304 -24 -110 116 170 174 145 72 44 -16
3191a6J16L09m34K24l35QK84p0j5k33l9L13N9q1j23m1l26J96J12J74j3j52k14
$$ -16 100 409 -25 199 -136 -128 156 86 71 -162 -201 112 171 90 -33 -74 -400 -204 -92 82 69 -83 -297
3214b97L99M5k89M07l98R7J52K6l57M46j69q3k69M83k73k46K45r0K63k32j55M24
$$ -297 102 147 -142 265 -133 -36 116 142 -215 231 62 -21 -290 193 -80 -326 -81 -171 92 -140 -295 129
3236A29k39k15L62p7j30L2o2K61M6Q8oj78j3j37J29J38o4n9P5p5OK05l26J46j04
$$ 129 -110 -325 37 -40 -170 -138 -200 61 107 195 189 11 -2 -139 -10 128 64 5 80 5 11 216 -110 36 -68
3261f8j5j11K44k21P7K15j77J00p8L6J62m54L44j82R7n3K19k61K17Mk71M07l28
$$ -68 -83 -194 50 -171 -94 121 -56 44 -34 2 164 -290 54 -128 -31 -84 135 -126 91 95 -176 231 -97
3284i7O1O6p2J14k33L2J48k50oM72l50o3J36j77L61M7l64K28l47J37kMK93k10
$$ -97 -36 30 -42 72 -161 -129 19 -231 -237 235 -115 -178 -42 -219 142 189 -175 53 -294 -157 -159 -155 138 -72
3308g2N3o2J36R0j35L38l96o5J04P5J27j89J54j93j42R7Q1o0K7r4P4k2R3%N3J6
$$ -72 -19 -81 55 145 10 348 -48 -113 -9 66 193 4 158 -35 -177 -80 1 -59 -32 -126 -52 -74 19 19 72 88
3334H8j19r6J02K17m56J70q1J73j04J63J57l47J89L3m4J67k50l4J81j45M3P9k46
$$ 88 -31 -127 -25 192 -264 -94 -175 -2 -106 57 214 -133 56 89 45 212 -38 -72 109 -36 7 86 -160
3357a60P3J22K1P3q8k18k37K52J04j23J92k35K43Ml4J25M0j36l61N29k10q9K66
$$ -160 -87 35 56 129 41 -177 -414 -162 -58 -181 11 -224 19 23 -11 114 154 18 -343 186 -24 -113 153
3380A53k0n18N18nj51j02RJ5R5M6O6k8l50J77J02o2M6l48J51J14k14J61L39k64
$$ 153 133 -385 133 128 -23 -125 -116 -101 -6 40 106 78 -272 -95 7 -55 -9 -357 -206 -92 -306 -145 194 -70
3404g0j21O4k4K01J61j39p8R5K40l87J03m9J17K11q2k7l32P5r9K65m14J90J12
$$ -70 -191 -127 -151 50 211 72 -6 89 329 -58 45 -4 113 324 242 215 -117 -42 -141 124 -290 -100 12
3427A2k35J91J38k43j09J17O4N9k07j7l1J40O7o9L86p6l02M0K28O7j90J13k12
$$ 12 -223 -32 106 -137 -246 -129 -65 -6 -213 -230 -261 -121 -54 -123 263 187 -115 -75 153 220 30 143 -69
3450f9J01Q7L6M6j35o4M1k83K34j50L06j77j9j90J96J99Rq8j28l4k9O5J95m3j60
$$ -69 32 119 155 201 66 2 43 -240 -6 -156 150 -27 -46 -236 -40 159 168 80 -48 -82 -111 -46 149 106 -54
3475e4R1pj35K00J29o8Q8j53k81J83j97M83j99m12L79k58L00L5j85mN2K8mj62
$$ -54 37 30 -105 95 224 156 244 91 -190 -7 -204 279 80 -332 47 -211 89 124 -61 -65 -13 15 11 -151
3499a51J61j1j22J83k04J53O7l7J03N0j31j2p6P3p8k00N07l14J8j99M15m5M1l75
$$ -151 10 -1 -123 60 -144 9 76 39 142 192 61 49 -27 46 -32 -232 275 -39 -21 -220 195 150 191 -184
3523a84J45L7J7K05j98p9O8J20k45K75j74j65R5L4L5K2J00m2j51Qq9K45O5r2l18
$$ -184 -39 -2 15 220 22 -57 11 131 -114 161 -13 -178 -83 -49 -14 8 108 66 -85 -77 -166 79 144 52 -266
3548b66K66j14K38J8k95J73J75j09P5m6l08J93j69o0L65n0j45K33j79l7J10J53
$$ -266 0 -114 124 142 -153 20 195 86 161 115 -193 0 -169 -229 136 86 -59 174 -5 -42 68 221
3570B21k82j34K34K7R5j29j16J6R4j29Q0N6o1J04N0m54L47j04P5k5k09J06J31
$$ 221 -61 -195 39 66 161 32 -84 -68 26 -103 -23 33 -28 76 126 -328 19 -85 -10 -35 -244 -138 -7
3593gm2K4r4J27k9l6j06L50k79J61j1K1m9J31l6m3J13l3m8p5q9oO7Nl09J51J55
$$ -7 -49 -25 -119 8 -21 -57 -163 187 -92 69 58 79 30 161 125 82 195 162 114 39 -50 -56 11 16 -293 -142 13
3620A3N3k15K30k80J66L2K0j01J86j23l52k8K59K55r8J12k96K57j29NK12J06l16
$$ 13 66 -149 81 -199 -33 -1 19 -82 104 -19 -371 -399 -140 115 17 129 -167 90 -39 -34 178 284 -32
3643c2J97l54K07m1k98N14l59K28P8k33q8j35MJ58J15K04nn2p3m0l6P1qk13J04
$$ -32 165 -189 18 -23 -321 193 -166 62 140 -93 -181 -316 -312 -154 -39 165 160 108 35 -5 -41 30 22 -191 -87
$$ [...]
8191a37
##END NTUPLES=NMR FID
##END=
