##TITLE=1H_LR-758-R8-C3-2
CDCl3
 8 sc, 
 3.11.2023
##JCAMPDX= 6.0         $$ Bruker NMR JCAMP-DX V2.0
##DATA TYPE= NMR FID
##DATA CLASS= NTUPLES
##ORIGIN= UXNMR, Bruker Analytische Messtechnik GmbH
##OWNER= root
$$ XWIN-NMR		Version 3.5
$$ Fri Nov  3 14:06:08 2023 Russian Standard Time (UT+4h)  she@DPX200
##.OBSERVE FREQUENCY= 200.1305
##.OBSERVE NUCLEUS= ^1H
##.DELAY= (6, 6)
##.ACQUISITION MODE= SIMULTANEOUS
##.ACQUISITION SCHEME= undefined
##.AVERAGES= 8
##.DIGITISER RES= 18
##SPECTROMETER/DATA SYSTEM= spect
##.PULSE SEQUENCE= zg30
##.SOLVENT NAME= DMSO
##.SHIFT REFERENCE= (INTERNAL, DMSO, 0, 15.7039)
##AUDIT TRAIL= $$ (NUMBER, WHEN, WHO, WHERE, WHAT)
$$ ##TITLE= Audit trail, XWIN-NMR		Version 3.5
$$ ##JCAMPDX= 5.01
$$ ##ORIGIN= Bruker BioSpin GmbH
$$ ##OWNER= she
$$ F:/spectra/data/she/nmr/H-F/1/audita.txt
$$ ##AUDIT TRAIL=  $$ (NUMBER, WHEN, WHO, WHERE, WHAT)
(   1,<2023-11-03 14:04:43.57 +0400>,<she>,<DPX200>,
      <created by zg, POWCHK disabled, PULCHK disabled
       configuration hash MD5:
       00 E9 B6 7A A2 85 ED C7 34 08 36 98 17 FE 4E 26
       data hash MD5: 16K
       10 86 07 21 2B 20 01 96 8C AD 4B B8 DF 3E 9E 34>)
$$ ##END=
$$ 
$$ hash MD5
$$ F0 6D 44 B8 1B C4 7F 40 64 E2 9A 1A 4C CA F4 BA
##$RELAX= 
##$RELAX= 
##$RELAX= 
##$RELAX= 
##$RELAX= 
##$RELAX= 
$$ Bruker specific parameters
$$ --------------------------
##$DU= <F:/spectra>
##$EXPNO= 1
##$NAME= <H-F>
##$PROCNO= 1
##$TYPE= <nmr>
##$USER= <she>
##$AMP= (0..31)
100 100 100 100 100 100 100 100 100 100 100 100 100 100 100 100 100 100 
100 100 100 100 100 100 100 100 100 100 100 100 100 100 
##$AQSEQ= 0
##$AQ_mod= 1
##$AUNM= <au_zg>
##$AUTOPOS= <>
##$BF1= 200.13
##$BF2= 200.13
##$BF3= 200.13
##$BF4= 200.13
##$BF5= 200.13
##$BF6= 200.13
##$BF7= 200.13
##$BF8= 200.13
##$BYTORDA= 1
##$CFDGTYP= 0
##$CFRGTYP= 5
##$CHEMSTR= <none>
##$CNST= (0..31)
1 1 145 1 1 1 1 1 1 1 1 1 1 1 1 1 1 1 1 1 1 1 1 1 1 1 1 1 1 1 1 1 
##$CPDPRG= <>
##$CPDPRG1= <>
##$CPDPRG2= <>
##$CPDPRG3= <>
##$CPDPRG4= <mlev>
##$CPDPRG5= <mlev>
##$CPDPRG6= <mlev>
##$CPDPRG7= <mlev>
##$CPDPRG8= <mlev>
##$CPDPRGB= <>
##$CPDPRGT= <>
##$D= (0..31)
0 1.2 0 0 0 0 0 0 0 0.06 0 0.03 0 0 0 0 0.0002 0 0 0 0 0 0 0 0 0 0 0 0 
0 0 0 
##$DATE= 1699005882
##$DBL= (0..7)
120 120 120 120 120 120 120 120 
##$DBP= (0..7)
150 150 150 150 150 150 150 150 
##$DBP07= 0
##$DBPNAM0= <>
##$DBPNAM1= <>
##$DBPNAM2= <>
##$DBPNAM3= <>
##$DBPNAM4= <>
##$DBPNAM5= <>
##$DBPNAM6= <>
##$DBPNAM7= <>
##$DBPOAL= (0..7)
0.5 0.5 0.5 0.5 0.5 0.5 0.5 0.5 
##$DBPOFFS= (0..7)
0 0 0 0 0 0 0 0 
##$DE= 6
##$DECBNUC= <off>
##$DECIM= 32
##$DECNUC= <off>
##$DECSTAT= 4
##$DIGMOD= 1
##$DIGTYP= 9
##$DL= (0..7)
0 120 120 120 120 120 120 120 
##$DP= (0..7)
150 150 150 150 150 150 150 150 
##$DP07= 0
##$DPNAME0= <>
##$DPNAME1= <>
##$DPNAME2= <>
##$DPNAME3= <>
##$DPNAME4= <>
##$DPNAME5= <>
##$DPNAME6= <>
##$DPNAME7= <>
##$DPOAL= (0..7)
0.5 0.5 0.5 0.5 0.5 0.5 0.5 0.5 
##$DPOFFS= (0..7)
0 0 0 0 0 0 0 0 
##$DQDMODE= 0
##$DR= 18
##$DS= 0
##$DSLIST= <SSSSSSSSSSSSSSS>
$$ [...]
##$SUBNAM2= <"">
##$SUBNAM3= <"">
##$SUBNAM4= <"">
##$SUBNAM5= <"">
##$SUBNAM6= <"">
##$SUBNAM7= <"">
##$SUBNAM8= <"">
##$SUBNAM9= <"">
##$SW= 18.0518050122584
##$SWIBOX= (0..15)
0 0 2 0 0 0 0 0 0 0 0 0 0 0 0 0 
##$SW_h= 3612.71676300578
##$TD= 16384
##$TD0= 1
##$TE= 0
##$TE2= 300
##$TE3= 300
##$TEG= 300
##$TL= (0..7)
0 120 120 120 120 120 120 120 
##$TP= (0..7)
150 150 150 150 150 150 150 150 
##$TP07= 0
##$TPNAME0= <>
##$TPNAME1= <>
##$TPNAME2= <>
##$TPNAME3= <>
##$TPNAME4= <>
##$TPNAME5= <>
##$TPNAME6= <>
##$TPNAME7= <>
##$TPOAL= (0..7)
0.5 0.5 0.5 0.5 0.5 0.5 0.5 0.5 
##$TPOFFS= (0..7)
0 0 0 0 0 0 0 0 
##$TUNHIN= 0
##$TUNHOUT= 0
##$TUNXOUT= 0
##$USERA1= <user>
##$USERA2= <user>
##$USERA3= <user>
##$USERA4= <user>
##$USERA5= <user>
##$V9= 5
##$VALIST= <valist>
##$VCLIST= <CCCCCCCCCCCCCCC>
##$VD= 0
##$VDLIST= <DDDDDDDDDDDDDDD>
##$VPLIST= <PPPPPPPPPPPPPPP>
##$VTLIST= <TTTTTTTTTTTTTTT>
##$WBST= 1024
##$WBSW= 4
##$XGAIN= (0..3)
0 0 0 0 
##$XL= 0
##$YL= 0
##$YMAX_a= 101080
##$YMIN_a= -196646
##$ZGOPTNS= <>
##$ZL1= 120
##$ZL2= 120
##$ZL3= 120
##$ZL4= 120
##$ABSF1= 10
##$ABSF2= 0
##$ABSG= 5
##$ABSL= 3
##$ALPHA= 0
##$AQORDER= 0
##$ASSFAC= 0
##$ASSFACI= 0
##$ASSFACX= 0
##$ASSWID= 0
##$AUNMP= <proc_1d>
##$AZFE= 0.1
##$AZFW= 0.1
##$BCFW= 1
##$BC_mod= 2
##$BYTORDP= 1
##$COROFFS= 0
##$CY= 11.3945322036743
##$DATMOD= 1
##$DC= 2
##$DFILT= <>
##$DTYPP= 0
##$F1P= 15.7292609196834
##$F2P= 12.9074282941183
##$FCOR= 0.5
##$FTSIZE= 0
##$FT_mod= 4
##$GAMMA= 1
##$GB= 0.15
##$INTBC= 1
##$INTSCL= 1
##$ISEN= 128
##$LB= 0.24
##$LEV0= 0
##$LPBIN= 0
##$MAXI= 10000
##$MC2= 0
##$MEAN= 0
##$ME_mod= 0
##$MI= 1.114404
##$NCOEF= 0
##$NC_proc= 0
##$NLEV= 6
##$NOISF1= 3.799351
##$NOISF2= 2.8
##$NSP= 1
##$NTH_PI= 0
##$NZP= 0
##$OFFSET= 15.70392
##$PC= 1
##$PHC0= -23883.15
##$PHC1= 23.85269
##$PH_mod= 1
##$PKNL= yes
##$PPARMOD= 0
##$PSCAL= 0
##$PSIGN= 0
##$REVERSE= no
##$SF= 200.130013532006
##$SI= 16384
##$SIGF1= 3
##$SIGF2= 2
##$SINO= 400
##$SIOLD= 16384
##$SREGLST= <1H.CDCl3>
##$SSB= 0
##$STSI= 0
##$STSR= 0
##$SW_p= 3612.71676300578
##$SYMM= 0
##$S_DEV= 0
##$TDeff= 0
##$TDoff= 0
##$TI= <>
##$TILT= no
##$TM1= 0
##$TM2= 0
##$TOPLEV= 0
##$USERP1= <user>
##$USERP2= <user>
##$USERP3= <user>
##$USERP4= <user>
##$USERP5= <user>
##$WDW= 1
##$XDIM= 8192
##$YMAX_p= 0
##$YMIN_p= 0
$$ End of Bruker specific parameters
$$ ---------------------------------
##NTUPLES= NMR FID
##VAR_NAME=  TIME,          FID/REAL,        FID/IMAG
##SYMBOL=    X,             R,               I
##VAR_TYPE=  INDEPENDENT,   DEPENDENT,       DEPENDENT
##VAR_FORM=  AFFN,          ASDF,            ASDF
##VAR_DIM=   8192,          8192,            8192
##UNITS=     SECONDS,       ARBITRARY UNITS, ARBITRARY UNITS
##FACTOR=    0.0002768,     1,               1
##FIRST=     0,             0,               0
##LAST=      2.2672688,     0,               0
##MIN=       0,             -196646,         0
##MAX=       2.2672688,     101080,          0
$$ Real data points
##PAGE= N=1
##DATA TABLE= (X++(R..R)), XYDATA
$$ [...]
$$ plain form
1837 -52 -99 145 285 204 40 296 13 -103 184 87 -64 43 96 -58 -75 123 -157 182 33 -160 -149 -30
1859 -30 133 266 46 190 203 -29 -46 -200 -10 40 16 54 -165 -193 -97 61 75 -172 0 -87 -276 -102 -281
1882 -281 -412 -359 -460 71 -451 -206 -52 -218 136 -306 -82 -194 -298 105 -228 -71 -82 -208 -42 -185 -157
1903 -157 -233 -359 114 7 -263 -302 -413 -20 -114 -478 143 29 101 -242 -68 6 -210 -508 -273 -236 -34 -306
1925 -306 -324 -242 -157 -186 -255 -108 -310 -419 -15 -236 -266 -346 -502 -258 -353 -421 -223 -290 -32 -502 -371 -200 -279 -197
1949 -197 -184 -476 -394 -358 -258 -57 -73 -211 -484 -192 -47 -351 -172 -354 -461 -205 -87 -124 -122 -218 -267 -249 -214 -137
1973 -137 -256 -200 -239 -356 -333 -237 -164 -322 -273 -249 -134 -443 -58 106 -298 -268 -80 -228 -121 -278 -55 168 -339
1996 -339 -215 -83 -200 -43 -68 124 86 106 -283 -144 53 90 -14 -42 -230 -13 -90 46 -79 -32 -47 65 117
$$ packed form
1837e2m7K44J40q1j64K56k83j16K87r7j51J07N3j54j7J98k80L39j49j93J1J19
1859c0J63J33k20J44J3k32j7j54J90N0k4L8k19k8R6J58J4k47J72q7j89J74j79
1882b81j31N3j01N31n22K45J54j66L54m42K24j12j04M03l33J57j1j26J66j43K8
1903a57p6j26M73j07k70l9j11L93r4l64O21j14P2l43J74P4k16k98K35L7K02k72
1925c06j8Q2Q5k9o9J47k02j09M04k21l0q0j56K44r5o8J98o7K58m70J31J71p9Q2
1949a97J3k92Q2L6J00K01j6j38k73K92J45l04J79j82j07K56J18l7Kr6m9J8L5P7
1973a37j19N6l9j17K3R6P3j58M9K4J15l09L85J64m04L0J88j48J07j57K23K23n07
1996c39J24J32j17J57k5J92l8K0l89J39J97L7j04k8j88K17p7J36j25M7j5J12N2
$$ plain form
2019 117 163 82 8 -38 56 3 -47 -12 55 82 37 -32 -37 58 -100 228 -26 -141 -19 302 69 120 -117 210 -200
2044 -200 167 129 268 -5 -146 131 42 110 63 316 130 18 332 48 -44 218 220 177 -29 204 322 217 124
2067 124 42 205 187 143 216 393 58 -20 400 218 404 -116 -143 168 132 408 169 -32 134 201 226 258 -80
2090 -80 -76 15 462 264 88 -118 224 443 -2 105 339 401 173 154 185 262 323 305 355 382 102 126 223 592 -14
2115 -14 242 263 95 444 238 6 342 233 228 193 -49 119 201 309 18 214 345 196 287 157 182 66 172
2138 172 379 6 193 153 275 305 169 55 -192 58 31 251 -55 116 136 226 164 62 -62 261 187 74
2160 74 276 7 -143 209 71 78 274 5 12 225 -55 -26 -53 -81 19 -46 14 -225 239 -132 -33 -47 57 78
2184 78 23 -32 63 -29 51 51 165 -133 57 332 29 -384 -215 -151 -55 12 -157 160 -5 -17 -3 -354 -145 -205 -96
$$ packed form
2019A17M6q1p4m6R4n3n0L5O7K7m5o9nR5j58L28k54j15J22L21k33N1k37L27m10
2044b00L67l8J39k73j41K77q9O8m7K53j86j12L14k84r2K62Km3k06K33J18j05r3
2067A24q2J63j8m4P3J77l35p8M20j82J86n20k7L11l6K76k39k01J66O7K5L2l38
2090h0MR1M47j98j76k06L42K19m45J07K34O2k28j9L1P7O1j8N0K7k80K4R7L69o06
2115a4K56K1j68L49k06k32L36j09nl5k42J68Q2J08k91J96J31j49R1j30K5j16J06
2138A72K07l73J87m0J22L0j36j14k47K50k7K20l06J71K0R0o2j02j24L23p4j13
2160G4K02k69j50L52j38PJ96k69PK13k80K9k7k8J00o5O0k39M64l71R9j4J04K1
2184G8n5n5R5r2Q0%J14k98J90K75l03m13J69O4R6O7j69L17j65j2J4l51K09o0J09
$$ plain form
2209 -96 40 -206 -20 78 26 -7 -82 -176 -216 -166 304 48 -106 -276 -146 -239 -351 -367 32 -179 59 -4 -70 14
2233 14 -116 -5 -207 -157 -122 -206 -371 -117 -279 -483 -27 -116 -51 97 -369 -112 -5 -20 17 -376 -157 -153 -53
2256 -53 -280 57 -199 -310 -98 -67 -145 -216 -247 -10 -259 -124 -144 9 -236 -331 78 -62 -409 -244 -205 8 -243
2279 -243 -3 -234 1 -147 -370 -283 -4 -166 -244 -262 -187 -120 -100 59 -288 -138 -71 -56 -6 -192 -32 -47 126
2302 126 -63 -362 -161 -216 -281 -118 -257 -289 51 -180 -156 -142 -359 -69 -330 -55 -74 -65 3 -83 -118 -86 -240 -117
2326 -117 -190 106 -86 -300 -84 -91 -52 -153 -69 -266 -157 -69 11 -87 -138 -43 -36 -1 15 -59 -129 49 262 -105 108
2351 108 193 99 -88 -47 141 87 -65 243 -94 -63 -61 49 -206 23 195 -95 158 25 139 112 -71 -36 264
2374 264 89 203 155 5 478 53 -194 -43 131 362 400 217 96 166 67 -115 156 131 87 73 244 24
$$ packed form
2209i6J36k46J86R8n2l3p5r4m0N0M70k56j54j70J30r3j12j6L99k11K38o3o6Q4
2233A4j30J11k02N0L5q4j65K54j62k04M56q9O5J48m66K57J07j5L7l93K19MJ00
2256e3k27L37k56j11K12L1p8p1l1K37k49J35k0J53k45r5M09j40l47J65L9K13k51
2279b43K40k31K35j48k23Q7K79j62p8j8P5O7K0J59l47J50O7J5N0j86J60j5J73
2302A26j89k99K01n5o5J63j39l2L40k31K4J4k17K90k61K75j9RO8q6l5L2j54J23
2326a17p3K96j92k14K16pL9j01Q4j97J09Q8Q0r8n1R5PL5J6p4p0J78K13l67K13
2351A08Q5r4j87M1J88n4j52L08l37L1KJ10k55K29J72k90K53j33J14k7j83L5L00
2374B64j75J14m8j50M73m25k47J51J74K31L8j83j21P0r9j82K71k5m4j4J71k20
$$ plain form
2396 24 -160 196 134 355 90 27 13 94 144 153 -6 138 121 164 177 -237 202 312 39 14 12 167 -12 86 104
2421 104 381 90 50 91 109 -225 309 245 330 137 158 139 278 276 75 161 1 -88 257 285 182 -112 253 322
2445 322 118 96 245 -81 364 63 190 250 -171 -41 70 93 -7 -57 -7 275 -100 259 52 83 -190 -41
2467 -41 98 -163 101 368 127 51 -73 174 241 -10 152 -37 78 358 43 112 -84 -209 26 57 -129 -157
2489 -157 264 270 88 -3 -127 -50 -85 -107 135 -107 -97 502 -114 -92 -110 -117 -73 -61 -156 184 74 -39 143 92 -83
2514 -83 -94 10 79 0 108 -233 70 144 201 -6 -211 -55 163 147 -72 -21 -21 -38 44 162 56 -169 150 -84
2538 -84 -84 -39 -154 232 -299 -181 -121 -142 147 59 109 -209 -222 49 -26 -106 -62 33 -80 88 -42 -116 16 -56 -101
2563 -101 -338 158 15 -240 22 -81 -331 -49 -97 65 154 -202 -331 -190 -169 174 -76 -269 -163 -113 131
$$ packed form
2396B4j84L56o2K21k65o3j4Q1N0Rj59J44j7M3J3m14M39J10k73k5kJ55j79R8J8
2421A04K77k91m0M1J8l34N34o4Q5j93K1j9J39kk01Q6j60q9L45K8j03k94L65O9
2445C22k04k2J49l26M45l01J27O0m21J30J11K3j00n0N0K82l75L59k07L1k73J49
2467d1J39k61K64K67k41p6j24K47O7k51J62j89J15K80l15O9j96j25K35L1j86k8
2489a57M21Oj82r1j24P7l5k2K42k42J0N99o16K2j8pM4J2r5L40j10j13J82n1j75
2514h3j1J04O9p9J08l41L03P4N7k07k05J56K18j6k19N1%j7Q2J18j06k25L19k34
2538h4%M5j15L86n31J18O0k1K89q8N0l18j3K71p5q0M4R5j13J68j30p4J32p2m5
2563a01k37M96j43k55K62j03k50K82m8J62Q9l56j29J41K1L43k50j93J06N0K44
$$ plain form
2584 131 -321 50 -261 -259 -156 103 -310 -335 97 246 -180 -241 -126 -121 -142 -110 -314 -145 -241 -109 -61 -292 -289 -2
2608 -2 -46 -25 -188 -23 -173 65 -41 -181 -60 -173 -167 -211 -186 -134 -204 -113 -80 109 -236 -107 -267 -39 -144 -68
2632 -68 -285 -270 -142 -7 -148 -194 -234 -38 -131 -43 -201 -218 -42 56 -5 106 -283 -8 -164 -249 45 -207 25
2655 25 -74 -105 -16 -38 66 114 36 -70 244 65 76 123 -53 -28 -142 -13 16 -5 -184 21 39 -84 -203 104
2679 104 -289 -130 166 22 60 211 31 -109 48 161 -99 93 219 215 -54 117 82 237 -61 -94 -200 -233
2701 -233 80 48 26 207 35 -200 134 -128 47 7 6 -38 179 -15 -100 274 214 -248 31 -61 26 252 -121
2724 -121 -36 -124 -13 -19 71 38 93 382 175 72 76 71 -49 31 -107 28 45 26 -42 324 148 -127 195 15 97
2749 97 -37 111 88 398 15 184 239 -13 284 219 -83 274 149 191 170 -44 54 133 -46 299 228 76 413
$$ packed form
2584A31m52L71l11KJ03K59m13k5M32J49m26o1J15Nk1L2k04J69r6J32M8k31LK87
2608bm4K1j63J65j50K38j06j40J21j13Om4K5N2p0R1L3J89l45J29j60K28j05P6
2632f8k17J5J28J35j41m6m0J96r3Q8j58j7J76R8o1J11l89K75j56q5K94k52K32
2655B5r9l1Q9k2J04M8p8j06L14j79J1M7j76K5j14J29K9k1j79K05J8j23j19L07
2679A04l93J59K96j44L8J51j80j40J57J13k60J92J26mk69J71l5J55k98l3j06l3
2701b33L13l2k2J81j72k35L34k62J75m0jm4K17j94q5L74o0m62K79r2Q7K26l73
2724a21Q5q8J11oR0l3N5K89k07j03Mnj20Q0j38J35J7j9o8L66j76k75L22j80Q2
2749I7j34J48k3L10l83J69N5k52K97o5l02L57j25M2k1k14R8P9j79L45p1j52L37
$$ plain form
2772 413 330 316 -19 7 161 -147 105 22 195 49 86 -23 252 0 238 137 22 184 -148 110 -160 8
2794 8 50 154 249 150 -14 170 214 102 -101 10 156 -170 274 158 -27 -68 52 -33 66 -10 192 45 103 29
2818 29 87 261 125 -78 -81 101 158 -300 -43 -75 68 17 -58 -31 -85 61 138 -97 110 -104 281 25 -98 17
2842 17 -42 -110 -120 6 -214 -190 -93 146 -184 -200 -250 110 -176 -115 -82 32 66 180 -191 -127 140 -270 39 -131
2866 -131 -61 -35 -8 90 147 -250 -91 -53 90 -114 -162 -87 -206 -133 -151 -360 65 -3 74 237 -80 -74 -172 133 220
2891 220 -216 -222 23 49 12 96 -106 -145 -89 -171 14 -212 -388 22 -174 -269 -286 -312 99 169 -139 192 -200 -27
2915 -27 181 32 65 -209 202 -98 29 -48 -49 -118 -258 -72 -342 -153 -370 52 -65 43 -239 134 -114 -89
2937 -89 44 -173 153 -71 -214 -5 -96 -72 32 -247 -171 -109 99 -138 -18 -118 3 -61 139 48 69 128 71
$$ packed form
2772D13q3j4l35K6J54l08K52q3J73j46L7j09K75k52K38j01j15J62l32K58k70J68
2794HM2J04R5r9j64J84M4j12k03J11J46l26M44j16j85m1J20q5R9p6K02j47N8p4
2818B9N8J74j36k03lJ82N7m58K57l2J43n1p5K7n4J46P7k35K07k14L85k56j23J15
2842A7n9o8j0J26k20K4R7K39l30j6n0L60k86O1L3J14L4J14l71O4K67m10L09j70
2866a31P0K6K7R8N7l97J59L8J43k04m8P5j19P3j8k09M25o8P7J63l17Or8L05Q7
2891B20m36oK45K6l7Q4k02l9N6q2J85k26j76M10j96r5j7k6M11P0l08L31l92J73
2915b7K08j49L3k74M11l00J27p7jo9j40J86k70J89k17M22j17J08k82L73k48K5
2937h9J33k17L26k24j43K09r1K4J04k79P6O2K08k37J20j00J21o4K00r1K1N9n7
$$ plain form
2960 71 -131 -261 80 -127 -38 -207 -87 -19 -193 -118 -98 127 70 -151 97 -173 -167 -155 60 -143 48 58 -173
2983 -173 -72 -298 13 -189 -113 -14 -58 -174 36 -154 -97 -159 73 126 60 -84 -213 -172 183 36 68 -256 -95
3006 -95 30 -168 61 135 67 -158 -68 75 -52 -194 27 200 -53 -342 -41 44 338 274 55 90 -38 255
3028 255 46 36 25 -24 47 69 -42 -1 -190 347 19 160 27 118 195 338 279 69 74 148 233 15 60 -145 -171
3053 -171 4 89 53 35 275 45 235 -48 68 35 224 176 117 98 -51 249 106 206 87 134 -161 1 250
3076 250 -114 -239 167 41 92 81 -259 -55 355 115 153 -87 -64 218 81 -102 9 198 0 -47 -146 -32
3098 -32 113 243 -161 -150 -172 173 224 177 242 127 -108 -22 247 71 -46 164 204 -35 -21 111 148 9 173
3121 173 -78 122 -59 72 21 226 22 -323 138 32 -162 3 121 -189 146 50 -219 -113 16 -16 -63
$$ packed form
2960G1k02j30L41k07Q9j69J20O8j74P5K0K25n7k21K48k70OJ2K15k03J91J0k31
2983a73J01k26L11k02P6R9m4j16K10j90N7o2K32N3o6j44j29M1L55j47L2l24J61
3006i5J25j98K29P4o8k25R0J43j27j42K21J73k53k89L01Q5K94o4k19L5j28K93
3028B55k09j0j1m9P1K2j11M1j89N37l28J41j33R1P7J43n9k10NP4Q5k18M5k05k6
3053a71J75Q5l6j8K40k30J90k83J16l3J89m8n9j9j49L00j43J00j19M7k95J62K49
3076B50l64j25M06j26N1j1l40K04M10k40L8k40K3K82j37j83J11J89j98m7r9J14
3098c2J45J30m04J1k2L45N1m7O5j15k35Q6K69j76j17K10M0k39J4J32L7j39J64
3121A73k51K00j81J31n1K05k04l45M61j06j94J65J18l10L35r6k69J06J29l2m7
$$ plain form
3142 -63 67 -29 113 58 127 180 -304 -122 62 -192 104 191 -49 -23 173 -19 -4 -12 66 60 -240 -4 128 51 -74
3167 -74 -11 77 -568 30 -41 176 -205 -169 24 -17 -150 42 60 -127 74 -11 -230 -16 256 -30 52 53 34 7
3191 7 145 20 253 -53 -232 -2 232 81 -180 -82 12 -175 -148 -173 -250 -17 134 -251 -110 96 -232 -11
3213 -11 -201 14 -184 -163 -133 104 2 72 172 -13 144 -170 -102 148 -201 -131 -160 -249 -48 -251 27 -138 89
3236 89 49 80 -113 -55 -87 -183 99 88 -30 -132 23 -97 -115 -141 -368 -132 -24 158 223 51 37 -37 -52 -51 -186
3261 -186 -288 118 56 94 -64 210 -253 188 -52 -151 42 -116 -86 -326 82 -293 94 10 148 -74 -12 253
3283 253 53 0 -88 -133 156 -245 365 24 -15 -25 131 60 64 -102 -66 195 -16 -60 -132 -86 78 158 -243 25
3307 25 -122 -257 174 140 86 -235 49 -9 -31 -291 -214 -90 97 -22 -19 24 85 -36 37 -146 32 -57 114 -4
$$ packed form
3142f3J30r6J42n5O9N3m84J82J84k54K96Q7k40K6J96j92J5qP8ol00K36J32p7j25
3167g4O3Q8o45N98p1K17l81L6J93m1j33J92J8j87K01q5k19K14K72k86Q2Jj9k7
3191GJ38j25K33l06j79K30K34j51k61R8R4j87K7k5p7K33J51l85J41K06l28K21
3213a1j90K15j98K1L0K37j02P0J00j85J57l14O8K50l49P0k9q9K01k03K78j65K27
3236H9m0L1j93N8l2r6K82j1j18j02J55j20j8k6k27K36J08J82O5j72j4p4j5Jj35
3261a86j02M06o2L8j58K74m63M41k40r9J93j58L0k40M08l75L87q4J38k22O2K65
3283B53k00n3q8m5K89m01O10l41l9j0J56p1Mj66L6K61k11m4p2M6J64Q0m01K68
3307B5j47j35M31l4n4l21K84n8k2k60P7J24J87j19LM3O1j21P3j83J78q9J71j18
$$ plain form
3331 -4 -95 91 118 68 3 219 0 119 205 -102 -75 -112 159 183 194 -75 -36 338 264 13 -21 -58 20 280 204 -161
3357 -161 85 -155 109 138 -48 -80 -177 -44 15 -8 -99 -66 312 377 -25 89 66 11 174 78 46 -66 10 274
3381 274 -124 -14 138 191 173 153 132 -78 -25 -149 2 3 38 170 -140 49 73 -36 -183 103 414 184 177 68
3405 68 -20 50 43 46 -111 -265 -154 249 -143 130 -83 -199 -10 129 128 -51 182 136 178 95 -210 99 -91 45
3429 45 159 34 204 205 -190 14 221 -118 219 -4 -61 97 -145 62 53 0 -268 39 -40 -125 -62 -126 -311 202
3453 202 118 -180 131 -245 -38 74 41 82 -77 3 236 -132 -50 43 54 -21 95 125 189 -30 -216 -229 181 -11
3477 -11 -44 22 -224 -87 -219 156 -159 -199 -42 -11 76 -23 39 -128 -95 -234 450 225 -193 -7 -93 98 -177
3500 -177 34 -14 -128 157 218 67 -291 -146 13 63 -62 -166 -57 7 51 -67 -254 -92 46 148 -9 -224
$$ packed form
3331dr1J86K7n0o5K16k19J19Q6l07K7l7K71K4J1k69L9L74p4k51l4l7P8K60p6l65
3357a61K46k40K64K9j86l2r7J33N9k3r1L3L78O5m02J14k3n5J63r6l2j12P6K64
3381B74l98J10J52N3j8k0k1k10N3j24J51JL5J32l10J89K4j09j47K86L11k30pj09
3405F8q8P0pLj57j54J11M03l92K73k13j16J89J39jj79K33m6M2q3l05L09j90J36
3429D5J14j25J70Jl95K04K07l39L37k23n7J58k42K07rn3k68L07p9q5O3o4j85N13
3453B02q4k98L11l76K07J12l3M1j59Q0K33l68Q2R3J1p5J16L0O4k19j86j3M10j92
3477a1l3O6k46J37j32L75l15m0J57L1Q7r9O2j67L3j39O84k25m18J86q6J91k75
3500a77K11m8j14K85O1j51l58J45J59N0j25j04J09O4M4j18j87J62J38J02j57k15
$$ plain form
3522 -224 1 60 125 -228 -184 -100 -33 -314 48 43 104 -25 20 -204 -132 -37 12 -180 1 140 -99 -57 -81 232 -112
3547 -112 -10 93 131 -67 -27 -176 -4 -164 151 -256 -250 -150 -20 191 -153 46 -79 -40 16 -46 2 -156 -146
3570 -146 -349 -347 -257 -226 -128 -29 -162 -108 -177 -147 138 -199 151 109 -97 114 210 65 195 45 -63 149 -114 7
3594 7 -20 -183 123 -82 8 -118 -56 -171 -155 -118 -2 10 -243 -163 -112 -58 5 312 -51 -2 -25 90 -146 101 -403
3619 -403 -55 -177 -148 -25 -101 -136 -41 -10 154 -55 5 10 -20 336 -48 48 57 -140 -79 -313 50 125 3 -147 -57
3644 -57 80 90 -168 35 -74 145 -119 128 15 265 207 -52 148 -53 0 -106 -89 -136 -199 99 -44 -51 242
3667 242 161 65 -234 -198 112 16 123 87 31 100 -26 108 221 -22 -95 70 -81 -141 239 113 -81 -143 43
3690 43 -83 -55 -64 -179 36 -74 -62 -229 44 -131 133 -165 -9 -266 291 -162 144 -60 29 -134 -27 203
$$ packed form
3522b24K25N9O5l53M4Q4O7k81L62nO1j29M5k24P2R5M9j92J81J39k39M2k4L13l44
3547a12J02J03L8j98M0j49J72j60L15m07OJ00J30K11l44J99j25L9N6o2M8j58J0
3570a46k03KR0L1R8R9j33N4o9L0K85l37L50m2k06K11R6j45J30j50j08K12k63J21
3594Gk7j63L06k05R0j26O2j15J6L7J16J2k53Q0N1N4O3L07l63M9k3J15k36K47n04
3619d03L48j22K9J23p6l5R5L1J64k09O0Nl0L56l84R6Rj97O1k34L63P5j22j50R0
3644e7J37J0k58K03j09K19k64K47j13K50n8k59K00k01N3j06J7m7o3K98j43pK93
3667B42q1r6k99L6L10r6J07l6n6O9j26J34J13k43p3J65j51o0L80j26j94o2J86
3690D3j26K8rj15K15j10J2j67K73j75K64k98J56k57N57m53L06k04Q9j63J07K30
$$ plain form
3712 203 17 103 158 -60 -1 26 -46 -19 -90 11 113 -19 154 -2 -445 217 62 -37 -80 269 16 124 -16
3735 -16 130 47 -109 -138 378 -175 68 195 -240 -69 -50 -92 15 288 103 296 77 -18 -9 -158 -86 51 255
3758 255 20 85 25 75 -88 -80 203 51 258 205 -54 -16 7 -31 -91 140 86 254 179 43 -55 198 218 -271 17
3783 17 -121 -66 18 -80 -168 211 -126 273 123 -55 20 228 66 221 40 -191 -100 -156 -121 -23 44 185 149 12
3807 12 -46 -26 81 52 86 -93 12 -147 -245 -20 -80 9 -78 80 -126 -1 108 -62 -50 280 -291 -96 50
3830 50 -2 -86 185 -48 -172 -58 -228 51 -296 -36 -42 -107 -147 30 127 4 122 -62 -108 98 -2 36 -54 217
3854 217 -43 113 90 -176 154 -226 109 -23 15 19 -227 -58 -15 -275 60 -190 106 -149 -88 111 130 100 -27
3877 -27 -165 63 -16 -81 69 74 -98 -57 -181 -92 78 -23 -55 -3 -125 70 164 -125 -103 61 -193 -102 -163 -130 -52
$$ packed form
3712B03j86Q6N5k18N9K7p2K7p1J01J02j32J73j56m43O62j55r9m3L49k53J08j40
3735a6J46q3j56k9N16n53K43J27m35J71J9m2J07K73j85J93k19r5Rj49P2J37K04
3758B55k35O5o0N0j63QK83j52K07n3k59L8K3l8o0K31n4J68p5j36r8K53K0m89K88
3783A7j38N5Q4r8q8L79l37L99j50j78P5K08j62J55j81k31R1n6L5R8O7J41l6j37
3807A2n8K0J07k9L4j79J05j59r8K25o0Q9q7J58k06J25J09j70J2L30n71J95J46
3830E0n2q4K71k33j24J14j70K79l47K60oo5m0J77R7j23J18j84m6K06j00L8r0K71
3854B17k60J56k3k66L30l80L35j32L8Mk46J69M3k60L35k50K96k55O1J99J9l0j27
3877b7j38K28p9o5J50Nj72M1j24Q9J70j01l2N2j22J95R4k89K2J64k54R1o1L3P8
$$ plain form
3902 -52 37 -92 13 -244 3 -31 -312 -20 189 323 -35 108 24 -122 -92 -161 191 -83 -9 -271 -282 -125 16
3925 16 -116 -171 217 -72 -38 -71 -167 -67 -141 -130 -20 49 -56 124 1 -234 156 39 -266 -18 -275 -90 71
3948 71 -97 29 -210 -3 134 18 -93 56 -110 -288 35 -80 248 43 -114 -131 75 47 -81 211 221
3969 221 30 -47 -18 -32 145 -45 -165 130 -364 -91 -204 47 -277 89 -53 -1 108 -150 30 -176 -69
3990 -69 200 128 72 -23 25 -22 -128 148 198 -25 75 23 -61 -77 -7 -64 -60 -17 -3 26 150 -106 -199 121 120 63 -176
4017 -176 -299 62 -137 108 -43 256 176 -122 -7 -68 109 325 166 19 138 -121 298 372 19 151 172
4038 172 -14 139 100 -100 -120 25 -138 61 -111 -190 -2 236 -9 -125 -139 189 -116 -203 152 183 183 25 -128
4061 -128 75 184 165 -47 -310 58 224 -66 315 -118 131 84 24 80 -206 -44 -25 -251 -194 90 6 -75 267
$$ packed form
3902e2Q9j29J05k57K47l4k81K92K09J34l58J43q4j46L0o9L52k74P4k62j1J57J41
3925A6j32n5L88k89L4l3r6J00p4J1J10O9j05J80j23k35L90j17l05K48k57J85J61
3948G1j68J26k39K07J37j16j11J49j66j78L23j15L28k05j57j7K06k8j28K92J0
3969B21j91p7K9j4J77j90j20K95m94K73j13K51l24L66j42N2J09k58J80k06J07
3990f9K69p2n6r5M8m7j06K76N0k23J00n2q4j6P0n7MM3J4K9J24k56r3L20jn7k39
4017a76j23L61j99K45j51K99q0k98J15o1J77K16j59j47J19k59M19P4l53J32K1
4038A72j86J53l9k00k0J45j63J99j72p9J88K38k45j16j4L28l05q7L55L1%j58j53
4061a28K03J09j9k12k63L68J66k90L81m33K49m7o0N6k86J62J9k26N7K84q4q1L42
$$ plain form
4084 267 -75 130 2 114 14 83 21 225 -132 -45 -132 70 38 76 70 -40 124 -57 -51 313 -27 51 -74 142
4108 142 -49 -33 127 -118 -100 66 213 123 97 -58 193 -63 -10 -112 -136 14 238 -180 114 112 93 -60 -35
4131 -35 114 -107 -101 152 33 -250 -22 -133 81 121 -177 -181 -25 -38 -241 -61 25 -37 -92 -183 -423 -267 -107 -65
4155 -65 130 -194 163 25 -67 11 -244 0 296 226 -22 -229 -60 -104 127 -161 -166 156 33 2 -75 94 41
4178 41 -205 -78 46 5 -104 -10 81 87 -114 -56 -7 -162 -20 76 -102 71 -112 -107 -187 183 -22 46 -20 -137 -4
4203 -4 -70 140 75 56 56 -275 89 -224 127 -50 176 29 -280 104 222 157 24 306 102 -60 90 155 -132
4226 -132 -221 153 -103 163 105 -62 159 -23 -47 -203 169 63 328 4 128 -114 159 3 -131 -161 -151 105
4248 105 -75 -39 -233 261 152 -16 -69 -157 131 50 -229 43 -103 -97 50 -86 -153 -65 215 -249 -155 18 -50
$$ packed form
4084B67l42K05j28J12j00O9o2K04l57Q7q7K02l2L8oj10J64j81OL64l40P8j25K16
4108A42j91J6J60k45J8J66J47r0k6j55K51k56N3j02k4J50K24m18K94kj9j53K5
4131c5J49k21OK53j19k83K28j11K14M0k98mJ56j3k03J80Q6o2n5r1k40J56J60M2
4155f5J95l24L57j38r2P8k55K44K96p0k48k07J69m4K31k88nL22j23l1p7J69n3
4178D1k46J27J24m1j09R4R1Ok01N8M9j55J42R6j78J73j83Nq0L70k05O8o6j17J33
4203do6K10o5j9%l31L64l13L51j77K26j47l09L84J18o5j33K82k04j62J50O5k87
4226a32q9L74k56K66n8j67K21j82k4j56L72j06K65l24J24k42K73j56j34l0J0K56
4248A05j80L6j94M94j09j68n3q8K88q1k79K72j46OJ47j36o7Q8K80m64R4J73o8
$$ plain form
4271 -50 -8 -107 99 -48 18 -189 118 -293 35 -199 -176 77 -23 53 12 85 92 -21 -193 -92 264 -34 -157
4294 -157 205 -77 250 101 406 5 245 96 186 239 -43 -46 194 -92 12 17 83 -124 28 -75 -120 114 144
4317 144 48 -22 40 -132 86 357 53 -43 -101 134 -255 -65 1 91 145 250 -67 61 18 103 -140 -39 -80 123
4341 123 -122 -65 -8 -13 -25 156 -122 -98 -36 -128 23 103 -34 147 62 149 -335 -52 -148 -99 -25 -74 47 75 95 137
4367 137 -50 -124 98 -45 -189 -63 108 115 -76 64 -376 45 131 86 -139 32 9 289 88 136 214 -58 26
4390 26 -161 288 -4 -67 -68 -148 -60 -93 -186 -182 -72 -110 104 232 160 -62 -54 -9 -58 -59 -172 -46 279 -135 -128 206 -77
4417 -77 -147 119 16 -344 -121 -195 117 268 -167 159 -153 54 88 -54 273 -19 94 171 -223 -8 -115 78
4439 78 30 -16 92 83 -193 -77 -158 17 -145 -36 -42 -62 -158 -43 -115 -111 65 114 258 117 -37 348 -8 135 106
$$ packed form
4271e0M2r9K06j47O6k07L07m11L28k34K3K53j00P6m1P3Pj13j72J01L56k98j23
4294a57L62k82L27j49L05m01K40j49R0N3k82lK40k86J04NO6k07J52j03m5K34L0
4317A44r6p0O2j72K18K71l04r6n8K35l89J90O6R0N4J05l17J28m3Q5k43J01m1K03
4341A23k45N7N7nj2J81k78K4O2r2J51Q0j37J81q5Q7m84K83r6M9P4m9J21K8K0M2
4367A37j87p4K22j43j44J26J71Pj91J40m40M21Q6m5k25J71k3K80k01M8P8k72Q4
4390B6j87M49k92o3jq0Q8l3r3MJ10l8K14J28p2k22QM5m9jj13J26L25m14PL34k83
4417g7p0K66j03l60K23p4L12J51m35L26l12K07L4j42L27k92J13P7l94K15j07J93
4439G8m8m6J08rk76J16q1J75j62J09ok0r6J15p2MJ76M9J44j41j54L85l56J43k9
$$ plain form
4464 106 -67 -6 -52 11 -108 -30 -131 15 125 -105 -169 -291 -21 134 -21 -52 -252 101 -202 -186 172 -54
4486 -54 -82 -51 -242 62 -257 198 -164 -36 -13 -49 102 123 220 23 61 -119 144 -103 172 -45 239 62 39
4509 39 -88 -17 -138 -222 -63 47 43 -20 16 19 81 -284 -74 340 -11 -41 -41 152 61 78 -18 147 115 181 196 47
4535 47 62 -152 -273 135 59 -62 141 -87 -198 -59 -40 -49 45 -136 -116 -53 -48 81 -23 -178 -221 189 69 -141
4559 -141 -109 -242 16 -46 54 -98 -253 74 61 168 -139 55 -31 -12 220 84 -31 -274 -92 -94 68 -11 37
4582 37 144 -249 117 -196 88 -2 -210 -213 -6 -8 143 -93 -41 46 34 51 79 -9 -273 433 -63 -106 -24 207 72
4607 72 -294 78 -111 -32 -59 6 -96 14 3 -32 -23 -137 95 -165 100 15 34 180 295 -56 106 -29 -7 -122
4631 -122 -124 13 168 -150 -82 -26 76 95 -118 177 -13 -150 75 56 -191 -122 -73 -77 91 112 -141 37 -113 188
$$ packed form
4464A06j73O1m6O3j19P8j01J46J10k30o4j22K70J55j55l1k00L53l03J6L58k26
4486e4k8L1j91L04l19M55l62J28K3l6J51K1R7j97L8j80K63k47K75k17K84j77k3
4509C9j27P1j21q4J59J10mo3L6LO2l65K10M14l51l0%J93r1J7r6J65l2O6J5j49
4535D7J5k14j21M08p6j21K03k28j11J39J9rR4j81K0O3NJ29j04j55m3M10j20k10
4559a41L2j33K58o2J00j52j55L27j3J07l07J94q6J9K32j36j15k43J82kJ62p9M8
4582C7J07l93L66l13K84r0k08lK07kJ51k36N2Q7j2J7K8q8k64P06m96m3Q2K31j35
4607G2l66L72j89P9k7O5j02J10j1l5Rj14K32k60K65q5J9J46J15l51J62j35K2j15
4631a22kJ37J55l18O8N6J02J9k13K95j90j37K25j9k47O9M9mJ68K1k53J78j50L01
$$ plain form
4655 188 97 -103 55 26 54 -91 124 32 -101 147 -8 149 16 -13 -120 14 139 8 -25 -68 321 -27
4677 -27 -123 -141 50 -139 39 106 133 -1 78 73 -138 206 65 257 58 -27 96 202 57 -47 -176 271 -22
4700 -22 -29 -169 182 -71 99 113 -196 -45 -31 126 120 -145 99 -71 65 10 -43 14 54 -125 -115 8 -7 -4 -19
4725 -19 210 -129 115 -316 -162 17 148 -84 55 -129 -30 -129 54 69 103 191 -332 38 -72 0 8 195 -181
4748 -181 67 -47 171 173 117 153 -56 290 108 148 -134 106 -116 -130 29 41 87 -126 -226 68 -46 -43 -156
4771 -156 -24 63 -23 -422 165 -155 -61 120 -131 -45 125 20 -149 -256 -100 256 -48 -126 -50 -61 -109 -114 -92 178
4795 178 -80 -250 205 99 130 20 45 -96 154 -270 109 -46 -18 99 79 143 -18 21 35 233 168 31 -104
4818 -104 -221 126 -173 -193 51 -12 187 -137 -124 15 75 -94 60 62 53 -154 -134 8 266 -64 282 211 396
$$ packed form
4655A88r1k00J58k9K8j45K15r2j33K48j55J57j33k9j07J34J25j31l3m3L89l48
4677b7r6j8J91j89J78O7K7j34P9nk11L44j41J92j99q5J23J06j45j04j29M47k93
4700b2pj40L51k53J70J4l09J51J4J57ok65K44j70J36n5n3N7M0j79J0J23j5Lj5
4725a9K29l39K44m31J54J79J31k32J39j84R9r9J83J5L4Q8n23L70j10P2QJ87l76
4748a81K48j14K18Kn6L6k09L46j82M0k82K40k22j4J59J2M6k13j00K94j14Lj13
4771a56J32Q7q6l99N87l20R4J81k51Q6J70j05j69j07J56L56l04p8P6j1m8nK2K70
4795A78k58j70M55j06L1j10K5j41K50m24L79j55K8J17k0O4j61L9J4J98o5j37j35
4818a04j17L47k99k0K44o3J99l24J3J39O0j69J54Krk07K0J42K58l30L46p1J85
$$ plain form
4841 396 126 6 99 177 -71 -232 152 33 112 -136 -77 -38 -20 -83 -69 166 -143 -234 115 183 -244 13 108 -171
4865 -171 5 69 -107 -213 127 12 -42 47 52 340 70 255 -20 -157 11 -10 -81 -153 -137 -137 -136 -12 -52 -10 30
4890 30 -124 -116 -41 11 42 127 99 -5 105 -75 -36 -229 203 47 -242 -238 345 104 -23 -67 -173 270 -105 -325
4914 -325 47 13 -79 68 -163 -91 92 -136 -114 -76 -173 -123 204 -196 -30 -9 92 -301 -250 -159 -101 64 -247 -150
4938 -150 81 19 61 101 -66 -147 145 -215 278 3 49 82 65 69 -131 31 -64 -113 55 48 86 30 -116 104 -293
4963 -293 -47 -53 -83 159 108 150 171 -198 193 -22 205 103 -87 34 -47 -74 -246 -104 -39 93 208 26 13
4986 13 -9 39 167 19 139 162 -6 5 -109 97 -209 -374 6 16 175 82 -26 -232 -321 -64 -124 108 9
5009 9 -314 270 -39 198 46 -116 100 112 -307 -145 134 -16 -117 3 -152 135 136 -221 -20 -116 -136 -153 280
$$ packed form
4841C96k70j20R3P8k48j61L84j19P9k48N9L9J8o3J4K35l09r1L49O8m27K57R5k79
4865a71J76O4j76j06L40j15n4Q9NK88k70J85k75j37J68k1p1p2J6%JJ24m0M2M0
4890C0j54QP5N2L1Q5k8j04J10j80L9j93M32j56k89MN83k41j27m4j06M43l75k20
4914c25L72l4r2J47k31P2J83k28K2L8r7N0L27m00J66K1J01l93N1R1N8J65l11R7
4938a50K31o2M2M0j67q1K92l60M93k75M6L3j7Mk00J62r5m9J68pL8n6j46K20l97
4963b93K46ol0K42n1M2K1l69L91k15K27j02j90J21q1k7j72J42O5J32J15j82j3
4986A3k2M8J28j48J20K3j68J1j14K06l06j65L80J0J59r3j08k06q9K57o0K32r9
5009Il23N84l09K37j52j62K16J2m19J62K79j50j01J20j55K87Jl57K01r6k0j7M33
$$ plain form
5032 280 121 -5 58 16 4 186 -3 -43 -8 184 -105 -97 -11 129 81 -91 36 -148 -96 55 -41 -190 17 -87
5056 -87 -298 121 -29 -100 17 -107 -113 34 -48 49 55 -54 -74 223 -169 22 11 73 -28 188 15 -31 130 67
5080 67 115 295 36 -9 31 -104 111 -80 243 -4 209 139 -179 92 15 98 -29 109 -127 8 33 61 73
5103 73 -42 156 -194 37 -80 -50 65 29 132 204 67 -165 75 -66 -106 67 291 -143 -67 86 218 187
5125 187 -168 -126 -121 -32 -177 -33 -208 253 -63 -89 57 -70 -190 123 -26 -62 -307 -243 168 -38 -466 -229
5147 -229 123 101 -96 -8 -183 25 -97 35 35 -126 92 300 -77 77 101 22 44 -174 -101 42 -48 54 -9
5170 -9 -205 -138 -82 4 -115 -67 -243 -96 276 184 51 210 -229 -186 -75 1 23 149 -91 -193 79 -247 -101
5193 -101 -114 26 -85 -40 -76 -98 -2 -119 -305 12 66 -98 -309 36 -9 2 -85 45 -20 -37 -15 -59 -3 -38 -30 43
$$ packed form
5032B80j59j26O3m2j2J82j89m0L5J92k89QQ6J40m8j72J27j84N2J51r6j49K07j04
5056h7k11M19j50p1J17j24oJ47q2R7Oj09k0K97l92J91j1O2j01K16j73m6J61o3
5080F7M8J80k59m5M0j35K15j91L23k47K13p0l18K71p7Q3j27J38k36J35K5K8J2
5103G3j15J98l50K31j17L0J15l6J03P2j37k32K40j41m0J73K24m34P6J53J32l1
5125A87l55M2NQ9j45J44j75M61l16k6J46j27j20L13j49l6k45O4M11k06m28K37
5147b29L52k2j97Q8j75K08j22J32%j61K18K08l77J54K4p9K2k18P3J43r0J02o3
5170ij96O7N6Q6j19M8j76J47L72r2j33J59m39M3J11P6K2J26k40j02K72l26J46
5193a01j3J40j11M5l6k2R6j17j86L17N4j64k11L45m5J1q7J30o5j7K2m4N6l5QP3
$$ plain form
5219 43 -109 157 -23 -116 -64 -246 -1 -16 186 -13 -199 73 7 -67 -69 -228 -189 -63 -236 60 -20 130 73 -65
5243 -65 0 96 98 -147 -16 97 -215 113 -41 -104 138 1 201 -144 105 31 134 79 -28 -98 158 -39 -107
5266 -107 148 24 20 161 -19 -81 31 53 -4 -70 70 -4 -118 -130 141 -95 -200 83 42 -3 86 -130 109 -76
5290 -76 -56 -86 244 142 -57 149 -5 112 20 70 -85 -200 -46 -45 113 138 -36 -136 -19 -116 129 138 123 -82
5314 -82 175 -73 -181 212 145 212 -5 -10 -135 69 -142 59 -207 57 74 92 0 121 -63 205 28 3 84
5337 84 -205 157 2 -158 -88 81 -159 57 5 -299 65 144 114 -110 -82 191 -137 -127 104 -14 -149 -49
5359 -49 170 94 -165 -43 42 159 13 -205 249 63 -125 90 108 -98 -156 78 43 -112 -152 -315 157 95 141
5382 141 126 29 -42 -158 115 -69 132 -148 72 31 -39 22 -56 235 128 -224 153 -57 -60 92 -65 -55 -201
$$ packed form
5219D3j52K66j80r3N2j82K45j5K02j99j86K72o6p4kj59L9J26j73K96q0J50n7j38
5243f5O5R6Kk45J31J13l12L28j54o3K42j37K00l45K49p4J03n5j07p0K56j97o8
5266a07K55j24mJ41j80o2J12K2n7o6J40p4j14j2K71k36j05K83m1m5Q9k16K39j85
5290g6K0l0L30j02j99K06j54J17r2N0j55j15J54JJ58K5j74j00J17r7K45Rj5k05
5314h2K57k48j08L93o7O7k17nj25K04k11K01k66K64J7J8r2J21j84K68j77k5Q1
5337H4k89L62j55j60P0J69k40K16n2l04L64P9l0k24K8K73l28J0K31j18j35J00
5359d9K19p6k59J22Q5J17j46k18M54j86j88K15J8k06n8K34l5j55m0j63M72o2M6
5382A41j5r7p1j16K73j84K01k80K20m1p0O1p8K91j07l52L77k10lJ52j57J0j46
$$ plain form
5405 -201 -22 -169 189 -186 338 246 123 165 -248 22 -101 -95 -2 -116 -16 210 -48 -114 163 -178 -112 328
5427 328 -78 148 173 19 181 -264 82 65 -115 11 84 -105 164 311 -120 139 63 7 -35 -72 55 -146
5449 -146 -146 -192 -297 -1 109 48 -165 12 15 115 -132 -149 20 -129 67 -359 -139 -88 -13 165 -31 72 40
5472 40 40 -204 -19 33 -11 -247 23 219 -2 -18 -33 -58 -59 290 -104 -308 185 46 -12 -132 190 28 -40 -141
5496 -141 131 -43 82 -79 -127 -8 124 26 8 -213 -90 -455 171 211 -234 155 -211 -111 -260 65 31 -174
5518 -174 95 -147 -1 -238 -24 19 95 9 -77 -42 -214 -224 34 68 -273 6 -98 -94 -244 -88 -197 -27 -66
5541 -66 -22 246 -46 -116 -24 184 36 -185 -64 -1 -33 18 0 171 -66 121 -286 29 256 20 121 227 -2
5564 -2 -28 39 -86 -297 134 156 24 51 -160 3 -111 -75 -52 -105 -395 -235 76 -265 -26 -15 53 15 -35 -111 -21
$$ packed form
5405b01J79j47L58l75N24r2j23M2m13K70j23OR3j14J00K26k58o6K77l41O6M40
5427C28m06K26K5j54J62m45L46j7j80J26P3j89K69J47m31K59p6n6m2l7J27k01
5449a46%m6j05K96J10o1k13J77LJ00k47j7J69j49J96m26K20N1P5J78j96J03l2
5472D0%k44J85N2m4k36K70J96k21j6j5k5jL49l94k04M93j39n8j20L22j62o8j01
5496a41K72j74J25j61m8J19J32r8j8k21J23l65O26M0m45L89l66J00j49L25l4k05
5518a74K69k42J46k37K14M3P6q6q6L5j72j0K58L4l41K79j04Mj50J56j09J70l9
5541f6M4K68k92p0R2K08j48k21J21O3l2N1j8J71k37J87m07L15K27k36J01J06k29
5564bk6O7j25k11M31K2j32K7k11J63j14L6K3n3k90J60L11l41K39J1O8l8n0p6R0
$$ plain form
5589 -21 67 115 73 94 204 -12 -99 -183 1 70 57 -161 -54 -202 50 -27 -13 14 6 138 41 164 58 -216 -237
5614 -237 57 78 38 -142 368 -189 104 15 213 -50 -183 -102 -187 -293 136 -69 167 39 -34 -135 240 185
5636 185 185 134 -131 -147 -100 -15 -105 -100 111 103 -16 -24 102 -242 36 -176 -191 -19 -199 13 -151 -7 -104 147 27
5661 27 -270 -194 -48 152 -18 1 -80 -95 -236 -72 -99 -173 138 116 -150 -178 -4 -17 -321 118 87 7 16 205 59
5686 59 -55 94 -117 -151 -188 17 1 -143 10 -212 -92 48 54 -165 -260 -82 -79 81 -65 -132 50 -14 -28 -141
5710 -141 221 150 194 84 -210 55 65 90 -9 254 -86 -205 16 156 12 -191 14 -46 102 55 -69 108
5732 108 86 147 73 -76 340 333 43 -165 -116 -208 -156 -154 50 -173 -88 8 73 -63 -68 -303 -204 0 -75 78 141 -227
5758 -227 231 -81 4 -213 -36 -220 -291 208 8 -170 -206 -84 38 -45 -134 2 39 -44 -54 -137 57 -17 -8 -107
$$ packed form
5589b1Q8M8m2K1J10k16q7q4J84O9j3k18J07j48K52p7J4K7qJ32r7J23j06k74k1
5614b37K94K1m0j80N10n57K93q9J98k63j33Q1q5j06M29k05K36j28p3j01L75n5
5636A85%n1k65j6M7Q5r0NK11qj19qJ26l44K78k12j5J72j80K12j64J44r7K51j20
5661B7k97P6J46K00j70J9q1j5j41J64k7p4L11k2k66k8J74j3l04M39l1q0RJ89j46
5686E9j14J49k11l4l7K05j6j44J53k22J20J40Ok19r5J78LJ60j46o7J82o4j4j13
5710a41L62p1M4j10k94K65J0K5r9K63l40j19K21J40j44k03K05o0J48m7j24J77
5732A08k2O1p4j49M16pk90k08M9r2N2KK04k23Q5R6O5j36nk35R9K04p5J53O3l68
5758b27M58l12Q5k17J77j84p1M99k00j78l6J22J22q3q9J36L7q3j0q3J94p4Rr9
$$ plain form
5782 -107 -197 -141 6 235 98 -125 35 -91 -153 -110 177 147 -70 -36 90 -7 78 -41 -85 132 -176 241 32
5805 32 112 23 -41 -50 -322 -165 -71 31 -158 5 22 -116 146 -19 -97 116 -287 -308 -37 197 -94 -35 199 -283
5829 -283 18 128 20 80 -139 113 -134 1 -166 337 160 10 -80 -57 34 -39 79 -85 -41 0 81 -89 -181
5852 -181 160 -102 48 10 -34 -33 -221 -73 5 -213 -157 -94 8 78 169 107 38 44 256 141 0 181 -56 56
5876 56 -38 100 -165 -149 253 36 -70 84 -65 31 -47 38 40 137 12 227 -202 -59 -269 -138 -114 22 91 199
5900 199 -139 -128 183 -38 -59 -16 46 -100 83 94 -45 38 108 166 -124 -49 -25 -98 -150 105 -39 -71 29 -15 -23
5925 -23 22 13 -125 -69 3 77 -219 1 -171 234 194 3 -59 76 33 173 -232 67 39 54 145 -134 -153 -91 -88 140
5951 140 125 83 -92 -51 220 -112 151 10 229 158 108 -69 -125 136 121 -171 101 -11 -133 -81 40 -212 199
$$ packed form
5782a07r0N6J47K29j37k23J60j26o2M3K87l0k17L4J26r7Q5j19m4K17l08M17k09
5805C2Q0q9o4rk72J57R4J02j89J63J7j38K62j65p8K13m03k1K71K34k91N9K34m82
5829b83L01J10j08O0k19K52k47J35j67N03j77j50r0K3R1p3J18j64M4M1Q1j70r2
5852a81L41k62J50l8m4Jj88J48P8k18N6O3J02P0R1o2o9OK12j15j41J81k37J12
5876E6r4J38k65J6M02k17j06J54j49R6p8Q5KR7j25K15m29J43k10J31K4J36O9J08
5900A99l38J1L11k21k1M3O2j46J83J1j39Q3P0N8k90P5K4p3n2K55j44l2J00m4q
5925b3M5rj38N6P2P4k96K20j72M05m0j91o2J35m3J40m05K99k8J5R1k79j9O2LK28
5951A40j5m2j75M1K71l32K63j41K19p1n0j77n6K61j5k92K72j12j22N2J21k52M11
$$ plain form
5974 199 -18 -255 3 -55 -22 -37 -53 5 85 -55 -124 85 -203 36 -41 -60 -19 -45 -20 -107 -12 -109 -22 116 -103
5999 -103 147 7 88 167 -186 -171 5 168 339 18 -104 56 166 -243 -203 94 11 159 -143 26 -65 102
6021 102 83 83 26 74 94 -54 -129 -248 14 73 -128 -10 -130 94 248 -273 163 75 97 -1 58 60 98 -75 86
6046 86 -273 -179 129 -423 11 -106 -89 22 116 -100 -316 215 58 -155 -33 62 129 50 -206 -87 -89 141 -50
6069 -50 34 143 -54 49 207 43 89 -116 132 -247 123 -94 -56 51 -112 -219 -60 123 -137 -15 -88 -239
6091 -239 -131 67 20 -28 -150 131 -23 -207 91 208 65 145 117 240 -9 -17 165 -251 -80 165 105 31 -60
6114 -60 -86 88 -165 108 -170 1 -22 -201 -219 -70 -198 39 56 182 45 7 -149 30 -16 -142 204 -56
6136 -56 55 21 -220 212 -33 -107 180 -89 -100 92 16 146 393 -37 -149 -34 -75 -11 135 12 -44 306 52
$$ packed form
5974A99k17k37K58n8L3j5j6N8Q0j40o9K09k88K39p7j9M1k6K5q7R5r7Q7J38k19
5999a03K50j40Q1P9l53J5J76J63J71l21j22J60J10m09M0K97q3J48l02J69r1J67
6021A02j9%n7M8K0j48p5j19K62N9k01J18j20K24J54n21M36q8K2r8N9KL8j73J61
6046H6l59R4L08n52M34j17J7J11R4k16k16N31j57k13J22R5O7p9k56J19kK30j91
6069e0Q4J09j97J03J58j64M6k05K48l79L70k17L8J07j63j07J59J83k60J22p3j51
6091b39J08J98m7m8j22K81j54j84K98J17j43Q0k8J23k49qJ82m16J71K45o0p4r1
6114f0k6J74k53K73k78J71k3j79j8J49j28K37J7J26j37l8j56J79m6j26L46k60
6136e6J11l4k41M32k45p4K87k69j1J92p6J30K47m30j12J15m1O4J46j23n6L50k54
$$ plain form
6159 52 -65 103 55 -9 -43 -108 16 -21 4 120 -5 -26 3 129 -91 51 -94 110 -337 158 -127 122 284
6182 284 125 113 -177 36 -21 -2 -133 -24 -114 134 -64 304 95 -73 -157 152 -35 -103 70 -4 69 -289 59
6205 59 -77 174 -5 -262 93 67 242 -157 10 123 -149 -107 -11 -35 236 92 112 -120 39 58 191 136 112
6228 112 270 -36 173 -32 44 29 4 54 -141 -27 -21 261 -54 83 93 108 124 155 111 -89 204 115 -64 -63 145
6253 145 48 -195 3 -182 3 141 64 130 -281 -19 45 39 -256 7 36 -210 40 -57 -9 -113 28 -107 68
6276 68 90 121 -175 166 122 32 114 88 61 170 -20 90 31 -187 126 3 -15 24 -200 55 171 -27 -239 107
6300 107 160 62 -38 26 89 34 -42 13 122 132 -38 -34 -6 -59 62 -50 -174 -100 29 174 42 222 -62 -110 286
6325 286 -85 25 57 151 64 -22 -91 189 -80 -157 -44 144 23 24 87 -121 -164 76 74 -249 -187 78 379 67
$$ packed form
6159E2j17J68m8o4l4o5J24l7K5J16j25k1K9J26k20J42j45K04m47M95k85K49J62
6182B84j59j2k90K13n7J9j31J09r0K48j98L68k09j68q4L09j87o8J73p4P3l58L48
6205E9j36K51j79k57L55k6J75l99J67J13k72M2R6k4K71j44K0k32J59J9J33n5k4
6228A12J58l06K09k05P6j5k5N0j95J14OK82l15J37J0J5J6L1m4k00K93q9j79JK08
6253A45r7k43J98j85J85J38p7O6m11K62O4ok95K63K9k46K50r7M8j04J41j35J75
6276F8K2L1k96L41m4r0Q2k6k7J09j90J10n9k18L13j23j8L9k24K55J16j98k12L46
6300A07N3r8j00O4O3n5p6N5J09J0j70MK8n3J21j12j24P4J29J45j32J80k84m8L96
6325B86l71J10L2R4q7q6o9K80k69p7J13J88j21JO3k08m3K40kl23O2K65L01l12
$$ plain form
6349 67 84 317 88 65 49 -134 133 -35 -97 129 1 -13 58 71 -64 -213 47 38 -50 6 28 160 213 51 162
6374 162 -77 -12 -217 -35 -42 50 26 -62 -23 99 48 34 -73 -66 193 79 132 100 -27 15 77 -26 35 -206 160
6399 160 -217 -59 -317 -69 108 43 -180 -52 -9 -245 45 332 76 -2 -67 -150 98 215 19 34 248 114
6421 114 -78 -44 119 -94 -89 -125 121 -115 -154 202 243 251 228 324 89 -187 16 83 60 20 29 -253 -156 -47 -243
6446 -243 -62 -77 217 213 -7 47 15 -35 271 -36 -231 66 -39 -59 64 -376 38 -82 -21 -33 -59 52 -60
6469 -60 96 194 -93 70 42 16 -64 -158 95 97 -144 103 207 134 -50 -51 232 51 -96 -29 36 -149 -108 1 -78
6494 -78 -97 -32 -158 86 -130 35 194 9 -101 32 -23 -184 76 -7 4 70 25 -79 34 41 -163 -169 -292 -60
6518 -60 -244 94 51 -71 -148 -24 -104 167 19 39 5 -245 -37 201 87 -122 -424 244 -269 51 375 -65
$$ packed form
6349F7J7K33k29k3j6j83K67j68o2K26j28j4P1J3j35j49K60rq8N6K2J32N3j62J11
6374A62k39O5k05J82pR2k4q8L9J22n1j4j07PK59j14N3l2j27M2O2j03O1k41L66
6399A60l77J58k58K48J77o5k23J28M3k36K90K87k56p8o5q3K48J17j96J5K14j34
6421A14j92L4J63k13Nl6K46k36l9L56M1Qk3R6k35k76K03O7k3m0Rk82R7J09j96
6446b43J81j5K94mk20N4l2n0L06l07j95K97j05k0J23m40M14j20O1j2k6J11j12
6469f0J56R8k87J63k8k6q0r4K53Kk41K47J04p3j84jK83j81j47O7O5j85M1J09p9
6494g8j9O5j26K44k16J65J59j85j10J33n5j61K60q3J1O6m5j04J13Pk04oj23K32
6518f0j84L38m3j22p7J24q0K71j48K0l4k50K08K38j14k09l02O68n13L20L24m40
$$ plain form
6540 -65 11 -84 177 -156 271 -45 -171 -59 -67 19 132 111 -77 38 21 -17 -40 -86 -79 47 -65 -52 46 -35 159
6565 159 -116 114 -126 8 102 -79 -119 137 -30 22 188 63 69 36 -12 -52 62 92 57 12 73 159 -146 207
6589 207 107 -104 -113 46 29 -60 46 95 27 21 12 359 -149 150 104 -166 -34 -88 86 -283 145 221 38 -30 97
6614 97 115 148 219 -266 -281 -109 -101 -73 -49 -12 83 -77 155 126 192 -127 44 91 93 -90 110 236 -158 230 39
6639 39 -96 94 83 -100 105 -104 -191 311 29 -16 191 31 -47 -226 114 140 -178 -179 -196 -269 -23 -78 -7 -149
6663 -149 133 -87 -60 -205 -57 -216 -1 179 124 264 30 -151 -137 56 32 -91 164 -67 -88 27 89 -36
6685 -36 -59 -191 -117 209 -111 152 -37 112 61 211 -114 -78 39 -40 32 38 -21 243 -156 121 116 -371 128 117
6709 117 16 -156 -171 167 -273 -52 -163 98 299 147 0 79 130 -63 169 149 -127 29 3 56 -164 -67
$$ packed form
6540f5P6r5K61l33M27l16j26J12qQ6J13k1j88J15j7l8k3m6PJ26j12J3R8q1J94
6565A59k75K30k40J34R4j81m0K56j67N2J66j25Ol3m8m0J14L0l5m5O1Q6l05L53
6589B07j00k11rJ59j7q9J06M9o8orL47n08K99m6k70J32n4J74l69M28P6j83o8J27
6614I7J8L3P1m85j5J72QK8K4L7R5j60K32k9O6l19J71M7Kj83K00J26l94L88j91
6639C9j35J90j1j83K05k09q7N02k82m5K07j60p8j79L40K6l18jj7p3K46n5P1j42
6663a49K82k20K7j45J48j59K15J80n5J40k34j81J4J93k4j23K55k31k1J15O2j25
6685c6k3j32P4L26l20K63j89J49n1J50l25L6J17p9P2On9K64l99K77nm87M99j1
6709A17j01j72j5L38m40K21j11K61K01j52j47P9N1j93K32k0k76J56k6N3k20R7
$$ plain form
6731 -67 -251 185 59 215 -100 154 277 164 -78 -167 58 -86 182 -150 58 90 -40 -95 120 7 -224
6752 -224 406 125 8 46 -126 145 -144 -311 -265 -78 -123 -152 -105 -294 77 236 -14 -26 -94 -211 -68 -210
6774 -210 17 -74 69 -3 67 -75 -35 -179 -6 177 -18 -218 375 5 -18 177 -83 73 217 -105 183 117
6796 117 -271 55 -313 25 -183 53 57 -108 -215 5 108 -211 98 -27 190 -168 54 128 12 157 39
6817 39 9 -6 -114 -68 81 67 280 -39 183 57 14 88 5 -178 16 4 -57 19 24 186 129 -73 -84 -248 236
6842 236 200 288 266 3 36 301 -131 -46 122 -172 -161 -113 -203 24 -38 138 25 58 -175 235 118 1 -106
6865 -106 -133 61 -84 108 14 -77 -233 37 -44 -146 204 49 143 -13 259 -33 -329 271 53 -32 -212 192
6887 192 -1 -46 31 -65 -180 15 124 -144 3 -60 -172 184 -16 -70 -7 92 320 -24 -134 61 158 -98 196
$$ packed form
6731f7j84M36j26J56l15K54J23j13k42q9K25j44K68l32K08L2j30n5K15j13k31
6752b24O30k81j17L8j72K71k89j67M6J87m5k9M7j89L71J59k50j2o8j17J43j42
6774b10K27r1J43p2P0j42M0j44J73J83j95k00N93l70k3J95k60J56J44l22K88o6
6796A17l88L26l68L38k08K36Mj65j07K20J03l19L09j25K17l58K22P4j16J45j18
6817C9l0j5j08M6J49j4K13l19K22j26m3P4q3j83J94j2o1P6NJ62n7k02j1j64M84
6842B36l6Q8k2k63L3K65m32Q5J68k94J1M8r0K27o2J76j13L3k33M10j17j17j07
6865a06k7J94j45J92r4r1j56K70q1j02L50j55R4j56K72k92k96O00k18q5j80M04
6887A92j93m5P7r6j15J95J09k68J47o3j12L56k00n4O3R9K28l44j10J95R7k56K94
$$ plain form
6910 196 188 53 -89 129 -102 -46 247 194 129 69 -48 177 -203 1 182 -219 85 79 75 -66 -15 9 -159 160
6934 160 -134 -40 315 -23 -11 257 62 -211 236 75 29 -108 -10 -154 109 21 111 228 -132 38 -46 -55 -71
6957 -71 -29 8 159 96 -91 3 -69 -176 81 -74 -120 230 357 155 74 -37 -106 -51 249 -76 222 -38 -154
6980 -154 67 195 141 57 -127 -185 -73 295 130 57 -188 87 73 -53 -180 -24 7 -44 151 -288 166 -26
7002 -26 -51 42 113 -129 -219 3 249 87 -209 -75 95 -23 -33 56 39 44 75 124 170 189 25 -212 -17 91 -239
7027 -239 159 -106 -155 -71 -32 -173 -1 -418 -93 -143 -197 262 -61 39 -296 193 111 -108 52 26 370 193
7049 193 37 56 -15 89 -83 42 -351 171 184 109 -153 3 -28 -189 106 13 -137 -20 21 -91 -119 70 34
7072 34 -43 3 43 67 216 -75 90 -126 -33 -2 70 20 238 64 63 -9 -222 247 103 217 -74 -38 41 -127 125
$$ packed form
6910A96qj35j42K18k31N6K93n3o5o0j17K25l80K04J81m01L04omj41N1K4j68L19
6934A60k94R4L55l38J2K68j95k73M47j61m6j37R8j44K63q8R0J17l60J70q4rj6
6957g1M2L7J51o3j87R4p2j07K57j55m6L50J27k02q1j11o9N5L00l25K98k60j16
6980a54K21J28n4q4j84n8J12L68j65p3k45K75j4j26j27J56L1n1J95m39M54j92
7002b6k5R3P1k42r0K22K46j62k96J34J70j18j0Q9j7NL1M9M6J9j64k37J95J08l30
7027b39L98k65m9Q4L9j41J72m17L25n0n4M59l23J00l35M89q2k19J60k6L44j77
7049A93j56J9p1J04j72J25l93N22J3p5k62J56l1j61K95r3j50J17M1j12k8J89l6
7072C4p7M6M0K4J49k91J65k16R3L1P2n0K18j74jp2k13M69j44J14k91L6P9j68K52
$$ plain form
7097 125 80 9 244 -39 -87 -124 140 -76 -85 143 -190 17 84 -153 49 -23 37 -160 -149 -151 38 -33 4 70 -36
7122 -36 135 40 -234 -79 107 100 96 -2 118 -200 95 -175 -248 -190 26 -3 -75 -80 165 -4 109 -56 17 71 -244
7147 -244 82 241 -260 -125 127 -263 -119 16 -139 -57 109 -250 -8 20 -28 -156 158 -75 21 25 -81 19
7169 19 17 -176 -30 -40 -209 176 26 110 -104 234 -173 -21 228 151 -2 -147 -124 104 -68 -135 27 24 188
7192 188 -1 178 29 136 54 -253 -128 130 -206 -72 -21 -6 33 6 87 92 -17 2 358 8 140 9 231
7215 231 184 -91 -232 -36 -1 -24 138 -28 94 -38 110 73 -31 184 68 -261 -175 40 42 -120 -19 -70 -96
7238 -96 -190 43 72 140 -170 150 -53 58 -103 -37 220 -107 -61 -335 3 62 95 135 92 -56 130 54 87 83 128
7263 128 -76 166 152 74 -268 -98 39 103 100 107 -292 -32 185 -60 33 -75 193 1 174 31 211 239 -24
$$ packed form
7097A25m5p1K35k83m8l7K64k16rK28l33K07O7k37K02p2O0j97J1kJ89p1L7O6j06
7122c6J71r5k74J55J86pmr8J20l18K95k70p3N8K16k9p2nK45j69J13j65P3N4l15
7147b44L26J59n01J35K52l90J44J35j55Q2J66l59K42K8m8j28L14k33R6Mj06J00
7169A9kj93J46j0j69L85j50Q4k14L38m07J52K49p7j53j45K3K28j72o7J62lJ64
7192A88j89J79j49J07q2l07J25K58l36J34N1J5L9k7Q1Nj09J9L56l50J32j31K22
7215B31m7k75j41J96L5k3J62j66J22j32J48l7j04K15j16l29Q6K15Kj62J01n1k6
7238i6r4K33K9O8l10L20k03J11j61O6K57l27M6k74L38N9L3M0m3j48J86p6L3mM5
7263A28k04K42j4p8l42J70J37O4lPl99K60K17k45R3j08K68j92J73j43J80K8k63
$$ plain form
7286 -24 -238 -206 -236 185 74 -131 53 107 -155 201 65 93 -161 -163 123 3 131 -196 162 -90 159 158 218
7309 218 -33 -14 -76 -83 11 -104 -131 11 107 -310 -149 -143 -7 82 -154 -97 166 190 10 130 -148 42 -34 -78 62
7334 62 5 66 -399 82 179 34 -264 67 115 82 35 -104 41 16 -72 232 -58 -11 172 -10 -133 -170 6 -179
7358 -179 -208 138 136 178 -52 18 -181 54 129 -51 208 -218 122 -65 -127 37 -179 37 73 161 48 -8 189
7381 189 59 42 -144 -180 179 -130 3 -43 -105 -79 -14 -188 -92 82 108 92 -85 -227 79 11 53 -34 -11 56 41
7406 41 181 -117 4 -94 -57 -85 -67 -20 13 -186 65 -35 -184 -157 -45 -112 -237 90 -269 223 -105 -79 67
7429 67 18 -25 -115 -89 69 172 100 26 110 241 -147 107 -56 -137 -45 300 265 -65 -153 -85 -177 -251 -73 202 -181
7454 -181 32 -88 130 62 46 -76 -26 111 -208 140 80 1 133 -85 62 -100 104 118 63 93 -131 -232 -16
$$ packed form
7286b4k14L2l0M21j11k05J84N4k62L56j36K8k54kK86j20J28l27L58k52K49jO0
7309B18k51J9o2pR4j15k7J42R6m17J61OJ36Q9k36N7K63K4j80J20k78J90p6m4J40
7334F2n7O1m65M81R7j45k98L31M8l3m7j39J45k5q8L04k90M7J83j82j23l7J76j85
7358a79k9L46kM2k30P0j99K35P5j80K59m26L40j87o2J64k16K16L6Q8j13n6J97
7381A89j30j7j86l6L59l09J33m6o2K6O5j74R6J74K6j6j77j42L06o8M2q7K3O7j5
7406D1J40k98J21r8L7k8J8M7L3j99K51j00j49K7J12o7j25L27l59M92l28K6J46
7429F7m9m3r0K6J58J03p2p4Q4J31l88K54j63q1R2L45l5l30q8O8r2p4J78K75l83
7454a81K13j20K18o8j6j22N0J37l19L48o0p9J32k18J47j62K04J4n5L0k24j01K16
$$ plain form
7477 -16 -226 -262 -375 -60 154 -93 -152 100 -84 -36 54 -31 -58 44 145 134 225 -184 178 -174 227 260 -195
7500 -195 -92 78 -80 76 12 143 3 -67 -287 -174 -293 -20 235 -42 81 -170 -311 -83 -9 136 161
7521 161 128 78 79 -107 92 66 -119 164 -180 146 82 14 25 -3 130 186 -126 218 -16 -165 6 89 -34 192
7545 192 -214 210 -113 -7 1 -79 95 -94 -323 -99 42 221 20 -144 219 -244 -67 -77 43 -254 352
7566 352 -28 -103 -234 136 -37 -231 204 17 -193 -136 131 -180 108 75 -250 -32 30 -276 116 48 89 -22
7588 -22 44 -47 118 10 -1 250 13 -3 41 152 161 18 -29 62 149 -113 -58 -7 42 34 -89 83 100 -74 143 -59
7614 -59 -22 -257 -62 -142 76 -43 -48 6 11 -5 -210 -9 135 -7 182 107 -110 32 -113 27 -7 -202 276 98
7638 98 -77 97 127 60 85 179 163 -47 -15 185 -124 95 203 -129 23 -198 139 -18 -168 -221 226 -51 24
$$ packed form
7477a6k10l6j13L15K14k47n9K52j84M8R0q5k7J02J01j1R1m09L62l52M01L3m55
7500a95J03J70j58J56o4J31j40p0k20J13j19K73K55k77J23k51j41K28P4J45K5
7521A61l3n0Jj86J99k6j85K83l44L26o4o8J1k8J33N6l12L44k34j49J71Q3j23K26
7545A92m06M24l23J06Qq0J74j89k29K24J41J79k01j64L63m63J77j0J20k97O06
7566C52l80p5j31L70j73j94M35j87k10N7K67l11K88l3l25K18O2l06L92o8M1j11
7588b2O6r1J65j08j1K51k37j6M4J11Rj43m7R1Q7k62N5N1M9qj23J72J7j74K17k02
7614e9L7k35J95q0K18j19nN4Nj6k05K01J44j42J89p5k17J42j45J40l4j95M78j78
7638I8j75J74L0o7K5R4j6k10L2K00l09K19J08l32J52k21L37j57j50n3M47k77P5
$$ plain form
7661 24 -7 -9 126 -292 -249 -30 -36 -35 50 25 267 47 -278 21 27 -109 -30 -82 23 4 15 7 43 -14 -234 244 -66
7688 -66 -30 -48 -113 -205 -107 167 -23 -108 -59 -168 179 85 -206 135 -57 -1 8 -52 -211 108 -36 -32 3 -24 -244 -82
7714 -82 -33 -204 -123 29 -126 -248 -133 231 -193 -151 -118 -70 -66 -13 -235 -369 95 -200 -156 -17 -127 87 15 75
7738 75 -177 198 63 -196 5 -83 -17 -173 -136 42 -114 295 86 55 13 24 20 179 -239 37 46 95 95 85 216
7763 216 -196 -96 -84 -19 -309 214 -102 -167 38 211 189 -75 -322 -39 145 62 -122 -102 160 41 -87 -105
7785 -105 180 -109 28 7 -82 14 102 -119 -34 -159 -88 -106 87 -245 -62 64 -43 -75 5 46 -26 178 -216 -21
7809 -21 -223 -228 -67 -87 67 -107 207 -115 38 126 -115 181 90 -104 6 -139 -18 -201 88 -40 112 -107
7831 -107 -210 -71 165 -273 128 -71 -135 -34 -58 184 5 -208 -85 66 -70 -80 30 -178 -26 31 55 44
$$ packed form
7661B4l1kJ35m18M3K19oJQ5k5K42k20l25K99Oj36P9n2J05j9J1qL6n7k20M78l10
7688f6L6j8o5r2R8K74j90q5M9j09L47r4k91L41j92N6Ro0j59L19j44ML5k7k20J62
7714h2M9j71Q1J52j55j22J15L64m24M2L3M8MN3k22j34M64k95M4J39j10K14p2O0
7738G5k52L75j35k59K01q8O6j56L7J78j56M09k09l1m2J1mJ59m18K76RM9%j0J31
7763B16m12J00J2O5k90N23l16o5K05J73k2k64k47K83J84q3j84K0K62j19j28j8
7785a05K85k89J37k1q9R6Q8k21Q5j25P1j8J93l32J83J26j07l2Q0M1p2K04l94J95
7809b1k02nJ61k0J54j74L14l22J53Q8k41K96r1j94J10j45J21j83K89j28J52k19
7831a07j03J39K36m38M01j99o4J01k4K42j79k13J23J51j36j0J10k08J52N7K4j1
$$ plain form
7853 44 93 82 97 104 -14 -20 -160 -10 -84 26 -136 7 153 173 140 79 90 91 -276 13 -2 -209 152 177 -231 -39
7879 -39 30 -25 -55 -314 -30 -18 137 194 9 -125 -39 212 23 -47 -32 141 119 83 77 112 -46 -141 20 -46 -56 -111
7905 -111 104 -113 72 315 277 -174 8 99 -18 -347 -13 -76 90 -33 -96 -38 127 162 -210 117 111 -118 -80
7928 -80 -217 -9 104 -201 88 296 260 -77 -118 73 -397 -220 -43 -13 168 -4 -54 167 42 59 -244 63
7950 63 -9 -19 42 -214 32 -74 112 -11 88 100 -90 241 -206 45 51 -173 -18 -18 45 104 88 275 -56 43 -22
7975 -22 11 -40 77 -100 73 54 -46 78 -198 -78 37 -145 -50 -134 25 73 70 184 79 -453 -39 39 130 -9
7999 -9 -99 20 -236 -93 -86 -132 -504 -89 23 33 148 245 236 157 -91 28 -34 -132 -44 68 -164 -13 35 193 124
8024 124 -73 84 -98 1 94 -188 131 -58 78 -65 119 42 153 -33 24 -75 130 50 -223 81 99 -99
$$ packed form
7853D4M9j1J5Pj18oj40J50p4J10j62J43J46K0l3o1J1Jl67K89j5k07L61K5m08J92
7879c9O9n5l0k59K84J2J55N7j85j34Q6K51j89p0J5J73k2l6oL5j58r5J61o6j0n5
7905a11K15k17J85K43l8m51J82R1j17l29L34o3J66j23o3N8J65L5l72L27ok29L8
7928h0j37K08J13l05K89K08l6l37m1J91m70J77J77L0J81j72n0K21j25J7l03L07
7950F3p2j0O1k56K46j06J86j23R9J2j90L31m47K51Ok24J55%O3N9j6J87l31R9o5
7975b2L3n1J17j77J73j9j00J24k76J20J15j82R5q4J59M8lJ14j05n32M14P8R1j39
7999ir0J19k56J43Pm6l72M15J12J0J15R7rp9k48J19o2r8Q8J12k32J51M8J58o9
8024A24j97J57j82R9R3k82L19j89J36j43J84p7J11j86N7r9K05q0k73L04J8j98
$$ plain form
8046 -99 88 -150 -176 -39 -197 100 -129 -106 -428 225 -104 -26 -8 216 -75 82 83 -104 8 3 204 -69 -257
8069 -257 36 -163 -118 166 100 96 -24 -101 23 -96 99 1 -167 -125 -112 24 -113 5 175 247 34 65 193
8092 193 -112 4 -79 146 -160 173 -105 84 28 355 51 -77 -393 172 137 284 133 -133 -182 -119 -148 -256
8114 -256 -19 56 155 -101 -7 65 102 -232 13 -125 -77 98 29 -14 -9 -305 16 -121 -65 141 8 -19 -102 -5 -162
8139 -162 -129 172 -19 -222 -7 -101 20 152 -8 -164 -212 122 43 -92 -34 -52 -166 207 -59 -87 -158 -120 -1
8162 -1 -129 -130 -151 -18 43 -109 -204 -317 -49 -159 197 173 -73 52 -40 -217 -194 -133 -89 -18 13 -75 -98 259 -81
8187 -81 -109 -20 65 -22
$$ packed form
8046i9J87k38k6J37j58K97k29K3l22O53l29P8J8K24k91J57Jj87J12nK01k73j88
8069b57K93j99M5K84o6mj20p7J24j19J95r8j68M2J3J36j37J18J70P2k13L1J28
8092A93l05J16q3K25l06L33k78J89n6L27l04j28l16N65l5J47j51k66m9O3k9j08
8114b56K37P5R9k56R4P2L7l34K45j38M8J75o9m3Nk96L21j37N6K06j33k7q3R7j57
8139a62L3L01j91k03K15r4J21J32j60j56m8L34p9j35N8j8j14L73k66k8p1L8J19
8162aj28jk1J33O1j52r5j13K68j10L56k4k46J25r2j77K3O1M4P1L1q8k3L57l40
8187h1k8Q9Q5q7
8191b2
$$ Imaginary data points
##PAGE= N=2
##DATA TABLE= (X++(I..I)), XYDATA
$$ plain form
0 0 0 0 0 0 0 0 0 0 0 0 0 0 8 -8 8 -8 16 -16 24 -24 32 -40 48 -56 64 -72 87 -97 113 -129 151 -169 193 -218
34 -218 248 -280 313 -352 392 -437 486 -540 602 -666 736 -813 896 -990 1091 -1202 1324
51 1324 -1459 1607 -1773 1958 -2168 2405 -2677 2993 -3363 3806 -4347 5025 -5904 7089 -8788
66 -8788 11436 -16183 27334 -112505 -6572 101080 -89142 12921 -92652 -121475 99529
77 99529 48299 -102632 -18692 -45273 -1002 88044 -37214 -84559 17069 9431 29831 11046
89 11046 -61094 -13632 30157 16600 17456 -40006 -26162 30832 8584 12234 -5619 -50910 19876
102 19876 32474 -20852 10626 -14519 -36726 46521 13632 -35446 16748 -16897 -10252 56679
114 56679 -17435 -32465 28313 -8935 14133 37197 -35718 -8472 33489 1619 20521 5692
$$ packed form
0@%%%%%%%%%%%%Qj6J6j6K4l2M0m8N6p2Q8j04J20j36J59j84K10k42K80l20L62m11
34b18M66n28N93o65P44q29R23j026J142j268J402j549J709j886K081k293K526
51A324k783L066l380L731m126M573n082N670o356P169q153R372j0929J2993j5877
66h788K0224k7619M3517j39839J05933J07652j90222J02063j05573k8823K21004
77I9529n1230j50931Q3940k6581M4271Q9046j25258m7345J01628p638K0400j8785
89A1046p2140M7462M3789j3557Q56n7462J3844N6994k2248L650j7853m5291P0786
102A9876J2598n3326L1478k5145k2207Q3247l2889m9078N2194l3645O645O6931
114E6679p4114j5030O0778l7248K3068K3064p2915K7246M1961l1870J8902j4829
$$ plain form
126 5692 -32342 22099 31894 -5149 8599 -9019 -8223 37098 6803 -13327 6838 -6964 15963
139 15963 23430 -20066 -3891 12455 -782 15509 -3138 -20443 15085 10084 -8112 5677
151 5677 -9867 -6805 21090 -5684 -14015 7194 -7536 3234 10756 -20404 -3775 11863 -7681
164 -7681 643 -1543 -13408 7498 6134 -9150 -220 -3212 -3998 10525 -2289 -11035 4108 -887
178 -887 613 6317 -8714 -2217 6791 -1986 4926 1043 -7346 4655 4792 -396 2893 -3673 -2917
193 -2917 7545 1294 -2394 2569 -3960 989 9677 -1876 -2474 1856 -1069 8744 5159 -6296 1757
208 1757 3624 3075 8184 -572 -4631 4173 6659 4259 2608 -3999 -473 9740 4184 -353 -383 -3140
224 -3140 5749 8500 -1129 -1803 -2239 2543 9045 2260 -3955 -1724 2326 6164 3995 -2350 -3878 1396
$$ packed form
126E692l8034N4441R795l7043J3748j7618P96M5321l0295k0130K0165j3802K2927
139A5963P467m3496J6175J6346j3237J6291j8647j7305L5528n001j8196J3789
151E677j5544L062K7895k6774q331K1209j4730J0770P522l1160J6629J5638j9544
164g681Q324k186j1865K0906j364j5284Q930k992p86J4523j2814q746J5143m995
178h87J500N704j5031O497R008q777O912l883q389J2001J37n188L289o566P56
193b917J0462o251l688M963o529M949Q688j1553n98M330k925R813l585j1455Q053
208A757J867n49N109q756m059Q804K486k400j651o607L526J0213n556m537l0k757
224c140Q889K751r629o74m36M782O502o785o215K231M050L838k169o345j528N274
$$ plain form
240 1396 4980 4213 -539 -6028 710 6296 3520 725 -4327 -1212 7373 4604 702 -2182 -2816 5004
256 5004 7382 1043 -3173 -1511 2999 6675 3216 -3472 -1908 4121 4351 3871 -418 -3435 2994 5675
272 5675 3571 -166 -2414 1563 5269 4697 446 -1817 1742 3639 4353 2790 -2066 -215 4159 4278
288 4278 2116 -806 -443 1682 3903 2583 -366 682 1155 2326 3497 -124 -449 1456 1561 1892
304 1892 200 -611 -83 936 2136 18 49 -431 -974 2552 1356 -1018 -670 -437 1220 822 405 -892
322 -892 -1088 580 -282 227 -237 -2302 513 221 -1726 406 -260 -1126 -613 -217 -148 -804 -477 -1480 -530
341 -530 1120 -947 -1644 -1459 -666 1574 411 -2031 -2751 -897 1780 422 -1010 -2681 -1998 2530 731
358 731 -1437 -1659 -1940 519 2133 26 -2233 -1601 786 1511 799 -1522 -2990 581 1248 744 -483
$$ packed form
240A396L584p67m752n489O738N586k776k795n052L115Q585k769l902k884o34P820
256E004K378o339m216J662M510L676l459o688J564O029K30m80m289l017O429K681
272E675k104l737k248L977L706n72m251k263L559J897P14j563m856J851M374J19
288D278k162k922L63K125K221j320k949J048M73J171J171l621l25J905J05L31
304A892j692q11N28J019J200k118L1m80n43L526j196k374L48K33J657l98m17j297
322h92j96J668q62N09m64k065K815k92j947K132o66q66N13L96O9o56L27j003R50
341e30J650k067o97J85P93K240j163k442p20J854K677j358j432j671O83M528j799
358G31k168k22k81K459J614k107k259O32K387P25p12k321j468L571O67n04j227
$$ plain form
375 -483 -3452 -992 2450 1245 -842 -3512 -1741 1318 1766 -382 -3563 -2470 346 1188 86 -3737
391 -3737 -3558 -778 1429 76 -3907 -4040 -1395 350 835 -3726 -4875 -1848 -282 975 -2569 -5698
407 -5698 -3324 513 902 -2837 -4927 -3539 -505 1398 -1968 -4600 -3748 -1339 2172 -340 -4738 -3468
423 -3468 -1399 1394 305 -3377 -3486 -1557 883 987 -2220 -3655 -2527 960 859 -2337 -3296 -3230 562
440 562 977 -2076 -2789 -3134 -510 1154 -1296 -3215 -3337 -921 1074 -959 -3296 -3039 -762 673 -566
457 -566 -2111 -3051 -799 1242 90 -1131 -3070 -815 2079 -64 -1256 -1611 -1658 1611 1058 -1284 -1530
474 -1530 -943 525 779 -368 -2619 -1406 792 -189 -630 -1589 -2336 903 310 -1045 -877 -1504 206
491 206 1117 61 -1327 -1121 801 875 74 -1128 -1269 588 1237 423 -262 -1005 1157 1498 762 341 -852
$$ packed form
375d83k969K460L442j205k087k670J771L059M48k148l181J093K816Q42j102l823
391c737J79K780K207j353l983j33K645J745M85m561j149L027J566J257l544l129
407e698K374L837L89l739k090J388L034J903l366k632Q52K409L511k512m398J270
423c468K069K793j089l682j09J929K440J04l207j435J128L487j01l196r59O6L792
440E62M15l053p13l45K624J664k450j919j22K416J995k033k337K57K277J435j239
457e66j545r40K252K041j152j221j939K255K894k143j192l55m7L269n53k342k46
474a530N87J468K54j147k251J213K198r81m41r59p47L239n93j355J68o27J710
491B06R11j056j388K06J922P4q01j202j41J857O49q14o85p43K162L41p36m21j193
$$ plain form
510 -852 1713 2692 540 107 -224 978 3054 1622 -345 -136 1712 2635 2934 1262 -1246 1718 3956
527 3956 2214 1772 -178 817 3691 2973 1326 285 868 3401 4257 2016 -353 1352 3879 3613 1961
544 1961 -264 639 3320 3374 2511 153 -11 3098 3601 2720 168 -557 2822 3898 2268 255 -451
561 -451 1560 3528 2611 -601 -953 1137 2655 3219 -675 -2555 1474 2382 2033 793 -2152 -330 2668
578 2668 1885 335 -1878 -1438 1914 3062 -265 -1889 -519 623 2123 1134 -2640 -1487 356 1533
594 1533 1265 -2359 -2233 418 1186 1057 -1801 -2977 4 1518 857 -1701 -2601 -736 1237 1279 -1864
611 -1864 -2410 -784 1071 2108 -1349 -2161 128 1207 2194 198 -1873 -120 1680 2257 1122 -1243
627 -1243 -818 1880 2759 596 -538 -345 467 3005 1161 -993 -152 512 2274 2010 -577 -861 310
$$ packed form
510h52K565R79k152m33l31J202K076j432j967K09J848R23K99j672k508K964K238
527C956j742m42j950R95K874p18j647j041N83K533Q56k241k369J705K527k66j652
544A961k225R03K681N4q63k358j64L109N03q81k552p25L379J076j630k013p06
561d51K011J968r17l212l52K090J518N64l894j880M029R08l49j240k945J822K998
578B668p83j550k213M40L352J148l327j624J370J142J500r89l774J153J843J177
594A533k68l624J26K651P68j29k858j176K981J514o61k558r00J865J973M2l143
611a864n46J626J855J037l457q12K289J079R87j996k071J753J800N77j135k365
627a243M25K698Q79k163j134J93Q12K538j844k154Q41O64J762k64k587k84J171
$$ plain form
644 310 1927 1632 -166 -918 92 1773 1624 -125 -605 -547 1550 1963 -113 -712 -612 1248 1900 173
662 173 -576 -435 880 1932 622 -683 -1020 1015 1955 763 -1368 -1474 162 1373 22 -467 -1864
679 -1864 -1071 1567 184 -1258 -1278 -1162 522 708 -1411 -1951 -963 -37 -134 -353 -2282 -2134 208 -77
697 -77 -998 -1639 -2688 -216 268 -1112 -1535 -2129 -1082 67 -433 -1842 -2443 -845 223 -134 -1326 -2538
715 -2538 -907 64 -571 -1241 -2702 -1234 -117 -188 -535 -2915 -1509 675 -337 -867 -1830 -2203 -99
732 -99 132 -1215 -2101 -1520 -870 21 139 -2659 -1844 -265 -372 142 -1481 -2474 -326 -179 -312 -1283 -1953
751 -1953 -1203 184 219 -1338 -1965 -956 -121 373 -1066 -2248 -1389 -353 550 -963 -1775 -1138 -519 831
769 831 -128 -2127 -984 -342 423 -6 -1492 -1517 -294 786 -184 -1335 -1111 -1012 955 459 -1604 -1066
$$ packed form
644C10J617k95j798p52J010J681j49j749m80N8K097M13k076n99J00J860O52j727
662A73p49J41J315J052j310j305l37K035R40j192k131j06J636J211j351m89j397
679a864P93K638j383j442k0J16J684J86k119n40R88R26r7k19j929J48K342k85
697g7r21o41j049K472M84j380m23n94J047J149n00j409o01J598J068l57j192j212
715b538J631R71o35o70j461J468J117p1l47k380J406K184j012n30r63l73K104
732i9K31j347q86N81O50Q91J18k798Q15J579j07N14j623r93K148J47j33r71o70
751a953P50J387L5j557o27J009Q35M94j439j182Q59J036R03j513q12O37O19J350
769H31r59j999J143O42P65m29j486k5J223J080r70j151K24R9J967m96k063N38
$$ plain form
787 -1066 -630 93 808 -1093 -890 -589 391 667 -553 -706 -1003 694 1071 -421 -781 -593 2 946 80
806 80 -697 -421 307 854 258 -335 -559 165 1240 151 -388 -80 -395 964 406 -86 -522 37 822 784
826 784 305 -347 -270 970 443 -167 333 -233 773 733 19 -332 -284 684 953 488 -40 -264 919 726
846 726 159 482 -349 630 847 116 431 -116 611 968 512 252 -233 782 910 532 377 100 708 1164
866 1164 854 398 261 630 845 545 778 158 831 1367 720 643 455 588 1283 1090 386 735 815 1284 814
887 814 811 529 957 1370 1083 641 657 611 1329 1127 864 777 466 1076 998 898 580 729 1461 1125 750 792 656
910 656 1335 1182 748 631 214 1227 1386 688 601 72 1281 1081 714 604 233 755 895 454 341 281
930 281 922 1051 734 202 -115 741 1188 234 385 -283 104 961 85 -75 -237 -23 709 532 77 -588
$$ packed form
787a066M36P23P15j901K03L01R80K76j220j53k97J697L77j492l60J88N95R44q66
806H0p77K76P28N47n96n93k24P24J075j089n39L08l15J359n58m92m36N59P85l8
826G84m79o52P7J240n27o10N00n66J006m0p14l51M8R68K69m65n28k24J183j93
846G26n67L23q31R79K17p31L15n47P27L57m56k60m85J015J28l78j55k77O08M56
866A164l10m56j37L69K15l00K33o20O73N36o47p7j88J33O95j93p04L49Q0M69m70
887H14lk82M28M13k87m42J6m6P18k02k63q7l11O10p8j00l18J49P32l36l75M2j36
910F56O79j53m34j17m17J013J59o98q7n29J209k00l67j10l71N22J40m41j13o0
930B81O41J29l17n32l17Q56M47r54J51o68L87Q57q76j60j62K14P32j77m55o65
$$ plain form
950 -588 118 808 169 386 -831 -398 645 326 139 -377 -233 871 717 -194 -650 -294 484 -92 46
969 46 -514 -1040 87 375 -238 -702 -786 -21 -6 273 -712 -827 241 -26 129 -169 -1275 -208 415 -356
989 -356 -430 -1058 -522 -107 44 -282 -1042 -211 -117 388 -340 -1131 -279 -109 -97 -104 -1008 -832 38 9 -173 -1139
1011 -1139 -912 -260 -150 108 -957 -990 -114 -70 -226 -764 -822 -662 51 -268 -1124 -634 -171 -572 72 -751
1031 -751 -1165 -307 -378 -36 -713 -1486 -743 -196 -339 -1004 -674 -611 -122 198 -773 -921 -367 -423 241 -563 -950
1052 -950 -364 -195 -233 -318 -1288 -590 -492 -214 -213 -879 -755 -299 155 -484 -908 -709 -396 74 -329 -880 -576 -866
1074 -866 190 26 -1186 -910 -698 55 -220 -841 -862 -563 110 48 -801 -1067 -822 228 233 -676 -537 -517 -100
1095 -100 640 -606 -495 -823 -129 647 -397 -961 -566 -99 58 -472 -879 -688 10 144 -312 -613 -927
$$ packed form
950e88P06O90o39K17j217M33J043l19j87n16J44J104j54r11m56L56P78n76J38
969D6n60n26J127K88o13m64q4P65J5K79r85j15J068k67J55k98j106J067O23p71
989c56p4o28N36M15J51l26p60Q31R4N05p28p91Q52J70J2pr04J76Q70k9j82r66
1011a139K27O52J10K58j065l3Q76M4j56n38n8J60P13l19q56M90M63m01O44q23
1031g51m14Q58p1L42o77p73P43N47j43o65L30O3M89L20r71j48N54n6O64q04l87
1052i50N86J69l8q5r70O98R8K78Jo66J24M56M54o39m24J99L13M70m03n51L04k90
1074h66J056j64j212K76K12P53k75o21k1K99O73o2q49k66K45J050Nr09J39K0M17
1095a00P40j246J11l28O94P76j044n64L95M67J57n30m07J91O98J34m56l01l14
$$ plain form
1114 -927 -405 341 -128 -698 -698 -674 340 163 -681 -607 -650 302 293 -506 -808 -222 133 350 -196 -745 -440 522
1136 522 582 -312 -395 -669 395 628 76 -340 -678 251 821 51 -411 -547 332 788 420 -79 -565 124
1156 124 958 227 52 -520 129 617 423 74 -621 -15 1033 371 359 83 35 1058 749 319 -184 60
1176 60 853 963 550 -48 149 665 750 651 136 -170 803 924 522 198 -38 713 1009 878 216 137 812
1197 812 1060 858 467 -116 565 970 1022 458 204 355 951 736 349 -79 672 899 663 879 -59 554
1217 554 709 681 882 -163 350 573 1136 876 142 173 621 647 725 242 121 913 769 473 44 172 237
1238 237 450 698 266 -140 646 575 824 270 -99 324 330 808 127 277 199 855 780 48 118 220 409 698
1260 698 386 -212 294 156 661 524 -289 -102 324 542 453 -182 -55 196 394 364 203 -313 73 280 461
$$ packed form
1114i27N22P46m69n70%K4J014j77q44P4m3R52rp99l02N86L55K17n46n49L05R62
1136E22O0q94q3k74J064K33n52m16l38R29N70p70m62j36Q79M56l68m99m86O89
1156A24Q34p31j75n72O49M88j94l49o95O06J048o62j2k76m8J023l09m30n03K44
1176F0P93J10m13n98J97N16Q5r9n15l06R73J21m02l24k36P51K96j31o62p9O75
1197H12K48k02l91n83O81M05N2n64k54J51N96k15l87m28P51K27k36K16r38O13
1217E54J55k8K01j045N13K23N63k60p34L1M48K6P8m83j21P92j44k96m29J28O5
1238B37K13K48m32m06P86p1K49n54l69M23OM78o81J50p8O56p5p32P0J02J89K89
1260F98l12n98N06j38N05j37q13J87M26K18q9o35J27K51J98l0j61n16L86K07J81
$$ plain form
1281 461 -119 -198 -287 397 435 -304 -216 -185 -8 221 -65 -127 -202 38 400 -235 -462 -277 226 231 -250 -389 -574
1304 -574 -39 271 -44 -458 -622 -248 299 147 -391 -308 -90 127 60 -429 -421 -6 355 -135 -221 -463 -372 137
1326 137 -97 -384 -443 -767 274 -27 -270 -464 -590 -90 -8 -259 -500 -533 -223 63 -171 -446 -951 -106 -147
1347 -147 -264 -235 -892 -235 181 -230 -390 -794 -373 64 -382 -399 -672 -684 -182 -193 -419 -908 -568 50 -42 -395
1369 -395 -1053 -678 -114 -157 -270 -730 -795 -116 -276 -344 -511 -752 -336 -320 -398 -752 -1012 -150 -169 -256 -536 -357
1391 -357 -323 -218 65 -662 -593 -280 -514 -51 -439 -734 -550 141 50 -288 -548 -812 -298 -29 -71 -613 -247
1412 -247 -116 -55 -148 -605 -305 -137 -139 -78 -454 -204 -173 16 58 -541 -307 -68 -53 227 -335 -70 -74 -249 -10
1435 -10 -104 -407 -144 -47 292 -303 -80 -202 -255 201 -157 -237 -72 -73 161 70 -6 -192 38 -13 -36 -283 72 78
$$ packed form
1281D61n80p9q9O84L8p39Q8L1J77K29k86o2p5K40L62o35k27J85N03Nm81j39j85
1304e74N35L10l15m14j64L74N47j52n38Q3K18K17o7m89QM15L61m90q6k42R1N09
1326A37k34k87n9l24J041l01k43j94j26N00Q2k51k41l3L10K86k34k75n05Q45m1
1347a47j17K9o57O57M16m11j60m04M21M37m46j7k73j2N02j1k26m89L40O18r2l53
1369c95o58L75N64m3j13m60o5O79j60o8j67k41M16J6p8l54k60Q62j9q7k80J79
1391c57L4J05K83p27O9L13k34M63l88k95J84O91r1l38k60k64N14K69m2n42L66
1412b47J31O1r3m57L00J68kO1l76K50L1J89M2n99K34K39J5K80n62K65mj75K39
1435a0r4l03K63R7L39n95K23j22n3M56l58q0J65jK34r1p6j86K30n1k3k47L55O
$$ plain form
1459 78 260 152 -3 97 463 291 122 166 109 4 396 279 53 45 -196 303 66 71 21 87 320 344 90
1482 90 280 129 182 153 -77 277 178 92 173 0 176 395 216 97 318 296 47 253 209 276 251 187 105 559
1506 559 142 36 335 165 -3 89 414 199 132 308 145 38 331 406 374 173 489 416 174 558 92 272
1528 272 230 430 628 368 404 772 488 616 259 45 352 450 620 368 309 220 601 549 20 223 294 171
1550 171 719 323 163 -57 102 570 470 94 258 21 443 279 48 -157 207 601 390 214 326 287
1570 287 567 410 80 93 293 574 366 82 211 56 492 795 124 202 107 206 270 173 -88 144 296 527
1592 527 209 301 35 28 302 0 172 5 90 241 572 30 -231 109 330 -96 -36 -217 185 173 106 -158
1614 -158 -167 -154 79 55 -182 -12 -238 14 -73 147 167 -376 188 -34 -103 -87 -159 -18 68 45 -288 -44 86 -99
$$ packed form
1459G8J82j08j55J00L66j72j69M4n7j05L92j17k26qk41M99k37Nn0O6K33K4k54
1482I0J90j51N3k9k30L54r9q6Q1j73J76K19j79j19K21k2k49K06m4O7k5o4q2M54
1506E59m17j06K99j70j68R2L25k15o7J76j63j07K93P5l2k01L16p3k42L84m66J80
1528B72m2K00J98k60L6L68k84J28l57k14L07R8J70k52n9q9L81n2n29K03P1j23
1550A71N48l96j60k20J59M68j00l76J64k37M22j64k31k05L64L94k11j76J12l9
1570B87K80j57l30J3K00K81k08k84J29j55M36L03o71P8r5R9O4r7k61K32J52K31
1592E27l18R2k66pK74l02J72j67Q5J51L31n42k61L40K21m26O0j81M02j2o7k64
1614a58rJ3K33k4k37J70k26K52q7K20K0n43N64k22o9J6p2J41Q6k3l33K44J30j85
$$ plain form
1638 -99 -208 -218 -116 -1 234 -144 -125 -383 -105 -132 -97 -140 -354 -352 -115 -86 148 -473 -148 110 -93 -49 -212
1661 -212 -141 -309 -147 -171 -503 -232 -253 -196 -95 -224 -182 -356 -191 -212 -349 -469 -434 -467 -263 -471 -360 -237 -474
1684 -474 -365 -292 -697 -596 -272 -297 -337 -445 -341 -262 -246 -296 -564 -281 -321 -469 -224 -441 -152 -463 -101 -123 -261
1707 -261 -241 -177 -266 -652 -518 -407 -58 -281 -51 -375 -275 -204 -110 -165 -419 -268 -544 -344 -310 -657 -368 -122
1729 -122 -258 -327 -441 -202 -77 -239 164 -307 -298 -310 -192 155 -104 -325 -116 58 101 -295 -310 -108 -49 83
1751 83 -351 -249 -147 -123 -212 -58 -86 79 -52 34 -216 -169 -104 -103 -1 -69 -287 19 -61 -85 7 -11 93 -187 -69
1776 -69 96 -190 -54 -216 -121 -34 7 60 157 44 251 -71 33 13 46 -298 30 -17 -43 142 104 70 135 -66
1800 -66 -133 90 164 151 155 -99 175 4 262 -14 390 322 203 212 486 276 150 97 400 311 105 292 150 5
$$ packed form
1638i9j09j0J02J15K35l78J9k58K78k7L5m3k14KK37K9K34o21L25K58k03M4j63
1661b12P1j68J62k4l32K71k1N7J01j29M2j74J65k1j37j20L5l3K04k08J11J23k37
1684d74J09P3m05J01L24k5m0j08J04P9J6n0k68K83m0j48K45k17K89l11L62k2j38
1707b61K0O4q9l86J34J11L49k23K30l24J00P1R4n5k54J51k76K00L4l47K89K46
1729a22j36o9j14K39J25j62M03m71Rj2J18L47k59k21K09J74M3l96j5K02N9J32
1751H3m34J02J02K4q9J54k8J65j31Q6k50M7O5JJ02o8k18L06q0k4R2j8J04k80J18
1776f9J65k86J36j62R5Q7M1N3R7j13K07l22J04k0L3l44L28m7k6J85l8l4O5k01
1800f6o7K23P4j3Mk54K74j71K58k76M04o8j19RK74k10j26n3L03q9k06J87j42j45
$$ plain form
1824 5 -106 59 307 268 380 91 176 136 85 199 70 236 158 189 179 -86 250 282 97 336 283 198 264 6
1848 6 304 333 192 263 310 212 311 164 335 336 248 505 158 176 330 334 447 168 91 80 113 84 211 68 97 206
1874 206 402 482 316 623 455 401 143 162 438 247 422 359 252 -69 -27 341 208 168 264 336 275 30 -58
1897 -58 317 78 114 284 -99 293 42 363 441 204 191 193 137 608 6 -50 -144 -112 226 234 305 -62 225 493
1921 493 24 41 101 -45 266 -15 263 25 82 195 72 202 41 -339 -34 38 185 80 -130 248 -146
1942 -146 102 167 -69 47 47 27 105 -396 59 271 34 -102 -43 -209 -214 -55 -61 -335 187 -48 16 108 -182 253
1966 253 126 -113 139 -116 -89 -285 -459 -143 -150 -121 -33 -175 -78 -106 -238 -246 -140 79 -299 -38 -266 -404 -290
1989 -290 -278 -198 141 -237 -174 -311 -116 10 218 -156 -345 -225 -384 -493 -225 9 -154 -280 -328 -190 -280 -443
$$ packed form
1824Ej11J65K48l9J12k89Q5m0n1J14j29J66p8L1j0k65L36L2j85K39n3q5O6k58
1848FK98K9j41P1M7r8R9j47J71Jq8K57l47J8J54MJ13k79p7j1L3k9J27j43K9J09
1874B06J96Q0j66L07j68n4k58J9K76j91J75o3j07l21M2L68j33m0R6P2o1k45q8
1897e8L75k39L6J70l83L92k51L21P8k37j3Kn6M71o02n6r4L2L38QP1l67K87K68
1921D93m69J7O0j46L11k81K78k38N7J13j23J30j61l80L05P2J47j05k10L78l94
1942a46K48O5k36J16%k0P8n01M55K12k37j36N9j66nJ59ok74N22k35O4R2k90M35
1966B53j27k39K52k55K7j96j74L16pK9Q8j42R7k8j32qJ06K19l78K61k28j38J14
1989b90J2Q0L39l78O3j37J95J26K08l74j89J20j59j09K68K34j63j26m8J38r0j63
$$ plain form
2011 -443 -191 -245 -135 -127 -80 -162 -221 -385 -165 -181 -80 -197 -453 -554 -501 -378 -374 91 -164 -343 -136 -309 -89
2034 -89 -199 -76 -35 -385 -88 -282 -125 -178 -307 -16 54 -127 -418 -175 -325 54 -100 -344 -469 -104 -79 -321
2056 -321 -182 -243 -373 -36 -225 -43 -307 -185 170 -121 -215 -507 -129 -219 -261 -268 59 100 -162 -56 25 136 -424
2079 -424 -88 19 -201 -178 -181 142 -91 -50 62 9 -359 -167 -4 68 -223 74 289 201 -95 -216 223 98
2101 98 -47 -4 -153 -126 -37 -15 24 -8 -61 96 -159 -180 38 76 -12 -22 150 -70 85 197 68 180 65 41
2125 41 95 48 225 151 -27 371 396 142 -282 -62 -63 104 0 -90 -143 109 68 117 335 210 170 339 248 290 137
2150 137 193 242 217 223 132 42 -84 85 240 -4 282 243 159 652 145 69 62 383 302 -33 340 281 295 450 -14
2175 -14 91 43 335 225 275 90 223 102 279 70 309 282 42 150 -61 406 -19 152 368 120 -163
$$ packed form
2011d43K52n4J10QM7q2n9j64K20j6J01j17k56j01N3J23MM65k55j79K07j73K20
2034h9j10J23M1l50K97j94J57n3j29K91P0j81k91K43j50L79j54k44j25L65K5k42
2056c21J39o1j30L37j89J82k64J22L55k91r4k92L78r0m2pL27M1k62J06Q1J11n60
2079d24L36J07k20K3lL23k33M1J12n3l68J92J63P2k91K97K15q8k96j21M39j25
2101I8j45M3j49K7Q9K2L9l2n3J57k55k1K18L8q8j0J72k20J55J12j29J12j15k4
2125D1N4m7J77p4j78L98K5k54m24K20jJ67j04r0n3K52m1M9K18j25m0J69r1M2j53
2150A37N6M9k5Or1r0j26J69J55k44K86l9q4M93n07p6pL21q1l35L73n9J4J55m64
2175a4J05m8K92j10N0j85J33j21J77k09K39k7k40J08k11M67m25J71K16k48k83
$$ plain form
2196 -163 298 97 87 -19 -60 219 9 138 82 13 323 -218 148 71 135 71 -139 331 101 63 224 162 -8
2219 -8 163 176 104 58 163 117 -71 13 63 401 385 104 31 4 154 154 -86 51 163 80 292 -183 244 295 103
2244 103 280 -47 99 112 273 215 43 -69 79 -55 -41 -49 276 91 72 19 -40 -139 -243 229 64 -291 45
2267 45 144 76 -99 -64 -72 13 -89 49 47 -185 -251 12 4 -99 175 -7 -236 -92 -195 -154 -14 -209 -219 -4 -4
2292 -4 -236 -178 -38 -74 -183 -376 -247 -80 -52 -382 -153 -233 -430 14 -131 -86 -289 -51 -216 -315 216 -302 -27
2315 -27 -209 -16 62 -61 -187 -63 97 -190 -102 -418 -129 -115 -169 -242 -154 -80 20 19 -156 -64 -94 -168 1 -44 -267
2340 -267 -120 2 23 -120 7 -240 -3 112 -141 -29 -87 13 68 -272 -440 -356 149 39 -322 -42 -103 256
2362 256 -96 -439 -228 23 -103 -130 -294 7 -166 61 -344 5 -130 -5 -146 70 -8 -361 -219 -147 -108
$$ packed form
2196a63M61k01j0j06m1K79k10J29n6o9L10n41L66p7O4o4k10M70k30l8J61o2j70
2219hJ71J3p2m6J05m6j88Q4N0L38j6k81p3k7J50%k40J37J12q3K12m75M27N1j92
2244A03J77l27J46J3J61n8j72j12J48j34J4qL25j85j9n3n9r9j04M72j65l55L36
2267D5R9o8j75L5qQ5j02J38kk32o6K63qj03K74j82k29J44j03M1J40j95j0K15%
2292dk32N8J40l6j09j93J29J67K8l30K29q0j97M44j45M5k03K38j65r9N31n18K75
2315b7j82J93P8j23j26J24J60k87Q8l16K89J4n4p3Q8P4J00jj75R2l0p4J69m5k23
2340b67J47J22K1j43J27k47K37J15k53J12n8J00N5l40j68Q4N05j10l61K80o1L59
2362B56l52l43K11K51j26k7j64L01j73K27m05L49j35J25j41K16p8l53J42P2L9
$$ plain form
2383 -108 77 -89 -232 -253 -288 -292 -14 75 -2 39 49 -200 -491 -84 206 -158 -216 203 -68 -2 -138 -3 158
2406 158 141 407 98 -193 -253 -2 8 31 191 33 -386 -38 121 -92 -148 -249 35 96 91 -48 160 -36 -139
2429 -139 -42 -144 -212 -3 124 -38 -12 35 221 -330 219 124 65 193 33 39 -23 148 55 25 -8 170 121 -54
2453 -54 38 -49 -38 -23 -151 439 108 1 86 259 37 191 52 -8 135 231 388 30 322 69 -30 -143 -78
2476 -78 187 172 -54 273 -63 -175 226 122 286 -108 23 174 121 141 65 255 -144 -215 52 16 287 -36
2498 -36 -3 266 192 157 -217 85 476 13 240 112 90 -32 238 222 153 21 8 -3 296 142 -31 212 -30
2521 -30 164 117 -162 124 -83 99 367 -40 56 322 192 148 134 82 132 -13 280 -3 200 212 138 230 -171
2544 -171 -70 31 190 209 188 -33 189 57 266 123 205 58 289 155 29 276 255 40 312 -30 -28 196
$$ packed form
2383a08J85j66j43k1l5mK78Q9p7M1J0k49k91M07K90l64n8M19k71O6j36J35J61
2406A58j7K66l09k91o0K51J0K3J60j58m19L48J59k13n6j01K84O1nj39K08j96j03
2429a39R7j02o8K09J27j62K6M7J86n51N49r5n9J28j60Oo2J71r3l0l3J78m9j75
2453e4R2q7J1J5j28N90l31j07Q5J73k22J54j39o0J43R6J57l58K92k53r9j13O5
2476g8K65j5k26L27l36j12M01j04J64l94J31J51n3K0p6J90l99p1K67l6K71l23
2498c6L3K69p4l5l74L02L91m63K27j28k2j22K70j6o9j32j3j1K99j54j73K43k42
2521c0J94m7k79K86k07J82K68m07R6K66j30m4j4n2N0j45K93k83K03J2p4R2m01
2544a71J01J01J59J9k1k21K22j32K09j43Q2j47K31j34j26K47k1k15K72l42KK24
$$ plain form
2566 196 77 114 102 -113 -123 208 111 28 -264 -22 97 71 -104 -66 63 154 50 -108 -110 25 44 -27 -2 -2 96
2591 96 -30 158 82 -211 -121 2 324 -45 21 -144 66 15 29 39 -46 -158 -105 -38 -45 -51 -100 -208 255 -81 -44
2616 -44 -147 -3 205 -216 -179 -119 -13 -51 -152 -144 -134 118 14 54 -243 -295 -265 118 -74 -120 -50 -189 52 -84
2640 -84 -71 -286 -88 -106 -99 -306 -164 37 -57 -80 -39 -509 -6 -181 -95 -121 -66 0 75 257 16 -125 -333 -216
2664 -216 -125 109 -169 -376 -12 22 -300 -202 -153 -157 -20 -378 -88 65 -180 6 -230 -434 -99 -76 64 21 -381
2687 -381 -282 -55 60 71 -307 -288 -70 32 -205 -312 -115 -7 18 82 -312 -201 -74 -228 -50 -87 -51 -264
2709 -264 -142 -35 -271 -328 -93 -152 47 -138 -65 -197 57 158 -97 -59 -181 -96 -161 -222 -124 -83 -108 -14 -49 -66
2733 -66 -91 49 28 41 -305 10 -59 197 -94 3 19 71 72 -348 24 116 34 17 128 -161 -97 -122 134 -204 -304
$$ packed form
2566A96j19L7j2k15j0L31r7q3k92K42J19k6j75L8J29R1j04j58kJ35J9p1K5%R8
2591I6j26J88p6k93R0J23L22l69O6j65K10n1J4J0q5j12N3O7pom9j08M63l36L7
2616d4j03J44K08m21L7O0J06l8j01QJ0K52j04M0k97n2L0L83j92m6P0j39K41j36
2640h4J3k15J98j8Pk07J42K01r4k3M1m70N03j75Q6k6N5O6P5J82k41j41k08J17
2664b16R1K34k78k07L64L4l22R8M9mJ37l58K90J53k45J86k36k04L35K3J40m3m02
2687c81R9K27J15J1l78J9K18J02k37j07J97J08K5O4l94J11J27j54J78l7L6k13
2709b64J22J07k36n7K35n9J99j85P3j32K54J01k55L8j22Q5o5o1R8M1k5R4l5j7
2733f6k5J40k1J3l46L15o9K56k91R7J6N2Jm20L72R2q2j7J11k89O4k5K56l38j00
$$ plain form
2758 -304 -303 -171 380 -62 93 110 250 388 -28 -7 303 -241 240 141 -133 -161 -66 161 49 159 -71 15 441
2781 441 85 48 -41 -41 1 39 44 -9 128 -58 137 132 -165 -1 257 222 70 19 72 -124 245 161 93 47 -18 146
2807 146 36 45 -23 66 -24 33 226 98 -129 50 226 122 205 189 146 42 190 -164 119 -81 70 49 -120
2830 -120 12 208 -201 137 185 65 122 69 289 -93 -60 13 406 184 74 -57 225 -58 -117 -110 85 -1 63
2853 63 165 21 174 -29 120 249 354 -142 260 111 -24 -28 -91 280 139 -195 96 172 -209 66 178 159
2875 159 -116 -179 -36 135 202 62 -58 24 26 170 -62 30 47 239 0 64 -120 -28 154 12 -115 -7 58
2898 58 319 134 -44 -152 147 -125 248 299 -100 -155 -187 118 170 -127 43 182 148 24 -75 -23 58 -109 -71
2921 -71 135 -233 -180 44 -273 -180 -24 -70 -99 -28 -124 -10 97 4 -22 -95 67 -31 345 93 -91 -177 -114 72
$$ packed form
2758c04JJ32N51m42J55J7J40J38m16K1L10n44M81r9k74k8R5K27j12J10k30Q6M26
2781D41l56l7q9%M2L8Nn3J37j86J95nk97J64K58l5j52n1N3j96L69q4o8m6o5J64
2807A46j10Ro8Q9r0N7J93j28k27J79J76j04Q3j6m3j04J48l54K83k00J51k1j69
2830a20J32J96m09L38M8j20N7n3K20l82L3P3L93k22j10j31K82k83n9PJ95q6O4
2853F3J02j44J53k03J49J29J05m96M02j49j35mo3L71j41l34K91P6l81K75J12j9
2875A59k75o3J43J71O7j40j20Q2KJ44k32R2J7J92k39O4j84R2J82j42j27J08O5
2898E8K61j85j78j08K99k72L73N1l99n5l2L05N2k97J70J39l4j24r9N2Q1j67L8
2921g1K06l68N3K24l17R3J56m6k9P1r6J14J07r3k6p3J62r8L76k52j84q6O3J86
$$ plain form
2945 72 286 -91 53 -94 -61 89 -139 -185 -31 78 198 63 -117 31 107 -6 14 61 95 -50 -65 20 -28
2968 -28 -98 85 -31 -305 -47 -199 -152 -217 106 -346 -286 -228 -32 -143 -139 2 -172 191 99 -140 -19 -206 120
2991 120 -214 -36 -373 -147 50 -83 116 -486 30 63 -87 -210 -349 -10 66 -181 -28 57 266 -180 -58
3012 -58 132 -120 -112 -279 -192 -12 -236 -96 67 -293 -89 7 79 -60 49 -74 -135 165 -105 -80 -162 191 -29
3035 -29 76 123 -200 -97 -364 -64 -157 -81 -218 -106 -177 66 219 -131 -205 -214 87 271 17 -142 -172 -225 -109
3058 -109 226 -109 45 -361 -36 -3 -130 11 -151 -211 36 -153 -48 62 -29 174 205 -101 -95 -71 0 183 -250
3081 -250 -112 48 278 179 -143 -212 252 -187 257 -180 -157 -6 208 115 150 -1 -97 139 -21 -15 146 265 137
3104 137 -38 186 73 -230 -34 0 -168 -182 243 136 -36 -271 267 -228 -227 172 -70 80 118 39 102 79 63
$$ packed form
2945G2K14l77J44j47L3J50k28m6J54J09J20j35j80J48P6j13K0M7L4j45j5Q5m8
2968b8p0J83j16k74K58j52M7o5L23m52O0N8J96j11MJ41j74L63r2k39J21j87L26
2991A20l34J78l37K26J97j33J99o02N16L3j50j23j39L39P6k47J53Q5K09m46J22
3012e8J90k52Qj67Q7J80k24J40J63l60K04R6P2j39J09j23o1L00k70K5q2L53k20
3035b9J05M7l23J03k67L00r3P6j37J12p1K43J53l50p4rL01J84k54j59l0n3J16
3058a09L35l35J54m06L25L3j27J41j62o0K47j89J05J10r1K03L1l06OK4P1J83m33
3081b50J38J60K30r9l22o9M64m39M44m37K3J51K14r3L5j51r6K36j60OJ61J19j28
3104A37j75K24j13l03J96L4j68j4M25j07j72k35N38m95JL99k42J50L8p9O3k3j6
$$ plain form
3127 63 -90 124 248 100 253 -37 147 26 80 -83 -21 53 -157 79 147 -97 -84 122 179 -14 -26 -112 212
3150 212 136 207 151 84 116 167 16 190 94 -5 257 295 51 111 -58 132 76 103 219 216 153 19 90 275 305 -42
3176 -42 -101 -267 -46 212 171 -66 144 18 206 -94 -44 3 -11 97 211 17 36 13 58 149 -80 154 191 57
3200 57 143 177 84 -161 26 -38 47 -28 -37 260 131 63 267 17 4 94 37 -126 248 111 -199 -75 -87 -124 -82
3225 -82 172 -72 -83 -89 26 85 -83 10 -108 -5 104 27 116 76 81 -1 30 37 145 66 -56 -10 -3 -5 59 -122 28
3252 28 201 -225 -189 -169 -43 -97 -41 -97 -238 54 28 -8 79 -93 62 130 -303 -14 -75 25 -163 80 -144 -23
3276 -23 63 -149 -124 -166 165 -96 -263 235 156 151 156 -182 -7 -76 154 139 -112 144 -181 -18 -189 4 29 -178
3300 -178 -237 -5 269 -100 19 -103 2 101 -56 194 -322 -7 -33 -75 -176 -153 -143 -128 20 -91 -224 -26
$$ packed form
3127F3j53K14J24j48J53k90J84j21N4j63O2P4k10K36O8k44J3K06N7j93j2q6L24
3150B12p6P1n6o7L2N1j51J74r6r9K62L8k44O0j69J90n6K7J16lo3j34P1J85L0l47
3176d2n9j66K21K58m1k37K10j26J88l00N0M7j4J08J14j94J9k3M5R1k29K34L7j34
3200E7Q6L4r3k45J87o4Q5p5rK97j29o8K04k50j3R0n7j63L74j37l10J24j2l7M2
3225h2K54k44j1oJ15N9j68R3j18J03J09p7Q9m0Nq2L1PJ08p9j22M6PkO4j81J50
3252B8J73m26L6K0J26n4N6n6j41K92k6l6Q7j72J55O8m33K89o1J00j88K43k24J21
3276b3Q6k12K5m2L31k61j67M98p9nNl38J75o9K30j5k51K56l25J63j71J93K5k07
3300a78n9K32K74l69J19j22J05R9j57K50n16L15k6m2j01K3J0J5J48j11j33J98
$$ plain form
3322 -26 -284 -191 88 -64 150 -120 -125 -103 -133 -205 -18 -231 -38 32 73 -99 -331 -106 -174 -243 -156 -28 49 41 -10
3347 -10 -59 -54 -67 -11 -17 64 176 -207 -200 -49 -172 -35 -108 -13 172 -69 142 104 -214 -197 -19 22 -171 -33 -76 -89
3373 -89 -271 -4 -33 -131 -61 105 -57 -213 -266 66 -60 297 12 -52 -1 18 -138 234 -148 39 171 155 0
3396 0 -36 176 8 216 62 -171 -97 -17 184 14 93 91 -105 331 159 -105 -75 -20 62 302 261 -99 37 -136
3420 -136 133 274 159 5 -49 -13 60 118 -59 -96 257 43 -268 -86 60 106 4 58 -95 85 -178 224
3442 224 -87 -163 85 302 364 17 -14 52 -146 155 -135 163 -53 111 -25 18 139 -6 -117 290 247 154
3464 154 159 296 110 102 37 100 139 50 282 120 -104 -8 238 -27 -97 -136 104 -52 127 174 138 73 110 6 172
3489 172 70 -26 -105 -65 -1 -101 -132 280 -42 71 38 227 213 40 -165 -156 364 -63 0 200 63 -17 161 183
$$ packed form
3322b6k58R3K79j52K14k70nK2l0p2J87k13J93P0M1j72k32K25o8o9Q7J28P7qn1
3347a0m9Nj3N6oQ1J12l83PJ51j23J37p3R5J85k41K11l8l18J7J78M1j93J38m3j3
3373h9j82K67k9r8P0J66j62j56n3L32j26L57k85o4N1J9j56L72l82J87J32j6j55
3396@l6K12j68K08j54k33P4Q0K01j70P9kj96M36j72k64L0N5Q2K40m1l60J36j73
3420a36K69J41j15j54n4L6P3N8j77l7L53k14l11J82J46M6j02N4j53J80k63M02
3442B24l11p6K48K17O2l47l1O6j98L01k90K98k16J64j36M3J21j45j11M07m3r3
3464A54NJ37j86qo5O3L9q9K32j62k24R6K46k65p0l9K40j56J79M7l6o5L7j04J66
3489A72j02r6p9M0O4j00l1M12l22J13l3J89j4j73k05RN20m27O3K00j37q0J78K2
$$ plain form
3513 183 122 31 295 -142 152 15 -18 -213 -113 -122 194 105 62 -145 112 13 114 -81 1 -71 -260 -61 -13 -19
3537 -19 -129 422 -171 84 202 12 -33 159 51 -46 -53 -6 22 122 -35 -22 113 -156 89 209 9 60 -116
3560 -116 -114 -36 129 118 136 -101 -22 -167 -266 100 107 36 78 -11 -35 178 105 -73 116 -11 215 71 56 -300 43
3585 43 -93 -139 248 24 119 1 -210 -82 283 54 -149 -148 -15 167 116 18 179 22 -34 -49 -80 -101 16 12
3609 12 -119 -121 150 102 -59 218 134 80 3 -24 -95 -86 -47 -6 -145 -197 -253 -83 -34 81 49 -56 -198 -390 -227 3
3635 3 5 190 -107 -57 -182 -131 36 81 161 125 -31 -39 -196 -108 172 219 -42 -124 25 69 -88 -126 81 -166 -18
3660 -18 -94 32 39 78 88 125 -64 -118 3 20 236 -147 -116 -251 -10 332 114 -236 -76 19 97 -82 118 -21
3684 -21 25 85 -202 -49 -256 -39 -263 203 47 -38 202 -67 140 -88 52 -88 -223 -178 -9 -64 -277 119
$$ packed form
3513A83o1r1K64m37K94j37l3j95J00rL16q9m3k07K57r9J01j95Q2p2j89J99M8o
3537a9j10N51n93K55J18j90m5J92j08r7pM7K8J00j57J3J35k69K45J20k00N1j76
3560a16KP8J65j1J8k37P9j45r9L66Pp1M2q9k4K13p3j78J89j27K26j44j5l56L43
3585D3j36m6L87k24R5j18k11J28L65k29k03JJ33J82n1r8J61j57n6j5l1k1J17m
3609A2j31kK71m8j61K77q4n4p7k7p1RL9M1j39n2n6J70M9J15l2j05j42j92J63K30
3635CKJ85k97N0j25N1J67M5Q0l6j56qj57Q8K80M7k61q2J49M4j57l8K07k47J48
3660a8p6J26PL9J0L7j89n4J21J7K16l83L1j35K41L42k18l50J60R5P8j79K00j39
3684b1M6O0k87J53k07K17k24M66j56q5K40k69K07k28J40j40j35M5J69n5k13L96
$$ plain form
3706 119 -60 -113 -139 -115 57 2 -150 -76 -122 -46 -124 131 54 210 -264 -359 -74 187 -205 169 155 -139 111 -35
3730 -35 51 111 173 -56 -27 -85 -33 -67 115 -95 -117 143 121 49 171 49 -142 -182 -97 -96 -84 273 -212 -69 -123 12
3756 12 59 69 -29 235 70 316 102 165 162 16 -64 30 221 35 65 124 -15 -72 100 52 62 265 89 155 -62
3781 -62 146 132 210 164 -286 258 106 -100 129 -112 95 223 -161 100 18 119 121 28 195 413 -44 41 -137
3804 -137 -20 109 112 -64 20 127 168 34 87 270 93 -36 220 -87 29 15 -93 -75 -13 234 242 7 -49 -39
3828 -39 -149 125 41 -94 -23 -51 42 11 158 33 109 -230 92 38 -206 166 -120 -62 -23 142 -158 118 -101
3851 -101 15 -52 85 82 -130 46 118 60 24 196 274 115 -195 65 235 195 -47 -41 -138 165 94 -219 56 112
3875 112 49 -85 67 117 58 -68 -48 166 330 -81 -57 114 -94 -120 -1 72 140 53 7 -35 -33 -42 -40 -1 85 190
$$ packed form
3706A19j79n3k6K4J72n5j52P4m6P6p8K55p7J56m74r5K85K61l92L74j4k94K50j46
3730c5Q6O0O2k29K9n8N2l4J82k10k2K60k2p2J22j22j91m0Q5JJ2L57m85J43n4J35
3756A2M7J0r8K64j65K46k14O3lj46q0R4J91j86L0N9j39n7J72m8J0K03j76O6k17
3781f2K08j4P8m6m50N44j52k06K29k41K07J28l84K61q2J01Kr3J67K18m57Q5j78
3804a37J17J29Lj76Q4J07M1j34N3J83j77j29K56l07J16j4j08J8O2K47Qk35n6J0
3828c9j10K74q4j35P1k8R3l1J47j25P6l39L22n4k44L72k86N8L9J65l00K76k19
3851a01J16o7J37lk12J76P2n8l6J72P8j59l10K60J70m0k42Or7L03p1l13K75N6
3875A12o3j34J52N0n9j26K0K14J64m11K4J71k08k6J19P3O8q7m6m2KrKL9Q6J05
$$ plain form
3901 190 166 108 104 -145 3 -1 -16 -93 118 79 -100 -127 -48 -233 -144 -3 -209 -160 290 -148 -43 17 109 -32 -55
3926 -55 -404 -128 30 -274 5 63 52 71 -189 -162 127 -172 -2 -173 84 134 -172 -17 -100 78 143 -62 -14
3949 -14 -62 104 167 -381 -85 227 -40 -209 33 -111 56 -137 -112 44 -75 59 10 -225 -54 78 -102 55
3971 55 -32 -207 -104 -43 98 45 -150 -44 -153 -2 48 -62 76 -105 -23 -104 120 39 -135 -1 50 156 75
3994 75 -21 52 -62 -83 -29 123 -1 91 -28 -194 -59 22 38 -152 -74 28 -419 -226 -109 173 -146 -121 38
4017 38 235 121 137 139 -122 38 302 -30 106 17 235 -10 -132 -79 -60 88 53 -80 56 -126 -147 163 -199
4040 -199 -40 -285 -70 59 -55 -92 12 -34 30 -168 -162 -11 -297 206 199 -82 104 -87 20 -125 -57 -25 -38
4063 -38 -3 -68 42 -33 117 -90 17 150 -91 -126 -2 10 -293 163 69 -188 -109 -22 191 74 -118 -228 206
$$ packed form
3901A90k4n8mk49J48mj5p7K11l9j79k7P9j85Q9J41k06M9M50m38J05O0R2j41k3
3926e5l49K76J58l04K79N8j1J9k60K7K89k99J70j71K57N0l06J55q3J78O5k05M8
3949a4m8J66O3n48K96L12k67j69K42j44J67j93K5J56j19J34m9k35J71J32j80J57
3971E5q7j75J03O1J41n3j95J06j09J51N0j10J38j81Q2q1K24q1j74J34N1J06q1
3994G5r6P3j14k1N4J52j24R2j19j66J35Q1J6j90P8J02m47J93J17K82l19K5J59
4017C8J97j14J6Kk61J60K64l32J36q9K18k45j22N3J9J48l5j33J36j82k1L10l62
4040a99J59k45K15J29j14l7J04m6O4j98OJ51k86N03pk81J86j91J07j45O8L2j3
4063c8L5o5J10p5J50k07J07J33k41l5J24J2l03M56r4k57P9Q7K13j17j92j10M34
$$ plain form
4086 206 166 63 -80 61 64 123 -41 260 -87 -21 -133 155 217 -118 153 248 179 36 173 -133 130 90 126
4109 126 156 42 22 -33 -136 -9 -36 188 334 176 220 71 23 45 32 -82 -55 216 -155 46 86 -91 -47 -157
4133 -157 -21 88 -2 27 -17 -68 -30 175 125 273 77 -95 -32 188 54 -139 -113 15 111 120 -104 153 -142 65
4157 65 -62 275 271 -115 194 204 -3 206 96 267 36 113 239 71 -76 221 -47 70 101 8 -85 89 -64
4180 -64 197 34 -7 -63 80 179 108 -174 123 -42 -51 81 37 369 27 256 -192 -52 -98 -116 -54 178 131 0
4204 0 -23 168 -59 0 67 182 52 -159 152 58 -80 27 12 -182 77 35 -160 -73 22 -269 -253 6 138 -183
4228 -183 13 63 -96 21 -162 202 -124 177 -19 -149 155 -87 64 -138 -162 224 -111 -257 -62 -366 -132
4249 -132 -1 -63 -125 -119 -175 -173 -30 192 -31 -3 -38 52 87 -100 71 56 -206 52 -29 -22 47 100 -10 7 120 224
$$ packed form
4086B06m0j03j43J41LN9j64L01l47O6j12K88O2l35K71R5o9j43J37l06K63m0L6
4109A26L0j14k0n5j03J27k7K24J46j58M4j49m8K2j3j14K7K71l71K01M0j77M4j10
4133a57J36J09r0K9m4n1L8K05n0J48j96j72O3K20j34j93K6J28R6Rk24K57k95K07
4157F5j27L37ml86L09J0k07K09j10J71k31P7J26j68j47K97k68J17L1r3r3J74j53
4180f4K61j63m1n6J43R9p1k82K97j65rJ32m4L32l42K29m48J40m6j8O2K32m7j31
4204@k3J91k27N9O7J15j30k11L11r4j38J07j5j94K59m2j95Q7R5k91J6K59J32l21
4228a83J96N0j59J17j83L64l26L01j96j30L04k42J51k02k4L86l35j46J95l04K34
4249a32J31o2o2On6KJ43K22k23K8l5R0L5j87J71j5k62K58q1PO9N3j10J7J13J04
$$ plain form
4275 224 -4 -108 9 38 -51 110 12 -72 -100 28 134 -96 -61 -21 -77 45 -153 -75 210 -129 -253 -229 106
4298 106 144 -273 186 1 133 -22 120 38 0 -260 28 -207 -206 0 48 -16 161 -105 -106 -29 270 -65 -61 -136
4322 -136 -64 196 92 90 -120 160 -74 8 -195 27 -113 164 -210 -196 -8 114 234 -150 132 177 195 -103
4344 -103 62 -82 -49 -295 -201 -90 -114 -15 34 -304 37 8 66 -343 -393 -143 -126 -78 -62 29 -34 -323 -30 -149
4368 -149 24 69 325 297 -137 194 94 37 80 -95 -61 54 162 37 -31 252 -233 49 19 44 -204 -52 131
4391 131 140 -5 -50 -18 -88 -14 63 -200 -129 -41 -42 373 -39 -122 -41 175 -4 175 230 12 38 104 72 33 -128 -95
4417 -95 -85 -43 183 -69 130 181 -95 -183 186 0 63 -154 184 19 138 41 140 -109 178 186 -22 -71 85 169
4441 169 -106 -90 -60 128 98 -72 93 -181 47 113 -255 -37 -160 91 -159 179 -33 155 -222 273 25
$$ packed form
4275B24k28j04J17K9q9J61r8q4k8J28J06k30L5M0n6J22j98P8K85l39j24K4L35
4298A06L8m17M59j85J32j55J42q2l8k60K88k35JK06M8o4J77k66jP7K99l35Mp5
4322a36P2K60j04kk10K80k34Q2k03K22j40K77l74J4J88J22J20l84K82M5J8k98
4344a03J65j44L3k46R4J11k4R9M9l38L41k9N8m09n0K50J7M8J6R1o3k89K93j19
4368a49J73M5K56k8m34L31j00n7M3j75L4J15J08j25o8K83m85K82l0K5k48J52J83
4391A31Rj45m5L2p0P4P7k63P1Q8jM15m12q3Q1K16j79J79N5k18K6O6l2l9j61L3
4417i5J0M2K26k52J99N1k76q8L69j86O3k17L38j65J19r7R9k49K87Qk08m9J56Q4
4441A69k75J6L0J88l0j70J65k74K28O6l68K18j23K51k50L38k12J88l77M95k48
$$ plain form
4462 25 96 120 -71 3 73 -18 -3 -202 -55 143 52 61 -32 3 -336 -84 -40 -273 88 -22 -100 366 -263 301 -142
4487 -142 111 9 58 -62 -65 -74 186 130 -199 36 -74 28 212 104 -290 -127 186 145 65 -15 -200 44 -22
4510 -22 295 -107 -152 174 282 64 155 -5 -159 115 255 146 201 -65 -52 120 30 -51 202 38 -168 -80 -91
4533 -91 -63 -95 360 -84 117 82 -12 79 -195 21 -78 -257 55 199 -78 -80 76 -39 -53 47 132 -79 -97 -25
4557 -25 -225 171 54 -176 172 -141 -101 113 23 -18 -41 31 37 -28 -176 -148 -58 18 -18 127 -66 -73 255 -62 -232
4582 -232 -14 183 -18 16 -143 -209 76 -160 -3 -127 25 99 118 168 -193 109 -154 -113 -72 50 104 -15 128
4605 128 70 -49 -88 -60 -269 -30 63 -98 257 -33 -171 -88 -71 48 113 -91 34 19 12 210 12 -82 -319 25
4629 25 50 190 26 183 -118 138 -172 -141 -70 -25 145 -26 210 -148 235 76 124 40 -37 -122 -121 240 54 152
$$ packed form
4462B5P1K4j91P4P0r1J5j99J47J98r1Rr3L5l39K52M4k33L61j10p8M66o29N64m43
4487a42K53j02M9j20lrK60n6l29K35j10J02J84j08l94J63L13m1q0q0j85K44o6
4510b2L17m02m5L26J08k18R1j60j54K74J40j09N5k66J3J72r0q1K53j64k06Q8j1
4533i1K8l2M55m44K01l5r4R1k74K16r9j79L12J44k77kJ56j15j4J00Q5k11j8P2
4557b5k00L96j17k30L48l13M0K14r0m1k3P2Oo5j48K8R0P6l6J45j93pL28l17j70
4582b32K18J97k01L4j59o6K85k36J57j24J52P4J9N0l61L02k63M1M1J22N4j19J43
4605A28n8j19l9K8k09K39R3j61L55k90j38Q3J7J19O5k04J25j5pJ98j98r4k37L44
4629B5K5J40j64J57l01K56l10L1P1M5J70j71K36l58L83j59M8q4p7q5JL61j86R8
$$ plain form
4653 152 178 54 37 -234 92 -62 282 89 108 277 100 185 -34 -67 119 -15 -195 122 -21 -165 181 -113
4675 -113 -32 -294 -235 399 78 -199 -165 125 -2 160 -38 -69 -219 -99 -7 106 159 -11 89 51 -65 -94 -93
4698 -93 -172 -145 -278 74 95 -103 -132 165 -162 77 -110 307 198 -35 -288 -169 -16 5 -125 5 -3 -6 44 31
4722 31 136 108 162 -93 -30 -113 24 -129 0 23 60 120 -335 -32 -193 -123 12 -5 -47 60 216 197 -91 67
4746 67 -180 96 -103 228 -2 6 43 127 -37 130 -26 -198 48 53 190 -31 2 -33 -61 -211 -111 -176 -9 82
4770 82 -120 59 22 -29 155 198 -113 -13 84 -202 72 32 -1 -36 78 64 -39 -2 94 -156 -11 -226 114 -33
4794 -33 43 196 195 -7 6 36 105 93 62 33 -87 -45 -93 113 -151 -22 111 -107 -190 63 148 -105 -143 -270 -192
4819 -192 -160 -148 -265 -49 -96 83 294 36 -62 -115 -68 -64 81 55 -81 -115 11 -2 -53 24 59 -150 106 -151 294
$$ packed form
4653A52K6j24j7k71L26j54L44j93J9J69j77Q5k19l3J86j34j80L17j43j44L46k94
4675a13Q1k62N9O34l21k77L4K90j27J62j98l1j50J20R2J13N3j70J00l8j16k9J
4698i3p9K7j33L52K1j98k9K97l27K39j87M17j09k33k53J19J53K1j30J30qlN0j3
4722C1J05k8N4k55O3q3J37j53J29K3L7O0m55L03j61P0J35j7m2J07J56j9k88J58
4746F7k47K76j99L31k30QL7Q4j64J67j56j72K46NJ37k21L3l5k8j50J00o5J67R1
4770H2k02J79l7n1J84M3l11J00R7k86K74m0l3l5J14j4j03L7R6k50J45k15L40j47
4794c3P6J53jk02J3L0O9j2l1k9j20M2m8K06k64J29J33k18q3K53Q5k53l8j27P8
4819a92L2J2j17K16m7J79K11k58r8n3M7MJ45k6j36l4J26j3n1P7L5k09K56k57M45
$$ plain form
4844 294 40 69 44 -27 -129 -91 70 -12 71 172 -57 131 -35 195 115 169 -23 18 -111 -222 -101 -227 -97
4867 -97 76 -92 144 -11 52 179 -72 76 -32 -75 -75 -22 -105 109 30 67 236 -54 44 56 -108 345 127 -183
4891 -183 -138 -83 115 -15 46 -117 -184 -42 -78 -251 0 255 7 158 82 -149 33 -116 -325 -157 -121 61
4913 61 72 -256 -1 -60 -139 -201 61 -44 -116 95 89 -177 -58 -144 -116 218 -130 35 -84 -20 35 -66 125 67
4937 67 172 -123 165 195 235 -141 -245 154 -258 -93 210 44 -18 15 14 131 150 95 -59 -2 30 221 148 52
4961 52 95 -3 -59 151 27 -36 -299 -195 -62 -40 -53 -145 -175 122 -95 129 -161 18 -45 -60 -151 214 -75 -57
4985 -57 100 -182 53 -217 -150 -254 134 174 191 47 192 -1 -55 -160 138 -75 -26 15 32 -60 -75 106 -9
5008 -9 -6 -143 81 182 168 -83 -16 9 97 101 -22 145 35 32 76 59 -165 57 219 -11 -186 2 -109 -45 -52 94
$$ packed form
4844B94k54K9k5p1j02L8J61q2Q3J01k29J88j66K30q0N4j92M1j29j11J21j26J30
4867i7J73j68K36j55O3J27k51J48j08m3%N3q3K14p9L7J69k90R8J2j64M53k18l10
4891a83M5N5J98j30O1j63o7J42l6j73K51K55k48J51p6k31J82j49k09J68L6J82
4913F1J1l28K55n9p9o2K62j05p2K11ok66J19q6K8L34l48J65j19O4N5j01J91n8
4937F7J05k95K88L0M0l76j04L99m12J65L03j66o2L3jJ17J9n5j54N7L2J91p3r6
4961E2M3r8n6K10j24o3k63J04J33K2j3r2l0K97k17K24k90J79o3j5r1L65k89J8
4985e7J57k82K35k70O7j04L88M0J7j44J45j93n4j05K98k13M9M1J7r2j5J81j15
5008iLj37K24J01j4k51O7K5Q8Mj23J67j10lM4j7k24K22J62k30j75J88j11O4pJ46
$$ plain form
5034 94 -208 -36 124 -54 78 -142 37 -50 68 -75 213 217 -161 162 -98 104 168 181 -168 -123 -125 95 -387
5057 -387 -176 36 133 103 7 149 146 -173 -120 41 78 21 -173 -140 255 115 55 170 -268 -78 83 115 24 34
5081 34 -142 435 71 -128 -110 -30 123 -8 44 98 152 89 -52 -49 135 -48 -5 -286 66 -111 -130 -119 170 -138
5105 -138 -167 -324 -36 -104 25 -152 -178 241 -45 24 -36 -2 94 26 -183 18 106 62 -3 89 175 -55 24 14 138
5130 138 -19 79 -94 -116 89 -51 26 128 -134 -25 -71 -98 14 -136 194 38 -305 179 -51 -14 -106 7
5152 7 -223 -22 -457 -126 -151 -198 -33 298 -16 81 189 18 96 -139 57 -175 -111 123 96 -82 -93 -155 -18
5175 -18 113 -77 277 -7 -18 -10 73 -288 -164 112 19 -27 135 95 23 -53 -123 -67 109 -104 -195 402 93 80 161
5200 161 -401 -46 119 -108 -46 -107 -74 223 -202 -35 -72 109 -9 249 -79 231 285 -11 146 -180 74 241
$$ packed form
5034I4l02J72J60j78J32k20J79q7J18j43K88Ml78L23k60K02O4J3l49M5kK20m82
5057c87K11K12R7l0r6J42ll19N3J61L7n7j94L3L95j40o0J15m38J90J61L2r1J0
5081C4j76N77l64j99J8Q0J53j31N2N4N4o3j41LJ84j83M3k81L52j77j9J1K89l08
5105a38k9j57K88o8J29j77k6M19k86O9o0L4R6o8k09K01Q8m4o5R2Q6k30P9j0J24
5130A38j57R8j73k2K05j40P7J02k62J09m6k7J12j50L30j56l43M84k30L7r2J13
5152Gk30K01m35L31k5m7J65L31l14R7J08j71P8k35J96k32O4K34k7j78j1o2J37
5175a8J31j90L54k84j1QQ3l61J24K76r3m6J62m0p2p6p0N6J76k13r1N97l09j3Q1
5200A61n62L55J65k27O2o1L3K97m25J67l7J81j18K58l28L10N4k96J57l26K54J67
$$ plain form
5222 241 -5 -179 -16 282 -67 -20 49 90 78 200 -168 -107 72 105 -194 35 -208 -32 118 164 -20 -154
5244 -154 1 80 -247 -115 43 113 40 95 19 12 -185 167 -81 -328 -166 144 -17 5 237 -105 332 -107 -198
5267 -198 74 -64 -141 -92 -69 -336 16 -116 9 37 -71 -66 316 320 51 184 46 -158 -199 172 -52 15 114 22
5291 22 127 -37 -184 37 180 -147 -34 -282 90 -60 21 -335 99 220 158 -106 -91 136 -65 -38 -69 45
5313 45 206 40 -52 210 -53 46 -311 124 -15 -52 -166 63 -275 153 -22 123 66 -174 -239 4 196 -398
5335 -398 161 90 266 89 -137 -50 -132 -168 278 -125 -103 -165 -39 61 225 -222 -60 -14 43 -256 22 -207 58
5358 58 86 -442 -112 -100 44 116 25 151 202 146 -142 150 -83 140 200 171 -113 181 86 -116 -19 -84 64 114
5382 114 22 -82 78 -142 226 188 -162 -26 175 26 239 85 80 -108 -108 -15 -134 -67 -119 118 220 28 -122
$$ packed form
5222B41k46j74J63K98l49M7O9M1j2J22l68O1J79L3k99K29k43J76J50M6j84j34
5244a54J55P9l27J32J58P0p3N5p6pj97L52k48k47J62L10j61K2K32l42M37m39r1
5267a98K72j38p7M9K3k67L52j32J25K8j08NL82Mk69J33j38k04m1L71k24O7R9r2
5291B2J05j64j47K21J43l27J13k48L72j50Q1l56M34J21o2k64J5K27k01K7l1J14
5313D5J61j66r2K62k63R9l57M35j39l7j14K29l38M28j75J45n7k40o5K43J92n94
5335c98N59p1J76j77k26Q7q2l6M46m03K2o2J26J00J64m47J62M6N7k99K78k29K65
5358E8K8n28L30J2J44P2r1J26N1n6k88K92k33K23O0k9k84K94r5k02R7o5J48N0
5382A14r2j04J60k20L68l8l50J36K01j49K13j54nj88%R3j19O7n2K37J02j92j50
$$ plain form
5405 -122 125 253 -65 -209 -55 -138 98 52 4 -176 -225 -91 185 123 -119 210 -132 -204 65 27 -166 -2
5427 -2 -154 5 48 45 -134 -62 -158 88 -84 171 -28 -88 228 -67 -37 -157 67 -17 -100 70 64 -40 -41 -182 55
5452 55 6 39 -165 -162 -9 -51 -167 214 216 -79 76 221 -52 -58 36 -150 121 -22 77 -33 24 -59 -138 -40 -194
5477 -194 -33 129 15 -248 -66 -181 -101 20 80 56 180 154 166 -112 11 -15 -7 192 -126 59 -92 25 -80
5500 -80 -22 19 16 93 -29 -156 26 39 -124 40 225 76 27 98 -79 -335 105 98 -154 -160 180 162 111 148 -87
5525 -87 -349 -94 122 57 155 -13 -168 96 -278 65 62 -53 -16 36 -393 -76 -53 -58 -144 -13 -163 66 -112 -4
5549 -4 -43 -186 -170 -223 -65 -222 43 -80 -111 233 -122 203 155 -151 -149 106 -129 -8 -94 -134 222 -282 -54 41
5573 41 98 0 -40 -85 -316 -55 -278 33 57 -276 73 70 69 -64 96 -253 -33 -150 -115 224 58 89 230 -9
$$ packed form
5405a22K47J28l18j44J54q3K36m6m8j80m9J34K76o2k42L29l42p2K69l8j93J64
5427bj52J59M3lj79P2r6K46j72K55j99o0L16k95L0j20K24q4q3J70oj04jj41K37
5452E5m9L3k04LJ53m2j16L81Kk95J55J45k73oR4j86K71j43R9j10N7q3p9R8j54
5477a94J61J62j14k63J82j15Q0J21O0k4J24k6J2k78J23k6QJ99l18J85j51J17j05
5500h0N8M1lP7j22j27J82J3j63J64J85j49m9P1j77k56M40pk52oL40j8n1L7k35
5525h7k62K55K16o5R8j68j55K64l74L43lj15L7N2m29L17K3nq6J31j50K29j78J08
5549dl9j43J6n3J58j57K65j23l1L44l55L25m8l06KK55k35J21q6m0L56n04K28R5
5573D1N7r8m0m5k31K61k23L11K4l33L49ljj33J60l49K20j17L5L39j66L1J41k39
$$ plain form
5597 -9 -74 84 -73 2 90 -274 -193 237 -75 -52 -33 68 -79 66 4 -102 -128 158 -132 31 39 -40 -157 79
5621 79 -213 -123 46 97 94 100 -1 -112 77 -119 217 93 -49 -70 -304 117 169 92 178 74 97 171 256 52 -39
5646 -39 4 -21 -17 -233 171 84 -195 79 93 317 -2 -138 146 15 1 -14 -194 48 98 -132 294 156 -137
5669 -137 130 23 -174 -137 -163 -5 226 -42 119 36 -88 -189 -112 -52 5 -29 -138 -217 -349 -111 123 180 140
5692 140 -93 -102 -96 -51 -91 0 -94 -28 78 -73 272 -123 121 4 -15 20 89 -157 43 -33 -237 -75 -26 -65 -38
5717 -38 55 -166 123 243 48 60 91 -46 -170 168 163 91 154 -168 279 -11 -188 80 -101 144 -119 172 87
5740 87 -182 -2 133 -99 -57 48 51 -45 -21 11 -226 -101 164 5 129 169 131 6 2 -2 73 -90 118 95 11
5765 11 80 -147 -238 35 -28 96 22 -62 80 -185 39 -32 -76 65 129 -67 86 -155 66 -11 -159 167 -13
$$ packed form
5597io5J58j57P5Q8l64Q1M30l12K3J9J01j47J45o2j06k6K86k90J63Qp9j17K36
5621G9k92R0J69N1lOj01j11J89j96L36j24j42k1k34M21N2p7Q6j04K3P4Q5k04r1
5646c9M3k5Mk16M04q7k79K74J4K24l19j36K84j31j4j5j80K42N0k30M26j38k93
5669a37K67j07j97L7k6J58K31k68J61q3j24j01P7O0N7l4j09p9j32K38K34N7m0
5692A40k33rOM5m0R1r4O6J06j51L45l95K44j17j9L5O9k46K00p6k04J62M9l9K7
5717c8R3k21K89J20j95J2L1j37j24L38np2O3l22M47k90j77K68j81K45k63K91q5
5740H7k69J80J35k32M2J05Lr6K4L2k37J25K65j59J24M0l8j25mmP5j63K08k3q4
5765A1O9k27r1K73o3J24p4q4J42k65K24p1m4J41O4j96J53k41K21p7j48L26j80
$$ plain form
5788 -13 -10 176 -19 91 3 -236 -41 -109 -45 -164 29 -21 -143 -185 9 -227 -3 17 248 -298 -80 100 94 54
5812 54 144 167 -120 94 -22 28 -40 155 -4 58 -128 11 161 -90 10 -116 78 39 -153 -124 20 7 77
5835 77 -150 100 -12 -93 -147 -127 60 -158 -209 166 32 247 213 45 87 -10 40 -139 72 -61 -39 30 31 75 36
5860 36 165 -143 -3 -124 -70 -21 -21 117 34 -80 0 -6 -139 15 143 37 -403 119 -210 146 72 -161 -151 30
5884 30 -207 -177 116 -6 102 136 -47 206 -158 50 -20 16 -13 130 75 -19 -100 -185 41 -181 19 0 294 -122
5908 -122 28 101 173 -41 262 286 -81 176 -378 -118 -76 -25 -218 180 -134 -33 170 37 -19 98 -36 -63
5930 -63 38 161 82 -196 240 -170 -5 -38 -70 -130 -49 -16 151 -202 -113 261 145 364 -234 -44 -6 85 8 62
5954 62 -81 4 -157 116 8 -100 -186 62 -132 32 82 84 229 -181 -5 -21 226 -35 -244 5 -55 -71 -66 46
$$ packed form
5788a3LJ86j95J10q8k39J95o8O4j19J93n0j22m2J94k36K24K0K31n46K18J80om0
5812E4R0K3k87K14j16N0o8J95j59O2j86J39J50k51J00j26J94l9j92K9J44j3P0
5835G7k27K50j12q1n4K0J87k18n1L75j34K15l4j68M2r7N0j79K11j33K2O9JM4l9
5860C6J29l08J40j21N4M9%J38q3j14Q0oj33J54J28j06m40N22l29L56p4k33J0J81
5884C0k37L0K93j22J08L4j83K53l64K08p0L6k9J43n5r4q1q5K26k22K00j9K94m16
5908a22J50P3P2k14L03K4l67K57n54K60M2N1j93L98l14J01K03j33n6J17j34k7
5930f3J01J23p9k78M36m10J65l3l2o0Q1L3J67l53Q9L74j16K19n98J90L8R1p7N4
5954F2j43Q5j61K73j08j08q6K48j94J64N0KJ45m10J76j6K47k61k09K49o0j6NJ12
$$ plain form
5978 46 170 -228 3 36 -92 114 33 142 191 -259 149 -311 107 167 8 47 54 -133 -156 -312 -173 -78 -37 305
6002 305 -12 -24 -56 121 4 173 -108 -5 -101 72 174 80 -43 144 207 -173 -27 235 -273 5 111 236
6024 236 54 98 -234 -187 -37 -25 209 -100 -108 14 -113 -54 -99 -17 -68 -14 49 168 262 121 -185 41 -73 -30
6048 -30 13 -174 -91 -8 -61 -69 120 75 -157 50 265 -250 -112 -59 -92 185 -23 -137 109 71 -2 405 -14 112
6072 112 -196 -186 -5 -66 139 -100 106 37 8 61 201 -74 -103 17 60 -159 -176 40 -54 18 146 324 126
6095 126 68 -41 -88 31 48 -155 -180 -67 -112 368 39 -218 -141 37 31 -120 143 -53 70 -151 -30 194 -42
6118 -42 436 5 90 27 -23 -31 113 65 -136 -50 -116 -272 -221 53 107 -245 -191 163 101 89 67 -11 -118 96 -16
6143 -16 -184 28 147 104 8 -231 -77 27 165 67 42 51 -275 -34 -97 -120 -204 43 -1 -224 -251 -85 -236 61
$$ packed form
5978D6J24l98K31L3j28K06q1J09M9m50M08m60M18O0j59L9Pj87k3j56J39R5M1L42
6002C05l17j2l2J77j17J69k81J03r6J73J02r4j23J87O3l80J46K62n08K78J06J25
6024B36j82M4l32M7J50J2K34l09qJ22j27N9m5Q2n1N4O3J19R4j41l06K26j14M3
6048c0M3j87Q3Q3n3qJ89m5k32K07K15n15J38N3l3K77k08j14K46l8p3M07m19J26
6072A12l08J0J81o1K05k39K06o9k9N3J40k75k9J20M3k19j7K16r4P2J28J78j98
6095A26n8j09m7J19J7k03k5J13m5M80l29k57P7J78oj51K63j96J23k21J21K24k36
6118d2M78m31Q5o3n0qJ44m8k01Q6o6j56N1K74N4l52N4L54o2j2k2p8j07K14j12
6143a6j68K12J19m3r6k39J54J04J38r8k5Rl26K41o3k3q4K47m4k23k7J66j51K97
$$ plain form
6167 61 125 -142 348 -103 65 -156 -190 -76 -151 -233 -178 -148 -201 249 -142 128 65 212 180 71 -10 13 85 -46
6191 -46 30 38 -170 6 -164 -81 -319 -128 -50 201 168 -92 -21 182 85 12 106 -78 98 -68 216 37 -181 27
6215 27 -48 -115 -24 -204 133 14 -345 72 -176 12 -177 -180 8 99 429 223 21 -208 -146 -206 30 -19 318
6238 318 -5 89 -95 64 131 -20 -91 -65 -288 -300 -169 0 -210 65 -117 77 -166 187 -18 167 -35 77
6260 77 125 73 -132 -325 140 10 12 186 -28 -46 25 -90 -155 276 -140 115 355 67 160 -68 264 142 -14
$$ packed form
6167F1O4k67M90m51J68k21l4J14p5q2N5L0n3M50l91K70o3J47l2j09q1K3P2j31
6191d6P6Qk08J76j70Q3k38J91P8K51l3k60P1K03r7p3R4j84J76j66K84j79k18K08
6215B7p5o7R1j80L37j19l59M17k48J88j89lJ88R1L30k06k02k29O2o0K36m9L37
6238C18l23R4j84J59O7j51p1K6k23j2J31J69k10K75j82J94k43L53k05J85k02J12
6260G7M8n2k05j93M65j30KJ74k14j8P1j15o5M31m16K55K40k88R3k28L32j22j56
$$ [...]
8191A28
##END NTUPLES=NMR FID
##END=
