##TITLE=1H_LR-758-R8-C3-1
CDCl3
 8 sc, 
 3.11.2023
##JCAMPDX= 6.0         $$ Bruker NMR JCAMP-DX V2.0
##DATA TYPE= NMR FID
##DATA CLASS= NTUPLES
##ORIGIN= UXNMR, Bruker Analytische Messtechnik GmbH
##OWNER= root
$$ XWIN-NMR		Version 3.5
$$ Fri Nov  3 13:54:47 2023 Russian Standard Time (UT+4h)  she@DPX200
##.OBSERVE FREQUENCY= 200.1305
##.OBSERVE NUCLEUS= ^1H
##.DELAY= (6, 6)
##.ACQUISITION MODE= SIMULTANEOUS
##.ACQUISITION SCHEME= undefined
##.AVERAGES= 8
##.DIGITISER RES= 18
##SPECTROMETER/DATA SYSTEM= spect
##.PULSE SEQUENCE= zg30
##.SOLVENT NAME= CDCl3
##.SHIFT REFERENCE= (INTERNAL, CDCl3, 0, 15.7039)
##AUDIT TRAIL= $$ (NUMBER, WHEN, WHO, WHERE, WHAT)
$$ ##TITLE= Audit trail, XWIN-NMR		Version 3.5
$$ ##JCAMPDX= 5.01
$$ ##ORIGIN= Bruker BioSpin GmbH
$$ ##OWNER= she
$$ F:/spectra/data/she/nmr/H-F/1/audita.txt
$$ ##AUDIT TRAIL=  $$ (NUMBER, WHEN, WHO, WHERE, WHAT)
(   1,<2023-11-03 13:53:07.04 +0400>,<she>,<DPX200>,
      <created by zg, POWCHK disabled, PULCHK disabled
       configuration hash MD5:
       00 E9 B6 7A A2 85 ED C7 34 08 36 98 17 FE 4E 26
       data hash MD5: 16K
       9C 9E D6 37 7E 01 C8 5A 76 3C 14 DC EE CC E9 78>)
$$ ##END=
$$ 
$$ hash MD5
$$ B7 2E EF 3E A5 96 2C 52 B3 38 58 6E 7D D4 D1 A2
##$RELAX= 
##$RELAX= 
##$RELAX= 
##$RELAX= 
##$RELAX= 
##$RELAX= 
$$ Bruker specific parameters
$$ --------------------------
##$DU= <F:/spectra>
##$EXPNO= 1
##$NAME= <H-F>
##$PROCNO= 1
##$TYPE= <nmr>
##$USER= <she>
##$AMP= (0..31)
100 100 100 100 100 100 100 100 100 100 100 100 100 100 100 100 100 100 
100 100 100 100 100 100 100 100 100 100 100 100 100 100 
##$AQSEQ= 0
##$AQ_mod= 1
##$AUNM= <au_zg>
##$AUTOPOS= <>
##$BF1= 200.13
##$BF2= 200.13
##$BF3= 200.13
##$BF4= 200.13
##$BF5= 200.13
##$BF6= 200.13
##$BF7= 200.13
##$BF8= 200.13
##$BYTORDA= 1
##$CFDGTYP= 0
##$CFRGTYP= 5
##$CHEMSTR= <none>
##$CNST= (0..31)
1 1 145 1 1 1 1 1 1 1 1 1 1 1 1 1 1 1 1 1 1 1 1 1 1 1 1 1 1 1 1 1 
##$CPDPRG= <>
##$CPDPRG1= <>
##$CPDPRG2= <>
##$CPDPRG3= <>
##$CPDPRG4= <mlev>
##$CPDPRG5= <mlev>
##$CPDPRG6= <mlev>
##$CPDPRG7= <mlev>
##$CPDPRG8= <mlev>
##$CPDPRGB= <>
##$CPDPRGT= <>
##$D= (0..31)
0 1.2 0 0 0 0 0 0 0 0.06 0 0.03 0 0 0 0 0.0002 0 0 0 0 0 0 0 0 0 0 0 0 
0 0 0 
##$DATE= 1699005186
##$DBL= (0..7)
120 120 120 120 120 120 120 120 
##$DBP= (0..7)
150 150 150 150 150 150 150 150 
##$DBP07= 0
##$DBPNAM0= <>
##$DBPNAM1= <>
##$DBPNAM2= <>
##$DBPNAM3= <>
##$DBPNAM4= <>
##$DBPNAM5= <>
##$DBPNAM6= <>
##$DBPNAM7= <>
##$DBPOAL= (0..7)
0.5 0.5 0.5 0.5 0.5 0.5 0.5 0.5 
##$DBPOFFS= (0..7)
0 0 0 0 0 0 0 0 
##$DE= 6
##$DECBNUC= <off>
##$DECIM= 32
##$DECNUC= <off>
##$DECSTAT= 4
##$DIGMOD= 1
##$DIGTYP= 9
##$DL= (0..7)
0 120 120 120 120 120 120 120 
##$DP= (0..7)
150 150 150 150 150 150 150 150 
##$DP07= 0
##$DPNAME0= <>
##$DPNAME1= <>
##$DPNAME2= <>
##$DPNAME3= <>
##$DPNAME4= <>
##$DPNAME5= <>
##$DPNAME6= <>
##$DPNAME7= <>
##$DPOAL= (0..7)
0.5 0.5 0.5 0.5 0.5 0.5 0.5 0.5 
##$DPOFFS= (0..7)
0 0 0 0 0 0 0 0 
##$DQDMODE= 0
##$DR= 18
##$DS= 0
##$DSLIST= <SSSSSSSSSSSSSSS>
$$ [...]
##$SUBNAM2= <"">
##$SUBNAM3= <"">
##$SUBNAM4= <"">
##$SUBNAM5= <"">
##$SUBNAM6= <"">
##$SUBNAM7= <"">
##$SUBNAM8= <"">
##$SUBNAM9= <"">
##$SW= 18.0518050122584
##$SWIBOX= (0..15)
0 0 2 0 0 0 0 0 0 0 0 0 0 0 0 0 
##$SW_h= 3612.71676300578
##$TD= 16384
##$TD0= 1
##$TE= 0
##$TE2= 300
##$TE3= 300
##$TEG= 300
##$TL= (0..7)
0 120 120 120 120 120 120 120 
##$TP= (0..7)
150 150 150 150 150 150 150 150 
##$TP07= 0
##$TPNAME0= <>
##$TPNAME1= <>
##$TPNAME2= <>
##$TPNAME3= <>
##$TPNAME4= <>
##$TPNAME5= <>
##$TPNAME6= <>
##$TPNAME7= <>
##$TPOAL= (0..7)
0.5 0.5 0.5 0.5 0.5 0.5 0.5 0.5 
##$TPOFFS= (0..7)
0 0 0 0 0 0 0 0 
##$TUNHIN= 0
##$TUNHOUT= 0
##$TUNXOUT= 0
##$USERA1= <user>
##$USERA2= <user>
##$USERA3= <user>
##$USERA4= <user>
##$USERA5= <user>
##$V9= 5
##$VALIST= <valist>
##$VCLIST= <CCCCCCCCCCCCCCC>
##$VD= 0
##$VDLIST= <DDDDDDDDDDDDDDD>
##$VPLIST= <PPPPPPPPPPPPPPP>
##$VTLIST= <TTTTTTTTTTTTTTT>
##$WBST= 1024
##$WBSW= 4
##$XGAIN= (0..3)
0 0 0 0 
##$XL= 0
##$YL= 0
##$YMAX_a= 503119
##$YMIN_a= -631843
##$ZGOPTNS= <>
##$ZL1= 120
##$ZL2= 120
##$ZL3= 120
##$ZL4= 120
##$ABSF1= 10
##$ABSF2= 0
##$ABSG= 5
##$ABSL= 3
##$ALPHA= 0
##$AQORDER= 0
##$ASSFAC= 0
##$ASSFACI= 0
##$ASSFACX= 0
##$ASSWID= 0
##$AUNMP= <proc_1d>
##$AZFE= 0.1
##$AZFW= 0.1
##$BCFW= 1
##$BC_mod= 2
##$BYTORDP= 1
##$COROFFS= 0
##$CY= 11.3945322036743
##$DATMOD= 1
##$DC= 2
##$DFILT= <>
##$DTYPP= 0
##$F1P= 15.7292609196834
##$F2P= 12.9074282941183
##$FCOR= 0.5
##$FTSIZE= 0
##$FT_mod= 4
##$GAMMA= 1
##$GB= 0.15
##$INTBC= 1
##$INTSCL= 1
##$ISEN= 128
##$LB= 0.24
##$LEV0= 0
##$LPBIN= 0
##$MAXI= 10000
##$MC2= 0
##$MEAN= 0
##$ME_mod= 0
##$MI= 1.114404
##$NCOEF= 0
##$NC_proc= 0
##$NLEV= 6
##$NOISF1= 3.799351
##$NOISF2= 2.8
##$NSP= 1
##$NTH_PI= 0
##$NZP= 0
##$OFFSET= 15.70392
##$PC= 1
##$PHC0= -23879.26
##$PHC1= 21.25269
##$PH_mod= 1
##$PKNL= yes
##$PPARMOD= 0
##$PSCAL= 0
##$PSIGN= 0
##$REVERSE= no
##$SF= 200.130013532006
##$SI= 16384
##$SIGF1= 3
##$SIGF2= 2
##$SINO= 400
##$SIOLD= 16384
##$SREGLST= <1H.CDCl3>
##$SSB= 0
##$STSI= 0
##$STSR= 0
##$SW_p= 3612.71676300578
##$SYMM= 0
##$S_DEV= 0
##$TDeff= 0
##$TDoff= 0
##$TI= <>
##$TILT= no
##$TM1= 0
##$TM2= 0
##$TOPLEV= 0
##$USERP1= <user>
##$USERP2= <user>
##$USERP3= <user>
##$USERP4= <user>
##$USERP5= <user>
##$WDW= 1
##$XDIM= 8192
##$YMAX_p= 0
##$YMIN_p= 0
$$ End of Bruker specific parameters
$$ ---------------------------------
##NTUPLES= NMR FID
##VAR_NAME=  TIME,          FID/REAL,        FID/IMAG
##SYMBOL=    X,             R,               I
##VAR_TYPE=  INDEPENDENT,   DEPENDENT,       DEPENDENT
##VAR_FORM=  AFFN,          ASDF,            ASDF
##VAR_DIM=   8192,          8192,            8192
##UNITS=     SECONDS,       ARBITRARY UNITS, ARBITRARY UNITS
##FACTOR=    0.0002768,     1,               1
##FIRST=     0,             0,               0
##LAST=      2.2672688,     0,               0
##MIN=       0,             -631843,         0
##MAX=       2.2672688,     503119,          0
$$ Real data points
##PAGE= N=1
##DATA TABLE= (X++(R..R)), XYDATA
$$ [...]
$$ plain form
1850 -434 269 414 -55 -87 29 -61 -375 -231 299 253 -184 13 -202 -101 -218 472 492 109 -319 624 16
1871 16 -635 -232 31 523 -343 186 160 -384 -58 212 311 -58 -176 75 -325 -477 -223 297 344 -91 216
1892 216 130 -467 -620 462 642 87 -100 337 -71 -730 -94 368 -40 -193 70 42 -187 -160 257 331 -17
1913 -17 -181 125 -36 -409 -34 507 363 198 296 232 -199 -591 -38 226 -185 188 266 108 -334 -39 249
1934 249 229 -82 46 65 -371 -403 -201 380 136 30 319 -76 -310 -199 131 171 -85 -144 97 -133 -699 30
1956 30 404 6 136 149 302 -210 -325 480 -19 -37 -49 167 -436 -550 -132 94 16 223 290 -36 -525 -205
1978 -205 366 153 -52 382 -110 -422 -486 -304 307 371 236 713 419 -85 -293 289 -61 -282 89 -67 -411
1999 -411 -373 -236 301 133 239 471 430 -270 -288 240 -32 -87 162 288 -404 -641 43 68 35 34 381 305 -334
$$ packed form
1850d34P03J45m69l2J16r0l14J44N30m6m37J97k15J01j17O90K0l83m28R43o08
1871A6o51M03K63M92q66N29k6n44L26K70R9l69j18K51m00j52K54N20M7m35L07
1892B16q6n97j53J082J80n55j87M37m08o59O36M62m08j53K63k8k29K7M17P4l48
1913a7j64L06j61l73L75N41j44j65R8o4m31l92N53K64m11L73P8j58m42K95K88
1934B49k0l11J28J9m36l2K02N81k44j06K89l95k34J11L30M0k56n9K41k30n66P29
1956C0L74l98J30J3J53n12j15Q05m99j8j2K16o03j14M18K26p8K07O7l26m89L20
1978b05N71k13k05M34m92l12o4J82O11O4j35M77k94n04k08N82l50k21L71j56l44
1999d11L8J37N37j68J06K32m1p00j8N28k72n5K49J26o92k37O84K5l3jL47p6o39
$$ plain form
2022 -334 -181 50 150 -319 121 209 -329 -759 92 165 25 -16 599 340 -59 -249 73 -78 -316 114 194
2043 194 -223 -405 -60 325 -232 -57 491 195 10 -396 42 -156 -119 31 374 -11 -650 -271 93 28 88
2064 88 380 291 -309 -103 91 -55 -121 -13 292 63 -301 -269 -302 -176 -95 447 563 261 9 393 -65 -232
2086 -232 -152 723 -47 -369 -217 5 -75 176 351 339 444 -137 85 329 -254 -84 152 -261 -406 -426 -221
2107 -221 116 166 259 656 43 109 321 45 -311 -120 251 66 -361 -136 -315 -158 -280 524 356 224 -202
2128 -202 24 35 -547 -155 52 137 -335 -217 -38 -195 -168 302 493 202 149 117 -178 -205 -152 248 -8 -338
2150 -338 -57 -20 -14 -222 364 483 -177 137 69 -222 -419 -205 140 179 -359 -171 61 -70 -324 167 231 42
2172 42 -127 60 -28 -368 -220 170 2 -359 -62 42 -15 -321 231 528 97 -140 -46 59 -426 -256 292
$$ packed form
2022c34J53K31J00m69M40Q8n38m30Q51P3j40m1O15k59l99j90L22j51k38M30Q0
2043A94m17j82L45L85n57J75N48k96j85m06M38j98L7J50L43l85o39L79L64o5O0
2064H8K92q9o00K06J94j46o6J08L05k29l64L2l3J26Q1N42J16l02k52L84m58j67
2086b32Q0Q75p70l22J52K22q0K51J75j2J05n81K22K44n83J70K36m13j45k0K05
2107b21L37N0R3L97o13O6K12k76l56J91L71j85m27K25j79J57j22Q04j68j32m26
2128b02K26J1n82L92K07Q5m72J18J79j57K7M70J91k91n3l2k95k7N3M00k56l30
2150c38K81L7Ok08N86J19o60L14o8k91j97K14L45L9n38J88K32j31k54M91O4j89
2172D2j69J87q8l40J48L90j68l61K97J04n7l06N52K97m31k37R4J05m85J70N48
$$ plain form
2193 292 135 -79 -114 171 -128 -195 110 317 -1 34 23 33 -613 -76 263 477 225 161 -10 -111 -271 298
2215 298 519 257 -80 271 -18 -278 -300 313 265 -257 -25 138 -254 -265 125 245 229 -11 -156 27 -252
2236 -252 -218 266 62 -158 -140 196 -122 -402 209 441 77 -88 214 -34 -345 -443 267 -153 -56 -8 233 -26
2258 -26 -47 32 360 20 -102 258 29 -192 -264 120 113 -92 242 234 -60 -16 -1 129 19 -24 164 -134 -565 -451
2282 -451 -28 289 -106 156 431 183 -325 327 307 52 -187 281 -76 -411 -345 -14 156 -130 306 133 223
2303 223 158 -358 -75 -139 -343 -12 -143 -282 -320 -27 205 -211 218 358 71 -195 142 213 181 -126 -147 -82
2325 -82 -405 -251 20 112 221 231 519 63 -356 80 5 -30 -284 86 211 -141 -176 -75 25 84 441 217
2347 217 129 72 -264 164 94 -251 -275 114 -246 -331 -75 14 105 287 539 -164 -227 -33 16 -151 -102 -211 -96
$$ packed form
2193B92j57k14l5K85k99o7L05K07l18L5j1J0o46N37L39K14k52o4j71j01j60N69
2215B98K21k62l37L51k89k60k2O13m8n22K32J63l92j1L90J20j6k40j45J83k79
2236b52L4M84k04k20J8L36l18k80O11K32l64j65L02k48l11r8P10m20R7M8K41k59
2258b6k1P9L28l40j22L60k29k21p2L84pk05L34qk94M4J5J30j10m3J88k98m31J14
2282d51M23L17l95K62K75k48n08O52k0k55k39M68l57l35O6L31J70k86M36j73R0
2303B23o5n16K83o4k04L31j31j39l8K93K32m16M29J40k87k66L37P1l2l07k1O5
2325h2l23J54K71R2J09J0K88m56m19M36p5l5k54L70J25l52l5J01J00N9L57k24
2347B17q8n7l36M28p0l45k4L89l60q5K56Q9R1J82K52p03o3J94M9j67M9j09J15
$$ plain form
2370 -96 -259 -381 136 73 441 103 395 250 -20 -61 115 -3 -230 -183 146 -176 -323 117 173 33 194 302
2392 302 -16 -193 -262 -69 -251 -130 -63 12 22 -264 -14 52 -81 46 256 385 -140 52 39 -12 -87 -251 179
2415 179 -215 -191 -14 69 173 264 222 324 -150 -102 237 -68 -356 -150 -226 -119 -333 275 216 90 119 360 32
2438 32 -290 -204 -140 -97 -195 -1 246 16 -3 128 163 -132 -137 391 260 126 -77 -70 -216 -193 -254 220 285 95 97
2463 97 70 -142 322 171 183 115 -183 22 -119 -138 -279 62 82 -107 274 78 -192 107 190 69 -273 5
2485 5 -7 -175 -141 -116 35 117 275 277 109 26 -11 255 151 -282 -88 36 -53 -439 -55 30 91 121 37 79 163 139
2511 139 468 228 78 -121 -8 -240 -453 -418 250 118 115 -103 351 59 -128 313 312 26 -34 -191 -287 -569
2533 -569 -115 51 190 -95 59 190 -240 -134 34 127 -336 -167 -83 -178 -415 -237 -49 87 178 512 250
$$ packed form
2370i6j63j22N17o3L68l38K92j45k70m1J76j18k27M7L29l22j47M40N6j40J61J08
2392C02l18j77o9J93j82J21O7P5J0k86K50O6j33J27K10J29n25J92j3n1p5j64M30
2415A79l94K4J77Q3J04R1m2J02m74M8L39l05k88K06p6J07k14O08n9j26K9K41l28
2438C2l22Q6O4M3r8J94K47k30j9J31L5k95nN28j31j34k03Pj46K3o1M74O5j90K
2463I7k7k12M64j51J2o8k98K05j41j9j41L41K0j89L81j96k70K99Q3j21l42K78
2485Ej2j68L4K5J51Q2J58Kj68q3l7K66j04m33J94J24q9l86L84Q5O1L0q4M2Q4k4
2511A39L29k40j50j99J13k32k13L5O68j32lk18M54k92j87M41jk86o0j57r6k82
2533e69M54J66J39k85J54J31m30J06J68R3m63J69Q4r5k37J78J88J36R1L34k62
$$ plain form
2554 250 18 69 252 88 -42 -44 111 16 -204 192 92 15 173 157 3 -28 -3 100 -89 -125 -23 -114 33
2577 33 -321 -111 143 113 77 -24 172 94 -138 132 74 -133 -93 235 207 -151 -208 425 11 147 213 173 26
2600 26 -188 27 -219 -391 -171 132 -116 -234 -102 48 272 -132 114 -49 -53 -254 125 7 -179 -104 -65 -88
2622 -88 -186 125 93 232 68 487 138 -339 -239 -240 -22 -168 -347 -68 -1 -245 149 24 164 57 86 78 97
2645 97 -224 -247 -123 -290 -254 128 9 -267 -145 -67 31 89 133 308 270 -187 -102 -15 63 -82 -4 -25 -357 194
2669 194 98 281 27 -21 83 69 -105 -96 -86 -509 -172 -135 -384 -142 -109 56 160 224 -12 82 -191 -218 -244 -10
2693 -10 -165 74 -26 113 -215 -70 -28 85 117 95 317 -97 -135 -188 124 -237 -290 326 -98 -274 -153 -1
2715 -1 175 -97 87 0 32 -225 -196 31 -29 -62 285 -122 66 128 190 -26 141 89 64 -198 -455 21 133 -178
$$ packed form
2554B50k32N1J83j64j30kJ55r5k20L96j00p7J58j6j54l1K5J03j89l6J02r1J47
2577C3l54K10K54l0l6j01J96p8k32K70n8k07M0L28k8l58n7O33m14J36O6m0j47
2600B6k14K15k46j72K20L03k48j18J32J50K24m04K46j63mk01L79j18j86P5L9k3
2622h8r8L11l2J39j64M19l49m77J00jK18j46j79K79O7k44L94j25J40j07K9qJ9
2645I7l21k3J24j67L6L82j19k76J22P8R8N8M4J75l8m57Q5Q7P8j45P8k1l32N51
2669A94r6J83k54m8J04j4j74RJ0m23L37L7k49K42L3J65J04O4k36R4k73k7k6K34
2693a0j55K39j00J39l28J45M2J13L2k2K22m14l8n3L12l61n3O16m24j76J21J52
2715aJ76k72J84q7L2k57K9K27o0l3L47m07J88O2O2k16J67n2k5k62k57M76J12l11
$$ plain form
2739 -178 -231 298 79 -126 29 57 144 12 171 282 116 -114 83 12 264 127 99 116 134 -43 98 -83
2761 -83 -140 -164 -14 -21 -275 -72 11 -108 -94 326 229 5 -35 386 -90 -388 -1 237 -105 -159 -185 -74 -152 73
2785 73 154 95 41 -88 283 81 33 14 -33 57 -328 -80 -158 -363 -80 272 267 229 228 249 104 69 16 197 -97 -105
2811 -105 -166 136 50 -304 239 162 -66 -4 138 186 9 -127 -365 -325 -295 -38 53 -214 -132 49 354 94 79
2834 79 181 46 -80 -6 112 -104 -68 -73 -160 16 -219 -212 310 167 -134 77 23 -1 -239 49 -141 -196 124 -59
2858 -59 9 -32 134 208 170 94 205 86 -480 74 69 20 -379 -192 140 -116 110 153 -60 295 186 116 -157 -48
2882 -48 -34 157 -71 -436 119 244 -103 131 86 420 62 109 151 66 -25 -339 -251 -71 -144 -199 46 -341 -33
2905 -33 247 415 109 226 156 -7 -311 -337 4 -8 27 -90 102 -72 82 103 146 84 29 226 -69 -215 -129
$$ packed form
2739a78n3N29k19k05J55K8Q7j32J59J11j66k30J97p1K52j37k8J7J8j77J41j81
2761h3n7k4J50pk54K03Q3j19J4M20r7k24m0M21m76k98L87K38l42n4k6J11p8K25
2785G3Q1n9n4j29L71k02m8j9m7R0l85K48p8k05K83L52nl8jK1j45l5n3J81k94q
2811a05o1L02q6l54N43p7k28O2J42M8j77j36k38M0L0K57R1k67Q2J81L05k60j5
2834G9J02j35j26P4J18k16L6nq7J76k35PN22j43l01K11n4k4k38K88j90n5L20j83
2858e9O8m1J66P4l8p6J11j19n66N54nm9l99J87L32k56K26M3k13L55j09p0k73J09
2882d8J4J91k28l65N55J25l47K34m5L34l58M7M2q5r1l14Q8J80p3n5K45l87L08
2905c3K80J68l06J17p0j63l04k6L41j2L5j17J92j74J54K1M3o2n5J97k95j46Q6
$$ plain form
2928 -129 -55 94 -10 51 -154 77 46 138 197 -128 89 196 -10 -196 -131 -154 -89 -92 -281 80 58 -167 -8 19
2952 19 196 30 36 -90 -149 -6 206 92 -119 40 59 103 60 157 67 21 58 -167 -90 -253 -80 32 45 -210
2976 -210 -69 -50 205 -6 460 326 -86 276 250 42 -209 -402 126 -140 -64 122 -43 264 122 176 118 11
2998 11 168 5 3 -47 176 -250 190 -133 -83 275 61 -79 82 60 -39 288 -128 175 -159 -131 -106 201 -11
3021 -11 -150 207 209 -61 23 109 -74 -48 8 -173 -290 -285 -99 -205 143 -73 281 121 -55 130 229 -151 -188 -13
3045 -13 172 -252 -12 -300 -4 28 103 253 171 -74 -85 214 -169 -92 6 26 -193 -36 -228 -96 -115 -166 405
3068 405 122 279 -110 64 48 -109 154 88 -10 -149 31 -57 63 61 -2 123 -151 -58 94 -202 -248 -41 -140
3091 -140 -157 -325 31 104 12 144 71 344 109 200 138 26 -308 -38 -27 -82 -88 -207 -15 219 100 92 50 -110
$$ packed form
2928a29P4J49j04O1k05K31l1R2N9l25K17J07k06j86O5k3O5lj89L61k2k25J59K7
2952A9J77j66Oj26n9J43K12j14k11J59J9M4m3R7r0m6L7k25P7j63J73J12J3k55
2976b10J41J9K55k11M66j34m12L62k6k08k51j93N28k66P6J86j65L07j42N4n8j07
2998A1J57j63kn0K23m26M40l23N0L58k14j40J61k2r9L27m16L03l34K8K5L07k12
3021a1j39L57Kk70Q4Q6j83K6N6j81j17NJ86j06L48k16L54j60j76J85R9l80l7J75
3045a3J85m24K40k88K96L2P5J50q2k45j1K99l83P7R8K0k19J57j92J32j9n1N71
3068D05k83J57l89J74j6j57K63o6r8j39J80q8J20ko3J25k74R3J52k96m6K07r9
3091a40j7j68L56P3r2J32p3K73k35R1o2j12l34K70J1n5oj19J92K34j19qm2j60
$$ plain form
3115 -110 183 13 -139 20 8 81 -51 -54 -111 -58 89 241 -11 158 8 -29 138 -111 -140 -114 92 -243 49
3138 49 306 -20 24 145 320 510 182 -103 -6 184 -268 71 108 -109 -345 150 -81 -85 -11 165 373 155
3160 155 210 44 -41 -28 -40 184 66 -269 92 -99 -82 36 -95 198 103 -18 -28 -84 -351 42 52 25 -210
3183 -210 131 -50 -135 27 195 105 127 -209 -20 -168 -145 79 159 92 -65 127 144 172 280 350 -98 107 -20
3206 -20 -81 -233 -203 78 -8 100 -87 8 -4 49 -97 77 207 -127 -298 104 -77 -180 -62 -6 306 -37 -24
3229 -24 34 167 168 106 64 -47 -177 -142 -21 -219 -92 155 40 151 286 84 -75 20 49 119 -84 141 -11
3252 -11 -41 -6 -177 240 -56 -41 135 219 50 74 22 -4 -112 21 -247 73 -62 -54 -309 -200 -190 128 -81 -50
3276 -50 360 16 -24 8 -304 -20 5 -72 -122 -29 103 103 -95 16 136 -304 51 317 174 61 -308 -264 181
$$ packed form
3115a10K93j70j52J59j2P3j32ln7N3J47J52k52J69j50l7J67k49k9K6K06l35K92
3138D9K57l26M4J21J75J90l28k85R7J90m52L39L7k17k36M95k31mP4J76K08k18
3160A55N5j66q5J3j2K24j18l35L61j91J7J18j31K93r5j21j0n6k67L93J0k7k35
3183b10L41j81q5J62J68r0K2l36J89j48K3K24Q0o7j57J92J7K8J08P0m48K05j27
3206b0o1j52L0K81q6J08j87R5j2N3j46J74J30l34j71M02j81j03J18N6L12l43J3
3229b4N8J33Jo2m2j11j30L5J21j98J27K47j15J11J35k02j59R5K9P0k03K25j52
3252a1l0L5j71M17k96J5J76Q4j69K4n2k6j08J33k68L20j35Qk55J09J0L18k09L1
3276e0M10l44m0L2l12K84K5p7n0R3J32%j98J11J20m40L55K66j43j13l69M4M45
$$ plain form
3299 181 -8 132 -91 272 -102 60 104 -129 -9 -15 -25 70 -70 -91 -88 68 -81 -19 210 -36 141 208 -93
3322 -93 2 -25 -89 -10 20 53 -100 242 -50 19 188 35 -167 -26 -20 -7 217 -297 -27 -102 -64 -51 105 17 141
3347 141 16 -71 197 1 -78 135 -41 -175 -191 -17 139 115 96 179 57 199 -128 55 3 -98 -33 216 35
3370 35 26 -52 33 -7 -34 -94 -15 189 66 194 -3 162 83 21 10 -307 212 165 -95 -83 328 -165 64 56 4 274
3396 274 -115 -31 31 172 -257 207 233 -426 -311 92 158 -32 -21 176 133 -177 -75 -25 53 -263 14 66 16
3419 16 -119 -248 -18 -11 170 292 73 -128 -23 -28 -198 -118 38 -140 -164 -138 206 -28 -230 217 160 -95 -75
3442 -75 -77 157 -107 -81 513 264 11 -36 64 -161 85 -19 128 -136 73 -166 -6 -140 119 -93 -39 300
3464 300 -96 208 183 130 88 180 -80 223 -147 57 -326 137 -264 156 -6 181 34 279 -122 80 121 -11
$$ packed form
3299A81j89J40k23L63l74J62M4k33J20oj0R5j40k1LJ56j49O2K29k46J77O7l01
3322i3R5k7o4P9L0L3j53L42k92O9J69j53k02J41OJ3K24n14K70p5L8J3J56q8J24
3347A41j25q7K68j96p9K13j76j34j6J74J56k4j9Q3j22J42l27J83n2j01O5K49j81
3370C5rp8Q5m0k7o0P9K04j23J28j97J65p9o2j1l17N19m7k60J2M11m93K29qn2K70
3396B74l89Q4O2J41m29M64K6o59J15M03O6j90J1J97m3l10J02N0P8l16K77N2n0
3419A6j35j29K30PJ81J22k19k01J05nj70Q0J56j78k4K6L44k34k02M47n7k55K0
3442g5kK34k64K6N94k49k53m7J00k25K46j04J47k64K09k39J60j34K59k12N4L39
3464C00l96L04k5n3m2R2k60L03l70K04l83M63m01M20j62J87j47K45m01K02M1j32
$$ plain form
3486 -11 -33 44 27 66 -61 -210 311 60 95 66 -45 12 -200 124 -7 -141 -195 -13 -145 -58 -6 82 152 -102
3510 -102 33 -125 26 2 53 -345 95 -5 189 -88 238 88 108 168 132 34 168 263 -16 62 -134 -11 -178
3533 -178 280 53 -140 46 -101 -9 186 216 118 -205 -190 -108 -294 96 -49 74 230 140 -207 48 -40 262
3555 262 292 -175 89 -34 37 -24 -117 -220 173 163 -158 10 35 -104 140 27 234 84 -43 -6 -40 -256 -79
3578 -79 221 -49 102 17 102 -66 115 -68 11 -20 -4 75 -21 -48 -96 121 -41 -24 214 140 -56 -79 -33 -133 -109
3603 -109 81 -318 55 -176 135 156 98 -52 34 56 24 129 -13 -73 -167 -175 -93 -9 -271 -115 145 -13 -40 -261
3627 -261 44 61 -151 227 115 -165 38 102 -105 -351 145 190 -110 -123 -107 -56 165 103 2 -91 -63 122 -40
3650 -40 117 116 -121 122 -131 29 -188 48 -32 30 191 -185 -34 96 -284 -138 157 -27 115 -82 159 -71
$$ packed form
3486a1k2P7j7L9j27j49N21k51L5k9j11N7k12L24j31j34n4J82j32Q7N2Q8P0k54
3510a02J35j58J51k4N1l98M40j00J94k77L26j50K0O0l6r8J34R5k79P8j96J23j67
3533a78M58k27j93J86j47R2J95L0r8l23J5Q2j86L90j45J23J56r0l47K55q8L02
3555B62L0m67K64j23P1o1r3j03L93j0l21J68K5j39K44j13K07j50j27L7l4k16J77
3578g9L00k70J51q5Q5j68J81j83P9l1J6P9r6k7m8K17j62J7K38p4j96k3M6j00K4
3603a09J90l99L73k31L11K1n8j50Q6K2l2J05j42o0r4qQ2Q4k62J56K60j58k7k21
3627b61L05J7k12L78j12k80K03O4k07k46M96M5l00j3J6N1K21o2j01r3K8J85j62
3650d0J57jk37K43k53J60k17K36q0O2J61l76J51J30l80J46K95j84J42j97K41k30
$$ plain form
3672 -71 157 95 26 -24 44 -194 -72 -107 61 -71 75 64 -253 100 109 73 198 171 -123 -72 -70 -27 -72 58 48 -49
3698 -49 138 95 17 27 -73 91 -199 -108 -9 39 122 -39 -44 125 -144 254 -160 -137 -193 -62 162 -83 -35 192
3722 192 -65 0 8 69 -65 -164 125 227 95 -94 292 16 -82 15 -56 63 -67 -56 269 35 153 -32 20
3745 20 82 10 91 10 -49 -208 131 57 166 -176 91 -16 113 146 -138 124 -33 39 105 352 -47 -4 -71 -126
3769 -126 -95 -13 -119 -16 170 210 -108 -229 77 -194 -154 42 -193 251 -360 126 21 -9 -185 39 161 -149
3791 -149 -116 -190 -22 -144 -9 217 -69 39 -188 4 -158 25 -80 -60 -9 57 3 -125 -120 -27 208 17 -164
3814 -164 26 -18 -145 -168 216 -42 13 -3 -83 -20 -58 80 -213 161 -152 -37 266 -60 129 -36 195 123 25
3837 25 80 -14 284 -14 -163 -14 -193 -75 56 132 20 298 77 -19 -95 -155 -180 37 -71 -97 15 69 -159
$$ packed form
3672g1K28o2o9n0O8k38J22l5J68j32J46j1l17L53Rl6J25k7k94N1KM3m5J30j0r7
3698d9J87m3p8J0j00J64k90R1R9M8Q3j61nJ69k69L98m14K3n6J31K24k45M8K27
3722A92k57O5QO1j34r9K89J02j32j89L86k76r8R7p1J19j30J1L25k34J18j85N2
3745B0O2p2Q1q1n9j59L39p4J09l42K67j07J29L3k84K62j57P2O6K47l99M3o7n5
3769a26L1Q2j06J03J86M0l18j21L06k71M0J96k35M44o11M86j05l0j76K24J22l10
3791a49L3p4J68j22J35K26k86J08k27J92j62J83j05K0N1O6n4j28NR3K35j91j81
3814a64J90m4j27k3L84k58N5j6q0O3l8J38k93L74l13J15L03l26J89j65K31p2r8
3837B5N5r4K98k98j49J49j79J18J31P6j12K78k21r6p6o0k5K17j08k6J12N4k28
$$ plain form
3860 -159 57 -301 -216 -7 255 -83 18 185 -68 -161 -27 -248 -35 -20 107 161 109 -127 -98 76 207 95
3882 95 -51 4 -170 40 -111 143 -164 -100 -226 -62 26 -97 70 162 -29 -103 20 -68 -116 -135 -142 -101 -191 204
3906 204 99 129 82 -12 29 -134 16 -95 -153 -42 -75 28 31 132 -34 34 122 180 1 -25 -181 -29 -89 67
3930 67 -68 -150 -105 -59 -6 -21 99 84 141 48 -115 29 95 71 -63 -16 -126 -170 8 -130 135 -74 -203 66
3954 66 199 -53 -220 -97 -262 -48 -105 63 355 -52 138 6 177 -191 -65 104 41 -26 -105 33 -105 197
3976 197 -71 -118 -1 61 26 220 -55 77 -141 -127 -34 323 -36 -73 104 -82 137 108 17 -112 -67 145 -75
3999 -75 56 -145 -169 -113 15 67 275 -9 -176 -128 95 -224 -188 46 53 -146 196 -165 -200 -189 -23 148 -136
4022 -136 -68 -253 166 -108 -133 187 56 223 -215 -147 275 57 -8 14 1 24 -99 71 147 -93 70 29 -92
$$ packed form
3860a59K16l58Q5K09K62l38J01J67k53r3J34k21K13J5J27N4n2k36K9J74J31j12
3882I5j46N5j74K10j51K54l07O4j26J64Q8j23J67R2j91p4J23q8m8j9pM1r0L95
3906B04j05L0m7r4M1j63J50j11n8J11l3J03LJ01j66O8Q8N8j79k6j56J52o0J56
3930F7j35q2M5M6N3j5J20j5N7r3j63J44O6k4j34M7j10m4J78j38K65k09j29K69
3954F6J33k52j67J23j65K14n7J68K92m07J90j32J71l68J26J69o3o7p9J38j38L02
3976A97k68m7J17O2l5J94k75J32k18J4R3L57l59l7J77j86K19k9r1j29M5K12k20
3999g5J31k01k4N6J28N2K08k84j67M8K23l19L6K34Pj99L42l61l5J1J66J71k84
4022a36O8j85M19k74k5L20j31J67m38O8M22k18o5K2j3K3j23J70P6k40J63m1j21
$$ plain form
4045 -92 -37 132 -196 -132 -99 -17 56 14 -161 160 -90 181 281 -134 -246 -29 77 157 -49 -161 -99 -106 237 -7
4069 -7 -47 94 -59 -96 -14 122 -171 276 -104 132 -68 33 140 16 -191 -248 96 70 -67 89 -321 -138
4091 -138 -122 -79 -7 45 -96 40 -197 -145 68 341 -186 -24 199 2 -88 -86 64 -62 262 -76 9 -189 -21
4114 -21 -97 -181 40 -74 -165 -61 -128 -60 -73 12 -104 -8 -88 15 66 95 161 -90 -75 -54 207 -342 -192 34 -67
4139 -67 259 -100 -160 66 -140 58 20 39 145 108 -109 -111 -209 -24 129 -139 -183 -98 4 -100 55 -235 -23
4162 -23 -98 4 -113 -34 -216 -136 -119 -77 -22 7 23 5 -117 220 131 57 118 -15 -105 -114 -112 177 139 -3 147 20
4188 20 -205 -15 216 134 100 -125 27 105 179 140 138 172 98 97 418 -39 7 -31 28 -346 -320 -119 -5 -179 -139 -18
4214 -18 -119 25 5 -61 87 134 30 104 -10 82 46 156 -8 -58 26 31 -172 238 -70 167 240 295 -115 52
$$ packed form
4045i2N5J69l28O4L3Q2P3m2j75L21k50K71J00m15j12K17J06Q0k06j12O2pL43k44
4069gm0J41j53l7Q2J36k93M47l80K36k00J01J07j24k07n7L44k6j37J56m10J83
4091a38J6M3P2N2j41J36k37N2K13K73n27J62K23j97r0KJ50j26L24l38Q5j98J68
4114b1p6q4K21j14r1J04o7O8j3Q5j16R6q0J03N1K9O6k51J5K1K61n49J50K26j01
4139f7L26l59o0K26k06J98l8J9J06l7k17kr8J85J53k68m4Q5J02j04J55k90K12
4162b3p5J02j17P9j82Q0J7M2N5K9J6j8j22L37q9p4O1j33r0rKK89l8j42J50j27
4188B0k25J90K31q2l4k25J52P8P4l9kL4p4jL21m57M6l8N9l74K6K01J14j74M0J21
4214a8j01J44k0o6J48M7j04P4j14R2l6J10j64n0Q4Nk03M10l08K37P3N5m10J67
$$ plain form
4238 52 25 -38 -170 9 83 113 13 216 68 174 -44 -14 -166 -50 -307 -147 29 2 -237 -23 179 -26
4260 -26 -10 92 48 -53 -72 51 77 -284 -36 -155 -44 -31 -345 240 -192 -84 355 204 104 -7 -153 -107
4282 -107 121 -213 87 -195 52 -159 207 -23 -63 237 -13 -249 136 -13 51 6 -165 270 -153 -297 41
4303 41 121 27 -248 -116 -125 8 247 40 163 50 -94 159 -8 194 79 -76 -39 195 -48 46 -49 19 -111
4326 -111 -79 40 42 274 -160 93 70 -95 146 -45 -158 -37 -148 47 30 292 -48 -92 -170 -55 -268 146
4348 146 24 -45 -191 332 -7 188 47 -10 121 -248 -15 12 17 -13 -220 -54 43 -84 -7 65 6 -43 130 -38
4372 -38 161 115 -135 -235 -72 -53 -55 63 54 -43 -185 159 -10 -196 192 8 -38 224 73 -100 131 322 45
4395 45 56 178 242 110 -67 -72 -118 15 91 -29 -28 246 -109 329 177 1 191 46 113 -88 -4 207 -110 188
$$ packed form
4238E2k7o3j32J79P4L0j00K03j48J06k18L0j52J16k57J60J76k7k39K14K02k05
4260b6J6J02m4j01j9J23K6l61K48j19J11J3l14N85m32J08M39j51j00j11j46M6
4282a07K28l34L00k82K47k11L66k30m0L00k50k36L85j49O4m5j71M35m23j44L38
4303D1Q0r4k75J32rJ33K39k07J23j13j44K53j67K02j15j55L7K34k43R4r5O8j30
4326a11L2J19KK32m34K53k3j65K41j91j13J21j11J95j7K62l40m4p8J15k13M14
4348A46j22o9j46N23l39J95j41n7J31l69K33K7Nl0k07J66R7j27P7P2n9m9J73j68
4372c8J99m6k50j00J63J9kJ18rr7j42L44j69j86L88j84m6K62j51j73K31J91k77
4395D5J1J22O4j32j77nm6J33P6j20JK74l55M38j52j76J90j45O7k01Q4K11l17K98
$$ plain form
4419 188 18 49 -118 83 23 53 61 160 -139 -237 -194 5 111 -44 116 26 -68 -112 234 109 32 -104 -191 182
4443 182 20 221 -194 -71 66 -62 43 -140 140 63 -76 207 59 138 69 -23 101 -168 14 46 172 -37
4465 -37 36 220 163 -181 -46 58 0 160 221 -36 116 -21 16 -120 147 -41 142 -35 -125 16 -199 179
4487 179 -136 287 88 -108 -185 15 -112 -214 -95 -97 -108 47 217 -13 -16 -216 -41 94 -89 -134 -132 -127 -121 -43 -67
4512 -67 224 259 -325 -63 207 -37 -104 -110 102 30 -2 -99 -24 193 157 17 -58 145 3 -92 395 -64 114 193
4536 193 -210 -24 42 -254 -16 70 -139 115 -86 -145 -144 -35 -69 -47 150 -103 26 -422 -276 -89 -120 68 -142
4559 -142 240 86 256 -94 -144 153 -106 133 -353 -233 96 2 26 163 10 42 -199 -26 45 -136 -133 -27
4581 -27 276 -338 77 -186 -73 235 -75 220 -187 42 18 217 -22 -24 70 -50 170 -134 10 -51 -139 75
$$ packed form
4419A88j70L1j67K01o0L0QR9k99r8M3J99J06j55J60r0r4m4L46j25p7j36q7L73
4443A82j62K01m15J23J37j28J05j83K80p7j39K83j48P9o9r2J24k69J82L2J26k09
4465c7P3J84n7l44J35J04n8J60O1k57J52j37L7j36K67j88J83j77r0J41k15L78
4487A79l15M23j99j96p7K00j27j02J19kj1J55J70k30lk00J75J35j83m5KNOP8k4
4512f7K91L5n84K62K70k44o7oK12p2l2r7P5K17l6j40p5K03j42r5M87m59J78P9
4536A93m03J86O6k96K38Q6k09K54k01n9JJ09l4K2J97k53J29m48J46J87l1J88k10
4559a42L82j54J70l50n0K97k59K39m86J20L29r4K4J37j53L2k41J73P1j81LJ06
4581b7L03o14M15k63J13L08l10K95m07K29k4J99k39kR4j20K20l04J44o1q8K14
$$ plain form
4603 75 -24 -168 -81 -38 148 77 -45 -80 -52 48 191 100 33 -49 -7 -113 70 -115 -77 284 -34 -4 30 -49 -56 -89
4629 -89 17 -78 28 -27 157 28 284 18 11 -147 -17 -27 137 -99 -147 -191 128 187 -6 139 -29 -108 116
4652 116 4 42 89 -3 -157 -123 -162 -107 1 -162 -22 -78 -22 257 -73 -70 -26 66 -140 14 -43 180 -63 -141 69
4677 69 91 6 -197 -20 -34 258 -107 211 -155 -250 -2 -25 60 10 24 -25 102 -238 -286 24 75 -22 -9 -52 -86
4702 -86 -28 55 -28 -8 89 -73 172 27 -67 -123 -107 -59 -101 182 167 237 -75 79 183 141 67 -221 -249 -217 -224 -121
4728 -121 -195 -49 9 186 283 -114 180 -76 97 24 -53 19 -301 -152 245 -56 -40 50 170 150 -152 140 160
4751 160 32 -126 -127 70 -297 80 -138 62 -4 175 140 -276 73 112 -5 15 -125 47 93 -337 297 -164
4773 -164 -274 -242 110 -26 -36 -113 -373 1 174 -77 -204 -56 -157 37 78 225 151 127 352 -15 -425 47
$$ packed form
4603G5r9j44Q7M3J86p1j22l5K8J00J43r1o7q2M2j06J83j85L8L61l18L0L4p9pl3
4629h9J06r5J06n5J84j29K56k66pj58J30j0J64k36m8m4L19N9j93J45j68p9K24
4652A16j12L8M7r2j54L4l9N5J08j63J40n6N6K79l30LM4R2k06J54n7K23k43p8K10
4677F9K2q5k03J77j4K92l65L18l66r5K48k3Q5n0J4m9J27l40m8L10N1r7J3m3l4
4702h6N8Q3q3K0R7j62K45j45r4n6J6M8m2K83j5P0l12J54J04m2p4k88k8L2pJ03
4728a21p4J46N8J77R7l97K94k56J73p3p7P2l20J49L97l01J6R0J20k0l02K92K0
4751A60j28j58jJ97l67L77k18K00o6J79l5m16L49L9j17K0j40J72M6m30O34m61
4773a64j10L2L52j36j0p7k60L74J73k51j27J48j01J94M1J47p4k4K25l67m10M72
$$ plain form
4795 47 -33 -2 20 -146 -29 -89 -76 -43 110 9 -39 83 381 26 209 132 -127 -176 264 169 -81 27 -53 18
4819 18 -82 -131 -26 -36 36 90 -97 -137 38 -149 -69 -194 147 187 114 -3 -16 -43 74 -38 133 49 -300 -69
4843 -69 83 140 -125 33 191 -137 -34 -218 17 -90 13 -172 324 184 -135 126 173 -166 14 -82 -26 -24
4865 -24 -109 161 39 116 -158 -244 -158 -254 25 28 -3 -14 192 -158 150 -118 65 -87 84 66 174 -99 16 241
4889 241 206 -43 81 -74 -167 -102 169 57 -37 -136 -133 188 124 139 -96 292 51 76 195 -151 31 336 29
4912 29 -7 -36 22 -114 16 51 -239 -153 -63 41 -127 -33 -100 48 52 -104 -132 -172 26 10 -103 68 142 13 -20
4937 -20 120 92 -87 134 -270 150 38 -166 109 177 -146 156 33 112 88 -91 -21 -164 29 104 13 -75 -128
4960 -128 143 47 -243 14 -38 149 93 90 -370 -84 -26 103 97 85 74 -33 -138 -85 -379 -160 20 226 15 -172
$$ packed form
4795D7q0L1K2j66J17o0J3L3J53j01m8J22K98l55J83p7k59m9M40r5k50J08q0P1
4819A8j00m9J05j0P2N4j87m0J75j87Q0j25L41M0p3j17j3k7J17j12J71q4l49K31
4843f9J52N7k65J58J58l28J03j84K35j07J03j85M96j40l19K61M7l39J80r6N6K
4865b4q5K70j22P7k74q6Q6r6K79Ll1j1K06l50L08k68J83j52J71j8J08k73J15K25
4889B41l5k49J24j55r3O5K71j12r4r9LL21o4J5k35L88k41K5J19l46J82L05l07
4912B9l6k9N8j36J30L5k90Q6R0J04j68R4o7J48Mj56k8m0J98j6j13J71P4j29l3
4937b0J40k8j79K21m04M20j12k04K75O8l23L02j23P9k4j79P0j43J93P5r1q8n3
4960a28K71r6k90K57n2J87n6lm60K86N8J29oj2j1j07j05N3k94K19J80K06k11j87
$$ plain form
4984 -172 49 112 313 133 -210 -218 -45 -113 146 13 -2 -54 94 -64 -74 156 -80 308 -152 26 43 -119 -79
5007 -79 79 22 -69 56 93 -21 247 -35 -116 17 -64 74 -63 49 273 106 70 -74 196 -41 77 -39
5029 -39 -84 19 -7 -59 -268 44 -92 -49 37 112 3 -27 43 -92 -23 -10 -131 -230 -393 -110 112 -157 -63 -32 -79
5054 -79 -66 -88 54 -16 116 -20 61 140 34 -46 -143 -234 35 125 211 18 -68 100 178 112 -152 153 136 83 -49
5079 -49 205 156 16 -31 -61 -24 -156 -197 -141 134 -200 75 331 -52 -30 -364 8 -39 -111 151 -18 -56 67 -264
5103 -264 -168 -51 18 122 136 5 65 174 -79 -100 -8 85 122 154 -309 -45 -163 -71 143 241 -150 -200 138 -282
5127 -282 68 21 -100 32 126 -78 156 158 -32 64 -145 -132 -1 -12 86 -126 206 -2 -56 4 338 237 234 6
5151 6 63 -41 -279 63 3 79 33 156 -42 -130 137 221 -203 -135 -159 -69 208 -130 -37 155 103 69 -394 -231 -139
$$ packed form
4984a72K21O3K01j80l43qJ73o8K59j33j5n2J48j58j0K30k36L88m60J78J7j62M0
5007g9J58n7r1J25L7j14K68k82q1J33q1J38j37J12K24j67l6j44K70k37J18j16
5029c9m5J03k6n2k09L12j36M3Q6P5j09l0P0j35O9J3j21r9j63K83K22k69R4L1m7
5054g9J3k2J42p0J32j36Q1P9j06q0r7r1K69R0Q6j93q6J68P8o6k64L05j7n3j32
5079d9K54m9j40m7l0L7j32m1N6K75l34K75K56l83K2l34L72m7p2K62j69l8J23l31
5103b64R6J17O9J04J4j31O0J09k53k1R2R3L7L2m63K64j18R2K14R8l91n0L38m20
5127b82L50m7j21J32R4k04K34Kj90R6k09J3J31j1R8k12L32k08n4O0L34j01lk28
5151FN7j04k38L42o0P6m6J23j98q8K67Q4m24O8k4R0K77l38R3J92n2l4m63J63R2
$$ plain form
5176 -139 161 64 279 -47 -5 -204 -3 -54 -32 -127 195 73 83 251 -126 84 205 178 -239 115 -44 -34 -34
5199 -34 80 -54 91 145 266 -53 18 -71 59 33 -9 -185 131 9 134 -227 -15 104 195 -50 -1 84 29
5222 29 -197 -133 -34 41 -54 -122 -225 217 66 -8 155 -130 169 1 172 -59 84 49 -8 140 -238 -117 255
5245 255 65 64 -117 -132 152 -65 -107 208 179 -121 -84 53 -244 175 57 11 95 -67 39 34 -55 -31 -74 105
5269 105 -91 100 31 144 -381 27 140 184 27 -75 115 -86 -8 207 106 -26 -222 43 -75 -207 -127
5290 -127 191 -166 -181 32 175 -156 -133 231 -20 182 -192 -86 151 -110 25 -225 66 -64 261 -130 96
5311 96 173 21 -70 -112 -77 5 161 67 4 26 21 56 -63 170 155 -130 -64 240 82 -196 -140 31 73 -89 -130 -17
5337 -17 -188 -79 -28 94 -6 51 35 211 -64 116 -43 83 -134 -6 -69 -17 -94 36 -96 -26 -35 -2 -5 -1 -163
$$ packed form
5176a39L00r7K15l26M2j99K01n1K2r5L22j22J0J68l77K10J21k7m17L54j59J0%
5199c4J14j34J45N4J21l19P1q9J30k6m2j76L16j22J25l61K12J19R1k45M9Q5n5
5222B9k26O4R9P5r5o8j03M42j51p4J63k85K99j68J71k31J43l5n7J48l78J21L72
5245B55j90jj81j5K84k17m2L15k9l00L7J37k97M19j18m6Q4j62J06nq9K4m3J79
5269A05j96J91o9J13n25M08J13M4j57j02J90k01P8K15j01j32j96K65j18j32Q0
5290a27L18l57j5K13J43l31K3L64k51K02l74J06K37k61J35k50K91j30L25l91K26
5311I6P7j52r1m2L5Q2J56r4o3K2nL5j19K33j5k85O6L04j58k78N6J71M2j62m1J13
5337a7j71J09N1J22j00N7j6J76k75J80j59J26k17J28o3N2p7J30j32P0rL3lMj62
$$ plain form
5362 -163 96 79 -23 129 178 -5 -211 193 232 136 -66 -31 156 125 107 15 12 -72 109 98 72 99 201 -8 -65
5387 -65 -348 103 -185 44 66 16 -238 -132 85 117 218 -116 -66 -178 146 -56 20 124 57 -3 -100 -284 -2
5410 -2 28 102 52 -47 130 91 -216 243 -25 115 107 195 98 67 315 -98 -121 3 64 21 -88 -87 -67 118 16 -13
5436 -13 106 2 -114 -136 -16 -194 135 -71 12 -2 224 78 189 54 174 -44 89 158 163 -63 -56 9 101 -66
5460 -66 9 -72 -160 211 37 -214 86 158 -76 215 -98 7 -301 153 -146 164 58 -70 -110 73 101 250
5482 250 13 123 179 19 -191 207 -113 -102 131 -231 34 62 235 57 41 -109 -48 251 87 180 -240 -37
5504 -37 -196 -94 37 -48 49 96 122 -77 73 27 250 210 12 -154 91 49 -154 -87 -33 158 14 81 2 -110
5528 -110 16 39 200 169 9 -464 230 131 156 -77 270 -63 119 54 -97 -14 -98 130 -51 26 44 -173 139
$$ packed form
5362a63K59j7j02J52M9j83k06M04L9r6k02L5J87l1j8r2lq4J81j1k6K7J02k09n7
5387f5k83M51k88K29K2n0k54J06K17L2J01l34N0j12L24k02P6J04o7o0r7j84K82
5410bL0P4n0r9J77l9l07M59k68J40qQ8r7l1K48m13k3J24O1m3j09JK0J85j02k9
5436a3J19j04j16k2J20j78L29k06Q3j4K26j46J11j35J20k18J33O9Nk26PO5R2j67
5460f6P5q1q8L71j74k51L00P2k34K91l13J05l08M54k99L10j06j28m0J83K8J49
5482B50k37J10N6j60k10L98l20J1K33l62K65K8J73j78j6j50O1K99j64R3m20K03
5504c7j59J02J31q5R7M7K6j99J50m6K23m0j98j66K45m2k03O7N4J91j44O7p9j12
5528a10J26K3J61l1j60m73O94r9K5k33L47l33J82o5j51Q3q4K28j81P7J8k17L12
$$ plain form
5551 139 -155 10 -64 54 -2 -136 39 -9 100 -202 203 137 -159 59 231 -94 -168 -45 252 -125 -111 -18
5573 -18 -67 -129 -70 -44 -18 3 -22 353 57 -87 164 -110 -49 -37 -141 -2 -50 149 72 3 37 109 -6 -205 54
5598 54 13 -70 77 -124 -9 -109 -428 -28 -79 -100 -282 14 426 83 65 -68 117 20 80 34 64 -38 269
5621 269 -3 6 -106 200 -11 82 158 -109 195 -50 -96 -14 41 164 147 167 39 26 38 147 -104 -235 -29 221
5645 221 -116 -85 85 34 1 -59 -162 -101 150 -83 15 -187 -38 -9 67 -157 54 -84 -170 41 304 -37 186
5668 186 33 -40 68 -18 -42 144 144 -66 142 -24 -134 71 8 188 -228 -297 136 -183 31 -86 11 399 -153
5691 -153 -247 59 94 -135 142 313 66 35 46 -137 76 -117 51 71 -149 342 115 184 -123 0 185 161
5713 161 -124 -66 -73 -246 -87 242 -105 -31 -12 146 -122 -60 169 269 446 172 -86 52 -204 93 138 -48
$$ packed form
5551A39k94J65p4J18n6j34J75m8J09l02M05o6k96K18J72l25p4J23K97l77J4R3
5573a8m9o2N9K6K6K1k5L75k96j44K51k74O1J2j04J39m8J99p7o9L4P2j15j99K59
5598E4m1q3J47k01J15j00l19M00n1k1j82K96M12l43j8j33J85r7O0m6L0j02L07
5621B69k72Rj12L06k11R3P6k67L04k45m6Q2N5J23j7K0j28j3J2J09k51j31K06K50
5645B21l37L1J70n1l3o0j03O1K51k33R8k02J49K9P6k24K11j38q6K11K63l41K23
5668A86j53p3J08q6k4J86%k10K08j66j10K05o3J80m16o9M33l19K14j17R7L88n52
5691a53r4L06L5k29K77J71k47l1J1j83K13j93J68K0k20M91k27O9l07J23J85k4
5713A61k85N8pj73J59L29l47P4J9J58k68O2K29J00J77k74k58J38k56K97M5j86
$$ plain form
5735 -48 -79 -69 233 214 10 -39 7 -244 24 -134 125 175 39 -34 257 -93 73 -45 -172 134 -2 196 -79
5758 -79 -135 -143 20 113 -272 115 269 63 -80 94 32 49 -67 98 -213 -27 -113 104 -107 34 242 140 -75
5781 -75 -155 53 5 229 204 348 -168 22 -203 -93 105 119 88 -112 138 -378 -32 48 -78 17 65 67 -88 -111
5805 -111 -166 53 55 199 107 -72 151 43 -180 -67 -50 -13 -43 164 18 -117 -114 -69 164 31 393 -2 -49 -4
5829 -4 54 -143 -56 16 -192 10 -111 -10 52 104 -144 33 40 396 139 19 33 142 -46 -13 -89 -70 133 65 -44
5854 -44 238 63 -108 284 209 -57 96 299 55 -116 -323 184 -57 8 80 147 114 52 92 11 -4 -44 -85 -130
5878 -130 192 -140 -158 -115 -46 107 110 289 142 -179 171 -41 395 -111 -37 110 -116 -70 -162 60 -44 114 -69
5901 -69 -105 126 -147 -77 -184 -197 -7 -267 98 8 -92 -141 -24 240 4 20 118 -95 24 179 5 -137 -68
$$ packed form
5735d8l1J0L02j9k04m9M6k51K68j58K59N0j36p3K91l50J66j18j27L06j36J98k75
5758g9n6qJ63R3l85L87J54k06j43J74o2J7j16J65l11J86q6K17k11J41K08j02k15
5781g5q0K08m8K24k5J44n16J90k25J10J98J4l1k00K50n16L46Q0j26R5M8Kj55k3
5805a11n5K19KJ44r2j79K23j08k23J13J7L7l0K07j46j35LM5K33j33L62l95m7M5
5829dN8j97Q7P2k08K02j21J01O2N2k48J77PL56k57j20J4J09j88L3p6J9K03o8j09
5854d4K82j75j71L92p5k66J53K03k44j71k07N07k41O5P2O7l3o2M0q1j5m0m1m5
5878a30L22l32j8M3O9J53LJ79j47l21L50k12M36n06P4J47k26M6r2K22j04J58j83
5901f9l6K31k73P0j07j3J90k60L65r0j00m9J17K64k36J6R8k13J19J55j74j42O9
$$ plain form
5924 -68 -147 -96 -100 -144 -22 106 135 43 132 -182 65 -64 115 -35 30 -91 -119 -327 114 155 103 105 -128 111 -174
5949 -174 12 -41 90 -4 -181 -47 -109 -253 -36 -78 153 247 65 182 66 -139 15 65 155 -14 -96 -320 52
5972 52 -153 22 80 -214 40 101 -114 -158 6 57 -177 -31 48 -4 -220 21 -257 183 116 -150 -92 -216 29
5995 29 96 44 -64 304 -15 -65 139 87 170 -2 66 -109 -151 62 -232 5 2 -66 -212 -70 0 -187 -211 29
6019 29 78 81 159 -126 -233 161 -228 -181 -120 65 -72 116 -90 147 179 282 -45 -132 14 -34 198 189 206 41
6043 41 -68 211 105 2 3 12 -214 129 143 -13 -204 -154 -21 -210 -63 195 78 -43 42 -59 47 54 129 67
6067 67 -40 107 -74 -160 -192 -102 85 155 134 73 -11 220 181 133 -174 120 -282 -56 -92 -51 -25 -100 130 16 119
6092 119 -112 84 1 -163 40 43 -31 16 -452 -170 142 -68 -118 -3 -3 44 -5 -14 -120 -9 -87 -68 -101 -100 70 -285
$$ packed form
5924f8p9N1mm4J22J28K9r2Q9l14K47j29J79j50O5j21k8k08M41M1n2Kk33K39k85
5949a74J86n3J31r4j77J34o2j44K17m2K31R4j82J17j16k05J54N0R0j69q2k24L72
5972E2k05J75N8k94K54O1k15m4J64N1k34J46P9n2k16K41k78M40o7k66N8j24K45
5995B9O7n2j08L68l19n0K04n2Q3j72O8j75m2K13k94K37lo8j46J42P0j87k4K40
6019B9M9LP8k85j07L94l89M7O1J85j37J88k06K37L2J03l27q7J46m8K32rJ7j65
6043D1j09K79j06j03JRk26L43J4j56j91N0J33j89J47K58j17j21Q5j01J06PP5o2
6067F7j07J47j81q6l2R0J87P0k1o1q4K31l9m8l07K94m02K26l6M1K6p5K30j14J03
6092A19k31J96q3j64K03Lp4M7m68K82L12k10n0J15%M7m9rj06J11p8J9l3JJ70l55
$$ plain form
6118 -285 -10 371 27 -106 -125 -229 -202 178 47 255 -146 -132 91 11 101 20 158 253 186 47 18 -52 19 -30
6142 -30 71 81 34 67 146 -176 -45 -77 48 313 -133 45 56 -25 173 -155 -121 112 -180 149 -167 -72 -155 -144
6166 -144 -128 -31 189 138 -125 -93 -10 160 251 -50 -152 -106 18 59 255 57 -54 133 95 -116 -283 18 -16
6189 -16 -77 116 -325 53 226 -93 -304 52 191 66 58 10 311 19 79 268 111 -90 24 -206 43 -184
6211 -184 60 76 34 -302 -121 -233 251 232 -95 67 307 -63 -66 -92 118 227 -72 -2 -43 17 -273 -29 -16
6234 -16 53 6 -133 305 -82 -283 261 11 -34 20 -43 159 133 8 155 -26 -17 282 66 -262 191 22 -83
6257 -83 51 -73 -74 16 28 -107 -45 -81 97 -95 21 -169 7 12 -148 -141 -113 -22 59 122 294 -21 233 -51 162
6282 162 69 117 8 134 -56 -5 97 232 132 -124 -164 -127 16 23 249 -206 48 -253 288 -161 34 102 57
$$ packed form
6118b85K75L81l44j33j9j04K7L80j31K08m01J4K23q0R0q1J38R5o7j39k9p0P1m9
6142c0J01J0m7L3P9l22J31l2J25K65m46J78J1q1J98l28L4K33k92L29l16R5q3J1
6166a44J6R7K20n1k63L2Q3J70R1l01j02M6J24M1J96j98j11J87l8k11j67L01l4
6189a6o1J93m41L78J73l19k11L56J39j25qm8L01k92O0J89j57k01J14k30K49k27
6211a84K44J6m2l36J81j12M84j9l27J62K40l70lk6K10J09k99P0m1O0k90K44J3
6234a6O9m7j39M38l87k01N44k50m5N4o3K02k6j25J47j81RK99k16l28M53j69j05
6257h3J34j24jR0J2j35O2l6J78j92J16j90J76Nj60PK8R1Q1O3J72l15K54k84K13
6282A62r3M8j09J26j90N1J02J35j00k56m0L7J43PK26m55K54l01N41m49J95O8m5
$$ plain form
6305 57 -121 -68 -128 51 60 35 179 -133 121 -165 -108 -90 -38 -69 -31 185 -19 -114 -95 180 -180 332 162 -14
6329 -14 200 -123 -60 121 88 278 -83 42 42 -239 77 66 -12 -55 56 15 0 220 11 -22 195 49 -101 67
6353 67 99 73 59 137 -239 251 -82 104 -66 -160 -30 -42 8 9 88 91 -194 34 -22 -29 100 -115 -328 377 -152
6378 -152 -179 132 -253 54 168 243 -29 -65 94 24 12 -85 -63 -17 193 -118 -268 -163 -207 -117 -296 33 -69
6401 -69 -16 18 25 -83 74 56 -115 -120 -341 -127 214 -61 -50 16 76 -206 -226 -70 -250 -42 -178 -145 59 -330
6425 -330 -119 -180 -29 -23 15 -57 -12 97 9 -59 -18 5 -125 13 -27 153 -87 -1 66 91 56 11 238 203 121 169
6451 169 -55 104 -1 129 167 -15 11 -76 -228 -62 257 200 232 -9 56 32 2 -152 211 -24 116 104 -9
6474 -9 59 -87 -15 204 -34 -34 -195 -90 -66 -54 -59 273 329 330 101 48 -74 49 362 -153 -183 -209 -123 -43 -122 11
$$ packed form
6305E7j78N3o0J79Rk5J44l12K54k86N7J8N2l1L8K16k04r5J9K75l60N12j70j76
6329a4K14l23O3J81l3J90l61J25%k81L16j1p8m3J11m1j5K20k09l3K17j46j50J68
6353F7L2k6j4P8l76M90l33J86j70r4J30j2N0JP9Lk85K28n6pJ29k15k13P05n29
6378a52k7L11l85L07J14P5k72l6J59p0j2r7K2M6K10l11j50J05m4R0j79L29j02
6401f9N3L4Pj08J57j8j71nk21K14L41k75J1O6O0k82k0J56j80K08j36L3K04l89
6425c30K11o1J51OL8p2M5J09q8o8M1K3j30J38m0J80k40Q6O7K5l5m5K27l5q2M8
6451A69k24J59j05J30L8j82K6q7j52J66L19n7L2k41O5k4l0j54L63k35J40j2j13
6474iO8j46P2K19k38%j61J05K4J2nL32N6Jk29n3j22J23L13n15l0k6Q6Q0p9J33
$$ plain form
6500 11 -199 146 -77 -189 41 -145 180 116 -102 -143 114 226 -300 53 189 -5 -173 -27 76 -59 -2
6521 -2 124 55 228 -45 -150 44 70 201 77 -78 -172 -32 -222 -147 118 -52 -14 68 9 -39 133 -4 115
6544 115 144 130 176 19 60 -39 -30 166 213 212 -155 -306 -217 -55 -148 125 74 131 -10 126 103 352 -2 -84 -130 -241
6570 -241 -207 -153 -32 11 155 134 233 132 83 83 -6 27 -56 -143 158 78 59 -120 -80 262 -233 12 183 -101 21
6595 21 -99 159 -219 -132 -128 40 29 100 145 -196 -21 -129 136 64 10 63 -167 -199 14 -262 -102 302 23 123
6619 123 183 -93 33 39 -54 -30 130 -153 77 -104 27 -187 -15 -152 67 -210 -120 -84 -58 315 -54 295 -305
6642 -305 12 -197 -18 15 -130 -203 114 4 4 14 113 -87 50 219 60 10 -104 -204 -241 -136 -33 167 -290
6665 -290 174 -133 -57 324 19 -75 -95 -4 37 -23 32 -127 -8 -251 -172 69 158 70 220 -121 -147 -102 -63 147
$$ packed form
6500A1k10L45k23j12K30j86L25o4k18m1K57J12n26L53J36j94j68J46J03j35N7
6521bJ26o9J73k73j05J94K6J31j24j55r4J40j90P5K65j70L8Q2n9m8J72j37J19
6544A15K9j4M6j57M1r9RJ96M7jl67j51Q9J62r3K73n1N7j41J36k3K49l54q2m6j11
6570b41L4N4J21M3J44k1R9j01m9%q9L3q3q7L01q0j9j79M0L42m95K45J71k84J22
6595B1j20K58l78Q7MJ68j1P1M5l41J75j08K65p2n4N3k30l2K13k76J60M04k79J00
6619A23O0k76J26Or3K4J60k83K30j81J31k14J72j37K19k77R0L6K6L73l69L49o00
6642c05L17k09J79L3j45p3L17j10%J0R9k00J37J69j59n0j14j00l7J05J03K00m57
6665b90M64l07P6L81l05r4k0R1M1o0N5j59J19k43P9K41Q9q8J50l41k6M5L9K10
$$ plain form
6689 147 -5 -159 -72 119 123 -215 10 -108 108 132 228 -55 27 223 189 -154 77 74 -24 -104 94 -3 -17 -31 -160
6714 -160 -189 -222 -228 -180 117 -151 -115 -62 158 110 30 298 29 243 -188 -84 -137 -62 -101 -220 -27 -164 175 107
6738 107 141 19 -69 -5 -134 -46 76 24 105 118 11 160 -12 1 -153 -14 54 99 70 61 -133 -225 48 30 49
6763 49 -222 20 140 78 -25 -12 2 -56 59 186 -4 -162 -35 128 -15 7 -187 -188 -103 210 -49 142 65
6786 65 208 -102 64 168 -214 -172 36 -42 30 64 66 -139 61 -79 -104 45 -138 67 -139 -25 -32 -222 -55
6809 -55 64 194 -16 1 236 26 151 -197 106 24 -78 359 142 -91 88 -70 -137 252 2 222 0
6830 0 -78 -82 -116 -42 353 -107 -91 204 6 109 -83 -65 143 18 -90 4 -251 -58 174 77 -52 119 -64 -110
6854 -110 -33 -337 148 211 115 8 198 -31 62 -155 -107 -95 -32 -186 100 -38 89 254 232 170 227 -175 -24
$$ packed form
6689A47j52j54Q7J91Ml38K25j18K16K4R6k83Q2J96l4l43K31lr8q0J98r7j4j4j29
6714a60k9l3oM8K97k68L6N3K20m8q0K68k69K14m31J04n3P5l9j19J93j37L39o8
6738A07L4j22q8O4j29Q8J22n2Q1J3j07J49j72J3j54J39O8M5k9rj94r2K73j8J9
6763D9k71K42J20o2j03J3J4n8J15J27j90j58J27J63j43K2j94jQ5L13k59J91p7
6786F5J43l10J66J04l82M2K08p8P2L4Kk05K00j40k5J49j83K05k06J14pj90J67
6809e5J19J30k10J7K35k10J25l48L03q2j02M37k17k33J79j58o7L89k50K20k22
6830@p8ml4P4L95m60J6K95j98J03j92J8K08j25j08R4k55J93K32r7j29J71j83m6
6854a10P7l04M85O3r6j07J90k29R3k17M8J2O3j54K86j38J27J65k2o2N7m02J51
$$ plain form
6877 -24 61 0 -70 89 26 -222 -88 -123 24 148 254 53 12 45 185 -108 119 -49 -79 0 -85 46 -88 68
6901 68 165 16 8 177 5 157 -40 73 77 -28 -121 -57 142 -159 145 331 150 117 -48 -10 -37 20 76 -92
6925 -92 72 144 51 126 -89 -152 120 103 141 -272 33 -224 -32 -2 178 261 -149 25 -118 -142 -176 61 126 43
6949 43 74 197 127 31 73 -234 -171 -173 -122 -4 39 -88 126 22 -214 -11 -87 -163 -33 61 -210 159 58 322
6973 322 -99 88 95 223 -271 -113 68 -244 -179 -10 121 -115 75 180 -11 42 -29 -47 150 12 37 -130
6995 -130 144 -114 88 97 -96 16 -67 130 -4 -9 -110 -39 40 56 16 -190 -81 -177 -320 212 107 53 67 153
7019 153 -98 99 329 83 -45 -123 -24 17 170 43 -88 259 -303 -135 -4 17 -25 -77 -83 -80 122 -133 23
7042 23 181 -175 142 90 -69 176 77 248 -159 26 130 -430 49 -199 -107 -28 -130 -94 65 23 -71 -59 41
$$ packed form
6877b4Q5o1p0J59o3k48J34l5J47J24J06k01m1L3J40k93K27j68l0P9q5J31j34J56
6901F8R7j49qJ69j72J52j97J13Mj05r3O4J99l01L04J86j81l3j65L8k7N7N6j68
6925i2J64P2r3P5k15o3K72j7L8m13L05k57J92L0J80Q3m10J74j43k4l4K37O5q3
6949D3L1J23p0r6M2l07O3kN1J18M3j27K14j04k36K03p6p6J30R4k71L69j01K64
6973C22m21J87PJ28m94J58J81l12O5J69J31k36J90J05j91N3p1j8J97j38K5j67
6995a30K74k58K02Rj93J12q3J97j34nj01P1P9J6m0k06J09r6j43N32j05n4J4Q6
7019A53k51J97K30k46j28p8R9M1J53j27j31L47n62J68J31K1m2n2oLK02k55J56
7042B3J58l56L17n2j59K45r9J71m07J85J04n60M79k48R2P9j02L6J59m2r4J2J00
$$ plain form
7065 41 8 169 -224 -62 -196 90 -17 -153 -153 72 233 28 269 226 139 133 203 112 -100 -37 -66 204 -2 -146
7089 -146 17 74 150 114 -37 71 77 118 149 117 -60 93 64 265 -205 171 -30 43 -51 -217 -125 -79 82 299
7113 299 27 -29 -7 12 -83 10 176 33 43 87 -28 -203 -115 -59 285 -3 -136 -137 -25 -213 35 -37 99 206
7137 206 -148 85 -9 152 -21 -244 94 32 78 10 104 86 -34 40 -164 -207 103 83 37 -169 87 -125 88
7160 88 205 65 -47 195 -181 -46 -150 149 -212 -260 -73 -115 146 36 144 -287 -30 -45 -147 -15 -122
7181 -122 -94 87 248 207 -30 -64 124 -11 -58 -155 -75 -79 -74 37 1 56 -133 248 26 -127 -13 -193 -91 27
7205 27 298 25 -145 -84 181 11 -52 113 33 79 -77 62 105 33 -83 11 -178 46 393 -64 0 -61 56
7228 56 -13 65 44 -233 -194 29 214 84 -402 193 9 -101 201 30 -47 -59 17 -54 152 -22 6 98 111 69
$$ packed form
7065D1l3J61l93J62j34K86j07j36%K25J61k05K41m3q7oP0r1k12O3k9K70k06j44
7089a46J63N7P6l6j51J08OM1L1l2j77J53k9K01m70L76k01P3r4j66R2M6J61K17
7113B99k72n6K2J9r5R3J66j43J0M4j15j75Q8N6L44k88j33jJ12j88K48p2J36J07
7137B06l54K33r4J61j73k23L38o2M6o8R4j8j20P4k04m3L10k0m6k06K56k12K13
7160H8J17j40j12K42l76J35j04K99l61m8J87m2K61j10J08m31K57j5j02J32j07
7181a22K8J81J61m1k37l4J88j35m7r7Q0mNJ11l6N5j89L81k22j53J14j80J02J18
7205B7K71k73j70O1K65j70o3J65q0M6j56J39M3p2j16R4j89K24L47m57O4o1J17
7228E6o9P8k1k77L9K23J85j30m86N95j84j10L02j71p7j2P6p1K06j74K8R2J3m2
$$ plain form
7252 69 -26 121 84 -180 -3 -26 -110 -52 -31 -30 45 295 -110 -1 138 111 -139 -46 -19 -29 -166 153 -29 -130 0
7277 0 -7 -74 186 231 119 52 -306 139 282 -86 97 139 207 -162 131 -37 142 91 -536 75 114 127 127 -18 218
7302 218 171 218 -114 106 208 60 -110 -161 -93 -337 96 185 16 -67 -52 -55 217 -9 195 -97 -116 -17 158 -109
7326 -109 176 -192 97 274 99 46 83 353 -135 -87 234 75 283 98 -198 244 59 42 -175 -5 37 117
7348 117 -69 -34 254 73 36 151 49 -182 196 276 -123 -104 -117 -125 84 -24 -14 -10 -5 214 -19 -209 -19 -71
7372 -71 -210 -142 80 90 49 75 111 108 -27 -459 100 22 147 -16 65 41 146 -102 55 -87 208 -118 122 -63
7396 -63 -181 112 134 -42 22 170 -123 -25 68 -41 0 -296 85 -108 192 -30 -55 -186 -178 -53 -89 207 -117
7419 -117 -333 -218 75 -181 -39 15 -277 38 -153 310 29 -81 46 222 153 73 77 -117 140 106 143 -23
$$ packed form
7252F9r5J47l7k64J77k3q4N8K1JP5K50m05J09J39k7k50R3K7j0j37L19j82j01J30
7277@po7K60M5j12o7l58M45J43l68J83M2O8l69K93j68J79n1o27O11L9J3%j45K36
7302B18m7M7l32K20J02j48j70n1O8k44M33Q9j69q3J5lK72k26K04k92j9R9J75k67
7326a09K85l68K89J77j75n3L7K70m88M8L21j59K08j85k96M42j85j7k17J70M2Q0
7348A17j86L5K88j81l7J15j02k31L78Q0l99J9j3qK09j08J0MNK19k33j90J90n2
7372g1j39O8K22J0m1K6L6lj35m32N59p8J25j63Q1k4J05k48J57j42K95l26K40j85
7396f3j18K93K2j76O4J48k93R8R3j09M1k96L81j93L00k22k5j31QJ25l6K96l24
7419a17k16J15K93k56J42N4k92L15j91M63k81j10J27J76o9q0Mj94K57l4L7j66
$$ plain form
7441 -23 25 -1 94 24 32 38 -130 -46 16 -172 -256 -15 152 102 -133 -26 -131 -39 -94 -54 -74 77 -2 -81 120 16
7467 16 63 17 78 -99 -115 -90 -219 304 62 -170 -71 -10 -2 162 123 -68 60 82 6 46 24 287 -14 80 -118
7492 -118 44 -21 -397 -112 66 106 3 -92 29 119 158 -19 66 -135 -128 171 145 -76 136 -46 127 129 188 119
7516 119 90 -92 -135 60 -119 56 55 20 79 146 -10 20 -69 -273 -18 13 -187 -70 158 -31 -12 60 127 -99
7540 -99 297 151 103 -123 84 -23 -96 -81 40 71 -336 -223 -35 -32 -122 -18 -54 -40 71 -10 -12 -9 -20 -78 152 58
7566 58 92 307 -35 -138 15 -78 -176 -153 -81 43 -127 -52 150 -189 169 56 -125 -79 86 -272 -229 337 206
7589 206 7 -19 92 124 -108 54 -63 -57 -57 133 8 -36 159 -306 48 -29 273 25 -201 118 64 54 -201
7612 -201 -51 102 -87 -117 102 161 -33 -24 -32 66 -311 -58 -72 -125 -80 -80 81 37 -165 100 45 -86 166 -126 -75
$$ packed form
7441b3M8k6R5p0QOj68Q4O2j88q4K41J67n0k35J07j05R2n5M0k0J51p9p9K01j04
7467A6M7m6O1j77j6K5j29N23k42k32R9O1QJ64l9j91J28K2p6M0k2K63l01R4j98
7492a18J62o5l76K85J78M0j03r5J21R0L9j77Q5k01PK99k6k21K12j82J73KN9o9
7516A19k9j82m3J95j79J75jl5N9O7j56L0q9k04K55L1k00J17K28j89J9P2O7k26
7540i9L96j46m8k26K07j07p3J5J21L1m07J13J88Lr0J04l6J4J11q1kLj1n8K30r4
7566E8L4K15l42j03J53r3r8K3P2J24j70P5K02l39L58j13j81M6J65l58M3N66j31
7589B06j99k6J11L2k32J62j17O%J90j25m4J95m65L54p7L02k48k26L19n4j0k55
7612b01J50J53j89l0K19N9j94RqR8l77K53j4n3M5%J61m4k02K65n5j31K52k92N1
$$ plain form
7637 -75 286 110 145 130 -154 16 -93 43 -82 -176 188 -89 -73 263 -61 90 129 -48 73 -95 64 -157
7659 -157 -361 -86 68 190 -27 4 -47 37 -59 -30 -49 -53 -103 28 156 67 -14 60 320 221 19 87 42 191 111
7684 111 -88 240 273 -1 103 68 -122 139 -46 -293 74 -132 163 -161 157 9 -54 -30 77 -160 66
7705 66 -122 -43 118 194 -179 0 -136 -48 245 115 32 36 384 -20 -212 -178 161 176 215 -89 -44 102 -125 5
7729 5 -298 179 275 239 75 -136 -295 -121 36 0 -297 48 2 -198 34 100 -93 89 72 103 110 -104 471 17
7753 17 237 237 55 -153 140 -122 20 271 -88 -110 -101 175 -121 86 105 152 -16 -113 152 -196 -76 100 172
7776 172 161 11 50 76 -37 44 -38 -181 -102 329 -6 -105 64 -125 229 151 -128 -152 47 200 74 -46 43
7799 43 -78 -48 144 247 -56 43 -63 120 54 198 -160 200 293 -82 -18 121 60 -183 117 177 78 83 -19 -176
$$ packed form
7637g5L61j76L5j5k84J70j09J36j25r4L64k77J6L36l24J51L9j77J21j68J59k21
7659a57k04K75J54J22k17L1n1Q4r6K9j9mn0J31J28q9q1P4K60r9k02O8m5J49q0
7684A11j99L28L3k74J04l5j90K61j85k47L67k06K95l24L18j48o3K4J07k37K26
7705F6j88P9J61P6l73J79j36Q8K93j30q3ML48m04j92L4L39J5L9l04M5J46k27J30
7729El03M77R6l6j64k11j59J74J57l6k97L45m6k00K32O6j93J82j7L1Pk14N75m54
7753A7K20%j82k08K93k62J42K51l59k2RK76k96K07J9M7j68r7K65l48J20J76P2
7776A72j1j50L9K6j13Q1q2j43P9M31l35r9J69j89L54p8k79k4J99J53j26j20Q9
7799D3j21L0J92J03l03R9j06J83o6J44l58L60R3l75O4J39o1k43L00O0r9Nj02j57
$$ plain form
7823 -176 -120 148 132 -29 -26 42 -41 14 211 44 -3 20 -151 28 -100 21 19 83 345 67 116 -95 -109 -292 125
7848 125 -155 268 113 89 -73 -144 -131 -174 -160 -40 -168 -26 -92 80 -20 -11 96 -156 -101 35 224 -182 78
7871 78 -45 -87 -25 -85 -163 34 307 163 -102 -6 34 182 -12 -97 -175 -13 204 36 -46 41 140 6 96 34 204
7896 204 -102 96 167 150 -67 -203 90 -66 -7 175 106 -233 41 37 -81 -87 146 231 -5 -168 -145 27 199
7919 199 2 -69 52 -118 161 97 12 -140 -130 128 1 -20 115 -187 -60 -127 -81 83 -214 12 -38 -34 40 -158
7943 -158 72 61 36 -128 -110 -179 1 148 -44 56 -203 -28 82 8 -54 -81 92 108 -116 -78 109 276 63
7966 63 -235 194 -217 -60 51 65 -43 -174 -62 44 -101 45 55 15 -113 162 135 174 42 -249 -180 -3
7988 -3 -208 121 14 -237 -14 7 -28 179 5 -373 25 35 -199 -144 85 91 -64 32 173 -29 -152 -150 -4 32
$$ packed form
7823a76N6K68j6j61LO8q3N5J97j67m7K3j71J79j28J21kO4K62k78M9k11j4j83M17
7848A25k80M23j55k4j62p1J3m3J4J20j28J42o6J72j00RJ07k52N5J36J89m06K60
7871G8j23m2O2o0p8J97K73j44k65R6M0J48j94q5p8J62K17j68q2Q7R9j34R0o2J70
7896B04l06J98P1j7k17j36K93j56N9J82o9l39K74mj18oK33Q5k36j63K3J72J72
7919A99j97p1J21j70K79o4q5j52J0K58j27k1J35l02J27o7M6J64k97K26n0MP4j98
7943a58K30j1k5j64J8o9J80J47j92J00k59J75J10p4o2k7J73J6k24L8J87J67k13
7966F3k98M29m11J57J11J4j08j31J12J06j45J46J0m0j28K75k7L9j32k91O9J77
7988ck05L29j07k51K23K1l5K07j74l78L98J0k34N5K29Oj55R6J41k02j23KJ46L6
$$ plain form
8012 32 -15 157 -52 15 -157 -78 238 -51 178 95 -86 123 -82 42 -136 -59 -172 -73 -171 7 94 56 183
8035 183 -106 3 82 -73 143 -160 -313 -99 7 -143 -127 -35 -190 25 -6 -72 94 9 -100 -15 130 -118
8057 -118 250 220 -80 65 169 124 127 -77 -25 53 158 -44 274 -103 215 -73 29 -108 -241 -64 113 72
8079 72 95 155 -195 145 -15 -50 24 -158 73 -81 8 -7 59 293 37 199 -40 98 -60 -19 -219 27 157
8102 157 207 197 178 173 53 -48 117 -40 -171 149 77 64 -17 116 -7 -114 13 -242 4 -168 -87 -138 -30
8125 -30 -193 85 59 -30 -55 149 259 -103 137 -146 79 -267 -139 -99 132 -72 -221 143 113 36 39 44 -30 217
8149 217 422 -295 -158 69 94 -77 91 458 69 -9 -134 -63 9 -27 -142 72 -53 53 -191 -233 51 -64
8171 -64 231 95 142 -93 3 159 142 24 37 85 131 -51 -139 -30 154 -15 -104 16 260 35
$$ packed form
8012C2m7J72k09O7j72P9L16k89K29q3j81K09k05J24j78P7j13R9r8J78Q7l8J27
8035A83k89J09P9j55K16l03j53K14J06j50J6R2j55K15l1o6J66q5j09Q5J45k48
8057a18L68l0l00J45J04m5Lk04N2P8J05k02L18l77L18k88J02j37j33J77J77m1
8079G2K3O0l50L40j60l5P4j82K31j54Q9j5O6K34k56J62k39J38j58M1k00K46J30
8102A57N0j0j9nj20j01J65j57j31L20p2j3q1J33j23j07J27k55K46j72Q1n1J08
8125c0j63K78k6q9k5K04J10l62K40k83K25l46J28M0K31k04j49L64l0p7LNp4K47
8149B17K05p17J37K27K5j71J68L67l89p8j25P1P2l6j15K14j25J06k44m2K84j15
8171f4K95j36M7k35R6J56j7j18J3M8M6j82q8J09J84j69q9J20K44k25
8191C5
$$ Imaginary data points
##PAGE= N=2
##DATA TABLE= (X++(I..I)), XYDATA
$$ plain form
0 0 0 0 0 0 0 0 0 0 2 -8 8 -8 8 -16 16 -24 32 -39 48 -56 64 -80 94 -111 128 -150 174 -201 231 -265 304
31 304 -345 392 -444 503 -565 633 -711 792 -886 984 -1095 1215 -1344 1486 -1642 1812 -1998
48 -1998 2201 -2425 2671 -2943 3246 -3582 3958 -4385 4866 -5425 6071 -6837 7758 -8888
62 -8888 10320 -12197 14776 -18565 24691 -36306 66310 -322372 -631843 -223467 -122672
73 -122672 29598 250950 503119 438860 288066 199695 155362 -47815 -221594 -236616 -157769
84 -157769 -174079 -164454 -58460 52489 35244 12488 51205 87176 49155 34704 69620 87341
96 87341 37086 -6307 -26041 -63589 -122777 -131716 -94089 -57984 -23610 48300 120812 142235
108 142235 125260 107183 64711 -23286 -111958 -146473 -142574 -133334 -94347 1066 95186 126319
$$ packed form
0@%%%%%%%%Kj0J6j6J6k4L2m0N6p1Q7j04J20j44J74k05K39k78L24l75M32m96N69
31C04o49P37q36R47j068J198j344J503j678J870k079K310k559K830l128L454l810
48a998M199m626N096n614O189o828P540q343R251j0291J1496j2908J4595j6646
62h888J9208k2517K6973l3341M3256o0997J02616l88682l09471M08376J00795
73a22672J52270K21352K52169o4259j50794q8371m4333k03177j73779j5022P8847
84a57769j6310R625J05994J10949j7245k2756L8717L5971l8021j4451L4916J7721
96H7341n0255m3393j9734l7548n9188q939L7627L6105L4374P1910P2512K1423
108A42235j6975j8077m2472q7997q8672l4515L899R240L8987R5413R4120L1133
$$ plain form
120 126319 123353 128810 105105 20805 -64305 -91250 -92785 -111606 -109077 -44860 28484 51272 54115
133 54115 79343 85305 33840 -17579 -18070 -10692 -31486 -35912 2531 27285 3182 -18195 -3266
146 -3266 -1119 -35185 -47247 -13371 9976 2557 14790 56092 68358 38786 17976 13587 -13526
159 -13526 -57832 -69721 -48253 -33631 -27102 861 35619 42367 32382 31508 29597 7564 -15786
172 -15786 -21194 -21272 -27917 -26125 -7715 9306 13463 14233 15307 8937 -2366 -7345 -6515 -6249 -3396
187 -3396 3468 5951 1521 -253 2132 471 -4222 -4663 -2160 -2287 -1476 3790 8706 9394 8741 5197
203 5197 -5411 -16923 -19519 -15801 -13338 -5692 9849 21009 19829 16091 16802 11241 -4871 -16035
217 -16035 -16355 -19017 -26287 -21877 -3687 10722 14842 22152 29023 21641 4907 -5345 -9677 -17097
$$ packed form
120A26319k966N457k3705q4300q5110k6945j535j8821K529O4217P3344K2788K843
133E4115K5228N962n1465n1419m91P378k0794m426L8443K4754k4103k1377J4929
146c266K147l4066j2062L3876K3347p419J2233M1302J2266k9572k0810m389k7113
159a3526m4306j1889K1468J4622O529K7963L4758O748r985q74j911k2033k3350
172a5786n408p8o645J792J8410J7021M157P70J074o370j1303m979Q30K66K853
187c396O864K483m430j774K385j661m693m41K503j27Q11N266M916O88o53l544
203E197j0608j1512k596L718K463P646J5541J1160j180l738P11n561j6112j1164
217a6035l20k662p270M410J8190J4409M120P310O871p382j6734j0252m332p420
$$ plain form
231 -17097 -22568 -17309 -8330 -5207 -2603 7665 16903 18347 15231 12693 8524 -709 -9411 -13526 -13330
246 -13330 -10493 -8364 -6854 -4387 1103 5652 8385 12610 16931 15159 7176 48 -5157 -12350 -17219
261 -17219 -14575 -8239 -7133 -5970 2380 10144 10364 10667 16269 15600 4130 -5152 -6439 -9105 -15551
276 -15551 -13158 -2344 2341 3 2994 10816 9643 4266 5652 8068 891 -8179 -7586 -4062 -6500
291 -6500 -5634 2881 7537 2735 -144 3426 3943 -244 -277 4337 2703 -2995 -4584 -1755 -1575 -850 3974
308 3974 6537 4135 1052 346 -1789 -5229 -4306 -240 -494 -1912 -244 2280 1739 2518 5246 5080 730
325 730 -1146 -1199 -3165 -4296 319 5113 3645 473 2357 2330 -2442 -3747 493 1603 -3620 -4420 -802
342 -802 -553 -2260 2744 10454 9526 4404 3991 4277 -2980 -8890 -5215 -1831 -6004 -8226 -1515 2759
$$ packed form
231a7097n471N259Q979L123K604J0268R238J444l116k538m169r233q702m115J96
246a3330K837K129J510K467N490M549K733M225M321j772p983p128n205p193m869
261a7219K644O336J106J163Q350P764K20L03N602o69j1470r282j287k666o446
276a5551K393J0814M685k338K991P822j173n377J386K416p177r070N93L524k438
291f500Q66Q515M656m802k879L570N17m187l3M614j634n698j589K829J80P25M824
308C974K563k402l083p06k135l440R23M066k54j418J668K524n41P79K728j66m350
325G30j876n3j966j131M615M794j468l172J884k7m772j305M240J110n223q00L618
342h02K49j707N004P710r28n122m13K86p257n910L675L384m173k222O711M274
$$ plain form
358 2759 521 2283 10699 11538 3823 -977 -283 -2959 -9828 -9398 -2879 -952 -3461 -449 5811 7161
374 7161 5996 8443 10317 5228 -3925 -8051 -8910 -10635 -11154 -6682 964 5376 5744 6759 10565 10843
390 10843 6764 1383 -1207 -4148 -10873 -15106 -10698 -3631 -558 2069 9184 13352 9360 4797 6482
405 6482 5822 -1794 -8148 -7249 -7987 -12616 -11495 -1824 5132 4857 7257 12620 10390 3378 1102 2606
421 2606 -1003 -7155 -8328 -6922 -8362 -7916 -1235 4675 6670 8462 11230 8177 1875 257 1218 -2674
437 -2674 -8162 -7007 -4075 -6825 -7300 786 8170 7351 6615 10237 9072 -329 -5054 -1967 -2483 -8765
453 -8765 -8963 -2705 -1310 -3656 557 7966 9000 5615 5209 4544 -450 -5441 -4308 -2578 -3646 -4413
469 -4413 -1742 -1166 -1755 448 4246 4531 3566 5085 4136 -983 -3826 -573 374 -3589 -4577 -1492 -1194
$$ packed form
358B759k238J762Q416Q39p715m800O94k676o869M30O519J927k509L012O260J350
374G161j165K447J874n089r153m126q59j725n19M472P646M412L68J015L806K78
390A0843m079n381k590k941o725m233M408P067L073K627P115M168l992m563J685
405F482o60p616o354Q99p38m629J121R671O956k75K400N363k230p012k276J504
421B606l609o152j173J406j440M46O681N910J995J792K768l053o302j618R61l892
437b674n488J155K932k750m75Q086P384q19p36L622j165r401m725L087n16o282
453h765j98O258J395k346M213P409J034l385m06o65m994m991J133J730j068p67
469d413K671N76n89K203L798K85r65J519r49n119k843L253R47l963r88L085K98
$$ plain form
486 -1194 -4663 -3323 3426 5897 4168 4889 6227 2174 -3241 -3274 -1725 -3619 -6098 -4216 -1043 -1227
502 -1227 -1601 2496 7446 7725 4891 2920 1421 -2436 -5527 -6263 -4436 -3960 -3978 -2465 634 2980 3901
519 3901 5570 8542 6982 1357 -2391 -2816 -4962 -8218 -6425 -1462 -435 -3360 -319 5620 5215 2748
535 2748 6374 10107 3976 -4681 -3760 -1451 -7062 -11647 -5073 1279 -2608 -4267 4200 10600 6532
550 6532 4384 10424 8672 -3595 -9493 -4893 -5555 -13043 -10015 1520 3811 -1413 2917 12736 11561
565 11561 3628 3811 6447 -2301 -12470 -10560 -5637 -7177 -7383 1395 7837 4327 2423 7758 9257
580 9257 2335 -854 1489 -999 -8485 -9722 -3626 -1840 -4158 -733 5898 5735 1280 2741 7567
595 7567 5932 772 -749 34 -4605 -10251 -8837 -3453 -1949 -1973 2182 7659 7659 3582 4437 7826 4887
$$ packed form
486a194l469J340O749K471j729P21J338m053n415l3J549j894k479J882L173j84
502a227l74M097M950K79k834j971j499l857l091p36J827M76j8J513L099K346R21
519C901J669K972j560n625l748m25k146l256J793M963J027k925L041N939m05k467
535B748L626L733o131q657R21K309n611m585O574O352l887j659Q467O400m068
550F532k148O040j752j2267n898M600o62p488L028J1535K291n224M330R819j175
565A1561p933J83K636q748j0169J910M923j540k06Q778O442l510j904N335J499
580I257o922l189K343k488p486j237O096J786k318L425O631j63m455J461M826
595G567j635n160j521P83m639n646J414N384J504k4M155N477%m077Q55L389k939
$$ plain form
612 4887 -3082 -6140 -4654 -6730 -11025 -8265 1008 4676 2450 3929 9389 7607 447 -457 3206
627 3206 -339 -7771 -7533 -2558 -3432 -5745 -23 7339 5877 1255 3297 5714 717 -3346 -197 1891
643 1891 -3738 -7216 -2921 -514 -3760 -2304 4932 6297 1717 1373 4413 2270 -2636 -1423 1400
658 1400 -2358 -6941 -4551 -1130 -2453 -2529 3760 7709 4166 1116 3273 2883 -2023 -3967 -1784 -2047
674 -2047 -6009 -5837 -1720 -2 116 4010 7805 6270 2570 1187 348 -2410 -5017 -4390 -3353 -3367 -3092
691 -3092 -1073 1481 3848 5378 5590 4318 2249 -898 -3717 -4712 -3740 -3061 -2937 -1850 192 845 159
708 159 2171 5211 4743 1887 885 363 -2717 -5082 -3508 -1734 -2546 -2999 -308 1058 384 1522 5212
725 5212 5998 3258 1562 1085 -2440 -5791 -5265 -3169 -2944 -2480 294 2511 2140 3333 6060 5791 2534
$$ packed form
612D887p969l058J486k076m295K760R273L668k226J479N460j782p160r04L663
627C206l545p432K38M975q74k313N722P362j462m622K042K417m997m063L149K088
643A891n629l478M295K407l246J456P236J365m580l44L040k143m906J213K823
658A400l758m583K390L421j323p6O289L949l543l050K157l90m906j944K183k63
674b047l962J72M117J718J18L894L795j535l700j383q39k758k607O27J037j4K75
691c092K019K554K367J530K12j272k069l147k819r95R72O79J24J087K042O53o86
708A59K012L040m68k856j002n22l080k365J574J774q12m53K691J366o74J138L690
725E212P86k740j696m77l525l351N26K096K25M64K774K217l71J193K727k69l257
$$ plain form
742 2534 -100 -1202 -4359 -7427 -5567 -2065 -868 -161 2539 4276 3095 2259 3875 3416 64 -1752
758 -1752 -2627 -4185 -6119 -4014 -126 783 769 3159 4255 1859 716 2205 2343 -228 -1848 -1709 -2708
775 -2708 -4795 -3585 -173 1050 925 2725 3722 2104 727 1617 2104 -510 -2024 -2112 -2793 -4282 -3452
792 -3452 351 1675 1816 3013 3891 1932 24 211 441 -1211 -2105 -1398 -2314 -3809 -2484 993 1443
809 1443 1979 3102 2973 574 -1191 -326 -367 -1705 -1968 -856 -1242 -2725 -1133 1457 1910 1461 2797
826 2797 2399 -309 -2050 -911 -202 -1673 -1688 514 -206 -2045 -1127 1482 1853 666 1639 2423 -291
843 -291 -2296 -1077 394 -673 -1274 356 417 -1765 -2179 618 1789 698 1201 2348 956 -1439 -1214
860 -1214 157 -284 -1350 -668 -34 -1416 -2146 -418 1385 1444 1546 1931 1206 -305 -807 -295 -526 -396
$$ packed form
742B534k634j102l157l068J860L502J197P07K700J737j181q36J616m59l352j816
758a752q75j558j934K105L888R09j4K390J096k396j143J489J38k571j620J39r99
775b708k087J210L412J223j25J800R97j618j377Q90M87k614j514q8o81j489Q30
792c452L803J324J41J197Q78j959j908J87K30j652q94P07r16j495J325L477M50
809A443N36J123j29k399j765Q65m1j338k63J112l86j483J592K590M53m49J336
826B797l98k708j741J139P09j471j5K202p20j839R18K609L71j187R73P84k714
843b91k005J219J471j067o01J630O1k182m14K797J171j091N03J147j392k395K25
860a214J371m41j066O82O34j382p30J728J803N9J02L85p25j511n02N12k31J30
$$ plain form
878 -396 -135 -593 -1334 -1683 -1030 35 1128 1968 1772 576 122 129 160 -491 -53 696 -666 -2123 -1705 -677
898 -677 -801 42 1995 2697 841 -150 762 337 -1134 -932 1014 -614 -2899 -2348 -154 -155 -732 1863
916 1863 3814 1443 -778 529 792 -1514 -1974 358 315 -2373 -2843 -35 1173 -73 1030 3587
932 3587 2705 -329 -850 687 -369 -2328 -849 526 -1230 -2405 -1014 1080 752 1223 2692 2798
948 2798 682 -626 -233 -961 -1907 -1006 -197 -1201 -2262 -903 723 1167 1698 2735 2312 763 -713
965 -713 -1294 -1987 -2076 -1172 -531 -831 -560 341 936 1199 2153 2776 1769 -55 -896 -1556 -2274 -1875 -665 -30
985 -30 -492 -295 730 550 603 2050 2731 1309 -514 -221 -850 -2548 -2530 -484 203 -1283 -1055 486 1066
1004 1066 361 1671 3796 2001 -449 -775 -1107 -2874 -3676 -1716 264 127 -448 1489 2592 1521
$$ packed form
878c96K61m58p41l49O53J065J093Q40j96j196m54PL1o51M38P49j362j457M18J028
898f77j24Q43J953P02j856r91R12m25j471K02J946j628k285N51K194jn77K595
916A863J951k371k221J307K63k306m60K332m3k688m70K808J208j246J103K557
932C587q82l034n21J537j056j959J479J375j756j175J391K094l28M71J469J06
948B798k116j308L93p28r46R01Q09j004j061J359J626M44N31J037m23j549j476
965g13n81o93q9R04O41l00K71R01N95K63R54O23j007j824q41o60p18L99J210O35
985c0m62J97J025j80N3J447O81j422j823K93o29j698J8K046O87j486K28J541N80
1004A066p05J310K125j795k450l26l32j767q02J960J980j37n75J937J103j071
$$ plain form
1020 1521 1344 2686 1887 -668 -1880 -2192 -2681 -2856 -1035 826 686 744 1793 1689 819 1160 2146 1091
1038 1091 -985 -1172 -1107 -2727 -2874 -1085 893 267 -330 1216 1861 1011 917 2733 2324 -575 -1672 -1384
1056 -1384 -2487 -3827 -2178 403 467 706 1780 2684 2021 1177 1887 1565 -981 -2240 -2673 -3134 -3057 -1405
1074 -1405 812 1675 1819 2082 2279 1279 449 816 482 -857 -1682 -2002 -2218 -1974 -879 632 1126 1428
1092 1428 1811 1574 1143 944 1201 595 -352 -1059 -2145 -2774 -2518 -777 324 820 1948 2564 2167 1226
1110 1226 983 747 205 -1525 -1472 -1854 -3095 -2838 -161 1714 1527 2249 3345 2255 108 -437 287 -551
1128 -551 -2134 -1798 -995 -1476 -2335 5 2325 2097 1499 2595 2234 -152 -1147 -193 -228 -1661 -1823 -795
1146 -795 -1014 -1961 -412 1813 2434 1197 1817 2206 202 -1686 -823 -121 -1502 -2122 -928 -490 -1143 -513
$$ packed form
1020A521j77J342p99k555j212l12m89j75J821J861j40N8J049j04q70L41R86j055
1038A091k076j87O5j620j47J789J978o26n97J546O45q50r4J816m09k899j097K88
1056a384j103j340J649K581O4K39J074R04o63q44P10l22k546j259m33m61P7J652
1074a405K217Q63J44K63J97j000q30L67l34j339q25l20k16K44J095J511M94L02
1092A428L83k37m31j99K57o06r47p07j086o29K56J741J101M96J128O16l97r41
1110A226k43k36n42j730N3l82j241K57K677J875j87P22J096j090k147n45P24q38
1128e51j583L36Q03m81q59K340K320k28n98J096l61k386r95R54l5j433j62J028
1146g95k19r47J549K225O21j237O20L89k004j888Q63P02j381o20J194M38o53O30
$$ plain form
1164 -513 1882 2593 1768 1517 1342 -250 -1747 -1772 -816 -1160 -1570 -376 -216 -417 572 1760 2231 1832 1444
1183 1444 883 -440 -1316 -1367 -1363 -939 -1042 3 -80 -91 607 1644 1851 1671 1761 989 -888 -1843 -1678 -1528
1203 -1528 -1705 -749 135 -19 103 657 1729 1747 1090 1738 935 -1519 -2177 -1350 -1276 -1225 -415 1123 665 83
1223 83 662 1838 1227 365 1016 874 -1006 -2199 -1131 -664 -1052 -362 958 969 -354 295 1477 1212
1241 1212 225 706 880 -729 -1846 -1223 -808 -1344 -548 953 1231 8 665 1677 1442 295 370 627
1259 627 -1019 -2300 -1674 -1148 -897 -66 1418 1277 720 584 661 670 -267 -178 233 -819 -1911 -993 -649 -284
1279 -284 -81 1221 1245 21 257 737 474 -298 320 572 -586 -1591 -1187 -594 -856 -151 943 1511 573
1298 573 737 897 683 -68 237 302 -923 -1984 -1299 -532 -813 -97 1461 1715 1040 711 861 232 -861
$$ packed form
1164e13K395P11q25k51j75j592j497k5R56l44m10J194J60k01R89J188M71l99l88
1183A444n61j323q76n1MM24j03J045q3j1O98J037K07j80R0p72j877r55J65J50
1203a528j77R56Q84j54J22N54J072J8o57O48q03k454o58Q27P4N1Q10J538m58n82
1223H3N79J176o11q62O51j42j880j193J068M67l88O90J320J1j323O49J182k65
1241A212r87M81J74j609j117O23M15n36P96J501K78j223O57J012k35j147P5K57
1259F27j646j281O26N26K51Q31J484j41n57j36P7Rr37Q9M11j052j092R18L44L65
1279b84K03J302K4j224K36M80k63p72O18K52j158j005M04N93k62P05J094N68r38
1298E73J64J60k14p51L05O5j225j061O85P67k81P16J558K54o75l29J50o29j093
$$ plain form
1317 -861 -599 46 -1126 -1875 -985 4 -273 239 1833 2121 637 200 283 -344 -795 -542 41 -656 -1275
1336 -1275 -902 -214 -413 -73 1340 1730 686 -13 627 8 -735 -461 8 -505 -1514 -1146 -430 -558 119
1355 119 1325 2124 855 530 671 -343 -988 -847 -471 -725 -1370 -752 -254 -43 590 1736 1875 939 408
1374 408 -155 -487 -1076 -882 -77 -457 -979 -448 223 10 154 1487 1764 762 27 158 -264 -1172 -648
1393 -648 -29 -278 -885 -509 214 -315 8 1149 1735 764 437 287 -260 -1337 -807 -86 -383 -821 -358
1412 -358 200 11 48 1293 1741 505 30 182 -351 -1426 -1100 -116 19 -615 -42 516 80 -224 875
1431 875 1503 594 61 -33 -294 -1104 -1147 121 321 21 -251 276 -19 -394 514 938 667 96 427 103
1451 103 -1023 -837 9 126 -371 -129 350 -243 -545 185 1136 435 48 284 -249 -706 -690 303 229 -168
$$ packed form
1317h61K62O45j172p49Q90R89k77N12J594K88j484m37Q3o27m51K53N83o97o19
1336a275L73O88j99L40J413L90j044o99O40o19p43K74M69n13j009L68P16j28O77
1355A19J206P99j269l25J41j014o45J41L76k54o45O18M98K11O33J146J39r36n31
1374D08n63l32n89J94Q05l80n22N31O71k13J44J333K77j002p35J31m22r08N24
1393f48O19k49o07L76P23n29L23J141N86r71l27j50n47j077N30P21k97m38M63
1412c58N58j89L7J245M48j236m75J52n33j075L26R84J35o34N73N58m36l04J099
1431H75O28r09n33r4k61q10m3J268K00l00k72N27k95l75R08M24k71n71L31l24
1451A03j126J86Q46J17m97K42M79n93l02P30R51p01l87K36n33m57J6R93p4l97
$$ plain form
1471 -168 112 245 48 -533 503 765 294 -38 453 -147 -923 -686 -2 174 -201 294 198 -268 -536 231
1491 231 669 97 249 672 395 -677 -660 219 -164 -361 14 413 -163 -881 85 690 475 190 905 565
1511 565 -383 -1190 -166 183 -595 -281 399 -74 -556 124 1032 608 97 486 284 -816 -1163 -465 -85
1530 -85 -194 -240 492 150 -659 266 1039 632 505 477 218 -630 -783 -279 -114 -613 -185 438 81 -298 119
1551 119 598 486 446 618 259 -1071 -1145 -539 -349 -576 -159 772 382 -28 -64 856 896 26 133 267 -902
1572 -902 -1107 -644 -120 -329 -7 693 491 87 323 814 341 113 425 442 -833 -946 -642 -255 -364 239
1592 239 692 497 -386 133 629 232 -189 363 171 -816 -1178 -384 -56 115 330 924 592 150 36 395
1612 395 230 -202 116 5 -465 -767 -21 -80 -192 211 916 587 -203 -88 239 -270 -432 186 179 -606 -771
$$ packed form
1471a68K80J33j97n81J036K62m71l32M91o00p76K37O84J76l75M95r6m66k68P67
1491B31M38n72J52M23k77j072J7Q79l83j97L75L99n76p18R66O05k15k85P15l40
1511E65r48q07J024L49p78L14O80m73m82O80R08m24n11L89k02j100l47O98L80
1530h5j09m6P32l42q09R25P73m07j27k8k59q48j53N04J65m99M28O23l57l79M17
1551A19M79j12m0J72l59j330p4O06J90k27M17R31l90m10l6R20M0q70J07J34j169
1572i02k05M63N24k09L22P00k02m04K36M91m73k28L12J7j275j13L04L87j09O03
1592B39M53j95q83N19M96l97m21N52j92r87l62P94L28J71K15N94l32m42j14L59
1612C95j65m32L18j11m70l02P46n9j12M03P05l29p90J15L27n09j62O18pp85j65
$$ plain form
1633 -771 -218 -100 -354 370 780 689 -98 -227 350 -195 -280 -60 360 -421 -578 -200 -32 -232 134 853 486
1654 486 -155 -398 -361 -193 -703 -93 486 -217 -398 -328 280 33 244 669 580 -381 -288 -192 -152 -454 54 371
1676 371 -145 -650 27 -8 -171 1 730 430 -165 -269 141 -239 -764 40 274 -51 -381 38 -53 -170 62
1697 62 854 449 73 -201 -77 -287 -702 279 284 -9 -504 51 342 -36 299 820 296 1 -445 -10 -437
1718 -437 -916 -199 532 217 -183 -196 164 45 -47 800 444 69 -167 -65 -122 -721 -535 259 -50 -37 -65 363
1740 363 -191 -386 717 584 -173 -130 89 -395 -444 -166 181 -93 -318 106 102 -104 -243 406 450 138 -277
1761 -277 62 -358 -406 78 281 56 68 -2 125 -212 -402 246 407 -20 -247 210 -371 -608 -344 673 145
1782 145 -220 76 38 -586 -140 601 311 -208 -193 -109 -406 -285 -159 230 366 95 -75 237 -274 -392 60
$$ packed form
1633g71N53J18k54P24M10r1p87j29N77n45q5K20M20p81j57L78J68k00L66P19l67
1654D86o41k43L7J68n10O10N79p03j81P0O08k47K11M25q9r61R3R6M0l02N08L17
1676C71n16n05O77l5j63J72P29l00n95j04M10l80n25Q04K34l25l30M19r1j17K32
1697F2P92m05l76k74J24k10m15R81Nk93m95N55K91l78L35N21n24k95m46M35m27
1718d37m79P17P31l15m00j3L60j19r2Q47l56l75k36J02n7n99J86P94l09J3k8M28
1740C63n54j95J103j33p57M3K19m84m9K78L47k74k25M24mk06j39O49M4l12m15
1761b77L39m20m8M84K03k25J2p0J27l37j90O48J61m27k27M57n81k37K64J017n28
1782A45l65K96l8o24M46P41k90n19J5Q4k97J21J26L89J36k71j70L12n11j18M52
$$ plain form
1803 60 390 -61 229 194 -196 -273 -210 393 195 -67 240 191 -143 -297 444 485 -11 -125 251 -410 -547 -250
1825 -250 338 398 -5 334 350 -484 -435 18 340 54 -200 231 -140 -501 -266 257 583 142 -134 260 -94
1846 -94 -273 -33 242 14 -274 289 187 -545 -465 331 240 -198 513 438 -286 -259 -93 339 -66 -186 517 -102
1868 -102 -547 -177 185 352 296 317 200 -282 -403 -249 132 -14 7 315 129 -314 -120 413 -1 -279 106
1889 106 271 -454 -752 28 232 -198 -203 457 132 -258 -172 113 -67 -268 260 278 -124 -77 -172 171 117 -119
1911 -119 696 108 -462 -507 -35 161 -34 211 522 72 -365 34 48 -325 -41 102 21 -226 -401 116 6
1932 6 -170 334 470 -9 -352 78 272 153 201 123 30 -485 -518 -52 -175 -253 268 698 230 -333 -215 80
1954 80 -19 -207 -3 84 -564 -350 138 150 -107 164 480 400 -113 -223 -82 -270 -67 231 20 -397 -334 -113
$$ packed form
1803F0L30m51K90l5l90p7O3O03j98k62L07m9l34j54P41M1m96j14L76o61j37K97
1825b50N88O0m03L39J6q34M9M53L22k86k54M31l71l61K35N23L26m41k76L94l54
1846i4j79K40K75k28k88N63j02p32Q0P96r1m38P11p5p24K7J66M32m05j20P03o19
1868a02m45L70L62J67n6K1j17m82j21J54L81j46K1L08j86m43J94N33m14k78L85
1889A06J65p25k98P80K04m30nO60l25l90Q6K85j80k01N28J8m02M7r5L43n4k36
1911a19Q15n88n70m5M72J96j95K45L11m50m37L99J4l73K84J43q1k47j75N17j10
1932Fj76N04J36m79l43M30J94j19M8p8r3n15l3M66j23p8N21M30m68n63J18K95
1954H0r9j88K04Q7o48K14M88J2k57K71L16q0n13j10J41j88K03K98k11m17O3K21
$$ plain form
1976 -113 113 -72 181 491 41 -53 -80 -53 -280 -176 265 276 -543 -246 -52 42 -301 98 494 243 -283 -237
1998 -237 -29 -391 -452 206 459 -34 -54 243 -101 -88 77 507 290 -199 112 94 -416 -191 68 245 -20
2019 -20 -334 -5 128 98 233 789 417 -238 -227 -93 -110 -525 322 219 -136 -294 -43 131 -319 289 570
2040 570 274 -85 -332 105 -281 -447 77 262 -263 -82 20 -97 -183 15 531 325 -194 -227 118 -189 -261
2061 -261 -38 221 -101 -81 -147 264 -518 -76 553 509 35 -111 24 -427 -334 229 170 -213 -212 72 -300 -195
2083 -195 -111 427 293 16 154 116 -291 -639 27 -42 -84 -444 24 -86 -124 -155 600 349 85 143 82 -271 -380
2106 -380 11 44 -83 -411 44 188 -397 -122 661 563 125 78 50 20 -474 93 -80 -360 -257 -66 11 -60
2128 -60 159 676 421 -281 -8 -33 -126 -395 -160 0 -31 -171 -68 60 -258 -46 165 296 152 78 185 -401
$$ packed form
1976a13K26j85K53L10m50r4k7K7k27J04M41J1q19K97J94R4l43L99L96k51n26M6
1998b37K08l62o1O58K53m93k0K97l44J3J65M30k17m89L11j8n10K25K59J77k65
2019b0l14L29J33l0J35N56l72o55J1J34j7m15Q47j03l55j58K51J74m50O08K81
2040E70k96l59k47M37l86j66N24J85n25J81J02j17q6J98N16k06n19l3L45l07p2
2061b61K23K59l22K0o6M11p82M42O29m4m74j46J35m51R3N63n9l83JK84l72J05
2083a95Q4N38j34k77J38l8m07l48O66o9m2l60M68j10l8l1P55k51k64N8o1l53j09
2106c80L91L3j27l28M55J44n85K75P83r8m38m7k8l0m94N67j73k80J03J91P7p1
2128f0K19N17k55p02K73k5r3k69K35J60l1j40J03J28l18K12K11J31j44p4J07n86
$$ plain form
2150 -401 -450 -105 65 -80 -146 100 273 -195 44 40 512 204 -62 131 -344 -358 -247 217 -21 -88 221 81
2172 81 -15 -244 469 329 -1 178 379 135 -380 -345 210 130 -107 90 143 -282 -517 71 181 341 -2 64
2194 64 -60 -350 -71 283 -83 -128 169 351 -92 60 122 112 186 121 342 -3 -477 -120 285 237 -73 -16 370
2217 370 -19 -353 83 44 -135 -36 -8 -111 -344 -176 222 232 -13 198 224 -143 -152 -82 161 -295 235 142 98
2240 98 -68 -100 5 95 -201 120 179 -132 -3 -54 -108 38 143 212 11 -542 -625 -175 54 214 422 297 -34
2263 -34 -33 285 233 -221 61 283 122 -375 9 -107 229 -34 -68 374 -90 -149 60 64 -105 -142 291 -183 -470
2286 -470 -68 83 145 109 240 197 299 -154 134 -137 -477 97 12 -114 -442 -132 117 10 -170 236 600
2307 600 14 -167 -135 -272 -304 16 80 64 -350 -414 -13 -311 13 166 678 290 -349 155 141 -468 -145 409
$$ packed form
2150d01m9L45J70j45o6K46J73m68K39mM72l08k66J93m75j4J11M64k38o7L09j40
2172H1r6k29P13j40l30J79K01k44n15L5N55q0k37J97N3m25k35N88J10J60l43O6
2194F4j24k90K79L54l66m5K97J82m43J52O2j0P4o5K21l45m74L57M05m8l10N7L86
2217C70l89l34M36l9j79R9K8j03k33J68L98J0k45K11K6l67rP0K43m56N30r3m4
2240I8j66l2J05R0k96L21N9l11J29n1n4J46J05O9k01n53q3M50K29J60K08j25l31
2263c4JL18n2m54K82K22j61m97L84j16L36k63l4M42m64n9K09Mj69l7M33m74k87
2286d70M02J51O2l6J31m3J02m53K88k71l40N74q5j26l28L10K49j07j80M06L64
2307F00n86j81L2j37l2L20O4j6m14o4M01k98L24J53N12l88o39N04j4o09L23N54
$$ plain form
2329 409 87 -336 -22 52 -100 114 -32 201 136 -91 75 1 -136 -405 106 96 -297 -95 -71 -31 -121 233
2351 233 221 85 -104 -33 -101 -257 -312 -38 328 -182 -292 240 200 -273 295 693 192 -59 -155 -122 -291 -111
2373 -111 59 188 -346 16 256 122 -50 153 362 87 -230 -22 48 -334 -266 -169 -31 -17 -69 118 50 10
2395 10 134 554 105 -207 22 116 -288 -339 -86 139 -38 -39 218 260 -135 401 406 9 -144 -35 -69 -409 -247
2418 -247 159 -14 -25 -35 149 130 -117 311 430 55 -64 -162 168 -221 -368 47 129 -20 144 279 -24 -16
2440 -16 -25 327 199 -401 133 -100 -456 -342 -42 76 -16 156 360 177 -101 60 3 44 -398 126 -50 -84
2462 -84 -203 19 210 -84 174 491 -50 -306 9 266 -53 -87 -144 109 -95 -176 23 372 -115 162 265
2483 265 270 -87 -125 313 63 100 -205 -69 -455 -367 135 466 37 -34 356 151 21 -103 266 165 -323 132
$$ packed form
2329D09l22m23L14P4j52K14j46K33o5k27J66p4j37k69N11j0l93K02K4M0r0L54
2351B33j2j36j89P1o8j56n5K74L66n10j10N32m0m73N68L98n01k51r6L3j69J80
2373a11J70J29n34L62K40j34j72K03K09k75l17K08P0l82O8R7J38J4n2J87o8m0
2395A0J24M20m49l12K29R4m04n1K53K25j77jK57M2l95N36Nl97j53J09l4l40J62
2418b47M06j73j1j0J84j9k47M28J19l75j19r8L30l89j47M15Q2j49J64J35l03Q
2440a6rL52j28o00N34k33l56J14L00J18r2J72K04j83k78J61n7M1m42N24j76l4
2462h4j19K22J91k94K58L17n41k56L15K57l19l4n7K53k04q1J99L49m87K77J03
2483B65Nl57l8M38k50L7l05J36l86Q8N02L31m29p1L90k05j30j24L69j01m88M55
$$ plain form
2505 132 -153 -383 -85 111 114 84 68 -12 70 9 -247 -129 220 33 154 -38 -403 -498 -135 161 276 76 197
2528 197 254 -339 -166 198 173 -165 30 132 -88 -386 189 305 152 -77 254 400 -97 -93 30 -12 -275 -78
2550 -78 80 -249 -281 172 155 53 127 501 42 -311 -3 -36 -256 -277 -142 -126 25 -256 -303 179 48 390 91
2573 91 244 -246 -436 -210 -113 -348 -325 228 -84 -72 54 322 184 203 216 58 -255 -243 -45 -108 -90 153 -10
2596 -10 -104 -13 104 -23 186 184 380 33 -148 -296 -36 -48 -226 -74 91 34 -183 105 72 326 118 81 265
2619 265 -155 -273 -140 15 -173 -47 245 -238 200 -112 294 102 153 282 209 26 -279 41 -117 -189 -64
2640 -64 -208 -244 62 0 -22 116 410 332 274 -235 -223 -106 -172 -292 -57 208 -23 128 45 276 -154 -126 74
2663 74 114 26 -118 -24 -145 -66 191 206 1 -99 95 236 309 -118 312 43 -29 -356 -234 -161 -306 58 197
$$ packed form
2505A32k85k30K98J96Ll0j6q0Q2o1k56J18L49j87J21j92l65r5L63K96J15k00J21
2528A97N7n93J73L64k5l38J95J02k20k98N75J16j53k29L31J46m97MJ23m2k63J97
2550g8J58l29l2M53j7j02P4L74m59l53L08l3k20k1J35J6J51k81m7M82j31L42k99
2573I1J53m90j90K26R7k35K3N53l12J2J26K68j38J9J3j58l13J2J98o3J8K43j63
2596a0r4R1J17j27K09kJ96l47j81j48K60j2j78J52J65n7k17K88l3K54k08l7J84
2619B65m20j18J33J55j88J26K92m83M38l12M06j92N1J29p3j83l05L20j58p2J25
2640f4j44l6L06o2k2J38K94p8n8n09J2J17o6j20K35K65k31J51q3K31m30K8K00
2663G4M0q8j44R4j21P9K57J5k05j00J94J41P3m27M30k69p2l27J22P3j45L64J39
$$ plain form
2686 197 84 110 -46 167 53 -17 277 380 -77 -184 -193 -104 -307 -162 88 69 110 226 150 55 99 11 147 -305
2710 -305 101 -306 -158 46 -113 312 117 105 245 51 99 -12 179 70 -62 -203 -2 228 92 -236 69
2731 69 276 155 122 -121 172 -70 36 54 12 -292 -16 143 40 -88 183 115 49 156 115 94 -99 227 -166
2754 -166 2 -24 -3 -259 -127 -82 104 162 157 -20 91 50 -333 261 285 -201 126 4 -18 -1 68 217 284 -121
2778 -121 -45 79 -104 -77 -124 -175 100 36 -256 123 -131 -164 163 311 59 -77 78 42 -101 82 -282 -158
2800 -158 -352 102 -124 -21 -409 129 128 -2 342 -67 -12 -274 12 -101 -235 -159 -28 -35 -70 -115 142 91 -31
2823 -31 60 -100 31 -216 -154 -40 -38 -36 27 43 -152 137 204 287 120 306 192 81 -86 -306 -301 -184 -139 37 -357
2848 -357 -134 227 281 349 220 192 -58 -114 -2 -145 -39 -147 -279 128 28 -70 -57 26 259 -170 102 472
$$ packed form
2686A97j13K6j56K13j14p0K94J03m57j07rQ9k03J45K50j9M1J16p6r5M4q8J36m52
2710c05M06m07J48K04j59M25j95j2J40j94M8j11J91j09j32j41K01K30j36l28L05
2731F9K07j21l3k43K93k42J06J8m2l04K76J59j03j28K71o8o6J07m1k1j93L26l93
2754a66J68k6K1k56J32M5J86N8nj77J11m1l83N94K4m86L27j22k2J7O9J49O7m05
2778a21P6J24j83K7m7n1K75o4k92L79k54l3L27J48k52j36J55l6j43J83l64J24
2800a58j94M54k26J03l88N38jj30L44m09N5k62K86j13j34P6J31pl5m5K57n1j22
2823c1R1j60J31k47O2J14KKO3J6j95K89O7Q3j67J86j14j11j67k20NJ17M5J76l94
2848c57K23L61N4O8j29k8k50n6J12j43J06j08j32M07j00r8J3Q3K33m29K72L70
$$ plain form
2870 472 -195 -328 33 -39 -217 233 -275 261 -61 78 11 382 144 56 65 -64 -160 -59 21 -155 80 218
2892 218 161 -44 235 -35 136 20 200 -182 -437 -315 -154 -69 -159 -34 2 245 -63 -103 74 544 17 218
2914 218 152 -137 -266 -270 -176 -21 -80 112 117 182 119 96 243 79 -35 16 109 -153 -170 -41 -5 -12 173 326 115
2939 115 87 132 424 7 51 193 -217 -288 -212 -174 13 -5 49 152 157 53 63 106 -109 2 213 -222 -458 -164
2963 -164 -70 -175 20 190 197 -49 -3 78 24 -278 119 142 -8 -86 -177 -92 59 -70 43 146 428 -344 -34
2986 -34 297 98 -13 -1 -199 -388 -55 -149 182 -136 203 361 -135 16 99 48 261 138 139 -8 -80 -190 266
3009 266 -8 200 347 185 362 -143 41 99 76 40 -46 38 -18 -204 -84 -118 52 327 283 -155 -99 63 166
3032 166 7 -126 -4 -14 17 -213 -365 -203 -101 288 338 135 -199 -312 230 -63 -189 -72 72 -138 67
$$ packed form
2870D72o67j33L61p2j78M50n08N36l22J39o7L71k38q8Rj29r6J01Q0j76K35J38
2892B18n7k05K79k70J71j16J80l82k55J22J61Q5r0J25L6K43l08m0J77M70n27K01
2914B18o6k89j29mR4J55n9J92NO5o3k3J47j64j14N1R3k62j7J29L6pJ85J53k11
2939A15k8M5K92m17M4J42m10p1P6L8J87j8N4J03Nj04J0M3k15J11K11m35k36K94
2963a64R4j05J95J70Pk46M6Q1n4l02L97K3j50p8r1Q5J51j29J13J03K82p72L10
2986c4L31j99j11J2j98j89L33r4L31l18L39J58m96J51Q3n1K13j23Jj47p2j10M56
3009B66k74K08J47j62J77n05J84N8k3l6q6Q4n6j86J20l4J70K75m4m38N6J62J03
3032A66j59j33J22j0L1k30j52J62J02L89N0k03l34j13N42k93j26J17J44k10K05
$$ plain form
3053 67 264 -297 52 -43 104 87 273 -30 280 -75 -249 -145 92 -141 -163 100 -119 -138 105 346 67 -165
3075 -165 39 130 203 -140 -77 -61 -54 12 61 -46 56 281 179 228 52 -261 2 -118 -10 142 326 -42 -291
3098 -291 354 80 -114 287 137 -217 -115 -97 30 -70 4 80 27 21 -138 130 104 -75 163 190 247 294 -98
3121 -98 107 -28 -167 -1 -314 81 140 71 -17 342 133 202 200 -191 81 112 159 -284 38 96 -141 6 159
3144 159 119 -94 58 206 174 -78 -48 -25 -294 -248 201 -55 3 88 -111 -16 209 171 -6 176 -78 57 -275
3167 -275 -135 -279 330 -11 14 188 2 108 111 -96 251 170 -71 115 39 -66 -249 -66 -71 -31 -45 143 131
3190 131 110 -78 58 29 -122 60 93 -135 -434 139 87 17 379 86 171 66 74 287 3 -7 134 -16 -277
3213 -277 -174 28 71 13 -103 282 138 175 203 199 216 -171 138 15 -127 -290 80 165 60 -60 53 240 95
$$ packed form
3053F7J97n61L49r5J47j7J86l03L10l55j74J04K37k33k2K63k19j9K43K41k79k32
3075a65K04R1P3l43O3J6PO6M9j07J02K25j02M9j76l13K63j20J08J52J84l68k49
3098b91O45k74j94M01j50l54J02J8J27j00P4P6n3oj59K68k6j79K38K7N7M7l92
3121i8K05j35j39J66l13L95N9o9q8L59k09O9kl91K72L1M7m43L22N8k37J47J53
3144A59m0k13J52J48l2k52L0K3k69M6M49k56N8Q5j99R5K25l8j77J82k54J35l32
3167b75J40j44O09l41K5J74j86J06Lk07L47q1k41J86p6j05j83J83nM0j4J88j2
3190A31k1j88J36k9j51J82L3k28k99N73n2p0L62k93Q5j05QK13k84j0J41j50k61
3213b77J03K02M3n8j16L85j44L7K8mJ7l87L09j23j42j63L70Q5j05j20J13J87j45
$$ plain form
3236 95 -1 -21 -125 -87 267 126 132 -148 79 283 301 325 217 -29 -51 169 105 -136 -52 -48 -5 -43 77 -144 -26
3261 -26 -10 -88 378 216 68 202 127 -204 175 -322 -89 -158 -216 40 134 -54 219 333 418 -367 7 96 -175
3284 -175 -90 -207 157 -17 32 -77 61 217 307 170 255 -87 -345 25 -163 -56 -5 156 161 83 -39 26 -122
3307 -122 -54 -17 -10 -330 -154 -30 44 -106 -70 -65 282 -181 13 29 -8 105 274 288 -60 35 79 137 50 -35 31 145
3333 145 -311 -4 -166 -50 155 134 276 28 37 91 -254 -166 0 92 64 -58 -46 181 -128 -114 140 268 128
3356 128 -184 -329 -127 -73 -300 103 81 216 62 -63 32 84 106 -54 -72 -7 -105 -138 10 -197 -81 147 109
3379 109 -59 206 -48 138 -31 -61 74 -356 -240 87 98 -11 33 -52 -58 133 -80 -125 92 5 165 -255 260
3402 260 -51 -339 -57 -173 270 163 -130 183 100 -279 25 -132 186 -15 -35 -201 -239 -30 3 226 -333
$$ packed form
3236I5r6k0j04L8L54j41Ok80K27K04J8K4j08k46k2K20o4k41Q4MM3l8J20k21J18
3261b6J6p8M66j62j48J34p5l31L79m97K33o9n8K56R4j88K73J14Q5p85L74Q9k71
3284a75Q5j17L64j74M9j09J38J56R0j37Q5l42k58L70j88J07N1J61Np8j22O5j48
3307a22O8L7Pl20J76J24P4j50L6NL47m63J94J6l7J13J69J4l48R5M4N8q7q5O6J14
3333A45m56L07j62J16K05k1J42k48RN4l45Q8J66R2k8j22J2K27l09J4K54J28j40
3356A28l12j45K02N4k27M03k2J35j54j25R5N2K2j60j8O5r8l3J48k07J16K28l8
3379A09j68K65k54J86j69l0J35m30J16L27J1j09M4q5oJ91k13m5K17q7J60m20N15
3402B60l11k88K82j16M43j07k93L13q3l79L04j57L18k01k0j66l8K09L3K23n59
$$ plain form
3423 -333 -32 45 96 -11 -323 24 231 -77 56 -170 -152 -137 -216 129 -140 63 50 -271 43 242 -155 6
3445 6 -60 -170 53 -71 -137 -174 102 -25 92 179 111 103 -24 47 7 -313 -50 -125 -14 14 210 -42 103 127 -166
3470 -166 -164 179 -140 -46 -151 52 -55 -127 74 -188 -130 61 -101 -42 124 -11 -93 -223 -112 12 -198 -238 -263
3493 -263 -75 -255 -8 128 -121 4 -40 -14 332 -5 -327 188 -23 341 -22 -45 -84 67 19 9 222 -210
3515 -210 -111 93 -187 -41 49 -20 -159 107 -222 34 41 25 -19 -98 12 130 -97 -263 -364 170 -289 -110 -130
3538 -130 47 -121 -132 285 241 82 -123 140 226 -134 65 -68 -107 -80 -154 -22 26 158 -26 -146 -64 -62 252
3561 252 64 18 -72 8 -183 -23 -10 6 -7 -134 -79 -81 -227 -191 157 -200 -89 65 -11 -220 -6 -2 261 81
3585 81 63 123 198 -38 -116 158 -145 -42 -18 -13 113 -116 225 192 -95 117 42 29 -44 17 77 197 -132 -114 -85
$$ packed form
3423c33L01P7N1j07l12L47K07l08J33k26J8J5p9L45k69K03j3l21L14J99l97J61
3445Fo6j10K23j24o6l7K76j27J17Q7o8qj27P1m0l20K63p5J11K8J96k52J45K4k93
3470a66KL43l19R4j05K03j07p2K01k62N8J91j62N9J66j35q2j30J11J24k10m0k5
3493b63J88j80K47J36k49J25m4K6L46l37l22N15k11L64l63k3l9J51m8j0K13m32
3515b10R9K04k80J46R0o9j39K66l29K56Pj6m4p9J10J18k27j66j01N34m59J79k0
3538a30J77j68j1M17m4j59k05K63Q6l60J99j33l9K7p4J32M8J32j84j20Q2KL14
3561B52j88m6r0Q0j91J60J3J6j3j27N5kj46L6L48l57J11J54p6k09K14MK63j80
3585H1j8O0P5k36p8K74l03J03K4NJ26k29L41l3k87K12p5j3p3O1O0J20l29J8K9
$$ plain form
3610 -85 -37 -223 445 -130 -58 16 -55 -71 -131 96 281 107 -254 -151 -42 -43 133 61 41 -50 -204 50 14 189
3634 189 -105 80 245 -288 1 -36 -51 -83 -82 111 -252 82 283 274 -116 90 95 -126 -122 -75 -203 -42 265 -30
3658 -30 111 -65 -219 152 128 3 -51 61 -48 -155 47 8 40 -94 -28 444 -52 18 174 -89 60 87 167
3681 167 15 -23 -27 -199 -343 105 152 -120 -26 -38 38 -14 -157 -149 -10 -28 -192 -80 -87 -110 -238 -122 80 138 26
3706 26 -91 80 219 -166 -8 125 -81 -254 239 1 182 77 39 122 147 -63 80 109 -87 118 194 -148
3728 -148 -112 35 59 -149 117 77 -74 -24 27 -16 -86 25 -6 -60 -14 77 79 29 125 -26 -39 -45 -42 -62 315 -92 -71
3755 -71 -79 -53 -85 -113 -24 -11 -34 -75 104 -21 -136 -162 147 -87 176 -31 -32 -106 -144 -36 -181 -95 76 118 80 -68
3781 -68 -20 33 19 111 -111 224 152 -119 1 -119 -115 15 195 220 35 169 17 -9 -106 -146 82 3 35 -91 189
$$ packed form
3610h5M8j86O68n75P2P4p1j6o0K27J85j74l61J03J09jJ76p2k0r1j54K54l6J75
3634A89k94J85J65n33K89l7j5l2JJ93l63L34K01rl90K06Nk21MM7j28J61L07k95
3658c0J41j76j54L71k4j25n4J12j09j07K02l9L2j34O6M72m96P0J56k63J49K7Q0
3681A67j52l8mj72j44M48M7k72R4j2P6n2j43QJ39j8j64J12pk3j28J16K02N8j12
3706B6j17J71J39l85J58J33k06j73M93k38J81j05l8Q3K5k10J43K9j96K05P6l42
3728a48L6J47K4k08K66m0j51N0N1m3p0J11l1n4M6R1Kn0R6j51j3oLk0L77m07K1
3755g1qK6l2k8Q9J3k3m1J79j25j15k6L09k34K63k07jp4l8J08j45Q6J71M2l8j48
3781f8M8N3j4R2k22L35p2k71J20j20MJ30J80K5j85J34j52k6r7m0K28p9L2j26K80
$$ plain form
3806 189 -139 -95 91 34 -260 -94 176 -17 -23 16 43 -66 59 -122 36 -73 -202 17 122 -175 -336 -44
3828 -44 33 -124 89 -14 119 -83 -111 131 -228 15 29 -20 -127 -4 230 -150 -47 -82 206 5 -192 -149
3850 -149 176 -187 -98 38 85 79 -8 197 -174 2 -69 -51 -193 -59 -69 -84 -63 109 296 219 143 -134 -119 107
3874 107 -257 -108 98 -113 -62 216 -191 167 -11 57 28 -203 -151 104 -71 49 -125 -34 -67 179 64 -346
3896 -346 -272 -86 -67 -39 -67 -45 -183 132 -138 7 207 87 -36 10 172 53 189 84 92 -165 -117 -92 -48 -199
3920 -199 -131 108 101 -281 136 -192 420 76 -26 162 -10 3 -44 -197 -157 104 5 36 -7 116 -186 -123 210
3943 210 -20 -78 -78 -306 -9 -53 -123 -76 73 -280 11 99 121 -62 72 -48 20 118 -163 326 209 52 8 -57
3967 -57 187 132 54 72 106 -220 4 27 18 38 74 -19 127 -4 15 50 -89 251 -15 -12 78 -76 151 -98 -23 221
$$ packed form
3806A89l28M4J86n7k94J66K70j93oL9K7j09J25j81J58j09j29K19J05k97j61K92
3828d4P7j57K13j03J33k02k8K42l59K43J4m9j07J23K34l80J03l5K88k01j97M3
3850a49L25l63Q9J36M7oq7K05l71J76p1J8j42J34j0j5K1J72J87p7p6k77J5K26
3874A07l64J49K06k11N1K78m07L58j78O8k9k31N2K55j75J20j74R1l3K46j15m10
3896c46P4J86J9K8k8K2j38L15k70J45K00j20j23M6J62j19J36j05Qk57M8K5M4j51
3920a99O8K39pl82M17l28O12l44j02J88j72J3m7j53M0K61r9L1m3J23l02O3L33
3943B10k30n8%k28K97m4p0M7J49l53K91Q8K2j83J34j20O8R8k81M89j17j57m4o5
3967e7K44n5p8J8L4l26K24K3rK0L6r3J46j31J9L5j39L40k66LR0j54K27k49P5K44
$$ plain form
3993 221 -43 -40 -148 30 289 139 66 348 -176 -72 -60 139 -86 189 -39 -284 53 254 164 -15 72 187
4015 187 26 206 -114 78 -29 256 5 87 54 -281 -87 -8 -199 18 114 -6 135 -115 -88 -224 96 30
4037 30 -227 -41 60 -95 124 -56 167 60 -88 -143 -54 -188 69 96 -129 -69 28 68 132 115 70 198 205 -74
4061 -74 208 -129 -47 46 107 87 82 -82 -149 -66 59 -67 26 15 217 7 -47 76 51 -262 40 176 -59 -20 10
4086 10 21 67 20 42 52 45 209 -60 -157 222 93 168 123 -77 108 140 -52 157 21 -110 34 115 -115 -205 -40
4111 -40 -16 167 -38 138 76 -195 -149 87 443 44 -52 -131 14 1 -87 67 -151 61 65 -66 146 -128 -3
4134 -3 -54 46 13 -23 -63 -119 58 88 2 1 114 -20 136 50 -103 -109 -189 -186 -32 -19 -115 -284 -157 -162 -39 109 3
4161 3 416 56 -244 36 148 9 -139 -147 -84 233 17 -217 -88 -56 -168 24 53 -17 1 -37 239 -251 -256 33
$$ packed form
3993B21k64Lj08J78K59j50p3K82n24J04J2J99k25K75k28k45L37K01r0j79Q7J15
4015A87j61J80l20J92j07K85k51Q2l3l35J94P9j91K17R6j20J41k50K7j36L20o6
4037C0k57J86J01j55K19j80K23j07j48n5Q9j34K57K7k25O0R7M0O4j7m5J28Pk79
4061g4K82l37Q2R3O1k0nj64o7Q3J25j26R3j1K02k10n4J23k5l13L02J36k35L9L0
4086A0J1M6m7K2J0pJ64k69r7L79j29P5m5k00J85L2j92K09j36j31J44Q1k30r0J65
4111d0K4J83k05J76o2k71M6K36L56l99r6p9J45j3q8J54k18K12Mj31K12k74J25
4134cn1J00l3l6m0n6J77L0q6jJ13j34J56q6j53oq0LJ54J3r6j69J27nJ23J48j06
4161CM13l60l00K80J12j39j48qO3L17k16k34J29L2j12J92K9p0J8l8K76m90nK89
$$ plain form
4185 33 -304 -155 63 53 100 318 144 81 132 19 -127 -183 -45 163 -250 -99 -195 -34 -1 129 164 -180 3
4208 3 -101 -115 47 -40 -65 157 -152 -23 -248 150 279 -80 78 -108 219 -136 104 -69 -23 -149 -143 -206 -8
4231 -8 57 130 66 -179 -162 -12 95 83 -109 -44 52 -49 -71 -185 -235 152 30 32 136 82 114 -69 -58 366 -106
4256 -106 264 134 150 185 32 130 -295 32 -89 16 -71 -192 -111 45 38 -31 -142 -22 -77 79 -113 -354 -40
4279 -40 165 -138 -27 -132 -107 40 -24 -5 -145 12 -140 38 242 -105 -244 -13 -80 36 -164 -222 -175 276
4301 276 -89 -263 -50 -78 -161 -346 53 68 89 79 75 -33 -133 -81 103 206 -19 -199 121 -196 -205 217 111
4324 111 42 72 339 -8 13 -122 -50 -286 -74 -147 -68 189 58 -2 187 -52 -273 317 84 -87 15 -9 35
4347 35 -96 -75 112 91 2 65 62 -113 120 322 121 27 -234 78 17 -83 -196 237 -22 19 -97 157 -159
$$ packed form
4185C3l37J49K18j0M7K18j74o3N1j13j46n6J38K08m13J51r6J61L3J30L5l44J83
4208Cj04j4J62q7k5K22l09J29k25L98J29l59J58j86L27l55K40j73M6j26Oo3J98
4231hO5P3o4k45J7J50J07j2j92O5R6j01k2j14n0L87j22KJ04n4L2j83J1M24m72
4256a06L70j30J6L5j53R8m25L27j21J05q7j21Q1J56po9j11J20n5J56j92k41L14
4279d0K05l03J11j05K5J47o4J9j40J57j52J78K04l47j39K31o7J16k00n8M7M51
4301B76l65j74K13k8q3j85L99J5K1j0mj08j00N2J84J03k25j80L20l17rM22j06
4324A11o9L0K67l47K1j35P2k36K12p3P9K57j31o0J89k39k21N90k33j71J02k4M4
4347C5j31K1J87k1q9O3lj75K33K02k01r4k61L12o1j00j13M33k59M1j16K54l16
$$ plain form
4370 -159 -108 -42 -12 -142 -16 -77 -36 95 196 154 172 -105 -261 136 -44 325 -51 246 -191 213 83 79 -75
4393 -75 -30 23 154 135 33 -3 -43 19 105 186 -160 98 -159 229 -248 -119 214 -25 12 188 83 -115 -246
4416 -246 -81 169 116 -117 -236 43 -8 -24 190 133 237 -218 -210 -45 -95 148 -35 103 22 -77 -80 -176 -123 61
4440 61 112 179 131 -44 86 -291 -84 139 45 -143 -95 -20 -58 50 -17 -133 49 -16 233 -25 -108 -142 139 -67
4464 -67 -4 77 21 -336 70 259 121 -74 -26 21 -103 -193 -120 63 -178 179 -50 119 -54 43 -150 -146 259 203
4488 203 123 -78 -101 -115 53 -48 -143 195 22 -183 39 -116 -35 175 140 308 -88 -267 -99 -12 180 81 162
4511 162 -336 -95 53 -38 -12 -184 214 120 -182 38 -123 -225 -50 54 -132 -77 -401 84 285 -181 -96 -262
4533 -262 -84 6 -200 35 17 79 42 169 -38 100 -79 -94 82 -149 82 177 -51 108 82 171 -228 -42 96
$$ packed form
4370a59N1O6L0j30J26o1M1J31J01m2J8k77j56L97j80L69l76K97m37M04j30mj54
4393g5M5N3J31j9j02l6m0O2Q6Q1l46K58k57L88m77J29L33k39L7J76j05j98j31
4416b46J65K50n3k33j19K79n1j6K14n7J04m55QJ65n0K43j83J38q1r9lr6N3J84
4440F1N1O7m8j75J30l77K07K23r4j88M8P5l8J08o7j16J82o5K49k58q3l4K81k06
4464f7O3Q1n6l57M06J89j38j95M8M7j24r0P3J83k41L57k29J69j73R7j93MM05n6
4488B03q0k01k3j4J68j01r5L38j73k05K22j55Q1K10l5J68l96j79J68Q7J92r9Q1
4511A62m98K41J48r1K6j72L98r4l02K20j61j02J75J04j86N5l24M85K01m66Q5j66
4533b62J78R0k06K35j8O2l7J27k07J38j79j5J76k31K31R5k28J59k6Q9l99J86J38
$$ plain form
4556 96 144 135 -82 38 -23 -66 53 151 -27 -283 -56 102 -11 99 385 56 -81 -121 -14 -112 125 101 6 12
4580 12 0 -185 -63 -151 85 73 -48 307 37 44 -29 -85 -20 227 -33 5 88 134 -115 -192 -151 -5 -100 -160 195
4605 195 133 168 60 -29 234 -267 -66 -243 197 -17 -11 308 118 -124 -58 -18 -196 31 42 84 -31 82 -50
4628 -50 -6 -79 -261 127 -52 -40 -4 -8 -200 333 117 253 31 -89 -71 -233 170 339 87 -46 -43 168 248 67
4652 67 111 -120 78 -280 -57 0 -440 -287 106 -62 -80 -111 245 227 -45 145 -76 -13 -185 96 258 -110
4674 -110 -137 94 -62 177 57 -36 -95 131 -84 -56 139 -313 -98 79 222 -77 -262 98 -73 129 196 -95
4696 -95 -79 -53 98 -191 -45 -94 -21 79 -191 -28 61 112 109 5 -112 -198 3 79 84 -272 -97 -79 -61 100 -10
4721 -10 -29 141 45 -90 -49 -20 -8 41 92 -202 -49 -6 31 187 6 -61 31 -195 41 -100 56 36 -293 35
$$ packed form
4556I6M8rk17J20o1m3J19R8j78k56K27J58j13J10K86l29j37m0J07r8K37k4r5O
4580A2j2j85J22q8K36j2j21L55k70Pp3n6O5K47k60L8Q3M6k49p7M1J46r5o0L55
4605A95o2L5j08q9K63n01K01j77M40k14OL19j90k42O6M0j78K27J1M2j15J13j32
4628e0M4p3j82L88j79J2L6mj92N33k16J36k22j20J8j62M03J69k52j33LK11Q0j81
4652F7M4k31J98l58K23N7m40J53L93j68j8l1L56j8k72J90k21O3j72K81J62l68
4674a10k7K31j56K39j20r3n9K26k15K8J95m52K15J77J43k99j85L60j71K02O7k91
4696i5J6K6J51k89J46m9P3J00k70J63Q9N1lj04j17q6K01P6Nl56J75J8J8J61j10
4721a0j9J70r6j35M1K9J2M9N1k94J53M3L7J56j81o7R2k26K36j41J56k0l29L28
$$ plain form
4745 35 140 65 -4 55 67 -228 -145 90 -110 0 -160 274 77 144 -297 113 -27 40 3 -81 373 -201 -22
4768 -22 222 -88 8 79 319 -93 -181 -226 -82 -143 -21 -222 29 219 -98 203 -72 -42 -34 -34 -24 -241 121 -14
4792 -14 197 -44 -3 291 91 88 -263 -70 73 77 -128 -59 -128 3 -8 -31 9 -113 143 211 -196 -268 158 122 -127
4817 -127 34 93 -29 78 -124 75 73 -134 -104 -37 108 -31 255 11 -93 38 140 -41 -186 -220 137 2
4839 2 50 492 259 -57 3 -192 169 -56 -84 -44 62 150 -66 73 -48 129 -20 -52 52 -27 -64 64 -76
4862 -76 -160 261 -16 28 57 170 79 65 156 -186 -68 -313 344 229 -158 119 -99 -196 -49 38 109 -25 89
4885 89 -13 117 35 106 -117 -32 -29 -25 250 143 151 71 71 -172 97 207 -212 -13 -30 0 120 -222 -64 77 24
4910 24 -198 24 -26 10 -96 -129 -121 -9 -315 -31 -59 -266 61 -28 255 181 9 -160 155 -145 -66 -19 80 0
$$ packed form
4745C5J05p5o9N9J2k95Q3K35k00J10j60M34j97O7m41M10j40O7l7q4M54n74J79
4768b2K44l10R6P1K40m12q8m5J44o1J22k01K51J90l17L01k75L0Q%J0k17L62j35
4792a4K11k41M1K94k00ll51J93J43Mk05O9o9J31j1k3M0j22K56O8m07p2M26l6k49
4817a27J61N9j22J07k02J99kk07L0O7J45j39K86k44j04J31J02j81j45l4L57j35
4839BM8M42k33l16O0j95L61k25k8M0J06Q8k16J39j21J77j49l2J04p9l7J28j40
4862g6q4M21k77M4K9J13r1j4R1l42J18k45O57j15l87K77k18r7J47Q7P1j34J14
4885H9j02J30q2P1k23Q5LMK75j07Qq0%k43K69J10m19J99j7L0J20l42J58J41n3
4910B4k22K22n0L6j06l3QJ12l06K84k8k07L27q9K83p4j72j69L15l00P9M7R9q0
$$ plain form
4934 0 111 -165 313 -174 41 -80 70 -26 174 220 -37 -132 -164 -10 -145 9 133 -271 -49 -41 315 -117 -19
4957 -19 92 48 -67 -206 -221 -186 -126 -90 143 -4 18 39 97 -247 41 -34 -41 124 123 -21 -115 58 -22 141 -12
4982 -12 198 -219 109 -48 239 -10 -227 -77 -228 94 29 -21 219 40 -104 -100 -91 36 150 -195 94 69 164
5005 164 -105 -141 0 -185 48 140 -147 26 -5 56 27 53 144 22 -11 47 -74 -73 -138 -41 -6 -39 37 -42 245 227
5031 227 -51 73 -123 26 -38 -118 236 -159 8 -190 -293 -118 -23 -45 212 -91 92 42 -80 271 108 -89
5053 -89 -69 57 56 -90 -145 189 -453 -22 -4 169 -81 171 -9 37 -217 -199 1 -206 -99 101 -185 54 -42
5076 -42 -26 69 149 60 -123 -77 47 165 -225 61 -46 -84 249 -92 144 22 310 312 30 -10 50 -258 47 93
5100 93 -22 -91 69 -79 -50 211 -7 -140 -25 130 -131 -180 -115 -27 -94 91 -173 47 37 87 36 -150 -54 -68
$$ packed form
4934@J11k76M78m87K15j21J50r6K00M6k57r5l2J54j35J54J24m04K22QL56m32R8
4957a9J11m4j15j39j5L5O0L6K33j47K2K1N8l44K88p5pJ65jj44r4J73q0J63j53
4982a2K10m17L28j57K87k49k17J50j51L22o5n0K40j79j44MRJ27J14l45K89k5R5
5005A64k69l6J41j85K33R2k87J73l1O1k9K6R1j22l3N8j21Jo5R7L5l3P6p9K87j8
5031B27k78J24j96J49o4q0L54l95J67j98j03J75R5k2K57l03J83n0j22L51j63j97
5053h9K0J26jj46n5L34o42M31J8J73k50K52j80M6k54J8K00k07J07K00k86K39r6
5076d2J6R5Q0q9j83M6J24J18l90K86j07l8L33l41K36j22K88Kk82m0O0l08L05M6
5100I3j15o9J60j48K9K61k18j33J15J55k61m9O5Q8o7J85k64K20j0N0n1j86R6j4
$$ plain form
5124 -68 -276 -178 184 -189 191 -28 128 82 151 61 -134 131 17 273 106 100 -47 79 177 -252 -136 -83 -105
5147 -105 232 -20 90 110 -200 176 -12 -210 9 -251 -95 -176 190 94 82 12 207 129 84 -5 -22 188 -16
5170 -16 -161 51 123 -101 -12 -110 183 51 15 58 -279 59 24 -23 -157 6 -127 146 62 17 49 142 -12 212
5194 212 -137 -251 -172 235 26 -123 328 39 130 343 -14 -131 108 194 -64 119 -20 2 143 29 -129
5215 -129 37 -29 62 92 131 341 -103 -22 -36 23 -4 61 122 79 -203 240 -168 22 -213 25 199 -35 -227 105
5239 105 29 36 -187 38 -279 -158 -122 -92 85 12 168 86 70 -73 -146 266 104 147 125 270 -194 57 -20 -21 -329
5264 -329 -65 56 -119 -344 2 -95 -47 -124 -60 109 -134 15 -74 98 -153 112 205 -120 125 75 123 15 147
5287 147 46 -121 -188 254 -314 255 -138 -67 112 -76 139 -91 -103 127 -19 -56 90 -316 -19 37 -332 162
$$ packed form
5124f8k08R8L62l73L80k19J56m6O9r0j95K65j14K56j67oj47J26R8m29J16N3k2
5147a05L37k52J10K0l10L76j88j98K19k60J56q1L66r6j2p0J95p8m5q9j7K10k04
5170a6j45K12P2k24Q9r8K93j32l6M3l37L38l5m7j34J63j33K73q4m5L2R3j54K24
5194B12l49j14P9M07k09j49M51k89R1K13l57j17K39Q6k58J83j39K2J41j14j58
5215a29J66o6R1L0L9K10m44Q1j4N9k7O5O1m3k82M43m08J90k35K38J74k34j92L32
5239A05p6Pk23K25l17J21L6L0J77p3J56q2j6j43p3M12j62M3k2J45m64K51p7jl08
5264c29K64J21j75k25L46r7M8p7O4J69k43J49q9J72k51K65R3l25K45n0M8j08J32
5287A47j01j67o7M42n68N69l93P1J79j88K15k30j2K30j46l7J46m06K97N6l69M94
$$ plain form
5309 162 41 188 145 242 32 94 109 49 111 87 -69 -112 29 181 -207 -75 -64 -13 -183 43 -67 14 17 75 -120
5334 -120 -42 34 -112 -132 5 -147 20 187 99 66 70 56 12 -48 36 100 17 -11 -68 -86 -150 5 -115 126 173 -85
5360 -85 245 -141 -365 -101 -301 -160 -79 231 -75 57 14 183 -218 25 346 4 -267 29 52 -253 113
5381 113 0 -199 50 182 -45 32 -151 -72 -168 -223 216 40 -139 15 -109 90 229 48 38 160 -124 -179
5403 -179 125 -28 -38 24 6 146 -40 -172 -13 -38 114 93 120 40 -136 -297 -139 129 -20 82 -321 -71
5425 -71 113 -46 -351 -61 -99 -20 87 -114 -33 22 42 110 -51 14 -118 112 -68 125 -124 -89 237 71 -92
5448 -92 -70 225 107 189 228 -211 -98 68 -187 142 138 207 86 -40 -137 12 27 120 147 71 -137 114 -17 -19 130
5473 130 -75 211 48 -40 -8 180 31 -40 -226 -3 18 -30 -110 -27 10 7 195 135 -105 95 42 269 30 -98
$$ packed form
5309A62j21J47m3R7k10O2J5o0O2k4j56m3J41J52l88J32J1N1j70K26j10Q1LN8j95
5334a20P8P6j46k0J37j52J67J67q8l3Mj4m4o0Q4O4q3k8n7j8o4J55j20K41M7k58
5360h5L30l86k24K64k00J41Q1L10l06J32m3J69m01K43L21l42k71K96K3l05L66
5381A13j13j99K49J32k27P7j83P9r6n5M39j76j79J54j24J99J39j81j0J22k84n5
5403a79L04j53j0O2j8J40j86j32J59k5J52k1K7q0j76j61J58K68j49J02m03K50
5425g1J84j59l05K90l8P9J07k01Q1N5K0O8j61O5j32K30j80J93k49L5L26j66j63
5448i2K2K95j18Q2L9m39J13J66k55L29mO9j21j26r7J49J5R3K7p6k08K51j31kJ49
5473A30k05K86j63q8L2J88j49p1j86K23K1m8q0Q3L7lJ88o0k40K00n3K27k39j28
$$ plain form
5497 -98 197 -26 189 14 102 78 148 23 89 -192 -92 98 60 87 -117 156 -11 -23 -158 73 -37 145 201
5520 201 139 -203 -58 -45 -198 -78 145 -19 -62 245 -27 113 -94 17 81 11 134 20 -64 -31 -130 -214 -91
5543 -91 -172 180 129 140 215 -282 303 103 -19 28 5 -120 -174 -36 132 3 32 -206 -137 99 287 -228 276
5566 276 17 -350 -3 -344 -60 -37 -227 -35 179 -223 79 110 -107 -13 -131 189 -43 40 -127 46 57 295
5588 295 71 -287 324 232 113 67 -146 135 108 45 -34 22 -98 108 154 119 83 -189 47 -119 72 -141 -75
5611 -75 -312 -6 -131 13 128 -103 9 192 16 18 145 35 -78 -110 -119 47 259 -260 -23 -184 -83 -77 -15
5634 -15 -74 -139 40 73 11 25 18 -136 -76 -184 -134 287 -17 -75 84 -28 -150 -278 35 -57 -83 81 14 70 -10
5659 -10 106 -75 164 158 -11 -136 10 57 -131 3 -197 -7 -347 -35 28 -34 -156 150 26 -194 142 -40
$$ packed form
5497i8K95k23K15j75Q8k4P0j25O6k81J00J90l8K7k04K73j67j2j35K31j10J82N6
5520B01o2l42J45J3j53J20K23j64m3L07k72J40k07J11O4p0J23j14q4L3r9q4J23
5543i1q1L52n1J1P5m97N85k00j22M7k3j25n4J38J68j29K9k38O9K36J88n15N04
5566B76k59l67L47l41K84K3j90J92K14m02L02L1k17R4j18L20k32Q3j67J73J1K38
5588B95k24l58O11r2j19m6k13K81k7o3p9N6j20K06M6l5l6k72K36j66J91k13O6
5611g5k37L06j25J44J15k31J12J83j76KJ27j10j13l2rJ66K12n19K37j61J01OO2
5634a5n9o5J79L3o2J4pj54O0j08N0M21l04n8J59j12j22j28L13r2k6J64o7N6q0
5659a0J16j81K39oj69j25J46M7j88J34k00J90l40L12O3o2j22L06j24k20L36j82
$$ plain form
5681 -40 -88 37 60 -67 -33 -185 29 -124 -149 -22 -70 -19 220 291 6 216 193 93 69 87 -233 132 -90 -56
5705 -56 74 -115 240 -137 47 -15 103 -90 267 250 -62 198 -143 66 -232 318 -194 172 -31 1 0 -16
5727 -16 -51 10 24 -106 -154 12 89 109 -63 -150 -95 -8 180 -228 79 -19 -117 -127 30 -25 -58 188 -178 -14 71
5752 71 -143 225 -191 128 42 116 58 162 -191 110 -29 -319 163 -154 60 -2 181 260 -38 -90 104 58 238
5775 238 -171 28 137 126 146 -67 144 75 38 61 79 -189 229 -12 -406 174 13 38 247 158 -63 -312 -235
5798 -235 7 19 -114 198 -91 -32 181 -159 222 67 -222 114 -87 7 -122 47 104 48 -164 94 102 -20
5820 -20 198 128 -21 25 -129 57 154 -70 26 318 121 181 247 -73 -323 28 -261 161 -161 254 128 -77
5842 -77 359 -10 54 -309 57 129 -230 -227 -160 -68 -205 -75 101 -140 56 152 -153 32 75 -173 11 5 -213 44
$$ packed form
5681d0m8J25K3j27L4j52K14j53k5J27m8N1K39P1k85K10k3j00k4J8l20L65k22L4
5705e6J30j89L55l77J84o2J18j93L57j7l12K60l41K09k98N50n12L66k03L2jj6
5727a6l5O1J4j30m8J66P7K0j72q7N5Q7J88m08L07r8r8j0J57n5l3K46l66J64Q5
5752G1k14L68m16L19q6P4n8J04l53L01j39k90M82l17K14o2J83P9k98n2J94m6J80
5775B38m09J99J09j1K0k13K11o9l7K3J8k68M18k41l94N80j61K5K09q9k21k49P7
5798b35K42J2j33L12k89N9K13l40L81j55k89L36k01R4j29J69N7n6k12K58Qj22
5820b0K18p0j49M6j54J86R7k24R6K92j97O0O6l20k50L51k89M22l22M15j26k05
5842g7M36l69O4l63L66P2l59LO7R2j37J30J76k41J96R6l05J85M3k48J84ok18K57
$$ plain form
5866 44 21 36 29 -49 11 -11 -52 -69 -29 291 17 256 12 -188 -22 -203 -304 180 131 -21 17 -124 -73 -203 -131
5891 -131 -110 -172 -74 21 -98 -64 82 -46 167 5 -58 218 235 33 138 58 -103 149 27 -131 -59 -311 -166
5914 -166 63 82 53 -59 45 50 -40 -165 71 -226 -52 135 126 13 13 133 -93 116 -98 -25 121 -72 10 -111
5938 -111 84 -409 62 139 -268 -69 -65 56 -195 -22 -62 -29 207 -121 -42 -94 58 105 -108 -13 -312 -68 2
5961 2 80 -52 -27 216 -277 -152 5 -144 -86 -256 471 -137 -193 110 270 48 -147 117 -169 74 -29 101
5983 101 -113 -127 -102 96 36 142 -80 287 -210 96 126 -72 -99 12 -21 322 6 23 -75 121 237 2 264
6006 264 -211 37 257 -143 -210 183 -52 63 -81 -16 38 149 -56 -5 130 30 -129 41 -37 -64 4 -102
$$ packed form
5866D4k3J5pp8O0k2m1j7M0L20k74K39k44k00J66j81j01M84m9j52L8j41N1j30P2
5891a31K1o2R8R5j19L4J46j28K13j62o3K76J7k02J05q0j61K52j22j58P2k52J45
5914a66K29J9k9j12J04Nr0j25K36k97J74J87rj13%J20k26K09k14P3J46j93Q2j21
5938a11J95m93M71P7m07J99MJ21k51J73m0L3K36l28P9n2J52M7k13R5k99K44P0
5961BP8j32K5K43m93J25J57j49N8j70P27o08n6L03J60k22j95K64k86K43j03J30
5983A01k14j4K5J98o0J06k22L67m97L06L0j98k7J11l3L43l16J7r8J96J16k35K62
6006B64m75K48K20m00o7L93k35J15j44O5N4J11k05N1J35j00j59J70p8k7O8j06
$$ [...]
8191A48
##END NTUPLES=NMR FID
##END=
