##TITLE=1H_LR-758-R6-RM2
 CDCl3
 8 sc, 
 26.9.2023
##JCAMPDX= 6.0         $$ Bruker NMR JCAMP-DX V2.0
##DATA TYPE= NMR FID
##DATA CLASS= NTUPLES
##ORIGIN= UXNMR, Bruker Analytische Messtechnik GmbH
##OWNER= root
$$ XWIN-NMR		Version 3.5
$$ Tue Sep 26 13:52:05 2023 Russian Standard Time (UT+4h)  she@DPX200
##.OBSERVE FREQUENCY= 200.13135
##.OBSERVE NUCLEUS= ^1H
##.DELAY= (6, 6)
##.ACQUISITION MODE= SIMULTANEOUS
##.ACQUISITION SCHEME= undefined
##.AVERAGES= 8
##.DIGITISER RES= 18
##SPECTROMETER/DATA SYSTEM= spect
##.PULSE SEQUENCE= zg30
##.SOLVENT NAME= CDCl3
##.SHIFT REFERENCE= (INTERNAL, CDCl3, 0, 15.7039)
##AUDIT TRAIL= $$ (NUMBER, WHEN, WHO, WHERE, WHAT)
$$ ##TITLE= Audit trail, XWIN-NMR		Version 3.5
$$ ##JCAMPDX= 5.01
$$ ##ORIGIN= Bruker BioSpin GmbH
$$ ##OWNER= she
$$ F:/spectra/data/she/nmr/H-F/1/audita.txt
$$ ##AUDIT TRAIL=  $$ (NUMBER, WHEN, WHO, WHERE, WHAT)
(   1,<2023-09-26 13:50:21.43 +0400>,<she>,<DPX200>,
      <created by zg, POWCHK disabled, PULCHK disabled
       configuration hash MD5:
       00 E9 B6 7A A2 85 ED C7 34 08 36 98 17 FE 4E 26
       data hash MD5: 16K
       5D 8D 35 95 E7 92 FE B8 5E 44 82 D6 A5 18 D3 10>)
$$ ##END=
$$ 
$$ hash MD5
$$ BD FC A5 F2 38 CD 4A B1 B1 9F 2E 99 2D 80 B1 BE
##$RELAX= 
##$RELAX= 
##$RELAX= 
##$RELAX= 
##$RELAX= 
##$RELAX= 
$$ Bruker specific parameters
$$ --------------------------
##$DU= <F:/spectra>
##$EXPNO= 1
##$NAME= <H-F>
##$PROCNO= 1
##$TYPE= <nmr>
##$USER= <she>
##$AMP= (0..31)
100 100 100 100 100 100 100 100 100 100 100 100 100 100 100 100 100 100 
100 100 100 100 100 100 100 100 100 100 100 100 100 100 
##$AQSEQ= 0
##$AQ_mod= 1
##$AUNM= <au_zg>
##$AUTOPOS= <>
##$BF1= 200.13
##$BF2= 200.13
##$BF3= 200.13
##$BF4= 200.13
##$BF5= 200.13
##$BF6= 200.13
##$BF7= 200.13
##$BF8= 200.13
##$BYTORDA= 1
##$CFDGTYP= 0
##$CFRGTYP= 5
##$CHEMSTR= <none>
##$CNST= (0..31)
1 1 145 1 1 1 1 1 1 1 1 1 1 1 1 1 1 1 1 1 1 1 1 1 1 1 1 1 1 1 1 1 
##$CPDPRG= <>
##$CPDPRG1= <>
##$CPDPRG2= <>
##$CPDPRG3= <>
##$CPDPRG4= <mlev>
##$CPDPRG5= <mlev>
##$CPDPRG6= <mlev>
##$CPDPRG7= <mlev>
##$CPDPRG8= <mlev>
##$CPDPRGB= <>
##$CPDPRGT= <>
##$D= (0..31)
0 1.2 0 0 0 0 0 0 0 0.06 0 0.03 0 0 0 0 0.0002 0 0 0 0 0 0 0 0 0 0 0 0 
0 0 0 
##$DATE= 1695721821
##$DBL= (0..7)
120 120 120 120 120 120 120 120 
##$DBP= (0..7)
150 150 150 150 150 150 150 150 
##$DBP07= 0
##$DBPNAM0= <>
##$DBPNAM1= <>
##$DBPNAM2= <>
##$DBPNAM3= <>
##$DBPNAM4= <>
##$DBPNAM5= <>
##$DBPNAM6= <>
##$DBPNAM7= <>
##$DBPOAL= (0..7)
0.5 0.5 0.5 0.5 0.5 0.5 0.5 0.5 
##$DBPOFFS= (0..7)
0 0 0 0 0 0 0 0 
##$DE= 6
##$DECBNUC= <off>
##$DECIM= 32
##$DECNUC= <off>
##$DECSTAT= 4
##$DIGMOD= 1
##$DIGTYP= 9
##$DL= (0..7)
0 120 120 120 120 120 120 120 
##$DP= (0..7)
150 150 150 150 150 150 150 150 
##$DP07= 0
##$DPNAME0= <>
##$DPNAME1= <>
##$DPNAME2= <>
##$DPNAME3= <>
##$DPNAME4= <>
##$DPNAME5= <>
##$DPNAME6= <>
##$DPNAME7= <>
##$DPOAL= (0..7)
0.5 0.5 0.5 0.5 0.5 0.5 0.5 0.5 
##$DPOFFS= (0..7)
0 0 0 0 0 0 0 0 
##$DQDMODE= 0
##$DR= 18
##$DS= 0
##$DSLIST= <SSSSSSSSSSSSSSS>
$$ [...]
##$SUBNAM2= <"">
##$SUBNAM3= <"">
##$SUBNAM4= <"">
##$SUBNAM5= <"">
##$SUBNAM6= <"">
##$SUBNAM7= <"">
##$SUBNAM8= <"">
##$SUBNAM9= <"">
##$SW= 18.05172834244
##$SWIBOX= (0..15)
0 0 2 0 0 0 0 0 0 0 0 0 0 0 0 0 
##$SW_h= 3612.71676300578
##$TD= 16384
##$TD0= 1
##$TE= 0
##$TE2= 300
##$TE3= 300
##$TEG= 300
##$TL= (0..7)
0 120 120 120 120 120 120 120 
##$TP= (0..7)
150 150 150 150 150 150 150 150 
##$TP07= 0
##$TPNAME0= <>
##$TPNAME1= <>
##$TPNAME2= <>
##$TPNAME3= <>
##$TPNAME4= <>
##$TPNAME5= <>
##$TPNAME6= <>
##$TPNAME7= <>
##$TPOAL= (0..7)
0.5 0.5 0.5 0.5 0.5 0.5 0.5 0.5 
##$TPOFFS= (0..7)
0 0 0 0 0 0 0 0 
##$TUNHIN= 0
##$TUNHOUT= 0
##$TUNXOUT= 0
##$USERA1= <user>
##$USERA2= <user>
##$USERA3= <user>
##$USERA4= <user>
##$USERA5= <user>
##$V9= 5
##$VALIST= <valist>
##$VCLIST= <CCCCCCCCCCCCCCC>
##$VD= 0
##$VDLIST= <DDDDDDDDDDDDDDD>
##$VPLIST= <PPPPPPPPPPPPPPP>
##$VTLIST= <TTTTTTTTTTTTTTT>
##$WBST= 1024
##$WBSW= 4
##$XGAIN= (0..3)
0 0 0 0 
##$XL= 0
##$YL= 0
##$YMAX_a= 197867
##$YMIN_a= -340176
##$ZGOPTNS= <>
##$ZL1= 120
##$ZL2= 120
##$ZL3= 120
##$ZL4= 120
##$ABSF1= 10
##$ABSF2= 0
##$ABSG= 5
##$ABSL= 3
##$ALPHA= 0
##$AQORDER= 0
##$ASSFAC= 0
##$ASSFACI= 0
##$ASSFACX= 0
##$ASSWID= 0
##$AUNMP= <proc_1d>
##$AZFE= 0.1
##$AZFW= 0.1
##$BCFW= 1
##$BC_mod= 2
##$BYTORDP= 1
##$COROFFS= 0
##$CY= 11.3945322036743
##$DATMOD= 1
##$DC= 2
##$DFILT= <>
##$DTYPP= 0
##$F1P= 15.7292609196834
##$F2P= 12.9074282941183
##$FCOR= 0.5
##$FTSIZE= 0
##$FT_mod= 4
##$GAMMA= 1
##$GB= 0.15
##$INTBC= 1
##$INTSCL= 1
##$ISEN= 128
##$LB= 0.24
##$LEV0= 0
##$LPBIN= 0
##$MAXI= 10000
##$MC2= 0
##$MEAN= 0
##$ME_mod= 0
##$MI= 1.114404
##$NCOEF= 0
##$NC_proc= 0
##$NLEV= 6
##$NOISF1= 3.799351
##$NOISF2= 2.8
##$NSP= 1
##$NTH_PI= 0
##$NZP= 0
##$OFFSET= 15.70392
##$PC= 1
##$PHC0= -21712.85
##$PHC1= 12.45271
##$PH_mod= 1
##$PKNL= yes
##$PPARMOD= 0
##$PSCAL= 0
##$PSIGN= 0
##$REVERSE= no
##$SF= 200.130013532006
##$SI= 16384
##$SIGF1= 3
##$SIGF2= 2
##$SINO= 400
##$SIOLD= 16384
##$SREGLST= <1H.CDCl3>
##$SSB= 0
##$STSI= 0
##$STSR= 0
##$SW_p= 3612.71676300578
##$SYMM= 0
##$S_DEV= 0
##$TDeff= 0
##$TDoff= 0
##$TI= <>
##$TILT= no
##$TM1= 0
##$TM2= 0
##$TOPLEV= 0
##$USERP1= <user>
##$USERP2= <user>
##$USERP3= <user>
##$USERP4= <user>
##$USERP5= <user>
##$WDW= 1
##$XDIM= 8192
##$YMAX_p= 0
##$YMIN_p= 0
$$ End of Bruker specific parameters
$$ ---------------------------------
##NTUPLES= NMR FID
##VAR_NAME=  TIME,          FID/REAL,        FID/IMAG
##SYMBOL=    X,             R,               I
##VAR_TYPE=  INDEPENDENT,   DEPENDENT,       DEPENDENT
##VAR_FORM=  AFFN,          ASDF,            ASDF
##VAR_DIM=   8192,          8192,            8192
##UNITS=     SECONDS,       ARBITRARY UNITS, ARBITRARY UNITS
##FACTOR=    0.0002768,     1,               1
##FIRST=     0,             0,               0
##LAST=      2.2672688,     0,               0
##MIN=       0,             -340176,         0
##MAX=       2.2672688,     197867,          0
$$ Real data points
##PAGE= N=1
##DATA TABLE= (X++(R..R)), XYDATA
$$ plain form
0 0 0 0 0 0 0 0 0 0 0 0 0 0 0 0 8 -8 8 -8 8 -13 16 -16 21 -24 28 -32 37 -44 48 -56 64 -72 81 -92 101 -116
36 -116 129 -142 160 -176 195 -217 240 -263 292 -323 354 -389 427 -473 519 -574 634 -700 774
55 774 -865 966 -1083 1222 -1393 1605 -1872 2226 -2713 3416 -4520 6442 -10408 21575 -111516
70 -111516 -340176 165315 109376 -204527 157877 197867 -213513 -19014 192966 -54703
80 -54703 6552 165404 -33505 -24447 121495 2917 -5457 89041 -10230 -1235 73523 -25722
92 -25722 -11003 61350 -44001 -14142 75581 -49729 -37953 84880 -38851 -62577 79198
103 79198 -29852 -85720 85334 13545 -93345 59628 25928 -104480 41783 60893 -90698
114 -90698 9457 62280 -83418 -17767 62055 -65910 -28437 69440 -43846 -45338 54062
$$ packed form
0@%%%%%%%%%%%%%%Qj6J6j6J6k1K9l2L7m5N2o0O9q1R2j04J20j36J53j73J93k17
36a16K45k71L02l36L71m12M57n03N55o15O77p43Q16r00R92j093J208j334J474
55G74j639J831k049K305k615K998l477M098m939O129p936J0962j6850L1983j33091
70a11516k28660N05491n5939l13903L62404L9990m11380J94499K11980k47669
80e4703O1255J58852j98909R058J45942j18578q374R4498r9271Q995P4758r9245
92b5722J4719P2353j05351K9859Q9723j25310J1776J22833j23731k3726J41775
103G9198j09050n5868J71054p1789j06890J52973l3700j30408J46263J9110j51591
114i0698J00155N2823j45698O5651P9822j27965L7473R7877j13286j492R9400
$$ plain form
125 54062 -32834 -50543 57241 -4308 -49282 43080 10200 -39295 35834 19240 -24380 42349
137 42349 28883 -21738 31658 18674 -26263 41563 38285 -31097 20459 30265 -40915 9213
149 9213 43281 -37765 -15525 33330 -39156 -33100 35139 -21528 -44006 20076 -15373 -45113
161 -45113 19897 6862 -37782 3665 2933 -26179 17282 23123 -18056 6278 16456 -11207 20631
174 20631 33342 -10213 5057 27762 -6620 5569 32608 -3777 -6601 24687 -2599 -13437
186 -13437 17501 1104 -13188 10678 -3497 -19436 5875 3430 -12928 3270 -4463 -18227
198 -18227 6827 6795 -14970 2629 3397 -19031 4968 15972 -17315 -6844 14113 -13004 -10937
211 -10937 14684 -8318 -18623 8395 -2475 -19766 1184 1330 -15447 -2613 -58 -14072 -3661
$$ packed form
125E4062q6896j7709J07784o1549m4974R2362l2880m9495P5129j6594m3620O6729
137D2349j3466n0621N3396j2984m4937O7826l278o9382N1556R806p1180N0128
149I213L4068q1046K2240M8855p2486O056O8239n6667k2478O4082l5449k9740
161d5113O5010j3035m4644M1447p32k9112M3461N841m1179K4334J0178k7663L1838
174B0631J2711m3555J5270K2705l4382J2189K7039l6385k824L1288k7286j0838
186a3437L0938j6397j4292K3866j4175j5939K5311k445j6358J6198p733j3764
198a8227K5054l2k1765J7599P68k2428K3999J1004l3287J0471K0957k7117K067
211a0937K5621k3002j0305K7018j0870j7291K0950J46j6777J2834K555j4014J0411
$$ plain form
224 -3661 3555 -5282 -1274 -602 -6723 5410 8451 -1304 6088 8045 -3794 6949 15596 560
238 560 3958 14078 -345 -2227 11581 3794 -1939 6977 -2225 -10900 764 912 -4612 -1639 -9651
253 -9651 -14840 -2087 -1584 -7001 -1443 -7965 -16241 -628 4999 -7372 -721 5174 -7487 -2688
267 -2688 10983 585 -2577 10729 6009 -2871 5061 6518 1219 4763 6413 859 -1498 1051
281 1051 3109 1410 -2883 -2036 -267 -3780 -1468 3234 -3340 -7992 832 1537 -3919 2895 4579 -5334
297 -5334 -2135 6329 2555 2579 6841 1453 -2604 3789 6662 4167 3563 249 -2257 878 3247 1123
313 1123 -48 -3835 -5405 -324 -476 -5708 -3884 -1766 -5279 -3728 -1061 -4880 -4774 2624 1838 -4280
329 -4280 -3485 581 2400 4781 5983 193 -3634 2011 8938 7095 1231 613 743 -388 3876 5873
$$ packed form
224c661P216q837M008O72o121J2133L041r755P392J957j1839J0743Q647j5036
238E60L398J0120j4423j882J3808p787n733Q916r202q675J1664J48n524K973q012
253i651n189J2753N03n417N558o522q276J5613N627j2371O651N895j2661M799
267b688J3671j0398l162J3306m720q880P932J457n299L544J650n554k357K549
281A051K058j699m293Q47J769l513K312M702o574m652Q824P05n456O814J684r913
297e334L199Q464l774K4M262n388m057O393K873k495o04l314k506L135K369k124
313A123j171l787j570N081j52n232J824K118l513J551K667l819J06P398p86o118
329d280P95M066J819K381J202n790l827N645O927j843n864o18J30j131M264J997
$$ plain form
345 5873 -2127 -4374 3025 1757 -4850 -2700 -96 -3040 3 3159 -4309 -7619 1430 3822 -29
360 -29 994 2055 -397 2048 5196 2531 -448 3212 6876 4508 714 -136 277 929 3435 2790 -2710
377 -2710 -4988 -2048 -1445 -4200 -4940 -4246 -4225 -3083 -4084 -6579 -6192 -3861 -621 291 -2933 -3206 1376
394 1376 2892 1562 3334 3826 2282 6743 10331 4889 1298 5870 6583 3918 7170 6905 199 950
410 950 4544 -241 -3019 1298 1793 -3341 -4193 -3439 -6618 -5399 -181 -1761 -7395 -6384 -2628 -4041
426 -4041 -4808 -2351 -3492 -5062 -853 717 -4995 -5613 -1098 -1354 -2471 -982 -3421 -5531 -3107 -1799
442 -1799 -4033 -5194 -3802 -2843 -3216 -4281 -5113 -4271 -2557 -918 97 -2080 -3152 695 3711 1897
458 1897 2352 3555 3280 4383 6104 4777 3370 4429 5803 4582 1787 1636 2661 1083 -1205 -767
$$ packed form
345E873q000k247P399j268o607K150K604k944L043L156p468l310R049K392l851
360b9J023J061k452K445L148k665k979L660L664k368l794q50M13O52K506o45n500
377b710k278K940O03k755p40O94K1J142j001k495L87K331L240R12l224k73M582
394A376J516j330J772M92j544M461L588n442l591M572P13k665L252k65o706P51
410I50L594m785k778M317M95n134q52P54l179J219N218j580n634J011L756j413
426d041p67K457j141j570M209J570n712o18M515k56j117J489k439k110K424J308
442a799k234j161J392R59l73j065q32Q42J714J639J015k177j072L847L016j814
458A897M55J203k75J103J721j327j407J059J374j221k795j51J025j578k288M38
$$ plain form
474 -767 -3734 -6479 -2640 -2126 -9089 -10307 -6132 -8698 -9338 -5509 -9252 -13102 -6470 -3960 -8367 -6824
490 -6824 -3777 -4922 -3365 -181 -1414 -2385 569 2854 1727 204 675 3302 3477 2108 2217 553
506 553 -1574 2588 4167 -1395 -2137 -302 -2254 -1840 372 -2540 -4553 -1343 -1140 -3473 -2641 -2388 -2381
523 -2381 -273 -1659 -3713 -1326 -1589 -2690 -42 -2006 -5230 -1362 -247 -5529 -4039 -2194 -5957
538 -5957 -4984 -2370 -6146 -7876 -3270 -3645 -5811 -4941 -4976 -4023 -1375 -1077 -2450 -2127 -1520 2036 4407
555 4407 1522 1358 4417 3685 4904 7270 3316 1606 6767 6684 1755 2584 2527 -208 2208 2971 -2529
572 -2529 -3822 -2198 -3348 -3284 -3273 -6186 -5367 -3748 -5657 -5137 -4758 -6345 -3379 -359 -4195 -5051 -801
589 -801 -761 -844 2181 292 -2101 2042 3621 1312 1643 1335 881 2385 1930 221 1203 572 -57 2152
$$ packed form
474g67k967k745L839N14o963j218M175k566o40L829l743l850O632K510m407J543
490f824L047j145J557L184j233r71K954K285j127j523M71K627J75j369J09j664
506E53k127M162J579n562p42J835j952M14K212k912k013L210K03k333Q32K53P
523b381K108j386k054K387k63j101K648j964l224L868J115n282J490J845l763
538e957R73K614l776j730M606l75k166Q70l5R53K648K98j373L23O07L556K371
555D407k885j64L059p32J219K366l954j710N161q3m929Q29n7k735K416P63n500
572b529j293J624j150O4J1k913Q19J619j909N20L79j587K966L020l836q56M250
589h01M0q3L025j889k393M143J579k309L31l08m54J504m55j709R82o31o29K209
$$ plain form
607 2152 -601 -3363 1331 2305 -2060 -303 935 -2767 -129 4470 -420 -2188 3048 1658 -388
622 -388 3497 2047 -1146 2246 3828 258 52 1026 -140 -103 339 -1241 -2355 -1875 -1830 -1557 -2509 -3955
640 -3955 -2259 -1417 -3262 -2114 -1747 -2635 -376 1095 -635 -90 2227 2191 2405 3722 2783 3709 5554
657 5554 4678 3874 5209 4338 3996 5800 3090 390 3415 3457 464 844 57 -3236 -1270 1450 -2371
674 -2371 -4627 -2732 -2973 -3344 -1556 -2106 -4379 -3294 -538 -1027 -2280 -1231 135 117 112 1058 602 -159
692 -159 2333 3830 319 -259 2280 1269 950 2167 611 -2011 500 1985 -721 -1011 214 -640
708 -640 -672 1006 -543 -1323 517 1410 899 600 682 1226 2298 2148 1786 1425 1912 2511 2604 1634 476 714
728 714 1643 1364 -46 -1030 -1122 -615 -1048 -1445 -2540 -3428 -2140 -1205 -2964 -3571 -2118 -2129 -2191 -386 -1358
$$ packed form
607B152k753k762M694R74m365J757J238l702K638M599m890j768N236j390k046
622c88L885j450l193L392J582l570k06R74j166L7M42j580j114M80M5K73r52j446
640c955J696Q42j845J148L67q88K259J471j730N45K317l6K14J317r39R26J845
657E554q76q04J335q71l42J804k710k700L025M2k993L80p87l293J966K720l821
674b371k256J895k41l71J788n50k273J085K756m89j253J049J366j8nR46m56p61
692a59K492J497l511n78K539j011l19J217j556k622K511J485k706k90J225q54
708f40l2J678j549p80J840Q93n11k99Q2N44J072j50l62l61M87N99R3r70j158K38
728G14R29k79j410r84r2N07m33l97j095q88J288R35j759o07J453j1o2J805r72
$$ plain form
747 -1358 -2481 -135 2087 519 -450 1667 1543 1241 3507 2300 -150 1882 3632 1943 574 1592
763 1592 723 76 1133 272 -1635 -1568 48 -707 -2044 -1844 -1613 -1977 -1153 -694 -2322 -2087 489 1062
781 1062 -403 -483 373 503 2063 2659 966 396 1452 2028 1727 1444 448 187 789 766 -673 -1112 -1177
800 -1177 -1515 -1137 -1514 -3475 -2922 -1125 -2070 -2611 -2051 -1684 -1357 560 17 -1646 -662 1499 1902 1172
818 1172 1629 1521 1063 2716 3217 1398 795 2444 2544 1086 203 696 -706 92 1247 -646 -2840
835 -2840 -1047 -290 -1464 -1465 -1588 -1495 -1323 771 -365 -1869 -526 745 984 1205 706 335 734 2158
853 2158 1786 827 503 1139 1096 515 191 -643 -613 -194 -427 -1779 -2001 -1942 -1131 -1287 -1795 -2060 -1599 -1047 -661
874 -661 -827 -710 -265 820 1926 1077 521 2078 2796 2277 2356 2459 1996 2567 3301 1990 131 737 1900
$$ packed form
747a358j123K346K222j568r69K117j24l02K266j207k450K032J750j689j369J018
763A592q69o47J057q61j907O7J616p55j337K00K31l64Q24M59j628K35K576N73
781A062j465q0Q56J30J560N96j693n70J056N76l01k83r96k61O02k3j439m39o5
800a177l38L78l77j961N53J797r45n41N60L67L27J917n43j663R84K161M03p30
818A172M57j08m58J653N01j819o03J649J00j458q83M93j402P98J155j893k194
835b840J793P57j174jj23R3J72K094j136j504J343J271K39K21m99l71L99J424
853B158l72r59l24O36m3n81l24q34L0M19k33j352k22N9Q11j56n08k65M61N52L86
874f61j66J17M45J085J106q49n56J557P18n19P9J03m63N71P34j311j859O06J163
$$ plain form
893 1900 929 65 -309 -2065 -1686 -88 -1288 -3159 -2825 -2057 -1842 -2377 -2193 -2847 -2775 -582 -138 -1291
911 -1291 -1657 -267 577 811 1070 374 15 1249 2159 1215 201 641 1064 1323 1006 -176 -871 -438 200
930 200 67 -817 -1789 -1236 -159 -480 -1498 -1344 -624 -145 18 -8 -475 -147 1333 1282 19 168 783 1329
950 1329 700 982 124 -719 434 868 -1148 -1747 -1187 -1497 -1941 -1678 -2755 -3799 -2202 -1473 -2691 -3502
968 -3502 -2219 -1954 -1784 -714 -1076 -1741 -611 1100 816 -2 793 1684 1900 2225 2078 730 815 2351
986 2351 1679 420 -18 -157 -49 287 -396 -1988 -2195 -1505 -1756 -2074 -3075 -3302 -2620 -1812 -2298 -3020 -2527
1005 -2527 -1851 -982 -696 -1513 -1821 -955 577 375 -373 -286 -44 617 974 715 -469 -510 642 342 -712
1024 -712 -1063 -815 -988 -487 -330 -1557 -1960 -391 -463 -1230 -796 -483 -943 175 892 -422 -511 993 1314
$$ packed form
893A900r71q64l74j756L79J598j200j871L34P68K15n35J84o54P2K193M44j153
911a291l66J390Q44K34K59o96l59J234R10r44j014M40M23K59l17j182o95M33O38
930B00j33q84r72N53J077l21j018J54P20M79J63k6m67L28J480n1j263J49O15N46
950A329o29K82q58q43J153M34k016n99N60l10m44K63j077j044J597P29j218q11
968c502J283K65J70J070l62o65J130J711k84q18P95Q91K16L25j47j348Q5J536
986B351o72j259m38j39J08L36o83j592k07O90k51l18j001k27O82Q08m86p22M93
1005b527O76Q69K86q17l08Q66J532k02p48Q7K42O61L57k59j184m1J152l00j054
1024g12l51K48j73N01J57j227m03J569p2p67M34L13m60J118P17j314q9J504L21
$$ plain form
1043 1314 750 739 463 593 956 1185 -51 -472 -179 478 -377 -1421 -1762 -1984 -1781 -1390 -2117 -3637 -2634
1062 -2634 -2098 -2134 -2477 -2456 -2584 -1886 -648 -883 -1352 -672 -107 597 1205 903 641 1625 2310 1995 1955 1871 1437
1083 1437 2079 2235 1135 647 961 1352 430 -500 -376 -841 -800 -564 -1194 -2109 -1916 -1028 -1495 -1616 -1178 -1646
1103 -1646 -1423 -126 -141 -1742 -733 318 135 55 528 -44 26 1013 607 -317 -124 488 15 299 -377
1122 -377 -1040 -848 16 -97 -745 -1245 -939 134 -120 -517 -344 -266 409 1222 620 309 988 1428 2058 1950
1142 1950 1243 798 1545 2021 1573 999 711 122 748 840 -639 -1128 -396 -1052 -1269 -1259 -2505 -2332 -1243
1161 -1243 -1244 -2260 -2008 -1133 -1243 -682 -225 -681 -621 843 1043 566 741 1094 1847 1838 1725 1513 1141 1328 1791
1182 1791 1386 399 489 594 495 593 -334 -1142 -870 -37 -274 -1287 -1063 -950 -712 -116 -533 -1022 -315 529
$$ packed form
1043A314n64j1k76J30L63K29j236m21K93O57q55j044l41k22K03L91p27j520J003
1062b634N36l6l43K1j28O98J238k35m69O80N65P04O08l02k62R84O85l15m0q4m34
1083A437O42J56j100m88L14L91r22r30J24m65M1K36o30r15J93Q88m67j21M38m68
1103a646K23J297j5j601J009J051j83q0M73n72P0R87m06r24J93O12m73K84o76
1122c77o63J92Q64j13o48n00L06J073k54l97J73P8O75Q13o02l11O79M40O30j08
1142A950p07m45P47M76m48n74k88n89O26R2j479m89P32o56k17J0j246J73J089
1161a243jj016K52Q75j10N61M57m56O0J464K00m77J75L53P53rj13k12l72J87M63
1182A791m05r87R0J05r9R8r27q08K72Q33k37j013K24J13K38N96m17m89P07Q44
$$ plain form
1202 529 333 330 -10 296 875 1712 1074 248 828 886 878 931 153 -394 182 376 -550 -1104 -1019 -1251 -818 -663
1224 -663 -1563 -1908 -1354 -784 -988 -1037 -851 -875 135 421 358 -74 213 1284 1625 942 945 1232 1433 1541 1560
1245 1560 550 53 1105 1015 -102 -312 -558 -878 -399 -201 -1673 -1869 -1034 -1035 -1150 -890 -1309 -1231 -187
1264 -187 -181 -828 -520 -87 449 1063 830 -14 580 1660 1381 995 863 344 611 1338 462 -442 -468 -324 -557
1285 -557 -473 -1374 -1443 -974 -762 -917 -1544 -1837 -908 -129 -607 -701 -213 -218 462 1216 708 128 1156 1798 996
1306 996 1383 1452 537 1460 1832 679 117 287 307 -31 1 -758 -1528 -705 -483 -1115 -1574 -1689 -1337 -707 -858
1327 -858 -1413 -1084 -587 33 46 25 -148 429 1005 1168 1007 374 782 1433 1263 645 188 690 408 869 398
1348 398 -992 -383 -34 -536 -725 -754 -1169 -790 81 -781 -1149 -289 180 219 607 542 240 745 1716 1580 819
$$ packed form
1202E29j96ll40L06N79Q37o38q26N80N8qN3p78n47N76J94r26n54Q5k32M33J55
1224f63r00l45N54N70k04m9J86k4J010K86o3m32K87J071L41o83LK87K01J08J9
1245A560j010m97J052r0j117k10k46l20M79J98j472j96Q35jj15K60m19P8J044
1264a87Oo47L08M33N36O14k33q44N94J080k79l86j32n19K67P27q76r04k6J44k33
1285e57Q4r01o9M69K12j55o27k93R29P79m78r4M88nO80P54n08n80J028O42q02
1306I96L87O9r15R23L72j153n62J70K0l38L2p59p70Q23K22o32m59j15L52O30j51
1327h58n55L29M97O20J3k1j73N77N76J63j61o33M08O51j70o18m57N02k82M61m71
1348C98j390O09L49n02j89k9m15L79Q71q62l68Q60M69L9L88o5l02N05R71j36p61
$$ plain form
1369 819 1022 1153 1200 1478 1030 71 354 746 613 -622 -771 -717 -644 -854 -1037 -1806 -1796 -1205 -746 -1560 -1656
1390 -1656 -1162 -829 -302 -332 -328 -448 797 1051 813 797 1005 1332 1691 1818 1318 1077 1210 1756 1312 1065 476
1411 476 159 618 410 -264 -654 -786 -607 -585 -1040 -1221 -1286 -680 -465 -753 -1000 -631 -545 -139 258 -112 27
1432 27 559 853 444 330 567 819 477 612 340 -324 82 564 -197 -434 -109 -358 -306 -139 -659 -1290 -711
1453 -711 -321 -196 -197 -68 -50 325 1016 692 512 993 1488 1657 1330 1246 1142 1426 1440 1170 717 -79 143 279
1475 279 48 -649 -856 -1057 -1187 -1018 -1718 -1801 -1509 -1543 -1465 -1739 -1877 -1565 -797 -602 -787 -694 -350 -57 706
1496 706 526 61 902 1185 1228 1386 915 694 706 1281 726 166 310 480 236 -25 -544 -755 -399 -414 -437
1517 -437 -948 -1318 -780 -313 -517 -466 -525 -716 -205 404 11 -210 192 700 371 440 298 -144 271 708 178
$$ packed form
1369H19K03J31M7K78m48r59K83L92j33j235j49N4P3k10j83p69J0N91M59q14r6
1390a656M94L33N27l0Mj20J245K54k38j6K08L27L59J27n00k41J33N46m44k47n89
1411D76l17M59k08o74l90j32J79K2m55j81o5O06K15k88k47L69Q6M06L97l70J39
1432B7N32K94m09j14K37K52l42J35k72o64M06M82p61k37L25k49N2J67n20o31N79
1453g11L90J25jJ29J8L75O91l24j80M81M95J69l27q4j04K84J4k70m53p96K22J36
1475B79k31o97k07k01j30J69p00q3K92l4P8k74j38L12P68J95j85R3L44K93P63
1496G06j80m65Q41K83M3J58m71k21J2N75n55n60J44J70k44k61n19k11L56j5k3
1517d37n11l70N38M67k04N1n9j91N11O09l93k21M02N08l29O9j42m42M15M37n30
$$ plain form
1538 178 -666 -526 -607 -378 -482 -991 -1388 -1058 -998 -927 -1071 -1438 -909 -775 -544 -694 -697 -254 296 704 206 328
1560 328 563 1117 1273 1280 679 929 1460 1291 668 764 366 40 513 -142 -498 -799 -300 -913 -1253 -1217 -1946
1581 -1946 -1739 -947 -1257 -1510 -1214 -1186 -547 -361 -546 -700 -114 448 472 200 308 481 1177 803 781 599 370
1602 370 685 924 424 -327 -79 87 -148 -105 -449 -1143 -410 -187 -819 -832 -705 -716 -190 6 -539 -661 563
1623 563 651 659 637 104 428 1092 1259 698 662 473 633 636 313 -183 -529 -408 -366 -711 -1230 -1072 -804 -496 -967
1646 -967 -1231 -1269 -967 -328 -371 -712 -565 55 235 568 476 377 680 1346 1230 671 1109 951 1448 1351 753 420
1668 420 396 559 15 58 -414 -721 -678 -295 -785 -992 -1039 -899 -764 -636 -928 -992 -486 -142 146 -465 214 502
1690 502 558 791 671 370 297 1241 1078 409 539 663 450 437 81 -575 -760 34 -136 -572 -810 -933 -734
$$ packed form
1538A78q44J40q1K29j04n09l97L30O0P1j44l67N29J34K31j50lM43N50M08m98J22
1560C28K35N54J56Po01K50N31j69o23R6l98l26M73o55l56l01M99o13l40L6p29
1581a946K07P92l10k53K96K8O39J86j85j54N86N62K4k72J08J73O96l74k2j82k29
1602C70L15K39n00p51K48J66k35M3l44o94P33K23o32j3J27j1N26J96n45j22J224
1623E63Q8Qk2n33L24O64J67n61l6j89J60Ll23m96l46J21M2l45n19J58K68L08m71
1646i67k64l8L02O39m3l41J47O20J80L33r2r9L03O66j16n59M38j58M97r7n98l33
1668D20k4J63n44M3m72l07M3L83m90k07m7J40J35J28k92o4N06L44K88o11O79K88
1690E02N6K33j20l01p3R44j63o69J30J24k13j3l56o56j85P94j70m36k38j23J99
$$ plain form
1711 -734 -469 -502 -845 -958 -124 -160 -192 -24 -97 528 682 949 537 450 1066 1050 904 573 595 632 606 773 447
1734 447 -267 -179 -46 -290 -753 -834 -989 -657 -769 -1032 -1087 -1191 -568 -394 -529 -503 -442 28 486 90 96 277
1756 277 537 1112 826 744 436 547 1045 481 108 130 147 -7 114 -380 -661 -690 -396 -363 -1056 -905 -884 -811
1778 -811 -112 -488 -848 -128 22 161 223 168 307 834 838 850 460 730 836 839 855 431 109 479 276 8 -298
1801 -298 -720 -555 -657 -678 -1001 -1314 -1352 -654 -763 -1094 -872 -921 -424 -330 -153 -292 131 549 682 565 734
1822 734 364 891 1003 1161 383 431 819 825 436 266 -13 -288 124 -369 -503 -876 -513 -445 -412 -802 -695 -665
1844 -665 -283 -181 -135 -383 -75 356 201 393 280 189 790 955 633 140 333 398 244 258 -270 -450 -239
1865 -239 -43 -220 -862 -844 -637 -687 -277 -737 -1288 -517 -187 -330 -246 -484 218 517 722 371 359 623 1103
$$ packed form
1711g34K65l3l43j13Q34l6l2J68p3O25J54K67m12q7O16j6j46l31K2L7k6J67l26
1734D47p14Q8J33k44m63q1j55L32j12k63n5j04O23J74j35K6O1M70M58l96OJ81
1756B77K60N75k86q2l08J11M98n64l73K2J7j54J21m94k81k9K94L3o93J51K1P3
1778h11O99l76l60P20J50J39O2n5J39N27MJ2l90K70J06LJ6m24l22L70k03k68l06
1801b98m22J65j02k1l23l13l8O98j09l31K22m9M97R4J77j39M23M18J33j17J69
1822G34l70N27J12J58p78M8L88Ol89j70k79k75M12m93j34l73L63O8L3l90J07L0
1844f65L82J02M6k48L08M31j55J92j13r1O01J65l22m93J93O5j54J4n28j80K11
1865b39J96j77o42J8K07n0M10m60n51P71L30j43Q4k38P02K99K05l51j2K64M80
$$ plain form
1886 1103 1143 842 1012 777 1470 1121 897 640 170 340 700 219 -69 -576 -596 -414 -783 -986 -1131 -833
1906 -833 -787 -594 -857 -935 -772 -132 -248 -355 -407 268 388 729 586 341 606 910 813 689 436 492 723 640
1928 640 520 -274 56 -137 -27 38 -561 -700 -143 -239 -395 -540 -412 -66 57 325 -104 26 413 527 469
1949 469 700 268 592 869 1014 486 260 404 287 685 10 -340 -391 -170 -259 -598 -899 -868 -637 -698 -669 -968
1971 -968 -958 -687 -232 -408 -349 -147 96 496 744 693 493 817 1020 976 791 1011 1042 740 1023 466 278 22
1993 22 433 154 -121 -564 -637 -539 -482 -815 -955 -991 -671 -618 -907 -864 -734 -416 -100 -60 -12 -81 189 428 284
2016 284 247 654 415 563 489 390 106 223 233 -126 -97 -154 -224 -121 -254 -666 -663 -559 -590 -370 -316 -639 -158 -43
2040 -43 35 181 -129 303 291 593 709 478 420 522 570 673 373 97 495 204 62 50 -529 -445 -332 -397 -714
$$ packed form
1886A103M0l01J70k35O93l49k24k57m70J70L60m81k88n07k0J82l69k03j45K98
1906h33M6J93k63p8J63O40j16j07n2O75J20L41j43k45K65L04r7j24k53N6K31q3
1928F40j20p94L30j93J10O5n99j39N57r6j56j45J28L46J23K68m29J30L87J14n8
1949D69K31m32L24K77J45n28k26J44j17L98o75l50n1K21q9l39l01L1K31o1K9k99
1971i68J0K71M55j76N9K02K43M00K48n1k00L24K03m4j85K20L1l02K83n57j88k56
1993B2M11k79k75m43p3R8N7l33j40l6L20N3k89M3J30L18L16M0M8o9K70K39j44
2016B84l7M07k39J48p4r9k84J17J0l59K9n7p0J03j33m12LJ04l1K20N4l23M81J15
2040d3P8J46l10M32j2L02J16k31n8J02M8J03l00k76L98k91j42j2n79Q4J13o5l17
$$ plain form
2063 -714 -871 -1186 -691 -835 -833 -841 -745 -504 -469 -373 -337 -263 142 362 573 265 662 884 726 908 614 597 448
2086 448 822 674 328 122 163 118 10 -272 -625 -526 -532 -569 -800 -780 -676 -517 -302 -679 -480 -272 -250 81 -129
2109 -129 106 205 704 396 551 411 427 294 772 216 53 -27 155 291 159 -414 -656 -383 -333 -381 -710 -426
2131 -426 -656 -364 -259 -295 -765 -143 240 276 63 475 449 714 668 646 455 614 781 864 858 579 248 131 525
2154 525 412 -139 -395 -378 -88 -509 -561 -865 -730 -437 -609 -907 -704 -409 -376 -268 -168 -30 -176 249 329
2175 329 784 311 475 511 849 888 645 603 640 766 258 262 -154 -188 115 -142 -296 -821 -318 -288 -470 -559 -481
2198 -481 -416 -390 -170 -268 -397 25 381 191 376 229 556 787 738 560 633 658 591 631 340 28 -3 233 115
2221 115 -371 -639 -674 -212 -447 -561 -913 -519 -691 -286 -541 -703 -257 -367 -223 -47 274 -15 344 566
$$ packed form
2063g14j57l15M95j44KqR6K41L5R6L6P4M05K20K11l08L97K22j58J82k94j7j49
2086D48L74j48l46k06M1m5j08k82l53R9ol7k31K0J04J59K15l77J99K08K2L31k10
2109a29K35R9M99l08J55j40J6j33M78n56j63q0J82J36j32n73k42K73N0m8l29K84
2131d26k30K92J05l6m70O22L83L6k13M12k6K65m6k2j91J59J67Q3ok79l31j17L94
2154E25j13n51k56J7K90m21n2l04J35K93j72k98K03K95L3J08J00J38j46M25Q0
2175C29M55m73J64L6L38L9k43m2L7J26n08Mm16l4L03k57j54n25N03L0j82q9P8
2198d81O5K6K20r8j29M22L56j90J85j47L27K31m9j78P3K5o7M0k91l12l1K36j18
2221A15m86k68l5M62k35j14l52L94j72M05k55j62M46j10J44J76L21k89L59K22
$$ plain form
2241 566 753 664 346 522 481 682 714 25 354 227 250 25 -55 -151 -409 -177 -507 -909 -712 -368 -454 -319
2263 -319 -744 -602 -292 -274 -52 -188 15 348 472 395 377 282 380 531 707 239 151 103 280 19 143 -280
2285 -280 -408 -397 -282 -617 -585 -671 -650 -608 -387 -609 -537 -400 -148 -111 -244 -201 152 451 595 272 401 568 673
2308 673 798 889 451 335 552 500 338 -105 5 145 -134 -477 -431 -546 -519 -456 -629 -869 -468 -706 -392 -462
2330 -462 -444 -498 12 250 114 177 238 303 471 439 332 172 499 574 382 310 132 34 14 273 -271 -311 -556 -358
2354 -358 -637 -360 -395 -696 -402 -286 -224 -488 -214 -113 150 111 45 133 505 916 575 555 219 590 653 394
2376 394 309 162 209 198 182 -441 -319 -345 -400 -344 -398 -614 -681 -278 -670 -542 -424 -607 -445 56 -334 -206 158
2399 158 454 479 538 492 682 689 921 894 678 208 754 496 292 358 117 116 67 45 -216 -299 -331 -289 -211 -587 -668
$$ packed form
2241E66J87q9l18J76m1K01L2o89L29j27K3k25q0r6k58K32l30m02J97L44q6J35
2263c19m25J42L10J8K22j36K03L33J24p7j8r5R8J51J76m68q8m8J77k61J24m23
2285b80j28J1J15l35L2q6K1M2K21k22P2J37K52L7j33M3L53K99J44l23J29J67J05
2308F73J25R1m38j16K17n2j62m43J10J40k79l43M6j15K7O3j73k40M01k38L14p0
2330d62J8n4N10K38j36O3O1O5J68l2j07j60L27P5j92p2j78r8k0K59n44m0k45J98
2354c58k79K77l5l01K94J16O2k64K74J01K63l9o6Q8L72M11l41k0l36L71O3k59
2376C94q5j47M7j1j6o23J22k6n5N6n4k16o7M03l92J28J18j83J62N01l90J28L64
2399A58K96K5N9m6J90PK32k7k16m70N46k58k04O6k41jm9k2k61q3l2M2P8l76q1
$$ plain form
2424 -668 -390 -241 -48 -438 -388 -148 7 179 86 133 177 626 594 511 373 248 241 541 414 212 -14 -279 -77
2447 -77 -20 -286 -326 -486 -209 -456 -536 -607 -607 -64 -88 -73 -471 -304 -48 298 247 327 194 666 640 380 591 285
2471 285 764 698 542 180 302 205 132 165 -277 -308 -473 -208 -547 -594 -755 -635 -314 -295 -500 -730 -337 -112
2493 -112 -264 -170 -31 159 112 362 385 451 246 638 363 517 471 251 522 199 213 -74 -138 -108 41 -255 -670
2516 -670 -399 -406 -256 -432 -518 -530 -276 -380 -267 -315 -61 -47 49 333 128 234 199 532 509 199 234 319 182 402
2540 402 -16 97 -96 -55 -126 -161 -242 -360 -116 -278 -374 -434 -638 -299 -491 -624 -204 -110 53 142 429 192 375
2563 375 713 521 584 594 476 436 457 456 513 9 275 191 -166 -257 -129 -238 -203 -276 -492 -633 -636 -547 -302 -302 -465
2588 -465 -213 50 49 130 98 -103 316 217 353 308 216 183 545 383 284 187 398 304 308 40 -245 -235 -83 -279 -199
$$ packed form
2424f68K78J49J93l90N0K40J55J72r3M7M4M49l2q3j38j25pL00j27k02k26k65K02
2447g7N7k66m0j60K77k47q0p1%N43k4J5l98J67K56L46n1Q0j33M72k6k60K11l06
2471B85M79o6j56l62J22r7p3L3m42l1j65K65l39m7j61J20L21J9k05k30L93K25
2493a12j52R4J39J90m7K50K3O6k05L92k75J54m6k20K71l23J4k87o4L0J49k96m15
2516f70K71pJ50j76q6j2K54j04J13m8K54J4R6K84k05J06l5L33k3l10L5Q5j37K20
2540D02m18J13j93M1p1l5q1j18K44j62r6o0k04L39j92j33M20R4J63Q9K87k37J83
2563C75L38j92O3J0j18m0K1jN7n04K66q4l57r1J28j09L5p3k16j41lQ9K45%j63
2588d65K52K63jQ1l2k01M19r9J36m5r2l3L62j62r9r7K11r4Mk68k85J0J52j96Q0
$$ plain form
2613 -199 -409 -493 -164 -300 -634 -312 -268 -137 -116 163 -55 31 169 648 222 484 504 407 862 370 421 333 430
2636 430 368 411 106 -183 24 -28 -343 -457 -337 -522 -444 -179 -286 -517 -463 -300 -309 -76 -115 -108 218 -25 339
2659 339 175 400 108 577 493 467 460 621 608 254 467 249 266 414 324 -92 -188 -385 23 -284 -712 -516 -277
2682 -277 -221 -268 -197 -347 6 75 207 204 355 446 233 500 385 433 429 550 474 334 97 -5 176 84 93 -395 -88
2707 -88 -212 118 -207 -347 -507 -548 -482 -264 -215 -309 -260 40 228 -20 68 297 322 422 532 384 441 518 361
2730 361 747 428 16 259 330 148 97 225 -196 -115 -63 -145 -451 -495 -439 -218 -337 -416 -274 -154 -129 -132 -120 -80
2754 -80 301 261 239 198 257 442 583 490 299 440 384 429 129 -184 -91 4 64 64 -665 -420 -270 -425 -471 -373 -414
2779 -414 -488 -284 -183 -331 33 -218 242 135 127 214 103 228 392 155 303 400 403 234 322 192 90 277 123
$$ packed form
2613a99k10q4L29j36l34L22M4J31K1K79k18Q6J38M79m26K62K0r7M55m92N1q8R7
2636D30o2M3l05k89K07n2l15j14J20j85P8K65j07k31N4J63rK33l9PL26k43L64
2659C39j64K25k92M69q4k6pJ61j3l54K13k18J7J48r0m16r6j97M08l07m28J96K39
2682b77N6m7P1j50L53O9J32lJ51R1k13K67j15M8mJ21p6j40k37j02J81r2Rm88L07
2707h8j24L30l25j40j60m1O6K18M9r4M9L00J88k48Q8K29K5J00J10j48N7P7j57
2730C61L86l19m12K43P1j82n1J28m21Q1N2q2l06m4N6K21j19p9J42J20K5lJ2M0
2754h0L81m0k2m1N9J85J41r3j91J41n6M5l00l13R3R5O0%p29K45J50j55m6R8m1
2779d14p4K04J01j48L64k51M60j07qQ7j11J25J64k37J48R7Lj69Q8j30j02J87j54
$$ plain form
2802 123 -36 -134 35 -343 -73 -484 -612 -687 -303 -251 -200 -391 -363 -66 -101 28 138 -7 174 609 493 354
2824 354 517 364 385 452 320 292 239 280 71 262 127 -288 -311 -59 -195 -175 -503 -154 -167 -396 -325 -255 -169 -80
2848 -80 63 -89 24 212 75 284 340 15 498 374 703 375 397 383 340 118 0 -230 -46 37 -257 -84
2870 -84 -460 -469 -140 -317 -456 -561 -353 -171 77 -9 -339 122 137 112 350 60 92 233 273 558 502 305 326
2893 326 526 530 170 168 35 75 -95 -55 -77 -384 -117 -42 -499 -530 -328 -435 -338 -449 -11 -87 -303 183 87 144
2917 144 24 204 547 -60 328 252 435 528 441 409 328 -33 300 301 -415 -252 110 -352 -72 -187 -333 -27
2939 -27 -542 -7 -512 -582 -209 -129 165 10 42 276 270 327 237 535 221 289 304 467 190 212 44 61 -38 -5 -157
2964 -157 -244 -40 -139 -267 -321 -117 -189 -315 -403 -372 -138 -279 74 -138 22 169 10 250 284 164 279 246 317
$$ packed form
2802A23j59r8J69l78K70m11j28p5L84N2N1j91K8K97l5J29J10j45J81M35j16j39
2824C54J63j53K1O7j32k8n3M1k09J91j35m15k3K52j36K0l28L49j3k29P1P0Q6Q9
2848h0J43j52J13J88j37K09N6l25M83j24L29l28K2j4m3k22j18k30J84Q3k94J73
2870h4l76rL29j77j39j05K08J82K48q6l30M61J5k5K38k90L2J41M0K85n6j97K1
2893C26K00Ml60kj33M0j70M0k2l07K67P5m57l1K02j07R7j11M38p6k16M86r6N7
2917A44j20J80L43o07L88p6J83R3q7l2q1l61L33Jp16J63L62m62K80j15j46L06
2939b7n15N35n05p0L73Q0K94j55L2K34oN7r0K98l14O8J5J63k77K2j68J7r9L3j52
2964a57q7K04r9j28n4K04p2j26q8L1K34j41L53k12J60J47j59K40L4j20J15l3P1
$$ plain form
2987 317 223 177 387 309 291 335 104 -101 48 0 -105 -333 -437 -76 -293 -445 -356 -607 -472 -304 -52 -329
3009 -329 -251 -170 51 145 -77 -171 18 388 208 327 323 225 298 441 402 13 203 108 189 -146 -151 -129 -91 -51 -235
3034 -235 -526 -349 -38 -260 -389 -75 -97 -280 -78 273 143 -68 374 238 288 471 238 355 608 476 139
3055 139 62 62 -184 31 -22 19 -56 -173 -145 -248 -554 -326 -249 -271 -370 -71 -249 -146 155 32 -100 -101 284 189
3079 189 430 232 63 286 599 496 388 38 295 309 319 212 -243 3 -9 -28 -125 -238 -243 -88 -231 -215 -64
3102 -64 -354 -338 -237 -69 -173 -46 -42 114 380 148 284 126 466 252 308 400 437 218 287 -42 -47 220 103
3125 103 -13 -53 -299 -539 -535 -219 -262 -185 -597 -453 20 -219 -253 -190 -7 -18 62 4 -64 106 369 134 147 165
3149 165 275 359 474 13 290 205 337 146 86 -372 -198 -174 -175 -363 -463 -311 -490 -189 -190 -306 -490 236 -275
$$ packed form
2987C17r4m6K10p8j8M4k31k05J49m8j05k28j04L61k17j52Q9k51J35J68K52k77
3009c29P8Q1K21R4k22r4J89L70j80J19mr8P3J43l9l89J90r5Q1l35nK2L8M0j84
3034b35k91J77L11k22j29L14k2j83K02L51j30k11M42j36N0J83k33J17K53j32l37
3055A39p7%k46K15n3M1p5j17K8j03l06K28P7k2r9K99j78J03L01j23j32jL85r5
3079A89K41j98j69K23L13j03j08l50K57J4J0j07m55K46j2j9r7j13nJ55j43J6J51
3102f4k90J6J01J68j04J27MJ56K66k32J36j58L40k14N6R2L7k19O9l29nK67j17
3125A03j16m0k46k40ML16m3P7m12J44M73k39l4O3J83j1Q0n8o8J70K63k35J3J8
3149A65J10Q4J15m61K77q5J32j91o0m58J74K4jj88j00J52j79L01jj16j84P26n11
$$ plain form
3172 -275 -26 -250 154 94 171 555 405 321 294 262 570 130 171 245 105 227 160 199 16 0 12 214 -383 -277
3196 -277 -187 -15 -394 -189 -252 46 -114 -201 89 -84 346 231 177 196 136 394 212 358 417 196 214 284 257
3219 257 83 20 -88 -88 -212 -251 -160 42 -329 -283 -518 -274 -374 -39 -197 -58 -173 -40 188 67 117 152 66
3242 66 40 285 371 260 610 192 333 271 377 268 -25 -21 64 -54 -141 -172 -159 -205 -337 -238 -328 -206 -25 -262
3266 -262 -204 110 13 308 26 134 185 318 -188 318 237 474 140 271 346 136 182 -20 -131 184 -75 0
3288 0 -61 -254 -271 -108 -206 -152 -261 -11 -225 -354 -302 -130 -49 63 86 -70 283 3 10 214 280 567 570 250 352
3313 352 158 280 321 202 167 -32 78 -22 -347 -86 -180 -271 -20 -301 -254 -406 -443 -471 -125 -131 -213 66 133 10
3337 10 113 230 -102 211 286 303 217 362 282 246 -102 61 214 -120 59 69 -21 -90 -11 -147 -66 -249 -397 -293
$$ packed form
3172b75K49k24M04o0P7L84j50q4k7l2L08m40M1P4j40J22o7L9j83j6J2K02n97J06
3196b77R0J72l79K05o3K98j60q7K90j73M30j15n4J9o0K58j82J46N9k21J8P0k7
3219B57j74o3j08%j24l9R1K02l71M6k35K44j00L35j58J39j15J33K28j21N0L5q6
3242F6k6K45Q6j11L50m18J41o2J06j09k93MQ5j18q7l1J3m6j32R9r0J22J81k37
3266b62N8L14r7K95k82J08N1J33n06N06q1K37l34J31P5k10M6k02j11L15k59P5
3288@o1j93j7J63r8N4j09K50k14j29N2J72Q1J12K3j56L53k80PK04O6K87Ll20J02
3313C52j94J22M1j19l5j99J10j00l25K61r4r1K51k81M7j52l7k8L46oq2K79O7j23
3337A0J03J17l32L13P5J7q6J45q0l6l48J63J53l34J79J0r0o9P9j36Q1j83j48J04
$$ plain form
3361 -293 -460 -263 -223 -279 -34 35 29 252 108 319 488 422 -183 212 92 349 500 115 69 292 189 168 -216
3384 -216 -7 109 155 -115 -118 -392 -289 -53 -304 -189 -292 -185 -76 57 -144 -78 99 8 67 121 333 94
3406 94 383 354 282 379 355 92 416 226 -122 144 -119 -55 -27 -80 -303 -159 -193 -107 -186 -291 -110 -85 -118 116
3430 116 -173 -160 148 349 33 -40 408 168 244 370 67 298 74 235 185 162 46 -17 87 -14 -222 135
3452 135 -325 -57 -278 -370 -372 -466 -125 -45 -216 -74 -367 88 177 -119 356 -81 448 235 205 351 413 296 249
3475 249 157 222 -218 179 135 132 88 -46 -180 -190 -222 -188 -57 -123 -431 -215 -149 -335 -184 -149 200 152 -52 -169
3499 -169 0 243 337 157 104 225 166 90 397 276 245 193 173 91 -10 -318 -91 18 -199 19 -320 183 -365
3522 -365 -126 -227 -126 -229 -128 -111 163 -104 -56 43 359 247 161 213 196 179 106 334 216 -53 158 -45 -132
$$ packed form
3361b93j67J97M0n6K45O9oK23j44K11J69o6o05L95j20K57J51l85m6K23j03k1l84
3384b16K09J16M6k70lk74J03K36k51J15j03J07J09J33k01O6J77r1N9N4K12k39
3406I4K89k9p2R7k4k63L24j90l48K66k63O4K8n3k23J44l4Q6p9j05J81K5l3K34
3430A16k89J3L08K01l16p3M48k40P6J26l03K31k24J61n0k3j16o3J04j01k08L57
3452A35m60K68k21r2kr4L41Q0j71J42k93M55Q9k96M75m37N29k13l0J46O2j17m7
3475B49r2O5m40L97m4lm4j34j34j0l2L4J31o6l08K16O6j86J51L5L49m8k04j17
3499a69J69K43R4j80n3J21n9p6L07j21l1n2k0q2j01l08K27J09k17K18l39N03n48
3522c65K39j01J01j03J01J7K74k67M8R9L16j12q6N2j7j7p3K28j18k69K11k03q7
$$ plain form
3545 -132 -16 -13 -130 -40 -299 -99 -259 -324 -170 -202 -204 58 -124 -117 -217 -141 -28 64 41 210 301 236 509 351 157
3570 157 205 347 507 327 67 65 -14 -100 -418 64 -273 -215 -286 -40 -191 -322 -10 -243 93 -322 -158 -12
3592 -12 70 62 -263 265 179 227 -6 35 151 225 345 398 259 59 78 288 178 236 165 -56 -238 -151 -18 -205
3616 -205 -85 -402 -8 -286 -349 -229 -377 -21 -119 -12 92 320 5 67 207 163 171 127 327 47 204 317
3638 317 2 161 307 -115 -15 -18 -319 -317 -322 -165 -24 -263 46 -48 -278 -174 -119 48 -91 -146 -89 39 76 -3
3662 -3 252 175 406 112 172 332 368 -30 61 106 226 -35 -7 -132 331 -178 -306 -59 -307 -144 -274 -281 36
3685 36 14 157 -109 -138 146 3 24 226 78 149 479 122 25 6 161 101 74 183 143 291 -210 62 -90
3708 -90 -87 -188 -97 -237 -50 -34 -23 -32 294 -117 -357 -203 -219 -22 -174 -276 -15 212 171 260 109 178 136 177 -99
$$ packed form
3545a32J16Lj17R0k59K00j60o5J54l2kK62j82Pj00P6J13R2k3J69R1o5K73j58j94
3570A57M8J42J60j80k60kp9q6l18M82l37N8p1K46j51j31L12k33L36m15J64J46
3592a2Q2ql25N28q6M8k33M1J16P4J20N3j39k00J9K10j10N8p1k21j82Q7J33j87
3616b05J20l17L94k78o3J20j48L56r8J07J04K28l15O2J40m4Qm4K00k80J57J13
3638C17l15J59J46m22J00ll01KnJ57J41k39L09r4k30J04N5J67j39n5N7J28L7p9
3662cK55p7K31k94O0J60L6l98R1M5J20k61K8j25M63n09j28K47k48J63j30pL17
3685C6k2J43k66k9K84j43K1K02j48P1L30l57r7j9J55o0k7J09m0J48n01K72j52
3708i0Lj01R1j40J87J6J1rL26m11k40J54j6J97j52j02K61K27m1Q9j51O9m2M1k76
$$ plain form
3733 -99 -62 259 363 160 140 201 63 -108 58 -70 -265 21 -317 -268 -60 -324 -38 -239 -320 -171 -242 -39
3755 -39 71 51 36 135 131 1 371 68 380 104 25 23 -144 -41 83 36 -85 -124 -107 -127 -55 -253 -86 -220 111
3780 111 -145 -34 -132 -49 -69 44 -87 169 192 98 218 0 184 206 274 46 205 -102 -33 250 115 6 -54
3803 -54 -13 116 -30 -5 -285 -104 -188 -119 -123 20 -47 -138 269 -306 -176 -4 123 88 11 47 163 47 65 -8 296
3828 296 56 215 152 -136 126 14 -22 76 -148 -184 -229 -58 -112 -462 -343 -411 -104 -84 -115 -153 -84 -82 -51 -68 46
3853 46 -42 127 138 -3 -37 149 199 311 286 125 175 198 109 229 173 4 -299 -90 -57 -163 -87 -238 -305 21
3877 21 -66 -120 -154 -199 -102 248 -46 -85 -217 70 113 -104 58 57 198 201 -112 60 380 -29 107 -130 71 -142
3901 -142 -270 -193 88 -145 -153 -274 -142 -143 86 12 -118 -7 -6 -38 -21 -133 42 321 197 202 201 271 -29 4 281
$$ packed form
3733i9L7L21J04k03k0O1j38j71J66j28j95K86l38M9K08k64K86k01q1J49p1K03
3755c9J10k0j5R9mj30L70l03L12k76p9kj67J03J24m7j21l9J7k0P2j98J67j34L31
3780A11k56J11r8Q3k0J13j31K56K3r4J20k18J84K2O8k28J59l07O9K83j35j09o0
3803e4M1J29j46K5k80J81q4O9mJ43o7r1M07n75J30J72J27l5p7L6J16j16J8p3L04
3828B96k40J59o3k88K62j12l6R8k24l6m5J71n4l50J19o8L07K0l1l8O9KL1j7J14
3853D6q8J69J1j41l4J86N0J12k5j61N0K3q9J20n6j69l03K09L3j06P6j51o7L26
3877B1q7n4l4m5R7L50k94l9j32K87M3k17J62jJ41Ll13J72L20m09J36k37K01k13
3901a42j28P7K81k33qj21J32jK29p4j30J11Jl2J7j12J75K79j24NjP0l00L3K77
$$ plain form
3926 281 120 221 91 109 308 -26 63 48 -402 -69 -44 66 -172 233 -265 -183 -127 38 -10 -137 54 9 -118
3949 -118 -32 165 -158 73 226 229 229 228 -112 275 240 127 -22 -130 67 -283 -138 -118 108 -176 -49 -426 -81
3972 -81 -50 -169 -291 -198 -139 -185 -80 55 -105 80 337 -54 152 41 -185 53 281 174 21 93 -49 276
3994 276 131 -145 116 -73 64 -372 4 -257 -306 -178 -44 -100 -447 -273 -136 -312 -248 241 298 107 -18
4015 -18 184 -52 340 -95 111 188 87 54 91 29 -49 -115 66 -250 204 -64 -90 -226 -128 -272 -151 -149 131 -471
4039 -471 -304 35 -154 -150 -120 -227 177 -276 106 142 199 136 233 200 145 191 2 48 8 157 139 57 -63 -65 -126 -40
4065 -40 89 -58 -218 -425 -132 -38 -281 -135 -195 -258 -41 3 -43 69 120 127 -36 453 1 116 355 10 61
4088 61 89 199 122 170 171 1 -27 -157 51 -373 -250 -216 -291 50 -165 -132 -84 -113 -30 6 -67 2 73 36 153 85
$$ packed form
3926B81j61J01j30J8J99l34Q9j5m50L33K5J10k38M05m98Q2N6J65m8j27J91m5j27
3949a18Q6J97l23K31J53L%jl40L87l5j13j49j08J97l50J45K0K26k84J27l77L45
3972h1L1j19j22R3N9m6J05J35j60J85K57l91K06j11k26K38K28j07j53P2j42L25
3994B76j45k76K61j89J37m36L76k61m9J28J34n6l47J74J37j76O4M89N7j91j25
4015a8K02k36L92m35K06P7j01l3L7o2p8o6J81l16M54k68k6j36R8j44J21KK80o02
4039d71J67L39j89ML0j07M04m53L82L6N7o3R7l3n5M6j89M6m0J49j8q2j20ko1Q6
4065d0J29j47j60k07K93R4k43J46o0o3K17M4m6J12N1Pj63M89m52J15K39l45N1
4088F1K8J10p7M8Jj70k8j30K08m24J23L4p5L41k15L3M8k9Q3L6p3O9P1l7J17o8
$$ plain form
4114 85 -88 131 66 245 114 -218 -6 -94 241 175 -10 -83 5 -67 -83 -26 -54 -25 -409 -225 -170 -147 -83 -155 -84
4139 -84 -116 165 -34 -96 -80 35 -79 -102 -54 29 177 69 388 295 276 250 350 0 -40 78 -167 27 -251 -40
4163 -40 -21 -71 -58 -296 -108 -273 85 -47 -147 3 -163 115 -13 11 93 -119 229 -25 86 55 354 468
4185 468 111 275 87 38 -213 44 231 41 228 112 -161 -47 2 -161 -251 -280 -99 -38 -143 231 -205 284
4207 284 17 -261 -4 -56 126 288 310 256 275 10 224 118 264 284 35 -148 134 -59 -257 -145 -77 -220
4229 -220 -51 -29 186 0 -263 -250 -57 3 -140 10 -21 153 78 -68 99 268 -88 279 432 135 121 -50
4251 -50 131 -187 -57 139 57 -48 36 13 -210 125 -111 -114 -137 -142 -57 -319 15 -34 3 -55 122 257 28 303
4275 303 6 172 225 -26 56 166 377 114 132 142 151 117 119 10 61 -17 -267 -9 -201 -7 -103 -212 80 -149
$$ packed form
4114H5j73K19o5J79j31l32K12q8L35o6j85p3Q8p2j6N7k8K9l84J84N5K3O4p2P1
4139h4l2K81j99o2J6J15j14k3M8Q3J48j08L19r3j9k6J00l50m0J18k45J94k78K11
4163d0J9n0J3k38J88j65L58j32j00J50j66K78j28K4Q2k12L48k54J11l1K99J14
4185D68l57J64j88m9k51K57J87j90J87j16k73J14M9j63r0k9J81O1j05L74m36M89
4207B84k67k78K57n2J82J62K2n4J9k65K14j06J46K0k49j83K82j93j98J12O8j43
4229b20J69K2K15j86k63J3J93O0j43J50l1J74p5j46J67J69l56L67J53k97j4j71
4251e0J81l18J30J96q2j05Q4k3k23L35k36lk3nQ5k62L34m9L7n8J77J35k29K75
4275C03k97J66N3k51Q2J10K11k63J8J0Rl4Kj09N1p8k50K58j92J94r6j09K92k29
$$ plain form
4299 -149 -93 348 -29 -52 -47 -147 29 93 -140 -106 272 70 160 61 421 173 -184 71 284 226 166 262 -28 60
4323 60 -26 -379 89 -182 -163 -115 -109 -214 -22 36 -176 48 148 65 69 108 68 8 85 -38 94 246 107 182 208
4348 208 121 278 305 -99 -10 102 -55 -264 -209 -307 -399 -199 -254 -207 -293 -92 -154 -103 110 304 -141 186 43 -33
4372 -33 229 -178 170 291 336 261 163 22 -157 -96 -165 -81 -307 -17 -11 -265 -207 -168 -246 227 -175 -200 -126 -153 -129
4397 -129 -91 -116 131 49 -162 105 154 195 90 213 124 253 144 100 187 19 122 12 -133 395 3 53 108
4420 108 -142 -335 -20 -48 55 -55 -9 -197 -127 -81 -106 -47 73 18 -164 14 -146 143 -58 -20 176 351 -134
4443 -134 98 86 -11 146 -33 58 -55 -10 370 -125 -216 163 -142 -85 -203 -34 227 -144 -268 -41 184 42
4465 42 -9 122 40 29 -3 102 51 378 98 38 275 -21 106 18 34 29 15 66 -177 -198 -99 -150 -106 52 -164 -237
$$ packed form
4299a49N6M41l77k3Nj00J76O4k33L4L78k02R0r9L60k48l57K55K13n8o0R6k90Q8
4323F0q6l53M68k71J9M8Oj05J92N8k12K24J00q3ML9m0o0P7j23J32J52j39P5K6
4348B08q7J57K7m04Q9J12j57k09N5r8r2K00n5M7q6K01o2N1K13J94m45L27j43p6
4372c3K62m07L48J21M5p5r8j41j79O1o9Q4k26K90Ok54N8L9p8M73m02k5P4k7K4
4397a29L8k5K47q2k11K67M9M1j05J23q9J29j09m4Q7j68J03j10j45N28l92N0N5
4420A08k50j93L15k8J03j10M6j88P0M6k5N9J20n5j82J78j60K89k01L8J96J75m85
4443a34K32j2r7J57j79R1j13M5L80m95r1L79l05N7j18J69K61l71j24K27K25j42
4465D2n1J31q2j1l2J05n1L27k80o0K37k96J27q8J6nj4N1k43k1R9n1M4J58k16p3
$$ plain form
4491 -237 195 -56 29 -30 -239 -50 -124 -38 -80 -20 180 30 -62 118 71 161 -28 -83 105 -137 -62 102 96 66 -100
4516 -100 -176 -124 -3 -92 -144 -70 -264 -10 -42 17 91 -150 -112 10 -260 -72 -98 -184 311 -12 140 233 -86 206
4540 206 397 189 42 110 381 -3 -176 -42 -55 -310 -116 7 -132 -61 -22 -214 -50 -227 135 36 -113 18
4562 18 187 97 -154 -140 55 142 99 156 198 183 154 -51 -13 -80 2 -59 165 -1 -49 -135 -406 -17 -97 -210 -33
4587 -33 -98 -203 2 -152 155 107 -243 65 -163 39 108 26 93 94 33 66 253 258 -170 -69 220 -87 -142 98
4611 98 54 145 -136 -228 22 105 46 -298 -49 -208 -237 -222 -54 1 176 190 -15 43 -83 -164 102 262 -38 -46 151
4636 151 116 71 -79 79 94 32 281 -15 -280 -166 -111 -83 -319 123 -68 23 73 21 -54 -10 21 -26 -100 -136 -42
4661 -42 223 -73 298 170 153 283 247 307 83 -5 10 -6 -14 98 40 -161 61 -165 -6 94 -393 -120 -223
$$ packed form
4491b37M32k51Q5n9k09J89p4Q6m2O0K00j50r2J80m7R0j89n5J88k42P5J64ol0j66
4516a00p6N2J21q9n2P4j94K54l2N9P4k41L8J22k70J88k6q6M95l23J52R3l19K92
4540B06J91k08j47O8K71l84j73J34j3k55J94J23j39P1L9j92J64j77L62r9j49J31
4562A8J69r0k51J4J95Q7m3N7M2j5k9k05L8o7Q2o1K24j66m8q6k71L89q0j13J77
4587c3o5j05K05j54L07m8l50L08k28K02O9q2O7Jo1L3J87Nm28J01K89l07n5K40
4611I8m4R1k81r2K50Q3n9l44K49j59k9J5J68N5J75J4k05N8j26q1K66J60l00qJ97
4636A51l5m5j50J58J5o2K49k96k65J14N5K8k36M42j91R1N0n2p5M4L1m7p4l6R4
4661d2K65k96L71j28j7J30l6O0k24q8J5j6qJ12n8k01K22k26J59J00m87K73j03
$$ plain form
4684 -223 0 -68 -258 -278 109 -242 -21 98 -79 277 87 144 88 -53 -244 61 258 270 -164 -75 -33 331
4706 331 16 222 -176 27 139 -12 -234 26 -208 -157 -175 -299 12 -50 -63 -22 20 -169 -21 146 -39 115
4728 115 148 300 59 136 102 -172 88 401 122 142 110 -78 3 -29 161 -72 -173 -87 -329 -44 17 141 96
4751 96 -83 -139 -166 257 124 -14 10 -178 109 7 63 -132 29 323 -215 193 -11 219 -83 9 -173 -211
4773 -211 -183 -91 -269 -77 -55 61 -122 36 148 -57 -90 3 -48 -113 96 -152 -15 65 105 208 283 262 304 123
4797 123 164 0 115 66 102 -57 -155 87 -209 -140 -142 -68 -214 -78 -277 -343 -48 -238 74 -27 161 -66 -26
4820 -26 -62 -397 -27 49 120 174 148 83 127 24 184 170 339 334 42 170 126 -6 -300 -97 -17 -75 -78 -120 -73 92
4846 92 -6 19 -192 -152 -29 -162 201 21 -42 -246 -51 -86 64 108 130 -59 196 78 267 105 -105 -6 301
$$ packed form
4684b23K23o8j90k0L87l51K21J19j77L56j90N7n6j41j91L05J97J2m34Q9M2L64
4706C31l15K06l98K03J12j51k22K60k34N1j8j24L11o2j3M1M2j89J48J67j85J54
4728A15L3J52k41P7l4k74K60L13k79K0l2j88Q1l2J90k33j01Q6k42K85O1J24m5
4751I6j79n6k7M23j33j38K4j88K87j02N6j95J61K94n38M08k04K30l02R2j82l8
4773b11K8R2j78J92K2J16j83J58J12k05l3R3n1o5K09k48J37Q0M0J03P5k1M2j81
4797A23M1j64J15m9L6j59r8K42k96O9kP4j46J36j99o6K95j90L12j01J88k27M0
4820b6l6l35L70P6P1N4k6o5M4j03J60j4J69nk92J28m4j32k94K03Q0n8lm2M7J65
4846I2r8K5k11M0J23j33L63j80o3k04J95l5J50M4K2j89K55j18J89j62k10R9L07
$$ plain form
4869 301 273 -186 114 -58 -117 -69 -56 -119 -20 21 -50 -98 -52 -158 93 -31 49 59 99 229 311 125 266 -53 -41
4894 -41 18 89 119 80 169 109 -79 43 143 32 -186 -145 -39 -165 -94 -111 72 -188 -81 61 -94 -137 -31 14
4918 14 103 229 86 63 197 136 189 38 29 116 266 174 -78 -165 27 94 52 234 -225 -126 -18 -126 108 -199
4942 -199 -180 -359 25 -132 -243 -151 -46 122 -130 201 -174 -28 75 131 -87 156 30 124 393 107 35 26
4964 26 91 -221 14 -257 256 185 -172 -94 -12 -182 -174 -295 51 115 -137 -118 -75 87 -86 142 -131 -56 73 77
4988 77 31 302 -10 175 185 50 81 286 299 -333 -242 83 8 -73 156 -5 42 -167 -72 -123 63 28 -115 21
5012 21 -294 -147 -144 -124 291 152 93 151 -121 101 -113 118 75 -22 90 106 77 -60 -179 62 94 -10 -211 -158
5036 -158 -211 55 -172 21 -234 6 -230 33 72 -160 -17 11 12 193 -166 -231 92 -29 -80 -265 2 -46 129
$$ packed form
4869C01k8m59L00j72n9M8J3o3R9M1p1m8M6j06K51j24Q0J0M0J30Q2j86J41l19J2
4894d1N9P1L0l9Q9o0j88J22J00j11k18M1J06j26P1j7J83k60J07J42j55m3J06M5
4918A4Q9J26j43k3J34o1N3j51rQ7J50r2k52q7J92O7m2J82m59R9J08j08K34l07
4942a99J9j79L84j57j11R2J05J68k52L31l75J46J03N6k18K43j26R4K69k86p2r
4964B6O5l12K35k71N13p1l57P8Q2j70Qj21L46O4k52J9M3J62j73K28k73P5J29M
4988G7m6K71l12J85J0j35L1K05J3o32R1L25p5q1K29j61M7k09R5n1J86l5j43J36
5012B1l15J47LK0M15j39n9N8k72K22k14K31m3r7J12J6k9j37j19K41L2j04k01N3
5036a58n3K66k27J93k55K40k36K63L9k32J43K8JJ81l59o5L23j21n1j85K67m8J75
$$ plain form
5059 129 -72 -82 -32 38 148 -233 -74 -271 -306 -45 -92 -68 -79 -25 -232 5 -31 386 -69 92 210 79 -87
5082 -87 -395 86 211 12 46 -48 232 192 -134 94 43 -43 -69 -90 16 -82 -84 14 41 30 -252 -170 -16 -77 -218
5107 -218 268 -184 -12 -123 37 158 -89 -108 -79 -92 -32 21 92 -6 -135 -39 90 -135 86 -4 99 -80 -69
5130 -69 18 166 -204 2 -383 -121 251 -240 -7 -80 68 -172 -256 54 -100 48 40 -61 -73 -89 -41 -86 230
5153 230 109 -26 -66 -52 81 -85 -20 -108 152 -55 -40 157 -14 103 -254 -13 -38 85 55 71 -185 19 -3
5176 -3 -114 258 -305 266 194 113 155 362 59 -19 -81 -99 -83 47 -137 -97 -123 -80 230 -89 -151 -37 13 -47 -66
5201 -66 -161 -145 158 -200 -138 -123 -52 -125 -149 172 23 -22 49 242 -39 128 143 253 276 -7 -15 251 -89 49 9
5226 9 -163 -67 -62 -241 63 47 6 -172 -252 -278 29 -34 -39 -105 25 -130 79 -183 153 111 34 51 -108 320 -147
$$ packed form
5059A29k01j0N0P0J10l81J59j97l5K61m7K4j1N4k07K37l6M17m55J61J18j31j66
5082h7l08M81J25j99L4r4K80m0l26K28n1q6k6k1J06r8kR8K7j1k82Q2J54o1j41
5107b18M86m52J72j11J60J21k47j9K9j3O0N3P1r8j29R6J29k25K21r0J03j79J1
5130f9Q7J48l70K06l85K62L72m91K33p3J48k40q4L10j54J48qj01j2j6M8m5L16
5153B30j21j35m0J4J33j66O5q8K60k07J5J97j71J17l57K41k5J23l0J6k56K04k2
5176cj11L72n63N71p2q1M2K07l03p8o2j8J6J30j84M0k6M3L10l19o2J14N0o0j9
5201f6r5J6L03l58O2J5P1p3k4L21j49m5P1J93k81J67J5J10K3k83qK66l40J38m0
5226Ij72R6Nj79L04j6m1j78q0k6L07o3no6J30j55K09k62L36m2p7J7j59M28m67
$$ plain form
5251 -147 -410 14 176 92 128 -223 141 -142 95 12 -118 22 -228 254 11 -340 46 -93 -30 -238 119
5272 119 -148 201 -131 81 238 250 -93 -16 141 122 81 64 101 118 200 54 -1 203 62 -101 -167 -29 192
5295 192 86 15 -75 -39 234 -142 -105 -19 -240 98 33 -40 -210 192 -156 22 206 50 255 152 -158 -76 149
5318 149 157 -79 241 55 260 -19 -41 103 -175 213 -239 -50 104 -165 86 -109 -139 77 -39 85 22 142
5340 142 18 130 98 236 73 -131 72 -173 17 51 23 108 2 -81 -151 -113 -101 -158 -262 -20 52 25 -117 124
5364 124 -334 -207 -247 34 103 -174 -32 178 58 -46 -89 7 -149 15 257 42 128 61 151 0 -293 -157
5386 -157 -81 127 -95 -148 44 73 -122 -8 129 106 112 94 99 49 -121 128 62 -234 32 -58 196 103 135 304 353
5411 353 -64 145 -49 29 120 -87 3 -188 -176 -48 -82 -197 -56 26 96 -86 -141 29 -17 -107 -36 -18 151 -208
$$ packed form
5251a47k63M24J62q4L6l51L64k83K37q3j30J40k50M82k43l51L86j39O3k08L57
5272A19k67L49l32K12J57J2l43P7J57j9m1j7L7J7Q2j46n5K04j41j63o6J38K21
5295A92j06p1r0L6K73l76L7Q6k21L38o5p3j70M02l48J78J84j56K05j03l10Q2K25
5318A49Qk36L20j86K05k79k2J44k78L88m52J89J54k69K51j95l0K16j16J24o3J20
5340A42j24J12l2J38j63k04K03k45J90L4k8Q5j06q3p0L8J2n7j04K42P2k7j42K41
5364A24m58J27m0K81O9k77J42K10j20j04m3R6j56J64K42k15Q6o7R0j51k93J36
5386a57P6K08k22n3J92K9j95J14J37k3Oj8Nn0j70K49o6k96K66r0K54r3L2J69M9
5411C53m17K09j94P8R1k07R0j91J2J28l4j15J41Q2P0j82n5J70m6r0P1J8J69l59
$$ plain form
5435 -208 -73 -276 24 118 -176 153 43 188 46 -20 72 6 -71 94 18 179 -107 32 175 143 122 -101 26
5458 26 -12 -127 -308 -25 -45 153 5 36 57 -125 34 13 -163 32 309 -241 174 163 47 71 132 108 -155
5481 -155 -158 25 6 78 -191 86 94 -237 39 12 102 -133 -62 -66 -7 -140 -11 50 -146 -55 31 -64 218 115 114 -40
5507 -40 -203 68 -69 -296 66 121 227 -92 -175 33 -64 151 -23 -17 -168 -327 -123 -23 230 -171 -104 148
5529 148 -254 142 229 191 52 90 111 462 134 -161 47 14 178 4 41 86 29 -17 9 -197 -52 4 -225 -71
5553 -71 114 66 -92 124 -251 120 118 -121 -26 136 58 73 -236 -68 219 141 84 -176 214 2 33 256 79
5576 79 132 131 78 60 -51 -28 1 103 91 -81 52 -18 -170 64 -19 -215 140 149 -133 10 118 164 -137 37 71
5601 71 -205 -149 -191 123 151 -145 175 -86 33 22 101 123 -47 44 114 -62 -110 42 -204 -117 -97 -48 -68 -37 -43 -33
$$ packed form
5435b08J35k03L00R4k94L29j10J45j42o6R2o6p7J65p6J61k86J39J43l2k1k23J27
5458B6l8j15j81K83k0J98j48L1K1j82J59k1j76J95K77n50M15j1j16K4O1k4k63
5481a55lJ83j9P2k69K77Ql31K76k7R0k35P1mN9j33J29O1j96R1Q6r5K82j03jj54
5507d0j63K71j37k27L62N5J06l19q3K08r7K15j74Oj51j59K04J00K53m01O7K52
5529A48m02L96Q7l8j39L8K1L51l28k95K08l3J64j74L7M5n7m6K6k06J45N6k29J54
5553g1J85m8j58K16l75L71kk39R5J62p8J5l09J68K87p8n7k60L90k12L1K23j77
5576G9N3jn3j8j11K3K9J02j2j72J33p0j52K34q3j96L55Rk82J43J08M6l01J74L4
5601G1k76N6m2L14K8k96L20k61J19j1P9K2j70R1P0j76m8J52k46Q7K0M9k0L1oJ0
$$ plain form
5627 -33 -123 -51 121 -7 79 -77 27 -74 91 -23 221 -63 192 55 -113 10 -106 99 22 171 -43 65
5649 65 27 128 -276 12 97 -324 223 137 -185 -112 41 -73 52 -125 -60 169 118 99 -7 151 269 -153 -16
5672 -16 111 -264 25 153 54 -24 -17 -130 193 242 -52 -86 -191 10 -39 -125 25 -75 74 -124 -208 34 -162
5695 -162 107 -35 148 -49 -16 -180 125 -231 8 215 135 119 -170 40 -29 97 174 -58 -32 -198 15 -96
5717 -96 -58 -135 77 -58 -40 -6 -98 -32 -102 37 -145 86 -181 204 -51 -35 -264 133 71 171 -105 -224 -69
5740 -69 199 -142 -63 1 -39 -46 -62 -40 114 24 -141 -208 36 10 -117 45 -68 214 158 -23 -107 -161 106 207 14
5765 14 58 186 70 81 124 -34 -151 -54 31 -60 41 101 9 -96 -244 -44 45 168 -345 -98 -98 -244 50 85
5789 85 -147 -194 139 129 -17 137 -156 220 -17 357 104 116 -95 -188 235 -104 93 102 205 -33 117 -55
$$ packed form
5627c3r0P2J72j28Q6j56J04j01J65j14K44k84K55j37j68J23j16K05p7J49k14J08
5649F5l8J01m04K88Q5m21N47q6l22P3J53j14J25j77O5K29n1j9j06J58J18m22J37
5672a6J27l75K89J28r9p8Pj13L23M9k94l4j05K01m9q6J50j00J49j98q4K42j96
5695a62K69j42J83j97L3j64L05l56K39K07q0j6k89K10o9J26P7k32K6j66K13j11
5717i6L8p7K12j35J8L4r2O6p0J39j82K31k67L85k55J6k29L97o2J00k76j19J55
5740f9K68l41P9O4m0pj6K2J54r0j65o7K44k6j27J62j13K82n6j81q4n4K67J01j93
5765A4M4J28j16J1M3j58j17R7Q5r1J01O0r2j05j48K00Q9J23n13K47%j46K94L5
5789H5k32m7L33j0j46J54k93L76k37L74k53J2k11r3M23l39J97RJ03k38J50j72
$$ plain form
5811 -55 -193 72 -130 -170 253 -71 -8 -109 24 293 58 18 -38 -30 36 76 256 6 -113 219 74 -114 -9
5834 -9 -85 35 28 73 177 -34 -333 -8 -175 164 216 -187 107 -17 -18 -58 -117 -26 -140 -146 186 -189 252 140 172
5859 172 -147 37 153 47 203 132 151 84 -184 191 234 11 -208 18 -135 -9 146 183 25 3 36 -9 -210
5882 -210 232 96 -96 -239 288 -112 -126 -96 -264 15 321 17 47 -27 146 -44 140 234 -217 159 68 -166
5904 -166 -240 119 -73 -197 -99 -49 -129 220 -184 -49 -24 -62 -29 -62 -74 24 40 68 -206 17 56 148 98 -179 -95
5929 -95 -43 -48 127 -134 4 -132 12 15 -31 207 -37 23 104 -64 31 11 93 -6 -59 14 -164 -124 -166 -64 99 181
5955 181 32 86 83 205 -60 -92 -57 197 -76 106 -56 306 151 -32 105 -155 -46 -111 -252 -16 45 -113
5977 -113 68 0 17 20 -74 -179 -180 219 150 157 -125 -84 -39 -41 221 -22 -28 -102 -79 1 28 -62 -34 66 -102 -12 45 -94
$$ packed form
5811e5j38K65k02m0M23l24O3j01J33K69k35m0n6QO6M0J80k50j19L32j45j88J05
5834ip6J20pM5J04k11k99L25j67L39N2m03K94j24jm0n9R1j14oL32l75M41j12L2
5859A72l19J84J16j06J56p1J9o7k68L75M3k23k19K26j53J26J55L7j58k2L3m5k01
5882b10M42j36j92j43N27m00j4L0j68K79L06l04L0p4J73j90J84R4m51L76r1k34
5904a66p4L59j92j24R8N0q0L49m04J35K5l8L3l3j2R8J6K8k74K23L9R2n0k77Q4
5929i5N2nJ75k61J38j36J44Lm6K38k44O0Q1j68R5k0Q2r9n3P3j78M0m2J02J63Q2
5955A81j49N4lJ22k65l2L5K54k73J82j62L62j55j83J37k60J09o5j41K36O1j58
5977a13J81o8J7Lr4j05jL99o9Pk82M1M5kK62k43op4K3Q0K7r0K8J00j68R0N7j39
$$ plain form
6005 -94 160 39 -189 -243 145 -258 100 -178 23 180 -205 -203 -133 -7 -3 11 -148 -194 -50 -115 5 83 4 6 -450
6030 -450 27 -206 -19 78 -89 3 -145 -86 -185 -16 114 -153 37 -78 -168 20 256 25 -190 65 -16 32
6052 32 24 -2 -272 -11 81 28 14 -142 -9 34 20 -208 -299 344 -17 -4 43 185 -349 141 -116 -272 166 29
6076 29 -10 -195 -30 19 19 -90 180 -132 -125 108 74 48 27 280 -28 -5 83 269 142 -123 200 46 -1 -178
6100 -178 -124 14 60 -64 -63 -49 -11 -137 89 48 -20 -257 -20 -243 108 13 -52 93 247 -98 -256 83 -88
6123 -88 6 136 -106 151 227 -57 97 -94 24 -97 -101 169 -126 -46 -8 -90 62 -95 -78 10 -114 -77 67 87
6147 87 10 185 209 -96 -5 46 -19 -27 134 -218 66 -27 -26 -20 92 -206 -186 175 88 38 -94 -4 38 -39 -86 -277 -13
6174 -13 165 36 288 110 40 97 -84 -218 37 -260 -99 69 -53 95 65 -117 -13 4 142 35 -43 101
$$ packed form
6005i4K54j21k28n4L88m03L58k78K01J57l85KP0J26MJ4j59m6J44o5J20P8p9Km56
6030d50M77k33J87R7j67R2j48N9r9J69J30k67J90j15r0J88K36k31k15K55q1M8
6052C2qk6k70K61R2n3j4j56J33M3j4k28r1O43l61J3M7J42n34M90k57j56M38j37
6076B9l9j85J65M9%j09K70l12PK33l4k6k1K53l08K3Q8J86j27k65L23j54m7j77
6100a78N4J38M6j24JJ4L8j26K26m1o8k37K37k23L51r5o5J45J54l45j58L39j71
6123h8R4J30k42K57P6k84J54j91J18j21mK70k95Q0L8q2J52j57J7Q8j24L7J44K0
6147H7p7J75K4l05R1N1o5qJ61l52K84r3JOJ12k98K0L61q7n0j32R0M2p7m7j91K64
6174a3J78j29K52j78p0N7j81j34K55k97J61J68j22J48l0j82J04J7J38j07p8J44
$$ plain form
6196 101 30 -173 -50 -240 -23 2 43 66 -211 -66 -271 175 -85 116 7 -85 24 -70 150 298 168 255
6218 255 -12 -166 -94 232 112 -240 119 -3 -188 -100 194 132 -119 6 105 -136 -165 13 -149 12 64 118
6240 118 -191 206 -130 4 183 -64 121 63 117 -46 49 173 -123 -70 -67 -111 -23 -130 191 180 36 -76 75
6263 75 5 31 26 379 211 -96 -41 219 -248 10 -50 -403 110 -175 209 365 135 -33 -59 180 340 158 23
6286 23 -13 -199 54 7 -21 -16 259 -67 95 175 -14 124 -46 136 315 167 -19 180 44 -344 149 134 137
6309 137 171 289 81 79 186 -27 247 -157 150 -91 -140 37 41 -93 187 148 -32 -62 -118 -130 -41 -123 -230 311
6333 311 21 177 -213 -113 112 -184 -220 -40 -354 -115 -35 103 -38 228 -74 236 -54 13 251 112 -112
6354 -112 -178 -162 -24 199 54 -7 -165 104 -215 -5 185 -145 167 84 145 104 -155 -95 -116 -194 -51 238 -9
$$ packed form
6196A01p1k03J23j90K17K5M1K3k77J45k05M46k60K01j09r2J09r4K20J48j30Q7
6218B55k67j54P2L26j20l52L59j22j85Q8K94o2k51J25R9k41k9J78j62J61N2N4
6240A18l09L97l36J34J79k47J85n8N4j63R5J24k96N3Lm4Q8j07L21j1j44j12J51
6263G5p0K6nL53j68l07N5K60m67K58o0l53N13k85L84J56k30j68k6K39J60j82j35
6286B3l6j86K53m7k8NK75l26J62Q0j89J38j70J82J79j48j86J99j36l88M93j5L
6309A37L4J18k08kJ07k13K74m04L07k41m9J77Mj34K80l9j80l0n6j2Q9q2j07N41
6333C11k90J56l90J00K25k96l6J80l14K39Q0J38j41K66l02L10k90O7K38j39k24
6354a12o6J6J38K23j45o1j58K69l19K10J90l30L12q3O1m1k59O0k1p8J43K89k47
$$ plain form
6377 -9 112 -10 -79 104 128 12 91 -200 47 -174 279 102 73 128 -25 96 -127 26 75 75 92 99 -155 82
6401 82 20 204 208 215 241 77 -116 238 -33 -138 -121 -134 -135 110 -87 14 89 39 117 12 -279 201 20 -145 0
6426 0 117 -2 -112 86 138 33 192 -116 74 -107 -92 128 -57 92 -30 -100 -110 90 10 -147 22 119 157
6449 157 -128 -198 -222 -23 313 -160 -269 204 -58 -84 129 -95 -8 80 -65 -79 -77 39 195 92 -30 -236 -50
6472 -50 -91 120 26 -93 62 -56 6 75 78 -130 270 67 31 -146 39 134 -34 -147 -216 -52 36 -34 -58 124
6496 124 15 -174 -30 -76 -65 -11 -169 -11 87 -49 86 23 114 -45 -149 194 -90 170 -147 -137 -177 -301 -46
6519 -46 -81 192 -9 -107 16 -21 -31 -159 -28 -388 20 -243 -172 164 -48 14 14 186 -10 -9 40 9 79 -86 38
6544 38 -191 -122 33 84 163 84 141 133 117 -55 -109 -94 -142 -56 118 -25 76 -97 274 164 217 224 43 71 -111 -121
$$ packed form
6377iJ21j22o9J83K4j16P9k91K47k21M53j77k9N5j53J21k23J53M9%J7Pk54K37
6401H2o2J84MPK6j64j93L54k71j05J7j3jK45j97J01P5n0P8j05k91M80j81j65J45
6426@J17j19j10J98N2j05J59l08J90j81J5K20j85J49j22p0j0K00q0j57J69R7L8
6449A57k85p0k4J99L36m73j09M73k62k6K13k24Q7Q8j45j4KJ16J56j03j22k06J86
6472e0m1K11r4j19J55j18O2O9Lk08M00k03l6j77J85R5j68j13o9J64Q8p0k4J82
6496A24j09j89J44m6J1N4j58J58R8j36J35o3R1j59j04L43k84K60l17J0m0j24K55
6519d6l5K73k01r8J23l7j0j28J31l60M08k63P1L36k12O2%J72j96JM9l1P0j65J24
6544C8k29O9J55N1P9p9N7qj6j72n4J5m8Q6J74j43J01j73L71j10N3Pj81K8j82j0
$$ plain form
6570 -121 313 86 -72 111 14 91 -3 -46 -114 -238 -52 -48 174 355 4 -102 -76 -40 139 -156 34 -63 120
6593 120 1 -151 102 -161 -65 99 -146 -52 -94 -355 -60 188 188 -171 351 61 -157 11 -76 71 4 28 -9
6616 -9 9 13 -90 127 -208 128 32 30 108 -46 123 -102 -34 -101 -13 -11 -55 -10 148 -63 -65 181 -16 112 106 11 87
6643 87 -11 113 61 37 396 -127 -132 -94 172 -123 -177 -227 -59 108 80 31 -142 -15 -102 177 76 -236 -103 178
6667 178 64 -202 -135 226 10 -19 172 -131 67 -46 -31 -62 63 -104 26 -43 -215 59 113 186 -21 -182
6689 -182 -17 -76 84 28 128 275 290 -149 120 114 -147 175 12 -121 85 59 -32 -149 -1 13 -245 -4 -194
6712 -194 54 -168 -13 -123 -173 16 336 22 -141 -117 -95 80 -144 105 56 87 134 -86 194 118 21 227 -125
6735 -125 94 -44 -4 -43 86 -160 49 -189 124 -44 -34 18 155 23 -95 -37 -75 -208 69 -81 -213 -26
$$ packed form
6570a21M34k27j58J83r7P7r4m3o8j24J86MK22J81l51j06K6L6J79k95J90r7J83
6593A20j19j52K53k63R6J64k45R4m2k61K95K48%l59N22k90k18J68q7J47o7K4l7
6616iJ8Mj03K17l35L36r6kP8j54J69k25O8o7Q8Km4M5J58k11kK46j97J28or5P6
6643H7r8J24n2k4L59n23nL8K66k95n4n0J68J67k8m9j73J27q7K79j01l12J33K81
6667A78j14k66O7L61k16k9J91l03J98j13J5l1J25j67J30o9j72K74N4P3k07j61
6689a82J65n9J60n6J00J47J5m39K69ok61L22j63j33K06k6r1j17J48J4k58K41j90
6712a94K48k22J55j10n0J89L20l14j63K4K2J75k24K49m9L1M7k20K80p6r7K06l52
6735a25K19j38M0l9J29k46K09k38L13j68J0N2J37j32j18N8l8j33K77j50j32J87
$$ plain form
6757 -26 -151 212 77 -84 -3 172 35 7 -25 -45 -95 122 135 -8 100 189 27 -202 -149 69 59 98 255 -61
6781 -61 -15 233 46 -154 4 -260 -93 160 -11 -24 77 110 -52 -1 -44 92 -34 201 -12 -139 -4 11
6803 11 -167 6 168 37 -40 -156 94 13 96 -92 15 22 157 -94 108 -132 -22 1 137 81 -88 -113 202
6826 202 31 -107 68 100 5 -56 238 59 -138 2 -262 -32 -125 -31 -264 -103 71 74 -242 117 -45 -23 -246
6849 -246 15 -85 142 26 -26 78 -182 -18 54 -11 245 358 -268 17 -106 103 249 265 14 69 84 -14
6871 -14 48 -94 22 25 -9 -7 254 56 -68 -102 -38 -142 -214 14 41 -46 92 263 -23 112 102 -190 -97 229 -118
6896 -118 202 -142 -116 285 -22 68 -50 22 -81 -154 -138 90 -81 138 133 -362 137 182 5 188 -52 73 40
6919 40 80 -163 121 199 119 -137 14 -183 114 8 -172 168 -51 34 155 111 -20 3 44 -159 120 -48 -233
$$ packed form
6757b6j25L63j35j61Q1J75j37k8l2k0n0K17J3j43J08Q9j62k29N3K18j0L9J57l16
6781f1M6K48j87k00J58k64J67K53j71j3J01L3j62N1m3J36j26K35k13j27J35J5
6803A1j78J73J62j31p7j16K50q1Q3j88J07PJ35k51K02k40J10K3J36n6j69k5L15
6826B02j71j38J75L2r5o1K94j79j97J40k64K30r3R4k33J61J74Ll16L59j62K2k23
6849b46K61j00K27j16n2J04k60J64P2o5K56J13o26K85j23K09J46J6k51N5J5r8
6871a4O2j42J16Ll4KK61j98j24l4O4j04p2K28K7q7J38J71k86J35j0k92R3L26l47
6896a18L20l44K6M01l07R0j18P2j03p3J6K28j71K19nm95M99M5j77J83k40J25l3
6919D0M0k43K84P8q0k56J51j97K97j06j80L40k19Q5J21m4j31K3M1k03K79j68j85
$$ plain form
6942 -233 92 237 -211 -178 -115 -8 -134 180 7 -146 -112 65 -196 -61 -135 5 163 60 -142 47 -51 -58
6964 -58 61 -219 68 269 -133 115 117 153 -182 -48 55 -194 17 -26 168 24 76 -188 -40 14 -67 -130 -200
6987 -200 64 50 26 -213 -209 19 -144 180 46 53 -258 -179 87 17 -85 -203 68 -109 -151 -30 -165 -304 -185
7010 -185 124 151 153 45 6 -65 -57 -171 -84 114 112 -38 -56 -70 -132 192 -122 -37 -56 -50 38 -64 32 278 133 -43
7036 -43 -168 104 24 -100 144 270 37 -59 -184 -125 4 -25 -152 -191 -92 -74 -3 -3 -38 -153 -64 5 90 -98 -48
7061 -48 -58 51 304 74 174 -34 37 48 99 362 -108 -107 252 -113 179 -83 -3 274 -112 96 -370 -116 -42
7084 -42 34 -135 186 109 -104 -84 64 -44 -266 32 -118 82 -139 205 -276 -29 -296 123 221 -52 101 230
7106 230 -236 37 -29 148 7 -115 -53 -13 113 289 -49 -2 76 -11 -309 -166 -60 73 58 -78 -91 -230 118
$$ packed form
6942b33L25J45m48L3O3J07j26L14j73j53L4J77k61J35p4J40J58j03k02J89r8p
6964e8J19k80K87K01m02K48KL6l35J34J03k49K11m3J94j44N2k64J48N4q1o3p0
6987b00K64j4k4k39MK28j63L24j34Pl11P9K66p0j02j18K71j77m2J21j35j39J19
7010a85L09K7Kj08l9p1Qj14Q7J98kj50j8j4o2L24l14Q5j9OQ8j02R6K46j45j76
7036d3j25K72q0j24K44J26k33r6j25N9J29k9j27l9R9J8P1%l5j15Q9O9Q5j88N0
7061d8j0J09K53k30J00k08P1J1N1K63m70JL59l65K92k62Q0K77l86K08m66K54P4
7084d2P6j69L21p7k13K0J48j08k22K98j50K00k21L44m81K47k67M19R8k73J53J29
7106B30m66K73o6J77j41j22O2M0J26J76l38M7P8q7k98J43J06J33j5j36j3j39L48
$$ plain form
7129 118 -133 211 42 274 -103 -54 -61 -86 156 14 242 105 -208 -91 -204 -212 84 89 246 -58 42 19 12 -38
7153 -38 102 85 16 181 74 82 26 234 -8 -37 -308 -128 -260 -15 45 -93 10 -31 66 -91 21 35 -3 269
7177 269 100 -162 30 -37 -3 -369 -148 232 -208 -267 184 -74 325 -185 -194 -29 114 32 -18 -27 -79 -18 -31 48
7201 48 -60 39 -13 -266 80 -27 235 -144 94 -109 17 84 28 -63 -3 88 11 105 22 250 -7 272 138 55
7225 55 58 114 172 21 68 123 1 -61 99 65 32 229 0 104 -285 -120 -284 -180 32 18 -115 -45 -197 -98
7249 -98 19 90 -46 -120 -102 -13 29 66 -31 -113 -209 -150 -97 -204 184 -180 133 -145 -41 -22 127 291 -76 -56 189
7274 189 97 -60 83 258 -138 158 -138 145 25 13 235 125 27 -255 19 112 -110 73 43 5 -175 -241
7296 -241 -231 133 150 -282 64 21 -64 -4 46 -6 17 120 66 20 161 -35 25 -40 -83 154 -19 -369 -105 -98 127
$$ packed form
7129A18k51L44j69K32l77M9pk5K42j42K28j37l13J17j13qK96NJ57l04J00k3pn0
7153c8J40j7o9J65j07Qn6K08k42k9k71J80j32K45O0j38J03m1R7j57J12J4l8K72
7177B69j69k62J92o7L4l66K21L80m40n9M51k58L99n10rJ65J43q2n0rn2O1j3P9
7201D8j08R9n2k53L46j07K62l79K38k03J26O7n6r1O0R1p7R4q3K28k57K79j34q3
7225E5LN6N8j51M7N5j22o2J60l4l3J97k29J04l89J65j64J04K12j4j33P0j52R9
7249i8J17P1j36p4J8Q9M2L7r7q2r6N9N3j07L88l64L13k78J04J9J49J64l67K0K45
7274A89r2j57J43J75l96K96k96K83j20j2K22j10r8k82K74R3k22J83l0l8j80o6
7296b41J0L64J7m32L46m3q5O0N0n2K3J03n4m6J41j96O0o5m3K37j73l50K64PK25
$$ plain form
7321 127 -121 62 30 -74 71 41 171 -176 -22 171 -174 76 -1 136 143 248 -89 187 -27 11 12 -139 70
7344 70 209 74 19 -220 9 -78 42 135 -14 7 -52 287 207 113 -132 -114 99 110 31 -38 -254 84 -215 154
7368 154 12 130 76 -151 -17 168 -266 91 72 -153 -136 29 155 -58 138 2 -113 -38 -147 42 -119
7389 -119 -34 -24 -71 -285 -120 53 -55 -102 -60 -128 -265 -96 170 60 96 -145 -9 119 -29 39 254 20 112
7412 112 111 -55 -90 225 85 -133 -18 -56 -112 -26 -58 -39 -351 -141 -13 86 47 -36 -121 -78 -53 -195 340 -191 100
7437 100 -43 -70 228 65 128 -20 -31 1 203 12 48 4 9 33 -99 -81 16 131 209 19 -255 -142 166 -15
7461 -15 29 -143 34 36 144 -146 -141 18 -85 39 -193 43 350 116 -61 5 32 199 -11 -121 166 133 -51
7484 -51 113 182 229 207 174 -174 72 -283 31 -49 55 88 105 -6 -487 166 84 132 -120 16 -275 -119 123
$$ packed form
7321A27k48J83l2j04J45l0J30l47J54J93l45K50p7J37PJ05l37K76k14L8Jj51K09
7344G0J39j35n5k39K29q7J20R3j49K1n9L39q0r4k45J8K13J1p9o9k16L38k99L69
7368A54j42J18n4k27J34J85m34L57j9k25J7J65J26k13J96j36j15P5j09J89j61
7389a19Q5J0m7k14J65J73j08m7M2o8j37J69K66j10L6k41J36J28j48O8K15k34R2
7412A12jj66l5L15j40k18J15l8n6Q6l2J9l12K10J28R9l9q3q5M3K5j42N35n31K91
7437A00j43k7K98j63O3j48j1L2K02j91L6m4NK4j32J8R7J15P8j90k74J13L08j81
7461a5M4j72J77KJ08k90NJ59j03J24k32K36L07k34j77O6K7J67k10j10K87l3j84
7484e1J64O9M7k2l3l48K46l55L14q0J04L3J7j11m81O53q2M8k52J36k91J56K42
$$ plain form
7507 123 -22 -43 -179 -128 14 -40 84 28 -15 -14 50 -19 54 -119 -90 -103 208 134 194 -216 -96 -91 -9 25 -171 -46
7533 -46 219 317 -229 70 103 -185 178 -313 -87 61 181 -150 13 273 -71 265 19 176 58 -237 -255
7554 -255 -28 -13 54 -161 148 -154 -47 -114 -269 -99 131 -97 304 -22 -165 -266 -20 -126 21 -129 134
7575 134 124 -140 40 119 6 -6 203 -27 -140 35 2 -233 55 -313 -141 218 -88 -190 -27 -111 147 -59
7597 -59 -81 -232 -29 197 -198 233 5 -123 263 98 36 51 138 -192 -126 -97 -43 -40 -155 216 87 -186 -4
7620 -4 -71 252 126 41 29 -149 38 98 82 -16 -161 -7 -164 -66 -3 -55 -103 39 -56 -119 85 -49 121 13 14
7645 14 -275 -46 -19 229 50 347 344 -57 -9 -4 117 217 -66 32 46 -60 115 -21 -150 66 144 150 94 157 -99
7670 -99 -64 -43 108 99 200 133 267 48 8 -90 114 47 42 171 57 192 -28 -160 -164 80 -259 22 130 2
$$ packed form
7507A23j45k1j36N1J42n4J24n6m3JO4o9P3j73K9j3L11p4O0m10J20NQ2L4j96J25
7533d6K65R8n46K99L3k88L63m91K26J48J20l31J63K60l44L36k46J57j18k95j8
7554b55K27J5O7k15L09l02J07o7j55J70K30k28M01l26j43j01K46j06J47j50K63
7575A34j0k64J80P9j13j2K09k30j13J75l3k35K88l68J72L59l06j02J63q4K58k06
7597e9k2j51K03K26l95M31k28j28L86j65o2J5Q7l30O6K9N4Lj15L71j29k73J82
7620do7L23j26q5j2j78J87O0j6r8j45J54j57R8O3n2m8J42r5o3K04j34J70j08J
7645A4k89K29K7K48j79K97lm01M8NJ21J00k83R8J4j06J75j36j29K16P8On6O3k56
7670i9L5K1J51rJ01o7J34k19m0r8K04o7nJ29j14J35k20j32mK44l39K81J08j28
$$ plain form
7694 2 -250 -10 -126 204 73 41 -20 48 100 152 -153 58 -111 -53 55 79 278 155 115 26 90 72 -167 -164 -233
7719 -233 18 -193 -344 -293 184 -63 -124 -114 -196 52 3 68 38 220 91 7 -113 379 27 -87 -74 112 -286
7742 -286 -80 28 -128 -96 -88 81 232 130 -13 -65 -15 161 -30 103 5 93 23 -5 -60 -30 144 3 -33 -29 118
7767 118 241 86 -144 73 145 -162 228 -139 238 109 -139 -128 56 34 -34 -18 48 28 307 108 85 -1 -169
7790 -169 -158 -89 95 -11 -21 -60 154 8 86 -70 -168 -64 10 72 -101 -115 39 -20 -143 139 49 193 -47 178
7814 178 -175 49 29 25 182 -141 180 -158 -22 49 67 -11 -190 -115 -81 5 77 -188 -37 -84 171 -66 -207 6
7838 6 -50 129 161 109 -60 -21 -50 -37 52 86 -78 -84 -2 242 -273 -179 121 19 144 -62 -157 -234 -37 -161 12
7863 12 49 -3 108 122 101 -117 252 147 116 300 30 -118 -316 -297 -21 363 30 -60 67 73 -203 -70 29 -240
$$ packed form
7694Bk52K40j16L30j31l2o1O8N2N2l05K11j69N8J08K4J99j23m0q9O4j8k39Lo9
7719b33K51k11j51N1M77k47o1J0q2K48m9O5l0J82j29q4j20M92l52j14J3J86l98
7742b86K06J08j56L2QJ69J51j02j43n2N0J76j91J33r8Q8p0k8n5L0J74j41l6MJ47
7767A18J23j55k30K17P2l07L90l67L77j29k48J1J84k2o8J6O6k0K79j99k3q6j68
7790a69J1O9J84j06j0l9K14j46P8j56r8J04P4O2j73j4J54n9j23K82r0J44k40K25
7814A78l53K24k0mJ57l23L21l38J36P1J8p8j79P5L4Q6P2k65J51m7K55k37j41K13
7838Fn6J79L2n2j69L9k9J3Q9L4j64oQ2K44n15R4L00j02J25k06r5p7J97j24J73
7863A2L7n2J11J4k1k18L69j05l1J84k70j48j98J9K76L84l33r0J27Ok76J33R9k69
$$ plain form
7887 -240 -84 62 -128 76 71 33 -219 223 67 46 22 -173 -88 204 202 17 -59 26 169 28 -123 -233 107
7910 107 3 300 104 -44 -181 6 -213 15 -95 -83 4 -144 119 -35 -13 94 -73 -50 -145 -74 76 -144
7932 -144 -36 -43 -71 129 98 -79 79 -86 -103 47 10 198 -148 118 49 -77 222 13 -2 7 -166 -37 119
7955 119 -145 36 313 152 -105 85 45 166 211 -176 -110 95 10 -46 -60 -115 88 48 0 -182 165 -30 -131
7978 -131 51 -51 99 -163 -103 209 -5 244 -38 69 127 240 -214 62 29 136 -182 45 -116 -84 298
7999 298 319 30 -104 -76 110 -89 -60 22 45 -117 -83 -46 -273 -21 76 -130 81 -134 -284 69 250 -22 40
8022 40 -124 230 19 154 -1 -162 -26 108 1 -228 134 6 -35 86 -82 259 9 -43 67 -189 158
8043 158 311 165 273 -63 33 -91 -6 193 -9 -49 95 -119 -51 195 -76 153 -133 -280 -126 183 6
$$ packed form
7887b40J56J46j90K04nl8k52M42j56k1k4j95Q5K92kj85p6Q5J43j41j51j10L40
7910A07j04K97j96j48j37J87k19K28j10J2Q7j48K63j54K2J07j67K3r5P1J50k20
7932a44J08pk8K00l1j77J58j65j7J50l7J88l46K66o9j26K99k09j5Rj73J29J56
7955A19k64J81K77j61k57J90m0J21M5l87O6K05q5n6j4n5K03m0m8j82L47j95j01
7978a31J82j02J50k62O0L12k14K49k82J07N8J13m54K76l3J07l18K27j61L2L82
7999B98K1k89j34K8J86j99K9Q2K3j62L4L7k27K52R7k06K11k15j50L53J81k72O2
8022D0j64L54k11J35j55j61J36J34j07k29L62j28m1J21j68L41k50n2J10k56L47
8043A58J53j46J08l36R6j24Q5J99k02m0J44k14O8K46k71K29k86j47J54L09j77
$$ plain form
8064 6 -209 60 -271 143 -161 46 -21 7 239 -71 49 153 93 -2 97 117 46 -140 69 186 65 138 -5
8087 -5 80 159 46 123 -17 -171 -34 -75 194 179 -23 22 -1 -132 0 134 148 153 220 -119 4 221 28 28 -39
8112 -39 20 152 -228 -31 -105 -39 213 328 39 70 -82 142 22 -6 -68 -183 29 85 21 -110 -235 104 -17
8135 -17 -57 -27 62 3 55 -35 -43 15 -17 24 -15 188 61 18 115 49 -168 -37 11 149 292 22 -5 15 -151 75
8161 75 5 -189 71 38 -257 61 -14 -1 -183 -120 119 -34 -210 -95 -159 -106 -35 -7 94 385 79 -152 243
8184 243 202 -44 131 215 -175 71 -182
$$ packed form
8064Fk15K69l31M14l04K07o7K8K32l10J20J04o0r5R9K0p1j86K09J17j21P3j43
8087eQ5P9j13P7j40j54J37m1K69j5k02M5k3j31J32J34J4NO7l39J23K17j93%o7
8112c9N9J32l80J97p4O6K52J15k89L1j52K24j20k8o2j15K12N6o4j31j25L39j21
8135a7m0L0Q9n9N2r0qN8l2M1l9K03j27m3R7o6k17J31M8J38J43k70k7K0j66K26
8161G5p0j94K60l3k95L18p5J3j82O3K39j53j76J15o4N3P1K8J01K91l06k31L95
8184B43m1k46J75Q4l90K46k53
8191a82
$$ Imaginary data points
##PAGE= N=2
##DATA TABLE= (X++(I..I)), XYDATA
$$ plain form
0 0 0 0 0 0 0 0 0 0 0 0 8 -8 8 -16 16 -21 24 -32 40 -48 56 -64 80 -94 110 -128 149 -172 198 -228 261 -296
32 -296 336 -381 430 -485 544 -610 682 -762 847 -941 1044 -1157 1280 -1416 1561 -1721 1896
49 1896 -2091 2302 -2534 2794 -3084 3406 -3770 4183 -4657 5208 -5855 6633 -7579 8769
63 8769 -10313 12405 -15412 20124 -28613 48670 -198551 -18945 191732 -289851 -25113
74 -25113 120682 -275202 -187209 176069 -78910 -137192 76023 -56893 -131155 73689 -10170
85 -10170 -76332 52867 9744 -42151 58564 -10780 -35401 66649 -2195 -40591 68634
96 68634 -14369 -51939 84080 3535 -86929 62840 20805 -89145 56758 43009 -110100
107 -110100 19484 60428 -100293 -4835 81530 -74647 -26274 77290 -67901 -60465 70212
$$ packed form
0@%%%%%%%%%%Qj6J6k4L2l7M5n6P2q8J04j20J44j74K04k38K77l21L70m26M89n57
32b96O32p17Q11r15J029j154J292j444J609j788J985k201K437k696K977l282L617
49A896l987M393m836N328n878O490p176P953q840R865j1063J2488j4212J6348
63H769j9082K2718k7817L5536m8737P7283k47221J79606K10677m81583K64738
74b5113J45795l95884Q7993L63278k54979n8282K13215j32916p4262K04844q3859
85a0170o6162J29199m3123n1895J00715o9344k4621J02050o8844l8396J09225
96F8634q3003l7570J36019q0545r0464J49769m2035j09950J45903j3749j53109
107a10100J29584M0944j60721R5458Q6365j56177M8373J03564j45191P436J30677
$$ plain form
118 70212 -33576 -59386 56243 -32406 -82146 39810 -10542 -80002 24769 1087 -79741
129 -79741 3331 2811 -76218 -8523 14390 -51980 -7415 8931 -50303 -2374 21845 -37641
141 -37641 5181 34637 -32453 1620 42822 -28223 -3351 61908 -7257 -17802 47626 -6076
153 -6076 -25636 52112 11143 -44903 18384 12966 -36182 14681 14357 -49100 -15007 12156 -29705
166 -29705 -10330 5460 -38568 -22025 7657 -24190 -12920 13737 -22126 -19006 15435 -12296
178 -12296 -13760 26573 935 -19295 15363 4722 -10881 23327 14821 -15741 6446 11658 -7038
191 -7038 11852 12448 -12907 1382 9491 -8646 5146 11190 -12123 778 12728 -12550 -1291
204 -1291 21370 -6020 -7547 17993 -3810 -9902 23021 8828 -15348 7963 9117 -10405 7894
$$ packed form
118G0212j03788k5810J15629q8649m9740J21956n0352o9460J04771k3682q0828
129g9741Q3072n20p9029O7695K2913o6370M4565J6346n9234M7929K4219n9486
141c7641M2822K9456o7090L4073M1202p1045K4872O5259o9165j0545O5428n3702
153f076j9560P7748m0969n6046O3287n418m9148N0863l24o3457L4093K7163m1861
166b9705J9375J5790m4028J6543K9682l1847J1270K6657l5863L120L4441k7731
178a2296j464M0333k5638k0230L4658j0641j5603L4208q506l0562K2187N212j8696
191g038J8890N96k5355J4289Q109j8137J3792O044k3313J2901J1950k5278J1259
204a291K2661k7390j527K5540k1803o092L2923j4193k4176K3311J154j9522J8299
$$ plain form
217 7894 11890 -13861 -6654 7008 -7092 -5756 803 -10759 -8647 -1987 -11296 -8801 -2985 -10630
231 -10630 -4878 -94 -14662 -9796 6999 -1608 -4845 5893 -4882 -7549 13347 11349 -2197
244 -2197 5449 5311 -1072 10912 12575 506 3620 4016 -1660 5676 5265 -4125 1858 1230 -11345
259 -11345 -4041 4133 -7231 -5052 2337 -12337 -13514 4473 162 -9192 50 -1643 -9377 1445
273 1445 6434 -3108 -2111 4546 3078 745 1516 1854 2856 2831 3352 2749 -2910 -2226 5551 1621 -7162
290 -7162 -2438 657 -4381 209 1000 -10639 -9296 4031 2016 -4399 -3000 -5399 -5205 4891 7260
305 7260 -944 -3171 426 3422 6627 5566 1269 1777 4302 3610 5128 3844 -1068 2254 5918 -758
321 -758 -3894 327 -72 -1488 920 -2757 -8733 -4527 2289 -685 -4257 -4202 -4755 -4146 392 3356 -143
$$ packed form
217G894L996k5751P207J3662j4100J336O559j1562K112O660r309K495N816p645
231a0630N752M784j4568M866J6795q607l237J0738j0775k667K0896j998j3546
244b197P646j38o383J1984J663j2069L114L96n676P336m11r390N983o28j2575
259a1345P304Q174j1364K179P389j4674j177J7987m311r354R242j693p734J0822
273A445M989r542R97O657j468k333P71L38J002k5N21o03n659O84P777l930q783
290g162M724L095n038M590P91j1639J343J3327k015o415J399k399J94J0096K369
305G260q204k227L597K996L205j061m297N08K525o92J518j284m912L322L664o676
321g58l136M221l99j416K408l677n976M206O816k974l572N5n53O09M538K964l499
$$ plain form
338 -143 -3579 -183 2453 -109 1226 5674 2229 -1354 3097 2429 -2454 1989 5858 -824 -3039 1310
354 1310 -1432 -5030 367 745 -5092 -2429 894 -3080 -4494 -573 274 -844 1178 3006 839 249
370 249 3245 3993 2843 5077 7491 5756 3012 3401 3848 3757 5445 5638 1339 -1447 -595 77 -282 -1700
388 -1700 -3232 -3052 -4001 -5233 -4199 -5247 -6747 -3340 -1679 -4928 -4846 -16 -1028 -2834 1216 1800
404 1800 -587 4803 9005 2406 721 6176 6764 6009 9473 8179 2012 3175 7841 5153 2236 4798
420 4798 5237 1231 1863 3052 -686 -960 3877 3794 -1791 -1240 1463 -387 -69 3107 754 -1060 2515
437 2515 3222 -571 -511 1368 1730 1090 885 -1244 -2362 -1504 -755 -1430 -3526 -4551 -2926 -2981 -5499 -5164
455 -5164 -4523 -4782 -2840 -1511 -4081 -4316 -570 1212 733 681 1561 3143 4855 6680 6872 4618 4771
$$ packed form
338a43l436L396K636k562J335M448l445l583M451o68m883M443L869o682k215M349
354A310k742l598N397L78n837K663L323l974j414L921Q47j118K022J828k167n90
370B49K996P48j150K234K414j735k744L89M47r1J688J93m299k786Q52O72l59j418
388a700j532J80r49j232J034j048j500L407J661l249Q2M830j012j806M050N84
404A800k387N390M202o599j685N455N88p55L464j294o167J163M666k688k917K562
420D798M39m006O32J189l738k74M837q3n585N51K703j850L18L176k353j814L575
437B515P07l793O0J879L62o40k05k129j118Q58P49o75k096j025J625n5k518L35
455e164O41k59J942J329k570k35L746J782m79n2Q80J582J712J825J92k254J53
$$ plain form
472 4771 9112 10060 6278 6277 8365 4472 4546 8083 3449 -1056 3918 3232 -3076 -1645 -101 -4743 -3767
489 -3767 -1711 -6548 -8040 -3448 -3137 -5669 -5608 -4764 -4291 -2434 -962 -1350 -2122 -2054 1129 2534 -315
506 -315 753 3777 1817 1843 3755 774 319 4914 4019 -205 152 1128 605 2325 2158 -1558 -752 829
524 829 853 1822 330 -2400 1406 3682 -13 919 2249 -861 1222 5062 16 -2321 2021 1334 -1415
541 -1415 299 -1693 -5013 -2131 -1018 -3797 -5078 -5544 -5692 -4345 -5148 -5965 -4787 -5911 -5206 -2080
557 -2080 -4049 -4607 -85 -207 -2238 1685 2784 -45 2907 6029 2218 3221 7306 5231 3682 5210
573 5210 3160 3148 5603 3601 1311 1023 -629 140 1543 -1935 -3480 -1275 -3422 -4623 -2539 -4184
589 -4184 -6320 -2102 -1509 -5457 -3956 -2023 -2737 -879 -312 -2577 -1856 142 600 1727 373 -1723
$$ packed form
472D771M341R48l782jK088l893P4L537m634m505M974o86o308J431J544m642R76
489c767K056m837j492M592L11k532O1Q44M73J857J472l88p72O8L183J405k849
506c15J068L024j960K6J912k981m55M595q95m224L57R76n23J720j67l716Q06J581
524H29K4R69j492k730L806K276l695R32J330l110K083L840n046k337M342o87k749
541a415J714j992l320K882J113k779j281m66j48J347q03q17J178j124P05L126
557b080j969n58M522j22k031L923J099k829K952L122l811J003M085k075j549J528
573E210k050j2K455k002k290k88j652P69J403l478j545K205k147j201K084j645
589d184k136M218N93l948J501J933p14J858N67k265P21J998M58J127j354k096
$$ plain form
605 -1723 994 2024 -804 741 1349 -2523 113 2672 -2710 -3433 2078 -323 -2952 460 -1125 -4032
621 -4032 1070 3197 -2275 -1103 1466 114 1341 3087 638 -270 2519 3181 1756 418 -16 1513
637 1513 2086 283 -935 -1635 -2480 -873 -328 -4132 -5114 -2888 -3181 -3622 -3210 -5270 -5308 -1940 -1670 -3103
655 -3103 -2756 -2356 -920 1694 1139 -701 1552 3257 2683 5174 4316 1325 3485 6656 3855 2838
671 2838 4891 2764 1511 3851 2346 -916 727 2060 -732 -2051 -1159 -1657 -2117 -1431 -2062 -3574
687 -3574 -3509 -1083 -751 -2708 -2576 -1007 -1508 -1036 1207 -664 -2154 1371 2355 -1022 -334 973 -36
704 -36 345 1558 -886 -2472 210 901 -1246 -1203 -1576 -2103 -642 -84 -1336 -2047 -1119 295 969 102
722 102 -425 416 1577 2456 1995 1701 1705 2347 3190 2795 1768 1154 2550 2959 1319 246 363 42 317
$$ packed form
605a723K717J030k828J545O08l872K636K559n382p23N511k401k629L412j585k907
621d032N102K127n472J172K569j352J227J746k449r08K789O62j425j338m34J529
637A513N73j803j218p00q45J607N45l804r82K226k93m41M12k060l8L368K70j433
655c103L47M00J436K614n55j840K253J705n74K491q58k991K160L171k801j017
671B838K053k127j253K340j505l262J643J333k792j319Q92m98m60O86o31j512
687c574O5K426L32j957J32J569n01M72K243j871j490L525R84l377O88J307j009
704c6L81J213k444j586K682O91k147M3l73n27J461N58j252p11R28J414O74q67
722A02n27Q41J161Q79m61k94MO42Q43l95j027o14J396M09j640j073J17l21K75
$$ plain form
741 317 965 -1663 -3629 -1539 -542 -2428 -2819 -2243 -3291 -2889 -547 -1669 -3968 -1334 543 -972 -592
758 -592 986 -74 370 3230 1714 120 1390 3059 2090 1048 1371 643 692 1938 1530 -1213 -1639
775 -1639 83 -220 -956 -1187 -1636 -2146 -1129 -687 -1695 -2059 -336 9 -464 -383 -535 179 1818 2134 1081
794 1081 863 1319 2110 2543 2082 396 467 1872 1298 254 -113 -1131 -1042 633 -629 -3131 -2527 -1603
812 -1603 -1941 -2078 -1927 -2746 -2801 -621 -321 -2289 -1937 109 481 436 812 570 331 1421 3288 1402 542
831 542 2131 2549 1114 1429 1205 -606 379 1721 116 -2020 -886 -198 -1037 -942 -883 -1911 -1026 158
849 158 -765 -1714 -798 592 1227 876 -15 31 664 2294 2387 1066 318 1145 1938 1652 549 -305 -233 429
869 429 578 -613 -2191 -2361 -1641 -963 -1884 -3019 -2492 -1692 -1332 -929 -1384 -2438 -611 1489 660 -254
$$ packed form
741C17O48k628j966K090R97j886l91N76j048M02K342j122k299K634J877j515L80
758e92J578j060M44K860j516j594J270J669r69j042L23p28M9J246m08k743m26
775a639J722l03p36k31m49n10J017M42j008l64J723L45m73Q1j52P14J639L16j053
794A081k18M56P91M33m61j686P1J405n74j044l67j018Q9J675j262k502O04R24
812a603l38j37J51q19n5K180L00j968L52K046L72m5L76k42k39J090J867j886q60
831E42J589M18j435L15k24j811R85J342j605k136J134O88q39R5N9j028Q85J184
849A58r23r49R16J390O35l51q91M6O33J630R3j321p48Q27P93k86j103q54P2O62
869D29J49j191j578j70P20O78r21j135N27Q00L60M03m55j054J827K100q29r14
$$ plain form
887 -254 808 1353 1864 2895 3156 1483 2030 3827 3416 1893 2284 2429 1865 1838 1569 183 -410 788
905 788 384 -1342 -1753 -1094 -1493 -1343 -1184 -1985 -2195 -1150 -417 -1190 -1331 -323 -260 530 1039 133 256 1470
925 1470 1886 1606 954 780 1372 1941 1524 637 -286 230 764 667 -162 -1045 -887 232 240 -665 -933 -275 302
946 302 692 1127 200 121 1698 2554 1395 1130 1943 1683 2524 3207 1683 479 1939 2447 1184 395 431
965 431 -242 -306 353 -764 -2582 -1863 -761 -1227 -2423 -2149 -2205 -1776 -409 -822 -1626 -1258 595 971 688
984 688 1070 1199 1548 2599 2789 1769 1882 2809 2976 2604 2076 1527 1757 2231 1675 454 57 -84 178
1003 178 120 -671 -1478 -1315 -926 -1193 -1211 -1548 -1271 -746 -289 -574 -1187 -394 728 788 120 528 402 464 1325
1024 1325 1531 -153 -319 1295 922 -332 214 -342 -727 205 446 -1519 -1357 -379 -340 -648 -531 -640 -414
$$ packed form
887b54J062N45N11J031K61j673N47J797m11j523L91J45n64k7k69j386n93J198
905G88m04j726m11O59l99J50J59q01k10J045P33p73j41J008O3P90N09r06J23J214
925A470M16k80o52j74N92N69m17q87r23N16N34r7q29q83J58J119Qr05k68O58N77
946C02L90M35r27p9J577Q56j159k65Q13k60Q41O83j524j204J460N08j263p89L6
965D31o73o4O59j117j818P19J102m66j196K74n6M29J367m13q04L68J853L76k83
984F88L82J29L49J051J90j020J13R27J67l72n28n49K30M74n56j221l97j41K62
1003A78n8p91q07J63L89k67j8l37K77N25M57k85o13P93J122O0o68M08j26O2Q61
1024A325K06j684j66J614l73j254N46n56l85R32K41j965J62R78L9l08J17j09K26
$$ plain form
1043 -414 493 983 189 57 966 1799 1877 1819 1651 1276 1931 2763 2047 603 1138 1451 1221 783 397 -662
1063 -662 -703 3 -1165 -2089 -1874 -1819 -2103 -1891 -2632 -3323 -2226 -1670 -1810 -1749 -1586 -1626 -315 524 -275 -263 673
1084 673 1364 1398 1563 1196 1252 1761 2421 1855 534 1273 1526 1407 789 616 -463 -155 753 112 -1330 -1242
1104 -1242 -305 -847 -491 -663 -1756 -1565 270 -128 -1065 -679 -57 90 552 298 -378 -313 892 537 195
1123 195 -64 -402 -74 -57 -508 -980 -1296 -927 -365 -1090 -1927 -1566 -1254 -1113 -814 -1213 -1159 -438 218 -101 233
1144 233 250 641 1605 1855 1088 875 1698 1959 2036 2326 902 903 1857 1477 -114 -145 0 -352 -169 -221 -1968
1165 -1968 -1956 -1249 -1334 -2027 -2316 -2153 -1872 -1200 -849 -1499 -1872 -677 358 99 -609 -49 487 943 1728 1257
1185 1257 432 715 1718 1205 874 739 429 486 808 494 -746 -605 237 -199 -616 -851 -1476 -817 -139
$$ packed form
1043d14R07M90p94j32R09Q33P8n8j68l75O55Q32p16j444N35L13k30m38l86j059
1063f62m1P06j168r24K15N5k84K12p41o91J097N56j40O1J63m0J311Q39p99J2R36
1084F73O91L4J65l67N6N09O60n66j321P39K53j19o18j73j079L08R08o41j442Q8
1104a242R37n42L56j72j093J91J835l98r37L86O22J47M62k54o76O5J205l55l42
1123A95k59l38L28J7m51m72l16L69N62p25q37L61L12J41K99l99N4P21O56l19L34
1144B33J7L91R64K50p67k13Q23K61P7K90j424JR54l80j591l1J45l52J83n2j747
1165a968J2P07q5o93k89J63K81O72L51o50l73J195J035k59p08N60N36M56P85m71
1185A257q25K83J003n13l31j35l10N7L22l14j240J41Q42m36m17k35o25O59O78
$$ plain form
1204 -139 -405 -1188 -566 -73 391 359 254 75 916 1430 1045 988 1018 883 1633 1556 278 174 466 950 223
1225 223 -222 -239 -1217 -532 -286 -1099 -1826 -1359 -957 -884 -1037 -1322 -1390 -695 41 -5 -532 -421 895 1134 986
1246 986 1224 822 1087 1577 1972 915 931 1410 1144 512 835 -165 -646 96 327 -736 -862 -1144 -1221 -207
1266 -207 -782 -1616 -1166 -460 -730 -470 -592 -588 -8 929 465 218 690 1043 1390 1402 796 393 994 1234 1109
1287 1109 455 -166 -27 231 -149 -944 -919 -1082 -1102 -418 -1377 -2262 -1397 -627 -1109 -767 -849 -1191 -147 1074
1307 1074 -9 -145 828 952 1073 1928 854 466 1707 1781 1248 846 655 581 720 786 15 -776 -530 -349
1327 -349 -566 -799 -1489 -1517 -886 -813 -1217 -1375 -991 -608 -262 -180 -468 -297 276 656 380 426 456 1166 1125 826
1349 826 867 223 378 1099 328 -457 -281 -194 -449 -315 -665 -1636 -773 -242 -668 -1337 -831 -644 -140 517 237
$$ packed form
1204a39k66p83O22M93M64l2j05j79Q41N14l85n7L0j35P50p7j278j04K92M84p27
1225B23m45j7r78O85K46q13p27M67M02P3j53k85o8O95P36m6n27J11J316K39j48
1246I86K38m02K65M90L95j057J6M79k66o32L23j000m81P42K31j063j26k82p7J014
1266b07n75q34M50P06k70K60j22MN80R37m64k47M72L53L47J2o06m03O01K40j25
1287A109o54o21J39K58l80p95K5j63k0O84r59q85Q65P70m82L42q2l42J044J221
1307A074j083j36R73J24J21Q55j074l88J241P4n33m02j91p4J39O6p71p91K46J81
1327c49k17k33o90k8O31P3m04j58L84L83L46Q2k88J71N73L80k76M6L0P10m1k99
1349H26M1o44J55P21p71p85J76Q7k55J34l50r71Q63N31m26o69N06J87N04O57k80
$$ plain form
1370 237 -359 426 1297 1336 910 965 1114 1274 1608 1431 744 689 1209 1247 866 55 -206 -355 -219 -373 -1213
1391 -1213 -1818 -1422 -884 -1732 -1447 -1385 -1864 -1051 -437 -874 -1222 -284 191 216 709 323 715 1354 1695 1191
1411 1191 1155 1350 1420 1634 1539 630 746 1200 862 631 127 -90 -290 123 -235 -1050 -1300 -473 89 -685 -635
1432 -635 -776 -387 -14 450 50 -75 429 1118 503 403 427 608 863 1454 419 -231 -50 670 -77 -92
1452 -92 -267 -620 -944 29 -785 -1083 -997 -654 -561 -491 -765 -781 -164 303 394 402 531 1063 1603 1418 1507 1351 1663
1475 1663 1782 2073 1735 1093 1264 1517 1132 805 34 -102 87 -149 -584 -1114 -1181 -1308 -797 -1247 -1850 -1528
1495 -1528 -1303 -753 -920 -866 -1047 -439 449 446 -18 346 689 746 1025 1118 705 756 1354 1340 827 495 353 910
1517 910 517 -60 -234 -377 65 186 -377 -926 -497 -298 -292 -162 -249 -485 139 649 228 142 367 586 895
$$ packed form
1370B37n96P85Q71L9m26N5J49J60L34j77o87n5N20L8l81q11k61j49J36j54q40
1391a213o05L96N38q48K85O2m79Q13O14m37l48R38M75K5M93l86L92O39L41n04
1411A191l6J95P0K14r5r09J16M54l38k31n04k17k00M13l58q15k50Q27N62p74N0
1432f35j41L89L73M64m00j25N04O89o15j00K4J81K55N91j035o50J81P20p47j5
1452i2j75l53l24R73q14k98Q6L43R3P0k74j6O17M67R1QJ29N32N40j85Q9j56L12
1475A663J19K91l38o42J71K53l85l27p71j36J89k36m35n30o7j27N11m50o03L22
1495a528K25N50j67N4j81O08Q88lm64L64L43N7K79R3m13N1N98j4n13l32j42N57
1517I10l93n77j74j43M42J21n63n49M29J99OJ30q7k36O24N10m21q6K25K19L09
$$ plain form
1538 895 906 665 416 473 1018 725 75 -222 -179 216 -87 -728 -994 -1023 -622 -757 -1412 -1605 -1397 -1076 -615
1559 -615 -1028 -1335 -1061 -367 108 -82 95 -68 564 1063 1450 594 1008 1468 1341 1422 1404 693 842 1334 748
1580 748 94 95 -235 -321 -121 -1009 -1263 -1232 -822 -723 -1122 -1326 -1355 -1045 -752 -913 -1109 -837 -505 188 148 -66
1602 -66 257 171 681 926 510 304 778 819 351 333 -200 41 261 -48 -753 -1028 -618 -650 -658 -745 -1268 -961 -356
1625 -356 -149 -706 -293 -200 31 494 622 -116 348 1118 1081 989 909 257 624 999 979 111 131 -170 141 -115
1647 -115 -949 -815 -680 -657 -740 -1021 -1490 -1224 -1231 -741 -938 -829 -1016 -134 384 -105 -223 17 454 1146 881
1668 881 878 684 1120 1198 1120 836 684 793 830 455 -238 -474 -148 67 -450 -765 -1056 -738 -641 -807 -682 -986
1690 -986 -865 -543 351 -294 -270 67 317 579 593 163 638 1324 884 839 618 552 559 882 433 -108 -34 59 38
$$ packed form
1538H95J1k41k49N7N45k93o50k97M3L95l03o41k66k9M01j35o55j93K08L21M61
1559f15m13l07K74O94M75j90J77j63O32M99L87q56M14M60j27Q1j8p11J49M92n86
1580G48o54Jl30q6K00q88k54L1M10R9l99k04k9L10K93j61j96K72L32O93m0k14
1602f6L23q6N10K45m16k06M74M1m68j8n33K41K20l09p05k75M10l2qq7n23L07O05
1625c56K07n57M13R3K31M63J28p38M64P70l7r2q0o52L67L75k0q68K0l01L11k56
1647a15q34J34J35K3q3k81m69K66pM90j97J09j87Q82N18m89j18K40M37O92k65
1668H81lj94M36P8p8k84j52J09L7l75o93k36L26K15n17l15k91L18R7j66J25l04
1690i86J21L22Q94o45K4L37K50K62J4m30M75O86m40m5k21o6PL23m49n41P4R3k1
$$ plain form
1713 38 -146 -816 -923 -697 -371 -383 -1062 -804 -404 -78 -396 -395 -456 -326 556 746 269 452 937 1042 1048 1303
1735 1303 864 700 1267 1177 671 391 583 74 277 66 -464 -499 -140 -328 -780 -1085 -1037 -812 -440 -405 -671
1756 -671 -593 -316 242 511 273 136 587 996 989 889 319 714 1106 970 606 275 217 564 476 13 -651 -203
1778 -203 -34 -619 -700 -830 -1263 -660 -319 -788 -974 -823 -357 88 33 120 -29 424 1071 785 649 760 1018
1799 1018 966 1277 1081 462 569 923 401 171 -347 -190 -85 -382 -453 -920 -1206 -878 -455 -903 -1053 -974 -624
1820 -624 -684 -460 -726 -476 68 367 147 341 396 503 1059 996 536 463 675 650 935 498 123 213 387 115
1842 115 -52 -402 -272 -337 -210 -463 -671 -851 -417 110 -393 -572 -317 -105 381 358 59 167 275 883 961
1863 961 719 524 544 799 439 285 88 -16 215 -256 -485 -629 -828 -606 -517 -863 -1064 -977 -709 -557 -755
$$ packed form
1713C8j84o70j07K26L26j2o79K58M00L26l18Jo1J30Q82J90m77J83M85J05OK55
1735A303m39j64N67r0n06k80J92n09K03k11n30l5L59j88m52l05M8K25L72L5k66
1756f71P8K77N58K69k38j37M51M09pj00n70L95L92j36l64l31n8L47q8m63o64M48
1778b03J69n85q1j30m33O03L41m69j86J51M66M45n5Q7j49M53O47k86j36J11K58
1799A018n2L11j96o19J07L54n22k30n18J57J05k97p1m67k86L28M23m48j50P9L50
1820f24o0K24k66K50N44K99k20J94N5J07N56o3m60p3K12k5K85m37l75R0J74k72
1842A15j67l50J30o5J27k53k08j80M34N27n03j79K55K12M86k3k99J08J08O08P8
1863I61k42j95K0K55l60j54j97j04K31m71k29j44j99K22Q9l46k01Q7K68J52j98
$$ plain form
1884 -755 -680 -547 -29 163 195 157 123 826 973 1183 718 826 975 1073 1019 809 727 660 702 694 324 -235 -324 308
1908 308 -134 -453 -786 -742 -770 -457 -541 -926 -817 -181 -278 -405 -240 -208 176 198 406 160 249 772 786 740 572
1931 572 365 549 741 555 -58 37 96 311 -62 -269 -444 -469 -271 -74 -458 -356 -171 42 289 -1 65
1952 65 372 322 847 731 514 607 843 825 1085 643 391 842 841 762 362 -22 -68 54 -94 -376 -760 -713 -524
1975 -524 -892 -835 -1115 -775 -548 -676 -757 -577 -400 -115 47 291 206 276 986 953 828 727 813 1099 1120 954
1997 954 796 699 555 798 429 95 -67 -178 141 -104 -510 -908 -523 -214 -415 -736 -543 -507 -69 -45 -382
2018 -382 -120 -39 530 364 317 418 163 768 964 467 540 303 469 742 190 -178 -153 -222 -70 -326 -647 -477
2040 -477 -688 -477 -257 -600 -324 -284 -139 224 -376 -171 6 606 575 746 398 281 985 808 674 592 667
$$ packed form
1884g55P5J33N18J92L2l8l4P03J47K10m65J08J49R8n4k10q2o7M2ql70n59q9O32
1908C08m42l19l33M4k8L13q4l85J09O36r7j27J65L2L84K2K08k46Q9N23J4m6j68
1931E72k07J84J92j86o13R5N9K15l73k07j75k5J98J97l84J02J85K13K47k90O6
1952F5L07n0N25j16k17R3K36j8K60m42k52M51jp9m00l84m6J22j48k82l84M7J89
1975e24l68N7k80L40K27j28q1J80J77K85J62K44q5P0P10l3j25j01Q6K86K1j66
1997I54j58r7j44K43l69l34j62j11L19k45m06l98L85L09k01l21J93L6M38K4l37
2018c82K62Q1N69j66m7J01k55O05J96m97P3k37J66K73n52l68K5o9J52k56l21J70
2040d77k11K11K20l43K76M0J45L63o00K05J77O00l1J71l48j17P04j77j34q2P5
$$ plain form
2061 667 878 669 510 -110 -191 203 -74 -297 -814 -680 -614 -616 -723 -1051 -819 -768 -815 -611 -540 -545 -372 335 -24
2084 -24 -115 -6 524 732 701 487 393 734 772 613 599 286 68 273 144 -126 -174 -451 -233 -300 -484 -451 -443 -635
2108 -635 -406 -318 -496 -539 -529 30 -169 -346 -184 -77 297 524 467 287 774 695 331 455 371 413 190 246 -217
2131 -217 -467 -80 -601 -381 -329 -791 -699 -467 -298 -526 -809 -750 -191 -80 -126 -2 117 435 531 483 344 550
2153 550 827 1009 919 770 702 303 776 275 476 374 232 -111 -198 -333 -828 -616 -536 -561 -564 -696 -717 -605 -437
2176 -437 -113 -660 -236 176 324 242 393 362 495 848 941 459 567 638 639 666 9 360 9 -26 50 -181 -556
2199 -556 -465 -261 -751 -401 -503 -432 -411 -238 -292 -544 -46 148 454 263 206 247 632 1020 581 576 697 599 534
2222 534 619 372 54 447 263 287 -74 -415 -261 -324 -320 -571 -574 -726 -221 -297 -448 -428 -502 -277 -46 -75 2 -121
$$ packed form
2061F67K11k09j59o20q1L94k77k23n17J34O6kj07l28K32N1m7K04P1nJ73P07l59
2084b4r1J09N30K08l1k14r4L41L8j59j4l13k18K05j29k70m8k77K18o7j84L3Qj92
2108f35K29Q8j78m3J0N59j99j77J62J07L74K27n7j80M87p9l64J24q4M2k23N6m63
2131b17k50L87n21K20N2m62R2K32J69k28k83N9N59J11m6J24J19L18R6m8j39K06
2153E50K77J82r0j49o8l99M73n01K01j02j42l43q7j35m95K12Q0k5lj32k1J12J68
2176d37L24n47M24M12J48q2J51l1J33L53R3m82J08P1JK7o57L51l51l5P6k31l75
2199e56R1K04m90L50j02P1K1J73n4k52M98J94L06j91n7M1L85L88m39nJ21r8o5
2222E34Q5k47l18L93j84K4l61l41J54o3Mk51lj52N05p6j51K0p4K25K31k9P7j23
$$ plain form
2246 -121 216 369 417 438 503 796 823 578 462 657 497 508 352 102 -2 -301 -58 -79 -521 -418 -662 -404
2268 -404 -350 -596 -581 -273 -96 -106 -181 -209 218 126 491 656 136 445 515 732 714 650 322 513 561 337 -66
2291 -66 -82 -174 -127 -322 -420 -503 -578 -492 -344 -828 -695 -724 -462 -294 -248 -247 -362 -324 156 304 114 335 602 478
2315 478 569 476 580 862 602 493 252 283 280 174 -55 -261 -200 -494 -399 -280 -600 -745 -816 -460 -408 -367 -525
2338 -525 -110 -81 -140 -12 -27 -21 -58 275 281 341 370 638 666 224 291 117 432 184 41 132 -330 -226 -120 -165 -463
2363 -463 -505 -247 -513 -527 -732 -664 -293 76 85 50 -184 193 351 449 383 246 520 458 892 560 197 183 753
2386 753 358 140 27 -224 -295 -274 -332 -652 -506 -620 -603 -637 -563 -654 -761 -679 -456 -458 -163 -233 26 52 281 291
2410 291 199 580 252 426 450 413 351 123 304 80 -6 353 -50 -143 -118 -356 -202 20 -268 -656 -680 -198 -303
$$ packed form
2246a21L37J53M8K1O5K93K7k45j16J95j60J1j56k50j04k99K43k1m42J03k44K58
2268d04N4k46J5L08J77j0p5k8M27r2L65J65n20L09P0K17j8o4l28J91M8k24m03
2291f6j6r2M7j95r8q3p5Q6J48m84J33k9K62J68M6Jj15L8M80J48j90K21K67j24
2315D78R1r3J04K82k60j09k41L1lj06k29k06O1k94R5J19l20j45p1L56N2M1j58
2338e25M15K9n9J28j5Ol7L33OO0K9K68K8m42O7j74L15k48j43R1m62J04J06m5k98
2363d63m2K58k66j4k05O8L71L69Rl5k34L77J58R8o6j37K74o2M34l32l63j4N70
2386G53l95k18j13k51p1K1n8l20J46j14J7l4P4r1j07Q2K23kK95p0K59K6K29J0
2410B91r2L81l28J74K4l7o2k28J81k24q6L59m03r3K5k38J54K22k88l88k4M82j05
$$ plain form
2433 -303 -371 -559 -209 -216 -79 143 -110 101 394 404 394 428 553 255 518 224 317 -81 162 139 20 -231 -131
2456 -131 -309 -336 -345 -395 -704 -627 -241 -204 -254 -521 -109 -154 348 75 -297 209 392 539 644 410 307 485 603
2479 603 298 438 646 430 497 493 93 -331 -149 -97 -157 -430 -555 -480 -377 -464 -607 -551 -619 -345 -235 -100 -211
2502 -211 259 226 176 381 141 292 284 544 568 396 571 458 495 424 61 36 -74 267 45 -139 -436 -245 -245
2525 -245 -252 -569 -472 -266 -297 -56 -60 9 -117 99 -11 274 -33 416 451 491 511 232 221 519 749 522 499 -13
2549 -13 190 181 -121 -217 -412 -285 -442 -151 -427 -649 -530 -305 -253 -168 -165 -287 71 51 112 355 181 546 623 628
2573 628 284 532 755 691 479 291 210 325 483 217 -48 -144 -172 43 -306 -511 -628 -290 -368 -250 -599 -798
2595 -798 -405 -345 -16 -60 -109 -63 293 211 337 230 245 592 558 569 329 174 154 262 -71 69 -122 15 -139
$$ packed form
2433c03o8j88L50pJ37K22k53K11K93J0j0L4J25k98K63k94R3l98K43k3j19k51J00
2456a31j78k7rn0l09P7L86L7n0k67M12m5N02k73l72N06J83J47J05k34j03J78J18
2479F03l05J40K08k16O7mm00m24J82N2o0k73j25P5J03q7j43N6o8K74J10J35j11
2502b11M70l3n0K05k40J51qK60K4j72J75j13L7p1l63k5j10L41k22j84k97J91%
2525b45pl17R7K06l1K41mO9j26K16j10K85l07M49L5M0K0k79j1K98K30k27k3n12
2549a3K03rl02r6j95J27j57K91k76k22J19K25N2Q5Lj22L58k0O1K43j74L65P7N
2573F28l44K48K23o4k12j88q1J15J58k66k65r6k8K15l49k05j17L38p8J18l49j99
2595g98L93O0L29m4m9M6L56q2J26j07J5L47l4J1k40j55k0J08l33J40j91J37j54
$$ plain form
2618 -139 7 -714 -566 -467 -340 -415 -685 -510 -545 -246 -160 -182 -242 64 21 231 200 93 500 386 491 254 398
2641 398 472 352 435 93 26 90 -40 88 -107 -244 -503 -205 -187 -505 -475 -736 -454 -202 -215 -402 -172 -494
2663 -494 46 137 158 -36 212 479 505 403 397 359 537 488 214 304 192 251 244 295 -571 -368 -12 -137 -297 -328
2687 -328 -521 -197 -228 -299 -391 -557 -181 -162 39 85 -128 189 431 379 289 354 204 597 607 74 233 383 345
2710 345 -3 12 -93 40 -250 99 -33 -486 -412 -336 -173 -286 -486 -368 -366 -222 -367 -416 -268 249 477 301
2732 301 267 292 557 483 473 629 356 596 465 404 254 118 210 131 226 50 -591 -328 -518 -295 -372 -430 -481 -259
2756 -259 19 -129 -194 -259 -71 -10 131 -67 241 41 316 521 184 321 423 468 172 168 260 126 57 64 -123
2779 -123 -20 -135 -134 -282 -287 -381 -440 -377 -291 -368 -492 -233 -302 114 153 5 168 483 427 315 410 331 308 648 549
$$ packed form
2618a39J46p21J48R9J27p5k70J75l5K99Q6k2o0L06m3K10l1j07M07j14J05k37J44
2641C98P4j20Q3l42o7O4j30J28j95j37k59K98J8l18L0k61K82K52j3j87K30l22
2663d94N40R1K1j94K48K67K6j02ol8J78m9k74R0j12N9pN1q66K03L56j25j60l1
2687c28j93L24l1p1r2j66L76J9K01M6k13L17K42n2r0O5j50L93J0n33J59J50l8
2710C45l48J5j05J33k90L49j32m53P4P6J63j13k00J18KJ44j45m9J48N17K28j76
2732C01l4K5K65p4j0J56k73K40j31o1j50j36R2p9R5j76o41K63j90K23p7n8n1K22
2756b59K78j48o5o5J88O1J41j98L08k00K75K05l37J37J02M5k96mR2j34o9Pj87
2779a23J03j15Jj48nr4n9O3Q6p7j24K59o9M16L9j48J63L15n6j12R5p9k3L40r9
$$ plain form
2804 549 434 160 420 297 197 -76 -174 -103 -66 -214 -170 -602 -535 -213 -438 -214 -365 -367 32 -75 104 -181
2826 -181 11 342 97 317 286 294 334 640 309 262 547 342 227 177 67 -133 -262 130 33 -279 -264 -401 -242
2849 -242 -533 -322 -516 -302 -325 -251 -235 -62 -145 13 -141 130 236 128 402 410 285 354 261 20 411 318 197
2872 197 -109 -5 -13 9 -193 -443 -541 -291 -204 -259 -333 -456 -435 -201 -323 -273 -86 -119 2 123 137 423 508 418
2896 418 297 368 289 727 521 124 493 151 134 234 122 31 -157 -306 212 -21 -344 -499 -414 -42 -370 -407
2918 -407 -364 -167 -380 -112 -279 -48 182 416 375 255 239 112 341 511 461 309 101 275 164 -4 -104
2939 -104 -26 -131 99 -226 -352 -379 -352 -48 -181 -186 -330 -54 68 -340 -245 17 76 322 312 255 501 200 367
2962 367 529 365 203 367 296 143 170 92 -249 -329 -156 -350 -617 -371 -360 -226 -248 -455 -607 -340 -314 -75
$$ packed form
2804E49j15k74K60j23j00k73r8P1L7j48M4m32O7L22k25K24j51kL99j07J79k85
2826a81J92L31k45K20l1QM0L06l31m7K85k05j15n0j10k00j29L92r7l12J5j37J59
2849b42k91K11j94K14k3P4J6J73q3J58j54K71J06j08K74Qj25O9r3k41L91r3j21
2872A97l06J04qK2k02k50r8K50Q7n5p4j23K1K34j22N0J87l3J21J21J4K86Q5r0
2896D18j21P1p9M38k06l97L69l42j7J00j12r1j88j49N18k33l23j55Q5L72l28l7
2918d07M3J97k13K68j67K31K30K34m1j20j6j27K29J70n0j52k08J74j11j68j00
2939a04P8j05K30l25j26k7K7L04j33nj44K76J22m08R5K62N9K46j0n7K46l01J67
2962C67J62j64j62J64p1j53K7p8l41q0J73j94k67K46J1J34k2k07j52K67K6K39
$$ plain form
2984 -75 -244 -185 -124 -184 101 71 163 97 55 374 397 283 144 62 356 241 119 31 -20 100 -34 70 -297 -141
3008 -141 70 -473 -483 -491 -253 -54 -339 -376 -219 -43 25 210 -140 24 56 277 22 207 317 420 241 283
3030 283 213 235 347 102 -196 -42 -272 -263 -74 -131 -347 -197 -188 -367 -43 4 -172 -352 -124 106 115 -81 7 266
3054 266 164 342 245 -16 422 481 245 6 377 -53 56 343 193 65 -232 -47 42 -125 -343 -456 -275
3075 -275 -588 -146 -254 -678 -91 -234 84 -238 -220 -64 22 17 215 102 293 448 313 269 237 385 410 166
3097 166 18 -51 106 201 -92 -113 -225 -156 -228 -391 -285 -374 -271 -110 -265 -186 -348 -528 121 107 -84 165 60
3120 60 259 213 430 243 -53 314 381 286 -88 354 45 63 299 -33 -275 -494 -332 -186 -194 -209 -392 -205 -194
3143 -194 -456 -301 -167 -133 -142 -222 57 -89 71 385 197 350 365 446 268 309 147 355 182 322 48 125 -197
$$ packed form
2984g5j69N9O1o0K85l0R2o6m2L19K3j14j39q2K94j15j22q8n1J20j34J04l67J56
3008a41K11n43j0qK38J99k85l7J57J76O8J85l50J64L2K21k55J85J10J03j79M2
3030B83p0K2J12k45k98J54k30RJ89n7k16J50Rj79L24M7j76j80K28K30Rj96Q8K59
3054B66j02J78r7k61M38N9k36k39L71m30J09K87j50j28k97J85Q9j67k18j13J81
3075b75l13M42j08m24N87j43L18l22J8J56Q6nJ98j13J91J55j35m4l2J48K5k44
3097A66j48o9J57R5k93k1j12O9p2j63J06q9J03J61j55P9j62j80O49j4j91K49j05
3120F0J99m6K17j87k96L67O7r5l74M42l09J8K36l32k42k19J62J46qj5j83J87J1
3143a94k62J55J34L4rq0K79j46J60L14j88J53J5Q1j78M1j62K08j73J40k74P7l22
$$ plain form
3166 -197 84 -235 -204 -469 -187 -187 -293 -318 -313 -321 -388 -242 -85 5 -191 27 278 476 238 304 249 140 168 395
3190 395 172 99 399 484 98 -8 41 169 -11 -107 -59 -305 -169 -327 -152 -193 -361 -303 -219 -93 -97 19 -258
3213 -258 193 219 164 87 272 164 160 315 165 247 219 261 67 183 178 -39 72 23 -347 -110 -261 -325 -79 -356
3237 -356 -292 -422 -35 -83 -208 -149 -112 29 -54 -37 91 185 206 282 348 132 514 516 263 274 492 392 180 213 140
3262 140 -166 27 -31 -175 -2 -359 -425 -248 -46 -313 -143 -93 82 -210 108 84 34 -2 20 360 343 182 362
3285 362 258 217 117 7 289 -136 87 229 -75 -192 311 -25 23 -212 -246 -195 -159 -44 -119 -301 -353 -107
3307 -107 67 -84 122 -83 -209 40 363 105 537 550 260 61 -51 82 473 162 133 137 -99 116 -117
3328 -117 111 -42 -196 -21 -288 -121 -340 -149 -360 -198 -423 -192 -133 -111 1 217 -54 120 142 -14 331
$$ packed form
3166a97K81l19L1k65K82%j06k5Nqo7J46J57R0j96K18K51J98k38O6n5j09K8K27
3190C95k23p3L00Q5l86j06M9J28j80r6M8k46J36j58J75m1j68N8Q4J26mJ16k77
3213b58M51K6n5p7J85j08mJ55j50Q2k8M2j94J16nk17J11m9l70K37j51o4K46k77
3237c56O4j30L87m8j25N9L7J41q3J7J28R4K1P6O6k16L82Kk53J1K18j00k12L3p3
3262A40l06J93n8j44J73l57o6J77K02k67J70N0J75k92L18k4n0l6K2L40j7j61J80
3285C62j04m1j00j10K82m25K23J42l04j17N03l36M8k35l4N1L6J15p5j82n2K46
3307a07J74j51K06k05j26K49L23k58M32J3k90j99j12J33L91l11k9Mk36K15k33
3328a17K28j53j54J75k67J67k19J91k11J62k25K31N9K2J12K16k71J74K2j56L45
$$ plain form
3349 331 103 263 273 256 135 204 49 182 1 -186 225 -73 -175 100 42 -136 -248 -475 -225 -129 -388 -244
3371 -244 -25 -78 -5 -235 0 -345 32 330 357 187 190 268 324 662 193 30 -16 -26 142 -92 -75 133 -7
3394 -7 -194 31 -454 -405 -135 -127 -438 -40 -140 -233 -108 -185 -249 83 317 -81 248 148 189 282 237 161 62 294
3418 294 243 101 102 333 187 337 -138 75 -339 -324 -142 -211 -235 -233 -300 -287 -208 -361 182 -52 -229 -189 272 0
3442 0 -99 154 187 155 167 239 255 171 -2 124 51 124 -253 10 -23 144 -148 -46 -362 -426 42 -515 -7 -459
3466 -459 -270 -117 -180 -151 -80 60 -124 73 -13 13 240 119 261 146 217 254 315 59 51 280 40 39 78 -124
3490 -124 -221 57 -65 -191 -15 -266 -241 -314 -351 -333 31 -94 70 -196 -37 120 27 153 94 130 112 302 241
3513 241 210 241 323 135 78 -52 103 -106 7 -19 6 0 -127 -316 -63 -461 -112 -241 -160 -210 -90 -245 -144
$$ packed form
3349C31k28J60J0j7j21O9j55J33j81j87M11k98j02K75n8j78j12k27K50R6k59J44
3371b44K19n3P3k30K35l45L77K98K7j70LP8N6L38m69j63m6j0J68k34J7K08j40
3394gj87K25m85M9K70Ql11L98j00r3J25p7o4L32K34l98L29j00M1R3m5p6r9K32
3418B94n1j42JK31j46J50m75K13m14J5J82o9k4Ko7J3P9j53N43k34j77M0M61k72
3442@r9K53L3l2J2P2J6q4j73J26p3P3l77K63l3J67k92J02l16o4M68n57N08m52
3466d59J89J53o3K9P1J40j84J97q6K6K27j21J42j15P1L7O1k56qK29k40jL9k02
3490a24r7K78j22j26J76k51K5p3l7J8L64j25J64k66J59J57r3J26n9L6j8J90o1
3513B41l1L1Q2j88n7j30J55k09J13k6K5oj27j89K53l98L49j29Q1n0J20j55J01
$$ [...]
8191g4
##END NTUPLES=NMR FID
##END=
