##TITLE=1H_LR-758-R6-RM2-K1
 CCl4
 8 sc, 
 28.9.2023
##JCAMPDX= 6.0         $$ Bruker NMR JCAMP-DX V2.0
##DATA TYPE= NMR FID
##DATA CLASS= NTUPLES
##ORIGIN= UXNMR, Bruker Analytische Messtechnik GmbH
##OWNER= root
$$ XWIN-NMR		Version 3.5
$$ Thu Sep 28 14:22:49 2023 Russian Standard Time (UT+4h)  she@DPX200
##.OBSERVE FREQUENCY= 200.13135
##.OBSERVE NUCLEUS= ^1H
##.DELAY= (6, 6)
##.ACQUISITION MODE= SIMULTANEOUS
##.ACQUISITION SCHEME= undefined
##.AVERAGES= 8
##.DIGITISER RES= 18
##SPECTROMETER/DATA SYSTEM= spect
##.PULSE SEQUENCE= zg30
##.SOLVENT NAME= CDCl3
##.SHIFT REFERENCE= (INTERNAL, CDCl3, 0, 15.7039)
##AUDIT TRAIL= $$ (NUMBER, WHEN, WHO, WHERE, WHAT)
$$ ##TITLE= Audit trail, XWIN-NMR		Version 3.5
$$ ##JCAMPDX= 5.01
$$ ##ORIGIN= Bruker BioSpin GmbH
$$ ##OWNER= she
$$ F:/spectra/data/she/nmr/H-F/1/audita.txt
$$ ##AUDIT TRAIL=  $$ (NUMBER, WHEN, WHO, WHERE, WHAT)
(   1,<2023-09-28 14:21:36.57 +0400>,<she>,<DPX200>,
      <created by zg, POWCHK disabled, PULCHK disabled
       configuration hash MD5:
       00 E9 B6 7A A2 85 ED C7 34 08 36 98 17 FE 4E 26
       data hash MD5: 16K
       91 C0 C7 74 4E E8 5A E7 AF 08 72 73 64 84 A1 1E>)
$$ ##END=
$$ 
$$ hash MD5
$$ 50 2D C1 43 D2 84 7F B5 DA A9 E9 15 AC 80 EB 05
##$RELAX= 
##$RELAX= 
##$RELAX= 
##$RELAX= 
##$RELAX= 
##$RELAX= 
$$ Bruker specific parameters
$$ --------------------------
##$DU= <F:/spectra>
##$EXPNO= 1
##$NAME= <H-F>
##$PROCNO= 1
##$TYPE= <nmr>
##$USER= <she>
##$AMP= (0..31)
100 100 100 100 100 100 100 100 100 100 100 100 100 100 100 100 100 100 
100 100 100 100 100 100 100 100 100 100 100 100 100 100 
##$AQSEQ= 0
##$AQ_mod= 1
##$AUNM= <au_zg>
##$AUTOPOS= <>
##$BF1= 200.13
##$BF2= 200.13
##$BF3= 200.13
##$BF4= 200.13
##$BF5= 200.13
##$BF6= 200.13
##$BF7= 200.13
##$BF8= 200.13
##$BYTORDA= 1
##$CFDGTYP= 0
##$CFRGTYP= 5
##$CHEMSTR= <none>
##$CNST= (0..31)
1 1 145 1 1 1 1 1 1 1 1 1 1 1 1 1 1 1 1 1 1 1 1 1 1 1 1 1 1 1 1 1 
##$CPDPRG= <>
##$CPDPRG1= <>
##$CPDPRG2= <>
##$CPDPRG3= <>
##$CPDPRG4= <mlev>
##$CPDPRG5= <mlev>
##$CPDPRG6= <mlev>
##$CPDPRG7= <mlev>
##$CPDPRG8= <mlev>
##$CPDPRGB= <>
##$CPDPRGT= <>
##$D= (0..31)
0 1.2 0 0 0 0 0 0 0 0.06 0 0.03 0 0 0 0 0.0002 0 0 0 0 0 0 0 0 0 0 0 0 
0 0 0 
##$DATE= 1695896495
##$DBL= (0..7)
120 120 120 120 120 120 120 120 
##$DBP= (0..7)
150 150 150 150 150 150 150 150 
##$DBP07= 0
##$DBPNAM0= <>
##$DBPNAM1= <>
##$DBPNAM2= <>
##$DBPNAM3= <>
##$DBPNAM4= <>
##$DBPNAM5= <>
##$DBPNAM6= <>
##$DBPNAM7= <>
##$DBPOAL= (0..7)
0.5 0.5 0.5 0.5 0.5 0.5 0.5 0.5 
##$DBPOFFS= (0..7)
0 0 0 0 0 0 0 0 
##$DE= 6
##$DECBNUC= <off>
##$DECIM= 32
##$DECNUC= <off>
##$DECSTAT= 4
##$DIGMOD= 1
##$DIGTYP= 9
##$DL= (0..7)
0 120 120 120 120 120 120 120 
##$DP= (0..7)
150 150 150 150 150 150 150 150 
##$DP07= 0
##$DPNAME0= <>
##$DPNAME1= <>
##$DPNAME2= <>
##$DPNAME3= <>
##$DPNAME4= <>
##$DPNAME5= <>
##$DPNAME6= <>
##$DPNAME7= <>
##$DPOAL= (0..7)
0.5 0.5 0.5 0.5 0.5 0.5 0.5 0.5 
##$DPOFFS= (0..7)
0 0 0 0 0 0 0 0 
##$DQDMODE= 0
##$DR= 18
##$DS= 0
##$DSLIST= <SSSSSSSSSSSSSSS>
$$ [...]
##$SUBNAM2= <"">
##$SUBNAM3= <"">
##$SUBNAM4= <"">
##$SUBNAM5= <"">
##$SUBNAM6= <"">
##$SUBNAM7= <"">
##$SUBNAM8= <"">
##$SUBNAM9= <"">
##$SW= 18.05172834244
##$SWIBOX= (0..15)
0 0 2 0 0 0 0 0 0 0 0 0 0 0 0 0 
##$SW_h= 3612.71676300578
##$TD= 16384
##$TD0= 1
##$TE= 0
##$TE2= 300
##$TE3= 300
##$TEG= 300
##$TL= (0..7)
0 120 120 120 120 120 120 120 
##$TP= (0..7)
150 150 150 150 150 150 150 150 
##$TP07= 0
##$TPNAME0= <>
##$TPNAME1= <>
##$TPNAME2= <>
##$TPNAME3= <>
##$TPNAME4= <>
##$TPNAME5= <>
##$TPNAME6= <>
##$TPNAME7= <>
##$TPOAL= (0..7)
0.5 0.5 0.5 0.5 0.5 0.5 0.5 0.5 
##$TPOFFS= (0..7)
0 0 0 0 0 0 0 0 
##$TUNHIN= 0
##$TUNHOUT= 0
##$TUNXOUT= 0
##$USERA1= <user>
##$USERA2= <user>
##$USERA3= <user>
##$USERA4= <user>
##$USERA5= <user>
##$V9= 5
##$VALIST= <valist>
##$VCLIST= <CCCCCCCCCCCCCCC>
##$VD= 0
##$VDLIST= <DDDDDDDDDDDDDDD>
##$VPLIST= <PPPPPPPPPPPPPPP>
##$VTLIST= <TTTTTTTTTTTTTTT>
##$WBST= 1024
##$WBSW= 4
##$XGAIN= (0..3)
0 0 0 0 
##$XL= 0
##$YL= 0
##$YMAX_a= 26112
##$YMIN_a= -28251
##$ZGOPTNS= <>
##$ZL1= 120
##$ZL2= 120
##$ZL3= 120
##$ZL4= 120
##$ABSF1= 10
##$ABSF2= 0
##$ABSG= 5
##$ABSL= 3
##$ALPHA= 0
##$AQORDER= 0
##$ASSFAC= 0
##$ASSFACI= 0
##$ASSFACX= 0
##$ASSWID= 0
##$AUNMP= <proc_1d>
##$AZFE= 0.1
##$AZFW= 0.1
##$BCFW= 1
##$BC_mod= 2
##$BYTORDP= 1
##$COROFFS= 0
##$CY= 11.3945322036743
##$DATMOD= 1
##$DC= 2
##$DFILT= <>
##$DTYPP= 0
##$F1P= 15.7292609196834
##$F2P= 12.9074282941183
##$FCOR= 0.5
##$FTSIZE= 0
##$FT_mod= 4
##$GAMMA= 1
##$GB= 0.15
##$INTBC= 1
##$INTSCL= 1
##$ISEN= 128
##$LB= 0.24
##$LEV0= 0
##$LPBIN= 0
##$MAXI= 10000
##$MC2= 0
##$MEAN= 0
##$ME_mod= 0
##$MI= 1.114404
##$NCOEF= 0
##$NC_proc= 0
##$NLEV= 6
##$NOISF1= 3.799351
##$NOISF2= 2.8
##$NSP= 1
##$NTH_PI= 0
##$NZP= 0
##$OFFSET= 15.70392
##$PC= 1
##$PHC0= -21709.68
##$PHC1= 9.452709
##$PH_mod= 1
##$PKNL= yes
##$PPARMOD= 0
##$PSCAL= 0
##$PSIGN= 0
##$REVERSE= no
##$SF= 200.130013532006
##$SI= 16384
##$SIGF1= 3
##$SIGF2= 2
##$SINO= 400
##$SIOLD= 16384
##$SREGLST= <1H.CDCl3>
##$SSB= 0
##$STSI= 0
##$STSR= 0
##$SW_p= 3612.71676300578
##$SYMM= 0
##$S_DEV= 0
##$TDeff= 0
##$TDoff= 0
##$TI= <>
##$TILT= no
##$TM1= 0
##$TM2= 0
##$TOPLEV= 0
##$USERP1= <user>
##$USERP2= <user>
##$USERP3= <user>
##$USERP4= <user>
##$USERP5= <user>
##$WDW= 1
##$XDIM= 8192
##$YMAX_p= 0
##$YMIN_p= 0
$$ End of Bruker specific parameters
$$ ---------------------------------
##NTUPLES= NMR FID
##VAR_NAME=  TIME,          FID/REAL,        FID/IMAG
##SYMBOL=    X,             R,               I
##VAR_TYPE=  INDEPENDENT,   DEPENDENT,       DEPENDENT
##VAR_FORM=  AFFN,          ASDF,            ASDF
##VAR_DIM=   8192,          8192,            8192
##UNITS=     SECONDS,       ARBITRARY UNITS, ARBITRARY UNITS
##FACTOR=    0.0002768,     1,               1
##FIRST=     0,             0,               0
##LAST=      2.2672688,     0,               0
##MIN=       0,             -28251,          0
##MAX=       2.2672688,     26112,           0
$$ Real data points
##PAGE= N=1
##DATA TABLE= (X++(R..R)), XYDATA
$$ [...]
1699F3M5j4n5J67m3m44J56j3K60j12O0j0j26J17r0m1L5l8L40j44m2k31L42j80
1723Bk81K38K22l42J71j25R0J85k76K08k49RqJ36N8J79l06K46j26k11o5J19L4
1746i2J60n0k9j44J16J23J75k63LJ02j77j57M68k27k68L43l8N0l14L96j55l2m2
1769e2O8N8p4k0k18K81k75M00j08J55l79R3J18r4k53J38L42j41P8L9o9k90R7J97
1793I1P5m17K82j0l61L18M4j01K2L16n30L33J29k04j24J85j31N3J93J64l43l2
1815d8J10r0J77j79Q9N7m3N7j06p2O5N5k7k17j4J75j81J61j41J80o2j87K39j94
1839a96L12q1l76M56j72m7J09n8R2j10J66j36J57l25J03K43m8k8j61J17JL7l08
1862b53L43k81M7R7J9O2j5J98l52j27K37L82l43k64J08P8K01o0k2o3K69j49k0
$$ plain form
1699 63 108 94 39 206 163 -281 -125 -138 122 10 70 60 -66 51 -39 -80 -45 -83 257 113 71 -160 182 2
1723 2 -279 -41 181 -161 10 -115 -25 160 -116 92 -157 -148 -156 -20 38 217 -89 157 31 -180 -245 -126 -92
1746 -92 68 18 -11 -155 -39 84 259 -4 -1 101 -76 -233 235 8 -260 83 45 95 -219 177 22 -10 -52
1769 -52 16 74 0 -20 -238 43 -232 168 60 215 -164 -71 47 -47 -300 -162 180 39 117 156 87 -203 -106 91
1793 91 166 -251 31 21 -340 -22 22 -79 -57 259 -271 62 191 -13 -137 48 -83 -30 163 327 -16 -48
1815 -48 62 -28 149 -30 59 116 73 130 24 -48 17 72 45 -172 -186 -11 -192 -31 -172 8 -54 -241 -2 -196
1839 -196 116 35 -341 115 -57 -104 5 -53 39 -71 95 -41 116 -209 -106 137 89 61 -100 17 18 55 -253
1862 -253 90 -191 -144 -47 -28 34 19 217 -135 -262 -25 357 14 -250 -142 -64 137 77 55 -8 261 112 92
1885I2k41J05L72m31L4J3L4J08oJ5l23Q9M8Q1P4r7j48J66K59k84p3K87r5N9j2
1910A26k56L59n09L93n2j12J04p2K08j60r6N5N8k01J44j18J91j48k1Jk9J65j46
1933a16n1rM2K57j65J7K4N2j21p8K76l8K8k59K40j65p5L15k93R1J83j40j3J49
1957A51k9l6m10K59K29k89J75L4j54j52L15o0j69L0K37K1M6n1k66L3J01l45K88
1980d2k59K73r6J05J04k13L5j15K19K2rj68K10k14J56N3j52j24K89kQk76M59j66
2004I7j13kJ6oQ8j19l9r2J4K14j72M42m64qn9K68l80M46k52J03j1j14n3L29q9
2029D4j10J45Qk81J52O1j14N8Q4r0%K66j79qK12j58q0k57J39J69k6n4J87l53J80
2054ej91OK64r8R6O3j54K12k13j10K81j59Ol4P8J53l88J99M0j76j12J90K46j35
$$ plain form
1885 92 -149 -44 328 -103 -69 -56 -22 86 80 95 -228 -139 -91 -10 64 -33 -181 -15 244 -40 -113 174 79 138 126
1910 126 -130 229 -280 113 61 -51 53 -19 189 29 -67 -12 46 -155 -11 -129 62 -86 -107 -106 -135 30 -116
1933 -116 -167 -176 -134 123 -42 -25 -1 51 -70 -148 128 90 118 -141 99 -66 -141 174 -119 -28 155 15 2 151
1957 151 122 86 -324 -65 164 -125 50 84 -70 -222 93 33 -136 -106 131 152 198 147 -119 -86 15 -330 -42
1980 -42 -301 -28 -124 -19 85 -128 -93 -208 11 33 24 -144 66 -148 8 61 -91 -215 74 72 80 -196 263 97
2004 97 -16 -18 -2 -8 80 -39 -78 -170 -156 58 -114 328 -136 -144 -203 65 -315 131 -121 -18 -29 -143 -196 133 44
2029 44 -66 79 87 -194 -42 19 -95 -37 47 -43 -43 223 44 36 248 90 10 -247 -108 61 35 -19 168 -185 -5
2054 -5 -196 -190 74 -24 72 135 -19 193 -20 -130 151 -8 -2 -36 42 195 -193 6 46 -130 -242 -52 194 59
2078E9k54M88j75N6j77K3OM8k44K69K13m04K06k70q0K64j79K17j46J11j35JM3
2101f0K02k39K31j1m0lN2r1J75m5k4j1j37J23m0N7n2l5k46J70j65L84l2q2o3j28
2127a10P3j09K86l9j62K31l2J03m12l6J92n8Q1J17q2O2o1p1R9l97K49M5j77J75
2151c3RQ6l06J48j1P9o0R8P4j06M1P5k7N8p4j92m2J93%P1q8k96J48J42ml2n1J50
2179E0j85P4K5Q6K5j46KK9l6N1J12p8L13m12O0j22Mr1Q5J24k01J57O6K49l64M
2205a19J12j66K23r5j09J69q7K24j28J7J02L5k10J01j44K14k49J11J65k47J37
2226E6j83M0K2J74J84l05J47j06J02l65L03l00M8K32J42l44R1J43l21Q8jJ72j99
2249a80P6L81k41j15J55p4N6J21j76L7P4j36J44R6j78j48K06Q5q5j55L3O7j05
$$ plain form
2078 59 -195 293 118 174 -3 20 26 74 -170 99 312 -92 114 -156 -236 28 -151 66 -80 31 -104 -103 -60
2101 -60 142 -97 134 123 83 80 132 41 216 171 147 136 -1 122 82 139 87 52 -194 -24 -189 195 163 81 18 -110
2127 -110 -37 -146 140 101 -61 170 138 241 -171 -207 -15 -73 8 125 43 105 44 -27 72 -325 -76 -31 -208 -33
2151 -33 -24 62 -244 -96 -107 -28 -88 10 84 -22 19 94 67 125 51 -141 -183 10 10 81 -7 -303 -155 -13 -17 -49 -100 50
2179 50 -135 -61 -36 50 75 -71 -69 -40 -76 -25 87 9 322 -90 -30 -152 -148 -239 -154 -30 -231 -74 -8 241 -123 -119
2205 -119 -7 -173 50 -45 -154 15 -72 152 24 41 143 178 -32 69 -75 139 -110 1 166 -81 56
2226 56 -127 -87 -65 109 293 -12 135 29 131 -234 69 -231 -183 49 191 -153 -62 81 -240 -152 -153 19 -180
2249 -180 -104 277 36 -79 76 2 58 179 3 40 114 -22 122 218 40 -108 98 183 98 -57 -24 43 -62
2272f2R9k95J12J86m1J4p0J40k49J69J01j13R8k31K75Kk09J19j32j91L49k53K27
2295D5j31K25j12N3l0n9J64k6j50lj96L45j60n7J35j09J71k5p8M8n7J2K1Qj32
2320i8R0O2R8m00K59j16L1K4J36l7k24M6J94J6J07l22K14K98l19k0j84K38J10
2343B03j61q3J95j02k64J70J40J15j17j67J67j49m3J17p4R6q8J77k04J59M4k19
2365h8K62k08m2O2J18l86J90K77j10J62j87r9R7J33k06J89j74R4J46l86j32K94
2387FJ1l36J65J50j17n0J98j17P1K1j65R1j99L49N4j42Q4j43p7L46K03m20Pm2
2411e2J42jk29K7o3jK31k22O01n03q0J64qL5M8j30N3k36K72L3l6R8l75N88m78
2436a22K1M4j63J21q9M27j91J22j94n5%K2J26o4j3o7l4K34j40M0j28J29q7J09
$$ plain form
2272 -62 37 -258 -146 40 -1 13 -57 83 -166 3 104 -9 89 -142 133 135 -74 45 -87 -278 71 -182 45
2295 45 -86 139 27 80 50 -9 155 129 -21 -24 -220 125 -35 -92 43 -66 105 80 2 50 -7 5 26 34 -98
2320 -98 -8 54 152 -248 11 -105 -74 -50 86 49 -175 -129 65 81 188 -134 80 378 59 39 -145 93 203
2343 203 42 -41 154 52 -212 -42 98 213 96 -71 96 -53 -96 21 -53 43 -45 132 -72 87 131 -88
2365 -88 174 -34 -76 -14 104 -282 -92 185 75 237 50 -49 48 181 -25 164 -10 84 230 -156 -288 6
2387 6 17 -319 -154 -4 -121 -171 27 -90 -19 2 -163 -72 -271 78 132 -10 74 -69 -146 200 403 -17 -10 -52
2411 -52 90 89 -140 -113 -176 -177 54 -168 433 -70 -150 14 6 41 89 -41 12 -224 48 81 45 143 -232 356 -122
2436 -122 -101 -57 -220 -99 -188 239 48 170 -24 -79 -79 -57 69 5 -8 -75 -109 125 -15 25 -103 26 -61 48
2460D8J9n7k3J40l02J27J39K1p9j24J52K3O8j77o9L12j73O0k02l6K32j27r8K38
2484A12P4k22J51j47R3q4K50j33n2j7J00l39K74j7Pk0k53K73pj30O5K4r9N7j39
2509a79K34j9p4K36j01j50L7J9p0L8Ml3L1k18lJ98P2MJ85j48J32j57k11k41L49
2534f5L03l66P8Lj31J46j7J14J11n4M3k5j43l4j83L97k49Q2J35m16K60J12j19
2557a8P1K10j76l7l5r9M5nP0j41K51k34J13j65L70k76p1L30j22J03Q7k77j13J92
2581G3r0L4j24J85j80K42l48K8kL40k55j3N7J04O0k3j13jK39l30K07J36j06m6
2605G4l69L72k83J26J67j50n0L4q3K20P5j87N7k34J88K01j25R3j8l39M31j06q1
2628A3J52m19J18q7L65j17j30k55L13J74k19J12RQ4L1j22j88R6j08J06j7oj34
$$ plain form
2460 48 67 10 -13 127 -175 -48 91 112 33 -91 61 84 152 -25 -94 218 45 105 -97 -133 99 -28 -126 112
2484 112 186 -36 115 -32 61 -23 227 94 42 25 125 -214 60 43 50 30 -223 50 43 -87 -22 2 -97 -40 -179
2509 -179 55 36 -38 198 97 -53 -16 3 -67 -29 -25 -58 -27 -245 -248 -50 22 26 211 63 195 38 -173 -414 -65
2534 -65 238 -128 -50 -47 -178 -32 -49 65 176 122 165 140 -3 -37 -220 177 -72 10 145 -271 -11 101 -18
2557 -18 53 263 87 50 15 -84 -39 -44 26 -115 136 -98 15 -150 220 -56 -127 203 81 184 271 -6 -119 73
2581 73 -17 17 -107 78 -102 140 -208 -180 -182 158 -97 -110 -53 51 111 88 -25 -26 213 -117 90 226 120 74
2605 74 -295 77 -206 -80 87 -63 -113 -79 -162 58 133 -54 3 -231 -43 158 33 126 108 -231 200 94 13
2628 13 165 -254 -136 -223 142 25 -105 -360 -47 127 -92 20 29 113 144 22 -166 -70 -178 -72 -89 -95 -229
2651b29L54j96L61l08Q2j6j20P5qj0K58L9k31M8l5L4l0K01k8n3kq0j63k0J5p0
2677a32J47J4nj13M9q4N7K47j89j89L35j66Qo4K0P2j22K6J4m8L7R4K01k02k3j29
2703a45L34k03R5j05J76n04J84KJ65L70l00m4QkK2r3K26k43k25nL22K7j65J86
2727H3R4j52k8J28l5m2j20J45j72J59n4J2JK9J16l13J76jK60l64j75L61K7o5J41
2752B11p9j38O9r9K44o8k09J88o6M7j11k21J84J71o9m4o3k42N09Qj06k54n7J50
2776d5Q9o1j18J30J17j18K5k05M65p4l42N8qJ13N3K50m22Nj9p4J09j4P1m44L86
2801g3J36k15r1K79m1M17o28L08K8l11L86l7p3M2j83r4J57L12n6k36R7Pl8l03
2825b10J21Q6j91K17p5J67j62M4o3RJ45K6j78m9N7J07N3j07K1K9j48l3K86j28
$$ plain form
2651 -229 125 -71 290 -18 64 48 -72 3 -5 -15 243 282 51 99 64 98 68 269 241 188 186 106 -57 -77 -62 -132
2677 -132 15 29 24 -89 -40 -124 -67 180 -9 -198 137 -29 -21 -85 -65 7 -115 -89 -75 -123 -86 8 209 7 -16 -145
2703 -145 189 -14 81 -24 152 -352 -168 -166 -1 369 69 25 33 31 53 -40 186 -57 -282 -287 35 62 -103 83
2727 83 177 25 -3 125 90 48 -72 73 -99 60 6 18 19 48 164 -149 27 26 286 -78 -253 108 135 70 211
2752 211 132 -6 63 -36 208 140 -69 119 53 100 -11 -232 -48 123 54 10 -53 -295 214 222 116 -138 -195 -45
2776 -45 44 -17 -135 -5 112 -6 19 -186 279 205 -137 -79 -87 26 79 329 -93 -88 -107 -181 -72 -86 -15 -459 -73
2801 -73 63 -152 -243 36 -5 412 -216 92 120 -191 195 158 85 127 -56 -150 7 319 263 27 124 131 93 -210
2825 -210 -89 -3 -194 23 -52 115 -47 -3 -66 -57 88 114 -64 -113 -56 51 104 -3 18 47 -101 -134 152 24
2849B4mL4K38k37M1J13m46M74j11j30K6J02p3j08J39k06O0K02j01j88J17K25k74
2872h3K67k15nL5Q8L8j62O2j39J60j62J56qK5J77l79N0J00K77k96J32j17R9j41
2896d1mJ77j17j12l3K44j23LpK6L00l53J51k96P2m8J66J92r5k32K05m8R7J13j31
2921A06k41j53O5L48j91l4P0PJ59l31L36L3l34q3K46J37Q9l83J75k7M0J06j4k64
2945a38J30J25l40K85Qj13K09n9N2k40R0j1J4M6j38K99r2j9l44K50n5R3j65J32
2969A9q3k9J89k18J53o5P3j86J40M5o4o6p2l5K24mJ77l55j99K17J42J80k79q6
2993a82j1K27j00K88l26P2N4j82J02r6R4j1O1N1j28L17j87M3k8j38o0Kk9K10j6
3018B7J97j13j39KK0QQ6lj58O8j20R9j19J58K54k40m5J5L47k27n8l10R9J8J13
$$ plain form
2849 24 20 54 292 55 96 209 -237 237 126 -4 22 124 51 -57 82 -124 -64 138 37 -151 -34 191 -83
2872 -83 184 -31 -36 -1 87 125 -37 25 -114 46 -116 40 32 57 234 -145 -95 5 282 -14 118 1 100 -41
2896 -41 -45 132 15 -97 -130 114 -9 -6 -13 13 313 -40 111 -185 -113 -161 5 197 102 -130 75 27 124 237 106
2921 106 -135 -288 -223 125 -66 -100 -30 -23 136 -195 141 174 -160 -243 3 140 229 -154 21 -6 34 140 126 -138
2945 -138 -8 117 -223 62 70 -43 166 107 159 -81 9 -2 12 58 -80 219 127 108 -236 14 -41 52 -113 19
2969 19 -64 -93 96 -122 31 -34 39 -147 -7 38 -26 -92 -164 -199 25 21 198 -157 -356 -139 3 183 -96 -182
2993 -182 -193 34 -66 222 -104 -32 22 -160 -58 -154 -60 -71 -10 41 -87 230 43 86 58 -80 -140 -138 -167 43 27
3018 27 224 111 -28 -26 -6 2 88 85 -73 -5 -125 -26 -145 13 267 27 -18 -3 344 117 59 -251 -152 -134 -21
3043b1j28L16j80J09q1J06j88K73k30j00K14J24j88j72K65K74m73J10j99K59j61
3064g1L04k93K91k44J84L8K34r9k04N2l24J9K49J09l36J34n8j15M18j68J8j69
3086c1K98m41L50l32M29l38J59k80J75J52R8l78P0M3Q5l87L71j43K15p9j57K75
3108A54l98K34K15j51j56O6j50J76k21nO9M76k90J95k75q5N0K67l1k15q8L88m12
3131a87J04J93l28K65j91K30j01J45r3K07j97k2k2J01j79J32k1j62J55k07q6K57
3153gK30j48l62j5M36j11j69K58j23KO4R6j51J16r3J19o8j30nO6M8L0l05L28J64
3178B70o20J13L37j38j35M56j59j05j7P3Q6l27j1L73k63P0P9mJ53k94J46j82J03
3201Dm2q3K02k83L64j63Q7j06L55l06q7M61k26j92O5Kj79N8Qj27J47L2J23l7J16
$$ plain form
3043 -21 -149 167 -13 96 15 121 -67 206 -24 -124 90 214 26 -146 119 393 -80 30 -169 90 -71
3064 -71 233 -60 231 -13 171 209 443 344 140 192 -132 -113 136 245 -91 43 -15 -130 288 120 138 -31
3086 -31 267 -174 176 -156 273 -65 94 -186 -11 141 239 -139 -69 -26 59 -328 43 -100 115 36 -121 154
3108 154 -244 -10 205 54 -102 -36 -186 -10 -231 -236 -167 309 19 214 -61 -146 -96 171 140 -75 -163 225 -187
3131 -187 -83 110 -218 47 -144 86 -15 130 37 244 47 25 3 104 -75 57 36 -126 29 -178 -264 -7
3153 -7 223 75 -287 -302 134 23 -146 112 -11 -9 55 151 0 116 23 142 74 -56 -61 5 53 83 -222 106 270
3178 270 -350 -237 100 -38 -173 283 124 19 2 75 161 -166 -177 196 -67 3 82 78 231 -63 83 -99 4
3201 4 -38 -121 81 -202 162 -1 86 -20 335 29 -58 403 177 -15 50 52 -127 -69 -61 -188 -41 -9 114 77 193
3226A93o6j70J20m5O4mj55m1J15R2R1j84J36n3p1j36L6J14m80M85j68LL2J48Q3
3251A39m19J99J25J2j88M2M8L65k94j35K76j01j50m9Q6j49J99k14L69l43oJ22
3273f6J07j95J87K4k80L43m3p4kj95J25J9L9J67k60K4R0l03J43J42N4Q9k09j3
3297h7J10J08j92P8n8J66k48N1m5K66P3j5k23J8M2M3l7M5o6k41J90j79K46j06
3321f1J24j86P3J05k04N7L07o0k83J39J0l3J7p2O6l6j7r0N4J8J69j50q6J75k05
3346a69K87q6m7Pk7q6J94k84L61O3q4R0j46n9p5pj14p6Q9J09M4l5J96j92K12q7
3372G8j59M4j93K92k08M20k96Oj43J18J04j54J86j40J95k23L03l30j6l9K13JJ64
3395B23l48J19J45j81J23j81J64k95K47l3J29j34qp1M82m80J35j80K92k05P9J33
$$ plain form
3226 193 127 -43 77 32 96 92 -63 -104 11 103 194 10 146 93 22 -114 -78 36 -444 41 -127 -124 -92 56 139
3251 139 -280 -81 44 56 -132 -90 -42 323 29 -106 170 69 -81 -130 -44 -193 6 -208 161 -182 -188 -66
3273 -66 41 -154 33 57 -223 120 77 3 1 -194 -69 -50 -11 156 -104 -80 10 -293 -150 -8 46 135 -74 -87
3297 -87 23 131 -61 17 -41 125 -123 -72 -117 149 222 207 -16 2 44 87 50 95 29 -212 -22 -201 45 -61
3321 -61 63 -123 -50 55 -149 -92 215 155 -128 11 21 -12 5 -67 -1 -37 -54 -144 -90 -72 97 -53 -139 36 -169
3346 -169 118 32 -15 -8 -35 -121 73 -211 150 213 129 219 73 14 -61 -68 -182 -258 -169 -60 -16 -51 145 -47 165 78
3372 78 -81 -37 -230 62 -146 274 -22 -16 -159 -41 63 -91 95 -45 150 -73 230 -100 -116 -155 58 59 223
3395 223 -125 -6 139 -42 81 -100 64 -231 16 -17 112 -22 -30 -101 381 -99 36 -144 148 -57 22 155
3417A55j58J60j92kQ9n4l8n9L2J06m21J2J46L17J99l14k81L60j10J34j29J43r1
3440DO3r8k4J58k63J53L5R5R4k05J8L1q8m3l3K55J4j88mJ49l9L9j79N5K7p1p3
3467a18n3P6n0J09M4k2j41JK51j34K05k54Q2J21j36J50l48k8K66k41K08o0P1m1
3491d2J68m8r2J59j80m5JJ32j5j6M7J83l18N9J74j05j72M5M1J31N3P6j81l1k32
3516b08K73J07k70J83m3M4q1R3p8j1l20M58l10J37O8k40J50q1K10kj34n8L68n70
3540c15N07k63O9O4j60P3J04j32p3P5Pl1J12k8J39J8j24lj79J42m9j6J39P1k95
3565a48K76j29L55m67q9J33K27j25O0N0j94O3QNj10L51k32J30J4k09r2K78p8k38
3589a61J11K3J43l7j55o2J42n7N8J05j80K51k5l0j21O5O0l9J75m08K89%k2j34
$$ plain form
3417 155 -3 157 -35 -37 52 -2 -40 -99 -67 39 -382 -370 -224 93 292 -22 -303 57 -53 81 -48 95 4
3440 4 67 -31 -55 103 -160 -7 28 123 217 12 30 61 -27 -70 -103 152 166 -22 -26 123 84 123 -56 -1 26 -45 -118
3467 -118 -171 -95 -145 -36 8 -14 -155 -154 97 -37 168 -86 -4 117 -19 131 -217 -245 21 -220 -12 -72 -1 -42
3491 -42 126 78 -14 145 -35 -80 -79 53 38 22 69 252 -66 -7 167 62 -110 -65 -24 107 160 236 55 24 -208
3516 -208 65 172 -98 85 42 86 5 98 20 9 -311 147 -163 -26 42 -198 -48 -129 81 79 -55 -113 255 -315
3540 -315 192 -71 -2 62 -98 -25 79 -53 -126 -51 -44 -75 37 9 148 166 42 39 -140 2 -47 -63 76 147 -148
3565 -148 128 -1 354 -113 -202 -69 158 33 93 143 -51 12 20 25 -85 266 34 164 178 -31 -123 155 77 -161
3589 -161 -50 -27 116 79 -76 -138 4 -53 5 110 -70 181 156 126 5 70 130 91 266 -142 147 147 125 -9
3613iJ13r4N9L3j15KJ64j82Q1J14l5P9l57J74K91k69K7l4O7R4J07n56J14K35J0
3638A13k8l07K55K28l92j02O4m8J47J29rj86kj3j55K26j15J83K1j66K71j50J72
3661A36k11K74j79j61K5J29l3K29k00J9j36o9l0M6J67o9k2K1J19q9R0j13n4K9
3685h2J64J35m8k82J90J2J99j98K36k51j24k2J31k15K74o9j12J01j46R7M7j05
3707f8K95r4o7k4J0Kp2l7m0J20j76l1N05l09k0j06O4L46k56J2J47rk58K00R8m16
3733a84K84p0R7k7k74L66q5j01Rn6j0l12L72J58l91K37K37k95M3j63L97j41J3
3756A04K3j55J5N7p7J1J33O6k13p9Q4J27r2l4l12N62j1j28j12j00k7k6J16R1L4
3781E7L0j90q6J67r9J8L51l27j21K59m3n0j10K14j56k02K15k98K13K71k66k7Q8
$$ plain form
3613 -9 104 10 69 102 -13 -11 153 -29 52 166 131 210 -147 27 318 49 76 42 109 203 310 -246 -132 103 113
3638 113 85 -222 33 261 -131 -233 -169 -217 -70 59 50 -136 -138 -151 -306 -80 -195 -12 9 -157 114 -36 136
3661 136 -75 199 20 -141 -116 13 -20 209 9 28 -108 -177 -207 -161 6 -63 -85 -64 55 -34 56 -57 -111 -82
3685 -82 82 217 169 -113 77 89 288 90 326 75 -49 -71 60 -155 119 50 -62 39 -107 -10 37 -68
3707 -68 227 133 66 42 52 54 -18 -55 -95 25 -151 -182 323 14 -6 -112 -48 298 42 54 201 192 -66 134 232 -184
3733 -184 100 30 127 100 -174 192 107 6 15 -41 -51 -363 9 167 -224 13 250 -45 -2 -165 232 91 104
3756 104 127 -28 -13 44 -33 -22 111 177 -36 -115 -31 96 4 -30 -342 220 209 81 -31 -131 -158 -184 -68 23 57
3781 57 87 -103 -189 -22 -121 -103 248 -79 -200 59 16 -34 -144 70 -86 -288 -73 -371 -158 113 -153 -180 -92
3804i2Q7J86j44K8P8K3j34M5j09O4N5J51k22K07j95j40L05k5j65n8O1n2K46j79
3828B1K10p4j30J96p0r7O4r2j47J65j33j12J37j2R3k69K40J09k36r2J54M0O5j1
3852A9j25J77j22m5K7k3J70j18J55p9j32j14L78m3J28k69%K2K45k10L6K61n26
3875a88K75O7o9J29j96j58J92j27J25j02L50j03n4j10j1j17J3K08l27q5M63k65
3897i0N2K9p9K09K0j23l7P1Jn6k27O0K81o0j98J78k2J68l06K28Nj1j25q6J10q1
3923h9L6L13k60j51K57k87J98j3J5R2J11m27m0L05L45n13j0j39M34j56j00L27
3945B48j8n11Q1L24m85J82J84l5r8%J31j50J12m8K52K3j68Q1j09l5K80l09q2K24
3969G4j28J93q4m5K43o23K37J09j07N3N8K63jk01l5R6l58J46J16o4po3o2o3J99
$$ plain form
3804 -92 -5 181 37 65 143 166 32 77 -32 32 87 238 16 223 28 -112 193 168 3 -55 6 -46 200 21
3828 21 231 157 27 223 153 56 120 28 -119 46 -87 -199 -62 -74 19 -250 -10 99 -137 -229 -75 -35 30 19
3852 19 -106 71 -51 -96 -69 -92 78 -40 115 36 -96 -210 168 125 253 -16 -16 6 251 41 77 338 -188
3875 -188 87 154 85 214 18 -140 52 -75 50 -52 298 195 141 31 20 -97 -84 124 -203 -288 175 -90
3897 -90 -38 -9 -88 121 141 18 -19 52 53 -3 -230 -170 111 51 -147 31 9 177 -129 99 104 93 -32 -118 -8 -89
3923 -89 -53 260 0 -151 106 -181 17 4 19 111 222 -205 -245 60 405 -108 -118 -257 177 21 -79 248
3945 248 230 -281 -200 124 -361 -179 5 -30 -128 -128 3 -147 -35 -83 169 192 24 105 -4 -39 241 -68 -150 74
3969 74 -54 139 55 10 253 -370 -133 -24 -131 -78 -20 243 242 41 6 102 -256 -110 6 -58 -65 -128 -190 -253 -54
3994e4J26l9k08J65o%J75L0l14J26J9k04K19J9nJ14M0l48NL60k44K69j98l27J56
4019a24j43K88o4L2k26L66j61J35k26J33m5P5N4n3O1L2J72k52r1k15L41j08L10
4042B91l22J27J09l53K68P1k21K5J2m8k1K10j66L8j89M12k14j49Q8j00K16k14
4064a30j02J51j02K79O1k4j80M2j20J77J31l01J02j03R0J28k46J6O3J79j85J74
4086A00J06L3k26J36j16j36K67l90N23m63K88j22j94L74m33L47n0J90R0j34j7
4107A73j31q3K60k65O2Mj68J16J6J51j63Nj9J99j21K3j93J81m6P8j11Q2q4J24
4131I0p0J4L4j05oj41L78l03J64r5J65lk22lO9p4j1L1J27k5Q1q8R3j17k5j17P5
4158h4N8p8pL09p3J63l02J24n2j43J4M7N8K2J20l20J75j97L50L4r2j77l0K84k83
$$ plain form
3994 -54 72 33 -175 -10 -16 -16 159 189 -125 1 20 -184 35 54 49 163 203 -145 -140 220 -24 245 47 -280 -124
4019 -124 -267 21 -43 -11 -237 129 -32 103 -123 10 -35 40 94 41 102 134 306 54 -37 -252 89 -19 291
4042 291 -31 96 205 -148 120 191 -30 -5 7 -41 -62 148 -18 20 -169 243 29 -120 -32 -132 84 -130
4064 -130 -232 -81 -183 96 157 133 -47 -5 -125 52 183 -118 -16 -119 -29 99 -147 -131 -68 111 -74 100
4086 100 206 239 13 149 33 -103 164 -226 297 -166 122 0 -194 180 -253 94 44 234 324 190 173
4107 173 42 -41 219 -46 16 20 -148 -32 -16 135 -28 -23 -42 157 36 59 -134 47 1 79 -32 50 -34 90
4131 90 20 34 68 -37 -43 -184 194 -109 55 -40 125 122 -100 -103 -34 -108 -119 -88 39 14 95 7 100 -17 -42 -159 -84
4158 -84 -26 -104 -111 198 125 288 -14 110 58 -85 -71 -24 34 56 176 -144 31 -166 184 218 126 -51 -81 203 -80
4183h0p7K52k6n4J69l28J9J58j12L88k49p2L5jk87K19k34K38J41k44K12o8M4j77
4207a34L50j89j14J93j37qJ80p9J5k8p9m0O4r5o5J84k60J71k0J04j86N27l86R7
4231F5P3j81j31J57R2n6mj38J91J98m39J70J52k31K24j29m05L66r2L46j99k26
4253a97K50j35J26k6J41j57k14K66K95k00q5k51K13L1k76N19k08j50lK46j67J1
4275B9K11l46K50P1k49r6Q7j86J17J42l1K01n7l20K34J5j48N6O2K4J57k95L9K94
4299B61k78J18J9Or5r8J40r9L4K3K7j9J9k59K92n9J72j68n4k1R8r3J10r3j76j43
4325c36K90j5r7K16K6r4RNj94K28J36L5j13k9j46K14k01k4K98p6j87L05j80k19
4349a49J80j22n8L40l21l5L60l89OK05l8J65j58K3j24K83J63j30k04K18q1j49
$$ plain form
4183 -80 -157 95 69 15 184 -144 -125 33 -79 309 60 -12 23 22 -265 -46 -280 -42 99 -145 67 -1 43 -134
4207 -134 216 27 -87 106 -31 -39 141 62 77 49 -30 -70 -6 -101 -166 18 -242 -71 -91 13 -173 354 -32 65
4231 65 138 -43 -174 -17 75 19 15 -123 68 266 -173 -3 149 -82 142 13 -392 -26 -118 228 29 -197
4253 -197 53 -82 44 18 159 2 -212 54 349 149 64 -187 26 57 -219 300 92 -58 -61 185 18 29
4275 29 240 -106 144 215 -34 -130 -43 -229 -112 30 -1 200 143 -177 57 72 -76 -20 42 66 223 -72 -33 261
4299 261 -17 101 120 126 31 -67 73 -26 8 31 58 39 58 -201 91 32 204 36 -18 -39 59 -34 76 -17 -193 -336
4325 -336 -46 -61 -158 58 84 -10 -1 4 -190 38 174 209 96 67 -79 135 -66 -90 208 132 -55 250 70 -149
4349 -149 31 -91 -149 191 -130 -165 195 -194 -188 17 -21 144 -14 9 -115 168 331 201 -3 215 134 -15
4371a5K59k30J12j50q0K7J02m4m9K58j03J25k92oK15k45J43K54l31L7lj27J80
4394C7MN5j52Pk7L48l56J46J2k18R5J21j99K12j61J76n2j53K8K0j58j9L39k6j08
4419b9j47L3J51m6j61J77J1jJ46j49J66j94R2k08J54k20J45J05M1p1K1j91R5o8
4443a48L34m30M9R4Q6Q2o3K45l71K37j66L0O1LR4K1l88K05j3K27L4j26o2k58L02
4468G9r8P1j08J41R0p1k18L05j47lJ8j22J22M4k16P8J13j84K95j65R0j26o6J45
4492F7q5j72K68R8j11j00L14r0j72Rr5K4J94N9j04j2j86K32j53L4J17m31L09m4
4516c0j73j1K00Kk8p3J0J77r4N0P7o9j79K14j44K34k35R9r6j84N09j58l38L55
4540A15N7m01J08R3L38k75l0K66j13j13lP3j56j79J98j09M81l58k1n6K0J58j63
$$ plain form
4371 -15 244 14 126 -24 -104 -77 25 -19 -68 190 87 212 -80 -86 129 -116 27 281 -50 -13 -16 -143 37
4394 37 41 96 -56 -49 -76 272 -84 62 74 -144 -49 72 -127 85 -76 100 48 -105 -77 -57 -215 -234 105 79 -29
4419 -29 -176 -143 8 -38 -199 -22 -11 -12 134 -15 151 -43 49 -159 -5 -225 -80 25 66 -5 16 -175 -80 -148
4443 -148 186 -244 -195 -101 -15 67 4 249 -122 115 -51 -21 40 43 137 158 -230 -25 -38 189 223 97 35 -223 79
4468 79 -19 52 -56 85 175 104 -114 191 44 41 59 -63 59 103 -113 -35 78 -106 189 24 114 -12 -78 67
4492 67 -18 -190 78 176 65 -35 279 189 17 26 -69 -45 149 208 104 92 -94 138 -15 19 136 -295 14 -30
4516 -30 -203 -214 -14 -12 -40 -113 -103 74 -20 30 107 38 -141 73 -71 163 -72 27 -69 -253 256 98 -240 115
4540 115 172 -229 -121 -28 310 35 5 271 158 45 42 115 -41 -220 -22 -131 350 -8 -29 -85 -65 93 -70
4563g0P9l7L4j19K54j4p9P4j09J01l68M25j93o8K33k47j21J44j1N4J54k12Rm5
4587a32K4J36L7j92J15J22L7lOl72M42k96O6O4n8k31K03r6J24J5j0L3R6k95J60
4612eoj72RJ03K11p1j93J23J03j24J14K37j91j40Q9J0qj40l35M18r9nQ1n0m4K52
4638A67o1j67J97q3o0o5K69l33J90K6k41N03l32k20M50k65k56J52n5K71M1j65
4660c7M1l8Q9k8j26J01q8j5R9k39K04j09J58j52j11M18k90o4K37j80o4K66m1J35
4684A66k94L49j26k38M2K99j64k28p9K87j79K22j09j89J25R1k8K7K1r9Q3J36m3
4707G2J3LM7k58K72J5p2j11J6m3J23j52p9L4O1J47j89J06k97M08k94L09j8j89
4731g6K08p1j6J07j15m8j49K38o5J01k84k3M07n0m85K09J22J15j13l6K3o0J67
$$ plain form
4563 -70 9 -28 6 -113 141 127 48 122 13 114 -254 171 -22 -90 143 -104 -225 -81 -92 -38 116 -96 -87 -132
4587 -132 -108 28 65 -127 -12 110 147 144 150 -222 220 -76 -10 54 -4 -235 -32 -128 -4 11 1 34 130 -165 -5
4612 -5 -11 -183 -174 -71 140 69 -124 -1 102 -22 92 329 138 -2 87 97 89 -51 -386 32 -67 -72 9 -41 -85 167
4638 167 106 -61 136 53 -7 -72 197 -136 54 80 -161 342 10 -210 240 -25 -281 -129 -184 87 128 -37
4660 -37 4 -34 55 27 -99 2 -86 -101 -2 -241 -37 -146 12 -140 -251 167 -123 -187 50 -130 -194 72 31 166
4684 166 -128 221 95 -143 -101 198 34 -194 -273 14 -165 57 -52 -241 -116 -25 -53 -26 -5 -104 -21 115 72
4707 72 85 88 135 -123 149 164 92 -19 -3 -46 77 -75 -154 -120 -59 88 -101 5 -292 116 -178 131 113 -76
4731 -76 132 61 45 152 37 -11 -160 78 13 114 -170 -193 214 164 -321 -112 10 125 12 -24 -1 -61 106
4754A06j57l1R1j23K24j37r4J96k9j67K14j21o0l0m5M11j67j16K39k16K5LL3k05
4778a56P6J36Jj82J68l9m6j02K7K77o7l14L85m09K28r5J14K84n09N9J93r9O7j8
4802b1K22j75q0K63k53r6K30j72Q2l18M35k38%K18P6k14J03J18l44J46M0J29l31
4825a80R0J72J2k28j4L0j13K58R0JJ24n3m16K13P6%j49R9j15K16l04L74j18K07
4849B72j05Lk4k51K31j13P4j28q0Q3J28m7p3l1m5l2OJ43K14j40j45J04l7J3j69
4874a49J19J36k4j60J14Q4j69J7P4K05j19j05Q7M9j64J4J29j58j07N6P7K5k64
4897b33J59JK66p0K07l23j12J25K22k57J21j78K06o3O2j16j64j6J08M9J02J47
4919B43l77L39j41n6K4N2k69M37j82j09j08J04P0R6l1k5j22K73n45O19m38L40
$$ plain form
4754 106 -51 -82 9 -114 110 -27 -121 75 46 -121 93 -28 -88 -118 -163 248 81 -35 204 -12 13 16 49 -156
4778 -156 -80 56 57 -125 43 4 -42 -144 -117 160 93 -221 164 -245 -17 -112 2 286 -223 -164 29 -70 -3 -21
4802 -21 201 26 -54 209 -44 -140 90 -82 0 -318 117 -121 -121 97 173 -41 62 180 -164 -18 22 151 -180
4825 -180 -90 82 94 -134 -148 -118 -231 27 117 118 242 189 -227 -14 62 62 -87 12 -103 113 -191 183 65 272
4849 272 167 170 146 -105 126 13 87 -41 -121 -38 90 43 -30 -61 -106 -138 -132 11 225 85 -60 44 7 20 -149
4874 -149 -30 106 82 -78 36 120 -49 -32 42 247 128 23 110 159 -5 9 138 -20 -127 -71 6 31 -233
4897 -233 -74 -73 193 123 330 7 -105 20 242 -15 106 -72 134 71 133 17 -147 -163 -55 -6 96 243
4919 243 -134 205 64 8 32 84 -185 252 70 -39 -147 -43 27 123 92 67 -55 218 -327 292 -146 194
4941A94j33j69K24k31J46j98J83J34j27k08J38O7p0P0M5k10K30j72K2J40j08j85
4963b18J66K3r2r6M34j13ql68J31K32K4m8J42j48j48R6J0j81K1J53k06N8K90q1
4987G3j2k19O4j50K6J39L0P3o0m6J51Q2K2r7k06K2J78Nj32J15j93J63J8j59J38
5012B5L0n0J59j11L5K7k58J88j7j31J46lq1Jk48J91L14j54n4R4qnj21J60R4m42
5038b19Q4K54J02N3l99J13L8k78K46j96L10j1k83q4L15j10K8j51L7n3L09j50K68
5061B23k74K14k54L67j56j24K60k34J69k94m3J07j76J12J36J59q9k12J05J0m6
5082d0J4K61n65M31k52K31n6q9J46o3J03k29L4n5J12J95J5l74K49J20k13K01j02
5105G4P2j07k49L03j03k23M18j1l58L34j70nK06l3j47r6K31MPo6j33n0J44j12
$$ plain form
4941 194 61 -108 116 -115 31 -167 16 150 23 -185 -47 20 -50 20 65 -145 85 -87 -65 75 -33 -218
4963 -218 -52 -29 -121 -217 217 104 96 -272 -141 91 115 67 209 61 -87 9 19 -162 -141 12 -194 -136 154 73
4987 73 61 -158 -94 -244 -218 -79 -49 24 -36 -82 69 151 173 76 -130 -108 70 75 -57 58 -135 28 46 -113 25
5012 25 55 5 164 53 88 115 -143 45 28 -103 43 40 -41 -40 -288 -97 217 63 9 103 95 90 -31 129 223 -219
5038 -219 -135 119 221 274 -125 -12 26 -252 -6 -202 108 97 -186 -270 45 -65 -37 -188 -151 -204 105 -45 223
5061 223 -51 163 -91 276 120 -4 256 22 191 -103 -146 -39 -215 -103 33 192 103 -109 -4 6 -40
5082 -40 -26 235 -330 101 -151 80 24 -65 81 18 121 -108 -74 -129 -17 178 193 -181 68 188 -25 176 74
5105 74 146 39 -210 93 -10 -233 185 174 -184 150 -20 -25 181 148 1 -95 136 140 147 81 -52 -102 42 -70
5129g0K4J03Lj27J00J18k11n7K79k91r4J80O6l6L5R6l77K94k2J65m77K13j59L17
5153G2o5q7J59l38K53K07j32j23K65k30N3j83M51k55R2k58M0L41k03K5j18j46
5175a80K79k35J9n1J06j40P0L1KP9k8R8L2j9K42l15o8J49r9K6p4J01m8J48m2j49
5201f6k3J99R9n30L50k14K41l5k21L15N4J19n11L73k69K24j27Lj51J33O9m0j02
5224a10Q4M8o2J48j88MJ15M0K6l02oR9J22kM7Qq2r4R9M11l37o3J0Q2j72p6K44
5251I3k54J11J1k69J82n9M3R3r1j5K57j33J03k37J66J80k54J50P5l52K56M8J41
5274B45k17q6J5J24J3j00n0R8j21M6Q5K32o6j94J47k5m3l5q8O9K98k64j43L75
5298C15k24Mj19p3j99K27p7M20k20K8j6J46j53l1J30k71L22k38K82p3k63j9L88
$$ plain form
5129 -70 -46 57 60 -67 33 151 -60 -117 162 -129 -223 -43 23 -13 22 118 -259 35 13 178 -299 -86 -245 72
5153 72 7 -80 79 -259 -6 201 69 -54 211 -19 34 -149 302 47 139 -119 -79 262 59 84 -34 -180
5175 -180 99 -136 -117 -168 -62 -202 -132 -101 -99 -20 -48 50 82 63 305 -10 -78 71 -28 -2 -76 25 -23 125 83 -66
5201 -66 -89 110 209 -321 29 -185 56 21 -200 115 169 288 -223 150 -119 105 -22 -19 -170 -37 32 -8 -110
5224 -110 -26 22 -40 108 -80 -76 39 79 105 -197 -203 -104 18 16 63 71 -11 -105 -6 405 68 5 15 97 -75 -151 93
5251 93 -161 -50 -39 -308 -126 -185 -142 -49 -140 -155 102 -31 72 -165 1 181 -73 77 152 -200 56 104 245
5274 245 28 -58 -43 81 94 -6 -56 42 -79 -33 52 284 218 24 171 146 103 68 -20 49 347 83 -60 315
5298 315 91 95 -24 -97 -296 -69 -146 274 54 82 66 212 59 28 158 -113 209 -29 253 180 -83 -102 286
5321B86j86k49M9P2J02N6N1l83M03j58p0J88j44K8o0R9p3n8k4J6J9L09k89l5O6
5346A5j78K90j10J95j86j44L5J85j1j62K2O6J18L9J78l66J12j04J65k52J21j22
5368i4j21J10p1K69L1j52q7J77J24j93k89L06K4q9J4K04l13K57l62M63J9n11M47
5391A63j61j4NP7q2J96k19q4K66o4l28L32J22rl10J0Q9K15m27L6O9J11O8j95Q8
5416d6kjM5j14L81m18M1k8J00J35J91k92J48mk65L45l76K25n4j13J08K2j61K76
5440A43j70J7P0l53J80P8J91j34R6j59j86K71j38K35j85O0j74M87n66L58j23Q6
5462H4j15oJ7J34o8n4jP1k2k19J71j98J24j29K91L8j54K19j87kK9L1Q8j95K31
5487A78O6k37J60j16p7J12j43K15l13PR7J38P8k06K44j17l90L16N0j21J2m4N0
$$ plain form
5321 286 100 -149 -100 -28 74 130 181 -202 201 43 -27 161 17 45 -15 84 11 -47 -71 -55 -36 273 -16 -51 15
5346 15 -163 127 17 212 26 -118 -83 102 91 -71 -49 17 135 174 352 -14 98 -6 159 -93 28 -94
5368 -94 -215 -105 -176 93 124 -28 -115 62 186 -7 -296 10 34 -55 -41 163 -150 107 -255 208 227 -284 163
5391 163 2 -12 -7 70 -12 184 -35 -119 147 83 -245 87 209 200 -110 -100 -11 204 -223 -187 -118 -7 61 -134 -46
5416 -46 -48 -49 -4 -118 263 -155 -114 -142 -42 93 284 -8 140 136 -129 216 -160 65 11 -102 6 28 -133 143
5440 143 -27 -10 60 -293 -113 -35 156 22 118 -41 -227 44 -94 141 -44 16 -158 329 -237 121 -2 84
5462 84 -31 -37 -20 114 46 -8 -9 62 40 -179 -8 -206 -82 -211 80 118 -36 183 -4 -6 23 54 142 -53 178
5487 178 244 7 167 51 -26 86 -57 158 -155 -148 -51 87 165 -41 203 86 -304 12 62 -59 -47 -91 -41
5510d1J68l21J84K21k97M7m1K65k08J28k60J13m3m3j39J37P7P1J33j32k19K15
5532A5%J2j98L70O4o7M6j81p4j46J61J15j86nL0k24L03j67K24L6K2j82k0%J96
5557A44j73j45K02Oj45J79k71j3Q1JL1Q5p6o1J79P6j17j66O1J13P8j2k3r1L09
5582B52j37k15P3j86J28j05O8L79k26j24Q4Mj27PQ3l4m1K82l53R6J19K51k91l5
5606d8J08p4J30j57Ok5j79K05q4K75K1l66M7J24J39j80J90j23j2J44J9N8j34o9
5630A5J2j59J41J00l61K93P5l1l18J56j1k4pJ51K8j95K75m4j11K4P7l0j53O6J2
5655a9k57K74j10L6o5N2j71L93R7l29J94m6j88L33k35J34q0j7l5k1pN5J25j54
5679d1K33j13J9n9k17N00l55k48J33K43l83K22J46J97r0j05R5j38j01K08l33N6
$$ plain form
5510 -41 127 -194 -10 211 -86 -39 -80 185 -23 105 -155 -42 -85 -128 -267 -130 -53 18 151 19 -200 15
5532 15 15 27 -171 199 263 196 242 61 -13 -159 2 117 -69 -74 -44 -268 35 -132 92 128 150 -32 -52 -52 144
5557 144 -29 -174 28 34 -111 68 -203 -216 -135 -134 -103 -18 -94 -155 24 100 -17 -183 -122 -9 69 57 34 -57 252
5582 252 115 -100 -27 -213 -85 -190 -122 257 31 -93 -9 -5 -132 -125 -42 -76 -117 165 -188 -92 27 278 -13 -48
5606 -48 60 -14 116 -41 -35 -60 -239 -34 -118 157 178 -188 -141 -17 122 -58 132 9 -3 141 160 218 84 15
5630 15 27 -132 9 109 -252 41 116 85 -233 -77 -88 -112 -119 32 60 -135 140 96 -15 9 86 56 -97 -31 -19
5655 -19 -276 -2 -112 -76 -141 -89 -260 133 230 -99 95 49 -139 194 -41 93 13 -4 -39 -60 -67 -12 113 -41
5679 -41 192 79 98 39 -178 322 -33 -281 -148 95 -288 -66 80 277 187 82 177 39 -62 146 -187 -131
5701a31J47K4j42o9L23j78l2PJ35pk55J30L12j63j76N7J51j79o1N49m52l10K81
5724c9j71K99O6p2j17j03J60jp3J47q1L0j56J06j66K59J94k89r4K32j54O4L9j66
5748h6L17l24mP6J14j91N5l9m6J86lk50L53j39LJ12j36j03J98J71j83l36M46k53
5772f2r1J38l5J5m1n9O8J8rL95l42M5J44k08J4P3r0K55m22l8L20l86L06m6R9N
5798F6l57L66oN3j11j5k77L95Kj85J51ok04K27K04m61J22J36m3N6j39J32q5K4
5822D5k92J86Q7K9p8J0J92j25k15L23N9k70p1N1R2k00J20J18J12k10R1K3J32l19
5846a10J58j50Q2o7K19j55p9L80k64pK05l28Nm0L9R1n9j7K0J93n8K00k67j96k9
5871b34K17j5K42j16k2j76O6J61j26q7N5M4l9j02J25o4K23j92k33P0j00R9J84
$$ plain form
5701 -131 16 40 -102 -171 152 -26 -58 -51 84 77 -178 -48 264 101 -75 -18 133 -46 -107 442 -10 -320 -39
5724 -39 -210 89 155 83 -34 -137 23 22 -51 96 15 45 -111 -5 -171 88 282 -7 -101 131 -23 41 80 -86
5748 -86 231 -93 -97 -21 93 -98 -43 -82 -128 58 55 -195 158 19 22 134 -2 -105 93 264 81 -255 191 -62
5772 -62 -153 -15 -50 -35 -76 -135 -67 -49 -58 337 -5 40 184 -24 -10 63 -27 228 -194 -232 88 -298 8 -38 61 66
5798 66 -291 75 69 122 11 -4 -281 114 116 -69 82 76 -128 99 303 -158 -36 100 57 113 -26 106 21 45
5822 45 -247 -61 26 55 -23 -13 179 54 -161 162 221 -49 -120 -69 23 -177 -57 61 173 -37 54 77 209 -110
5846 -110 48 -102 -20 -87 132 -23 -102 278 14 7 212 -116 -111 -151 -112 -21 -80 -97 -77 116 58 258 -9 -205 -234
5871 -234 -17 -32 210 94 72 -104 -38 123 -3 -90 -35 9 -30 -132 -7 -71 152 -40 -273 -203 -303 -204 -20
5894b0l2L8j4J87j68k52K97j44J96q2J05p0j94J10j57K54q9J70l85L30p1r0m1
5917a22J28O3j21Q6R9J8l52K6J56K28O1k95j11J07J13k15R6Q4j30R6q1J42j40
5940f4P5M6k01K88J59k45NJ22r6k57N7L1L04M2j15L3k67J88l39K65K4k12P2L38
5964B53p0n6l31J72J50j14L1k92L42j13j8l1K06k26M1K64k12J9p7K7K4R2J06j77
5988A0Mr5J58o1k47K04l2J99J4j02k50L13k02J35k0n5K64j96k33n1L23n2kO5O3
6013A54l26K31j25M11j84j28j22L4k8L24Ml49K07l24K12J06j08R8m8p1r8kK66
6036A34k60K35j79K34k29K8L11j62k00L19k51o8J48qk5L9j64K86j49rn8l39N38
6059A71j14q4J2n1m3M2J53n9p0j50K36k56K33J06o5j18K09j74j07L71k97jn1J55
$$ plain form
5894 -20 -52 -14 -28 159 -9 -261 36 -108 88 6 111 41 -153 -43 -200 54 -35 135 -250 80 9 -81 -122
5917 -122 6 69 -52 34 133 151 -201 -175 -19 209 270 -25 -136 -29 84 -131 -35 49 -81 15 -66 76 -64
5940 -64 11 57 -144 144 303 58 63 185 89 -168 -111 -80 224 266 151 184 -83 105 -234 31 55 -157 -85 253
5964 253 183 127 -204 -32 118 4 35 -257 85 -28 -46 -77 129 -97 -56 208 -4 15 -62 -35 -11 81 187 10
5988 10 14 -81 77 16 -231 -27 -59 140 154 52 -198 115 -87 48 28 -27 237 41 -192 -243 80 28 26 91 154
6013 154 -172 59 -66 345 161 33 -89 -55 -83 241 245 -104 103 -221 -9 97 -11 87 39 -32 -130 -132 134
6036 134 -126 109 -70 164 -65 -37 274 112 -88 231 -20 -88 60 52 27 66 -98 188 39 30 -28 -367 171
6059 171 57 -27 -15 -66 -109 -67 86 27 -43 -193 43 -213 20 126 61 -57 152 -22 -129 242 -55 -56 -107 48
6083D8m2K34m56L51q0k11P9l5J34K14l21J97j37j8J00k21L23k24J60J46k29k89
6105b77L07Q7k70K08M1j99k31L44J34m3kk33j41M5L44J4k76J10j60m1M95k83J51
6128A24l20Q5L00k82L72j99L1J42j76q8M9R8p8k47P6J13Q9k65J71K6n5J55j31
6151a0K1m7K7Q7N3k63O3J15N6r4j38K65m1k0j76M2J8K53k28j02J26j93p6L26M6
6176A10nr4O5l20K12K28p4l72L21j61R3k43J02m0L06j25J59Mk30J04k04L29j90
6199b5n0J84m8j03j65K53j48j33K78j69K05J94k29o0O4l7K04q6j48j15J33p1K36
6222A64k22J00k84K49j14k95N81n61J14K20j4J67j21J09n2p0n9J09L2M5O8o6r
6245I1o2l32K52J50mj03pK07j15Q6l26J00L38j99J5l64L38L8k62J55L5j15K2N8
$$ plain form
6083 48 6 240 -216 135 55 -156 -77 -112 22 236 -85 112 -25 -43 57 -164 159 -65 95 241 12 -277
6105 -277 30 117 -153 55 96 -103 -334 10 144 101 99 -134 -275 -230 114 128 -148 -38 -198 -239 256 -27 124
6128 124 -196 -111 189 -93 279 80 111 253 77 -11 38 136 58 -189 -113 0 89 -176 -5 21 -34 121 -10
6151 -10 11 -36 -9 78 131 -132 -69 46 102 8 -130 135 94 74 -102 -60 -42 211 -17 -119 7 -186 -262 64 110
6176 110 105 11 76 -244 -32 196 122 -250 71 -90 3 -240 -138 -178 128 3 162 166 -64 40 -164 165 -25
6199 -25 -75 109 61 -42 -207 46 -102 -235 43 -126 79 273 44 -16 48 11 215 129 -19 -134 -1 -72 164
6222 164 -58 42 -242 7 -107 -402 179 -382 -268 -48 -62 105 -16 93 41 -29 -88 21 53 98 166 100 91
6245 91 29 -303 -51 99 95 -8 -15 192 77 163 -163 -63 275 76 91 -273 65 103 -159 -4 31 -84 -62 -4
6269dJ77l81K25K22m38K08J52l04J94n8l7M3O7Q1k51r9L12j36l7rJ83n9l13L5
6293b27J87K1L6j72J35l5J12l5J84j96n0j10Q6L2J06l4J03j15l19L17J92j81r2
6316e5R0P0L8j88J46l5N4l5M9j59R6o6J11K30m67K68j02R7N5k03j36J80j12J76
6340A02j23j2K62m42KK30j20J9N4j6K45k19J5J6j79J34N6n8j1O2k1K5R2K6l37
6365a98L10k77kJ60P1j5N3n2j7J7L9j55r1Q8o9K34K2mJ10k05J08rR5L5p8k12Q0
6392C8p2J44jk03O3j90K69N9M3j14o6J6M0M6K05k17k64R4K32o5r3N9o7K79m0k75
6418h0K01m9j93J15J19n8q8P4K8J56l02l36N63j73N5o2r4L45l16L89m21L39K1
6441B33j49jm4n3L8j33J92o4m2j14P4K89mm58L26k57K16L9k51K1J70m0J41j14
$$ plain form
6269 -4 173 -208 17 239 -199 9 161 -143 51 -7 -44 -1 66 147 -104 -203 109 -27 -64 -73 110 51 -262 -227
6293 -227 -40 -19 17 -155 -20 -55 57 22 206 10 -40 -150 -64 -32 74 40 143 28 -291 26 218 37 -55
6316 -55 35 105 143 -45 101 66 120 85 134 -25 71 5 116 346 -121 147 45 142 197 -6 -142 38 -74 102
6340 102 -21 -33 229 -213 -211 19 -101 -82 -28 -44 201 -18 -3 13 -166 -32 24 -34 -45 17 -4 21 113 139 -198
6365 -198 112 -165 -167 -7 64 49 102 50 33 50 89 -66 -157 -69 -138 96 118 114 224 19 127 118 213 248 170 -42 38
6392 38 -34 110 109 -94 -31 -221 48 107 150 36 -30 -14 26 72 277 60 -204 -110 122 57 -36 23 -44 235 195 -80
6418 -80 121 72 -121 -6 113 55 -33 41 69 225 -77 -413 150 -23 32 -30 -124 221 -95 294 -127 212 233
6441 233 84 83 39 -14 24 -109 83 19 -23 -137 -63 226 222 -236 90 -167 49 88 -163 -142 28 -12 129 15
6465A5K5Q5j46o5p0J05m7j7j4K84l05J60k10M11m3j76mr0n0J99r7l0j00J57qj42
6491a73K37j10O1p0L22l87R2P1l32M03k16J67j88J32n0Mn5J33J53j32Q1k18j20
6514a95J79L1p6J23J05l75J86L11j95j88j00N18m11K71j55K10j83J02l05K28n
6535G6n1Rk50K40L1j66M89k27j20Qqj29J39j59K17qN4k66K8Q8k0j65R2M1j41M14
6561B16k02kj13l9Q1p5j8O9k01N91j93m11K91Q3k61l8j11K42R9q9P1l06K90l7
6585f3oJ50j24o7K68l40N9J52m0k57L04j18J35q4J40j12J21O2j19k72m8J69L34
6608B44l42K45j21m8L67l68L7n2j86Q3K51j60K66j76N0P1k4m3j44k3J3j63K1L8
6632a64J94j6j52Q6R5K32l62J50k39J59K20k83R6p1k22L09m7R6j30J9o1J43J22
$$ plain form
6465 15 40 125 -21 -86 -156 -51 -98 -115 -129 155 -150 10 -200 211 168 -8 -12 -102 -152 47 -50 -80 -180 -23 -31 -173
6491 -173 64 -46 15 -55 267 -120 -28 43 -289 114 -102 65 -123 9 -41 -37 -92 41 194 62 143 -75 -195
6514 -195 -16 15 -61 62 167 -208 -22 289 94 -94 -194 324 -87 184 29 239 56 158 -147 81 76
6535 76 25 34 -216 24 55 -111 378 151 31 39 31 -98 41 -118 99 91 145 -121 -93 -5 -25 -190 -98 -57 -198 216
6561 216 14 12 -101 -140 -59 -134 -152 -83 -284 307 114 -297 -6 77 -184 -222 -333 -91 8 -81 -10 -316 -26 -63
6585 -63 -69 81 -43 -110 158 -182 -123 29 -11 -268 36 -82 53 -31 109 -3 118 180 61 -211 -259 -90 244
6608 244 -98 147 26 -22 345 -23 14 -38 -224 -141 110 -50 216 40 90 161 137 94 -50 -73 -60 -223 -202 -164
6632 -164 30 14 -138 -52 43 275 -87 63 -176 -17 203 -80 16 -55 -277 32 -15 81 -49 -30 -91 52 174
6655A74k0l27K34l61J87K18m95L66O1KrM6j5K35m72L58j75q9L8J79j48Rl7j38
6679a79L83j73L2j70J37k24K89j57L33k66M2k8N3L6m13L44J16j24j16K03k14R1
6701eO4j52K2%rM7K9j07K42j0j28Nj95l2Q8k3K4J03m1K8K92m65K88j91M4RJ30
6728E7j4j85P3q6J94r7lJ3J6j11M0J11k45J78J36j12Q4J67ok85j71K17Q4j10p9
6753a34M19m44K56j64k9J07Q1k11L34r9Kk14J16L8k9k25L1K55j86O5kK33l04j00
6777b04L63j45Q2j68J00k00K10q1M1K7p6l98N55l28J87j9J79k11K3k77N75l72
6799a37L87j5k32J25j86P0j6J50j07P4o4P3j87J23l02K50j40K64j80K5o7L10o2
6822A56K4j33p3J46j03n3K9L8p1J86k34M5K2K70k61k35J83J12k50L42k31J49l61
$$ plain form
6655 174 154 -173 61 -300 -113 105 -390 -24 37 39 30 76 61 296 -176 182 7 -82 -44 135 -13 -4 -41 -179
6679 -179 204 31 63 -107 30 -194 95 -62 271 5 47 19 72 108 -305 39 155 31 -85 118 -96 -5
6701 -5 59 -93 -71 -71 -80 -33 -4 -111 131 121 -7 -2 -197 -229 -141 -164 -140 -37 -78 -50 242 -223 65 -126 -82 -73 57
6728 57 43 -142 -69 -155 39 -58 -61 -48 -32 -143 -103 8 -237 -59 77 -35 49 216 210 -75 -246 -29 55 -55 -134
6753 -134 285 -159 97 -67 -96 11 92 -119 215 116 118 -96 20 58 29 -196 -165 90 -96 -31 -33 200 -104 -204
6777 -204 159 14 96 -72 28 -172 38 -43 -2 25 -51 -449 106 -222 -35 -54 125 -86 -63 -340 235 -137
6799 -137 250 235 3 128 -58 12 -4 146 39 113 49 122 -65 58 -244 6 -134 130 -50 -25 -92 218 156
6822 156 180 47 -26 120 17 -36 -7 31 -40 146 -88 -43 -21 249 -12 -247 -64 48 -202 140 -91 58 -303
6845c03K85J14n4q8%l9L1K62q0p6k4J13K2J14k24K01k83J19p3L59l78p5K83j56
6869E0k69K65K48j23k01J29L0j32M2l2q2K63k78l4P6p5L0K5o9K77j74k1J6O2l2
6894ij44N4K32j23M2j02J69j86J25k46J30N1j50K18qj43K06j18O2n9jr4J00p7
6918g1K68j93M03o21J21L5J01M0j66J55L4m1N1j91q6R1n9Q8p5L43l40J41o6K42
6942B04j57oj09N4R4P5j45J1j63m5K39K15j50o3LJ63l45J18J66k94qJ39P3j22
6966e3K64l75K23j96K54k69P6p8J89j95J27p5j3JK11j90J57N6o3q5m0n5K05j98
6990a22M88k69p8R8l8j54J60N4N2r2j13k33L30j73K02l23L05j41Q1l9k9K5N8r7
7014d8p3L1R3j56R6J75j17N7M3N7rK9l47J69k15K58j11m4j66J55K58l18K8J46
$$ plain form
6845 -303 -18 96 42 -46 -46 -85 -54 208 128 52 28 141 163 277 53 254 -29 90 17 376 -2 -77 206 50
6869 50 -219 46 294 171 -30 99 129 -3 39 7 -75 188 -90 -124 -48 -123 -93 -68 -137 140 -34 -55 -39 23 -9
6894 -9 -153 -99 133 10 52 -50 119 -67 58 -188 -58 -7 -157 61 53 -90 116 -2 60 1 0 -94 6 -71
6918 -71 197 4 407 -214 -93 -58 43 83 -83 72 106 65 116 -75 -161 -70 -129 -41 -116 227 -113 28 -38 204
6942 204 47 41 -68 -14 80 155 10 21 -142 -187 52 267 117 54 57 220 -125 -7 159 -135 -143 -4 69 -53
6966 -53 211 -164 59 -137 117 -152 -76 -154 35 -160 -33 -108 -121 -120 91 -99 58 114 51 -34 -74 -129 76 -122
6990 -122 366 97 19 117 79 -75 85 139 191 99 -14 -247 83 -90 112 -211 94 -47 34 -5 -34 -9 49 -48
7014 -48 -121 -90 3 -153 -57 118 1 58 101 158 149 178 -169 0 -215 43 -68 -112 -278 -123 135 -183 -155 -9
7038iJ40j47m6j7J07J36j23l25M74j1K7j82j23j65L28N3k80M72l26j74M48k98
7060d1J29j88K13k99P3J69m5k06K8J37J01k53K72J4j23J83l09K11j01m5J07J9
7082D6k31J62K39k15r1N0n7M7j59K50J40o5r1k71K43j53n3K03k8K8jR9j63Q0j1
7107bO8J99m8j65o0k25L00j09L4j52J10j02J06j97O1LJ88j46R5n0J9J83o3nj70
7132a28K02j83L50l02oJ24p2j60N0J4L00k48J04j19O5l31K10K45M2j43J9P0p3
7155C0J72m6l84K86P5j98K80j78j85J38J01m1q5j68M05P7k57K00j46o7K4n3K96
7178B76k77M7j16O9J24n1R1k87n6L89l67j5K26m5Q5r8l19L15K49k47R0j58K35
7201A60n5P4j11J51k31k95K70J95j82o8J65N0lj80j15L98j52J14j68n7n8K9k7
$$ plain form
7038 -9 131 -16 -62 -79 28 164 41 -284 190 179 206 24 -99 -264 64 117 -163 309 -17 -191 257 -41
7060 -41 88 -100 113 -186 -113 56 11 -195 -167 -30 71 -182 90 104 -19 164 -145 66 -35 -80 27 46
7082 46 -185 -23 216 1 -90 -40 -97 -50 -209 41 181 116 25 -246 -3 -156 -209 -6 -34 -6 -7 92 -71 9 -2
7107 -2 66 265 217 52 -8 -233 67 -42 -8 -160 -50 -152 -46 -243 -182 -179 9 -137 -42 -92 -73 110 47 42 -128
7132 -128 74 -109 241 -61 -67 57 -15 -175 -125 -111 189 -59 45 -74 -9 -340 -130 115 157 14 33 103 30
7155 30 202 156 -228 58 133 -65 215 37 -148 -10 91 50 -35 -203 202 279 22 222 76 9 33 -20 276
7178 276 -1 46 -70 -1 123 72 163 -124 -180 209 -158 -173 53 8 93 -5 -324 -9 240 -7 83 -75 160
7201 160 105 179 68 219 -12 -307 -37 158 -24 -92 73 123 120 -60 -175 223 71 185 17 -40 -98 -69 -96
7224i6K9J2J86k88K25l8J07K6j37m9m2j00L24k22J45j62P6j89J90P6j44l6N8j8
7248f7L29k02K1O4j38M1N0N6r7m8J34k36J69j34L87l91PO5k00K68r6K68l29J42
7272F3r2P8lj1q2L5q5J28j23L3nK17p6R0j22j5nJ27j52j4l74K77K92k08J6R6j41
7299e6K58l59K94M2j52p2K0J67m8r6j68K16o4J1o8J13q9L7K64n5l69j13K84j7
7323b0j93J33J66o3kQ6l11O25m67J00k2r1M9K11k13K16m51K51r6N4j32j5J32R7
7347D4l8J04j39J81l90O0J48K2j49K81j27j71j51K38Nj13M20k47P0k2k01M7J84
7370E6j67J63Lp4L9J0p0p8mK45R9kr3J04k47n1J81K6j57m9J37N4k81M00k27j72
7396a55K25K8M5m1R5k98j0L87m51J11J84Q5k37r6M0K31k05J00P1n5j81J8K34J14
$$ plain form
7224 -96 -67 -55 131 -157 68 30 137 163 26 -23 -65 -165 159 -63 82 -80 -4 -193 -3 73 -71 -107 -49 -67
7248 -67 262 60 81 145 7 48 98 154 57 9 143 -93 76 -58 329 -62 -55 10 -190 78 -18 250 -79 63
7272 63 -29 49 46 35 -47 -12 -97 31 -92 -59 -64 153 77 167 45 30 25 152 0 -14 -388 -111 181 -27 -11 85 -56
7299 -56 202 -157 137 179 27 -45 -25 142 94 -2 -170 46 -18 -7 -75 38 -51 -14 250 195 -174 -287 -3 -20
7323 -20 -213 -80 86 23 21 107 -204 421 -46 54 32 -59 -10 201 -12 204 -247 4 -92 -38 -170 -185 -53 44
7347 44 6 110 -29 152 -238 -178 -30 -8 -157 124 -3 -174 -325 -87 -82 -195 225 -22 48 26 -175 -128 56
7370 56 -111 52 55 -19 20 30 -40 -118 -122 123 222 220 127 231 -16 -67 114 140 -17 -66 71 125 -156 244 17 -155
7396 -155 70 98 143 102 197 -101 -111 276 -175 -64 120 205 -32 -128 -88 143 -62 38 109 54 -127 -109 125 239
7420B39k36m4j29J51P6j71P5j25J61k3MK88l01j22Q0M8O6k27K55J59k66J35n6
7443C7J73j58k7J78P2m06J7Nl5L01k06j18L91q5j68K73j71l6k47J48o9j03O5K17
7467D8l5k68K21j46J74l0k86M64j43n5j20Q3Q6l3K3P8j45K34l70K94k35K6j2K69
7491A22J18k54r2J83j09k76N96k53n0K9p9J3Q3q2r6P9RQ5J3k56L20j75l4m5m7
7516a98L36j26k43J41K71n3k00R2J18o6j95N2K11j56kK01k32P6j04r3j25L46j96
7539a45M2J22J0RRK39o49K55j71k4J76J23J61k21l3k85L83jJ64j21j31j41K41
7562A2J66k0o4k79J99o1j23L06k56M2J5R6j74J00L1j05Rj6K08n3qKk7j22R9p7
7588a00L51j63j31O0q7K9J16m8J83j13Q6k27p8J46j22K54j09l59K71K58j72j1
$$ plain form
7420 239 3 -41 -170 -19 57 -114 -39 -164 -3 -26 -22 266 -35 -157 -77 -29 37 -190 65 224 -42 93 37
7443 37 210 52 25 203 275 -131 -114 -109 -144 157 -49 -167 224 139 -29 244 73 37 -210 -62 -131 -234 -169 48
7467 48 13 -255 -34 -180 -6 -36 -322 142 -1 -56 -176 -93 -7 -40 -17 61 -84 150 -220 74 -161 -135 -147 122
7491 122 240 -14 -106 77 -32 -308 288 35 -15 14 -65 -52 31 -51 -147 -68 -59 26 39 -217 103 -72 -106 -151 -198
7516 -198 138 12 -231 -90 181 128 -72 20 138 72 -123 -71 140 -16 -18 183 -49 27 -77 -170 -295 51 -145
7539 -145 -103 19 29 38 47 286 -363 -108 -279 -303 -127 -4 157 -64 -97 -382 1 0 164 43 -88 -229 12
7562 12 178 158 94 -185 14 -47 -170 136 -120 -78 -63 33 -141 -41 -10 -115 -106 -122 86 33 25 27 0 -122 -23 -100
7588 -100 251 88 -43 17 -70 -41 75 27 210 97 183 -44 -122 24 -98 156 47 -312 -41 217 45 34
7610C4m9J93l24L7l5L5K22L9j74l2J47O8l27j1L44k18P6j13L23k18j08j1R2J21
7634A11j61j94K92p3K40k59m6k31M01R2l07O6K12q1J85k32J02k59Q3J73k94M11
7656B31j67j6Op3j70K37j60J27J18k92J83R7k63K38j75NJ91j61J12R0n4l1j42
7679f9R6k26R2K74l34K3J05J35l0r2K07j40j14L55l09M1j9o2K50j86K60j89q2
7702a4q5N0j93J09J70j33%M2k68J35J78J03j91R3K0l4J58j51J8j5kq2K27j36R
7727Hj01O5j62J12L60k40j95L76l07M6q8Q0l7K63j99J25Q0l51K22j7J2K9qm4m4
7752a5k72J6L57Kj4r0m6P4pJ61k79R2R2qj50J12k7O4J37q4Q3k53R6o4J80m5r3
7779A9K1o4j4j02J80n4l2J67j79K75P4l53j02J26K38j65j44O9ok07J4J20K80L5
$$ plain form
7610 34 -15 178 -146 -109 -144 -109 113 152 -22 -54 93 161 -166 -177 167 -51 25 -88 235 17 -91 -102 -10 111
7634 111 -50 -244 48 -25 215 -44 -90 -321 80 172 -135 -69 143 62 247 15 117 -142 -59 114 -180 231
7656 231 64 48 54 -19 -189 48 -112 15 133 -159 24 121 -142 96 -79 -74 117 -44 68 158 104 73 -69
7679 -69 27 -199 -107 167 -167 -144 -39 96 66 -26 181 41 -73 282 -27 14 -5 -67 183 -3 257 68 -14
7702 -14 -99 -49 -242 -133 37 -96 -96 -54 -322 -187 -9 94 -97 -4 16 -18 140 -11 7 -8 -10 -92 135 -1 8
7727 8 -93 -28 -190 -78 282 42 -153 223 -84 -38 -126 -46 -83 180 -19 106 186 -165 57 40 52 81 73 29 -15
7752 -15 -287 -271 86 88 74 -16 -62 12 5 166 -113 -21 71 63 -87 25 -2 62 199 115 198 -55 41 -23 157 112 19
7779 19 40 -24 -38 -140 40 -14 -46 121 -58 217 291 -62 -164 -38 200 35 -109 -40 -46 -253 -239 -119 161 196
7803A96n3k68K17j40o0p0J41j91K32P1j29K63l53J78o0K72n4l13m4K08l36K2l
7826b74L37m0o6N5j47K8J44k7k89J69J36rk05L29l13K13l5rO2j27j06k1L34k92
7850a53K04KJ65o2m40L75j1N0k01L6l1J03J97m16j29K07M74l90l8nJ94P6l1j81
7874ej51J11q3j42L47J0k70m3L52j35K60k21j48j79J05L78k81P2J13j58J69J1
7896A12L4j56m34N38l44K34K11k40M9p8j02P5J19p0o8K26L6o8%k11J07j29K69
7919A10j29m8P1j29J75J23j90o3J90l86K49m7J25k32k84M33P5l12L32j41J5Q8
7941B5M5j53j2J13p3J44M2K09j46k38J27r5J55L4l20L73k20J5N7k20J20L03j86
7964I9j20N3O1M3k2j34P2m5j16J40J87k67o1L07j21M7k59J76J46k11p5K47k89
$$ plain form
7803 196 143 -125 92 -48 -108 -178 -37 -228 4 75 -54 209 -144 34 -26 246 192 -121 -165 43 -293 -271 -274
7826 -274 63 23 -43 12 -135 -107 37 10 -279 -110 26 17 -188 141 -172 41 6 -3 59 -68 -174 -195 139 -153
7850 -153 51 53 218 156 -284 91 80 130 -71 -35 -66 37 234 -182 -311 -104 370 -20 -58 -63 131 207 176 -5
7874 -5 -156 -45 -128 -270 77 87 -183 -226 126 -9 251 30 -118 -297 -192 186 -95 -23 90 -68 101 112
7896 112 146 -10 -444 94 -250 -16 195 -45 4 -74 -176 -101 18 -52 -120 106 142 74 74 -137 -30 -159 110
7919 110 -19 -67 4 -125 50 173 -17 -80 110 -276 -27 -74 51 -181 -465 -32 43 -269 63 -78 -63 25
7941 25 70 -83 -95 18 -55 89 131 340 194 -44 83 -12 143 177 -143 230 10 25 82 -138 -18 285 99
7964 99 -21 32 93 136 114 -20 52 7 -109 31 218 -49 -110 197 76 123 -136 40 186 -25 -100 147 -142
7987a42J39j09L0J22K69n29RJ47j62L12n5Q8k18K69j72ok18J19L4K79k58K27J71
8010C46l79n1R4K04l64J05J10J22k49J80j08J9k50L01J16k9j3l27L38oq4K28l73
8033g0J42m8o3Oo8QP5o0J72j13M3p6k88M87l8k59J77j53k4K19j43j1L12k23M4
8058D8M8k62L28r5P8K6j04Q2j18K93k32j0o9j76K35j34n4K12J18l70J48K3l10
8081b95N49m77L15k25M3J01p9j38K68N9L05m97N3po0j56K55nJ89j35K6n5J28j11
8105E1j01J01k85n3L50J03j92L12l42m5Mo6J30m1K81m5J2j67qK7o7o8J66J99n30
8130b74K64j82N28k67j35K07kl42J74J78k44n3K82j92j12K19j73J02k45J74M5
8151d8L6J45j20p3J0k6J51P9l09O0J31j08P3r8J51J16J21k98j81J37L99m14J10
$$ plain form
7987 -142 -3 -112 -82 40 309 -220 -211 -64 -226 86 31 119 -99 170 -2 -8 -226 -107 -73 206 -52 175 346
8010 346 -33 -84 10 214 -150 -45 65 187 -62 118 10 29 -221 80 196 167 154 -173 165 159 75 303 -70
8033 -70 72 24 -39 -33 -101 -93 -18 -78 94 -19 24 -52 -340 147 109 -150 27 -126 -150 69 -74 -85 227 4 48
8058 48 96 -166 162 67 145 171 67 149 31 324 92 82 13 -163 72 -62 -116 96 214 -156 -8 15 -295
8081 -295 254 -223 92 -133 -90 11 -68 -206 62 121 426 -71 -18 -25 -85 -241 14 9 198 63 89 34 162 51
8105 51 -50 51 -234 -287 63 166 -26 286 -56 -101 -97 -163 -33 -74 207 162 174 7 -1 26 -41 -109 57 256 -274
8130 -274 -10 -192 336 69 -66 141 139 -203 -29 149 -95 -148 134 -58 -170 49 -124 -22 -267 -93 -48
8151 -48 -12 133 13 -60 -50 -76 75 154 -155 -95 36 -72 1 -97 54 170 291 -7 -188 -51 348 -66 44
8174D4k14K57k18q3L1K8K8J88k27K3J37l1oj28K16m6m5
$$ plain form
8174 44 -170 87 -131 -214 -183 -155 -127 61 -166 -143 -6 -37 -43 -171 45 -1 -46
8191d6
$$ Imaginary data points
##PAGE= N=2
##DATA TABLE= (X++(I..I)), XYDATA
0@%%%%%%%%%%%%%%%%%kJ0j6J6j6J6j9K7l2L4m2M8n6O4p2Q3r2J05j20J36j53J71
39I0j89K09k33K60k88L18l52L90m30M74n23N75o33O98p69Q49r39J039j152J284
59F78j438J619j838K106k445K891l507M422n960R265l4044K2434Q313n655J5342
74A2183o292K0221l2422N903m386n930M628m158J3697j603O937r32p906O179o996
89h77j435n756P014J078m191K927M276J275m782L521l36j691l424j400J920k644
105d525M330j061L831J547o27j324m733K938m471nK118J866M447l674L229k032
121A854k108j809k306L182o15K896M80J426J17l174m31k089Q68m34Q13J989J229
138A888M89j681N86j629p30j115P42J352n31J780l00J376j118p80K07j715M92
$$ plain form
0 0 0 0 0 0 0 0 0 0 0 0 0 0 0 0 0 0 0 -2 8 -8 8 -8 8 -11 16 -16 18 -24 24 -32 32 -40 43 -49 56 -64 72 -81 90
39 90 -99 110 -123 137 -151 167 -185 205 -225 249 -274 301 -332 366 -403 446 -493 546 -606 678
59 678 -760 859 -979 1127 -1318 1573 -1934 2488 -3472 5793 -28251 -5817 2496 -3159 12183
74 12183 5891 26112 -6310 -407 -4793 -10723 -6095 -10253 3444 1841 8778 7846 -60 6119 -877
89 -877 -2312 -8068 -1054 24 -4167 -1240 3036 4311 -471 3050 2714 1023 -2401 -3801 -1881 -4525
105 -4525 -195 -1256 2575 4122 3495 2171 -2562 376 -4095 -4100 -1982 -116 4331 657 3886 1854
121 1854 -254 -2063 -4369 -1187 -1802 1094 1574 3000 3117 -57 -488 -2577 -1709 -2143 -1330 659 1888
138 1888 2377 696 1282 -347 -1077 -2192 -1450 -98 -629 1151 851 2227 1109 329 536 -1179 -687
155f87j483J261K59L0K039p35J684j318m14n87j837L14j169J374R89Q38J921o36
173A843P87j934r03j311j262J023R7J863J014J027P89j259p13j311j585j32JR45
191a021Q14J094O50q1j83q76j010L4p52m0M25M67J264j81N14l72k68k15n30k06
211d73n58K41L13L04P50k54P08k27l53l58m84J53l53K7L67K05M48J58r3l69j34
232A8j11n04L6J90K84J35J15k95M74l02J37l26q0L13j%k24K83j90k41M74l29K82
255A38k82q4L50j13J83p15L10P3r1K36k0J96P2l6J15n39K48l21K23J10m7l9K22
278A89J18j49N4j00m87O6K30l46J48R6L96J07M4j02k15P9k21m25K76j39L15O1
300eK60L04l79K11m50O9k50j26J59J43qL80k68J35J16k49k20M0j47N5K37J3j09
$$ plain form
155 -687 -2170 -909 -650 -620 1419 684 2368 1050 636 49 -1788 -1474 -2643 -1269 -280 558 2479 1843
173 1843 2630 696 -207 -1518 -2780 -1757 -1660 203 1217 2244 3033 1774 1061 -250 -1835 -1967 -1966 -1021
191 -1021 -207 887 1537 1456 1273 397 -613 -579 -1331 -1371 -946 -479 785 604 1118 746 478 263 -267 -473
211 -473 -1031 -790 -477 -173 577 323 1031 804 451 93 -391 -238 -591 -564 -197 8 456 614 521 152 18
232 18 -93 -597 -561 -371 -87 48 163 -132 342 40 177 -149 -229 84 83 83 -141 142 -48 -289 185 -144 138
255 138 -144 -228 122 9 192 -523 -213 -140 -231 5 -15 181 253 217 332 -207 41 -280 -57 53 6 -33 189
278 189 307 158 212 112 -375 -309 -79 -425 -277 -181 215 322 366 264 49 128 -93 -518 -242 -381 -66 -5
300 -5 255 559 180 391 -59 10 -240 -366 -207 -64 -72 308 40 175 291 42 -178 -138 -285 -230 7 20 -89
323h9J78j45R1L7m6l0M9k8j12k4J26j73L67j56m6K48j44j53J92o3l33k9L77j53
347e9J30k34K97J0l0k1kk3j77J68j60L62n39N32j70P0M9j20J89l49P7j71j64J47
371a88K81j15J68rq7j50K34k41j80M66j59j10J89m7k6j46J5J04O0J4j36J14Q0
394A31j61J69k08P5r5K18j06q0j09R6m7J28P2O3r3k76J45P5N7j93l0K9J13R7j6
419E4J14l7j15p2K3j33r2L11J70k26J35j96o0M0K02j68K9k5m2J67k31j46J80J22
443Dj24j14J55L78o87N42k76k8R7Pm3J29n2J02j6k47K7J98j00J17J11k86J09L58
467C61k74l5J78k27j4l1J80j95K14j66l1j11J27k32M21mj36J11j32R4mJ53k29
490A8K5J19k42j12O2K12o1MQ4l3J68k60j3J77Mj27l27M78k88J55J66p4j99P7R6
$$ plain form
323 -89 89 -56 35 72 26 -4 45 17 -95 -119 7 -166 201 45 -1 247 103 -50 142 79 -254 -283 94 -59
347 -59 71 -163 134 144 114 93 91 68 -109 59 -101 261 -278 254 84 154 203 83 272 -77 0 -171 -335 -188
371 -188 93 -22 146 137 50 -100 134 -107 -287 179 20 -90 99 52 26 -120 -105 -1 59 73 -63 51 131
394 131 -30 139 -69 6 -89 129 23 -57 -166 -70 -117 11 83 146 53 -223 -78 -3 54 -139 -169 -140 -27 70 54
419 54 168 131 16 -56 -33 -166 -258 53 223 -3 132 -64 -124 -84 118 -50 -21 -46 -88 79 -152 -298 -118 4
443 4 -120 -234 -79 299 -388 154 -122 -150 -53 -46 -89 40 -12 90 74 -173 -146 52 -48 69 180 -106 3 361
467 361 87 52 230 3 -11 -42 138 -57 157 -9 -40 -151 -24 -256 165 161 25 136 4 98 94 247 18
490 18 43 162 -80 -192 -130 82 21 25 109 76 244 -16 -29 148 152 25 -302 176 -112 43 209 135 -64 13 109
515A09j71j6K05q0K20n8m5j32j19m7r7K48p4O4Q5nJ61k84J7p3N3M5l9N0J88p5
541A30O2k66K54k67R6%k73L67N0k79M0J13k07N5j13J05R0k35J47L89k09K3j49
564g7J44j91K28j82L3J22k74L84l5k8l44J88J30l0k02Jj53N55j2k77J64l22J72
587fJ06k72J05L2j32lK98k69K32k00j92M79k70m5j12J46n3K77j70mK51j74K0k23
611a79L87j45K3k5o9J38l01K74qo0L6L1j1J32k04q8N3k2P5M2N7j74j55R1J51r5
637d6k5O2J84L0q5p8j69j42M17o5j36L58k47J13k56K18o1k52J06K46k26J52o1
660C7J38j96l7k26K56J04J4j3j65J7K15j30n9M4K35l56Q6qR8N2J2j90JL05k18
685A6J31l05L33k65Q4Oj99K24r1L79o60K78J43n8j77L36k14j8p0J09K20k88J12
$$ plain form
515 109 -62 -78 127 47 267 209 164 32 -87 -134 -231 17 -57 7 92 87 248 -36 -19 -92 -39 6 -33 17 205 130
541 130 192 -74 180 -87 9 9 -264 103 153 -126 -86 27 -180 -125 -238 -133 -43 -278 -131 258 49 72 -77
564 -77 67 -124 104 -78 -45 77 -197 187 152 124 -220 -32 98 68 -134 -133 -286 269 257 -20 144 -178 -6
587 -6 100 -172 -67 -35 -167 -170 128 -141 91 -109 -301 178 -92 -137 -249 -103 -156 121 -49 -53 198 24 44 -179
611 -179 208 63 86 61 -8 130 -171 103 95 35 71 102 91 223 19 -69 -16 -38 37 79 136 -38 -193 -102 49 -46
637 -46 -71 -9 175 205 120 42 -127 -269 148 83 -53 305 58 171 -85 133 72 -180 -74 172 -54 98 37
660 37 175 -21 -58 -284 -28 76 90 77 -88 -71 144 14 -45 -1 234 -122 -36 -44 54 106 118 -72 -71 234 16
685 16 147 -158 175 -90 -6 0 -199 25 -66 313 -347 -69 74 16 -161 175 -39 -57 -127 -18 202 -86 26
708B6P6j62q1K77k71j42M17j40k25L40j79j20q4K79k87K91k46N49r0l08K00j31
730a1j29J75j24L22l97J17J38l79L97k45J05J89j96O1N6j41O6o3L35n49J74Rj09
753a99K16k37K33J41r3j23J85k45R1n9L10k24K7q4j91K51P2k03J53O7N2p5p9o
777b0K0K22n9n44L80m1J25K08k34j64Q7p6J67N6p3j30m9R5K20r2j22J28k67L29
801A66j18m9J05j12P3n8j80m8J58Q2k68L16l0Oj49j18K43N4j04j00J07j44j3L66
825A85q5j37O3o9P0J0q0k8Q5r3K17q3k76L35j48J6o8n0J45J33q0m7j04j2J89k52
851a64K46o8n3r6K36j8o4Q2j89K14Jq7K75k95J0j41k2O1J65p9o0j59K33o4Q1N5
877A00k63J03K8k82K45%Q9j2m6M3p1J33q7M7N9j7K7j60J04J74m07L97k93K69n34
$$ plain form
708 26 102 -60 -141 136 -135 -277 140 0 -225 115 -64 -184 -268 11 -276 15 -231 318 228 -80 120 -11
730 -11 -140 35 -89 233 -164 -47 91 -288 109 -136 -31 158 -38 23 79 -62 4 -59 276 -273 -99 -90 -199
753 -199 17 -220 13 154 61 -62 123 -122 -31 -90 220 -4 23 -61 -252 -1 71 -132 21 88 140 65 -14 -20
777 -20 0 222 163 -381 -1 -42 83 291 57 -107 -20 -96 71 127 54 -76 -125 -30 190 98 -24 104 -163 166
801 166 48 -1 104 -8 65 7 -173 -221 -63 19 -249 67 37 43 -106 -224 19 73 -31 -131 -24 -168 -181 185
825 185 100 -37 26 -43 27 37 -43 -71 14 -79 138 55 -221 114 -34 -18 -86 -136 9 142 62 15 -89 -101 88 -164
851 -164 82 14 -39 -135 101 83 19 101 -88 126 127 40 315 20 30 -111 -133 -72 93 14 -46 -205 28 -36 45 100
877 100 -163 -60 -32 -314 -69 -69 20 8 -38 5 -66 67 -20 27 86 69 96 -64 40 214 -193 204 -89 180 -354
902c54L24J74r5j07P0j20K6J91p1m7J92k9n2r7J4N1j12j0P6q7kL36j32k62J43
927B0J18k32J02l5k63M31k8k30N09k60q0k35L49j99j77J60J34j15K50l4m5k42
949a02j17L61P2k39N2J68j79kk23K31l0M2J44k16j47K40m05N29j94M3k72L60k29
972a13J23l4nO4kK0n7K18k12j42N7J80kl5J67l58J42j06M3Q4n2j7J60j09n6K7
998a5M4K08j79l17K66k01L01m7j25J38q0j34J44Pk39J38K74K26l56o1K6RJ65j49
1022D3k99K17k78K14K32qj15q0J73r8m0j34K4O1J17J52m47RM97k60l5k19N14m37
1046a97J08L08j72J51m69L0J09K28k28O1j16L22j26L2j19K94k71n2K33j30J30
1067A26j06KMl0j61K3K49k4k34L2m1J92Q0n2J03k80K8n6J57k9p8K14j06P9q5J47
$$ plain form
902 -354 -30 144 49 -58 12 -108 -82 109 38 -9 183 154 102 5 19 70 -42 -52 24 -63 -65 271 139 -123 20
927 20 138 -94 8 -27 -290 141 113 -117 392 132 52 -183 166 -33 -210 -50 84 -31 219 185 140 -102
949 -102 -219 142 214 -25 27 195 16 14 -209 22 -8 34 178 -38 -185 55 -350 179 -15 28 -244 116 -113
972 -113 10 -24 -29 35 33 53 -4 214 2 -140 -83 97 95 60 227 -131 11 -95 -52 32 -20 -37 123 14 -42 -15
998 -15 29 237 58 -259 7 -194 107 60 -65 73 -7 -141 3 10 -229 -91 183 409 53 -8 18 27 192 43
1022 43 -256 -39 -317 -103 129 121 6 -74 99 1 -39 -173 -149 -88 29 181 -266 -257 240 -20 -55 -274 240 -197
1046 -197 -89 219 47 198 -271 -241 -132 96 -132 -71 -187 135 9 41 -78 216 -55 -107 126 -4 126
1067 126 20 22 26 -4 -165 -142 107 83 -151 -119 -160 32 112 60 163 -117 -89 -145 12 -17 -95 119 13 92 7 154
1093A54j55j32k6J96j42L3J16JO0nj15K71l90J03L3Lp9k2J79j55J0K15m0l0j22
1118c9k4J03k76K71m0k69M36k66K13k59J15p2J68r5J3P6k28J53l3J4j0K14k59
1141i4J45k62Q7L35k04M7k01L0L42m36J81KN7L1K02j40k97K34%j37K4k8L57M3
1165C18l13J9j37J89j37J60L6j42l83L77P2k23k06L06M6J0j02J02j17J45n3N4
1187B1J39o2k13pJ10M0j26j23R9O1l6JL02j72j88K41N0j12J71l19L69j74j81Q8
1211b1K14k31J15P3k90L2J58K8j4k65K40k55L03m1p0K3r2NJ43M4k34K58q0N4j05
1236hK35o4j01k37L25j94j1R5J33j3j43p6K73j30J32q3Nk13J85j07J3k60K26J61
1260A43q6J37j90J69n2j7j75j68K86k9l49J26P7P1K02n9k32J4k6K66Lk13p6K8
$$ plain form
1093 154 -1 -133 -159 37 -105 -72 44 45 105 100 -15 256 -134 -31 2 5 -74 -96 83 -72 -62 153 113 83 -39
1118 -39 -63 40 -236 35 -5 -274 162 -104 109 -150 -35 -107 61 -34 -21 55 -173 -20 -53 -39 -49 165 -94
1141 -94 51 -211 -124 211 7 54 -147 -117 225 -211 -30 -28 29 60 262 122 -175 59 59 -78 -54 -82 275 318
1165 318 5 24 -113 76 -61 99 135 -7 -390 -13 59 -164 -370 -64 -18 -8 -110 -8 -125 20 -33 21
1187 21 160 98 -115 -122 -12 28 -98 -221 -122 -61 -97 -96 206 34 -154 87 137 25 196 -123 246 72 -109 -21
1211 -21 193 -38 77 150 -140 -108 50 78 64 -201 39 -216 87 46 -24 -1 -93 -88 55 99 -135 123 43 97 -8
1236 -8 227 163 62 -175 150 -44 -55 40 173 160 17 -59 214 84 216 133 138 -75 110 3 16 -244 -18 143
1260 143 57 194 4 173 121 104 -71 -239 47 18 -331 -205 -128 -57 145 86 -146 -132 -158 108 111 -102 -178 -150
1284a50J90p3K17l07J47r2R9O3J23r6j20Q2l67L52J49l47J61k03J74n8p8K49l6
1307G9p2l0M2P7n0k86L52j63l10N70j88m8N0j96L35j05j76l9p2K93k17j3M8K9
1331i0J62o3M7k63K02l1r2K15J39j30J08k54P1r3p7N23j99l11K06j10J76o0j68
1354i2J76j28p0M7L36n17m5J93L66o69M82j24Q7k9r2L5j63K52N6l0j76J56k12
1377a61L84l32J58o0l8m6K32P5M4l69P2L29m79M11j94J58j74k44K82K8l7J50j33
1400E6J29m93N68l01M5n9L6j14J33j82L73J9r9l7J00j43j7J41j23j41n7L33l39
1423a72P9l2J13M7K6j84J84k7J20j00j24o6J54K17rj70j8k4J6k41J46Q7L3j97
1447a42j36K64m8J30L0J70k92J96MJ24m11n2J23J96l21J94OK9O8m4p1J15k40J08
$$ plain form
1284 -150 40 -33 184 -123 24 -68 31 94 217 121 1 83 -284 68 217 -130 31 -172 2 -56 -134 115 79
1307 79 7 -23 19 96 46 -240 112 -51 -361 209 21 -27 23 -173 162 57 -119 -158 -230 63 -154 -167 -119 -90
1331 -90 72 9 56 -207 -5 -36 -128 87 226 96 204 -50 21 -72 -149 374 175 -136 70 -40 136 76 -92
1354 -92 84 -44 -114 -67 269 -248 -293 -100 266 -403 79 -45 42 13 -79 -44 -207 45 101 71 -105 51 -161
1377 -161 223 -109 49 -11 -49 -95 137 212 256 -113 -41 288 -191 220 26 184 10 -234 48 76 39 189 56
1400 56 185 -308 260 -41 4 -55 -19 -133 0 -182 191 210 111 74 174 31 14 155 32 -109 -166 167 -172
1423 -172 -93 -125 -12 35 61 -123 61 34 154 54 -70 -136 18 235 226 56 38 14 30 -211 -65 22 55 -142
1447 -142 -278 -14 -62 68 98 268 -24 172 176 300 -111 -163 -40 156 -165 29 35 64 132 88 17 132 -108 0
1471@L7n2K35k06K5J04k74j8J17p4r5K16L56k78l2k38L00m5j28J74Q7j13q7l35
1495c24J92N8j02J63m2J34j10K11j69j64K96j30l3J64m0j1Jk47M07k30J40j29
1517C5j00J7k7Q5r9J22j9K03L3m91K20J51l53L35m8j60K04j26J5j50M17o2j08
1540I4j65J03m6k0Jk32L44P3j28l1K77m10K54l35M7K26j21J30l11J60J28Ml9o
1564cj62K93k31P6m8K27r1J52k18j32K80n0J38j78P6k65K50j43q4L2K17p5M2k12
1588a09K58j79Q9j76K42n8P0j03J28j55o7k28m2J77J02J33O6m6k18K9L00k72J38
1611G9K16k38J26l84J31L75j39k36K5j94J41J66j83J63p4j25J59Q5r5O2r9K11
1633A72j01j90J03J6o1j22R6j10K7J72K37l26j04K61p4j90J68j2k1k5M15j99j89
$$ plain form
1471 0 37 -15 220 14 39 143 -131 -149 -32 -106 -201 15 371 93 61 -177 123 78 -50 124 211 98 11 -324
1495 -324 -132 -74 -176 -13 -55 79 -31 180 11 -153 143 13 -20 144 104 93 94 -153 254 24 164 35
1517 35 -65 -48 -75 10 -89 33 14 217 250 -241 -21 130 -223 112 64 -96 108 -18 -3 -153 264 202 94
1540 94 -71 32 -14 -34 -33 -265 79 152 24 -7 270 -140 114 -221 -174 52 -69 61 -250 -90 38 42 3 -3
1564 -3 -165 128 -103 -27 -75 152 61 213 -5 -137 143 93 231 53 129 -136 114 -29 -113 -81 136 61 103 -109
1588 -109 149 -30 59 -117 125 67 137 34 162 7 -60 -288 -330 -153 -51 82 148 102 -116 -87 213 -59 79
1611 79 295 57 183 -201 -70 305 166 -70 -45 -239 -98 68 -115 48 -26 -151 8 93 -2 60 -39 172
1633 172 71 -119 -16 0 -61 -183 -87 -197 -170 2 239 -87 -191 70 -4 -194 -26 -38 -59 -84 331 132 -57
1656e7K33m9j42m9J80n7J8j06l9q1p3K11j04J86j25N1J71j68q2l19L81O2%K16
1680B58j70o4k8q8q8J62k4k2K28q2m6j68j84K88p4m5J07N0J33j50k9K14k78J49
1704D9K2j60l6L5M62j96j26j77J06o0P4Q6l13J03J62k27O5O0K36m50K66j17J07
1727b9J7J26J3J56k86j53P1K2N9J55k12L0j27J10Q7k23M06l14L34j51J15j76J01
1750A31j3n2j30K63k7k57K61lk12J59l8L9l67K06j57J73j70K04R8j97L51m66K66
1773F2j35k8m0o4K12m8P6O1j70J93l50P3K09R6M9o7k03L3L21j96J33l06R7j13
1797a05j43L15N5J22l56J31K2o6K6l73K45K3q3J53R3pk74J41J07k40L44l05L47
1820A72j68j3K0J65k86qK79l94L67m16J94j26L31k66J83j69L45n7l49J51PO6k21
$$ plain form
1656 -57 176 127 -15 -64 116 59 77 -29 -68 -149 -222 -11 -115 71 -54 -3 168 0 -82 -401 -20 42 42 258
1680 258 88 24 -4 -92 -180 -18 -42 -64 164 82 36 -132 -316 -28 -102 -147 -40 10 143 -7 -36 178 -100 49
1704 49 71 -89 -125 -90 372 176 50 -127 -21 -81 -7 79 -234 -131 31 -196 -131 -71 165 -285 -19 -136 -29
1727 -29 -12 114 127 283 -3 -156 -85 -63 -4 151 -61 -31 -158 -48 39 -184 222 -92 242 91 206 30 131
1750 131 118 66 -64 199 172 -85 176 173 -39 120 82 121 -246 -40 -197 -24 -194 10 108 -89 262 -204 62
1773 62 -73 -101 -141 -205 7 -41 35 96 -74 119 -231 -158 51 147 196 129 -74 -41 280 84 217 -89 8 -105
1797 -105 -248 67 122 244 -112 19 41 -25 1 -372 -127 -104 -187 -34 59 52 -222 -81 26 -214 130 -175 172
1820 172 4 -9 11 176 -110 -118 161 -233 134 -282 -88 -214 117 -149 34 -135 210 153 -196 -45 -38 28 -193
1843a93J15l6l4J73p8K65k65j62J03M4L48m16Q9q8M6o4K28j95Q2m5q4J04m0L3
1867g0J35j79K48n40R3K67J9o6J58k42O3J03N5j7J6o1J15k13M0J02k4O3k21L40
1891A84k63L51k93J8j4L7M5k34M02j75o4j55K63m0R7p4j61m6J87K45k98o4J86
1914A34o6N8k56J15R0j83j5L46l26J23m7O6j05K77j23J3n0O2j13J48q6j96K83
1937A49j93J87l45L69l05L30j16j9j46j73N47l99n4K33r7K52J9l45k5J12J42j22
1959AM7q6J55j87M1l9J51k6J10M0k35k0j8K1O0L0j67K98j90J83l02L03K2l32J92
1984E2j63J32n1J38r4J13J03j29J89m73N4Q8J16K6k86o6M12p1j26J16p2K75l19
2007c6L4J1K20o7m05J53N4K16k24O9P6J61j25j11k11M6J56l3J85k21m7m6k0R9
$$ plain form
1843 -193 -78 -114 -148 25 -53 212 -53 -215 -112 -68 280 -136 -47 -135 -89 -153 75 -120 -38 -83 -167 -63 -103 -70
1867 -70 65 -114 134 -406 -313 -46 -27 -93 65 -177 -114 -11 44 27 43 -18 97 -116 -76 26 2 65 -156 184
1891 184 -79 272 -21 -3 -17 20 65 -169 233 58 -6 -161 102 62 159 85 -76 -122 65 310 12 -52 134
1914 134 68 126 -130 -15 75 -108 -123 223 -103 20 -27 39 -66 211 88 101 51 113 0 148 62 -134 149
1937 149 -44 143 -202 167 -138 192 76 57 -89 -262 285 -114 -168 65 -32 220 239 -106 -131 -19 123 1
1959 1 48 -38 117 -70 -29 -68 83 57 167 207 -28 -48 -66 -45 15 45 -122 176 -14 169 -133 170 192 -140 52
1984 52 -111 21 -30 108 14 127 230 101 290 -183 -129 -41 75 101 -185 -251 161 90 -36 80 8 283 -36
2007 -36 -2 9 229 162 -243 -90 -36 180 -44 25 101 262 137 26 -185 -139 17 -16 169 -52 -99 -145 -165 -66
2031f6J73q0l22M69m3l23J12J89j57L3r4K36q3Q8j78J26K18m31j51K75j3NJ29
2054A12M6k13K35k52j94L48o2j71K37j07K08k57J55o3q0J58m9J42Lj93L0O7o4
2077C6l24L67j51nK5k27J99K31k87o5K67N3J57k31j64J04j52J53L6J72j97J92
2099A89k52N1j10M67k55o3J05O3k34j6R8P4k71L82l28j39L94j91j13L49k15l24
2121c39K68Q3k76K29l0P5M8l93L63QQ1j83j40L42n0J4j00j28jq8L04k99J26J60
2145G4k47J99j08jj02K17P7k33p5J38J99j23j35j9J56K8j70j41L37J23k66j08
2167a80J90j8j4P5p7J59j48j91J47J95j95K15k18O2l46K37J64k51K25j40K23k10
2189i6n4K08J59k55J26j71J30J20j3r1r9L0J05q1q9J33k70J78k1K9j06K51l37
$$ plain form
2031 -66 107 27 -295 174 131 -192 -80 109 -48 -15 -109 127 44 132 -46 80 298 -133 -284 -9 -22 -17 112
2054 112 158 -55 180 -72 -266 82 20 -151 86 -21 187 -70 85 22 -58 100 51 193 196 3 33 100 36
2077 36 -288 79 -72 -77 -52 -279 -80 151 -136 -201 66 119 276 45 -119 -15 -167 -14 22 194 -3 189
2099 189 -63 -12 -122 345 90 27 132 195 -39 -55 43 117 -154 228 -100 -239 155 -36 -149 200 -15 -339
2121 -339 -71 12 -264 -35 -65 10 58 -335 28 36 117 -66 -206 136 86 100 0 -128 -129 -217 87 -212 -86 74
2145 74 -173 26 -82 -83 -185 32 109 -124 -199 -61 138 15 -120 -139 17 45 -125 -266 71 194 -72 -180
2167 -180 10 -8 -22 53 -24 135 -13 -204 -57 138 -57 158 -60 2 -344 -107 57 -194 31 -109 114 -96
2189 -96 -150 58 217 -38 88 -83 47 167 154 63 -36 -6 99 18 -71 62 -208 -30 -51 -22 -128 123 -214
2212b14L39j54K19jL8l22q9J64l20M33J84j15k36P0Q7k09m2L62j26l03L25o6J31
2235A55j21j12p6J2K17jk17K88j99k18J36K51p3J28j98l26M49l79L23J63r7L3
2257A38k09j89M55j10L7j72KN9N2Q7m05L16j49o2Q2J80m0n0K43k38J85j22k73
2280a83J56K8k7K12l95J78M5P6j71J0m2k8N0Q4J5k6K11j34r4K3j55K02M9J40l53
2305a29K92j52l05M00n9j26J13n0j13K93j49J53j88nK57l34l2R5l2j76J19j72
2327c00K92O1r8k3M0K16pj97M1L9k7J30k42j86L39k59L18k5j60l12N34j95j64
2350a85K47j84L55k19jr2o8J02j64J40k8Q9M1Q6k05q6J83O1J17j21j0J23k05j98
2374b22J59L9L3j66L05R6k06J13n4o4r0J27j5j6J4R6j35J22n6J19j89Nj28J41
$$ plain form
2212 -214 125 -29 190 189 227 -95 -184 -20 -340 93 277 162 -74 -4 83 -126 -168 194 68 -235 90 24 155
2235 155 34 -78 -154 -142 75 74 -143 145 -54 -272 -136 115 42 170 -28 -354 95 -284 39 202 105 138
2257 138 -71 -260 195 85 122 -50 -48 11 63 150 -255 61 -88 -150 -68 112 72 22 265 27 212 90 -183
2280 -183 -27 1 -26 186 -209 -31 14 90 -81 -71 -113 -141 -91 -7 8 -18 193 59 -35 -12 -167 35 84 224 -129
2305 -129 163 11 -294 106 47 -79 34 -16 -129 164 15 168 -20 -25 232 -102 -134 -39 -71 -247 -128 -300
2327 -300 -8 53 -45 -68 -28 188 181 -16 25 64 37 167 -75 -261 78 -181 137 112 -48 -360 174 -21 -185
2350 -185 62 -122 233 14 13 -79 -147 -45 -209 -69 -97 -8 33 119 -86 -172 11 72 189 68 58 181 -24 -222
2374 -222 -63 -24 9 -157 148 244 38 151 97 33 -57 70 55 39 53 149 14 136 80 199 10 15 -113 28
2398B8O2JL9p0k42M14k59j75K91m54K83K2KJ40q1K9J71J7k34m5J89j39k15J10
2422a16L2n8JJ53L23j47r7k5p4K9j29J8K55j05r3J94l17J05l9J28K36k82M2j02
2446f8j0M3J96k93J46K20k4j98J26j03o0m6J16j3RR8M0l81L9N4J03J69j82J33
2470A14j17j63L12m6j32M2J30j65J45j99l4K08P9l23L21k94k8J14K26k25J89j8
2492A36r6j77K47m3p2K0l6j7j32J74j4l3m2M5J69m5l64J43L48M2m96L54k65O9
2516h5J78K19j08m6r1n1m0J07n3l4O5j7N5j26j41J51K3k62j0L94k68J88j67J45
2540B6j80L46Qj48k9J53k79J71n0O9j98Q4j78K82m9k61M21K5r2J37j81l0j3m5
2564a1j23Q0J32n5j04qJ96n6QJ16j04k1k71K53J7j87J75k07K09k10J49rJ56j87
$$ plain form
2398 28 90 91 130 60 -182 232 -27 -202 89 -365 -82 -60 -58 82 1 30 201 218 -16 -61 128 -11 -226 -116
2422 -116 -84 -142 -141 12 335 188 91 66 -8 21 -108 -90 165 60 -33 161 -156 -51 -90 38 274 -8 34 -68
2446 -68 -78 -35 161 -132 14 234 210 12 138 35 -25 -71 45 32 41 139 179 -202 -163 -109 -6 163 -19 114
2470 114 -3 -166 146 100 -32 10 140 -25 120 -79 -113 95 174 -149 172 -122 -150 -36 190 -35 154 136
2492 136 40 -137 110 67 -5 15 -21 -38 -170 4 -10 -43 -85 -40 129 84 -280 -137 211 253 -243 111 -154 -85
2516 -85 93 312 204 158 67 16 -24 83 30 -4 61 44 99 -27 -168 -17 6 -256 -266 128 -140 48 -119 26
2540 26 -154 192 200 52 23 176 -103 68 18 87 -111 -27 -205 77 28 -233 188 213 121 258 77 47 34 -11
2564 -11 -134 -54 78 23 -81 -89 107 51 59 175 71 50 -221 32 49 -138 37 -170 39 -171 -22 -31 125 -62
2588f2M2n0J41o0k17Q0K66k26L7J73r4j6k29K33N4N9l8Pn1k38J75K32k46Q1j69
2613a16o3M1pJ3N7M14j44k16J8n2N3J35k57L27l3k49J70K7l25R3J64K46q8j80
2637B8q8OM1J39j5J73k11J10k10P5J56k77J11j16J03mm5j14L94j68l72M47l9k35
2661a11J2J70O4k10J04k29K90j83j35K93q0L1k8m12M03n2q4K27l01J26J59N6N5
2684A65r2j5l4J05J27k81J84J98m61K02J09l12L55k80m0Q3K19k48K9m8N1J33j12
2707C7j25K8M3j45J79J61M7k28J76j31l8R6j04k15K03k44L91j02Jj80J56j32P8
2730d8L20k92J34K4M5j86q3o6K17pJ02q0L5k37R9L2Q3j42J0N6p5L5Q9j83k13M23
2756I2k33K83M0M9k75j66K57N7k3j37j9L6J32j31Qn6L43n42J40J90k3L5m4j82
$$ plain form
2588 -62 -20 -70 71 11 -206 -126 140 -86 -49 124 30 14 -215 18 72 131 93 100 49 -189 -14 218 -28 53 -116
2613 -116 -179 -138 -145 -132 -75 339 195 -21 -3 -55 -2 133 -124 203 170 -79 91 118 -207 -114 50 296 208 28
2637 28 -60 -54 -13 126 111 284 73 183 -27 48 204 -73 38 -78 25 21 -24 -138 256 88 -284 163 124 -111
2661 -111 -99 71 135 -75 29 -200 90 -93 -228 65 -15 16 -12 -424 -21 -73 -157 70 -231 -105 54 110 165
2684 165 73 58 24 129 256 -25 159 357 -104 98 207 -105 250 -30 -70 13 232 -16 13 -35 16 149 37
2707 37 -88 -60 -17 -162 17 178 225 -3 173 42 4 100 -4 -219 -16 -260 131 29 30 -150 6 -126 -48
2730 -48 272 -20 114 138 183 -3 -86 -152 65 58 160 80 115 -122 -23 9 92 -50 -40 16 -59 -24 65 -118 -331 92
2756 92 -141 142 182 231 -44 -210 47 104 81 -56 -75 -39 93 -38 -30 -86 257 -285 -145 45 22 57 13 -169
2780a69N0M92m65J55l29L16j91K50m71N01j04o5j20M0K33j07K6j66J70P4k57n2
2802a89P3R6j72J50k9m8L17Q8k84n7j47K45q7M0j22J72j80K67q7L2J00l3jl39
2826a95K21QNJ85l19q8K43j10Q2K71m70L30j83j36K06k23L89l55J6l8M36k40j02
2849f7j59K77%j94O4P8M3Knq5J06J72j02k32J90J98l97K59j15j08PK2rJ31o0J79
2875A95r1K0k62Nj0J72M8Ql27L54P9m18K13O1R5k48K28k65P2J90o7Q4p4j40o0
2900a38J10O9K01j75oL2J1l2j51M2j74m9k8L43o1J27L1k45l4J19j15J48j71L14
2924A68j21j28M7l7k20M32j48Q9K5j79j4o9J91k2j58J45J64j51j28L8J19r4p6
2947a27J73j75J44K8P2k23m6J29L2J08q1j85N6Q8k3N8j36L31j7k0l7k56KJ26j73
$$ plain form
2780 -169 -119 373 -92 63 -266 50 -141 109 -362 139 35 -30 -150 -110 123 16 42 -124 46 120 -137 -189
2802 -189 -116 -20 -192 -42 -71 -119 198 286 2 -55 -202 43 -44 -4 -126 46 -134 133 46 78 178 145 144 -195
2826 -195 26 34 39 224 -95 -183 60 -50 32 303 -167 163 -20 -156 50 -173 216 -139 -123 -161 275 35 -67
2849 -67 -226 51 51 -143 -79 -1 42 44 39 -46 60 232 130 -102 88 286 -111 148 33 -75 -68 -46 -55 76 16 195
2875 195 104 124 -138 -133 -143 29 77 85 -242 112 191 -227 -14 47 142 -106 122 -143 -71 119 52 136 62 -78 -138
2900 -138 -28 41 242 67 61 93 104 72 -79 -37 -211 -260 -288 55 -6 121 152 -93 -127 -8 -123 25 -146 168
2924 168 47 -81 -34 -71 -291 141 -7 82 107 -72 -86 -155 36 14 -144 1 165 14 -114 -76 43 -51 -127
2947 -127 46 -129 15 43 115 -108 -154 -25 7 115 34 -151 -95 -7 -30 28 -108 223 206 186 149 -107 -105 21 -152
2972a52K12k15Q5N9J80k22n6K61j12k8P5M1j71J81kl32K6L03j91N4j16J4r1J53
2996d4j29J63L83l80K31o4l91K82l6j94J52r5K98k23m5L3K77j12k14Pk73N48l42
3019a68L05j54J99j33J56o4j4j33j76J03J10K8L0k70K1k0J20L55l28j15K3jJ24
3042bl6j39L44m4K84l18M3j23J6R4J02j22M1%Q8k77j22L67k58M4q1J04k9M5k37
3067b16L43k99L09r1j74nJ13J8P6o3K34l71k8l9L17j48NK21p6k26J49R2k96K50
3091I5l66L98j97L1q3K4O3J83n8j48j2J16k75K77K6q7r1N6Q6k85K66j19Q5j39
3115a54J60j30O7%r9J48O6j14J32j89r5J65Ql8L0r7K01p7J1n1pJ0J55n1Nj05j07
3142a56J63j25K81P2P3l91Kj15R1P5K42R7j56j36pq0L0kQ5N8j48J8J51r4j0J10
$$ plain form
2972 -152 60 -155 -70 -11 169 -53 -109 152 40 12 87 128 -43 138 136 -196 -170 133 -58 -4 -120 -106 -197 -44
2996 -44 -173 -10 373 -7 224 160 -231 51 15 -179 -27 -122 176 -47 -92 -59 218 106 -108 -101 -374 174 -168
3019 -168 137 -17 182 49 205 141 127 -6 -182 -79 31 59 89 -181 -160 -180 -60 295 -33 -148 -125 -126 -2
3042 -2 -38 -177 167 123 407 89 132 9 25 119 221 99 140 140 228 -49 -171 196 -62 -18 -99 5 -24 21 -216
3067 -216 127 -172 137 46 -128 -133 -20 -2 74 11 245 -126 -154 -193 124 -24 -19 202 126 -100 49 141 -155 95
3091 95 -271 127 -70 -39 -122 -98 -35 148 90 -58 -70 46 -229 48 74 -13 -104 -48 38 -247 19 -100 -15 -154
3115 -154 6 -124 -57 -57 -156 -8 58 -56 76 -113 -208 -43 -35 -73 -43 -140 61 -16 -5 -56 -63 -53 102 51 56 -49 -156
3142 -156 7 -118 163 235 308 -83 -81 -196 -105 -30 212 309 153 17 10 -70 -40 -42 43 101 -47 -29 122 28 18 128
3168A28mm10K50J41J47l51M9K41k24K28j88q1L94l58J35J0n1K9j41J63l38l3R8
3191a66L6N1K73l97K66l12J66n1J55J26k55K13l00j3Q0J84K15l54K48j24O4J66
3213B71l65K53o5l37LK96J28j24J11m03K92l6p4L08k71J87j69L01P5l99N6pp8
3236d7M7J09P0j0k77M9J05j38jR2L1O4l30M2K46K07k31n9J97n26N19J39n24P6
3260a50J10p1M1J31m1P8N7j15Kk49N26m11J45J67l39k4K60m9l8O1j68m2L4J98
3284A13j32j0K42n22J49p8J87O6J2L8J60k64l00L40J59l13J75k48K11J78k58l5
3306a30Q9Q3j48P7j06J57m9K14q9q4M6l8j38N5K17K8j19j18M9J28o3K11n00K27
3330aR2k32R7j08J62m7R1r5k9K41k52P1l7J0ll8J91k05R7j0M0j90R1j04L55j64
$$ plain form
3168 128 124 -286 -36 105 252 -99 -50 191 -33 195 7 -74 320 -38 97 107 56 85 -56 107 -231 -264 -166
3191 -166 -130 -79 194 -203 63 -249 -83 -134 21 147 -108 105 -195 -208 -128 56 271 -83 165 41 105 271
3213 271 -94 159 94 -243 -240 56 184 60 171 -232 60 24 -50 258 -13 174 5 306 381 -18 38 31 -47
3236 -47 0 109 179 169 -108 -59 46 -92 -93 -1 30 94 -236 -194 52 259 28 -31 166 -360 159 298 -226 -150
3260 -150 -40 -111 -70 61 20 98 155 40 42 -207 319 -92 53 220 -119 -143 117 68 30 91 -77 -119 -85 113
3284 113 -19 -29 213 -309 -160 -238 -51 15 27 65 225 -39 -339 1 160 -153 22 -226 -15 163 -95 -130
3306 -130 -41 42 -106 -29 -135 22 -27 187 98 14 60 22 -116 -61 156 184 65 -53 -4 124 61 272 -228 -1
3330 -1 91 -141 -44 -152 10 -37 54 -41 -70 171 -81 -10 -47 -37 -40 -78 113 -92 5 -5 35 -155 -64 -168 187 23
3356B3j53J16p9L24m3k85J07j09O6N1%J51j02j76J63K82l92J13M3Q6j45j4J13
3379A40k33K1K32k83R0O3l23K37q8P6K04k80o1O2J72Mj07K1J72j62j07J76J23
3402A49j61N4j59J43M3r2o4p6K11j01l6P9R5j76K72k18L30k71k16K14O2j20J50
3425A12j6l64K45no9j16J03o5K21mok19L13l55K34r8J60j80J45K80m14Q4P9P0
3449A35j78K44N9j25n5N1j35J44Kk04J16j60K5M36k89L8q3k2K9o5L0o5K14j80
3473c8J0rk6J48M4j4k14Q8Pj78j3K89l09J87n1j76N34l58J79l19J96J10q9k8n4
3498h4L14m22L74J1j04R7l89L54k31KJ63k58K47P7N8k28j67K12j39O5K16m51M21
3521A38j63J4K61k45J17q6n1L2j49K21k6k55J00L5J36j27K39m7l18K15O0k60K60
$$ plain form
3356 23 -130 -14 -93 231 188 -97 10 -99 -33 18 18 169 67 -109 54 336 -56 57 100 186 41 27 140
3379 140 -93 -72 160 -123 -33 30 -293 -56 -144 -68 136 -144 -205 -143 29 33 -74 -53 119 -43 -150 26 149
3402 149 -12 42 -117 26 69 -23 -87 -163 48 -53 -89 -10 85 -91 181 -37 293 22 -194 20 82 -38 112
3425 112 96 -268 -23 -28 -97 -213 -110 -175 46 42 36 -183 130 -225 9 -89 71 -109 36 316 -98 -14 65 135
3449 135 -43 201 260 135 80 131 -4 140 142 -62 54 -106 -81 355 66 104 21 -1 28 -37 -7 -72 142 -38
3473 -38 -28 -37 -63 85 129 115 -99 -11 -4 -182 -195 94 -215 -28 -79 -255 279 -79 100 -219 -23 87 -2 -30 -84
3498 -84 230 -192 182 193 89 186 -203 151 -80 -78 85 -173 74 151 209 -19 -186 26 -113 -48 168 -283 138
3521 138 -25 -11 250 5 122 36 -15 17 -132 89 63 -192 -92 -57 79 -48 191 144 -174 41 101 -159 101
3544A01n4j08J64m4J28q7j60r2j69M38M6m57J98Q5j3j19R3L01l64k5K54k02L6
3567e0R1K98l83Q3j07J12n2n0j81K14njk31K12L01k89M1OJ50J43j37l44K15O4
3591A00k68J96J05k12J99j69Q3l0j43L37j55p5O1L0j26j9P9K12k55j44L59j89
3613b4j24J76J28k26K38k72J90j27O4j3l00J10J71K39m33n5J90J11o6Pj8K22l17
3636a29K53o3l32K44Pj72L49k22l4J5m2M37m01J53o7l39L19r7P1o5J68M1kj19
3660b7l8o6J65J70k2m14J81L09l94M0J33k48O9R2J13j46O3L23m57J89r3O7J73
3683A82k73K31k87L48k98K68J44m51J35j71L41l65K55m4N7j85J33k09M0L38J30
3704C19q5l30P0OJ54m30N31j62P0r3k08o2M14k37o4j93K05J62k27J66K24k94j32
$$ plain form
3544 101 47 -61 103 59 187 100 -60 -152 -321 117 163 -294 -96 -11 -24 -143 -50 251 -113 -138 116 -86 -50
3567 -50 41 339 -44 39 -68 44 -8 -58 -239 -25 -30 -31 -262 -50 251 -38 3 9 159 302 165 -179 36 100
3591 100 -168 28 133 -79 120 -49 34 4 -139 198 43 -32 29 59 -67 -86 -7 205 -50 -194 165 -24
3613 -24 -148 28 156 -70 168 -104 86 -41 23 10 -290 -180 -9 230 -203 -258 -68 43 -23 -16 -34 188 -129
3636 -129 124 61 -271 -27 -20 -192 157 -65 -99 -84 -126 311 -90 63 -4 -343 -24 -121 -50 -115 53 94 92 -27
3660 -27 -65 -131 34 204 182 -232 -51 258 -136 -96 37 -211 -142 -50 63 -83 -20 303 -154 35 -58 9 182
3683 182 -91 140 -147 201 -97 171 315 -136 -1 -172 169 -196 59 15 72 -113 20 -189 -149 189 319
3704 319 234 -96 -26 -20 134 -296 235 73 143 50 -158 -220 194 -43 -107 -300 -95 67 -160 6 230 -64 -196
3727a96N55n33J04j13j25M62Lk20k35L58j43N5r0J98j55J51L1Q9l81K58n3N8r8
3750b0m9K04j40kJ91k37m0j9P0l38M14N2j88K08r2m3j39L45j8k01q0J50j15K71
3774A84j97J55k15p0K88r1k25M35o4l06j42L60k9j84P9J01J57m21L26j7k20P8
3796a8k7M6k11J92LN4QO0j97L27k24J53j09j30J98l8r9k12L29j00pm6J41j31O
3821c2l4P7N9j62K45j60J43J4j56R9k94J62K1J48j9K4J28k31J5O5Q6j79j07Q1
3845gJ70l70K36j9j06M7K60k79J52p0J25l26K10l9l30L53Q3J97k04r5L34l23p8
3868g9j15K96O4j13L6j02o9J58k07L21l29K91k79j00J93k15L34j78j08J28P2j90
3890a91J28M52m88j74L65j63P9L1n0l8j0n8P2J42j43q8j24K16m1n3K97k42L40
$$ plain form
3727 -196 359 -174 -70 -183 -308 154 157 -63 -298 60 -83 -28 -118 80 -75 76 107 196 -185 73 20 78 -20
3750 -20 -69 135 -5 -7 184 -53 -93 -112 -42 -380 34 86 -102 106 14 -29 -168 177 159 -42 -122 28 -87 184
3774 184 -13 142 -73 -143 145 54 -171 264 200 -106 -248 112 83 -101 -22 79 236 -185 141 124 -96 -18
3796 -18 -45 1 -210 -18 -15 39 47 107 -90 237 13 166 57 -73 125 87 -12 -224 105 5 -2 -48 93 -38 -32
3821 -32 -66 11 70 -92 153 -7 136 150 -6 93 -201 -39 -18 130 111 135 263 32 47 112 198 19 -88 -7
3845 -7 163 -207 29 10 -96 -49 211 -68 84 14 139 -187 23 -16 -346 7 90 287 83 -12 322 -1 -79
3868 -79 -194 102 166 53 89 -13 -82 76 -131 190 -139 152 -127 -227 -34 -249 85 -93 -201 -73 -1 -191
3890 -191 -63 389 -99 -273 92 -71 8 39 -11 -49 -59 -117 -45 97 -46 -134 -258 -42 -83 -136 161 -81 259
3913B59m82J40J89k39P2P5k3J40j47n4J03n1J69k78J58MpJ76m81L20K8j43J70
3936I8j61q4j66J46J66M1j06M8P7r3q9K23r0j1q3MJ04K02l03L4o1J79j87L14j29
3961G3j22K3J29q7k04K00jq6J28R0J4jl88K45Q4m9k6J18m01J18o0J76K27q3l7
3986H0J7m8M1k8j78J90L9j29Q8j64J65J50k75J30j54N1O5K23j35r2j00J67j0k74
4010a81K8K4J51j67J6J4L42j18j73J93l69R1K94k47K24j54j87K29J83J29o6k51
4032EJ46k19K69j82k87K68K88j15q5N5p9k2p0j37J56m4J7K32j2o4l52J84K8J39
4056A19k85p7K64j15q3L34j7k43j58K90j49j1j00K02P3K2j29K74m9J39m93J22
4078g0l1J86j59M9j98K26K22j49j31J0J40l04K87o1J21l01J2K87p9j69J40k24
$$ plain form
3913 259 -223 -83 106 -133 -61 14 -9 131 -16 -70 33 -18 151 -127 31 35 28 204 -277 43 71 -72 98
3936 98 -63 -147 -313 -167 -1 40 -66 -18 59 -34 -123 100 10 -1 -84 -80 24 226 -77 -43 -104 75 -112 202 73
3961 73 -49 -26 103 16 -188 12 11 -75 53 143 157 156 -232 13 97 48 22 140 -261 -143 -203 -27 200 117 80
3986 80 97 49 90 62 -116 74 113 -16 72 -92 73 223 -52 78 -76 -25 40 263 128 36 -64 103 93 -181
4010 -181 -153 -129 22 -145 -129 -115 227 109 -64 129 -240 -149 145 -102 122 -32 -219 10 193 322 256 5
4032 5 151 -68 201 19 -268 0 288 173 88 143 64 42 -28 -165 -9 -53 -36 196 184 120 -232 -48 -20 119
4056 119 -166 -243 21 -94 -177 157 140 -103 -261 29 -120 -131 -231 -29 44 66 -63 211 162 301 -192 -70
4078 -70 -101 85 -74 -25 -223 3 225 76 -55 -45 95 -209 78 17 138 -163 -151 136 57 -112 28 -196
4100a96M26l40J17o1j03O2K66k90m2K22j12oK12j37Q0On0%o4JR4k07J33Q1NP8
4126A75l08K99k97J05O0R3k34K47p7j5k86J87K23k23N7j22J56Q6k11K31k59K3
4148i0J42k96L6L8M75l40j70OO1Q7K65j71j04r5P3J8j44L0L23L5k4j92O8J26m2
4173A15k68K03j39J45j95N8K0K6J50j25J16j02k09J28j17L51k56K53l31m0P1J40
4195fJ46l30M2K29L5l7J85L1m04j13L80k15K31j17j38K65k01J27k91L60q5O8M9
4218B11jl4k88J35J27q8J82k73j42J49L68r3l43K01J12k69O1Q5J55m46K24J37
4240A70q1j83M5J02j07L8L6k21J30J04q9K00j03J59j48o6J20m3l0J46L9l00q8
4263a70L23j52j29j27M56l53K00j01J06r6P6j04j2o7j28K00j22K15J61n5L1k38
$$ plain form
4100 -196 230 -110 7 -54 -157 -95 171 -119 -161 61 -51 -57 155 18 98 104 54 54 -10 -9 85 -122 11 92 97 175
4126 175 -133 166 -131 -26 34 127 -107 140 63 48 -238 -51 172 -51 6 -116 40 126 -85 146 -113 -90
4148 -90 52 -244 -208 -170 305 -35 -205 -199 -138 -51 214 43 -61 -156 -83 -65 -209 -179 144 179 155 -37 31 157 115
4173 115 -153 50 -89 56 -139 -81 -61 -35 115 -10 106 4 -205 -77 -194 157 -99 154 -177 -217 -146 -6
4195 -6 140 -190 -148 81 116 79 264 295 -109 -222 158 -57 174 57 -81 184 -17 110 -181 179 94 162 211
4218 211 210 176 -112 23 150 62 244 -29 -171 -22 346 253 -90 111 223 -46 15 100 255 -191 33 170
4240 170 89 -94 -49 53 -54 -16 20 -201 -71 33 -56 144 41 200 52 -14 106 63 33 179 218 -82 -170
4263 -170 153 1 -128 -255 201 -152 48 -53 53 -43 33 -71 -83 -150 -278 -78 -200 15 176 121 152 -86
4285h6J96j25lK55j56%L5o8k14J70j16K4J34P0p7M2k1r5J1J89j06k65J99R7k70
4310a80K35j5J76l33P7M1j1O9PJ81l47K04j15lL69m60k6K88q2p8n0P2L2n0J12
4335A13k91j0L91j39J27j75m6K1K58k86J48m0j76M62l79R3N7j10n6J5j55l9L20
4358A03N2p3j62J91n8j53n0J99j36K32j86NMJ76k69p5J47J65j68L46k36J32k48
4381f2K26k43o6M00n22L87l43M25j23n5RO9k28L38l42J17rJ16kk20K35N4q9j27
4405e5l8p5J57L2L10j84l0J9q0k38J2j15K27J9J05j02J10m1l13J9J56K40k82P3
4429g4K50j64J72L7k11J78k07o5J74k15L54m53K13M8jj7l9K58l11J07J14j75m9
4452g6K95k28r5K09Jj34j2L8J10k26M70j80k17P2j6no8L6P2Oo2j93M25k07j35
$$ plain form
4285 -86 110 -15 -18 237 81 81 116 48 -166 4 -112 -88 46 116 39 81 60 -35 -24 165 59 -206 -7 90 -180
4310 -180 55 40 216 -117 -40 1 -10 59 66 247 -100 104 -11 -14 355 -105 -131 157 75 -3 -53 19 51 1 113
4335 113 -178 -188 203 64 191 16 -30 -9 249 -37 111 71 -105 357 -22 71 128 18 -38 -23 -178 -217 103
4358 103 155 82 -80 111 53 -100 -150 49 -87 145 -41 -36 -32 144 -125 -200 -53 112 -56 290 54 186 -62
4381 -62 164 -79 -145 255 -267 120 -223 202 79 24 33 102 -126 212 -130 -13 -22 94 92 -128 107 161 72 -55
4405 -55 -93 -168 -11 21 331 147 117 136 56 -182 -170 -285 -58 -39 66 -36 74 33 -280 -261 -105 135 -147 -74
4429 -74 176 12 184 221 10 188 -19 -84 90 -125 229 -224 -11 37 36 19 -20 238 -73 34 148 -27 -76
4452 -76 219 -9 -104 105 106 -28 -40 -2 108 -118 352 172 -45 27 11 6 -62 -26 46 52 -10 -203 222 15 -120
4477a20L61k78LN6k25R3K43l8j2j47J51k43j1J02n2L8q0m1K84l81M82r9k11K55
4501A30j94L4k7J56l5k04mN6MK07M5j49R3r2j95J91r3K14k97p3L19K8l08J70N7
4526C3j23M2K13Q5k95j32K28j22J92k43K56k64K20Q7N3q8r7m3N5k46K47q0o9J46
4550E5n2k4M3O5L5j58P1N2j14j6j46o5L13J97k98J84k39R0M4R5n6J14j58J11q1
4575F2o6Q4q5p4J78r5O8k03K06J12k28L03l38m9K42k10QJ0j11J22j62J32M0J24
4599G0Rn9K4J16j34j54J07n6K98k39P1M5l00J05J50L0q9R9L2K9P4k29N4j91J22
4624a6j7j59J90L0J1k26J4K11k89J21J64j55K24j91K8n5J31o8J03k6j69M4q8M09
4648B21k22O9J1r0j11P0K69j30j59m4J03j97M04k90J36J87k40j9j13K23r5J85
$$ plain form
4477 -120 241 -37 -34 22 -203 -110 133 95 83 -64 87 -156 -167 -65 -117 -79 -159 -200 84 -297 185 86 -125 130
4501 130 -64 -30 -57 99 64 -140 -144 -88 -84 123 168 19 112 20 -175 16 -77 137 -160 -233 86 114 -194 -24 33
4526 33 -90 -48 165 250 -45 -177 51 -71 121 -122 134 -130 90 177 230 142 45 2 57 -189 58 -22 -91 55
4550 55 3 -21 22 87 122 -36 35 87 -27 -43 -189 -254 59 256 -42 142 -97 -7 37 132 76 190 32 143 62
4575 62 -4 80 -5 -79 99 4 72 -131 75 187 -41 262 -76 -125 117 -93 -85 -75 -186 -64 -226 -94 -54 70
4599 70 79 20 44 160 26 -128 -21 -77 221 -18 53 98 -202 -97 53 83 -6 93 125 154 228 -1 53 -138 -16
4624 -16 -33 -192 -2 28 39 -187 -173 38 -251 -130 34 -121 103 -88 -60 -115 16 -52 51 25 -144 -100 -188 221
4648 221 -1 68 79 -11 -122 -52 217 87 -72 -116 -13 -210 194 -96 40 227 -13 -32 -145 78 -17 168
4670A68k41jl3J68M1J0j50n3K05j26K9O6l00K81O4j34k4qN6N9R3k96j11J35J85
4695H3k41K11j8l55L17L5Kq8K11j79lJ82l52J92L0qm9R2N9N7k63J82j22J94l04
4720a35J10j62K72k10K24r1n6r5LJ84J2q4N8k35L48k55K65j35j49K23Q5l41J27
4743c7J61k21J34k10L22k00Q5r9Q6k6Mj39J69j4J04l6r4k9K7j6k7M1j66K18o9
4768c2o3K44j84o1R5K8q6M1J30j33K30l40K79j61M3j78l1r2L38j50L3K4Q9j16
4792e3J58O1j47j05L28m05N3J59R2l2q5j79K51j32jJ13j4j55PL55j07J18k62K06
4816B24j04p6L3N3m00M34K8j43oq5K25j80J06j23K06q7J3OJ1j2j05QJ13p3r2j3
4842c9J40j84J1R0L4K0l10K76k31Q4J32LL44l91N9j92K48j92o7K47j59L3J12m1
$$ plain form
4670 168 -73 -74 -107 61 102 112 -38 -91 114 -12 17 83 -217 64 128 -6 -30 -38 18 77 170 -126 -237 -102 83
4695 83 -158 53 35 -320 -3 32 34 -54 157 -22 -25 157 -195 -3 27 19 -30 62 121 178 -85 97 -25 169 -135
4720 -135 -25 -187 85 -125 99 8 -48 -143 -140 44 56 -28 30 -205 143 -112 153 18 -131 92 177 -164 -37
4743 -37 124 -97 37 -173 149 -51 34 -65 21 -5 -1 -140 29 15 119 83 -11 -40 -13 -29 -56 -15 -181 37 -32
4768 -32 -95 149 -35 -96 -1 27 -59 -18 112 -21 209 -131 148 -13 30 -148 -179 -271 67 -83 -50 -26 63 -53
4792 -53 105 166 19 -86 242 -163 -110 49 141 109 24 -155 96 -36 -37 76 62 -93 -86 269 162 280 18 224
4816 224 120 44 77 130 -270 164 192 49 43 -42 183 3 109 -14 192 105 118 124 135 123 18 26 139 66 -26 -39
4842 -39 101 -83 -72 18 52 72 -238 38 -193 -109 23 26 370 -21 38 -154 94 -98 -165 82 -77 -44 68 27
4866B7q4K17r3l67L39J22p1l20M31j49j03K29l50K33mj90K94k77K79j93P5J58
4888B03k23M8j71J45q6r9K71o1nJ81m16K54j94P4K68M5l69J45K0J1n9K67r8j14
4912C7j19lJ29M9k04K66k6o4m3P1L7j88K60l13O3J80j60J27K1P5m95J77K09l22
4936b36J68j8Q5P2j17M3k78M05k49J28K50j83p1P8p1J14o6j51L6Pj4J27K36k18
4960G7R7j60MP6j20O0k54J72R7Q1l0J52Mk17j29k20M56K1j76r1k9j4R1K5J21J9
4986A13l71K84j73J85m3L1Q2m06K80l2J7P0j21K18l14K02j0J60Kq8J5J00k95L30
5010B36l14J52r7R3k9j18o7J50k1j28L67k36O7J3k00L5J88k0Q0q7j08M4M5j84
5034a39R9K80n12K89k85L63j12j87M5L25j54Q8m8R6l0N5l4k08L51n14L4L23j17
$$ plain form
4866 27 -57 160 67 -300 39 161 90 -230 201 52 -51 178 -172 61 57 -133 161 -116 163 -30 45 203
4888 203 -20 28 -143 2 -84 -183 88 27 22 203 -213 41 -153 -79 189 234 -135 10 30 41 -18 249 151 37
4912 37 -82 -85 44 93 -111 155 129 65 22 93 130 -58 202 -111 -48 132 -28 99 120 195 -300 -123 86 -236
4936 -236 -68 -86 -1 71 -46 -3 -281 124 -125 3 253 70 -1 77 6 120 54 -97 -61 -54 -68 59 295 77
4960 77 174 14 18 94 -26 34 -220 -48 49 130 100 252 256 39 -90 -310 146 167 -9 -100 -129 -143 -52 -27 94 113
4986 113 -258 26 -147 38 -5 26 108 -298 -18 -50 -33 37 -84 134 -180 22 12 172 174 86 101 201 -94 236
5010 236 -78 74 -23 70 41 -77 -144 6 -15 -143 224 -12 55 68 -132 -97 91 71 151 64 -44 0 45 -139
5034 -139 -40 240 -272 17 -268 95 -17 -204 -159 166 12 100 52 148 118 173 139 -69 282 -232 -198 125 8
5057Hj8n3O9J32r0J7j19Q8j61K84l30Q7J02J74K2k08J04j06L25l98P4R9k41K79
5081A40r7o9l2K32N6k43r0J0J66j36J60k12P5J15N8k39J22J52l49J13J79j69k0
5104g8J41j59J69q0k7m1L41k73k19L38k51J10M6K4R8l7N0r3j37J07K60k00q0j33
5128a24K16l5O2k78K18j76J03k44L29p9m6j57K80l7j41J38l0N9j46J83l5Q7j42
5151EQ9k5L8k7L6l52J78L24k46L23k94j3M8j92KN8O3M0o6m2j08J69j22J85j26
5176e5M4K11j24j78K00j1j76J5J56j95K21l41K31K1J42P8l2J64m21R5k71M7K95
5199A16n8k32K24P5K67k51q8j84J12J7j69J61p4K43j71j2j29K52j69K38l69K00
5221aO0k3j16K65k89J59q4J91l32M2K37j00Ok7L49j90j08k96L27k7l59K47L49
$$ plain form
5057 8 -10 -63 6 138 48 65 -54 34 -127 157 -173 -86 16 190 212 4 108 2 327 -71 3 102 -139 140
5081 140 43 -26 -58 174 230 -13 -103 -93 73 -63 97 -115 -40 75 133 -106 16 168 -181 -68 111 -58 -78
5104 -78 63 -96 73 -7 -34 -75 266 -7 -226 112 -139 -29 17 41 139 102 152 59 -78 29 289 89 9 -124
5128 -124 92 57 119 -159 59 -117 -14 -258 71 -8 -54 -211 69 32 -109 29 -1 58 -88 95 60 147 5
5151 5 94 69 107 80 116 -236 -58 266 20 343 49 36 84 -108 -106 -48 15 55 -11 -53 -161 8 -114 71 -55
5176 -55 -11 200 76 -102 98 87 -89 -74 82 -113 108 -233 -2 19 161 239 207 371 -50 45 -226 -179 116
5199 116 58 -174 50 125 392 141 53 -131 -19 -2 -171 -10 -84 159 -12 -24 -153 99 -70 168 -201 -1
5221 -1 59 36 -80 185 -104 55 -29 162 -170 -128 109 9 15 -12 337 147 39 -257 70 43 -316 -69 280
5244B80r5j57j47O3J91n3m8K1j24m2K52k19P1j9J01n0l4k23L08J7k08K35j07J98
5268B11l24Q9J13j79J91J06j00K9j26l40M71r7o3k27l1L30P0k15J61J04j60k06
5290a93K04Q6l5o2j98K17j68L03k5j45k3J15j32J14j30Q6K1Ol14J65l4J48J36
5313A42l06K6O0p3J74J78l39J70l8J85j98l1K42j8P9j60n9l22L25J90r1m1j38
5336d3m1J85j95L24k05PJ06j80R9j06j08n7Q2K72M3j99m2Q5j13J85o8j67n9N7
5360a38L10j40r8J10Q8r4mJ01P8k14Q6l12K69Q0j08N7k16J31l6o4K59M1l50J46
5384a8j06K00k60PJ30qK10j14K0l6J12j12k61K54o0J21Qnj18K11m3j49L9P4m9
5409D7j9R2l02K59m3j23J61o5K81k68oJ68q4p1jj54K62j83j01K74J49l44J77q
$$ plain form
5244 280 185 28 -119 -56 135 82 34 55 -69 -111 141 -78 -7 -26 75 25 -9 -232 76 93 -115 120 13 211
5268 211 -113 -24 89 -90 101 207 107 136 10 -330 141 44 -19 -246 -277 53 123 -92 69 173 13 -193
5290 -193 11 97 62 0 -198 19 -149 154 129 -16 -39 76 -56 58 -72 14 35 41 -273 -108 -142 6 142
5313 142 -164 -138 -78 -151 23 201 -138 32 -6 179 -19 -50 192 174 253 93 34 -288 37 227 136 95 -43
5336 -43 -84 101 -94 230 25 32 138 -42 57 -49 -157 -214 -132 140 183 -16 -58 27 -86 99 31 -136 -195 -138
5360 -138 172 32 -66 44 132 38 34 135 213 -1 85 -227 42 122 14 71 -145 -14 -50 -114 145 186 -164 -18
5384 -18 -124 76 -184 -177 -47 -55 155 41 61 25 137 25 -236 18 -42 79 87 82 -36 175 132 -17 22 96 47
5409 47 28 120 -182 77 34 -89 72 7 288 20 14 182 98 27 26 -128 134 -49 -150 124 273 -71 106 98
5433I8j52N5j32K44p6N3r3k10M41j67k32L59j63j36J40k7l59J05K4K05j02K3p2
5456a74J45L3m6o9K06Jm0j95N9K4N2R5j9K14n3j82o6J07k4j9j62p5Q4L56l01J9
5482c0J8j61p2K03nPK97k66J03j21%P6j91J73j48lL60j33J18j88j36J30k55L7
5506a87K24k06L70l99O2M69l37p9j26LK85l62M04j27J33NL6j03K59r7j45k37J86
5529C1R7q1j70K50J27j69p6p0N7r0k12M45J1j82j2R0M8l2j91R5j1J16K2J60m93
5554b40K95j64K2Q8J07J67m84K85j6j33Q0j32J59K58q6k78JJ66j22o9M1k2P8K57
5578B58m58J66J2KK29l30J02K8k0l5O3j66j04K28q9J28l01L11J54q1K32l60l7
5601f8O5j55J89j64J24O6mk92J64L37k38m07P00m75M57k26j04J04l52L22O9p8
$$ plain form
5433 98 -54 1 -131 113 37 90 -3 -213 228 61 -171 188 25 -111 29 2 -357 -252 -228 -23 -125 -102 -174
5456 -174 -29 4 -42 -111 95 96 56 -139 -80 -56 -4 91 72 286 233 51 -15 92 68 49 -113 -188 -104 252 -49 -30
5482 -30 -12 -173 -245 -42 -47 -40 257 -9 94 -27 -27 49 -142 31 -117 -120 240 107 225 37 -99 31 -224 -187
5506 -187 37 -169 201 -198 -136 333 -4 -83 -209 -206 79 -283 121 -6 127 132 168 65 324 227 82 -155 31
5529 31 128 47 -123 127 254 85 9 -61 -4 -94 -306 139 150 -32 -44 46 94 62 -129 -34 -45 71 93 253 -240
5554 -240 55 -109 -87 1 108 275 -209 76 60 -73 7 -125 34 292 206 -72 -71 95 -27 -96 -55 -77 1 258
5578 258 -200 -34 -22 -20 209 -121 -19 9 -11 -46 17 -149 -253 -25 -114 14 -287 24 178 97 329 -31 -68
5601 -68 -3 -158 31 -133 -9 57 53 -239 -75 262 24 -383 317 -158 299 73 -31 73 -279 43 112 34
5623C4K2p3l4L4N1l0j23r6K27K2N2j56L0NN1j23n9J85J99o4Kj58n4J52k54j8J55
5650b1J48k47J64R1K6k32k22K65k00J04J61M4R2k01K47k21LPL5k1j35J22m2p8
5674a11o4K20k0K1j39n0P2R8m2m2J93j75Q6k6L9J32o0k59L15k42J53q3k53K95
5698E8k0k18J83Q3l2n5O5j76J88k90K26Q1J85l61p2L49k36k08J86j35K6N3j23
5721b43K26j8p8P1N5R0k40L23k54l6J17O5j37J27m19L10k7J36j28L60l25J03k46
5744a68L11p5j21K24l55J55k07M54m84J07J47J71l69N20k55L6j89K77J0l15K05
5765G9m7p3L28k00j74O6PN6j69L16l64J13K11j93J13j29J29j36L56k68k43K55
5787C3j27J15j01K91l78L28j37j15jQ5R8j62J00k43K76j75Q4j59K88m7j52J09
$$ plain form
5623 34 56 -17 -51 -17 34 4 -119 -215 12 34 86 -70 -40 -35 16 -107 -166 19 218 154 156 -2 -56 96 -158 -176 -21
5650 -21 127 -120 44 135 161 -71 -293 -28 -228 -124 37 81 173 -28 219 -2 1 8 43 22 -113 9 -33 -111
5674 -111 -175 45 25 46 -93 -143 -71 27 -15 -57 136 -39 47 21 60 192 132 -127 188 -54 99 16 -237 58
5698 58 38 -180 3 86 54 -1 64 -112 76 -214 12 93 278 -83 -155 194 -42 -250 -64 -199 -173 -120 -243
5721 -243 -17 -35 -113 -42 13 103 -137 186 -68 -104 13 78 -59 68 -351 -41 -68 68 -60 300 -25 78 -168
5744 -168 143 68 -53 171 -184 -29 -236 218 -266 -159 -12 159 -210 310 55 91 -98 179 189 -126 79
5765 79 32 -41 287 87 -87 -21 -14 42 -127 189 -175 -62 149 -44 69 -60 69 -67 289 21 -222 33
5787 33 -94 21 -80 211 -167 161 24 -91 -92 -7 91 -71 29 -214 62 -113 -29 -188 100 53 -99 10
5809A0J88j73r3o4J54J11O6k84J34k32K53R0j1l7j96M3J13q2nJ08j02p1O8J25
5833A13j37P9j04j43J06K9m3K30j67L0r9J24j7j16J85j51qM89k56J0K7m4k47M
5857a06L21k61m7J22m1J6L5k1N7m8n3K85k87O0j31L53k74k31J14J88O9Noj04n4
5882c9j5j50K66j04rK18k3j70p4o9J43J19r8q0n2K42l39K59J5k7k40N9M36r0j
5907A77k50Q0N6K8nl6N8j43j79J94q5J40R6l00J34j1M2J15j19K44j66K5k94p0
5931b69K99J21k84k2J11J2k40L25j99J92j34J62k81J91J6j88%K79j72r9J11Q7
5953A8R4j8j49r9LJ29K68k11n3N9O6j03jM3o8j28J02J48JQ5j23l1M3J08l65M31
5979B49j41j14j7o7l3L75n06L35p0j46j39L50j51QK29l14K72j45K26j57k80K33
$$ plain form
5809 10 198 25 -68 -132 22 133 199 -85 49 -183 70 160 149 112 -84 -41 72 -10 -15 93 -9 -80 -12 113
5833 113 -24 55 -49 -192 -86 -57 -100 130 -37 -7 -106 18 1 -115 70 -81 -89 400 144 154 181 137 -110 -106
5857 -106 215 -46 -93 29 -12 4 39 18 75 27 -26 259 -28 32 -99 254 -20 -251 -137 51 120 125 119 15 -39
5882 -39 -54 -204 62 -42 -51 167 144 -26 -100 -169 -26 93 -5 -85 -137 105 -234 25 40 13 -227 -168 268 178 177
5907 177 -73 7 63 91 86 50 108 -35 -214 -20 -105 35 131 -169 -35 -46 -4 111 -8 236 70 95 -199 -269
5931 -269 30 151 -133 -155 -44 -32 -272 53 -146 46 -88 74 -207 -16 0 -188 -188 91 -81 -180 -69 18
5953 18 112 94 -55 -154 -151 -22 246 35 -18 41 107 4 3 46 -22 -150 -48 100 101 186 63 32 75 183 -182 249
5979 249 108 -6 -23 -90 -123 252 -254 81 11 -135 -274 76 -75 -67 162 -152 120 -25 201 44 -236 -3
6001cqJ7n2K41j77j07j70K25l7j09L20o9k16K73k36l2K12K9k79J46j74J80n5J22
6025D1O7k14K37j4J80l04N7j79J66j15J21j32L73k59P4j48nJ95m5l12L81j93j22
6048a50K80L8J42n02K29j51J61m12M67m36L21J82k18J77j67J76k60J77j43J40
6068E1k4j82o1J50j33L18k12j9m3K90L5k40O7j51J40j71J79K9m9K02j22k6K8L
6092E9k62J31K08o3k13nn7L22j06j73L39o0p6j03j48O6K23j26J49j70j01J77k33
6115b22N45k68j77R2J73j63N7k66LL21r4o3L83l55p7L68p0k28O4m2J60j60j76
6138a95J42k46J95Q0o2J51J9K05n17J62O5p6K64k60J26j57J22K34l40l3J17R1
6160H7l2M7j17p6P0K6Lj21J99j67p0O5k5K42K4r8j11Q8K8O7k81L7j31M04m06J25
$$ plain form
6001 -3 -11 6 -46 195 18 -89 -259 -34 -71 -180 140 71 -145 128 -108 -140 72 101 -178 -32 -206 -26 -81 41
6025 41 108 -106 131 117 297 -7 50 -129 37 -78 43 -89 284 25 99 -49 -54 141 96 -216 165 -28 -150
6048 -150 130 168 310 -192 37 -114 47 -365 102 -334 -13 169 -49 128 -39 137 -123 54 -89 51
6068 51 27 -155 -216 -66 -199 119 -93 -112 -155 135 170 -70 -3 -154 -14 -185 -6 23 -26 176 54 28 56 59
6092 59 -203 -72 136 73 -140 -145 -202 120 14 -159 180 120 44 -59 -207 -141 82 -44 105 -65 -166 11 -222
6115 -222 323 55 -122 -30 143 -20 37 -229 -226 95 1 -62 321 -34 -111 257 187 -41 23 -19 141 -19 -195
6138 -195 -53 -299 -104 -24 -86 65 84 289 -228 -66 -1 -77 187 -73 53 -104 18 252 -88 -121 -4 87
6160 87 55 102 -15 -91 -21 5 8 -113 86 -81 -151 -86 -111 131 155 57 -54 34 62 129 -152 -115 -246 158 -248 -123
6186a23m1J64K07k10l9R9j49r2J19j9r0J41J36j38J19PK1j92M6m4rm5oK03k32
6211a67J77l6P6j42J66j90P4m0J82j40l6J51k78K59P7m5k1J0j44qL12j76q9j15
6235a43pn2N04k65J01j89j48K36n8m8J09O1j80L63k07j1J52q3q6K94m06q4J12
6258c5M9J2pj40J86m4l2J23n1J49l95J73K08k32K53n01M89l40j1K20k19J22O4
6281D1k6K4j58J63l1j76L36l20K24l16J91K91l72j20N18Qk09q8r9J38M2j12N3
6304Bp3K55j64oM3l10LK43J65J2k31O8n9N3j06K97m0n6j5M3j04k27m7L16J49q8
6330A23k63L14j53rj17K5K11o9k9J5p6R1l44J48K37j64j76K66j02K16l0k69p2
6353b27M0K42J15j83j65J20J06j06R6KK5p6j79L40k41J05J09r6k25R3K45j69K57
$$ plain form
6186 -123 -164 0 207 -3 -42 57 -92 -184 -65 -84 -174 -33 103 -35 84 91 112 -80 -34 -78 -87 -132 -138 65 -167
6211 -167 10 -26 50 -92 74 -116 -42 -82 100 -40 -76 75 -203 56 133 88 67 77 -67 -75 237 61 -28 -143
6235 -143 -150 -202 302 37 138 -51 -199 37 -21 -69 40 101 -79 284 77 66 218 135 49 343 -63 -147 -35
6258 -35 14 26 19 -121 65 21 -11 112 61 210 -185 -12 196 -36 217 -284 205 -135 -146 74 -145 -23 41
6281 41 15 39 -119 44 13 -163 173 -147 77 -239 -48 243 -129 -249 269 277 68 -20 -119 19 61 -51 2
6304 2 -71 184 20 14 57 -253 -250 -7 158 170 -61 7 -52 1 -105 192 152 96 81 124 20 -207 -254 62 211 123
6330 123 -140 174 21 12 -105 -80 131 62 33 48 -28 63 -281 -133 104 -60 -236 30 -72 144 114 -155 -227
6353 -227 -187 55 170 -13 -178 -58 48 -58 38 40 65 -11 -190 150 -91 14 123 27 -198 -105 140 -29 228
6376B28k11J9M0k95N5K38k07J75n6k09K74J2q4j43K58l27J39J83n8k86Q9K39J16
6399A89j51lJ3J26J78l55J18k23J9J9J03j64J34K08l79K81q0J4l4O3l9r4Q6Q1
6423A10k46L29l03R6M3q9r6K21J56j39k51L88k81J03J10l30L13k44K45r1j57J23
6445A0j2K5P8M4J68l77j44K80n9O2o2j46K66p6l17J71MJ32p1P4j17j48L43J8L8
6470A84k10q5n0N3J17J77k64J15j6n6j40K11P5q0m3r9J11r1k60K78L1l6J94k45
6494a29K07j35J72K10l46k05L32l55L10K6M0j54r4K21k50J37N2n4N1r2L21k0l23
6517g8k81M04j8J55k44n8K69k35k4P5RM02l09k40j5J87MN5K19k41O9%j32m5J9
6542e3j2j11K89m5j53M1J5J18j15Q1PK0k20j07J71J47P6l31N01n09J54M7q1J03
$$ plain form
6376 228 17 36 76 -219 -164 74 -133 42 -14 -223 51 63 -21 -164 94 -233 -94 89 31 -255 -166 73 189
6399 189 38 35 48 174 352 -3 115 -108 -89 -70 33 -131 3 211 -168 113 33 47 13 76 37 -57 29 110
6423 110 -136 193 -110 -14 29 -60 -156 65 221 82 -169 219 -62 41 151 -179 134 -110 135 44 -113 10
6445 10 -2 23 101 145 313 -64 -208 72 13 75 13 -133 133 57 -260 -89 -85 47 -24 50 -67 -215 128 146 184
6470 184 -26 -111 -161 -108 9 186 -78 37 21 -35 -175 36 111 31 -12 -111 0 -91 -351 -73 -42 -78 116 -129
6494 -129 78 -57 115 325 -21 -226 106 -249 61 87 127 -27 -121 100 -150 -13 39 -15 36 -56 265 245 -78
6517 -78 -359 45 27 182 -62 -120 149 -86 -110 -35 -26 376 67 -173 -188 -1 3 58 277 36 105 105 -27 -72 -53
6542 -53 -65 -176 113 68 -85 -44 -29 89 -26 55 62 82 -138 -245 -74 73 149 -182 319 -190 -36 11 -70 33
6566C3l43L22j11j28M2J44m9J21Pr7p8J71J18j68m7M0j23KJ98l13J30K65N2k82
6590i4M1J53l2K5P8l17M97m55j85J69K13J32j79l0O5p3j37N4O3j52j8J6K08Q6
6614A28r9P7K0l31K2L1P1M12l69j9P0K00k55q2Q1K09j10j81K08j47Q4K38j91O2
6638A29O8k57K34j27j12J22K6k27K39K00n2n26K70J46L5n3k63J21O1j46j48L55
$$ plain form
6566 33 -310 12 -99 -227 -185 -41 -90 31 38 -59 -137 34 152 -16 -63 -23 -146 -144 54 -259 -129 136 188 -94
6590 -94 -53 100 68 93 171 -146 351 -104 -289 -120 93 225 46 16 81 8 -129 -75 -12 -164 -182 -166 42 128
6614 128 29 106 126 -205 -183 -152 -81 331 -38 -57 13 213 -42 -124 -43 166 56 -125 83 -64 20 258 67 129
6638 129 197 -60 174 47 -65 57 83 -144 95 295 243 -283 -13 133 168 115 -148 -27 34 -112 -260 95
$$ [...]
8191a49
##END NTUPLES=NMR FID
##END=
