##TITLE=1H_LR-758-R6-RM2-C1K1
 CCl4
 8 sc, 
 28.9.2023
##JCAMPDX= 6.0         $$ Bruker NMR JCAMP-DX V2.0
##DATA TYPE= NMR FID
##DATA CLASS= NTUPLES
##ORIGIN= UXNMR, Bruker Analytische Messtechnik GmbH
##OWNER= root
$$ XWIN-NMR		Version 3.5
$$ Thu Sep 28 16:29:07 2023 Russian Standard Time (UT+4h)  she@DPX200
##.OBSERVE FREQUENCY= 200.1305
##.OBSERVE NUCLEUS= ^1H
##.DELAY= (6, 6)
##.ACQUISITION MODE= SIMULTANEOUS
##.ACQUISITION SCHEME= undefined
##.AVERAGES= 8
##.DIGITISER RES= 18
##SPECTROMETER/DATA SYSTEM= spect
##.PULSE SEQUENCE= zg30
##.SOLVENT NAME= Acetone
##.SHIFT REFERENCE= (INTERNAL, Acetone, 0, 15.7039)
##AUDIT TRAIL= $$ (NUMBER, WHEN, WHO, WHERE, WHAT)
$$ ##TITLE= Audit trail, XWIN-NMR		Version 3.5
$$ ##JCAMPDX= 5.01
$$ ##ORIGIN= Bruker BioSpin GmbH
$$ ##OWNER= she
$$ F:/spectra/data/she/nmr/H-F/1/audita.txt
$$ ##AUDIT TRAIL=  $$ (NUMBER, WHEN, WHO, WHERE, WHAT)
(   1,<2023-09-28 16:28:14.90 +0400>,<she>,<DPX200>,
      <created by zg, POWCHK disabled, PULCHK disabled
       configuration hash MD5:
       00 E9 B6 7A A2 85 ED C7 34 08 36 98 17 FE 4E 26
       data hash MD5: 16K
       FE D7 B7 61 C3 A2 D2 D8 12 F0 BC 8A 39 75 7D 17>)
$$ ##END=
$$ 
$$ hash MD5
$$ DB AA 34 F4 46 19 ED 94 54 EF 43 81 AA F1 55 3D
##$RELAX= 
##$RELAX= 
##$RELAX= 
##$RELAX= 
##$RELAX= 
##$RELAX= 
$$ Bruker specific parameters
$$ --------------------------
##$DU= <F:/spectra>
##$EXPNO= 1
##$NAME= <H-F>
##$PROCNO= 1
##$TYPE= <nmr>
##$USER= <she>
##$AMP= (0..31)
100 100 100 100 100 100 100 100 100 100 100 100 100 100 100 100 100 100 
100 100 100 100 100 100 100 100 100 100 100 100 100 100 
##$AQSEQ= 0
##$AQ_mod= 1
##$AUNM= <au_zg>
##$AUTOPOS= <>
##$BF1= 200.13
##$BF2= 200.13
##$BF3= 200.13
##$BF4= 200.13
##$BF5= 200.13
##$BF6= 200.13
##$BF7= 200.13
##$BF8= 200.13
##$BYTORDA= 1
##$CFDGTYP= 0
##$CFRGTYP= 5
##$CHEMSTR= <none>
##$CNST= (0..31)
1 1 145 1 1 1 1 1 1 1 1 1 1 1 1 1 1 1 1 1 1 1 1 1 1 1 1 1 1 1 1 1 
##$CPDPRG= <>
##$CPDPRG1= <>
##$CPDPRG2= <>
##$CPDPRG3= <>
##$CPDPRG4= <mlev>
##$CPDPRG5= <mlev>
##$CPDPRG6= <mlev>
##$CPDPRG7= <mlev>
##$CPDPRG8= <mlev>
##$CPDPRGB= <>
##$CPDPRGT= <>
##$D= (0..31)
0 1.2 0 0 0 0 0 0 0 0.06 0 0.03 0 0 0 0 0.0002 0 0 0 0 0 0 0 0 0 0 0 0 
0 0 0 
##$DATE= 1695904094
##$DBL= (0..7)
120 120 120 120 120 120 120 120 
##$DBP= (0..7)
150 150 150 150 150 150 150 150 
##$DBP07= 0
##$DBPNAM0= <>
##$DBPNAM1= <>
##$DBPNAM2= <>
##$DBPNAM3= <>
##$DBPNAM4= <>
##$DBPNAM5= <>
##$DBPNAM6= <>
##$DBPNAM7= <>
##$DBPOAL= (0..7)
0.5 0.5 0.5 0.5 0.5 0.5 0.5 0.5 
##$DBPOFFS= (0..7)
0 0 0 0 0 0 0 0 
##$DE= 6
##$DECBNUC= <off>
##$DECIM= 32
##$DECNUC= <off>
##$DECSTAT= 4
##$DIGMOD= 1
##$DIGTYP= 9
##$DL= (0..7)
0 120 120 120 120 120 120 120 
##$DP= (0..7)
150 150 150 150 150 150 150 150 
##$DP07= 0
##$DPNAME0= <>
##$DPNAME1= <>
##$DPNAME2= <>
##$DPNAME3= <>
##$DPNAME4= <>
##$DPNAME5= <>
##$DPNAME6= <>
##$DPNAME7= <>
##$DPOAL= (0..7)
0.5 0.5 0.5 0.5 0.5 0.5 0.5 0.5 
##$DPOFFS= (0..7)
0 0 0 0 0 0 0 0 
##$DQDMODE= 0
##$DR= 18
##$DS= 0
$$ [...]
##$SUBNAM2= <"">
##$SUBNAM3= <"">
##$SUBNAM4= <"">
##$SUBNAM5= <"">
##$SUBNAM6= <"">
##$SUBNAM7= <"">
##$SUBNAM8= <"">
##$SUBNAM9= <"">
##$SW= 18.0518050122584
##$SWIBOX= (0..15)
0 0 2 0 0 0 0 0 0 0 0 0 0 0 0 0 
##$SW_h= 3612.71676300578
##$TD= 16384
##$TD0= 1
##$TE= 0
##$TE2= 300
##$TE3= 300
##$TEG= 300
##$TL= (0..7)
0 120 120 120 120 120 120 120 
##$TP= (0..7)
150 150 150 150 150 150 150 150 
##$TP07= 0
##$TPNAME0= <>
##$TPNAME1= <>
##$TPNAME2= <>
##$TPNAME3= <>
##$TPNAME4= <>
##$TPNAME5= <>
##$TPNAME6= <>
##$TPNAME7= <>
##$TPOAL= (0..7)
0.5 0.5 0.5 0.5 0.5 0.5 0.5 0.5 
##$TPOFFS= (0..7)
0 0 0 0 0 0 0 0 
##$TUNHIN= 0
##$TUNHOUT= 0
##$TUNXOUT= 0
##$USERA1= <user>
##$USERA2= <user>
##$USERA3= <user>
##$USERA4= <user>
##$USERA5= <user>
##$V9= 5
##$VALIST= <valist>
##$VCLIST= <CCCCCCCCCCCCCCC>
##$VD= 0
##$VDLIST= <DDDDDDDDDDDDDDD>
##$VPLIST= <PPPPPPPPPPPPPPP>
##$VTLIST= <TTTTTTTTTTTTTTT>
##$WBST= 1024
##$WBSW= 4
##$XGAIN= (0..3)
0 0 0 0 
##$XL= 0
##$YL= 0
##$YMAX_a= 108461
##$YMIN_a= -125635
##$ZGOPTNS= <>
##$ZL1= 120
##$ZL2= 120
##$ZL3= 120
##$ZL4= 120
##$ABSF1= 10
##$ABSF2= 0
##$ABSG= 5
##$ABSL= 3
##$ALPHA= 0
##$AQORDER= 0
##$ASSFAC= 0
##$ASSFACI= 0
##$ASSFACX= 0
##$ASSWID= 0
##$AUNMP= <proc_1d>
##$AZFE= 0.1
##$AZFW= 0.1
##$BCFW= 1
##$BC_mod= 2
##$BYTORDP= 1
##$COROFFS= 0
##$CY= 11.3945322036743
##$DATMOD= 1
##$DC= 2
##$DFILT= <>
##$DTYPP= 0
##$F1P= 15.7292609196834
##$F2P= 12.9074282941183
##$FCOR= 0.5
##$FTSIZE= 0
##$FT_mod= 4
##$GAMMA= 1
##$GB= 0.15
##$INTBC= 1
##$INTSCL= 1
##$ISEN= 128
##$LB= 0.24
##$LEV0= 0
##$LPBIN= 0
##$MAXI= 10000
##$MC2= 0
##$MEAN= 0
##$ME_mod= 0
##$MI= 1.114404
##$NCOEF= 0
##$NC_proc= 0
##$NLEV= 6
##$NOISF1= 3.799351
##$NOISF2= 2.8
##$NSP= 1
##$NTH_PI= 0
##$NZP= 0
##$OFFSET= 15.70392
##$PC= 1
##$PHC0= -21712.55
##$PHC1= 16.65271
##$PH_mod= 1
##$PKNL= yes
##$PPARMOD= 0
##$PSCAL= 0
##$PSIGN= 0
##$REVERSE= no
##$SF= 200.130013532006
##$SI= 16384
##$SIGF1= 3
##$SIGF2= 2
##$SINO= 400
##$SIOLD= 16384
##$SREGLST= <1H.CDCl3>
##$SSB= 0
##$STSI= 0
##$STSR= 0
##$SW_p= 3612.71676300578
##$SYMM= 0
##$S_DEV= 0
##$TDeff= 0
##$TDoff= 0
##$TI= <>
##$TILT= no
##$TM1= 0
##$TM2= 0
##$TOPLEV= 0
##$USERP1= <user>
##$USERP2= <user>
##$USERP3= <user>
##$USERP4= <user>
##$USERP5= <user>
##$WDW= 1
##$XDIM= 8192
##$YMAX_p= 0
##$YMIN_p= 0
$$ End of Bruker specific parameters
$$ ---------------------------------
##NTUPLES= NMR FID
##VAR_NAME=  TIME,          FID/REAL,        FID/IMAG
##SYMBOL=    X,             R,               I
##VAR_TYPE=  INDEPENDENT,   DEPENDENT,       DEPENDENT
##VAR_FORM=  AFFN,          ASDF,            ASDF
##VAR_DIM=   8192,          8192,            8192
##UNITS=     SECONDS,       ARBITRARY UNITS, ARBITRARY UNITS
##FACTOR=    0.0002768,     1,               1
##FIRST=     0,             0,               0
##LAST=      2.2672688,     0,               0
##MIN=       0,             -125635,         0
##MAX=       2.2672688,     108461,          0
$$ Real data points
##PAGE= N=1
##DATA TABLE= (X++(R..R)), XYDATA
$$ [...]
1773H8R3j58pl8j50K23l2O9J79l1l18q1o4N9J01J04Q4k21K20j6k02n7M6J37J27
$$ 88 181 23 16 -22 -172 51 19 88 267 236 -82 -163 -227 -168 -67 37 121 -100 120 104 -98 -155 -109 28 155
1798A55k0k4j78j30L49j79M8L34k36j17j26J86j12j96L42J28j30j77J49J41l91
$$ 155 135 111 -67 -197 152 -27 21 355 119 2 -124 62 -50 -246 96 224 94 -83 66 207 -184
1819a84j53L56j46J08R1K82m79J69J56l11k06K25L23l26M2J22j45J27J20K0j93
$$ -184 -337 19 -127 -19 72 354 -125 44 200 -111 -317 -92 231 -95 -53 69 -76 51 171 191 -2
1840bl6M0m5o4R6K15M5k53Q1L1l46J63L7K13j22P1k16R5j42j60M60l52J97L16
$$ -2 -38 2 -43 -107 -11 204 249 -4 77 108 -238 -75 -38 175 53 124 -92 3 -139 -299 161 -191 6 322
1864C22l97J12J32n12J10N41j91k58L92j41k78O7R0Q2j57JKL06J1j36l02q8L08
$$ 322 -75 37 169 -343 -233 308 117 -141 251 110 -168 -101 -11 71 -86 -85 -83 223 234 98 -204 -292 16
1887A6lJ16j79K94k29j9j61J8P2m5K05J64m23K6pK91k59P4r4J42j39K15r2k64
$$ 16 13 129 -50 244 15 -4 -165 -147 -75 -120 85 249 -174 -148 -155 136 -123 -49 -143 -1 -140 75 -17 -281
1911b81L23J38k35j99K08m8K50l50K72m8L4O8N8j52m62L72J60m31L91J19N0m32
$$ -281 42 180 -55 -254 -46 -94 156 -194 78 30 64 132 190 38 -424 -52 108 -323 68 187 237 -195
1933a95M8K95l27J56K83k69K65j43n2l04J01K25j05O3J33j13jr9o7l2J54J84J0
$$ -195 -147 148 -179 -23 260 -9 256 113 61 -243 -142 83 -22 41 174 61 60 -39 -106 -138 16 200 210
1956B10j16J08k06O3j05j78M90l51NK49l29L%R6M6M8l2N1j99K84j27Q6l17J89
$$ 210 94 202 -4 59 -46 -224 266 -85 -80 169 -160 -157 -157 -61 -15 33 1 52 -147 137 10 96 -221 -32
1980c2M0k81J2J47K87j09P4p1j52O5R7k92K73k47L25n1J3Q7j47j91J50K49m11
$$ -32 8 -273 -261 -114 173 64 138 67 -85 -20 77 -215 58 -189 136 85 98 185 38 -153 -3 246 -165
2003a65L80J05r8k83j51K71m8n0K96k18K70k46k33l0k8l1R6J77K46R0n66n3K43
$$ -165 215 320 222 -61 -212 59 11 -39 257 39 309 63 -170 -200 -228 -259 -163 14 260 350 -216 -269 -26
2026b6k13P6k0K67j31p0Q6M9K0j94R1L48j81j26j36M3o7J49J49j77P8o6n8Lj6
$$ -26 -239 -163 -183 84 -47 -117 -31 18 38 -156 -65 283 102 -24 -160 -117 -184 -35 114 -63 15 -51 -109 -106 -122
2051a22M8J41L6J94m49m3L58k4j65J11j25j57L20j61J95j54R7%l04k2J65k10J84
$$ -122 -74 67 103 297 -152 -195 163 139 -26 85 -40 -197 123 -38 157 3 100 100 -204 -226 -61 -271 -87
2074h7K83j31j01p9K1K99l01j17M49m20j3K03J89j80p2QnM9n4NJ35k51M13l40
$$ -87 196 65 -36 -115 -94 205 -96 -213 236 -184 -197 6 195 15 -57 -49 -54 -5 -59 -54 81 -170 243 -97
2098i7K4J54J30j57j07lM5lj1K8J14r0p7l7n9P1M5K81k51J06J47j77j79n1j16
$$ -97 -73 81 211 54 -53 -56 -11 -14 -25 3 117 27 -50 -87 -146 -75 -30 251 0 106 253 76 -103 -154 -270
2123b70J05L02J1l33M25J4l97J02Q5k47K24R8nj38m8q5K66k57J19J37O1j40r3
$$ -270 -165 137 148 -185 240 254 -143 -41 44 -203 21 119 114 -24 -72 -157 109 -148 -29 108 169 29 -64
2146f4L11r2k63J59q6k30K26N8R7j18K41k69j3J70k82J51P6%j32J51m05N29m18
$$ -64 247 155 -108 51 -35 -265 -39 19 116 -2 239 -30 -43 127 -155 -4 72 72 -60 91 -314 215 -203
2169b03l0K69k35K30k26J82j32J68l6j69L5K3L25j99k04l0L16q4J89j83j5R8j20
$$ -203 -233 36 -199 31 -195 -13 -145 23 -13 -182 -147 -124 201 2 -202 -232 84 0 189 6 -9 89 -31
2192c1j58L2P2Q5Mk9Q4J23l33J11R9m7m5L9Rj74L43o5n1J92k45k2M1k7k6J06Q9
$$ -31 -189 -157 -85 0 4 -25 59 182 -151 -40 59 12 -33 6 15 -159 184 119 68 260 15 -7 34 7 -19 87 176
2219A76m3k61j04L18qj59J45J99j46k14j8J40J6k05K17J81o5m00K96M3k27R4j05
$$ 176 133 -128 -232 86 78 -81 64 263 117 -97 -115 25 41 -164 53 234 169 -231 65 108 -119 -25 -130
2242a30J72m8j25N2j47K43o5J58k02O4K07k50rL19l13o4J42j65K69l6o0p3j2k31
$$ -130 42 -6 -131 -79 -226 17 -48 110 -92 -28 179 -71 -80 239 -74 -138 4 -161 108 72 12 -61 -73 -304
2266c04L61l2n3J07q9K4l9p3o4J84N5J16j67k8j53K50j21J34J38l19K46k14K7
$$ -304 57 25 -28 79 -10 14 -25 -98 -162 22 77 193 26 -2 -155 95 -26 108 246 -73 173 -41 -14
2289a4j56K26J69m87L28k8j60L04j50pM0l8J08mok18o6j83N73l14K5P3k08J79
$$ -14 -170 56 225 -262 66 38 -122 182 32 25 65 27 135 131 125 -93 -159 -342 231 -83 -58 15 -193 -14
2313a4j74J26J35K12m08J38r0j27K87mJ38l14J39j8k10R2n2J77k53N13j35p4P0
$$ -14 -188 -62 73 285 -123 15 -75 -202 85 81 219 -95 44 26 -184 -92 -144 33 -220 293 158 84 154
2336A54j64J30k02l0K93p9J05K9j39q5J28lK5k62M9J80n7j28R4L34l64l0l9K44
$$ 154 -10 120 -82 -112 181 102 207 236 97 12 140 137 162 -100 -51 129 72 -56 38 372 8 -22 -61 183
2360A83l20N1M9L17m73n7L60Rj22l4j35K33l68L16j37j33J69J40j25J21j98J12
$$ 183 -137 -86 -37 280 -193 -250 110 119 -3 -37 -172 61 -307 9 -128 -261 -92 48 -77 44 -154 -42
2382d2J15QJ16k34j9j21J03K2P6J11j00J13k35j08J16J12J2K3Q7j85L7J04j83
$$ -42 73 81 197 -37 -56 -177 -74 -52 24 135 35 148 -87 -195 -79 33 45 68 155 -30 7 111 -72
2405g2j65K21O3j64J11mj87J52MlK97m6k82R8R0l01m5P7N8k47N10k56K74R7k26
$$ -72 -237 -16 47 -117 -6 -10 -197 -45 -41 -44 253 207 -75 23 113 -188 -233 -156 -98 -345 165 -91 183 280 54
2430E4j04K70k63K63m66J13K98o3o1L20m20P1l13M63k01O1J21k88K36j9J69j82
$$ 54 -50 220 -43 220 -246 -133 165 102 41 361 -59 12 -301 162 -39 22 143 -145 91 72 241 59
2452E9J6j14L50k44j08K60j12j71q0J1j15J34K15j34N0k4J77J10l46j5n4K70j3
$$ 59 75 -39 311 67 -41 219 107 -64 -144 -133 -248 -114 101 -33 17 -7 170 280 -66 -81 -135 135 122
2475A22o8j25J95j72J9J17k89K90Lk23K59l4p4K20k95M25l76o4kJ00k14K62J00
$$ 122 54 -71 124 -48 -29 88 -201 89 92 -131 128 94 20 240 -55 370 -6 -70 -72 28 -186 76 176
2498A76o9j56M6k4L6j94O8M7J90p3L6p2J62j64O6K36k29j12J17J3l01J29J51k7
$$ 176 107 -49 -3 -27 9 -185 -117 -70 120 47 83 11 173 9 75 311 82 -30 87 100 -201 -72 79 52
2522E2M7k80M11m32K31J58j76j1q6j8J06J83l03J71o7O1J89k08m4L8P1j6j27n5
$$ 52 99 -181 230 -202 29 187 11 0 -86 -104 2 185 -118 53 -14 47 236 28 -16 22 93 77 -50 -105
2546a05K68r2M5j36J2J33Ll00L45l62M06p0j65J75k05R2n7J46l1rk16k3J84K7
$$ -105 163 71 116 -20 -8 125 128 -172 173 -189 217 147 -18 157 -48 44 -13 133 102 93 -123 -146 38 65
2570F5j47N6j3J11p4P3mk05J19q2J05o1J68j14j54r1K00m6M8K11j7k60K33j40
$$ 65 -82 -26 -39 72 -2 71 67 -138 -19 -101 4 -57 111 -3 -157 -248 -48 -94 -46 165 148 -112 121 -19
2594a9r5J41J70j12k4J13m78J24L76k30j59L69j04j03O6p3j2k59J59k42K93O1
$$ -19 -114 27 197 85 61 174 -304 -180 196 -34 -193 176 72 -31 35 -38 -50 -309 -150 -392 -99 -38
2616c8J2j40R8J05n7j9N0R1j2k47j14L38j25j00L64l36Q4k95M20j95o8M57m92
$$ -38 -26 -166 -68 37 -20 -39 11 102 90 -157 -271 67 -58 -158 206 -130 -46 -341 79 -116 -184 273 -219
2639b19L59l5m1j17qj6K11p7k4k06K57k56K78j20n9J80P0J9k72kk02K13j7J17
$$ -219 140 105 64 -53 -61 -77 134 57 33 -173 84 -172 106 -14 -73 107 177 196 -76 -78 -280 -67 -84 33
2663C3M5n6m1r5MJ35k87J12J74p8K52nk51K85l07O5L15p6l73J14k5j42R4K00l5
$$ 33 78 22 -19 -114 -110 25 -262 -150 24 -54 198 193 -58 227 -80 -15 300 224 -149 -35 -60 -202 -108 92 57
2688E7j04J45k36J22j0J50k94K59J53k82K65j74j49L5mj61J01K68j40p9j13K96
$$ 57 -47 98 -138 -16 -26 124 -170 89 242 -40 225 51 -98 -63 -67 -228 -127 141 1 -78 -191 105
2710A05j24N8J05q1M4j28q2k51j0M62l03J40MN4J18l05L38J77j63j45o9OO6L3
$$ 105 -19 39 144 63 107 -21 -103 -354 -364 98 -205 -65 -61 -7 111 -194 144 321 158 13 -56 -50 16 49
2734D9k14L17j34L91n31N3K66n9k90J30j19L87k44j41K10j70o2O9n2J37L1Nj63
$$ 49 -165 152 18 409 -122 -69 197 138 -152 -22 -141 246 2 -139 71 -99 -161 -92 -144 -7 24 29 -134
2757a34j18K62k24L75j05j38K04k38M2j04K86J28l14Q8j8jr2l2M09l02M6j7Q5
$$ -134 -252 10 -214 161 56 -82 122 -116 -74 -178 108 236 -78 10 -8 -9 -101 -133 276 -26 20 3 88
2780H8m9r5K73l25J32j76J02J14k11q0K01Q2j0k6J92j29j7k44K27n6j27J58K4
$$ 88 39 -56 217 -108 24 -152 -50 64 -147 -227 -26 56 46 20 212 83 66 -178 49 -7 -134 24 48
2803D8j46L00j19k07j6K05q5K14r1j15k8k64K19J68J59k83Oo5J49Ll7k52L06l87
$$ 48 -98 202 83 -124 -140 65 -20 194 103 -12 -40 -304 -85 83 242 -41 -35 -100 49 52 15 -237 69 -318
2827c18M82q5m25L94k82L89k14j54L11o9q5K35l01k5K78l7k90K02J40j59o7o3
$$ -318 164 79 -346 48 -234 155 -59 -213 98 29 -56 179 -122 -147 131 94 -196 6 146 -13 -80 -143
2849a43O2q8N2K52q4K20j80j31l1K02O7Q6m34K19k0o7N4n0Q0j49L8J40j8k5j85
$$ -143 -81 -169 -117 135 51 271 91 -40 -71 131 198 284 -150 69 49 -18 36 -14 66 -83 -45 95 77 52 -133
2874a33J58m6k54L26k11K12o3k9J50k02K38l30L05k86J72J5j18p7K0J57m0n0j45
$$ -133 25 -21 -275 51 -160 52 -11 -40 110 -92 146 -184 121 -165 7 22 -96 -173 -153 4 -36 -86 -231
2897b31J93Mj4Q6QN0J47k61n0M7Nk41J81L13j54K6M5l8k50j48K1M01k99N28j63
$$ -231 -38 -34 -48 38 46 96 243 -18 -68 -21 -16 -257 -76 237 83 109 154 116 -134 -282 -261 140 -159 369 206
2922B06k15j43k1J24L63k11j23J20j18J92l68J19K27k5q2J79k60m0N5j6K31l88
$$ 206 -9 -152 -173 -49 314 103 -20 100 -18 174 -194 -75 152 127 45 224 -36 -76 -21 -37 194 -194
2944a94QL53K3k58q1J45j06K29n8J08l19R8O6Q7K8om3K1M0k16J74k40R8ml81N06
$$ -194 -186 167 190 -68 -149 -4 -110 119 61 169 -150 -52 14 101 129 123 80 101 141 -75 99 -141 -43 -47 -428 78
2970G8j06R6j50L4J82k76M6K77k32p0M11k75p1j50J74M29o57K27R7m0jQ4N5p0
$$ 78 -28 68 -82 -48 134 -142 -96 181 -51 -121 290 15 -56 -206 -32 397 -260 -33 64 24 23 107 162 92
2994I2N5j07J27k14n7q4K73mK25l93n0L23k60P1n2L8j8M4k16K11J48l12J45l0
$$ 92 147 40 167 -47 -104 -188 85 81 306 -87 -137 186 -74 -3 -55 -17 -35 9 -207 4 152 -160 -15 -45
3018d5J36k25K74r9m1K51k02n5J19r8k95M2J72O1l30L30j47K17j35J55j2j16M5
$$ -45 91 -134 140 41 0 251 49 -6 113 15 -280 -238 -66 -5 -335 -5 -152 65 -70 85 73 -43 2
3041BJ7k43K40J04j35m4j7K02lk33J69j45r3K03k7M06k78L3j63J30j01M7m4nj7
$$ 2 19 -224 16 120 -15 -59 -76 126 123 -110 59 -86 -179 24 -3 403 125 158 -5 125 24 71 27 22 5
3066EL06l76N4J5N7l76K60J29j12Q5qK73j43q0P1l13K13K4n6j82O8LJ75k8j01
$$ 5 311 -65 -11 4 61 -315 -55 74 -38 47 39 312 169 89 160 -153 60 84 28 -154 -86 -83 92 64 -37
3091c7K53k41Ml5K34j52K17j32m1o6o6J01PP7k52L37l25K96j11k30L53k06j5l27
$$ -37 216 -25 -21 -56 178 26 243 111 70 4 -62 39 46 123 -129 208 -117 179 68 -162 191 -15 -30 -357
3115c57L22K8j6j4j68K80r1J6L08j07j28J4n1j7j66R4O4J8k19K30K3k11J28j7
$$ -357 -35 -7 -23 -37 -205 75 -16 0 308 201 73 87 36 19 -147 -53 11 29 -190 40 63 -148 -20 -37
3139c7q3J61j61J14q1J46l2M4j68J09O4J52n07K46K30j99J17P4j01L6j33j61N1
$$ -37 -120 41 -120 -6 -87 59 27 71 -97 12 76 228 -279 -33 197 -2 115 189 88 124 -9 -170 -119
3162a19P7J43p4Rr0N2o3J98r3L6K3j39j8J99l10J97L5j54K6R2O1O7j51M0O6o2
$$ -119 -42 101 27 36 -54 -2 -65 133 40 76 99 -40 -58 141 -169 28 63 -91 -65 27 88 155 4 44 110 48
3188D8j28j35N6J34J18Q1k04L5k5J18p2k10M14j40m4m0j65J77M6l86O59j87n2
$$ 48 -80 -215 -159 -25 93 174 -30 5 -20 98 26 -184 230 90 46 6 -159 18 64 -322 337 150 98
3211I8j82K56k04J36Mj02r3J0J79l58L76j61q3l9J10R1K4l5j37J88l19J19J18
$$ 98 -84 172 -32 104 108 6 -87 -77 102 -256 120 -41 -124 -163 -53 38 62 27 -110 78 -241 -122 -4
3234dj3j03K78k33K46k19j43JK86j92K95l24J47J00j70J90k17m2j13K85q8L5Q9
$$ -4 -17 -120 158 -75 171 -48 -191 -190 96 -96 199 -125 22 122 -48 142 -75 -117 -230 55 -33 2 91
3257I1J3k01J79j19N6K8l0j21J31R6j41J00k67K43k87K83j77Q5L4j67K25j99j06
$$ 91 104 -97 82 -37 19 47 17 -104 27 123 -18 82 -185 58 -229 54 -123 -38 -4 -171 54 -145 -251
3280b51M30mj57p0m6R9K5j5p7J31l8k00o1L03j90P6J02j68j59L51j18Q2o0k5K75
$$ -251 179 175 18 -52 -98 1 26 11 -66 65 27 -173 -234 69 -121 -45 57 -111 -270 81 -37 45 -15 -40 235
3305B35j95P4n6k1J0J12j36j56K72j91R3O9k41K65k37K7K9M8J2J96l30K5L14p9
$$ 235 40 114 58 37 47 159 23 -133 139 -52 41 110 -131 134 -103 -76 -47 1 13 209 -121 -96 218 139
3329A39j80o8M28k45qL7j90J62k53j05M47j48n9M6J01K98l94r0L64k85J14k84
$$ 139 -41 -109 319 74 66 103 -87 75 -178 -283 164 16 -43 3 104 402 8 -82 282 -3 111 -173
3351a73J61K12j67n6m2j2J81q6j39P1j68K23j01J47j29L4K32j91k21M7J14R5J21
$$ -173 -12 200 33 -23 -65 -77 104 18 -121 -50 -218 5 -96 51 -78 -44 188 -3 -224 -177 -63 32 153
3374A53k2l01J96j36K21j59J30O0k26O8p9J87l15J18N7L26k87J1K68l54J94j43
$$ 153 131 -170 26 -110 111 -48 82 142 -84 -16 -95 92 -223 -105 -48 278 -9 2 270 -84 110 -33
3396c3J37K6j84N2M0J5r0K95k7j09j74R4J38j10R8j31jJ75J9P3j79j56p0J03j50
$$ -33 104 130 -54 -2 38 53 -37 258 231 122 -52 42 180 70 168 37 36 211 230 303 124 -32 -102 1 -149
3421a49J39K21j66R7l20rJ56J48j89j79O1P6j85J38K08j02j55K82j04J07k17p0
$$ -149 -10 211 45 142 -178 -187 -31 117 -72 -251 -190 -114 -299 -161 47 -55 -210 72 -32 75 -142 -212
3443b12J33l7K14r0K08Kj02j83n6J19m3j00J13J08r9P5J04k02J48l31L14Mk21
$$ -212 -79 -116 98 8 216 218 116 -67 -123 -4 -47 -147 -34 74 -25 50 154 -48 100 -231 83 87 -134
3466a34L50k00k04J28J93j85j42N3J75R5m3j42r9k2M23k39Q3r2j17Q0j09R1J1
$$ -134 216 16 -188 -60 133 -52 -194 -141 34 129 86 -56 -155 -177 246 7 90 -2 -119 -39 -148 -57 -46
3489d6J95k78J23qq4J47K1r6J44j34j56K89j36k04K28J95j68K14o33K58l2J54
$$ -46 149 -129 -6 -14 -98 49 70 -26 118 -16 -172 117 -19 -223 5 200 32 246 -387 -129 -161 -7
3511gj24J75J0k2Pj03K44k93J64L1n6R0N0j69k03P9L31l86L64l12M38m15R4m7
$$ -7 -131 44 54 32 39 -64 180 -113 51 82 26 116 166 -3 -206 -127 204 -182 182 -130 308 -107 -13 -60
3535f0j1NJ77kk04j36L09L6k04J09rK33q3l0q4k22K97k85J19M4L3J7j30P7K88
$$ -60 -71 -66 111 109 -95 -231 78 114 -90 19 10 243 160 130 46 -176 121 -164 -45 -1 32 49 -81 -4 284
3560B84m12M27l01J22k09k23qK54L09j71M2k33K2p5R8J31j23K75o4k46J01N3k05
$$ 284 -128 299 -2 120 -89 -312 -320 -66 243 72 114 -119 -97 -172 -74 57 -66 209 145 -101 0 53 -152
3583a52L5RN7k9J54j80K56m50K19j2L2L7j63O8J37K6j74J24Lj43K6J54m45K53
$$ -152 -117 -108 -51 -80 74 -106 150 -300 -81 -93 -61 -24 -187 -119 18 44 -130 -6 -3 -146 -120 34 -411 -158
3607a58k29L51J03Omk6j63R8L7k23L22j73J44L5J42j62j30J83k34L48l82L22k06
$$ -158 -387 -36 67 73 69 43 -120 -22 15 -208 114 -59 85 120 262 100 -30 153 -81 267 -115 207 1
3630AL9j87J72J66m17L93r2k9P7n0K42m95lK79J41l46J26J26j41L3l03K14J66
$$ 1 40 -147 25 191 -226 167 75 46 123 73 315 -180 -183 96 237 -109 17 143 2 35 -268 -54 112
3653A12j95J04R0ll38J78J04k31M96l54J03k85K64J5k05J95j09Q9M4K14j30M8
$$ 112 -83 21 111 108 -230 -52 52 -179 317 -37 66 -219 45 60 -145 50 -59 30 74 288 158 206
3675B06k22J4Q6Q2k86m8J86J45j66j07J6J14m5k3j07M7J14J09j75j84O33k76O7
$$ 206 -16 -2 84 166 -120 -168 18 163 -3 -110 -94 20 -25 -48 -155 -108 6 115 -60 -244 389 113 180
3698A80l01J86J5L0J87Ol01K1P3j84M12j75m6j08K43j62j4R8l98J44J48O9k52
$$ 180 -121 65 80 110 297 303 2 23 96 -88 324 149 103 -5 238 76 62 160 -238 -94 54 123 -129
3721a29J03k2J87RK5j08n4P3j07n6R0Q4P0k88L38j60p5mj44J92M5k18J67J98r3
$$ -129 -26 -48 139 148 173 65 11 84 -23 -79 11 95 165 -123 215 55 -20 -24 -168 24 69 -149 18 216 123
3746A23M5k19J13j08J55j84J55k77R2N8NK35k69%J45J0j24J50Qj48o4J45k7j04
$$ 123 168 -51 62 -46 109 -75 80 -197 -105 -47 -42 193 -76 -76 69 79 -45 105 113 -35 -99 46 19 -85
3770h5K11k6Q5m5m6M5q7J31p4k60J43j8Q9j36K42l28L56j83J81l47K22J0j85K
$$ -85 126 100 185 140 94 139 52 183 109 -151 -8 -26 63 -73 169 -159 197 14 195 -152 70 80 -105 -103
3794a03J36J25l75J31J49Q2j98R1m2R2kRo8l00M36j54K5j23oj17K44n8p3o9N21
$$ -103 33 158 -217 -86 63 145 -53 38 -4 88 86 95 27 -273 163 9 34 -89 -95 -212 32 -26 -99 -168 353
3819C53k18j60J48p1k2j3k58K12J59j00J25n25O59l60O9J54k16L6L8j31q6L69
$$ 353 135 -25 123 52 30 17 -241 -29 130 30 155 -370 289 -71 -2 152 -64 -28 10 -121 -207 162
3841A62p9J18l38J83J45k29l4J56jj16L38k78J61k65k6l6J15m6Q8n4J76k60M00
$$ 162 83 201 -137 46 191 -38 -72 84 83 -33 305 27 188 -77 -103 -139 -24 -70 18 -36 140 -120 280
3864B80j76q8L0J11k97J69p7K93k82n4K04j13J71m36L56J03p4q7j02K67j40P2
$$ 280 104 16 46 157 -140 29 -48 245 -37 -91 113 0 171 -265 91 194 120 33 -69 198 58 130
3886A30l46J77L12m38K64O8n3p5k90nJ72J44J76l30PL96l39j38L35j12P8J36l76
$$ 130 -216 -39 273 -165 99 167 114 39 -251 -256 -84 60 236 -94 -87 309 -30 -168 167 55 133 269 -107
3909a07J37O0k36L26j76J34l18J01K61j78j92J84j15O6k81J29M55n80M59k24L2
$$ -107 30 90 -146 180 4 138 -180 -79 182 4 -188 -4 -119 -53 -334 -205 250 -330 129 -95 -63
3930f3R4r1J33k96J32L07n7l98K16j6l6j0J48Q6r8J10L2m39K54J6O9k13K04l20
$$ -63 31 -60 73 -223 -91 216 159 -239 -23 -39 -75 -85 63 149 51 161 193 -246 8 24 93 -120 84 -236
3954b36K0L44j86N9m8J85j44K20k43j25J26j20J11j54K16j8r0j0J88n1N5q0J90
$$ -236 -216 128 -58 1 -47 138 -6 214 -29 -154 -28 -148 -37 -191 25 7 -83 -93 95 44 99 19 209
3977B09l35K73l17K16J56k30P4k80M14k62p7N0J68J3K2j16K5k10K05k9J94k17
$$ 209 -126 147 -170 46 202 -28 46 -234 180 -82 -159 -109 59 72 94 -22 3 -207 -2 -31 163 -54
3999e4P0Q8k15J04J23J66l71kJ07K39k64J47j29J38j37J88l74N68j78l53O4K61
$$ -54 16 104 -111 -7 116 282 -89 -91 16 255 -9 138 9 147 10 198 -176 392 214 -139 -75 186
4021A86k09j7J28k98O4J56l2l0%J29o1M8j00J16J89n83O35l24k00K51J84j68k27
$$ 186 -23 -40 88 -210 -146 10 -22 -52 -52 77 16 64 -36 80 269 -314 321 -3 -203 48 232 64 -163
4044a63L34j64n0Kj44P7L08k20N0j25KQJ5r0L82k51k37J94N7K5j21L36l43oL33
$$ -163 171 7 -43 -41 -185 -108 200 -20 30 -95 -93 -85 -70 -160 222 -29 -266 -72 -15 10 -111 225 -118 -124 209
4069B09l99K25Qq8j69L69j88k34M79R1l56J48j29O1j2O0j61K35j92J08j75L75
$$ 209 -190 35 43 -45 -214 155 -33 -267 212 303 -53 95 -34 27 15 75 -86 149 -43 65 -110 265
4091B65m05Q2J82l7j75J17Q6k34L48l02K31j61j00K80j77jK50m57J97M9j67J32
$$ 265 -140 -58 124 87 -88 29 115 -119 229 -73 158 -3 -103 177 0 -1 249 -208 -11 38 -129 3
4113CL19k04P5k69k35M11j95L5P0R6n7J66j53J0L4j92j22K15k80K42K9j64K95
$$ 3 322 118 193 -76 -311 100 -95 -60 10 106 49 215 62 72 106 -86 -208 7 -273 -31 -2 -166 129
4136A29j51r1J2R6L3L5J16k82O0n5K87j49j85K36K1j43L7j17J95n3M3N6J90k57
$$ 129 -22 -113 -101 -5 28 63 179 -103 -43 -98 189 40 -145 91 112 -31 6 -111 84 31 74 130 320 63
4160F3l7K5j2j02J74j39J51m7q8J75r7j00J45l13L77n7o9p0M6p0j7K40k42j0p6
$$ 63 26 51 39 -63 111 -28 123 76 -12 163 66 -34 111 -202 175 118 49 -21 25 -45 -62 178 -64 -74 -150
4185a50J6N5j53p8M88j33j28LP3o4qK58j28m7j71rJ02J29r0j18R7j50L42O4j27
$$ -150 -134 -79 -232 -310 178 45 -83 -80 -7 -71 -79 179 51 4 -167 -176 -74 55 -35 -153 -56 -206 136 200 73
4210G3m3j9j80K52n5J12p9j1j83K50r4o8m3Q8L5j90J88k84L21p5j23o8L42l49
$$ 73 30 11 -169 83 28 140 61 50 -133 117 23 -45 -88 0 35 -155 33 -251 70 -5 -128 -196 146 -203
4234b03J80J19j11L11k98R4n2j04j76K47j6o8J30o1K95j95k1J59k31M7O2l1R9
$$ -203 -23 96 -15 296 -2 92 40 -64 -240 7 -9 -77 53 -8 287 92 71 230 -1 46 108 77 176
4257A76k78Q7O4j74L9J20jL0qk69L04k37J18j91N4n7j33M53l1k23Q1L9L94k20
$$ 176 -102 -15 49 -125 -86 34 33 63 55 -214 90 -147 -29 -220 -166 -223 -356 97 66 -157 -76 -37 357 137
4281A37o4j79L08l81M17q7j24kj7k50PL40j11m8k4j64J07P0j76M01k56J19j78
$$ 137 73 -106 202 -179 238 151 27 25 8 -242 -235 105 -6 -54 -78 -242 -135 -65 -241 160 -96 23 -155
4304a55QK02J47p1j91K83l58NL13J18m58K96j17J37j17l1o8J58j87K44r5j19l5
$$ -155 -147 55 202 131 -60 223 -135 -130 183 301 -157 139 22 159 42 11 -57 101 -86 158 63 -56 -91
4327i1OJ83L9p7j25j70K32j5qn1K99k42q7K55l57K45o2o2j39K82K88k61p3j18
$$ -91 -85 98 137 60 -65 -235 -3 -18 -26 -77 222 -20 -107 148 -209 36 -26 -88 -227 55 343 82 9 -109
4351a09Q9o0J52mj43J02k80m1K58j4Lk2L53k86J5j26Q0J40NN4K4qj71j9j80J70
$$ -109 -20 -80 72 68 -75 27 -253 -294 -36 -50 -47 -69 284 -2 13 -113 -33 107 112 166 190 182 11 -8 -188 -18
4377a8j26J10q1J61n5J07n9j67qL95l02R1k22J12L8m4q6K60R8r3k54j61K68q2
$$ -18 -144 -34 -115 46 -9 98 39 -128 -136 259 -43 48 -174 -62 -24 -68 -154 106 204 111 -143 -304 -36 -118
4401a18j57K73J63k18P0j98L11M5l99J67Q4J42k31K2O4j29M0J83o4j90p4L4K41
$$ -118 -275 -2 161 -57 13 -185 126 171 -228 -61 23 165 -66 -44 20 -109 -69 114 50 -140 -214 -180 61
4424F1k47L11j46j91J47N3J24l7J41k96j95L00k03J67J03j75l2n4J08Q5q2o4L01
$$ 61 -186 125 -21 -212 -65 -12 112 75 216 -80 -275 25 -178 -11 92 -83 -115 -169 -61 24 -58 -122 179
4447A79k41j59J85Q9p4m4M4q5O2j0l3N1p5J6n9J07J35L9k69M2L07l96M7K03k28
$$ 179 -62 -221 -36 53 -21 -65 -21 -106 -44 -54 -87 -36 -111 -95 -154 -47 88 127 -142 -100 207 -189 -142 61 -167
4472a67K60j95J43j21J18l80L86p0n4J11m3m0Q3J46o5j14P0l80J52M00k71j07
$$ -167 93 -102 41 -80 38 -342 44 -26 -80 31 -12 -52 31 177 112 -2 68 -312 -160 240 -31 -138
4494a38K9M0J23j85n8K90j1j1j21p4L7r0J17l7K82k75J48N4k97J45j61N1N4PJ93
$$ -138 -109 -69 54 -131 -189 101 90 79 -42 -116 -79 -169 -52 -89 193 -82 66 120 -177 -32 -193 -142 -88 -81 112
4519A12j36o2K66j82p7J2q7J14M2J82K7o6J4j25p2k0p6M3M9p3N8R9j1K35m9q8
$$ 112 -24 -86 180 -2 -79 -67 -154 -40 2 184 211 145 159 34 -38 -58 -134 -91 -42 -115 -57 42 31 266 217 129
4545A29k36q4K54Q1k79M94l77j30J12j0K04k49K04k65K53j43j31M9O7K04k88K17
$$ 129 -107 -191 63 144 -135 359 -18 -148 -36 -46 158 -91 113 -152 101 -42 -173 -124 -57 147 -141 76
4567G6j68J21j88R9J61k69J03m5Q4l9LJ49Kp3J15j27J95l77K75j1j86K90r0j68
$$ 76 -92 29 -159 -60 101 -168 -65 -110 -26 -65 -62 87 89 16 131 4 199 -178 97 86 -100 190 100 -68
4591f8L7n7k5j2J47NL9k26n5O3KJ75Q1qj17k19L62O2o6l85K80O0J00j93j09R0
$$ -68 -31 -88 -113 -125 22 27 66 -160 -215 -152 -150 25 106 98 -19 -238 124 186 120 -265 15 75 175 -18 -127 -37
4617c7j8O3J77k32l7M3M2r2k1l0J66j97J8k5L23j64K3j70l4M49k67j42J98J88
$$ -37 -55 8 185 -47 -84 -41 1 -91 -112 -142 24 -173 -155 -180 143 -21 2 -168 -202 247 -20 -162 36 224
4641B24m03P8J81Q6j13k17j1J85N3R4M6k11m9M48n63J11O7k91L18j64R3K74l85
$$ 224 -179 -101 80 166 53 -164 -175 10 63 157 203 -8 -57 391 -172 -61 6 -285 33 -131 -38 236 -149
4664a49K47j94J38qqJ22k80Q2j23R0J34j66l1l3o1N8K95k95J81L92m89J73J32
$$ -149 98 -96 42 34 26 148 -132 -50 -173 -83 51 -115 -146 -179 -240 -182 113 -182 -1 391 -98 75 207
4687B07l98R6J48l21L13j54j3J44n9r2Q4K5l4K57n99K36J1M8n7O5j13J59J36m37
$$ 207 -191 -95 53 -268 45 -109 -122 22 -37 -129 -45 -20 -54 203 -396 -160 -149 -101 -158 -93 -206 -47 89 -348
4711c48M00O0k3m1J7M0j38j47J37k30L14j82K01j68L8K66k13J36k02J25j80K08
$$ -348 52 112 89 48 65 105 -33 -180 -43 -273 41 -141 60 -108 -70 196 -17 119 -83 42 -138 70
4733G0k2NJ2k8r0J1k11K80o5J07m4j10L06o2l15q9N6K05l2J27M6o2k27Q7m0K23
$$ 70 48 53 65 37 -53 -42 -253 27 -38 69 25 -85 221 159 -156 -245 -189 16 -16 111 157 95 -132 -45 -85 138
4759A38l4j95J48k4o3q9J81M8k42P2o0K01k3r2j33K90j82J37R8m48J99J52O3k36
$$ 138 104 -91 57 33 -30 -119 62 110 -132 -60 -120 81 58 -34 -167 123 -59 78 176 -272 -73 79 142 -94
4783i4L15n0j35j78J44K06m54J24k05Q2K73k83O79k09K3l36RL79k98M1n4k2q0
$$ -94 221 171 36 -142 2 208 -246 -122 -327 -245 28 -255 424 215 238 -98 -89 290 -8 33 -21 -43 -123
4806a23L9J42n5R7J5l86M20j28l4J40r9m0j1O9kj23K08l96K46l9J79m30L78k80
$$ -123 -84 58 3 100 115 -271 149 21 -13 127 28 -12 -23 46 44 -79 129 -267 -21 -60 119 -311 67 -213
4830b13Q8J82J53k36K93m28L54m38K01K9q8j48M7K79J16j34K1k5l0j5P1k98J76
$$ -213 -125 57 210 -26 267 -161 193 -245 -44 -15 -103 -251 -204 75 191 57 78 53 23 8 79 -219 -43
4853d3K52l35J81j90M6K4p6R6R0j75j69O64m10k2J25k12L52l69j1J4K75jk50K63
$$ -43 209 -126 55 -135 -89 -65 -141 -45 45 -130 -299 365 -45 -67 58 -154 198 -171 -182 -168 107 106 -144 119
4877A19kj09m4L5K88j15k92K20k47J57J02k18J42j13Q0K6O3r6k2R8j86K20j56
$$ 119 117 8 -36 -1 287 172 -120 100 -147 10 112 -106 36 -77 3 29 92 -4 -26 72 -114 106 -50
4900e0L9j43K49J33n75K56J62j08K16j71j49J57p8j21J71o3r4L00l27J78K02m10
$$ -50 -11 -154 95 228 -347 -91 71 -37 179 8 -141 16 -62 -183 -12 -75 -169 131 -196 -18 184 -226
4922b26N24k51J42p3j92J94l02K25Mj54J67pj87K01j16j52K26q7O0J1M2p9K00
$$ -226 298 47 189 116 -76 118 -184 41 45 -109 58 51 -136 65 -51 -203 23 -64 -4 7 49 -30 170
4945A70q0J04k82M9l85L75j7M6K90j90R0j19K24j54k25J78J21n2l5N3Q1k48k5
$$ 170 90 194 -88 -39 -424 -49 -66 -20 270 80 170 51 275 121 -104 74 195 143 108 161 242 -6 -31
4968c1k2M5RO5j98M2Q9j2j33L50k50k29L32j73K63j79Q2k03J14J47k23K82k10
$$ -31 -53 -8 1 66 -132 -90 -1 -13 -146 204 -46 -275 57 -116 147 -32 50 -153 -39 108 -115 167 -43
4991d3J72N5k97J43j65J60lj56Jj5p5J25N5Q9Pj32J18jQ0l05L47j51o7m0N56k87
$$ -43 129 184 -113 30 -135 25 22 -134 -133 -148 -223 -98 -43 46 53 -79 39 38 118 -187 160 9 -58 -98 458 171
5017A71j62j65L50m44oM68k14J46j88M75o67J52J71l47J76J66j95P0J78q8j59
$$ 171 9 -156 194 -250 -256 212 -2 144 -44 431 -236 -84 87 -260 -84 82 -113 -43 135 47 -112
5038a12O6l9j58J27L43o21K31K84o2R5k44M57k75J18k42r9Q7J98j97l0J42j30
$$ -112 -46 -85 -243 -116 227 -394 -163 121 59 154 -90 367 92 210 -32 -131 -44 154 -43 -73 69 -61
5060f1K94l72J44N5k08m4j4R2K3j7J44JJ14j86j1j77K08j62Q8p9J51o0J10J4j77
$$ -61 233 -139 5 60 -148 -192 -206 -114 -91 -108 36 37 151 -35 -46 -223 -15 -177 -89 -168 -17 -77 33 47 -130
5085a30K10r2J48j70J65k71K86k19J3k5O4Q9k45L69j43k34K03O8K57l48P0p6j6
$$ -130 80 -12 136 -34 131 -140 146 -73 -60 -85 -21 68 -177 192 49 -185 18 86 343 -5 65 -11 -27
5108b7j1K87k29k8O7lK45j46m43K74j22J00Q2L1M3K7m0K02l44L60n93K11L35k91
$$ -27 -38 249 20 -8 59 56 301 155 -288 -14 -136 -36 46 77 120 147 107 309 -35 325 -268 -57 278 -13
5132a3P1j97J08Q8q7l7Rn8oK13k35K90m14K45J38j41J02j71J24M4J50k07mn3J74
$$ -13 58 -139 -31 57 -30 -67 -58 -116 -122 91 -144 146 -268 -23 115 -26 76 -95 29 73 223 16 12 -41 133
5157A33k78KJ87r7m0j31J64O8j65M16k98J1Kn7J5J48J28j13j96J35j04j5J4r5
$$ 133 -145 -143 44 -53 -93 -224 -60 8 -157 259 -39 -28 -26 -83 -68 80 208 95 -101 34 -70 -85 -71 -166
5181a66L11O2j58K47k5k91J49k05L78m37J06J65k63j15K78j13P9j34J72l9l9M5
$$ -166 145 207 49 296 271 -20 129 -76 302 -135 -29 136 -127 -242 36 -77 2 -132 40 1 -38 7
5203GM3J68k44P7r1n9J28N0j46J10O2j44r5J19r9o1J63K6k3p1Q8J17n0j02j48
$$ 7 50 218 -26 51 -40 -99 29 79 -67 43 105 -39 -134 -15 -114 -175 -12 14 -9 -80 8 125 75 -27 -175
5228a75M89l45J48kk37q0K44m6n5j8j6N4J8K11P3j76K9j31o7R9l02L64k35q7M55
$$ -175 314 -31 117 115 -122 -202 42 -4 -59 -77 -93 -39 -21 190 263 87 116 -15 -82 17 -285 79 -156 -243 212
5253B12k51j32O0K5J61p0K26j7j51N2j52O1j32L2j32J18j34K00o2j0J50j11L6
$$ 212 -39 -171 -111 -86 75 5 231 214 63 115 -37 24 -108 -76 -208 -90 -224 -24 -86 -96 54 -57 -21
5276b1R5Pn8j34K01J97j73k41J27r0j33K28j38J63P0q9o4J14k85K91j28J52k15
$$ -21 74 81 23 -111 90 287 114 -127 0 -90 -223 5 -133 30 100 11 -53 61 -224 67 -61 91 -124
5299a24J34k8j51J05J39p1k54K43J35K2k39J8J58J72l86N8Q3lj21j87L61l25J00
$$ -124 10 -18 -169 -64 75 4 -250 -7 128 150 -89 -71 87 259 -127 -69 14 11 -110 -297 64 -261 -161
5322a61K86M9l3M1k61K8J77j12k2o5K29j78J80J4m0k23q1J18q3J8L01p4k00KK73
$$ -161 125 174 141 182 -79 -51 126 14 -8 -73 156 -22 158 172 132 -91 -172 -54 -137 -119 182 108 -92 -90 183
5347A83k15J32j56R1J8j08J98j56q2k05M19p5L58l81J6k66K28J6N2r3j03K26m41
$$ 183 -32 100 -56 35 53 -55 143 -13 -95 -300 119 44 402 21 37 -229 -1 15 67 -26 -129 97 -344
5370c44K64J92j80M6Rn9J18j56J89p8L6k06l0L14k90L00j17M3o0Jk8l0N7K44j02
$$ -344 -80 112 -68 -22 -13 -72 46 -110 79 1 37 -169 -199 115 -175 125 8 51 -9 -8 -36 -66 -9 235 133
5395A33j81K7K50j33k69J0J49Q5N5j20p8J8Q5n3L0J32k30J29m8j55J00J20j57
$$ 133 -48 -21 229 96 -173 -163 -14 71 126 6 -72 -54 31 -22 8 140 -90 39 -9 -164 -64 56 -101
5418a01o6J89l3N1O3q1kL9J53m5q2K6K4l4j80J6J72q5q8Q1J22o6L8j24J3l46L36
$$ -101 -167 22 -11 40 103 22 20 59 212 167 85 111 135 101 -79 -63 109 24 -64 17 139 73 111 -13 0 -346 -10
5445a0p3L25k28j0J46o3k66J31J53K58k43j44j79N3K50O7l16K45j97R0p4j27K33
$$ -10 -83 242 14 4 150 87 -179 -48 105 363 120 -24 -203 -150 100 167 -149 96 -101 -11 -85 -212 21
5468B1j19J64j95L28q3o8pl99J77J60N5Q2l38L07j58j64Q7J50NO8j97K1K08j42
$$ 21 -98 66 -129 199 116 48 41 -358 -181 -21 34 116 -222 85 -73 -237 -150 0 5 73 -124 -103 105 -37
5492c7P0j14K32o6n4oQ4J06k55o4k24K10J11J77j44p9Q4M6j49LK53jk92L9J26
$$ -37 33 -81 151 85 31 25 109 215 -40 -104 -328 -118 -7 170 26 -53 31 77 -72 -69 184 183 -109 -70 56
5517E6M2K0Jk12K47k28K64j27k07J00K58l80L00J5o9j25L2J16N5k71K1R6P2Q5
$$ 56 98 118 119 -93 154 -74 190 63 -144 -44 214 -166 134 149 80 -45 -13 103 158 -113 -92 4 76 161
5541A61j61k3M7r8l5L48k16j17K20Lq6M2n3j5k1J1Pk4q1m9r3K36J25j67oJ23M9
$$ 161 0 -23 24 -74 -109 239 23 -94 126 129 43 85 32 17 -4 7 14 -10 -91 -140 -233 3 128 -39 -45 78 127
5568A27k61r8K60m0j1j73M0K03J40k11M2j49J52J24j48l6j2J34j59l1J60j77J59
$$ 127 -134 -232 28 -12 -23 -196 -156 47 187 -24 18 -131 21 145 -3 -39 -51 83 -76 -107 53 -124 35
5591C5l5J44k4J34l69J20q2L6K16m4k60j60K25L9P9j99J53j7L37j88j64j51J05
$$ 35 0 144 120 254 -115 5 -77 -41 175 131 -129 -289 -64 -25 54 -145 8 -9 328 140 -24 -175 -70
5614g0K95m38L00k20J15l8j32J80j13L86k19j44j4J03J12O7j00Q0l04p8K71j41
$$ -70 225 -213 87 -133 -18 -56 -188 -8 -121 265 46 -98 -112 -9 103 170 70 150 -154 -232 39 -102
5636a02J74k09K22q4J01j4Ok13J01r1J33Q4nk1k38J43m5j39J57J14Jk22J96j28
$$ -102 72 -137 85 1 102 88 94 -119 -18 -109 24 108 103 82 -156 -13 -58 -197 -40 74 75 -147 49 -79
5660g9J31K3l9j08j55K94m1K0q2L03m19K51j88K4M4J98m01J50qM61j50j50j1j45
$$ -79 52 75 36 -72 -227 67 26 46 -36 267 -152 99 -89 -65 -21 177 -224 -74 -82 379 229 79 68 -77
5684g7M3K3J37k87n1K01j83J39J18j98K95j34J15o1k05J56j05R8L7j20J66j16
$$ -77 -34 -11 126 -161 -212 -11 -194 -55 63 -135 160 26 141 80 -125 31 -74 24 61 -59 107 -9
5706i%j14K59j64j22ml5ON6J47j71o8m2L4N06l41J91o7m57N17Q4k63R7j48J63
$$ -9 -9 -123 136 -28 -150 -154 -189 -183 -127 20 -151 -219 -261 -227 279 -62 129 62 -395 122 206 -57 40 -108 55
5731E5p0J40r8k81K97j07Mn2J20J82k49J46k26J85j49J49m0J66j62k0J32k55J51
$$ 55 -15 125 27 -254 43 -64 -60 -112 8 190 -59 87 -139 46 -103 46 6 172 10 -10 122 -133 18
5754A8L8k1m0K17l55K11j2l5p9o4L33k97J72j82O5jp7p6J17o4J23K34p0l56Q4
$$ 18 56 35 -5 212 -143 68 56 21 -58 -122 211 -86 86 -96 -31 -32 -109 -185 -68 -132 -9 225 155 -201 -117
5779a17K28j0k51O3R1J28k81K23j16RK28k71J94J38k73j27J30j41J86j81J30J64
$$ -117 111 101 -150 -87 4 132 -149 74 -42 -33 195 -76 118 256 -17 -144 -14 -155 31 -150 -20 144
5801A44l24Q4R1n1J51k12N0K7K1m4K50k91J39j42O5J45l4m4j72mK2J68k60J19
$$ 144 -180 -96 -5 -56 95 -117 -67 -40 -19 -63 187 -104 35 -107 -42 103 69 25 -147 -151 -129 39 -221 -102
5825a02J62k34P1J21J3J75r7J17k44j14K21k65R3R4J17j51QJ09k26K72j15Mj46
$$ -102 60 -174 -103 18 31 206 109 226 -18 -132 89 -176 -83 11 128 -23 -15 94 -132 140 25 29 -117
5848a17Q4O1o0J66p7l6j4K6O2j99P3K50m7k35N2j92K22k0R2J27q4j27j7L2k75
$$ -117 -33 28 -32 134 57 21 7 33 95 -104 -31 219 172 -63 -11 -203 19 -1 91 218 134 7 -10 22 -253
5873b53K37Q6K8m1l5j06K27r8l69L25j40Q5L4J72nj04n9K33j95M6K0Kj11j48K65
$$ -253 -16 70 98 57 22 -84 143 45 -324 1 -139 -54 -20 152 147 43 -16 217 22 68 88 90 -21 -169 96
5898I6n0l2l3J47k68K93m04L29o9L3j95K72Q2j32J34l43J30O4l7R5j91K33J24
$$ 96 46 14 -19 128 -140 153 -251 78 9 42 -153 119 201 69 203 -140 -10 54 17 112 -79 154 278
5921B78j63j45L45l84J99k06j10R7K26j98K3R2k12J40K59j34l2j66K46j14Mp1
$$ 278 115 -30 315 -69 130 -76 -186 -89 137 -61 -38 54 -158 -18 241 107 75 -91 155 41 45 -26
5943b6p4o1K51k85M8K59j19K2p8P3q5mm6J76O4q7j21J77j25j89L62j76Q9k51K67
$$ -26 -100 -161 90 -195 -147 112 -7 15 -63 10 -75 -79 -125 51 115 28 -93 84 -41 -230 132 -44 45 -206 61
5968F1j46Q5N2M5k15R0k2j79L90l61M1j25K08J92r8Ok51Q4M33m38J57J66j04l3
$$ 61 -85 0 52 97 -118 -28 -50 -229 161 -200 -159 -284 -76 116 18 24 -227 -143 290 -148 9 175 71 38
5992C8K0k0j46J45kM0L4J60r1k67K34j57L2J55l3j70j70J81ol6lm5J25J06j12
$$ 38 58 38 -108 37 35 75 109 269 178 -89 145 -12 20 175 142 -28 -198 -17 -23 -59 -62 -107 18 124 12
6017A2j1L76m67m3J91j6J26m4k7p3J6m8j94M6L4R2L9p5L62k35r4P8l04K76j06
$$ 12 1 377 -90 -133 58 42 168 124 97 24 40 -8 -202 -156 -122 -30 9 -66 296 61 -33 45 -259 17 -89
6042h9J59N2k42J29n5O5P8M2mo1m6L0l77R5L60k06K5qj6J05k46J41J41m05M55
$$ -89 70 122 -120 9 -46 19 97 139 135 74 28 58 -319 -224 136 -70 -45 -53 -69 36 -210 -69 72 -333 122
6067A22Q9n10N62k39P9R1k55M6J81l54J42j03O0K36k90K56P7j0j53J67l85K78
$$ 122 211 -299 263 24 103 194 -61 -15 166 -188 -46 -149 -89 147 -143 113 190 180 27 194 -191 87
6089H7j30J23k65L80o3k74R3J29J0k29J42n7J35k94K04j01J6J32n98L78J10q5
$$ 87 -43 80 -185 195 132 -142 -49 80 90 -139 3 -54 81 -213 -9 -110 -94 38 -560 -182 -72 -157
6111a57J19Q3j78K93k85l9j20J52J70k33J29N5p5J89n4k57J90j2N4j52J53n1J53
$$ -157 -38 45 -133 160 -125 -164 -284 -132 38 -195 -66 -11 -86 103 49 -208 -18 -30 24 -128 25 -26 127
6134A27k8j41J39l0J94j87k02J32J78j28L1L1k24J99m7L9j32j64J52J20M1k3k61
$$ 127 99 -42 97 67 261 74 -128 4 182 54 85 116 -108 91 44 83 -49 -213 -61 59 100 77 -184
6157a84K22J36j96m2J2K39j08l67M62j52K5j78J53l97M54m7k61J71K52k11p4m9
$$ -184 38 174 -22 -64 -52 187 79 -288 174 22 47 -131 22 -375 79 32 -229 -58 194 -17 -91 -140
6179a40K21J6M1o9k02K50j79K89k63n3N0J71k11o9J72o0k03L15m3p3j4K41l35
$$ -140 81 97 138 69 -133 117 -62 227 -36 -89 -39 132 -79 -148 24 -36 -239 76 33 -40 -54 187 -148
6202a48O4p1K33j98j03K77L05m19j21J32j84K20r6k3J03j3J29N0k07R6K0P5j60
$$ -148 -84 -155 78 -120 -223 54 359 -60 -181 -49 -233 -13 -109 -132 -29 -42 87 137 -70 26 46 121 -39
6225c9pl4k03K73J04N5J5k39M1K35M8k43j6J25K25j74j63J50k66K88k06J15q9
$$ -39 -46 -80 -283 -10 94 149 164 -75 -34 201 249 6 -10 115 340 166 3 153 -113 175 -31 84 -5
6248eJ92J90n92J17M4j37m3J68K57p6r6o2J37l29K41J28q3p5K59l08J3J61r9J6
$$ -5 187 377 -215 -98 -54 -191 -234 -66 191 115 19 -43 94 -235 6 134 51 -24 235 -73 -60 101 2 18
6272A8R9l27N4J81RQ6k06Q6K4j02J24j4j22p3J81k31K76j9j80M07k03p5j45J09
$$ 18 117 -210 -156 25 34 120 -86 0 24 -78 46 32 -90 -163 18 -213 63 44 -136 271 68 -7 -152 -43
6296d3NP0j25J58L4M2l9j4j31k84J45Q7K8J09J95k44M6l2q2J32QO9j63o0j39K76
$$ -43 -38 32 -93 65 99 141 102 88 -43 -327 -182 -95 -67 42 237 -7 39 7 -75 57 65 134 -29 -89 -228 48
6322D8J77k92N1o1r7J55j30p9M41k03p0J56j15K15l05j08L34m12K53J91l7L09
$$ 48 225 -67 -16 -77 -174 -19 -149 -228 213 10 -60 96 -19 196 -109 -217 117 -295 -42 149 112 421
6344D21n71J00J68o3j29l9J09J56j88J13Oq3P1m6j9m9o5J80r0K93k0l57R1O3M5
$$ 421 -150 -50 118 55 -74 -113 -4 152 -36 77 83 0 71 25 6 -43 -108 72 -18 275 255 -102 -11 52 97
6369I7j36k69L73o6k8j51K15j15r9K56J70r6j80N0J31R6m1k08K6k96J07j32J62
$$ 97 -39 -308 65 -1 -29 -180 35 -80 -179 77 247 151 -29 21 152 248 207 -1 25 -271 -164 -296 -134
6392a34J13j01K83l09K70K5j14q4J70m12J85P4k00J89M4J55l56J33K36j64j05
$$ -134 -21 -122 161 -148 122 147 33 -51 119 -293 -108 -34 -234 -45 -1 154 -202 -69 167 3 -102
6413a02OK23L7k48J68j08N1j02K47j40K30j3j86K57l30O3k3J37J0l41J62NN6r6
$$ -102 -96 127 164 -84 84 -24 27 -75 172 32 262 249 63 320 -10 53 30 167 177 -164 -2 3 59 -37
6437c7o0J68j0j22M3k5l08M73l08J83M60n44J05ql30M15n2j04k7J68k14K04q9
$$ -37 -97 71 61 -61 -18 -43 -351 122 -186 -3 457 -87 18 10 -320 95 43 -61 -88 80 -134 70 -19
6460a9J65k35L74j67l00J55Q1j10N7k68M14N3n9n8nj6L4q2k9jM8L5l4q6R2r5j19
$$ -19 146 -89 285 118 -182 -27 54 -56 1 -267 147 200 141 83 78 62 96 14 -15 -16 32 67 33 -53 39 -56 -175
6487a75j3K82J50k72l4O5j17K41m1N2p1k62L34j14k00J75K4k30K68k50L21k17
$$ -175 -188 94 244 -28 -62 3 -114 127 86 138 67 -195 139 25 -175 0 24 -206 62 -188 133 -84
6509h4J98k4J96k00j3j52K78k88M5N8J19j87j27O1K37j88R9qj8l5KP2J50m6j32
$$ -84 114 90 286 86 73 -79 199 -89 -44 14 133 -54 -181 -120 117 -71 28 20 2 -33 -31 41 191 145 13
6534A3J48j72l1j7k0R9j0k63J29J59R6j93K46k10p4L18k23r4K20l9k12J44J85
$$ 13 161 -11 -42 -59 -79 20 10 -253 -124 35 131 -62 184 -26 -100 218 -5 -99 121 82 -130 14 199
6557A99j8m34J40l4N7j79J45J04K01l7l51K11P8l15L24j75J76o3m6l8R3j84J16
$$ 199 181 -253 -113 -147 -90 -269 -124 -20 181 144 -207 4 82 -233 91 -84 92 29 -17 -55 38 -146 -30
6580c0P6O0J74m20K91L7j51j70L3K80j83j53km8M08k52N4k6K1Pj49J16J51k01
$$ -30 46 106 280 -140 151 188 37 -133 -100 180 -3 -156 -158 -206 202 -50 4 -22 -1 6 -143 -27 124 -77
6604g7j24J24QQ2m6J41R1j74J55j3l61K50m7J7k39K38k4l26K8K77Q1j40L77l64
$$ -77 -201 -77 -69 13 -33 108 199 25 180 167 -194 56 9 26 -213 25 1 -325 -297 -20 61 -79 298 -66
6628f6J04L3k12J40j63N0K87j34m2j11O5k40K73N8k2k11L03m7k38J09k0L01K6
$$ -66 38 71 -141 -1 -164 -114 173 39 -3 -114 -49 -289 -16 42 20 -191 112 65 -173 -64 -84 217 243
6651B43k05R1l1l0m7mj38K32k88K95r2L6k27J81o0j05K62j35j11K39j63K82r6
$$ 243 38 129 98 68 21 17 -121 111 -177 118 26 62 -165 16 -44 -149 113 -22 -133 106 -57 225 129
6674A29j1K60k58j8j51M11l11l67K85k34%J95k21K65k42K99j31K12k98L16l19
$$ 129 118 378 120 102 -49 362 51 -316 -31 -265 -265 -70 -291 -26 -268 31 -100 112 -186 130 -189
6695a89K22O1l32J8L09J3j99J08M0j43j09J13q0J18J20r1N3o7J54j4j19q7m7L60
$$ -189 33 94 -238 -220 89 102 -97 11 51 -92 -201 -88 -168 -50 70 -21 32 -35 119 105 -14 -101 -148 212
6719B12j01l1j96L9K94j78k98J0K48J53r4j35l5J59k09K04j3k8O1o8q3O6j32m1
$$ 212 111 80 -116 -77 217 39 -259 -249 -1 152 58 -77 -112 47 -162 42 29 1 62 -6 -89 -23 -155 -196
6743a96L64n8qk48kK18J90j94l08M39k48j30J11K10Q2k09k32K53jq6J01k29J50
$$ -196 168 110 102 -146 -148 70 260 66 -242 197 -51 -181 -70 140 222 13 -219 34 33 -53 48 -181 -31
6766c1J19k25P5K42l29J74J0O3n7j06N1OJ08j10n3k7J03l1J99l50J35q6J04j13
$$ -31 88 -137 -62 180 -149 25 35 98 41 -65 -14 -8 100 -10 -63 -90 13 -18 181 -169 -34 -120 -16 -129
6790a29L4j06K64l04M52k92J86k3j41J84m41K58J25n0j78J79P2j78J4J9K62r7
$$ -129 -95 -201 63 -241 211 -81 105 82 -59 125 -316 -58 67 17 -161 18 90 -88 -74 -55 207 110
6812A10k96K82l36J92L1N7j46j32L42p6NK8j08KL5M1j03p5R7J51k5k12J59N9k7
$$ 110 -186 96 -240 -48 -17 40 -106 -238 104 28 33 61 -47 -45 -10 31 -72 -147 -50 101 76 -136 23 82 55
6837E5N5L8l20K29K08k82J72N8j55l60L46j40J19l1j26kK34J20J3r5Qj74j85K25
$$ 55 110 148 -172 57 265 -17 155 213 58 -302 44 -96 23 -8 -134 -136 98 218 231 136 144 -30 -215 10
6861A0J68l6j8j50l1J25J64k15p3N7p4K65k8j1j30K1O6j36r7J79q6k5J58j75K01
$$ 10 178 142 124 -26 -57 68 232 17 -56 1 -73 192 164 153 23 44 110 -26 -123 56 -30 -55 103 -72 129
6886A29k26J53k86k8L14O6k96J69o9K4P9r7P2j66L24j8k15P0m9j64J90l2l2j72
$$ 129 -97 56 -230 -258 56 122 -174 -5 -74 -50 29 -68 4 -162 162 144 -71 -1 -50 -214 -24 -56 -88 -260
6910b60K31m6K08j30K24j15j99J34k10J30l1Q0O4r2J42m1R7m67M00j35n3L45l29
$$ -260 -29 -75 133 3 227 112 -87 47 -163 -33 -64 16 80 -12 130 89 186 -281 119 -16 -69 276 -53
6933e3J68j06k7P6r3r9o6L30m6j41J70j89j56L87N0k36P3N7J21j65O5j12O8j05
$$ -53 115 9 -18 58 -35 -134 -200 130 84 -57 113 -76 -232 155 205 -31 42 99 220 55 120 8 76 -29
6957b9q0J95k5k13L42j18J05j51qJ00k22J90k58rJ08Q6m6j84L71k14P2j44K50
$$ -29 -109 86 61 -152 190 72 177 26 18 118 -104 86 -172 -181 -73 13 -33 -217 154 -60 12 -132 118
6980A18j73J10k31J96l5L4N0j07o4J22K42k79K87q1j8o6q7o4j14J77k5O5j11J81
$$ 118 -55 55 -176 20 -15 19 69 -38 -102 20 262 -17 270 189 171 105 18 -46 -160 17 -8 57 -54 127
7004A27j62L4p5Q1j23J81K0k51K03j54PM3l2L0K34J3k38JJ16p5k1K54k92l3RK52
$$ 127 -35 -1 -76 5 -118 63 83 -168 35 -119 -112 -69 -101 -71 163 176 -62 -61 55 -20 -41 213 -79 -112 -103 149
7030A49j34j40k6K84j6k82J23q8L2K77k77O9J09j10j84J37R7j68K18K7J2j88K1
$$ 149 15 -125 -151 133 117 -165 -42 -130 -98 179 -98 -29 80 -30 -214 -77 20 -148 70 97 109 -79 -58
7053e8J23j90j6J20K9j03K36l51O5O0K01O2p7k79M5N4J85k36J45o3J72j52j17
$$ -58 65 -125 -141 -21 8 -95 141 -210 -145 -85 116 178 101 -178 -133 -79 106 -130 15 -48 124 -28 -145
7076a45K88J10j99J34l22K89k80J67j49J1M4j72L14j60J50n9q2j4J77R0p5l30
$$ -145 143 253 54 188 -134 155 -125 42 -107 -96 -52 -224 90 -70 80 21 -61 -75 102 192 117 -213
7098b13K44p2lL0Q0k5P6m4J26k9l85M07k60o0k8N1K25j67J48l25K24j11J88k97
$$ -213 31 -41 -44 -14 66 41 117 73 199 170 -215 192 -68 -128 -156 -105 120 -47 101 -224 0 -111 77 -220
7122b20P7M8Qm1J54J46j61r2J15j18K47l95K39j15M1J4K14k28kJ90m19M61l36
$$ -220 -143 -95 -87 -128 26 172 11 -81 34 -84 163 -232 7 -108 -67 -53 161 -67 -69 121 -298 163 -173
7145a73J14j9m2R8j7O0OM8j68K06J0l78M15J56l84jk9m3L33j60J52l06K07j09
$$ -173 -59 -78 -120 -22 -39 21 27 75 -93 113 123 -255 160 316 -68 -69 -98 -141 192 32 184 -122 85 -24
7169b4J79l9k33K9P2k0j58K6j75O23o0j27l29%N01r5O2l61L0J14J10k49J66P4
$$ -24 155 116 -117 -88 -16 -36 -194 -168 -343 280 220 93 -236 -236 265 170 232 -129 -99 15 125 -124 42 116
7193A16Q6k60J16k67O9K23k90K26j48J11J50j30L9k09J32j11J35j36O8K45k83
$$ 116 202 -58 58 -209 -140 83 -207 19 -129 -18 132 2 41 -168 -36 -147 -12 -148 -80 165 -118
7214a18p6K99P5k19N4j68J36J9J41k59O4j85K05j10L16j14q1P8k29J83k1O7j52
$$ -118 -194 105 180 -39 15 -153 -17 2 143 -116 -52 -237 -32 -142 174 60 -21 57 -172 11 -10 57 -95
7237i5J18j35N1J0J66K79l43N6j44K00j88j42j6J84K15k71J96j25j95J90j03j78
$$ -95 23 -112 -61 -51 115 394 51 107 -37 163 -25 -167 -183 1 216 -55 141 16 -179 11 -92 -270
7259b70L12N2k7j2lJ25l21M83l34r7J01p1J13k00K48J96n30K07p7K35j79k04K06
$$ -270 42 94 67 55 52 177 -144 339 5 -92 9 -62 51 -149 99 295 -235 -28 -105 130 -49 -253 -47
7282d7M37l15J14l10o3Q3qJ81M7k06J17l30L66j23J57Q7l03K90k57QJ15K1L10
$$ -47 390 75 189 -121 -184 -101 -109 72 119 -87 30 -300 66 -57 100 187 -116 174 -83 -75 40 61 371
7305C71l92q8Q4J22j64J14j57J29o1rJ14qJ82l80K90k00J64LL7k32n9J51j32J70
$$ 371 -21 -109 -25 97 -67 47 -110 19 -42 -51 63 55 237 -143 147 -53 111 114 151 -81 -140 11 -121 49
7329D9Oq1q3J77R3L3l20K69N5J60m43J42j58Q1kj18K22j6k39K1K06k10K56j05
$$ 49 55 -26 -109 68 161 194 -126 143 198 358 -85 57 -101 -20 -22 -140 82 66 -173 -152 54 -156 100 -5
7353eJ3n8q5K99l94L94l79j78M24r6Q4j8Q1q1o6o1J45P7r2o6K45l09R8K55j92
$$ -5 8 -50 -135 164 -230 164 -215 -393 31 -65 19 1 82 1 -65 -126 19 96 4 -62 183 -126 -28 227 35
7378C5j01k54M73r6m8O7j69K6j79K79j39J15k3m6Q1M6p8j51p9M43m6k88L66k68
$$ 35 -66 -320 153 57 9 76 -93 -67 -246 33 -106 9 -14 -60 21 67 -11 -162 -241 202 156 -132 234 -34
7402c4R2k10L3j4m0K33j00OJ59K1k41j19K15J92k46o9Q3k13M37j88r3K00m5j78
$$ -34 58 -152 -119 -133 -173 60 -40 -34 125 146 -95 -214 1 193 -53 -122 -39 -252 185 -3 -96 104 59 -119
7426a19J19j06j5L83n91K07R5j62l2L57lj90r9LK7P2q1Q2k2L12j62j18J30j08
$$ -119 0 -106 -121 262 -329 -122 -27 -189 -221 136 133 -57 -156 -153 -126 -54 -135 -53 -75 237 75 -43 87 -21
7450b1n4j50R6J46p4N7L7n8k17N2L19l32M00q9r4l9nJ41r2k9K8k01J18J36j05
$$ -21 -75 -225 -129 17 -57 0 37 -21 -238 -186 133 -199 201 112 18 -21 -26 115 23 -6 22 -179 -61 75 -30
7475c0j10J33rK70k18Q5r5j4J91j17lJ0k62L13j83J17R1j65k87L13j9q3J74j59
$$ -30 -140 -7 -16 254 36 121 26 12 203 86 83 93 -169 144 -39 78 169 4 -283 30 11 -72 102 -57
7499e7P8Q0j75Q6J56k73K31j78Qj15L40O7l66J21J23O2j71n1l1J8R7K3j20jj29
$$ -57 21 101 -74 12 168 -105 126 -52 -44 -159 181 248 -118 3 126 188 17 -34 -65 -47 50 73 -47 -48 -177
7524a77J31J94l77J65J74j47M3l49M46j32K9N4O0k31j12L78M0k07J8N6R4O5j89
$$ -177 -46 148 -229 -64 110 -37 6 -343 103 -29 0 54 114 -117 -229 149 189 -18 0 56 150 215 26
7547B6o4n4J50lJ92j55R8J1k01J12q6J20o1j34N6qN0p2L3N2j57M8o7J9j4O1J04
$$ 26 -38 -92 58 55 247 92 190 201 0 112 26 146 85 -49 7 -1 49 -23 10 62 -95 -47 -114 -95 -109 -48 56
7574E6j31J76j75j5O5P5J8p8lk0Q3k7k86L18j85K11l9j95J34j11M40l65r3R4p0
$$ 56 -75 101 -74 -89 -24 51 69 -9 -12 -32 51 24 -262 56 -129 82 43 -152 -18 -129 311 -54 -147 -53 -123
7599a23j86O08n09R9J98j17N3K9k69J41J21m7P7l79J55L96j86j96K68j69o9J21
$$ -123 -309 299 -210 -111 87 -30 23 52 -217 -76 45 -2 75 -304 -149 247 61 -135 133 -36 -105 16
7621A6M1l8M2k59K90j94J51N3R6l06q4J27q6K25j54l2J83q3K80j58k85M51k47
$$ 16 57 19 61 -198 92 -102 49 102 198 -108 -192 -65 -151 74 -80 -112 71 -12 268 110 -175 276 29
7644B9m3j2J47q5j54J89r9k43L81j61J59nk17O9n4N9m4Q2N2q6K54k51L4q3o2J20
$$ 29 -14 -26 121 36 -118 71 -28 -271 110 -51 108 103 -114 -45 -99 -40 -84 -2 50 -36 218 -33 1 -82 -144 -24
7670b4J15o0k06N6J36q3o9J60k6r4M0J01O3k09Oj3N6J93j27L6K25nrk03J06j81
$$ -24 91 31 -175 -119 17 -66 -135 25 -1 -95 -55 46 109 -100 -94 -107 -51 142 15 51 276 271 262 59 165 -16
7696a6O1pj79K27o0j43K48q3j4q4J82J82l10q6k25K76L84l13j34J04q3M9QJ20
$$ -16 45 38 -141 86 26 -117 131 48 34 -50 132 314 4 -82 -307 -31 353 40 -94 10 -73 -24 -16 104
7720A04k12kp8J56j26K26j20R9k42p5K7J57R5l5Q3l36K09JJ6J97O2q8j91O1l0
$$ 104 -108 -110 -188 -32 -158 68 -52 47 -195 -270 -243 -86 9 -26 57 -279 -70 -69 -53 144 206 118 -73 -12 -42
7745d2N3j35L0J11o9j9k3J18q6m9K8J15J48j68q3R9k10J42j69J39L3K1o7kJ67
$$ -42 11 -124 -94 17 -52 -71 -94 24 -62 -111 -83 32 180 12 -71 28 -182 -40 -209 -70 -37 -16 -83 -85 82
7770H2k8k16M05l24J13j48R9J68l24M22k70%J38j71JJ16J41r5kK25l54K35j92
$$ 82 54 -162 243 -81 32 -116 -17 151 -173 249 -21 -21 117 -54 -53 63 204 109 107 332 -22 213 21
7793B1J96j43j20J43P3k9j77MNl6K68k33j10K44j87J37j33P6j17P3O2K16n9j72
$$ 21 217 74 -46 97 170 141 -36 -32 -27 -63 205 -28 -138 106 -81 56 -77 -1 -118 -45 17 233 174 2
7817BK3r4J55j57J91j49Q6j10J64r3n8J02m5oj15o0R6j11j29K73L2j08K14j96
$$ 2 25 -69 86 -71 120 -29 57 -53 111 18 -40 62 17 11 -104 -164 -68 -179 -308 -35 -3 -111 103 -93
7841i3N1L5l9J44k85L04j05q6K27k56K66l19J0J96J66l80J23J3j28J84k59J56
$$ -93 -42 -7 -46 98 -187 117 12 -74 153 -103 163 -156 -146 50 216 -164 -41 -28 -156 28 -231 -75
7863g5Jj37J78J44k0k03K08p6p2J10K9k14J53j2lk01L15j03%j09K39r8j21J76
$$ -75 -74 -211 -33 111 91 -112 96 20 -52 58 87 -127 26 14 11 -190 125 22 22 -87 152 54 -67 109
7887A09j0J83k82L1Oj28j70L84r0j16kj37J94R0o6J40r9J2Kk6p2K91k73j75K88
$$ 109 99 282 0 31 37 -91 -261 123 33 -83 -85 -222 -28 62 -4 136 37 49 51 25 -47 244 -29 -204 84
7912H4o0k50L50k39J36K1J34j05J7k01J24K66m99K10J10JPj06j70J71J39l68L26
$$ 84 24 -226 124 -115 21 42 176 71 88 -113 11 277 -222 -12 98 99 106 0 -170 1 140 -228 98
7935I8N0m3j83K30j5l52l7j46N18R2j18k04L13j82o4O6JO5j4q4L55o41N57k84
$$ 98 148 105 -78 152 137 -215 -252 -398 120 212 94 -110 203 21 -43 23 24 89 75 -9 346 -295 262 -22
7959b2Pr1J60N4l29K72n7k0J43K57m63K55o1j86R9p2lP9L5J8K2k93K44J8J47n7
$$ -22 -15 -106 54 108 -221 51 -6 -26 117 374 -89 166 105 -81 18 -54 -57 22 57 75 97 -196 48 66 213 156
7985A56k07J32J7k40L59l17q1K65L1j14j37R4o1J58P6r7k11Q0J38J40j59k19L6
$$ 156 -51 81 98 -142 217 -100 -181 84 115 1 -136 -42 -103 55 131 34 -177 -97 41 181 22 -197 -161
8008a61K75k69q3K19J8q9J96j79r2J30J03R2k17J60r0K10j59n2j19j13M47j81
$$ -161 114 -155 -238 -19 -1 -90 106 -73 -165 -35 68 160 -57 103 13 223 64 12 -107 -220 227 46
8030D6j11J5l7R6J8m20M18k5M9p1J28l8r1J22J5m4j01J63l6m8j18j83K22l0q7
$$ 46 -65 -50 -87 9 27 -393 25 0 49 -22 106 68 -23 99 114 70 -31 132 96 48 -70 -253 -31 -61 -148
8055a48J34k20M06k99K1j01K02j58k7M8J24P2j23J10O5k22n3J87k8j43L54k41
$$ -148 -14 -234 172 -127 -106 -207 -5 -163 -190 -142 -18 54 -69 41 106 -116 -169 18 -10 -153 201 -40
8077d0p9n6P4oJ77j60j40K54j65J2M9J0J34q2j76J83J48j90nJ72k34Q6j98M52
$$ -40 -119 -175 -101 -107 70 -90 -230 24 -141 -129 -80 -70 64 -18 -194 -11 137 -53 -58 114 -120 -34 -232 220
8101B20m13J13k2q5L17k37K54k07J05P0k31q9K46j79m2lJ39R4j02j97K69J67l10
$$ 220 -193 -80 -102 -187 130 -107 147 -60 45 115 -116 -205 41 -138 -180 -183 -44 50 -52 -249 20 187 -123
8124a23J96o9J95k89R0L0J7k05P0j67J77O8J48M6m29N26k90K76j98j15j16R3k00
$$ -123 73 4 199 -90 0 30 47 -158 -88 -255 -78 -10 138 184 -245 281 -9 267 69 -46 -162 -69 -269
8147b69J96pJ14k08LP7J18K97j51l40L46k72J48Ll3R3j20k55M09j12J02N5j62
$$ -269 -73 -80 34 -174 -171 -94 24 321 170 -170 176 -96 52 55 22 115 -5 -260 149 37 139 194 32
8170C2j46J9j68L13N1l27N00l35KN4o2J0n8K9K64l7j60kP5J54l27
$$ 32 -114 -95 -263 50 101 -226 274 -61 -59 -5 -67 -57 -115 -86 178 141 -19 -21 54 208 -119
8191a19
$$ Imaginary data points
##PAGE= N=2
##DATA TABLE= (X++(I..I)), XYDATA
0@%%%%%%%%%%%%%qJ6j6J6j6K4l2M0m8N6o4P2q8J04j20J36j57J81k08K38k68L02
$$ 0 0 0 0 0 0 0 0 0 0 0 0 0 0 -8 8 -8 8 -8 16 -16 24 -24 32 -32 40 -48 56 -64 72 -85 96 -112 126 -142 160
35A60l39L81m28M78n35N98o62P34q15R01r96J101j213J336j473J623j791J975
$$ 160 -179 202 -226 252 -283 315 -347 387 -428 473 -523 578 -635 701 -772 851 -940 1035
53A035k177K404k659K949l282L664m111M647n298O108p153Q557j0552J3640j9107
$$ 1035 -1142 1262 -1397 1552 -1730 1934 -2177 2470 -2828 3280 -3873 4684 -5868 7772 -11335
68a1335L1703j18638k7365J71690j2330l4533K6386Q2883j8666q1123p0684J0535
$$ -11335 20368 -98270 -125635 46055 33725 -808 25578 108461 89795 8672 -62012 -51477
80e1477M0112K2336k0240J0899M5266J0315o0836l3591K3546J1428l0048K756
$$ -51477 -11365 10971 -9269 1630 46896 57211 -3625 -37216 -13670 -2242 -32290 -29534
92b9534L7010Q443k5668j171J7543L385j0061k254N403J4768N547k3637k3571
$$ -29534 7476 15919 -9749 -10920 6623 10008 -53 -2307 3096 17864 23411 -226 -23797
105b3797K0304K1812k4612k4808L1786L6129j6551k9509N873R627j6421k0497
$$ -23797 -3493 18319 -6293 -31101 685 36814 20263 -9246 -3373 6254 -10167 -30664
117c0664j294J6318K6674J6132q985p576J0361p867l7742j3730K8278J8213p061
$$ -30664 -31958 -15640 11034 27166 18181 10605 20966 13099 -24643 -38373 -10095 8118 1057
130A057P673K2153m788k7214j6423k982O48R340J2270L721O497P952j4075k4228
$$ 1057 8730 30883 26095 -1119 -17542 -20524 -19876 -10536 1734 5455 11952 19904 5829 -18399
144a8399L023J8751k418p900J6154J4783j4629j9094n83K723j782N444O754K227
$$ -18399 -15376 3375 957 -6943 9211 23994 9365 -9729 -10312 -7589 -9371 -3927 2827 5054
158E054O154K298j5882j3709J0229R468j0096j431J8699O624j4605o906M734m308
$$ 5054 11208 13506 -2376 -16085 -5856 3612 -6484 -7915 10784 17408 2803 -4103 631 -3677
172c677p135L587M168J918Q903N773p323n607M620o048j5748J861J4935K241k782
$$ -3677 -10812 -7225 -3057 -1139 7764 13537 6214 607 5227 -821 -16569 -14708 227 2468 -314
187c14J0146O696j1632j0443o45k748l196Q523R519L38K485K826j0347j2963L828
$$ -314 9832 16528 4896 -5547 -6192 -8940 -12136 -3613 5906 6244 8729 11555 1208 -11755 -7927
202g927O841m409K230J3924K123j2324n111K866m288j741Q026N688k087J612L04
$$ -7927 -1086 -5495 -3265 10659 12782 458 -4653 -1787 -6075 -7816 210 5898 3811 5423 5727
217E727j0187n501P370L369m072M792R269m326j0105R81J730n634L83Q884J087
$$ 5727 -4460 -9961 -2591 778 -3294 1498 10767 6441 -3664 -2683 -953 -6587 -6204 2680 3767
232C767l066L510J687p495k231N350k682n440N049M788m474r42P546M95p508P75
$$ 3767 701 4211 5898 -1597 -3828 1522 -1160 -6600 -1551 3237 -1237 -2179 5367 5862 -1646 -871
248h71L099n427l499O366L283k496K713L324o852n187L841Q96m486M077R006k626
$$ -871 2228 -3199 -6698 -332 2951 455 3168 6492 -360 -5547 -1706 -810 -5296 -1219 7787 5161
264E161o360J652Q8o405n1P462Q63j574L706K65q045k318N057n14k238O274M536
$$ 5161 -1199 453 541 -5864 -5915 1547 2410 836 4542 4807 -3238 -5556 -499 -1013 -3251 3023 7559
281G559o205m019K662j682m820M258O575k076j570L170k375o319J899M413k564
$$ 7559 1354 -2665 -3 -1685 -6505 -2247 4328 2252 682 3852 1477 -4842 -2943 1470 -1094
296a094j043N734R9o579J50N003k387k539M497J969n545j194L414j876k050N374
$$ -1094 -2137 3597 3696 -2883 -2733 2270 -117 -2656 1841 3810 -1735 -2929 485 -1391 -3441 1933
312A933L113m866j034K850l657m178M585M778k355j05L785k465p056R57L770k219
$$ 1933 5046 180 -854 1996 -1661 -5839 -1254 3524 1169 1064 4849 2384 -4672 -3715 55 -2164
328b164K60O069Q48n687N4J654m052j284N702J604l979J472L061m149l941M317
$$ -2164 -1904 4165 5013 -674 -620 1034 -3018 -4302 1400 3004 -975 497 3558 -591 -4532 -215
344b15K130l058R88L592k422l537K839J507l602O50M005k008m796K528L040l006
$$ -215 1915 -1143 -155 3437 1015 -2522 317 1824 -1778 -1128 2877 869 -3927 -1399 1641 -1365
360a365L34M745q79m784O33J048l299R8O085J661l202J250Q17n309l660L851K117
$$ -1365 -1031 3714 2835 -1949 -1316 -268 -3567 -3469 2616 4277 1075 2325 3142 -2167 -5827 -1976 141
377A41r86L551L486l753m557N76n16l279K758N873j64k094J444j020n655k91M664
$$ 141 -845 2706 6192 2439 -2118 -1542 -2058 -5337 -2579 3294 3130 1036 2480 1460 -4195 -4486 178
394A78J85r65M102J475m841k859J654n14j922L176L800k086j098K281k211m235
$$ 178 363 -602 3500 4975 134 -2725 -1071 -1585 -3507 -331 3469 1383 285 2566 355 -3880
410c880J579L309k305r31M255R02l179J086K154l046k515J783K93l045J826M860
$$ -3880 -2301 1008 -1297 -2228 2027 2929 -250 836 2990 -56 -2571 -788 -495 -3540 -1714 3146
426C146m32j993K061p68n354j134L137k06j71M911K636m308k671J228k220k811
$$ 3146 2714 721 2782 2014 -3340 -4474 -1337 -1543 -1714 3197 5833 1525 -1146 82 -2138 -4949
442d949L498M162q02k7J586k966n118J257L244p18J218M539l77n398j731P96k428
$$ -4949 -1451 2711 1909 1882 3468 502 -4616 -3359 -115 -833 385 4924 4547 -851 -2582 -1786 -4214
459d214j26N834K825j356K92L29m951m230K227J916r27L029M692j418l385M70
$$ -4214 -4340 1494 4319 2963 3255 3584 -1367 -5597 -3370 -1454 -2381 648 5340 3922 537 1007
475A007q84m020k69M024J29j287K920K320k711j809K005j716l614J591K426j483
$$ 1007 123 -3897 -4166 -142 -13 -1300 1620 3940 1229 -580 1425 -291 -3905 -2314 112 -1371
491a371L58M527R8l960J8R62l080j620M178J941j278R52J193l691k906K076R12
$$ -1371 -1013 3514 3612 -348 -330 632 -2448 -4068 110 2051 773 1725 2918 -773 -3679 -1603 -691
508f91p19K659L410j685m118k93r27k745K014N536J806q18J330j854n952k851
$$ -691 -1410 1249 4659 2974 -1144 -1437 -2364 -5109 -3095 2441 4247 3429 4759 2905 -3047 -5898
524e898J905O00J508N093L666k819k793l84l296m223K272M103Q29P15L249l39
$$ -5898 -3993 -3393 -1885 3208 6874 4055 1262 878 -2418 -6641 -4369 -266 563 1278 4527 4188
540D188m216r95L57k040n18L360J027j523R02K295j792k362J635L80k675M81K292
$$ 4188 -28 -1023 -666 -2706 -3224 136 1163 -360 542 2837 1045 -1317 318 698 -1977 -1496 796
557G96k48j622J989O73k811q9K380o42j337K126J555k809j674P99j067j795K952
$$ 796 548 -1074 915 1588 -1223 -1312 1068 426 -911 1215 2770 -39 -1713 -914 -1981 -3776 -824
574h24L930m21p18J720k192n252j123J667L25K361M854J473k475j340j613m062
$$ -824 3106 2685 1967 3687 1495 -3757 -4880 -3213 -2888 -527 4327 5800 3325 1985 372 -3690
590c690k520K724L668N78J936K325k169l805o14k91j833J676L930Q5j681J050
$$ -3690 -6210 -3486 182 760 2696 5021 2852 -953 -1567 -1858 -3691 -2015 1915 2000 319 1369
606A369K31l058q74K566L75j231J747P22k311j426J849k49j497J388K481j524
$$ 1369 1600 -1458 -2332 234 609 -622 1125 1847 -464 -1890 -41 -290 -1787 -399 2082 558
622E58j007J831M6k857m3J394j273p31K458J540j253P04J117k344k936P27O82
$$ 558 -449 1382 1428 -1429 -1472 -78 -1351 -2082 376 1916 663 1367 2484 140 -2796 -2069 -1387
639a387r50J901L743R5k237K7p25l608r16K616J344O18K337R87l035k059r1k23
$$ -1387 -2337 -436 3307 3402 1165 1192 467 -3141 -4057 -1441 -97 521 2858 3845 810 -1249 -1340 -1563
657a563j557K520K812n72q89Q36j490k841M24K674Lk08J826j03k716q20J273p36
$$ -1563 -3120 -600 2212 1640 751 1587 97 -2744 -2320 354 357 149 1975 1872 -844 -1664 -391 -1127
675a127j71K359R95j681k19P86j385j833J216J646q09j06K152p31j833R74O82
$$ -1127 -1298 1061 2056 375 156 942 -443 -2276 -1060 586 -223 -329 1823 1092 -741 233 915
692I15j845m30J684l10j517J473J811q68j046J261q23k252K21J604l07L62K429
$$ 915 -930 -1360 324 14 -1503 -30 1781 913 -133 1128 305 -1947 -1726 -122 -429 -67 2362
709B362l2k131j019N08j266q04K258J765p77J39M89j935j791J080J070o16Q25
$$ 2362 2330 199 -820 -312 -1578 -2382 -124 1641 864 1003 1492 -443 -2234 -1154 -84 -700 125
726A25K268q32k525J91M30j194K41K525K25j440L41M74k091o84J982M12p85J026
$$ 125 2393 1561 -964 -773 -343 -1537 -1296 1229 1454 14 355 829 -1262 -1946 36 448 -337 689
744F89J002j620j603J171K86q01O25J795j207j188J168j95j244L99J633l73j257
$$ 689 1691 71 -1532 -361 -75 -876 -251 1544 337 -851 317 122 -1122 -723 910 537 -720
761g20R13L64j451N0K134l83j311O66L75j691n11J486N19n20J290M40j806r60
$$ -720 193 557 -894 -844 1290 907 -404 262 637 -1054 -1565 -79 440 -80 1210 1650 -156 -1116
779a116R28m92r22J660J806j068r16Q47r15j254K65J660l22j25J288m32j969p4
$$ -1116 -188 -680 -1602 58 1864 796 -120 727 -188 -1442 -1177 483 161 36 1324 892 -1077 -1151
797a151J234n72n47J614Q11j812k56Q24m58q90J529Q84j323o02J244p91j080J158
$$ -1151 83 -489 -1036 578 1389 -423 -679 145 -313 -1203 326 1210 -113 -715 529 -262 -1342 -184
815a84J482j019j18P18n83j915O62J330ml55R97q0j722N3L74q62M91K138L96j487
$$ -184 1298 279 161 879 296 -1619 -957 373 369 14 1011 931 -791 -738 -364 -1226 -735 1403 1799 312
835C12l07J84r16j264J694J115l19O3Q45j275j726R65N64o66O65J430K5j416L02
$$ 312 5 189 -727 -1991 -297 818 499 562 1407 132 -1594 -629 -65 -731 -66 1364 1389 -27 275
854B75L7j534O8J519K08n24M34N83j268q63J217o3o78M01Q29o14k73P20mr52J97
$$ 275 312 -1222 -1154 365 573 49 483 1066 -202 -1065 152 89 -589 -188 641 27 -246 474 470 -482 -285
875b85P53p78j014J188R89o30R5J141o79j532J9K14q07O75J879l3p78O19o83j372
$$ -285 468 -310 -1324 -136 853 223 318 1459 780 -752 -733 -519 -1326 -651 1228 1195 417 1036 353 -1019
895a019q38J419M25J08J460J39j317j117L40l71o84J268J598l18p32J57p64j501
$$ -1019 -1857 -438 -13 95 1555 1694 377 -740 -400 -771 -1455 -187 1411 1093 361 518 -246 -1747
913a747O07J317r0M05J249o93j573n30O95m64l53J444J122p27OK48j011j117N38
$$ -1747 -1140 177 87 492 1741 1048 -525 -1055 -360 -824 -1177 267 1389 662 668 916 -95 -1212 -674
932f74P21r27M28J523k16p52M16L69j068q22N18l0m11J112Q70l43j78M45o81j523
$$ -674 47 -880 -452 1071 855 103 519 888 -180 -1002 -484 -514 -925 187 1057 714 536 981 300 -1223
952a223J03Q55%J41J523J48j549l49L01j162q5J253J060l93j33m2j262q80Q39
$$ -1223 -1120 -265 -265 -124 1399 1547 -2 -351 -50 -1212 -1297 -44 1016 623 490 448 -814 -1694 -855
971h55J171j28N70J126q71j704m22j02j95L3K584N16n39R2n65j757p36P90K24
$$ -855 316 188 758 1884 1013 -691 -1113 -1215 -1410 -1377 1207 1723 1184 1276 711 -1046 -1782 -992 -768
990g68l5J374J206o67p87M0l62j635L80J046N0j17J082J5n96j25K85o80p61N75
$$ -768 -803 571 1777 1110 323 363 1 -1634 -1254 -208 -158 -275 807 822 226 101 386 -294 -1055 -480
1010d80P05r10O72Q21l21o67L66j45r16j22J673Q4o84J78j2r00n28Q77M12j6P98
$$ -480 225 -685 -13 808 487 -180 186 41 -875 -997 676 760 76 254 242 -658 -1186 -309 103 87 885
1031H85R00j267j491J47m60m20J005J775P28m42j6r34j830n84N54O99O40J153
$$ 885 1785 518 -973 -826 -1286 -1706 -701 1074 1802 1360 1344 410 -1420 -2004 -1450 -751 -111 1042
1049A042R84r19j017k22p98q15J109Q62j81N09O68p94p93R3J65m33J06P01J28
$$ 1042 2026 1107 90 -132 -930 -1745 -636 226 45 554 1222 428 -365 -272 -107 -540 -434 267 395
1068C95o97L23L52l57n99P18L15q68L66M97k00m79M85o7q85L13M77r5J14N80L60
$$ 395 -302 21 373 16 -583 135 450 -418 -52 445 245 -234 251 184 -701 -388 89 -6 108 688 1048
1089A048j110m76K53n88m54J439P19L0j99L29q78j438M2J62M02R06J378o4r87
$$ 1048 -62 -538 -285 -873 -1327 112 831 861 662 991 113 -1325 -1283 -1121 -719 187 1565 1501 514
1108E14j67l81j415M3Q51Q84J01L13L86j019p93M73l55p5O32J057k71r93M39j66
$$ 514 347 -34 -1449 -1406 -555 329 430 743 1129 110 -683 -210 -565 -640 -8 1049 778 -215 224 58
1128E8o04r4P94M91r10Q09j82q43k21O75j83j45N51L95m00m42K36J57l31P0L16
$$ 58 -546 -640 154 645 -265 544 362 -481 -702 -27 -210 -355 196 591 191 -251 -15 142 -189 -119 197
1149A97n94k25J195o1o01N46L94p79q18M62r1j32N59Q62j30n68R3l44j031K81
$$ 197 -397 -622 573 512 -89 457 851 72 -746 -284 -375 -507 52 914 784 216 309 -35 -1066 -785
1169g85P68J25R9M41K07q49n96K90k08J8P82P49q03k07lk70q13N55P72p7J65N36
$$ -785 -17 108 207 648 855 6 -590 -300 -508 -490 292 1041 238 31 28 -242 -1055 -500 272 195 360 896
1191H96n23q36O0J12pj32J075j77n95J2j4l7l41Q15L3n28J86j7j19l37P88k9l08
$$ 896 373 -463 -403 -291 -298 -430 645 468 -127 -115 -129 -166 -507 308 341 -187 -1 -18 -137 -474 314 285 -23
1214b3q6K74j16m54J82N34k98k17O27l69n67J23O66l27m1O76n7n52l57M19n74
$$ -23 -109 165 49 -405 -223 311 13 -204 423 54 -513 -390 276 -51 -92 584 527 -25 -382 37 -537
1235e37q7R92Rk67K85k0q83l52P87q7Q4J44N19k39p88K20J30m82L58O62j41n67
$$ -537 -624 368 377 110 395 375 -508 -860 -73 -160 -76 68 587 348 -440 -220 -90 -572 -214 448 307 -260
1257b60L92k61j83l0Q01l31k24L86l10k98k79M54J03K11L27j8p76k41N47J57m62
$$ -260 132 -129 -312 -342 459 128 -96 290 -20 -318 -597 -143 -40 171 498 480 -296 -537 10 167 -295
1278b95K15P48p21j11K15p8m65L92O37k59Nj08o4p96K33K54K60o4N65L23j186
$$ -295 -80 668 -53 -164 51 -27 -492 -100 537 278 283 175 111 -685 -452 -198 62 -2 563 886 -300
1299c00j5L02m11k66O31N99k77j82l8j43o25L74L81n0K33R5j20o21L67L42j69
$$ -300 -315 -13 -424 -690 -59 540 263 81 43 -100 -725 -351 30 -20 213 308 188 -433 -66 276 107
1320A07m67P09k9m44k90Q56m66J07K67j62m57N0J50j70K4M99L82n01l4K92q26
$$ 107 -360 349 320 -124 -414 442 -24 83 350 188 -269 -219 -69 -239 -215 284 666 165 131 423 -403
1341d03l73N13M67L5j17N18l96o65K78j96j50L38N95J88o62r9J0m76p7P21L29
$$ -403 -776 -263 204 239 122 640 244 -421 -143 -339 -489 -151 444 632 -30 -129 -119 -595 -672 49 378
1362C78m33M40m8l74l55J94J38j08P9M98j69o08J63q7r2n9Q34j29m05K87L00n77
$$ 378 -55 385 337 -37 -392 -198 -60 -168 -89 409 240 -368 -205 -292 -384 -443 391 262 -143 144 444 -133
1384a33k90M42j06k02J73M41m39j31N99j08m46L45j56m87K42J26K86l10N09K44
$$ -133 -423 19 -87 -289 -116 325 -114 -245 354 246 -200 145 -11 -498 -256 -130 156 -154 355 599
1404E99n5j030K76j59j18L69P00ql42K78p17m23K87M00K16j3L69j82m36m31J87
$$ 599 544 -486 -210 -369 -487 -118 582 574 232 510 -207 -630 -343 57 273 260 629 447 11 -420 -233
1425b33j32L50J71K29R0m39J27m82l94N47R9K67J35J71j49o15JK39l84J5O10L2
$$ -233 -365 -15 156 385 475 36 163 -319 -713 -166 -67 200 335 506 357 -258 -257 -18 -402 -387 223 255
1447B55k19J09L66m81k87K45r0j38K05K50j28j49K77M2o32L19p0k70R3K73J46
$$ 255 36 145 511 30 -257 -12 -102 -240 -35 215 87 -62 215 257 -375 -56 -126 -396 -303 -30 116
1468A16m3K60J64m78q16M43L38n0j40R40k50o10j78J22l22M40L24K64l69o0p1
$$ 116 73 333 497 19 -797 -354 -16 -66 -206 734 484 -126 -304 -182 -504 -64 260 524 155 95 24
1489B4n12N0K45M48r8K89j3j90p72K51k57j04N11P59j22k47J00l87o16L5M61J63
$$ 24 -488 -438 -193 255 157 446 433 243 -529 -278 -535 -639 -128 631 509 262 362 -25 -641 -606 -145 18
1511A8o3M47j31j71l98O29n50M4p8J15q9J0L97M8l02K28L12o15j75L14l0l35M12
$$ 18 -45 402 271 100 -298 331 -219 -175 -253 -138 -227 -217 180 228 -74 154 466 -149 -324 -10 -40 -375 37
1534C7L31l29N5J53j87k68L44K11k10j54L17j62m77l6L36RL12L58j89n03k34k8
$$ 37 368 39 94 247 60 -208 136 347 137 -17 300 138 -339 -375 -39 -30 282 640 451 -52 -286 -314
1556c14k71J27N90L56N5k37J83o40m23K01J89R6N3P64n26Q7o41M28m07M2L10N8
$$ -314 -585 -458 132 488 543 306 489 -151 -574 -373 -184 -88 -35 729 203 290 -351 77 -330 -288 22 80
1578H0N9k07L70j75l32J18L32l02J7L81l42k11L21j53L3m8M11n98K35j78J6J30
$$ 80 139 -68 302 127 -205 -87 245 -57 -40 341 -1 -212 109 -44 -11 -59 352 -246 -11 -189 -173 -43
1600d3P7M04l80K8k32J46o1K23L5P5m24J6k14o3J71jO25l11L4L9k46j13q4L18
$$ -43 34 438 58 86 -146 0 -61 162 197 272 -152 -136 -350 -413 -242 -243 382 71 105 144 -102 -215 -299 19
1624A9K9O0L75m14J1o0l8l88mL10J83J02R6M1o05o1M06J45m64M05J44l89n2m9
$$ 19 48 108 483 69 80 20 -18 -406 -410 -100 83 185 281 322 -283 -344 62 207 -257 148 292 -97 -149 -198
1648a98K26k62J36K92k58Q6M2J88o76L09l4K17l84P7L93j47j23L04j29q6k1m0
$$ -198 28 -234 -98 194 -64 22 64 252 -424 -115 -149 68 -316 -239 154 7 -116 188 59 -27 -48 -88
1670h8n3O9J02J04l22L88K37l13k61J86ol31M40N5j88k23R3l9j94J47J09Q1K06
$$ -88 -141 -72 30 134 -188 200 437 124 -137 49 43 -288 152 207 19 -204 -111 -150 -344 -197 -88 -7 199
1693A99L53p12R3j61K24j81P6K20J13J00k83K9k11l0L55L7k46M6N2o8k74K90j28
$$ 199 552 -160 -67 -228 -4 -185 -109 111 224 324 41 70 -141 -171 184 221 -25 21 73 5 -269 21 -107
1716a07J73k02K57n3j96J31L8j66L0J12L31n07K08j6pj58J79J62j05j48j52K40
$$ -107 66 -136 121 68 -128 3 41 -125 -95 17 348 -159 49 33 26 -132 47 209 104 -44 -196 44
1738D4k00K03K97l47K88j35k66p3o3K62k34N32j33l01K08K2j74k23J64L57n0o7
$$ 44 -156 47 344 -3 285 150 -116 -189 -252 10 -224 308 175 -126 82 104 -70 -293 -129 228 178 111
1760A11J61k74l53J84K85k74M2J50K61n7l13j0rLJ14m6J5J13k96M1J9L18J10j11
$$ 111 272 -2 -355 -171 114 -160 -118 32 293 236 -77 -87 -96 -93 21 -25 -10 103 -193 -152 -133 185 295 184
1784A84j81K57m52J41k17L23N7n7L28l19k97J18K98k81K9L96N7o24J63o5j86K91
$$ 184 3 260 -192 -51 -268 55 112 55 383 64 -233 -115 183 -98 -69 327 384 -240 -77 -142 -328 -37
1806c7L02Q6k03%j46r3R0N5OO9N8M3j89k68J22K57j40j46R6R0R7N6k71l2j77K49
$$ -37 265 351 148 148 2 -91 -1 54 60 129 187 230 41 -227 -105 152 12 -134 -38 52 149 205 -66 -98 -275 -26
1832b6J1Q6p6n3J80j40J65k44L96k46n6m0K6J44j09K39k31J71k75l6N5j02J84
$$ -26 -15 71 -5 -58 122 -18 147 -97 299 53 -3 -43 -17 127 18 257 26 197 -78 -114 -59 -161 23
1855B3J65j08M7q0j14j48k65K78K64l1qM5Q3k89j41R2L42k97K75P0l81j46K15
$$ 23 188 80 127 47 -67 -215 -480 -202 62 31 23 68 151 -138 -279 -187 155 -142 133 203 -178 -324 -109
1878a09l4lj01M43k5N2j78O3q3p8J59k05K38k13J56j39K10j85L1j04J21J45q0
$$ -109 -143 -146 -247 196 171 223 45 108 25 -53 106 -99 139 -74 82 -57 153 -32 -1 -105 16 161 81
1901H1q6O7J02l77K54j11N0k39K45j83J47k14N85j78j76O3l0k64K0L27j73J36
$$ 81 -5 62 164 -213 41 -70 -20 -259 -14 -197 -50 -264 321 143 -33 30 0 -264 -244 83 -90 46
1923D6j8K1k04O0m6k8r0L75q1K49m2l68j81J47M8J49j03L0o2L01k38rP1o1m4J34
$$ 46 28 49 -155 -95 -141 -169 -259 116 35 284 242 -126 -307 -160 -112 37 -66 -36 -98 203 -35 -44 27 -34 -78 56
1949E6L01l34l33L77k04J9J53O9j86K68j17r0l95M90K0k46o4K53M7M1j92k9L43
$$ 56 357 23 -310 67 -137 -118 35 104 -82 186 69 -21 -416 74 94 -152 -216 37 84 125 -67 -96 247
1972B47j43J40l8l16K00L6l21K36J14j49q1L25j00j96%J95j21j1P9l04J40J04
$$ 247 104 244 206 -110 90 126 -195 41 155 6 -75 250 150 -46 -46 149 28 17 96 -208 -68 36
1994C6L6J92k69M1J75l67m1J29LJ81k58K55P5l68K56j64O6q7K83M5j84j18M03
$$ 36 72 264 -5 36 211 -156 -197 -68 -65 116 -142 113 188 -180 76 -88 -22 -109 174 219 35 -83 320
2017C20m10nj2N6K86j87J7k46J67M9Q4k45J26j54J53N6k17K61j17j72K4J28m9
$$ 320 -90 -95 -107 -51 235 48 65 -181 -14 35 119 -126 0 -154 -1 55 -162 99 -18 -190 -166 -38 -87
2040h7K42j9J10m01K30PJ12k78Mj9N1M8k4J91q1J26l16J79J24l02J69n2p1J08
$$ -87 155 136 246 -155 75 82 194 -84 -80 -99 -48 0 -24 167 86 212 -104 75 199 -103 66 14 -57 51
2064E1mk66M6j7L10l31L77k29L27l62j15L43k42j04J59J98r1J01r8K2j06R5k86
$$ 51 47 -219 -173 -190 120 -211 166 -63 264 -98 -213 130 -112 -216 -57 141 50 151 53 75 -31 64 -222
2087b22K97j30qJ85l1J55l04j48R9K20j62K97p5k17J08k36K96j45j91J39J72J7
$$ -222 75 -55 -63 122 91 246 -58 -206 -107 113 -49 248 173 -44 64 -172 124 -21 -212 -73 99 116
2109A16k12o0K63J8j76J6q6K55m10J10L3K01J16m6j72k09K55j99K13k06M40k07
$$ 116 -96 -156 107 125 -51 -35 -121 134 -276 -166 -133 68 184 138 -34 -243 12 -187 26 -180 260 53
2131E3j29J44j54k52K82K34l59O2J26K61n37K20o8J29j83K36J5j63Q2R7k16P8
$$ 53 -76 68 -86 -338 -56 178 -181 -119 7 268 -269 -49 -117 12 -171 65 80 -83 -1 96 -120 -42
2153d2j0R7jl5j05mj0K05l79L32j30O7l15L16k6O6p6K84k13k31L51k38J13J44
$$ -42 -52 45 44 9 -96 -100 -110 95 -284 48 -82 -15 -330 -14 -40 26 -50 234 21 -210 141 -97 16 160
2177A60P9n07K80j08k6k6j51L14R7O2Kj35m7r0k18K98L8N9o7J51m26M0M17j28
$$ 160 239 -268 12 -96 -122 -148 -299 15 112 174 176 41 -6 -96 -314 -16 22 81 14 165 -261 -221 196 68
2201F8M6M6j90J55m03L19j00p8J78M4J1k89J51J56r8N6r3N0K30m03J99L00l05
$$ 68 114 160 -30 125 -278 41 -59 -137 41 85 96 -193 -42 114 16 72 -21 29 259 -144 55 355 50
2224E0O1J44m9j83r8J09mk51L68l72K99j08j99J88K06j40j15N1j27J85N4%P8j63
$$ 50 111 255 206 23 -75 34 30 -221 147 -225 74 -34 -233 -45 161 21 -94 -43 -170 15 69 69 147 -16
2248a6O1L1J7l1q6L9J89l09M7K40m11L30j25n6kJ95j36J63k67L60k86P9K3q5K1
$$ -16 45 76 93 62 -24 15 204 -105 -58 182 -229 101 -24 -80 -82 113 -23 140 -127 233 -53 26 49 -36 -15
2273a5j94J73N0k39K95L10k29k27M8J31k06J46pj39J31l3m8k39J57K58r8j78K15
$$ -15 -209 -36 14 -225 70 380 151 -76 -28 103 -103 43 36 -103 28 -5 -53 -292 -135 123 25 -153 62
2296F2K2j87J13K21l00K67M6j54k99J03k1o1J14RJ95j92O5L0Q9r5qo5J52%j60
$$ 62 84 -103 10 231 -69 198 244 90 -209 -106 -127 -188 -74 -65 130 -62 3 33 122 27 19 -46 106 106 -54
2321e4r7J71o4L2L8J53j14j31K22j44l0k76K57K67j03l21K49q1j5j65L88j68q1
$$ -54 -151 20 -44 -12 26 179 65 -66 156 12 -18 -294 -37 230 127 -194 55 -26 -41 -206 182 14 -67
2344f7K92j47l3k84K47P4j24pP6Q5q6J54j67j61J22j5K5O4o8k70J49J24L08l32
$$ -67 225 78 45 -239 8 82 -42 -49 27 112 26 180 13 -148 -26 -41 -16 48 -20 -290 -141 -17 291 -41
2368d1K4O8k84L62k57OJ12j6j03Q4J35Q2l41Lj35O21k57j84J37M5j11K2j50K11
$$ -41 -17 51 -233 129 -128 -122 -10 -26 -129 -45 90 172 -169 -166 -301 320 63 -121 16 61 -50 -28 -178 33
2392C3J67k88Pr8L91j57o7o3K17J12n44M04p1k71L17O8qj66j5R0j69M6J60j25
$$ 33 200 -88 -81 -179 212 55 -12 -75 142 254 -290 114 43 -228 89 157 149 -17 -32 58 -111 -65 95 -30
2416c0J00k4M7J1j25L2l13M77k83M9j0O7K7n1J14j8qj60J54r9J8j67J71k6M1p0
$$ -30 70 46 93 104 -21 11 -302 175 -108 -59 -69 -2 25 -26 88 70 62 -98 56 -43 -25 -192 -21 -47 -6 -76
2442g6j85J48J2J16j03K43j54j16N8J9K18q0j81l5J38j57K19j53L67k17r4j33
$$ -76 -261 -113 -101 15 -88 155 1 -115 -57 -38 180 100 -81 -116 22 -135 84 -69 298 81 -13 -146
2464a46K80Nj89N5N6j46K06k39R8Q1k75P7q6M70r1k89J62M1k07M57j74j23o0j45
$$ -146 134 139 -50 5 61 -85 121 -118 -20 61 -214 -137 -223 247 156 -133 29 70 -137 320 146 23 -37 -182
2488a82J57J64K13m58R8J45j64P5p9j46K95p6o5o1J2K3R9l2k71K08L19l60q0K02
$$ -182 -25 139 352 -106 -8 137 -27 48 -31 -177 118 42 -23 -84 -72 -49 50 18 -253 -45 274 -86 -166 36
2512C6j93n3K59k01K64j89K28l44J61K67J12m86J42n7P6j62L5J60r7J04J2J80
$$ 36 -157 -210 49 -152 112 -77 151 -193 -32 235 347 -139 3 -54 22 -140 -105 55 -42 62 74 254
2534B54k74J79j98J13R6k48n7l7L2J99l2n0k60K15K94j46O6n3J3j42K30m35L89
$$ 254 -20 159 -39 74 170 -78 -135 -172 -140 59 27 -23 -283 -68 226 80 146 93 106 -36 194 -241 148
2557A48j52K12j04k29J38o9K04R6j15j67J3j51J77P4j35p8J07l8K7L12n44J19
$$ 148 -4 208 104 -125 13 -56 148 244 129 -38 -25 -176 1 75 -60 -138 -31 -69 -42 270 -274 -155
2579a55Q8j20L40M8j72O9k27r7K19L1K76l45K97l30K13k6j06q6Q1j0K74j80p4
$$ -155 -67 -187 153 201 29 98 -129 -226 -7 24 300 -45 252 -78 135 109 3 -83 -2 -12 262 82 8
2602Hk1j45K0l6K03j41K29k28L13k35k7K66j36q9J72l7k02K16j11n9N5J79K1m4
$$ 8 -13 -158 -138 -174 29 -112 117 -111 202 -33 -60 206 70 -19 153 116 -86 130 19 -40 15 194 215 171
2626A71k44j68L61j55j80K48j56K86j09q8J64l06K54k46J32n4Rj3%J09P2k46Q6
$$ 171 -73 -241 120 -35 -215 33 -123 163 54 -34 130 -176 78 -168 -36 -90 -81 -94 -94 15 87 -159 -73
2649g3K13l2l4O0J52l90r3J40J50k38L01j07k51J70K11k74L59q4l14K32k24J19
$$ -73 140 108 74 134 286 -104 -197 -57 93 -145 156 49 -202 -32 179 -95 264 180 -134 98 -126 -7
2671gM8j08K72k6k46Q2k41L34j11q3J40k55K1Q9M7K8j12L61m6n2j54J66p4k24
$$ -7 41 -67 205 179 -67 15 -226 108 -3 -86 54 -201 -180 -91 -44 -16 -128 233 187 135 -19 147 73 -151
2695a51K84l73L73J5r9j26Q2P2p9K4j0K10k57J32M1k44P3rK7K3p6j95L56j80M8
$$ -151 133 -240 133 148 49 -77 5 77 -2 22 12 222 -35 97 138 -106 -33 -42 -15 8 -68 -263 93 -87 -39
2720c9o5K57l40k61M39J14j64P7j01R7N3O6l40K61k80J54J56l16K82O2J18k71
$$ -39 -104 153 -187 -448 -9 105 -59 18 -83 14 67 133 -207 54 -226 -72 84 -232 50 112 230 -41
2742d1J60l06N92k14k09J6n8K6Q4n5K05k46K09j8o0j49J1J26n13N73j92J72m9
$$ -41 119 -187 405 191 -18 -2 -60 -34 50 -5 200 -46 163 145 85 -64 -53 73 -440 133 -59 113 64
2765F4k24J81M9k9l05J14j1J03l1J22q7J49j95J53J82j81j87R0j87M29m64O1Q4
$$ 64 -160 21 70 41 -264 -150 -161 -58 -89 33 -54 95 -100 53 235 54 -133 -43 -230 199 -265 -204 -120
2788a20m1J19Q5k09J23lj13K96l13K97n5j18Lm8mJ00k86J54J48l7k6r9O9J7RJ78
$$ -120 -161 -42 43 -166 -43 -46 -159 137 -176 121 66 -52 -49 -97 -101 -1 -287 -133 15 -22 -48 -147 -78 -61 -52 126
2814A26j48k33M24l95N8P7k4J54p2J94j28j81L07l48K62q2N6J26j08j76J8K09
$$ 126 -22 -255 169 -226 -168 -91 -115 39 -33 161 33 -148 159 -189 73 -9 47 173 65 -111 -93 116
2836A16mk05J56j33R4m16K51k1K05k7N3O0k46J36k0K0J00P3j11n9k35M25k72R3
$$ 116 112 -93 63 -70 24 -392 -141 -162 43 16 69 129 -117 19 -1 19 119 192 81 22 -213 212 -60 33
2860C3j36P8K9L5J17J5j46p5k06Q7N10n75J97K3m6R2J44M9j01j11j6Kj79L86j15
$$ 33 -103 -25 4 39 156 171 25 -50 -256 -169 341 -234 -37 -14 -60 32 176 225 124 13 -3 -1 -180 206 91
2885I1j37j42M87k56L8j06J79k38J13P8l9J26J4m02K4K63j79J47j67J69k71K5
$$ 91 -46 -188 299 43 81 -25 154 -84 29 107 68 194 208 -194 -170 93 -86 61 -106 63 -208 -183
2907a83J04J03k57M4J59p2R8j30L24j00j14k8k4J41k77J55J26k58J74j77j14J21
$$ -183 -79 24 -233 -189 -30 -102 -4 -134 190 90 -24 -52 -76 65 -212 -57 69 -189 -15 -192 -306 -185
2929a85K18K48k50J13k10o0M8J84p1m0p4N9M04m74m2j32k5K35L6k2O6P6kN5k08
$$ -185 33 281 31 144 -66 -126 -78 106 35 -5 -79 -20 384 -90 -132 -264 -289 -54 -18 -40 26 102 100 155 -53
2954e3p2J77q3O4j04J6J36k57M51k54Q3J6k13j50K90J04l1j8r8N4M0k11Q0q0J62
$$ -53 -125 52 -31 33 -71 -55 81 -176 275 21 104 120 -93 -243 47 151 120 102 4 58 98 -113 -33 -113 49
2979D9O2q2N6L7k70J19q8K38p7K8P2m26Q0J61J90k87K15r6P5p7L2K2r7J93k05
$$ 49 111 29 85 122 -148 -29 -117 121 44 72 144 -282 -202 -41 149 -138 77 -19 56 -21 11 33 -64 129 -76
3004g6K29l31J81J65j21j51rJ03K2Q8j97K31q7M9K20n16M40k46K05l83K34J59
$$ -76 153 -178 3 168 47 -104 -113 -10 12 100 -97 134 47 96 316 -200 240 -6 199 -184 50 209
3026B09j07l17J71l8J5K36l99J66J14j25Q0n4P9p0j30K76j58j38M8K14k36K07
$$ 209 102 -215 -44 -82 -67 169 -230 -64 50 -75 5 -49 30 -40 -170 106 -52 -190 -142 72 -164 43
3048D3J1J04l61J67J26J9j4k86J24J62n4k38K74J53k27K09l16J83k5k02J67k08
$$ 43 54 158 -203 -36 90 109 95 -191 -67 95 41 -197 77 230 3 212 -104 79 54 -148 19 -189
3070a89J07L09j49K1k81J46J26j67L2R8j6q8n0J0J79M2k8j65q7K2J44%J68L6l55
$$ -189 -82 227 78 99 -182 -36 90 -77 -45 53 37 -51 -101 -91 88 130 102 -63 -150 -128 16 16 184 220 -135
3095a35J8J53j33k81K15J19r5K54N9j49j21J82j98K58j24j06L34o33L95j93K06
$$ -135 -117 36 -97 -378 -163 -44 -139 115 174 25 -96 86 -112 146 22 -84 250 -383 12 -181 25
3116B5o7j2j37K92j49n5K43j21j33L01k43J12k8l7J46J8j57oj02pJ95Q5q6j27
$$ 25 -42 -54 -191 101 -48 -103 140 19 -114 187 -56 56 28 -9 137 155 -2 -8 -110 -117 78 163 77 -50
3140e0J16j69K49j82j45K59J25j87P9p5j87k62N52r3p4JK57l9k00p7N4l0k4K17
$$ -50 66 -103 146 -36 -181 78 203 16 95 20 -167 -429 123 30 -44 -43 214 175 -25 -102 -48 -78 -102 115
3164A15J08j40k29J82N9r6Q3j40q5k17K46K22j56l0K25k76J21J52l55M45j42j94
$$ 115 223 83 -146 36 95 -1 82 -58 -143 -360 -114 108 -48 -78 147 -129 -8 144 -211 234 92 -102
3186a02J27l0M8O4m1L32l90Q8L09k82k34j7K13j60n6L8K0j23K10K7L0RP0k25l28
$$ -102 25 -5 43 107 66 398 8 96 405 123 -111 -128 85 -75 -131 -93 -73 -196 14 41 71 80 150 -75 -403
3211d03J46O7L26k21J96j46J17R5j19K00m36K88m9k99L43Mk0j4j14L0j35J96O8
$$ -403 -257 -190 136 -85 111 -35 82 177 58 258 -178 110 61 -238 105 109 89 75 -39 -9 -144 52 120
3234A20J02k09K49k83k0L0o9J44K9p7j67J04l0L03j00O8m28R1L21m03J72M9k9
$$ 120 222 13 262 -21 -41 -11 -80 64 93 16 -151 -47 -77 226 126 194 -234 -143 178 -225 -53 -4 -33
3257c3J3J12j43j6Q3j71K57k17R5Q7r2N7J16l39L26k50j0J92p4o5L8m4j16J95
$$ -33 -20 92 -51 -67 16 -155 102 -115 -20 67 -25 32 148 -191 135 -115 -125 67 -7 -72 -34 -78 -194 1
3281Ak7n7L07j5j93N9q9P9p4M08k92k74J15J16L7l47L29l6m8j43K00J3j05N5r3
$$ 1 -26 -83 224 209 16 75 -14 65 -9 399 107 -167 -52 64 101 -246 83 47 -1 -144 56 69 -36 19 -74
3306g4K31q9K0p0Jn9K7j08K3l48M81R4k5l16K7N23r8J7o7j27p5J04P5l62J66j82
$$ -74 157 68 88 18 19 -40 -13 -121 -98 -446 35 129 104 -212 -185 338 240 257 190 63 -12 92 167 -195 -29 -211
3332b11L78j18j89R9l5k8K59j26M9p0j43J53N1q1n3J11O1j89M04j71j02j56p2
$$ -211 167 49 -140 -41 -76 -104 155 29 78 8 -135 18 69 -12 -65 46 107 -82 322 151 49 -107 -179
3355a79M47l98J36r4J48J92k88j90J87j22K84J45p3j09l17rJ92L0J36K5j79J39
$$ -179 268 -130 6 -88 60 252 -36 -226 -39 -161 123 268 195 86 -231 -240 -48 -18 118 143 -36 103
3377A03k09P7r4n6L95j03rl65L84j23j23OJ7J66k23J31J57r1p1k7r7J94LQ9k89
$$ 103 -106 -29 -123 -179 216 113 104 -261 123 0 -123 -117 -100 66 -157 -26 131 40 -31 -58 -155 39 42 131 -158
3402a58M3K05o3nl3m3N7q7N5j36K16mo8n2J97k14n0J28r6P5L37l48O2l59M58j19
$$ -158 -115 90 27 22 -11 -54 3 -84 -29 -165 51 47 -21 -73 124 -90 -140 -12 -108 -33 304 -44 18 -341 117 -2
3428bl34N04l01J94k04J73j72qJ79J93k22k7M0K82j16k26k43K20M34l66J29k70
$$ -2 -336 168 -133 61 -143 30 -142 -150 29 222 0 -27 13 295 179 -47 -290 -70 364 -2 127 -143
3450a43L17m77N27k58j04J98j34O7j06J66K62j71J05k31j81N9O1qK61k11L3oo2
$$ -143 174 -303 224 -34 -138 60 -74 -7 -113 53 315 144 249 18 -163 -104 -43 -51 210 -1 32 26 -36
3473c6J76Q8k98j89L48J60k29J20J8k49J5R7J08q0Q7m42M97j75j9o7R5r3l0q2
$$ -36 140 228 -70 -259 89 249 20 140 158 -91 -76 21 129 49 136 -306 191 16 -3 -70 25 -68 -98 -180
3497a80L4J11J60J65j54j20k45J79N5J33l22K61j96K30j24J9J95r9p7j20q6M17
$$ -180 -146 -35 125 290 136 16 -229 -50 5 138 -184 77 -119 111 -13 6 201 102 25 -95 -181 236
3519B36p7j85J41q1j54PK37l81K74k23Q1J05J20K7R6l26kQ0n8L82n43J65K05k74
$$ 236 159 -26 115 34 -120 -113 124 -257 17 -206 -125 -20 100 127 223 -103 -105 -25 -83 299 -244 -79 126 -148
3543a48O7J24P9j36J3j34K02n3j22o1p3k0L33Q1K8k24o8K8J5j1L6p8N9J06J72
$$ -148 -81 43 122 -14 -1 -135 67 14 -108 -169 -242 -262 71 152 180 -44 -112 -84 -69 -80 -44 -122 -63 43 215
3568B15j37k09N8K01LOj87M8o1j17K20j29K35j52K59m96J60J39QJ28n7n0O6ll33
$$ 215 78 -131 -73 128 131 137 -50 -2 -63 -180 40 -89 146 -6 253 -243 -83 56 64 192 135 85 151 148 -185
3593a85K97N4j65p7J22j75J72J52j61j37K9m5P9j5P2J19k56J66j85q9R8O4K6J6
$$ -185 112 166 1 -76 46 -129 43 195 34 -103 -74 -119 -40 -55 17 136 -120 46 -139 -228 -130 -66 -40 -24
3617b4n9l68K97J23K50k82P0R2j15j62m1j12K95L12K9k64J35l20J84o1L0J29m61
$$ -24 -83 -451 -154 -31 219 -63 7 99 -16 -178 -219 -331 -36 276 305 41 176 -144 40 -21 9 138 -323
3640c23K52J35k27R7M7J36j14r6K09l38K29j77J2J29k12L67R0k41j06J63j5O0
$$ -323 -71 64 -163 -66 -19 117 3 -93 116 -222 7 -170 -158 -29 -241 126 216 -25 -131 32 17 77
3662G7K12k68n1J06n4j39m6J05K46k88N0J48k57K59M2J6p0k07N7m3J54J76j46
$$ 77 289 21 -30 76 22 -117 -163 -58 188 -100 -50 98 -159 100 142 158 88 -119 -62 -105 49 225 79
3685G9j55O4p7J02J92k12M6q4oJ42k19J97qO8l23J40j15K02M7n4N5r4j97J47l
$$ 79 -76 -12 -89 13 205 -7 39 -45 -51 91 -128 69 61 129 -194 -54 -169 33 80 26 81 -13 -210 -63 -66
3710f6m6J11j02J05J21j26l8j22J58Nr9K97j61M4J51p9j0Lj96J45Qj44o2O3j71
$$ -66 -112 -1 -103 2 123 -3 -41 -163 -5 0 -99 198 37 81 232 153 143 146 -50 95 103 -41 -103 -40 -211
3735b11K53j08K2N7o7M5J30J0j69N9k9o6j6o4k4qJ31K00k2K4l02J63k19K32q6
$$ -211 42 -66 -44 13 -54 -9 121 131 -38 21 -8 -74 -90 -154 -178 -186 -55 145 123 147 -155 8 -211 21 -65
3760f5M6n3K83j10p6q3M0O1j67N2L12j45Q0l5j50R4L46n80o3M4K32j49J71p7j60
$$ -65 -19 -72 211 101 25 -58 -18 43 -124 -72 240 95 175 140 -10 84 430 -150 -213 -169 63 -86 85 8 -152
3785a52J25r1K39k53K6K55j46J41m6l21J08Q8k10J90l4j12K92l70J97j02N66n18
$$ -152 -27 -118 121 -132 -106 149 3 144 98 -223 -115 -27 -237 -47 -81 -193 99 -271 -74 -176 390 -128
3807a28J2j7J19J42j87P6j9N2oj95L9J65O0q8L3J39k69Q7KJ81j63m5K2J58K1k75
$$ -128 -116 -133 -14 128 -59 17 -2 50 44 -151 -112 53 113 25 58 197 -72 15 17 198 35 -10 12 170 191 -84
3833h4J8J71m0k21J55j41J76J38n4j83q2J06j74J18Q8L2k51J50Lk6Q5R7J36k91
$$ -84 -66 105 65 -156 -1 -142 34 172 118 -65 -147 -41 -215 -97 -9 23 -228 -78 -75 -101 -16 81 217 -74
3857g4J47j10q6L61k81j0MJ60n4P3k44L07l78L75j44O2k22J39J7L2M01m62R8R
$$ -74 73 -37 -123 238 -43 -53 -49 111 57 130 -114 193 -185 190 46 108 -114 25 42 74 475 13 111 120
3881A20j44k00J68J09p2kK6j19K9o4n4P5J18J53j02j14m2m1j66J12J91k4K23k00
$$ 120 -24 -224 -56 53 -19 -21 5 -114 -85 -149 -203 -128 -10 143 41 -73 -115 -156 -322 -210 -19 -43 180 -20
3905b0q2N2M7L3O6k27J67K23k72p3R8R9k18Q0j0J10j38n7N5k6K05j37rJ58k23
$$ -20 -102 -50 -3 30 96 -131 36 259 -13 -86 12 111 -107 -27 -37 73 -65 -122 -67 -93 112 -25 -34 124 -99
3930i9l6K76J41l00J74k79m7J42O9k43J00L05k8o9j79n4K21k93J58k5J33p6m8
$$ -99 -135 141 282 -18 156 -123 -170 -28 41 -202 -102 203 175 106 -73 -127 94 -199 -41 -66 67 -9 -57
3953e7K32l42j0L17J2k11L9R2j16J65j98J62J46l91M1K33J66j07l08K51m8j15
$$ -57 175 -167 -177 140 152 -59 -20 72 -44 121 -77 85 231 -160 -119 114 280 173 -135 116 68 -47
3975d7J76n9m4K04j97O7k98J55K41p1M8j85K6O8q7o6K53l59J75kK06j47k98L02
$$ -47 129 70 26 230 33 100 -198 -43 198 127 175 -10 16 84 -3 -69 184 -175 0 -2 204 57 -241 61
3999F1o6rK7M1j18J37J49m67J22K56j77J7J23l5j95J44N4m0p9j87j55O45L0o87
$$ 61 -5 -14 13 54 -64 73 222 -245 -123 133 -44 -27 96 61 -134 10 64 24 -55 -242 -397 248 278 -409
4023d09J62M8J31K69j3j85r2n3j8n9N9J44o2L31n83L96l13n0J05K39j40K56o5
$$ -409 -247 -199 -68 201 188 3 -89 -142 -160 -219 -160 -16 -78 253 -330 66 -247 -297 -192 47 -93 163 98
4046I8j79M9m7K77n1j71p3m5n5J45p7Q9j56K57j18j16J97m8n6K54p7j53O3J87
$$ 98 -81 -32 -79 198 147 -24 -97 -142 -197 -52 -129 -40 -196 61 -57 -173 24 -24 -80 174 97 -56 7 194
4070A94l35J1J7J91j59K07l14J89K91j88J49l53p8J46j41Q6k6L03m18j06L21M4
$$ 194 -141 -130 -113 78 -81 126 -188 1 292 104 253 -100 -178 -32 -173 -87 -113 190 -228 -334 -13 31
4092C1j01Q4R3k67J01Kl2Q4n5K82j64j57J4K27l02J40J82N4l95K16j09K07j52
$$ 31 -70 14 107 -160 -59 -57 -89 -5 -60 222 58 -99 -85 142 -160 -20 162 216 -179 37 -72 135 -17
4115a7O7j41m1k18K89P1p9J91k94K59k48j7J92o1n5o0o0J01k8j29K21O8J69j79
$$ -17 50 -91 -132 -350 -61 10 -69 122 -172 87 -161 -178 14 -47 -102 -162 -222 -121 -149 -278 -57 11 180 1
4139AJ2K8J84j62J17l8j28J65k99K86j42j70Q0J74l55K05l7Q1j01J52K9j48K30
$$ 1 13 41 225 63 180 142 14 179 -120 166 24 -146 -66 108 -247 -42 -79 2 -99 53 82 -66 164
4162A64j62O3K52l18J01k35M46k07j51l3J6l9j21L24j28K89l86J6J49L5l01K73
$$ 164 2 65 317 -1 100 -135 311 104 -47 -80 -64 -103 -224 100 -28 261 -125 -109 40 75 -226 47
4184D7k03K32j36j76J07K71j56J43k24L1k5JJ75l22K18k5J85j67l3l5QJ5J29M
$$ 47 -156 76 -60 -236 -129 142 -14 129 -95 -64 -89 -88 87 -235 -17 -42 143 -24 -57 -92 -84 -69 60 64
4208F4n2l1M8J3K8r9K78l36J99O2p8j41m8j21R0J90L8j91j14J41K8j45R6J6J08
$$ 64 12 -19 29 42 70 -29 249 -87 112 174 96 -45 -93 -214 -124 66 104 -87 -201 -60 -32 -177 -81 -65 43
4233D3j96K12j94Q4k5k0j49N1M01l08N0J3O7R8q1j63M0L6k24L31j01K60m18K10
$$ 43 -153 59 -135 -51 -76 -96 -245 -194 207 -101 -51 -38 29 127 46 -117 -77 -41 -265 66 -35 225 -193 17
4257A7j9Q9k46K14O9j57q4J39k13o0J76K4m3k08K40j44J26K25q0j5j31K9J00j0
$$ 17 -2 87 -159 55 124 -33 -117 22 -191 -251 -75 -51 -94 -302 -62 -206 -80 145 65 50 -81 -52 48 38
4281C8k39K31r7N8K69m15L16k24L6J92l1n8j36l4k8J99L0o1r3J46J14k57j02j26
$$ 38 -201 30 -67 -9 260 -155 161 -63 -27 165 134 76 -60 -94 -122 77 107 46 -47 99 213 -44 -146 -272
4305b72L74o9r8R0N8l2k0J08o1k6p6J77J8j97j25L69l23J32j40K60n1r3o7j84
$$ -272 102 33 -65 25 83 51 31 139 78 52 -24 153 171 -26 -151 218 -105 27 -113 147 96 3 -64 -248
4329b48J18q1Q7K50q0j22J49mQ7m2K88l58l4j68J38on8J31J04q9j89r1L4m3J94
$$ -248 -130 -211 -124 126 46 -76 73 69 156 114 402 44 10 -158 -20 -26 -84 47 151 62 -127 -218 -184 -227 -33
4354c3k0R0lj35J29Q6j11n6p0o8P8J98K51m16R0j05N8m4J24P7qk50R0NP5J26p7
$$ -33 -53 37 34 -101 28 114 3 -53 -123 -191 -113 85 336 -80 10 -95 -37 -81 43 120 112 -138 -48 -43 32 158 81
4381H1q3r5J38P3p1j21M8J12rJ69k98mK54l53J05K3J48j43J07R9j67k34J37K33
$$ 81 -2 -97 41 114 43 -78 -30 82 73 242 -56 -60 194 -159 -54 -31 117 -26 81 180 13 -221 -84 149
4405A49o4L2j75K89p1m75K75R0N1k0r7j44L21q4j22j64J58J16K16k87l9j0k48
$$ 149 85 117 -58 231 160 -315 -40 50 101 81 -16 -160 161 77 -45 -209 -51 65 281 -6 -45 -55 -303
4428c03J75N4J11J69j15j53K91j22r0q6L5n0J59j91Nq0J2L03k01J68r6m9j71n0
$$ -303 -128 -74 37 206 91 -62 229 107 17 -69 -34 -84 75 -116 -111 -191 -179 124 -77 91 -5 -54 -225 -275
4452b75L70j46K13j32j5K84j92k82K58K27m37M5j47M11P0k69j7j70J77K43j79
$$ -275 95 -51 162 30 15 299 107 -175 83 310 -127 -82 -229 182 252 -17 -34 -204 -27 216 37
4473C7K7J11r5m6O4j08jK68l72N4k23J40Q8j11J50R3k7l1K36k74J47j55o0J6J49
$$ 37 64 175 80 34 98 -10 -11 257 -115 -61 -284 -144 -56 -167 -17 76 49 18 254 -20 127 -28 -88 -72 77
4498G7O4r0j93n2K70j88J01J13k62k7K70q4j21J44Qj30j0P1l5M9Qj9K16k73K06
$$ 77 141 51 -142 -194 76 -112 -11 102 -160 -187 83 -1 -122 22 30 -100 -110 -39 -74 -25 -17 -36 180 -93 113
4523A13l15L62j56J32j87L8J06j14J36k6k13L18j08j72J52j59o4L76n5o8k42q1
$$ 113 -202 160 4 136 -51 -13 93 -21 115 89 -124 194 86 -86 66 -93 -157 219 164 96 -146 -227
4545b27J97lJ23j2m42K80K58l26O8L62j03j25L3k92K57j54K13N1nk87L74P9m85
$$ -227 -30 -33 90 78 -364 -84 174 -152 -84 278 175 50 83 -209 48 -106 107 158 153 -134 240 319 -166
4568a66J31q5j6J20o5J42j75K80k34K32j80Lr0j3J04J47k07K04j16N8M1j99K17
$$ -166 -35 -120 -136 -16 -81 61 -114 166 -68 164 -16 -13 -103 -116 -12 135 -72 132 16 74 115 -84 133
4591A33P5k46k34K89N8K22k89k38J91K04k40j4J92k56j09L62o7J85j82l9l02L69
$$ 133 208 -38 -272 17 75 297 8 -230 -39 165 -75 -89 103 -153 -262 100 33 218 36 -3 -305 64
4613F4J53j44j67j81K57Q8L0P9l71nK17p9J19k43J1L12P7j06k73K57o1o5O4j79
$$ 64 217 73 -94 -275 -18 70 100 179 -192 -197 20 -59 60 -183 -172 140 217 111 -162 95 34 -31 33 -146
4637a46L20j13J59l59M9K8J04j12o3L12O9n33L81r4K7q9K48j5r8P0j53R0j46K25
$$ -146 174 61 220 -139 -90 -62 42 -70 -133 179 248 -285 96 2 29 -60 188 173 75 145 -8 82 -64 161
4661A61N8l28Q7jj35N23k88pj19M9j06K65j71j8n2o7J84M4N9k06J15j30l2o1K33
$$ 161 219 -109 -22 -23 -158 365 77 70 -49 0 -106 159 -12 -30 -82 -149 35 79 138 -68 47 -83 -115 -176 57
4686E7n5j36L98j94k17M74l16k98M03j29K8J7L30k93r4M5m4J8Q0nj38p1n0K27
$$ 57 2 -134 264 70 -147 327 11 -287 116 -13 15 32 362 69 -25 20 -24 -6 74 69 -69 -140 -190 37
4710C7P3j85j52J64j7J57K94m61J20no1r4J51j82k49K56K54nj88P9J03m5%p4q9
$$ 37 110 -75 -227 -63 -80 77 371 -90 30 25 -36 -130 21 -161 -410 -154 100 95 -93 -14 89 44 44 -30 -119
4735a19K41k11l6J43j18J5K62j03k5k08K83k01o1J15L7j11J96p9k03O3Q2J94k54
$$ -119 122 -89 -125 18 -100 -85 177 74 49 -159 124 -77 -138 -23 14 -97 99 20 -183 -120 -38 156 -98
4758i8N9P9J71j06j35j87K63k50J60j24J33m3k00K70J07j76j7N3J10Q1N8L7M7
$$ -98 -39 40 211 105 -30 -217 46 -204 -44 -168 -35 -78 -278 -8 99 -77 -94 -41 69 150 208 245 292
4781B92l52M9j93K48l0J03l09J03rJ96j50k97K20K57M6k80M3J08k58J15K22j53
$$ 292 -60 -11 -204 44 14 117 -192 -89 -98 98 -52 -349 -129 128 174 -106 -63 45 -213 -98 124 -29
4803b9rQ8q9j29j54M51j08l35L18q9JK50k44K9M9j19K84j17J38k19q7l6K94k45
$$ -29 -38 50 -39 -168 -322 129 21 -314 4 -85 -84 166 -78 -49 0 -119 165 48 186 -33 -120 -156 138 -107
4827a07J69k03L35l57L87j21j06L71m91K59j66q2J09j45M1J98l7M6k60K23j14
$$ -107 62 -141 194 -163 224 103 -3 368 -123 136 -30 -112 -3 -148 -107 91 54 100 -160 63 -51
4848e1J18j5J17l25Q7J10l5k77j06J73J57L58J0m33K35m0j86n6K03O3n38N97o3
$$ -51 67 52 169 -156 -69 41 6 -271 -377 -204 -47 311 321 -112 123 83 -103 -159 44 107 -431 166 103
4871A03J11K2j88N5l8j24P8%j02J4J82n3j56M5J23Q8K3j29k5n0l1K1o0M2m6l3
$$ 103 214 236 48 103 65 -59 19 19 -83 -69 113 60 -96 -51 72 160 183 54 29 -21 -52 -31 -91 -49 -95 -128
4897a28K91j77m4J16j60O4n3j34J5K44r5J03J59k66K62k88J59K44k66R1r2n7K12
$$ -128 163 -14 -58 58 -102 -38 -91 -225 -210 34 -61 42 201 -65 197 -91 68 312 46 137 45 -12 200
4920B00p7k97K44j33K92k87K88j67J10j98O3j5M1j17k24K31M6n3n6K51j91J29
$$ 200 123 -174 70 -63 229 -58 230 63 173 -25 38 23 64 -53 -277 -46 0 -53 -109 142 -49 80
4942H0k14m4J28p9NJ63N5j3j5j07k12L81j01K03k28K66l29J65r5j17j00L66Q0
$$ 80 -134 -178 -50 -129 -124 39 94 81 66 -41 -253 128 27 230 2 268 -61 104 9 -108 -208 158 238
4965B38j66j17r0N3p3J37Q1J21r1k39K47j71K00Q8k26O0j71M6n9J40J51m01K60
$$ 238 72 -45 -135 -82 -155 -18 63 184 93 -146 101 -70 130 218 -8 52 -119 -73 -132 8 159 -242 18
4988A8L5k5J71j93J07k8j87J58j87K72Q2l36L18m50L70l0o16N40o1p4k7K33l8
$$ 18 53 28 199 6 113 85 -102 56 -131 141 223 -113 205 -245 125 95 -521 19 -42 -116 -143 90 52
5011E2j98jK94r3j67K22j00K18L5l83J54%n4K4L15k46R3j94N3p5K21k37K02l38
$$ 52 -146 -147 147 54 -113 109 9 227 262 -121 33 33 -21 3 318 72 165 -29 24 -51 170 -67 135 -203
5035b03L8J16l8J25k29L91k30R0j62l9L86k90j57L04lk45J04jJ7JK09m08K07J2
$$ -203 -165 -49 -87 38 -191 200 -30 60 -102 -141 245 -45 -202 102 99 -146 -42 -43 -26 -25 184 -224 -17 -5
5059ej9M6j33K45n9m6k08K09J82k18Q0k39K08l38j8N22k85P4K7N6k05p4M6mK59
$$ -5 -24 22 -111 134 75 29 -179 30 212 -6 74 -165 43 -295 -313 209 -76 -2 25 81 -124 -198 -152 -156 103
5084A03l12L59l01O0J63k5M3N8j67l08N51n30J68J89q9K02l33J3N7K42l73J28
$$ 103 -209 150 -151 -91 72 47 90 148 -19 -327 224 -306 -138 51 -38 164 -169 -156 -99 143 -230 -102
5106a02J7K21J11m07K08k03J56o9n3P1L6M2J45m58L24r0k03L27Q7j36J27j35K90
$$ -102 -85 136 247 -160 48 -155 1 -68 -121 -50 -14 28 173 -285 39 -51 -254 73 160 24 151 16 306
5129C06k83j14k05K69J23m5p0n4q5J45l8P3J7P0l10K9J17K38j83q1J7K4J26k75
$$ 306 23 -91 -296 -27 96 51 -19 -73 -158 -13 -51 22 39 109 -201 -172 -55 183 0 -81 -64 -40 86 -189
5153a89R6r4N2Q2Pm9J24J68k12q5J67k89M67k59J14kr0Q9m0P7l33L81j10k3j04
$$ -189 -93 -187 -135 -53 -46 -95 29 197 -15 -100 67 -222 245 -14 100 98 8 97 57 134 -199 182 72 49 -55
5178e5R1J42l24K35k02L75k64j10L20j27j76J35j65M0K18j13O9p5p3k9M9K67k79
$$ -55 36 178 -146 89 -113 262 -2 -112 208 81 -95 40 -125 -85 133 20 89 14 -59 -88 -39 228 -51
5201e1Mnm2K12l62J34k35N21k54O8j9l0j5J64j28M6j09K25k8j03j51J20n3J26
$$ -51 -47 -52 -94 118 -244 -110 -345 176 -78 -10 -29 -59 -74 90 -38 8 -101 124 96 -7 -158 -38 -91 35
5225C5m2k70L49J29nk94K72j90j3J46l6k81M60l10Q7j32J23N4j71J31k66J17Q2
$$ 35 -7 -277 72 201 196 -98 174 -16 -29 117 81 -200 260 -50 37 -95 28 82 -89 42 -224 -107 -25
5248b5Q2J2j05j27J04J36j61J33jL0lj84M3j1J00n5K13Q2k72L72l61j37L07j30
$$ -25 57 69 -36 -163 -59 77 -84 49 48 78 75 -109 -66 -77 23 -32 181 263 -9 363 2 -135 172 42
5272D2k26J27J32j05k77M02Pj38r2k7K12L7k44M0N5J3J05j88N2J37J35k20l4N9
$$ 42 -184 -57 75 -30 -307 95 102 -36 -128 -155 57 94 -150 -110 -55 -42 63 -125 -73 64 199 -21 -55 4
5296DL42k16p3o6j00R7l0K08j09l47L51j60K22l25K47n8J52n50O59k07J36j72
$$ 4 346 130 57 -9 -109 -12 -42 166 57 -290 61 -99 123 -202 45 -13 139 -411 248 41 177 5
5318EJ10j25j02K50K8j22n8j72k2K68k1N3l48J56j47K02k15M36j74J74l75J18
$$ 5 115 -10 -112 138 166 44 -14 -186 -208 60 39 92 -256 -100 -247 -45 -260 176 2 176 -199 -81
5340h1J00J08l7r3k5N8J40k65r4O4L1l7J48L5L5j02J31Q2l51k0K84k20j11M29
$$ -81 19 127 90 -3 -28 30 170 -95 -189 -125 -94 -131 17 52 87 -15 116 198 -153 -173 111 -109 -220 209
5364B09k91o8L24k01M6M37l91q2j38P4K92l23K50k08J68r6QO3k03q5R6K45r7j09
$$ 209 -82 -150 174 -27 19 456 65 -17 -155 -81 211 -112 138 -70 98 2 10 73 -130 -215 -119 126 29 -80
5388h0L39m37N3K10o5j6p3N0J15j70J95j84l9j20l1M32j15k03N8N7O0j93M2J47
$$ -80 259 -178 -125 85 20 4 -69 -19 96 -74 121 -63 -102 -222 -253 179 64 -139 -81 -24 36 -157 -115 32
5412C2J9j92J24k15L73o7l28J07j14K09N3J90L4j83j66qK71j78R0M7j05J44J88
$$ 32 51 -141 -17 -232 141 74 -254 -147 -261 -52 1 191 225 42 -124 -132 139 -39 51 98 -7 137 325
5435C25m47J6M5l27L23P1j40j23M82j96q8N0K1k84K73k86J77K42j29l4J10j79
$$ 325 -122 -106 -61 -388 -65 6 -134 -257 225 29 -59 -9 12 -272 1 -285 -108 134 5 -29 81 -98
5457i8K78n2J91l03j23J76k49M01l88K80l76K78o2j07J83j64j19J54o6P4k3R4
$$ -98 180 128 319 16 -107 69 -180 221 -167 113 -263 15 -47 -154 29 -135 -254 -100 -166 -92 -115 -21
5479b1l3j3P3j44J06K08l42L6K84n6o6J55l75O0qQ2J14P2J59k70Q8j99O0k29K30
$$ -21 -54 -67 6 -138 -32 176 -166 -130 154 98 32 187 -188 -128 -136 -54 60 132 291 21 109 -90 -30 -259 -29
5504b9k31J98R8J70j12j80J68j27Q4l0j8k44M0K54O3j06p3L8K50l71K54j91J83
$$ -29 -260 -62 36 206 94 -86 82 -45 39 9 -9 -253 -213 41 104 -2 -75 -37 213 -158 96 -95 88
5527H8J3k80J94j84L03j02n4K56k77K8J50m05J73K03p7q7J24o4K05j19j49R9J06
$$ 88 101 -179 15 -169 134 32 -22 234 -43 -15 135 -270 -97 106 29 -58 66 2 207 88 -61 38 144
5550A44k11j4K46k76l3K60k96J41J74j35J08j70L5l20N07k13QM3J33mk70J17j9
$$ 144 -67 -81 165 -111 -144 116 -180 -39 135 0 108 -62 -27 -347 160 -53 -45 -2 131 127 -143 -26 -45
5573d5K74l08N7J10j33j25J87J75L0k2k92L5J63M9L0R2l14O4j85J62jo6J52q6
$$ -45 229 -79 -22 88 -45 -170 17 192 222 200 -92 -57 106 155 185 277 -37 27 -158 4 3 -63 89 3
5597Cp7R4J04j55K7P1j69j50N29j89r9J89j34j4k1K14Lk81n7R4j31Q8M1L6R4P9
$$ 3 -74 20 124 -31 -4 67 -102 -252 277 88 -11 178 44 30 9 223 226 -55 -112 -18 -149 -61 -20 16 110 189
5623A89j74k29J32L48k71O2j59J06Q5l2j62r5J35J19k75K31o0J24j19Q5j93k9
$$ 189 15 -214 -82 266 -5 57 -102 4 89 57 -105 -200 -65 54 -221 10 -50 74 -45 40 -153 -182
5645a82J72j34J0n2L4r0J27J3J67P0j83J50j52p2K59p6j68J61M8j19N3lN5j42
$$ -182 -10 -144 -134 -186 -152 -242 -115 -102 65 135 -48 102 -50 -122 137 61 -107 54 102 -17 36 33 88 -54
5669e4O6J07R2l60J43k12M01j41P0j21r2J42L4J53n19L89L8l9L1l51K48r3j38
$$ -54 12 119 211 -149 -6 -218 183 42 112 -9 -101 41 75 228 -291 98 136 97 128 -223 25 -68 -206
5692b06J38M7N3J54j64j11L16k38k65K88J4Q5K1l46JL19j81J83l22J32pj97L20
$$ -206 -68 -21 32 186 22 -89 227 -11 -276 12 26 111 132 -214 -213 106 -75 108 -214 -82 -89 -286 34
5715C4j06K02l0j14r3M2R4J75j29J79n40M98j95J64k36k2J36J40l06K9q9L84k39
$$ 34 -72 130 100 -14 -107 -65 29 204 75 254 -286 212 17 181 -55 -77 59 199 -107 -78 -167 217 -22
5738b2P7m8o6J43j88J54k0j85L33q0l43L20j98J99Kj27J79p7l41N08j23k9l57
$$ -22 55 7 -59 84 -104 50 30 -155 178 98 -245 75 -123 76 78 -49 130 53 -288 220 97 68 -289
5761b89K73m4j1N1Q9n4L71l11k1k06%K51j33Q5j89m0K60j70l3N7K66j78k01P6
$$ -289 -16 -60 -71 -20 69 15 386 75 54 -152 -152 99 -34 51 -138 -178 82 -88 -121 -64 202 24 -177 -101
5785a01Rl4N5N4pMK62j38j50Oj9R9J32j12l57P8J19k12K18K24k99r0K56K10pm25
$$ -101 -92 -126 -71 -17 -24 -20 242 104 -46 -40 -59 40 172 60 -297 -219 -100 -312 -94 130 -169 -259 -3 207 200 -225
5811b25K74J7j4k20K38k58J14l4K28k12K97k61n7J69k45P6K36J4j65j32qK61N
$$ -225 49 66 52 -168 70 -188 -74 -108 120 -92 205 -56 -113 56 -189 -113 123 137 -28 -160 -168 93 98
5834I8p5j34j5L12j78J1j17J36j35J77K3j46K47l31L32m61K19M0j7J2K51m47L98
$$ 98 23 -111 -126 186 8 19 -98 38 -97 80 103 -43 204 -127 205 -256 -37 3 -14 -2 249 -198 200
5857B00j04k29P1J11L7J64l04J95k16P1j94K68k92M47j48q6l0m8K09l0O5j75J09
$$ 200 96 -133 -62 49 86 250 -54 141 -75 -4 -198 70 -222 225 77 -9 -39 -87 122 92 157 -18 91
5880I1k01K17O3J21m1k58j27K36j43L15k40r6K4M2K91l67K9J16j02L8q1O9O7k09
$$ 91 -110 107 170 291 250 -8 -135 101 -42 273 33 -63 -39 3 294 -73 -44 72 -30 8 -73 -4 63 -146
5904a46K61m5m09N07j57M4j63J32O4k73L7J78m0p1P1l6O1R8j49j39J95j26K95
$$ -146 115 70 -339 168 11 55 -108 24 88 -185 -148 30 -10 -81 -10 -46 15 113 -36 -175 20 -106 189
5927A89m91L56q0K49m14j02J89j42L38k78L75P3l28J34j23K10j31j13Q5m9K3j58
$$ 189 -302 54 -26 223 -191 -293 -104 -246 92 -186 189 262 -66 68 -55 155 24 -89 -4 -53 -30 -188
5949a88L92q0k43k7K71j11j03K4l11M24k07L27j8k62Q3K39j61k19K46J64O1n18
$$ -188 204 124 -119 -146 125 14 -89 -65 -376 48 -159 168 150 -112 -29 210 49 -170 76 240 301 -217
5971b17P6J02%j4J4J88l70nP9K4K49n5j97R0K29l29K07k51M44k79J23k20K66j58
$$ -217 -141 -39 -39 -53 -39 149 -221 -226 -147 -123 126 71 -126 -36 193 -136 71 -180 264 -15 108 -112 154 -4
5995dP9r1j26L79k14O3m4j47p9J04L7J42j82P5J30j60k31L05JJ68m00kK20no0
$$ -4 75 -16 -142 237 23 86 42 -105 -184 -80 -43 99 -83 -8 122 -38 -269 36 37 205 -195 -197 23 18 -42
6020d2J20r7r2J72K5j60L05k28j59K43J0j46r6L64j65j8J07j88j13J67m0J11j4
$$ -42 78 -19 -111 61 86 -74 231 3 -156 87 97 -49 -145 219 54 36 143 -45 -158 9 -31 80 66
6043F6k27P5K10k21O9o2J06L6n5J40j87p7K34m25L0M33l9j44j00L30k83R9jj9
$$ 66 -161 -86 124 -97 -28 -90 16 52 -3 137 -50 -127 107 -318 -288 145 106 -38 -138 192 -91 8 7 -12
6067a2m9K52q1M6l51K58j20J46j84L3q2O2MJ85j77l0j04K28J16r1k21L39m16L07
$$ -12 -61 191 110 156 -195 63 -57 89 -95 -62 -144 -82 -78 107 -70 -100 -204 24 140 49 -172 167 -249 58
6091E8j07or8J48L22n69P3J08k1K10Q7l47K59j33m1J74j4q7P3j91Q3j63J31j6
$$ 58 -49 -55 -153 -5 317 -252 -179 -71 -92 118 205 -142 117 -16 -57 117 103 16 89 -102 -19 -182 -51 -67
6115f7q5K48n0j30p3R4K8j54J31j10K99j71n1J56j77j59M25k4j30J59j29o2L3
$$ -67 -152 96 46 -84 -157 -63 -35 -189 -58 -168 131 -40 -91 65 -112 -271 154 130 0 159 30 -32 1
6138AR6R8k57j6J14o7J88j22J32n4k98Q7L27k83j87L60k60M09j93q8r6P7M00l85
$$ 1 97 195 -62 -78 36 -31 157 35 167 113 -185 -98 229 -54 -241 119 -141 268 75 -13 -109 -32 368 -17
6162a7r3K09k07M0k%J2Q4j1J7n6q9J24l3K18M9k9k70N3K6P3o1j59Q2k4J30j53
$$ -17 -110 99 -108 -68 -70 -70 -58 26 15 32 -24 -113 11 -22 196 245 216 -54 -1 25 98 37 -122 -40 -64 66 -87
6189h7R4M4k18L26n0j74K7r1L45l8j42k9p3n2m7J04j8J52j36M5l42K89j48K79
$$ -87 7 51 -167 159 109 -65 -38 -129 216 178 36 7 -66 -118 -165 -61 -79 73 -63 -18 -360 -71 -219 60
6213F0j52k37M83r5j53K4J51J34l22nJ20q2NJ91J03l45K43p9k57K08o0J62k92
$$ 60 -92 -329 154 59 -94 -70 81 215 -107 -112 8 -74 -69 122 225 -120 123 44 -213 -5 -65 97 -195
6236a95Q7J34l4J55j45Q5j09mj3q6J77o6k46J10J17j52J61J46p9J50j17K93n78
$$ -195 -108 26 -8 147 2 87 -22 -26 -39 -125 52 -14 -260 -150 -33 -185 -24 122 43 193 76 369 -209
$$ [...]
8191g3
##END NTUPLES=NMR FID
##END=
