##TITLE=1H_LR-758-R6-P-MeOH
 CDCl3+CCl4
 8 sc, 
 29.9.2023
##JCAMPDX= 6.0         $$ Bruker NMR JCAMP-DX V2.0
##DATA TYPE= NMR FID
##DATA CLASS= NTUPLES
##ORIGIN= UXNMR, Bruker Analytische Messtechnik GmbH
##OWNER= root
$$ XWIN-NMR		Version 3.5
$$ Fri Sep 29 14:41:41 2023 Russian Standard Time (UT+4h)  she@DPX200
##.OBSERVE FREQUENCY= 200.13135
##.OBSERVE NUCLEUS= ^1H
##.DELAY= (6, 6)
##.ACQUISITION MODE= SIMULTANEOUS
##.ACQUISITION SCHEME= undefined
##.AVERAGES= 8
##.DIGITISER RES= 18
##SPECTROMETER/DATA SYSTEM= spect
##.PULSE SEQUENCE= zg30
##.SOLVENT NAME= CDCl3
##.SHIFT REFERENCE= (INTERNAL, CDCl3, 0, 15.7039)
##AUDIT TRAIL= $$ (NUMBER, WHEN, WHO, WHERE, WHAT)
$$ ##TITLE= Audit trail, XWIN-NMR		Version 3.5
$$ ##JCAMPDX= 5.01
$$ ##ORIGIN= Bruker BioSpin GmbH
$$ ##OWNER= she
$$ F:/spectra/data/she/nmr/H-F/1/audita.txt
$$ ##AUDIT TRAIL=  $$ (NUMBER, WHEN, WHO, WHERE, WHAT)
(   1,<2023-09-29 14:40:04.17 +0400>,<she>,<DPX200>,
      <created by zg, POWCHK disabled, PULCHK disabled
       configuration hash MD5:
       00 E9 B6 7A A2 85 ED C7 34 08 36 98 17 FE 4E 26
       data hash MD5: 16K
       7C 41 20 D1 45 87 28 38 E2 A5 69 6E 98 ED A3 72>)
$$ ##END=
$$ 
$$ hash MD5
$$ B0 B6 E3 B2 BC 56 0C 04 8F 34 A4 05 CD C6 68 6C
##$RELAX= 
##$RELAX= 
##$RELAX= 
##$RELAX= 
##$RELAX= 
##$RELAX= 
$$ Bruker specific parameters
$$ --------------------------
##$DU= <F:/spectra>
##$EXPNO= 1
##$NAME= <H-F>
##$PROCNO= 1
##$TYPE= <nmr>
##$USER= <she>
##$AMP= (0..31)
100 100 100 100 100 100 100 100 100 100 100 100 100 100 100 100 100 100 
100 100 100 100 100 100 100 100 100 100 100 100 100 100 
##$AQSEQ= 0
##$AQ_mod= 1
##$AUNM= <au_zg>
##$AUTOPOS= <>
##$BF1= 200.13
##$BF2= 200.13
##$BF3= 200.13
##$BF4= 200.13
##$BF5= 200.13
##$BF6= 200.13
##$BF7= 200.13
##$BF8= 200.13
##$BYTORDA= 1
##$CFDGTYP= 0
##$CFRGTYP= 5
##$CHEMSTR= <none>
##$CNST= (0..31)
1 1 145 1 1 1 1 1 1 1 1 1 1 1 1 1 1 1 1 1 1 1 1 1 1 1 1 1 1 1 1 1 
##$CPDPRG= <>
##$CPDPRG1= <>
##$CPDPRG2= <>
##$CPDPRG3= <>
##$CPDPRG4= <mlev>
##$CPDPRG5= <mlev>
##$CPDPRG6= <mlev>
##$CPDPRG7= <mlev>
##$CPDPRG8= <mlev>
##$CPDPRGB= <>
##$CPDPRGT= <>
##$D= (0..31)
0 1.2 0 0 0 0 0 0 0 0.06 0 0.03 0 0 0 0 0.0002 0 0 0 0 0 0 0 0 0 0 0 0 
0 0 0 
##$DATE= 1695984003
##$DBL= (0..7)
120 120 120 120 120 120 120 120 
##$DBP= (0..7)
150 150 150 150 150 150 150 150 
##$DBP07= 0
##$DBPNAM0= <>
##$DBPNAM1= <>
##$DBPNAM2= <>
##$DBPNAM3= <>
##$DBPNAM4= <>
##$DBPNAM5= <>
##$DBPNAM6= <>
##$DBPNAM7= <>
##$DBPOAL= (0..7)
0.5 0.5 0.5 0.5 0.5 0.5 0.5 0.5 
##$DBPOFFS= (0..7)
0 0 0 0 0 0 0 0 
##$DE= 6
##$DECBNUC= <off>
##$DECIM= 32
##$DECNUC= <off>
##$DECSTAT= 4
##$DIGMOD= 1
##$DIGTYP= 9
##$DL= (0..7)
0 120 120 120 120 120 120 120 
##$DP= (0..7)
150 150 150 150 150 150 150 150 
##$DP07= 0
##$DPNAME0= <>
##$DPNAME1= <>
##$DPNAME2= <>
##$DPNAME3= <>
##$DPNAME4= <>
##$DPNAME5= <>
##$DPNAME6= <>
##$DPNAME7= <>
##$DPOAL= (0..7)
0.5 0.5 0.5 0.5 0.5 0.5 0.5 0.5 
##$DPOFFS= (0..7)
0 0 0 0 0 0 0 0 
##$DQDMODE= 0
##$DR= 18
##$DS= 0
$$ [...]
##$SUBNAM2= <"">
##$SUBNAM3= <"">
##$SUBNAM4= <"">
##$SUBNAM5= <"">
##$SUBNAM6= <"">
##$SUBNAM7= <"">
##$SUBNAM8= <"">
##$SUBNAM9= <"">
##$SW= 18.05172834244
##$SWIBOX= (0..15)
0 0 2 0 0 0 0 0 0 0 0 0 0 0 0 0 
##$SW_h= 3612.71676300578
##$TD= 16384
##$TD0= 1
##$TE= 0
##$TE2= 300
##$TE3= 300
##$TEG= 300
##$TL= (0..7)
0 120 120 120 120 120 120 120 
##$TP= (0..7)
150 150 150 150 150 150 150 150 
##$TP07= 0
##$TPNAME0= <>
##$TPNAME1= <>
##$TPNAME2= <>
##$TPNAME3= <>
##$TPNAME4= <>
##$TPNAME5= <>
##$TPNAME6= <>
##$TPNAME7= <>
##$TPOAL= (0..7)
0.5 0.5 0.5 0.5 0.5 0.5 0.5 0.5 
##$TPOFFS= (0..7)
0 0 0 0 0 0 0 0 
##$TUNHIN= 0
##$TUNHOUT= 0
##$TUNXOUT= 0
##$USERA1= <user>
##$USERA2= <user>
##$USERA3= <user>
##$USERA4= <user>
##$USERA5= <user>
##$V9= 5
##$VALIST= <valist>
##$VCLIST= <CCCCCCCCCCCCCCC>
##$VD= 0
##$VDLIST= <DDDDDDDDDDDDDDD>
##$VPLIST= <PPPPPPPPPPPPPPP>
##$VTLIST= <TTTTTTTTTTTTTTT>
##$WBST= 1024
##$WBSW= 4
##$XGAIN= (0..3)
0 0 0 0 
##$XL= 0
##$YL= 0
##$YMAX_a= 403017
##$YMIN_a= -554721
##$ZGOPTNS= <>
##$ZL1= 120
##$ZL2= 120
##$ZL3= 120
##$ZL4= 120
##$ABSF1= 10
##$ABSF2= 0
##$ABSG= 5
##$ABSL= 3
##$ALPHA= 0
##$AQORDER= 0
##$ASSFAC= 0
##$ASSFACI= 0
##$ASSFACX= 0
##$ASSWID= 0
##$AUNMP= <proc_1d>
##$AZFE= 0.1
##$AZFW= 0.1
##$BCFW= 1
##$BC_mod= 2
##$BYTORDP= 1
##$COROFFS= 0
##$CY= 11.3945322036743
##$DATMOD= 1
##$DC= 2
##$DFILT= <>
##$DTYPP= 0
##$F1P= 15.7292609196834
##$F2P= 12.9074282941183
##$FCOR= 0.5
##$FTSIZE= 0
##$FT_mod= 4
##$GAMMA= 1
##$GB= 0.15
##$INTBC= 1
##$INTSCL= 1
##$ISEN= 128
##$LB= 0.24
##$LEV0= 0
##$LPBIN= 0
##$MAXI= 10000
##$MC2= 0
##$MEAN= 0
##$ME_mod= 0
##$MI= 1.114404
##$NCOEF= 0
##$NC_proc= 0
##$NLEV= 6
##$NOISF1= 3.799351
##$NOISF2= 2.8
##$NSP= 1
##$NTH_PI= 0
##$NZP= 0
##$OFFSET= 15.70392
##$PC= 1
##$PHC0= -21709.3
##$PHC1= 10.85271
##$PH_mod= 1
##$PKNL= yes
##$PPARMOD= 0
##$PSCAL= 0
##$PSIGN= 0
##$REVERSE= no
##$SF= 200.130013532006
##$SI= 16384
##$SIGF1= 3
##$SIGF2= 2
##$SINO= 400
##$SIOLD= 16384
##$SREGLST= <1H.CDCl3>
##$SSB= 0
##$STSI= 0
##$STSR= 0
##$SW_p= 3612.71676300578
##$SYMM= 0
##$S_DEV= 0
##$TDeff= 0
##$TDoff= 0
##$TI= <>
##$TILT= no
##$TM1= 0
##$TM2= 0
##$TOPLEV= 0
##$USERP1= <user>
##$USERP2= <user>
##$USERP3= <user>
##$USERP4= <user>
##$USERP5= <user>
##$WDW= 1
##$XDIM= 8192
##$YMAX_p= 0
##$YMIN_p= 0
$$ End of Bruker specific parameters
$$ ---------------------------------
##NTUPLES= NMR FID
##VAR_NAME=  TIME,          FID/REAL,        FID/IMAG
##SYMBOL=    X,             R,               I
##VAR_TYPE=  INDEPENDENT,   DEPENDENT,       DEPENDENT
##VAR_FORM=  AFFN,          ASDF,            ASDF
##VAR_DIM=   8192,          8192,            8192
##UNITS=     SECONDS,       ARBITRARY UNITS, ARBITRARY UNITS
##FACTOR=    0.0002768,     1,               1
##FIRST=     0,             0,               0
##LAST=      2.2672688,     0,               0
##MIN=       0,             -554721,         0
##MAX=       2.2672688,     403017,          0
$$ Real data points
##PAGE= N=1
##DATA TABLE= (X++(R..R)), XYDATA
0@%%%%%%%%%%Mj0J4j6J6k4L2l3M1m8N6o9P9r1J06j22J41j60J81k06K33k63K96
33A57l33L71m13M59n09N63o22O89p60Q39r23J013j112J222j343J477j626J787
51I36j969K175k404K667k973L329l750M255m873N645o635P946r746J2340j6334
66i391K3047l5978O8021k58078k80145Q94801o98456K29798K39959p28299P47905
77A93184j40285l08951N27564l89642J76990J09077k71982L34998k44489k7966
87d1502J50131j84162J90397k03150p392J94770k10921J58788r9057j6081J89679
98A21500k63410J93675j1620j44503K43181k64766J59106J18300l32467L15142
108A34138j29053p9834K67703l53212J90104P0719k76219K88711j87398j0503
$$ y = [0, 0, 0, 0, 0, 0, 0, 0, 0, 0, 0, 4, -6, 8, -8, 8, -16, 16, -17, 24, -24, 32, -37, 42, -49, 57, -65, 76, -84, 97, -109, 124, -139, 157, -176, 195, -218, 241, -268, 295, -327, 362, -398, 441, -482, 531, -581, 641, -702, 775, -851, 936, -1033, 1142, -1262, 1405, -1568, 1761, -1989, 2266, -2607, 3038, -3597, 4349, -5397, 6943, -9391, 13656, -22322, 45699, -212379, -492524, 402277, -296179, -66381, 173578, -554721, 193184, 52899, -256052, 271512, -118130, 58860, 167937, -104045, 230953, -13536, -41502, 108629, -75533, 114864, -88286, -95678, 99092, -111829, 46959, -52098, -68179, 121500, -141910, 51765, 40145, -104358, 138823, -125943, 33163, 151463, -181004, 134138, 5085, -74749, 192954, -160258, 29846, 100565, -175654, 113057, -74341, -84844]
118h4844J93172k63251K16475l3390j34598K45344j84417P9799O1492j85666K15092
129A25208j16194o0485J28989j59219J19903m5673r3929J53347j19738O0078J2077
140D364r0695J62674j20238K0317R6822j42625J38703n6200n7450J56340j55527
151d3515O3424N0488j29251J36139r6573j9960J13675j56314P9301M597q3473
162h1462J21663j05533K5433Q6840j04686Q9477k1488k5919R6327r1466L5282
173B4468K4482o4973O1663o1687J332L5258p3544N5778k7463j5262N8863o3847
185d4932N3400P671m2709P4839n1639J5428L3353o9520O3825l1936l4130N9822
197C3472o8990L1996J0518n8916P1373l8758n689N0043n8835N1579l016l8752
$$ y = [-84844, 108328, -154923, 61552, 28162, -106436, 138908, -45509, 34290, 95782, -89884, 125208, 9014, -51471, 77518, -81701, 38202, -7471, -101400, 51947, -67791, -7713, 4364, -86331, 76343, -43895, -23578, 73244, -69381, 69322, 13122, -44328, 112012, -43515, 19909, 70397, -58854, 77285, -19288, -39248, 74427, -81887, -2586, 2011, -81462, 40201, -65332, -39899, 46941, -57745, 31732, 10244, -15675, 80652, -10814, 24468, 48950, -16023, 45640, -16047, -14715, 20543, -53001, 2777, -24686, -39948, 18915, -44932, 8468, 16139, -26570, 48269, -3370, 12058, 45411, -24109, 39716, 7780, -26350, 33472, -35518, -3522, 6996, -51920, 19453, -19305, -24994, 25049, -33786, 17793, 14777, -23975]
209b3975O2308m2928R180K5964m9278M4177j8890j8794L6987m2821K0970K661
221E561k9249L6162l1597N837K0678l1429L0669j6054j764L1315l4015K3626J972
234A1712j7560L2036l1450J0019J6082l4693K6355j6472p360K6324l8050J9789
246c268P372k5008L1342k1395M135K2325k8605K2350k162j2620K1579k0541Q896
259D400O141k1469J7198q540l788R189j6532J3874j269r331J3041q995Q125J864
273C908r370J4690o868N49M429r344J1253q266n025J0501j2019N449j439q808
287a0360J4911j0924m67R918r889J0158l380m955J3693j0198K026N497q106P473
301E397n255k677Q138p836J136J626k949N502n383M32M852m076K886k060O40K439
$$ y = [-23975, 38333, -4595, 4585, 30549, -18729, 25448, 6558, -12236, 24751, -18070, 2900, 5561, -23688, 12474, -19123, -13286, 7392, -24037, 6632, -9422, -11186, 20129, -13886, 9740, 11712, -5848, 26188, -5262, 4757, 20839, -13854, 12501, -3971, -11331, 14993, -23057, -3268, 4104, -20904, 10438, -10957, -6822, 15503, -13102, 9248, 7086, -5534, 16045, -4496, 4400, 10541, -10928, 6270, -2270, -6058, 3131, -13401, 473, -796, -10127, 2914, -6081, 2044, 3908, -5462, 9228, 2360, 2909, 7338, -2006, 9247, 981, -4044, 6457, -5562, -113, -1552, -10360, 4551, -6373, -6840, 3078, -6811, 3347, -33, -4988, 8705, -1493, 533, 6030, -2076, 5397, 142, -2535, 5603, -2233, -1097, 529, -2420, 3082, -2301, -1869, 2983, -1093, 1793, -267, 373, 2812]
317B812m945L030q64j465J224m701M336j62m456N328j916J003K346m144O434k61
333C599l569M812k930K505J23o647M974j792k826J518n095K459P89l806L790j306
349c402N03L576j119K761N07q61K862r66L70k156j956R35k260k91k798j479L127
366b647j587R38J757l06M234m42J537K693l355K129Rk407J069n307r25J761l774
383d623P30k599O37M223l396K817J165J68M046j629K039J128k159L423j857l68
399C745O54n086L454k213l858J908m558K111L43m279M814j764J573M888k922N120
415C930M38q99N551m159N3l5m831K541m878k777J988m921L603m04j691N466k102
432c127N151K108l381N730k800J214J797o927L902j220l475K946m979K516O9m963
$$ y = [2812, -2133, 897, 33, -1432, -208, -4909, -573, -735, -5191, 137, -1779, -776, 1570, -2574, 3860, 3599, 30, 4842, 1912, 4417, 4540, -2107, 2867, 1075, -1751, -233, -5328, -2869, -2080, -5886, -2096, -3402, -2899, 677, -442, 2319, 2826, 1965, 4827, 3861, 4231, 2075, 119, 1054, -1206, -1497, -4295, -5774, -2647, -4234, -3296, -1539, -1845, 2389, 1947, 3484, 6177, 2822, 4951, 4960, 2553, 3622, -1685, -2610, -849, -4623, -3893, -6492, -5855, -1632, -5028, -2211, -1046, -878, 3168, 1539, 3578, 4706, 2547, 5970, 4113, 3745, 4399, -687, 2767, 554, -3304, -1396, -5954, -3843, -3500, -7779, -2965, -4729, -3156, 1732, -1190, 3930, 4368, 3469, 9020, 4861, 4914, 4879, 48, 2589, -2289, -5066, -3078, -7999, -4396, -4800, -6491, -1025, -3127, 2024, 4132, 751, 6481, 3681, 4895, 6692, -235, 3667, 2447, -1028, 1918, -3061, -545, -476, -5439]
448e439N591m276k2K853o006O167j588k909P712l769M279K529k208P270l854m3
464F287L027o328J960n855l406K720q778K336o12k781Q369n137N057P202l952
479A09Q099k189N26N242r540M188k119o862N224r357K505K521r279R665k605j293
495e165P613p535R115L08p327J0329o080J913K962r980J0242l634n176O214p897
510d098N716k217q654R471o755Q6L771o855J0214k816q61J0888o334O986J022
525I564m943J0634j0560j510M051j0472L984q210l789Q178j0892M888K478l184
539i783J1910p051M840R431q111Q563k984k367Q485j2269L075J433q572O498p797
554d699O55N243r841P397k336k748P519q366O621K634p949J0468l802Q08N869
$$ y = [-5439, 152, -4124, -4146, -1293, -7299, -1132, -2720, -5629, 2083, -1686, 2593, 5122, 2914, 10184, 6330, 6287, 9314, 2986, 4946, -909, -4315, -1595, -10373, -8037, -8649, -11430, -3061, -8198, -3141, 4061, 109, 8208, 6019, 6545, 11787, 2247, 6435, 4316, -2546, 2678, -6679, -4174, -1653, -10932, -1267, -3872, -5165, 2448, -5087, 4028, 4336, -2991, 7338, 1258, 3171, 6133, -3847, 6395, 2761, -2415, 3799, -4098, 1618, -599, -9253, 218, -6537, -6451, -2680, -9535, 679, -2137, -2998, 7890, 1556, 8542, 9564, 4621, 15255, 4695, 3185, 7236, -3236, 748, -7462, -11251, -3073, -13965, -9077, -6599, -9783, 2127, -4924, -84, 9347, 1236, 9799, 6815, 4448, 12933, 664, 3739, 5172, -3400, 3098, -4699, -4044, 1199, -8642, -1245, -3581, -6329, 1190, -7176, -555, 2079, -5870, 4598, 796, 1604, 7473]
569G473q645Q563j350n648N341q314L617j381q917P497n674M93N523p140J0308
584A746l67k698J1931o998L890K659q538P448p176m725M050r250L850l161l410
599a0749Q368o651N044M236m193R748m753J004Q089r292N430j605m595Q281r897
614a535J702M352q730O717m889k268O405r696M805M20n966Q074n725K929O982
629C577p841Q606R00k641P738p816L712J639r062M985n574k013K419q142N972
644c541p48l011O811l299M960K846n245Q267k805j538L812p483M810k744m993
659c901N027n785K185J174n433P793l750r53O613n872M879M82m231Q218n217J47
675A376M799o081M375k416l865N323o318K99J280m144L868l625j04M586l531M143
$$ y = [7473, -1172, 7391, 6041, 393, 5734, -2580, 1037, -344, -9261, -1764, -7438, -6945, -1422, -8562, 1746, 1379, -1319, 10612, 3614, 7504, 10163, 1625, 9073, 1897, -2828, 1222, -8028, -4178, -7339, -10749, -2381, -9032, -3988, 248, -3945, 5803, 1050, 2054, 10143, 851, 6281, 4676, 81, 8362, -1535, 167, 4519, -4211, 2506, -2383, -4651, 1754, -7942, -3137, -2717, -8683, -609, -6334, -3405, 3577, -4264, 4342, 5242, 2601, 10339, 2523, 6235, 7874, -1188, 3797, -1777, -3790, -1371, -9513, -3541, -4289, -7300, -489, -3788, 1172, 4018, -1227, 7040, 4235, 2697, 6509, -974, 3836, 1092, -3901, 1126, -4659, -2474, -1300, -6733, 1060, -2690, -3643, 2970, -2902, 1977, 2459, -1772, 6446, 1229, 1376, 6175, 94, 4469, 2053, -1812, 3511, -2807, -2508, -1228, -5372, -1504, -5129, -5233, -647, -4178, -35]
691c5K25m69N503l883K598J797m010L256l804m85J823o460L272p31l367M045l889
708d614K475K380l940M440l82l35L326m071K813P96l402K855k608M06J130m082
724b813L132j068j454K874l274K332M55k426M068j802R8J760k073K428j419p86
740C2K333k997J376p77j669K645l015N45J204k245K850j704j39K851k688K453
756A055J65j572L359k533K26J578l101K634j273j551K512l156J365M65k464K630
772C39j495j40J815j713J540K96j511K288j672M73O37j828J965j391l82J227j709
789a261J608j89p15J991j626R61O49j460J249r18k85P71j547N71o30l93J124j508
807a608K48J154j178J656n07k39J703j554J144J17q81J335q52j91R86j704O08
$$ y = [-35, 190, -279, 5224, 1341, 3939, 5736, 1726, 4982, 1178, 693, 2516, -3944, -672, -1403, -4770, -725, -4614, -2139, 241, -3699, 741, 359, 24, 3350, -721, 2092, 2888, -514, 2341, -267, 139, 1269, -2813, 319, -749, -2203, 671, -2603, -271, 184, -2242, 1826, 24, 122, 1882, -191, 2237, 818, 32, 2365, -632, 744, -33, -1702, 943, -2072, -1527, -323, -2568, 282, -1422, -1561, 1290, -1398, 1055, 1220, -352, 3007, 474, 700, 2278, -823, 1811, 538, -1013, 1499, -1657, -292, 173, -2291, 339, -1156, -1296, 519, -1194, 346, 642, -869, 1419, -253, 220, 857, -971, 994, -397, -779, 448, -1261, 347, 158, -557, 1434, -192, 769, 1418, -42, 1207, 289, 4, 775, -772, -201, -831, -1224, -100, -1608, -1360, -206, -1384, 272, -235, -474, 1229, -325, 819, 936, 55, 1390, 538, 347, 1333, -371, 237]
824B37k43n36J030j490k2O35r92J476o94j10J382j019Q33K29n82P42o57N30j1
843G38j000N76o70l47M10j099O78K91n12O89k09P16N18n15J405m51J74K67j008
862F51Q10j011j090O34j335J44j66j244J337o55l38J904m31J186O48j97J969l95
880B421k16K77r61M49r53j764J11j031n94L51q34R63M2K53J156K02R38J78L14
899A302J028l58m27l52j75o7j085Q0k33n72M3m37K79nr03J068K58k00N51l95J177
920E77R39q45R61O5j93P78j462J94k60j656K53j045m85j64m95R94J3J93J553O10
940E25Q73P62j55Q22l71n21l41p56j55j249p38M4j50l23l89M95O21j16O93M67
960C8J98Q95q50N14O12p54L49J1M6J97j105K67l8j250J40o39l97J69q96P39M96
$$ y = [237, -6, -542, 488, -1002, -1024, -389, -1381, 95, -599, -709, 673, -346, 487, 716, 134, 876, 219, 749, 738, -262, 314, -356, -703, -293, -1392, -714, -423, -935, -246, -455, 261, 779, 264, 1669, 1218, 1392, 1659, 651, 1461, 450, -640, -6, -1341, -1197, -1363, -2607, -1270, -1925, -2263, -359, -790, 396, 1044, 847, 2816, 2421, 2205, 2482, 1521, 1970, 1017, -747, -636, -1667, -2261, -1910, -2744, -1781, -1739, -1486, -330, -128, 810, 988, 1302, 2330, 1972, 1545, 1193, 1018, 951, -134, -54, -287, -859, -816, -1253, -974, -979, -1882, -814, -556, -756, -205, -600, 577, 1516, 671, 1632, 1697, 1504, 2282, 820, 1014, 754, -902, -649, -1694, -2179, -2343, -2838, -1844, -1831, -1638, -85, 525, 1398, 2160, 2005, 2827, 2456, 1935, 1594, 838, 683, -566, -1304, -1260, -1410, -1733, -2122, -1627, -1006, -1122, -429, 38, 236, 1131, 281, 795, 1407, 653, 1002, 1013, 1059, 1256, 151, 418, 380, -870, -730, -1369, -1766, -1597, -2493, -1754, -1258]
981a258L3J409N72R65R76n54P30J67q70p17j437Q3j279j331J2j053M27M90N8K088
1001d89M00N71J489L5R57l47k37Q6j296o27m07q89M04j174k50J108p12N44k75
1020a109K13Q69p24L50L31j56M57J1L37O36m63N24K31m50O59j248j99j06j412
1039a249J09m49l36K81k11P94O43L86Q64K04P37K61p40L95l79q80o81p61J6k85
1059a281q66L87K62L62J76O66O05K65K74K28n5j13j98J43O1o12Kn3K5l13l03J29
1081b09m40m06m71K3J21L82m08J47J136M60L43L37O11M64K31m90j14n93n88m42
1101I4j014n00l83j38J07m5L08R94M2P07K06K69J032l28m87L93p26L74r98l46
1121d39M56m38p8o34O8O63J50L2K2R5M28o4r1N67o83P70k60k61N31r92L46j32
$$ y = [-1258, -1225, 184, 756, 1721, 2697, 2143, 2873, 3040, 2170, 1453, 16, 99, -1180, -2511, -2499, -3552, -3125, -2635, -2577, -489, -89, 482, 1971, 2006, 2963, 2616, 2379, 2465, 1169, 542, 135, -754, -350, -1524, -1774, -666, -1378, -834, -1109, -896, -27, -751, -401, -70, -226, 231, 242, 579, 1215, 752, 1276, 1507, 1057, 1716, 468, 269, 163, -1249, -1140, -1589, -1925, -1644, -1855, -1061, -418, -32, 832, 1036, 1773, 2034, 1294, 1689, 1310, 430, -251, -1012, -996, -1281, -2147, -1760, -1498, -1136, -960, -294, 311, 576, 850, 1078, 1023, 910, 712, 855, 916, 304, 306, 253, 278, -35, -338, -209, -649, -1055, -1526, -1503, -1382, -1000, -1408, -1261, -125, 335, 678, 1015, 1626, 2090, 2321, 1831, 1717, 1124, 536, 94, -920, -1420, -1803, -1941, -1834, -1879, -1571, -577, -535, 172, 378, 647, 1679, 1351, 864, 1257, 531, 905, -93, -439, 17, -421, -499, -1133, -1065, -402, -252, -220, -198, -103, 325, 261, 170, 737, 54, 824, 564, 303, 834, -158, 188, 56]
1143E6n51K15n32k05K93q50J111mj73P84n85J205P57q84O04l1j31N92j706K86
1163B51k38m62P7j324N99L51q16Q25k91P77P37o18P11q9l7Q99r97K59J33p76M15
1184C86n40L8M92r05O51o48j1O91j134J062n85J57R52p52K80J41l93R28n78l22
1204i0M67q12N53Q7q17N67m52P1Q98j235P50L78o18M33l26O25L05r65O94K8m58
1225H3L50m84PJ1m13J69l93M84n0m74N70k61K96K41k75N82n6j93N28m42L6j25
1247A91j60K55l76q9K93o30N93k51n6O19m37L35n2k76L55k44k01J98j30M3m41
1268d61n2P16l93j60L89r6M41P7m59K81k02J79R8n62N67l09j8k81J50J30l55O1
1290b59lm7K28Q8l86K43k8K93L32m50L42l81J46K32l56J62J7j29N9j47l40M55
$$ y = [56, -495, -280, -812, -1017, -724, -1574, -463, -467, -640, 144, -441, 764, 1521, 637, 1241, 1210, 1079, 1671, -35, 251, 13, -449, -372, -1696, -1097, -746, -1562, -737, -1028, -251, 486, -132, 579, 490, 453, 1352, 355, 614, 747, -29, 386, -154, -116, 376, -529, 122, -526, -537, 154, -980, 82, -503, -346, 606, -146, 134, 275, -118, 810, 232, -90, 377, -435, 118, 205, -612, -45, -497, -426, 472, -763, -13, 365, -253, 180, -146, 479, 784, -181, 513, 541, 83, 433, -51, -44, -33, -446, -277, -670, -186, -236, -710, -140, -401, -105, 136, -139, 443, 387, 194, 722, 280, 316, 191, 31, 286, -90, -179, 114, -516, 77, -174, -230, 389, -48, 287, 235, -41, 314, 70, -131, 67, -63, -20, -461, -513, 203, -190, -350, 39, -57, 384, 461, 2, 283, 81, 260, 358, -204, 363, 54, 36, -245, -95, 35, -320, -259, -262, -309, -81, 7, -379, -136, -164, 129, 461, 11, 353, -28, 118, 350, -6, 156, 173, 44, 103, -44, -384, 71]
1312G1j86k09J97r1J38J69J25j60p5M25l72J32q0q3q6nj18J2Nj5P2j47N69j30
1336A58k29K10K75j35J77k9j8O1l64K00l17j78M1l67J49r2j31m1J00K67J29k03
1358c37N82R2P6j3J28j6q4J71j44j05k48j64J22p2j73j38p9j72L32j53j89K92
1380b92mQ5O65p8m3K24j67N18m28m10K83n72o6Q5m48J9j71L94K67k41M70L36P5
1403E01L56k56k93M24k62q2k96k00m6m45j32L9J03J88Q8p4N04m12M24j43K76k6
1425B36qk6L58p3o1q6q3k3l22O2j67N7m30j96J67J20k80N45o1J62M60K7L32M06
1449A116n76L43k31j8l83l69j47m92Kj11L2m1K37J73M26K84K88k2K3K36l99L2
1471D03o2l86M60m80j54J03l56K53J76k81lJ07J25nm2L37j37L3N41l85M01R9k13
$$ y = [71, -115, -324, -127, -218, -80, 89, 214, 54, -21, 404, 32, 164, 84, 1, -85, -90, -208, -196, -191, -206, -134, -281, 288, 158, -71, 139, 414, 279, 456, 427, 409, 470, 106, 306, -11, -189, -148, -515, -366, -458, -589, -630, -530, -263, -134, -337, 245, 337, 413, 400, 528, 512, 428, 599, 455, 350, 102, -62, 60, -12, -185, -323, -402, -574, -242, -395, -584, -292, -296, -211, 454, 376, 333, 557, 390, 908, 480, 70, 353, -219, -285, -200, -648, -629, -800, -406, -139, -380, 90, 426, 501, 857, 601, 308, 732, 470, 388, 92, -108, -154, -599, -731, -692, -589, -401, -313, -387, 117, -295, 129, -14, 262, 236, 228, 202, 560, 487, 426, 340, 257, 234, -88, -26, -193, -136, -566, -762, -595, -475, -755, -210, -271, -109, 351, 378, 710, 1116, 540, 883, 652, 634, 251, -118, -265, -757, -755, -866, -834, -875, -638, -465, -39, 245, 533, 511, 534, 770, 371, 403, 341, -45, 415, -65, -219, -116, -472, -219, -43, -324, -327, -220, -95, -100, -142, 195, 58, 91, 632, 247, 648, 747, 534]
1494E34J99k22l86J06m35j77j79k63J85k55J30M49m9J69L21l0N88R1k12J77l66
1515C75j62j80j47J98n97J75m05J35J17Q4K41J15K33J0K4j70N69n66K33k04q5
1536gL33j15j87m2j21J04q2p6J33l42R6J61j60J41R4K81l8K48L23J12k68n2k03
1559C33j4L5n79m0j38J52l82m55M46k8J90M65n8M43j39j0O40j48k43J14q6j02
1581C96j45k72j3j96o9K67l53L08j91j1R6p6J98M16l61P9P7P0k15J34M30m00p3
1604I6mm09L81j42j07N3p9J8n6L74J05j55OK63l23L87j57j1J78n02m5J1j20j19
1628c57J2k06L30l19J71L34o5M4K79M5l9J48j42J53l75L98l96j92K03p6j17p3
1650b40J56l0j0l2k45j2M75J27k90P1J96l1Q0n1Mj06k6K80o16N02k28j78M00k66
$$ y = [534, 733, 511, 125, 231, -204, -381, -560, -823, -638, -893, -763, -314, -363, -194, 127, 97, 685, 776, 564, 741, 375, 213, 33, -114, 84, -513, -338, -743, -608, -491, -407, -166, -51, 182, 192, 216, 46, 615, 49, 282, 78, -7, 326, 211, 24, -18, -139, -35, -117, -193, -60, -402, -306, -145, -305, -164, -70, 211, 173, 421, 744, 856, 588, 536, 333, 319, 354, -225, -265, -403, -251, -633, -1088, -642, -670, -480, -15, -73, 370, 231, 221, 861, 713, 470, 584, 498, 396, 251, -21, -34, -230, -299, -32, -385, -77, -268, -279, -183, -259, -61, 355, -6, 73, 150, 220, 5, 139, 569, 169, 96, 92, -317, 64, -78, -185, -132, -211, -193, -249, 125, 230, 75, 81, 344, 21, 408, 251, 240, 418, -84, -129, -118, -238, -357, -345, -551, -221, -540, -369, -35, -100, -56, 223, 268, 229, 377, 235, 388, 13, 411, 15, -177, 26, -50, -167, -240, -84, -114, -124, -156, -401, -413, 62, 189, -101, -30, 166, 135, 215, 164, 168, 62, 36, 316, -300, 202, -26, -204, 196, -70]
1674g0L8K21j10q1j7j20K12l27L98k27J12J58k31N9R8j58P2N1l02J12M7j44K3
1697a86Q8K10l18M18l6J21J5m8J6l0l52L11l50j13M89p76K83M53n32L99l39J80
1719i7J77k26K84l34J03J74P7J32k3m50K49j89OK40k81L70l53j65L42l69K05k2
1741a50K4L32j83L2o5l28M82Q4k84K77k08j41K00j59l0J23j85P2k2m3J88L51j59
1764B08k1J38j49k36L34k85J59j0j94j25j21J59K15l41K25M1l2M77m21R7j12O4
1786G0J8l10J97k35L73k1p7j63L45k82K40P6k70L35k61J32r2j13L30J74l21j53
1808hk52j51L72j41n7j26K87r2j22J77O4J9J69k8K31k89P5K49k45J53j41k24o3
1831a43J98j06J8m54L32p8k33K28M6J48J44MP1k20J56j04R5n8M82o13M89l77M3
$$ y = [-70, -32, 189, 79, -2, -19, -139, 73, -254, 144, -83, 29, 187, -44, 15, 113, -45, 27, 78, -224, -112, -65, -209, -186, -98, 112, -206, 212, 176, 297, 312, 264, 280, 250, -102, 209, -141, -254, 235, -541, -258, 195, -337, 62, -277, -97, 80, -146, 138, -196, -93, 81, 158, 290, 267, -183, 66, -123, -117, 123, -158, 212, -141, -306, 36, -333, -128, -150, -126, 206, 23, 55, -10, -338, 144, 228, -56, 221, 13, -128, 72, -87, -117, 6, -179, -107, -129, -172, 16, 367, 208, 187, 325, 176, -60, 274, -11, 148, 138, -56, -181, -302, -143, 72, -269, -44, -3, -35, 442, 21, 118, 6, 70, 88, -222, -25, -260, 113, 92, 15, -148, 197, -85, 155, 231, -39, 296, 35, 167, 75, -38, 292, 466, 145, -8, -260, -411, -39, -180, -237, -363, -76, -168, -290, -113, -49, -30, 139, 111, 342, 53, 128, 377, 132, 285, 144, -80, -143, 55, -51, -33, -487, -155, -233, -466, -238, -192, -44, 100, 104, 175, -45, 111, 7, 102, 44, 526, -87, 402, 25, 68]
1854F8o5k08K67K9k84L50k88J45J27l4P5n1J05l17K29J65k17l15K22k48J24lN0
1877g4J56n4Q2J23p9j40n2P4K69j00o1J02k92L21k2o7no4k45N4m2j66J13l89K98
1902b60p3J77K02K00l26J75J57K14pl35NK67l70j40K08k57j13L06j18o2j62K71
1924d1J57j50K14J04m03K6M41j75j44j08K06P6j66K7m70K81K0K16k66l2L42k72
1946a17J35k3J68J7J32l92J09N8j08K71j99Q6r4J8o5Ml86K37N1nJ82l08J79Q0
1970C0O8L1J37j7k79K44J5k7J00k79K7j51K1l41K90OJ58Nj80Q9Q2L7K43l04P3
1995G8r9k2J58j45J17J66k78K52l64OP5%o3k21J16K17k7l21K54J95J76nj01r5
2019F9J33n7j05m7l69N57l81P6k52K20l6j22RK12K51j99L73j83M5J73j62r7J85
$$ y = [68, 3, -205, 62, 91, -193, 157, -131, 14, 141, 107, 182, 131, 236, -81, 148, 313, 96, -219, 3, -245, -121, -124, -74, 82, 28, 110, 233, 154, 14, -38, 36, 305, 205, 144, 246, -46, 275, 253, 186, 181, 117, -128, -74, -116, -282, -169, -558, -260, -333, -156, 46, 246, -80, 95, 252, 466, 459, 124, 129, 396, 26, -114, 94, -163, -276, 30, -88, -150, -312, -41, 116, -34, 180, 284, -119, -93, 348, 173, 29, -79, 127, 203, 37, 64, -406, -125, -105, 111, -155, -187, 155, -117, 18, -5, 163, 180, 312, -80, 29, 87, -21, 250, 51, 137, 43, 61, -4, 0, -386, -149, -98, -103, 79, -229, -50, 30, 98, 129, 266, 249, -30, 214, 229, 202, 302, 23, 50, -101, -80, -421, -131, -125, 33, 38, -142, -53, 29, 66, 309, 5, 78, -21, -43, 115, -30, 87, 253, -25, 227, -137, -131, -56, -56, -119, -340, -224, -7, -34, -355, -101, 94, 270, 265, 164, 69, 202, 145, 40, -7, -376, 181, -200, -124, -376, -156, -192, -314, -305, -93, 158, -41, 332, 149, 194, 367, 205, 108, 293]
2042B93k58J12j02j29j71K58L6k17n9J12J35j16O5l0j10K16j93KP92l96j22J14
2064B32k2j71J08k20j09L69j93j55P6r9K84M0k71K44lJ03O8m32K18K3j01R6N1
2087A36Ol17J58p9R7n9J77r1j16Q9K77j84j8j48N07l39r0K9r7J22k66K09j02j89
2111b88J35j89J77O5J63j71j13M3L7K84L6j25o8O6r0J29k77J54J11m3L7J52k80
2134e5l2lk28R9J03K35j10J6j24K08Mj75k2K62j07J57l55J13k0K16j61QK1k85
2158b35M09j21j61J8J75L9J44k51N7O2k07M0J90m33K58k62J64K39j35O8m9K98
2180C07j82m0j24P8N6J6R2j3j24k33K48j55J97j17P0J39l84K43j91K14R7j5k10
2203c1J19Q8j04o2qQ6o5n5j20K10j63K41p3m6q3P5p8qO4J17j62k04K73o6K85j28
$$ y = [293, 35, 147, 45, -84, -255, 3, 39, -178, -237, -125, 10, -106, -41, -71, -181, 35, -158, -156, 636, 240, 118, 232, 210, 39, 147, -73, -182, 187, -6, -161, -85, -184, 100, 140, -131, 113, 110, 213, 281, -151, 67, 90, -11, 85, 136, 142, -175, -17, -96, 1, -58, 119, 28, -88, 1, 278, 94, 76, -72, 435, 96, 6, 35, -62, 60, -206, 3, -99, -288, -153, -342, -165, -100, 63, -108, -221, -178, -141, 143, 179, 54, -14, 52, -38, 91, -186, -32, 79, 36, 73, 225, -55, -87, -90, -318, -219, -116, 119, 9, 25, -99, 109, 113, -62, -84, 178, 71, 228, -127, -14, -34, 182, 21, 29, 50, -235, 174, 53, -108, -90, 85, 124, 268, 17, 74, 136, -71, -31, 159, -274, -16, -278, -114, 125, -10, 58, 9, 307, 125, 85, -39, 39, 95, 111, 203, 190, 66, -167, 81, -74, 123, 6, 76, 215, -169, 74, -117, 97, 194, 179, -31, 88, 176, 72, 10, 2, 88, 23, -32, -152, 58, -105, 136, 63, 17, -66, 9, -69, -77, -13, 104, -58, -262, 11, -55, 230, 102]
2229A02j61j04m9K73j81J88j59J01k1J0k16M61k30j77L90j53q8j4J25o4J68k46
2251d5j62J47K07j47J3ok2Q1k0j36K33l5J21k43j23K91j47K03k41J26j27J58j34
2274hJ20k05J09J36k49j97M04k6l62K52M1J08j77P6R8J9l01L52j67k00O0J76j14
2297e5k33K35o4q6K25K5l0N4k95R3J96j5k30K20J35Pj7j22k16Q8m0K6J08J26M
2322A39o3J3j88M7k2J61P8k38L4N8J30j41J27k49J80l02M65o1j65j7QJ52o2l36
2346b52M50k63p8J51K25k98K9P1M6j32J03m0k8J54l62K55r6R2N6k86L72k07OJ76
2370A44k14P3O0R6J33k03q3K01k20K84m30O3p0J5N7l3k04L35K17Qk84Q8K36k64
2394Ep5L0L3j23M5J51N5L6n4O1k26M5r6J81j72J3P6K9p4l4K70l10M28j35j01Q7
$$ y = [102, -59, -163, -212, 61, -120, 68, -91, 10, -11, -1, -217, 244, 14, -163, 227, 74, -14, -28, 97, 33, 201, -45, -207, -60, 147, 0, 13, 7, -15, 66, 46, -90, 143, 108, 229, -14, -137, 154, 7, 210, -31, 95, -32, 126, -8, 112, -93, 16, 152, -97, -294, 110, 84, -278, -26, 15, 123, -54, 22, 120, 139, -162, 190, 23, -177, -117, 59, -55, -288, -53, -117, -203, 22, 47, 17, 71, -224, -131, 65, 50, -180, 40, 175, 182, 165, 43, -173, -85, -125, -99, 9, 135, 139, 76, 89, -99, -52, -74, 87, 165, -73, -39, 19, 149, 8, 135, -114, 66, -236, 229, 168, 3, -14, -6, 146, 84, -252, 198, -65, -143, 8, 233, -65, -36, 35, 81, -51, 52, 12, -16, 138, -224, 31, -65, 27, 83, -203, 169, -38, -32, 144, -70, 3, 63, 159, 292, 89, 6, 207, -13, 271, -159, -96, -166, -151, -94, -127, -331, 4, 221, 229, -55, 33, 269, 5, -70, -40, -7, -130, -85, 66, 121, 157, 103, 164, -62, -17, -113, 68, -104, -91, -15, 14, -60, -94, 176, -134, 294, 159, 58, 145]
2420A45k19j7J51J7j69M9o9Q4j43J89R1k09n7M3K07J48Pl13L19k51L2j20P3q3
2444i5K5j3M6N2k8R8J20l7m13N10j21k6j82O2L4P7j67k16N89j60k26KL2J45j70
2469f2No2J11J14j94K00k47N5P4K98k67J35k17M2Nj13K4K39N3k30L5j61K05k45
2493b03Q4j11K74k7j52K91k95J23J90j56j21J29J54j37O7j28q6L78l57J63r3j31
2515a44P7j51O3K05k40N44k44K76n58K16P7l5j32k7k9o3K50N5j99K52k40j87M07
2538A73n3jj31J20l7j89Q3J37J8j60J40j36j12L88m46N12k50PL07n45L95l87J04
2561f3J74n8j17J41j18o2l2J76r5k32J61J19q6J12o7k01K68m4J31j5jr6m3N2K07
2586B11k26K8J32j13k2J07k22Q3m5j62K19K5m1rj2J3L10m36j15M13k56j86L64
$$ y = [145, -74, -91, 60, 77, -92, -43, -112, -28, -171, 18, 109, -100, -157, -114, 93, 241, 248, -65, 254, 3, 35, -85, -12, -95, -70, -83, -37, 15, -13, 85, 205, 168, -245, 265, 144, 118, -64, -2, 32, 109, -58, -274, 315, 155, -71, -69, -37, 108, -62, -57, -119, -8, 106, -88, 112, -135, -80, -6, 292, 25, 160, -57, -15, -10, -123, -99, 140, 193, -37, -2, -163, 42, -203, -119, -230, 44, 17, -135, 156, -139, -16, 174, 18, -103, 26, 180, 43, 110, -18, -104, 274, -83, 80, -13, -144, -67, -218, -155, 50, -190, 354, 110, 386, -172, 44, 121, 86, -46, -73, -102, -165, 85, 140, -59, 193, -47, -234, 173, 120, 119, -12, 108, 71, -118, -35, 102, 120, -40, 100, -36, -148, 240, -206, 306, 56, 63, 370, -175, 220, -167, -63, 111, 53, -64, 77, -41, -103, -135, 41, -54, -286, -125, -6, -92, 20, -47, -248, 20, -24, 107, 92, 91, -5, -48, 4, 211, -15, 13, 145, 32, 10, 117, -105, -22, -67, -229, -10, 15, -26, -35, -47, -34, 276, -160, -275, 138, -118, -304, 60]
2609F0k62R5J39k09K59k28PJ36J08j49Q5K1l49M69j70j42j6J92j13O1O6q4j31
2632a55J26l1j02K25M4n9O9o5r5M2l9N7j0J5J31j62o3M28m65o7K56j59J97l15
2656a97K59k44P0K04O5j93K48P2m93M16l23Q1K30l21J91J9pm0l1j00L88k74L5
2679E5k6j08R8k3J91j76K21k40Q9j08j42K29k21J68O7j11J83l32J62nK61k23J02
2702A11j22P0qr9K5J26k22J38O8n5R7q8j0j1k7K57j72j28o8k7J53k08K56r4l22
2727c60K62m8J21j8M3o0J58q4k3R2O6N1j26qj97J10J7l4j61O7J70J29j56l1K3
2752CK13k01p6J85p7k50K54j11K23k38n4J39n8K8j9m5J86j0j95K67j25N0m9j78
2776a38J4j05L78k16J34j2L8l80L17M7Pj29J58j97o6k1J67m3M0J27k40J88j60
$$ y = [60, -202, -107, 32, -177, 82, -146, -139, -3, 105, -44, 41, 62, -287, 182, 12, -130, -146, 46, -67, -6, 60, -24, -155, -29, -60, -162, 63, 107, 48, 117, 52, -43, -1, -40, 17, 7, 22, 153, -9, -72, 356, -109, -176, 80, -79, 118, -197, 62, -182, -112, 92, 157, -36, 212, 284, -209, 207, -116, -35, 195, -126, 65, 84, 77, 37, 6, -94, 294, 20, 55, 29, -79, 19, -4, 187, 11, 232, -8, 81, -27, -169, 60, -161, 7, 74, -37, 146, -186, -24, -29, 232, 9, 111, -11, 59, 51, -48, -23, 103, -119, 19, 87, 32, 129, 41, 31, 20, -7, 250, 78, -50, -118, -145, 8, -200, 56, -38, -360, -98, -146, -25, -43, 0, -60, 98, 14, -9, 83, 149, 200, 74, 66, -131, -21, -4, -38, -199, -132, 38, 167, 11, -20, 3, 216, 15, -61, 124, 47, -203, 51, -60, 163, -75, -129, 10, -48, -20, -39, -84, 102, 92, -103, 164, 39, 89, 40, -138, -124, -229, 149, -67, 67, 55, 93, -287, 30, 77, 84, -45, 113, -84, -150, -171, -4, -47, -7, 120, -120, 68, -92]
2799i2R2K09l68K44j60n8L60k26P7k3m7O6j48l1L9n7j4L55l07Q6K9n6j6n2j58
2824b56K35l9K34n36j17L68J34j8M6j51J46J4ojl47K08%J49k0k01r4J76M5k78
2848c09L28j53k09J61L13k38L3K28j36J20k56K71j25J17k35L9N4j04J39q8l0N4
2870b6O6k88J35K18k51J65p4k47L79J4j89P6J47J57k87j96J7K90n3L6l3Q9n1j19
2894b5L08k23l51R9L4R1O6J43l39J15j15L15j49R3r1J90j54j55N9J21l0j15J2
2917a01K44j21k60M40k77J69L9j26r5J05N3k98J01L62j29L1k7n9j27K39k43O3
2939a7J06j13P9j88K57k28K00M2j7j64P8q2m0K09j08l0p7K05l77K76M7k90L33
2962A01R7j53k10O2o9L80k54P8k61rj91M06J58j02r1j09J63j87k9M76l47R8oM
$$ y = [-92, 0, 209, -159, 85, -75, -133, 227, 1, 78, 55, 8, 74, -74, -105, -66, -123, -137, 218, -89, -3, 26, -30, -46, -98, -256, -21, -60, 174, -362, -479, -111, 23, 5, 51, -100, 46, 60, 54, 53, -294, -86, -86, 63, 43, -158, -252, -76, -31, -309, 19, -134, -343, -182, 131, -107, -74, 154, 18, 138, -118, 153, 28, 145, -90, -51, 3, -101, 38, -50, -80, -26, 40, -248, -113, 105, -146, 19, -55, -302, 77, 91, -98, -22, 125, 282, -5, -201, -184, 106, 53, 89, 56, 145, 94, -25, 283, 60, -291, -192, -158, -67, -1, 142, -197, -82, -197, 118, -31, 62, -29, 161, 7, -148, -89, 32, 2, -113, -101, 143, 22, -238, 202, -75, 94, 133, 7, -88, 17, 70, -228, -127, 235, 106, 137, 110, 51, -76, 163, -80, -17, 89, -24, 55, -133, 124, -104, 96, 138, 121, -43, 35, -47, -87, 122, 14, -16, -93, 112, -265, 11, 58, -232, 101, 198, 45, -165, -103, -172, 208, -46, 32, -229, -238, -429, -23, 135, 33, -58, -167, -4, -191, -220, 256, -91, 7, 1, 5]
2986EP0L4j64K84l06j14L24n1o7n3p7J10O7k32J53J81l92J80K1J58k67j14M24
3009A74j90L2o2Q9J44k22qJ13j80J2J74j70K8Q6L1O9p8j61K12J5k67K46J04j41
3033E0j97P1P3J77k00m0j75L48J28j47o5J76K5j31p5J27k18J95j33J16j93K4k6
3056i0Q0J51j53M8p8l6q5J78j43K26M3j26n8l1K66o4l57K28l45K81n8n3M19l37
3080i4j10J33k6Q0k8j7K48k60J04J7j51n4J22l8M9k50J40L54l68J3rJ24j11m4
3104a76J62J33j27j48P0J80J8M3j28J0J41m9m2k66J64j2j33R1J1r6L50l39K1Q4
3128c8q1L77l18J2l6K61k02J04k18k7L10j42k16J99Q8K65k15p5k06J11m7J38r6
3151e2N5m4j3pk0R4j14K40j92m6J71m2o4j27P6M6J1m7J95Jp7j39M0n1k42P11m51
$$ y = [5, 75, 109, -55, 229, -77, -191, 133, 82, 15, -38, -115, -5, 62, -170, -17, 164, -228, -48, -27, 131, -136, -250, 174, -16, 16, -46, 43, 187, -35, -43, 70, -110, -98, 76, -94, -66, 20, 51, 120, 42, -119, 93, 108, -159, 87, 191, 50, -147, -76, -3, 174, -26, -66, -241, 107, 235, 88, 23, 199, 224, 93, 18, 145, -73, 122, -11, 105, -88, -64, -90, -10, 141, -12, 36, -42, -78, -163, 15, -128, 98, 141, 15, -43, -74, 192, 128, -229, -1, -346, -65, -123, -176, 243, -94, -204, -71, -97, -17, -45, -62, 186, -74, 30, 47, -104, -158, -36, -74, -25, -275, -135, 219, -149, -136, -145, -21, -132, -176, -14, 119, -8, -156, -86, 94, 112, 155, 27, 37, 178, 129, 87, -179, -15, -27, -160, -69, -58, -154, 196, -143, -122, -38, -119, 258, -60, -48, -84, 177, -25, 79, -139, -166, 144, 2, -214, -15, 73, 338, 123, 48, -158, -47, -94, 44, -52, 3, -41, -54, -61, -81, 13, -101, 139, -53, -99, 72, 30, -34, -161, -85, -39, -28, -75, 120, 121, 44, -95, -55, -106, -348, 363, -88]
3178h8K66r4k24M41l29j05K22m3J70l96JJ57oq3J34n8K13r7j12M8j40K21j45K69
3202B22k69L19k91k4K00j72k72J22%L84k61j61J43J63k04m0P3O1l1J37j89P0j73
3225a93K22K16m96N44m67K00J56k82J74J7l57J97Q8N9j19J0o4J48o9Q6j18J61
3247A13q5j99L50j87l65M40p8q8J79j0O3k61J10jJ15n6n13M60Qo6M92l91K54k1
3271B63n46J22J65Kl64M71j39k1R4j6k7k17L26O3K4k48R5k18K9j28K77N8l77L88
3295G6j91%k6N4J24m0j83L15J60k66j40K68R5k10K68j52k67K85o9j2k58J92J04
3318A27o4J39j26Pj07J27r1m3J62j83K40k16J51o8j67J77j66p8m4J12K7p8L04
3341A42k13L31j24m2l95J84J64n2K24m34M13j70J39k65k8J46J40m11M03l54K78
$$ y = [-88, 178, 84, -140, 301, -28, -133, 89, 46, 216, -180, -179, -22, -28, -111, 23, -35, 178, 81, -31, 17, -123, 98, -47, 222, -47, 272, -19, -43, 157, -15, -287, -165, -165, 219, -42, -203, -60, 103, -101, -141, -68, -7, -38, 99, -90, -20, -193, 29, 245, -251, 293, -174, 26, 182, -100, 74, 91, -266, -69, 19, 78, -41, -31, -95, 53, -16, 70, -48, 113, 28, -171, 179, -8, -373, 67, -11, -99, 80, 70, 133, -128, -18, -19, 96, 40, -473, -13, -5, -71, 421, 30, 284, 263, -283, -161, 4, 6, -358, 113, -26, -47, 47, 31, 4, -213, 113, 176, 200, -48, 47, -171, -142, -270, 7, 65, -312, 76, -115, -115, -141, -87, 37, -3, -186, 129, 289, 23, -117, 151, 246, 36, 304, 152, -115, 170, 101, 89, -169, 23, 127, 63, 202, 76, 83, -24, 103, 12, -31, 131, -52, 188, -28, 123, 55, -112, 65, -101, -179, -223, -111, -84, -162, 142, -71, 260, 136, 94, -301, -117, 47, -5, 219, -215, 198, 28, 167, -98, -126, 20, 160, -251, 152, -202, 76]
3362G6j09J42n7L72k36k35P5k04K52N1P7k45qr1P3p6K56J7l23j75L34P4m9p0%
3387g9Pj63K80p3k00L66J85m29M4K17j17R3o2l53J60R1j58J37j58O9K83j66l8
3410f4J18j42K1O8j67L26l94L72r5J05j48J91j16P8k22J68rj92J02k3j5k11L98
3433A49j25J42k23K21k19j08L59m07K76RK15j35j51p3K7K55k03J1j10P3J37j61
3455d1MJ31Or8K6J78q4k50O8O9LK80l70L14n9r5L9j26q8K62n18L60K56l87K04
3480H4q6pm0O6N5j00q1R4K56l99M9j80L16o2J05K16l56N7q6J92j63m2N2j3q8J34
3506b7J71o8q2l8J08k14J20j60K74l5j73K21k20k2L68l11L1o5RJ69Q0m6n4Q8k05
3531h1k1O4M5o2l11L45J86k03j44pJ00K93j31J05m1Ml59J47J70N5j16OJ88j77
$$ y = [76, -33, 109, 52, 424, 188, -47, 28, -176, 76, 127, 204, -41, -49, -140, -67, -143, 113, 130, -193, -368, -34, 40, -9, -79, -79, -72, -235, 45, -28, -228, 138, 323, -106, -62, 155, 38, 131, 69, -284, -124, -33, -191, -54, -212, -143, 140, -26, -64, 54, -88, -67, 1, -166, 160, -234, 138, 43, 148, 0, 191, 75, 153, -69, 99, 90, -102, 0, -23, -38, -249, 149, 24, 166, -57, 164, -55, -163, 196, -211, 65, 74, 289, 154, 3, -70, -43, 212, 9, 20, -90, -17, 120, -41, -37, 94, 100, 2, 28, 206, 122, -128, -60, 9, 12, 292, -78, 236, 177, 82, 121, -5, -93, 169, -349, 11, 267, -120, 84, -2, -9, -49, 17, 72, -28, -109, -15, 241, -158, -109, -289, 27, -35, 70, 286, -70, -13, -99, 93, -70, -112, -60, -73, -161, -27, 144, 76, -6, -44, 64, -150, -30, -190, 84, 49, -124, 97, -123, -145, 223, -88, -57, -122, -113, 56, 136, 90, 36, 124, -81, -102, -38, 7, -55, -366, -21, 165, -38, -182, -189, -89, 204, 73, 178, 137, 141, -218, -71, 99, 154, 38, 44, 232, 55]
3555E5L3j00k39L68N2j54p8R0K90l95J18P5L3j7m7Qj5k9k59j36K99j1K20l08K4
3580a23qJ87k32K24o9J3N9q5O4r7K59R3k08J53k22j39J89R6j94o0J34J86m57N8
3604a79R6L9j25Q2r0J81L20k80O6j92j17J66K15Kj59m9o3J15m8n7K8k8o0n3J18
3629g2K72l47O3O3M24m55RO4L0m7%l16K79r5P6J21k09Q6MM02n53J0K27l9n4M3
3655a4J21p4L9O8o3k1J20k3k57K8m5J15r3J07M5j38J5l8J52J63j21J04j47L7j86
3680a06L43k58M33m23N8j88K8L8J70o9Mj1J57k90K91j25K2o4k8j86L01m0k31Q5
3704h9j95K80kJ08l52L17k01j19L46j17q6j1N6R9or3m2J41j72J00l23L23K03j05
3728F0j09P8j42J01p4j33L05l41L76J9m2j14n5j27K40r5J23j7j68J01j24J89m1
$$ y = [55, 88, -12, -251, 117, 169, 15, -63, 27, 317, -78, 40, 115, 148, 131, 84, 92, 77, 48, -211, -347, -48, -59, 161, -147, -123, -131, 56, -176, 48, -21, -8, 51, -34, 30, -67, 192, 285, 77, 230, 8, -131, 58, 154, -40, -100, 34, 220, -237, -179, -83, -44, -169, -87, -177, 4, 324, 44, 110, -82, -199, -33, 182, 184, 25, -24, -87, 28, -20, -77, -49, -77, -137, -190, -72, 200, -147, -84, -21, 403, -52, -43, 21, 51, 4, 4, -312, -33, -128, -52, 69, -140, -54, -50, 352, -201, -191, 36, -3, -57, -14, 107, 33, 72, 140, 77, 56, 176, 153, -104, -76, -121, -6, -99, 8, 53, -85, -70, -108, 44, 207, 86, 190, 43, 80, -106, 237, -21, 412, -11, 47, -141, -113, -75, 95, 26, 30, 19, 176, -114, 177, 52, 74, 10, -18, -204, 97, 57, -174, -89, -284, -4, -6, 102, -250, 67, -134, -253, 93, -24, -110, -121, -65, 34, 28, -65, -107, 34, -138, -38, -361, -38, 165, 60, -49, 29, -113, -12, -86, -219, 86, -255, 121, 140, 98, -16, -71, -198, 42, -53, 70, 53, -115, -14, -138, 51, 10]
3751A0l01L60r8R4L7o3q9J13Kj88%R1p5Po0J27N8k68K30P9j99N18k09l31J74l7
3777a8Q5l85L97j18j56J02j8J07k46K06J75p0M7l69M12k64K01r5k14J85q0m3l
3800a62K75j74K94q3l14J52L07l41o2K20P4j98M0p4J73j35m3L4MR7j9L38k24l25
3824a46J64k4j3rJ48j34j7J29l0J42o6o2M7k59K15l9N7l1p9J3J45l81K60p2J1
3849c1J06l13O6J96O5o3O3J11J2n34K83M2RR5p4j50M7L41j19j42K37k6k31o1M05
3874C34k63Q3k53J11K08r4j91J25Q7r4k9R9k59J29J32k56L08m2k38J93j60k34
3896c04M03l09K93Mm6k10L84l91M1J40L8p6Q9j00Q5M5J23j35j55p0J65M8r2J71
3920A41k56R2K29j25j67K75m38K05l60N49J20k15j18j0L70l78K13l1j16j9N9j7
$$ y = [10, -291, 69, -29, 65, 102, 39, -50, 63, 65, -123, -123, -32, -107, -100, -160, -33, 25, -243, -13, 66, -133, 385, 176, -155, 19, -18, 67, -318, 79, -39, -195, -93, -111, -4, -250, -44, 131, 61, 108, -261, 151, -113, 88, -7, -221, -36, -116, -159, -162, 113, -61, 233, 150, -164, -12, 295, -46, -108, 112, 186, -12, 28, -46, 127, -8, -51, -17, -13, 84, 65, 403, 179, -146, 18, -6, -19, -28, 120, -14, -31, 98, 68, 210, 144, 82, 129, -130, 85, 46, 103, 72, -7, 6, 151, -230, 30, -42, -31, 75, -238, -172, 24, 89, 26, 89, 200, 212, -322, -39, 3, 12, 107, 33, -117, -70, 271, 152, 10, 247, 221, -10, -71, 334, 71, 154, -99, 12, 220, 126, -65, 60, 147, 53, 24, 123, -136, -7, 125, -131, 177, 135, -103, 90, -70, -304, 99, -210, 83, 87, 41, -169, 215, -176, -135, 5, 43, -33, 56, -44, 41, 86, 209, 74, -81, -151, 14, 62, -30, 141, -115, -23, 206, 81, -86, 189, -249, -44, -404, 145, 265, 50, -68, -78, 292, -86, 127, 96, -20, -39, 20, 3]
3942CJ33o2M7k75J72j57N5L8J04m2n5J48K04j83k2N6k31J9J23j47J54l92N11r0
3966A11Q6l76N5L53M2m21M3L34k54k02K53joJ60j33L2l35L04r7J95j60j04J68
3989D7J75l70L10k70K10r2l2o7o6K02j62K19L2m71L18k98K15J55K6j98J47J39
4011A69r4O8O5k35J30j14J1k62K60K12k79J31j28J1J25j00q4l44M77J24j36J46
4033A53j27j3q6K24o5k07J13j18K32jk76J33O3j0j10N1L60l07j51l2q5K59k01
4056b01R1K10K4l66L14l7k29K95j42J24p8K1p4J08j70J01n9J07J05k58K74l90
4078b30K76P1J7p4K07k37l7j58J97p3j1j09Q6J30j22J8o1l8J40J8J82j21j88P4
4102d3j27k9K09j12J4K41P4k23l7j17o6K18p7J53j66j13J51P7l5j63L50k63J31
$$ y = [3, 136, 74, 121, -154, 18, -139, -84, -46, 58, 16, -39, 109, 313, 130, 108, 164, -67, -48, 75, -72, 82, -310, 201, 111, 197, -179, -124, 229, 271, -150, -107, 227, -27, -229, 24, 23, 17, 177, 44, 76, -259, 45, -52, 143, -17, -121, 47, 222, -148, 162, -108, 102, 10, -22, -89, -155, 47, -115, 104, 136, -335, -17, -315, -100, 55, 81, -117, 30, 169, 75, 143, 208, -27, 103, -11, 0, -262, -2, 210, -69, 62, -66, -55, 70, -30, -114, -458, 19, 143, 7, 153, 26, 13, -73, 151, 86, -121, -8, -126, 106, 105, -171, -38, 25, 15, -95, -44, 316, 9, -142, -174, -259, 0, -201, -110, 100, 124, -242, 72, 35, -194, 101, -41, 83, 5, 26, -48, 60, -110, -9, -68, 39, 144, -114, 160, -230, 46, 117, 134, 60, 267, 30, -7, -165, 32, -41, -52, -161, -75, 55, -67, -49, -110, -148, -8, 10, 192, 71, -117, -43, -170, -199, 10, -102, -88, 153, 227, 4, -33, -150, -216, 2, -75, 78, -88, -201, -50, 27, -8, -171, 179, -84, 47]
4125D7oL13l51k18J80q0K7L05k01j69J10J37M0l5j31n7n5Q9r3O3M5K21k80M06
4149C07l11K12j97p3J74L8k78O9N3j49J1Q4NK2k26O2J64J87j18k28K90j16N3q
4173B7j30j20K46j8j10j12L12k94J37J66J2k73J28j07j4J27J48K10l64k36N12
4194B47j78j0j20J64k59J76l2J09J56l81L37k12M1J13%j40j25L03j03p9k10M3
4216a60R2m3q9Q9O5k4p6J22PO6j12l53M61K80m12l0L01j19j75P6j64M05l21K22
4240A08k02K08j96O1O8m2n1Mq6K12p4j95J1J60K3j60K71j71K35jk86k6L62k76
4264d3J52j64j24J21K05j01m8J94j36k60R7L83l23J5j50J00J52j37j76J90L52
4285B99l34q1J52O7j64k0J00l3J42k31J36J8j6j83K71K4Rk12q5J85j30M2J19j26
$$ y = [47, 41, 354, 3, -215, -35, -115, -88, 217, 16, -153, -43, 94, 134, 99, -32, -89, -144, -55, -148, -85, -40, 181, -99, 307, -4, 208, 11, -62, 112, 150, -128, -59, -6, -155, -144, -60, -55, -33, -259, -197, -33, 154, 36, -192, 98, -18, 35, 27, -103, -223, 23, 5, -105, -217, 95, -199, -62, 104, 116, -157, -29, -136, -150, -23, 125, 335, -29, -265, 247, 69, 59, -61, 103, -156, 20, -12, 97, 253, -128, 209, -3, 38, 151, 151, 11, -114, 189, 86, 7, -203, -160, -68, -111, -200, -111, -46, -70, -146, -24, -17, 49, -63, -416, 45, 325, -87, -117, 184, 65, -110, -34, -198, 207, -114, 108, -94, 114, -82, -21, 47, 5, -46, -42, -128, 84, 10, -185, -174, -14, 9, -151, 120, -51, 184, 183, -103, -129, 233, -43, 109, -55, -179, -58, 147, 46, -2, 192, 56, -204, -107, 276, -47, -32, -182, -82, 70, -67, -243, -53, 299, -35, -116, 36, 103, -61, -81, 19, -14, 128, -103, 33, 51, 35, -148, 123, 147, 156, -56, -141, 44, -86, -44, 75, -51]
4309e1J29r6J63J2j65L6k01L13j81J42k73K12p9j61K84k21L40k61j22M4J6J09
4331a1P1j28J33O0M6k82p6Q7o0J53K6P0J53l75K17j91j44Q6K39j6O4l16K31l17
4355b80J42J24j33J19N9J01o8l84K83J0J1J56j42J64K05l09r0K18p8n2q9r1N8
4378f6J07j64l4N9L96l13R5l20L12j55J27K5K6k30p3K39J03r2k9j51K82K20m07
4401d3m3j03J39N0O8j06O9J4J13r0k14L87j53n1J30r5rp8J50Q9k34nP6k90K82
4426E3L4j42L39k71J73l6j32qM6p5J00K1J4j13j66k5K40k04K84r6q6O0J61k05
4450c4J9J94k63J77j03m8K26k15K1J63j42rn3nn2Q9j1j13K53k98J78N2p8j06J19
4475c9R1O2l13L76m3r9J26l17M5o6L8L8J15j58Q6j46K78r5k8p0L70k65j1O4k2
$$ y = [-51, 78, -18, 145, 157, -8, 28, -173, 140, -41, 101, -172, 40, -39, -200, 84, -137, 203, -58, -180, -136, -120, -11, 60, -68, 65, 125, 171, -111, -187, -100, -160, -7, 19, 89, 242, -133, 84, -107, -251, -165, 74, 58, 122, -194, 37, -280, -138, -14, -147, -28, 31, 132, 64, -320, -37, -27, -16, 140, -2, 162, 367, 58, -32, 186, 108, 56, -33, -124, -66, 41, -123, -157, -98, 298, -15, 80, -240, 72, -83, 44, 69, 95, -135, -208, 31, 134, 42, 13, -138, 144, 364, -43, -86, -189, -50, 0, 68, -38, 31, 45, 158, 68, -146, 241, 88, 37, 167, 72, 63, -15, 135, 224, -10, -15, 61, -229, 53, 87, -55, 284, 13, 186, 150, 18, 10, 56, -19, 81, 102, 116, 3, -163, -188, 52, -152, 132, 36, -50, 10, 171, -34, -15, 179, -84, 93, -10, -58, 168, -47, -26, 137, -5, -14, -67, -72, -124, -35, -46, -159, 94, -204, -26, 26, -52, -158, -39, 52, 114, -199, 177, 134, 35, 161, -156, -111, -177, -139, -101, 14, -144, -58, -204, 74, -21, -49, -119, 251, -14, -25, 39, 17]
4500A7J08j29J51k28K78o7k10K75l29J48J31N0Pk82J06j43r5J28M4J19j61J88
4522A06k79q1K71R7j99N8j04K83k93M7J85j77K11j47j64J4O1P7R3q8o5P0O5Ok33
4547a86K21q5K06j14k8J52l26L63k65K24j26r7N2p0Q4O6j97K4L80k98K3p1k14
4570b82K94L21l72k86N27p6k99n9K03n3k23O84o74K95J06n7K3Q5j58M5J82j92
4592C4J23j35q9J55j74k0J59R5q0l2M7k41K43o3J83r7L7L5k19j1J96k07o9J98
4616F8J6l9j14k8J81j25k37p4M17j37J75k15K00k3q4L24k43J8r2O4m6j5P2mp1
4641a2k5o3p6K43o7j30J20l4J93k47j60K91J07J08l67L03j89O9j92K08j17k3J07
4664D7R4j95K33q1r0o3k24L47N3k49L26j19L7l76L03j35P0k51K22r2J28m1j66
$$ y = [17, 125, -4, 147, -81, 197, 130, -80, 195, -134, 14, 145, 195, 202, -80, 26, -117, -212, -84, -40, 79, -82, 106, -173, -254, 17, 114, -85, -27, -131, 152, -141, -94, 91, -86, 125, -22, -186, -172, -111, -34, 59, -29, -94, -24, 41, 47, -186, 35, -50, 156, 42, 14, 166, -160, 203, -62, 162, 36, -61, -9, -79, 5, 71, -126, -102, 278, -20, 3, -68, -282, 12, 333, -39, -325, 202, 126, -173, -232, -29, -82, -305, 379, -295, 0, 106, 49, 72, 157, -1, 44, 226, 34, 157, 22, -67, 88, -86, -106, 53, 148, 68, 36, 83, -158, 85, 22, 205, 108, 145, 180, -39, -50, 146, -61, -130, 68, 84, 45, -69, -97, 84, -41, -278, -352, 65, -72, 103, -112, 88, 65, -19, 305, 62, 80, -12, 52, 6, -9, 63, 59, -12, -37, -100, -176, 67, 0, -130, -10, -44, 149, -98, -258, 33, 140, 248, -119, 184, -5, 64, -128, 80, -37, -60, 47, 141, -54, 179, 98, 8, -55, -279, 68, 121, -128, 198, 79, 116, -260, 43, -92, -22, -273, -51, -143, -15, -56, -222]
4687b22L20P1k8k34K92k14OK7K64l07L43m76J27J55j25L78l96J53O4k33m5R6j0
4710Fk67K24l6L12k13k37J53k84L95j89K7J98j63J19j21K29j20L7P8q5j56J47
4732E4L5m8n5j04J13kN1o0J99l07L7n1K12j46j6O6j31L62l87J39k14K44j87J70
4756b6k53M35l78J90LJ33j68j44M63l91J73l08N41n27K77j41K90j26j5P5l12O1
4778a48K07k65K49K4r1K08j19k54L01j22J89j83j86K11o5j05J66mj96L87l04K21
4800A21j22L1J63k65J39j32l04N23O2l29n5L7L12j11o3j62K96p6L4l70K09K45
4822A83p1o7j29K09l29J45k55M06q8j09J02j37o6K17q9P9M2j4j6j61j94N31k19
4845c0j3M9J58k08n6K4J37M3j44R9j39J00R7k08K39k64jK28l26L58J31n09L01
$$ y = [-222, 98, 169, 141, -93, 199, -15, -9, 18, 282, -25, 318, -158, -31, 124, -1, 377, -19, 134, 198, -35, -80, 16, 6, -261, -37, -73, 239, 26, -211, -58, -342, 53, -136, -109, 89, -74, 45, -76, 153, 33, 70, 148, 63, -93, 54, 89, 41, -14, -118, -5, -7, 44, -16, 183, -124, -87, -138, 74, -72, -88, -22, -153, 209, -178, -39, -253, -9, -196, -26, -279, 156, -222, -32, -29, 104, -64, -208, 255, -136, 37, -271, 270, -257, 20, -121, 169, 43, 28, 103, -209, -148, 59, -206, 43, 67, -24, 184, 65, -189, 112, -10, 179, -4, -190, 21, -44, -149, 17, 13, -183, 204, -100, 121, -1, 30, 193, -72, 67, -65, -369, 154, 216, -113, -168, -131, 181, 70, 7, -155, 141, 65, 99, -271, -62, 183, 112, 45, -84, 125, -204, -59, -314, 92, 4, -105, -3, -140, -206, 11, -78, 1, 43, 29, 13, -148, -342, 189, -30, -43, 6, 164, -44, -100, -76, 61, 104, -40, 59, -80, 20, 117, -91, 148, -116, -117, 111, -215, 143, 274, -235, 66]
4868F6j10N9rm4J85k87J34N2j49M7k6J71o9J33r9M6k11K04q0j39J96q0n0J24k87
4893b23J31J97Q1j34q4j36K72j05o7O9m0O4j26K36n6r1J99j29n5K3J7m2j55J24
4917c0J58q5K32n0k19j20J04K3k0lJ9J09k49L26m68L55j32J49P6k50K21M3r3r1
4941EJ48O6j44j43L88l19p2QONR3Rlj92j2K58j6j26L44n66K30N7r3J65nj70k00
4968b79J94K12r0j3k8j28J76k41R4j95N77l04j52K16L7o7j41J13j48J14J72n3
4990F6r9n6J97P5jP5j71j67j17J69J50O3k04nK53l73J22Q9k08L78l7j18j23j17
5014a59Q5J91k15J00L8K7j48q3K42j95j20J90R5JQ7m8j17J38k6r8m5o2J6L32k80
5039e4J07j82J92o9N1n5j4K6k43L09R3r1k97K15J00q0m2Q4J47j56k50K86n4MK6
$$ y = [66, -44, 15, 6, -38, 147, -140, -6, 46, -103, -56, -82, 89, 20, 153, 54, 100, -111, 93, 13, -126, 70, -10, -60, 64, -223, -92, 105, 186, 52, -32, -168, 104, -1, -68, 1, -39, 25, -101, 135, 79, -12, 187, 58, 3, 26, 43, 1, -154, -30, 128, 43, 275, 225, 6, -114, -10, 13, -7, -10, 9, 118, -131, 195, -273, 82, -50, 99, 175, -75, 146, 189, 96, 5, 153, 219, 75, -68, 320, 1, -71, -63, -57, -52, 41, 50, 47, -145, -157, 101, 85, -41, 303, -263, -33, 24, -69, 96, 91, -79, -279, -85, 127, 37, 24, -4, -132, 44, -197, -103, -298, 279, -25, -177, 39, 76, 9, -132, -19, -167, -53, 119, 66, -33, -89, 108, 183, 182, 257, 86, -81, -198, -29, 121, 184, -20, -25, 228, -145, -23, 66, -142, 236, 199, 81, -42, -159, -74, 117, -98, 2, 40, 67, -81, -164, 78, -117, -237, -47, 48, 49, 136, 88, -29, 109, 83, -15, -60, -122, -106, 226, -54, 53, -129, 63, -6, 45, -10, -24, 2, -241, 68, 161, 70, -227, -12, 88, 8, -34, 50, 197, 41, -209, 77, 23, 27, 53]
5064E3J2K49l53j36j7J88J55m91O17M5l83k7K96j58j56j31M8L0L50l29R5k23L45
5087G9Jk48M20n54L56J26K3j50J24j09k97L38j45j11K19J6j9p3p6K2J59l41L24
5110H4N6k37J51j27K84l23J84r1k5k33O7K89m8j17k39M56J95l14l29M45J8m7k00
5133a01o3K34K7J7l01J78j42N03m93K6q8J34k87N27k13j3M6rK08j42r1R6M9j30
5157b8J05j62L5P5Q5j93j60J05k0J6L7l9K37M7k71R9o4K74k44O4m6NK04l92L67
5182A36O0l00m0J29J20J48j92n3K0Qn0R0j72J85j02p9N6k10K88K5k2o8k96J84
5206a35K83j92m13K73M2K51j42m3K77l81J97kJ97k82k15N19j97m1k7K0K2L24k10
5229A25L5N7k20k09K58O5l6j07O1M17o42K48l69M81m81L87r0L6K02p3j21j13J19
$$ y = [53, 65, 314, -39, -175, -192, -4, 151, -340, 277, 322, -61, -88, 208, 50, -106, -237, -189, -159, 191, -138, -43, -266, 79, 80, -168, 252, -302, 54, 180, 203, 53, 177, 68, -229, 109, -36, -147, 72, 88, 69, -4, -80, -58, 101, -240, 84, 140, -97, 54, -73, 211, -112, 72, -19, -44, -277, -210, 79, 31, -86, -325, 131, 326, 12, -317, 128, 146, 99, -101, -164, 70, 97, 114, -187, -9, -151, 352, -141, -115, -203, -69, -356, 171, -42, -55, -9, -18, 190, 48, -43, 53, 102, -28, 77, -85, -50, 25, 110, -83, -243, -138, -158, -142, -105, -144, 93, 140, -131, -32, -96, 178, -66, -2, -48, -43, 161, -231, 136, 196, -104, -144, -15, 105, 253, 61, 8, 28, 36, -14, 76, -96, 89, -13, -92, -36, -246, 42, 67, 45, -23, -319, -135, 148, -44, -457, -184, -142, 109, -33, -76, 201, -180, 17, 15, 212, -70, -285, 234, 37, -4, -31, -11, 11, 335, 125, 160, 217, -3, -212, 46, 111, 75, -32, 29, 446, -196, 52, -317, 164, -317, 70, -20, 16, 218, 145, 24, -89, 30]
5252C0k12J79N8J29l30q2N52m64J86j31l5K15j78Q2Mj64p3K44m0j30J90J87m33
5275b16MJ74l9q9J30j05M5L22k89J56j43k5j02R1K89l51Q1j62K87r8R8j77R0R2
5299F3j63k7M1L3K56j57j25q5j11L90o6Pm8J9m2L8j8Q8PJ22k45Q6M8j02J99k45
5325c7J09r4J03J0J16k18M1n8L9K6j22r6K77k75j7K60l81L25P5j46K75r5j96J25
5349D6k06J52Jk42J12n3K26R1k01J6R7k72M18j78K97k57o9J53k23K50k43J4J92
5372A21j55J87N0k40M5L7L5q6P6L6k54J1J44k6p2N1M7j80O7M8J18m5l4p4J46j56
5398a03J77j18k4K99m4j91N9k9j40Q7o9j8L28j59Q5j71n7M0p0p8n7J57L98m23
5422a21j3M27k49K4nj06N3o2r2J68J29j32j04j57M58j45r1j76O9P7n5rK71j66
$$ y = [30, -182, -3, 55, 184, -146, -228, 324, -140, 46, -85, -120, 95, -83, -1, 3, -161, -234, 10, -30, -160, 30, 217, -216, -212, -38, -77, -166, -36, -141, -96, 226, -63, 93, -50, -75, -177, -86, 203, -148, -67, -229, 58, -40, 58, -119, -29, 63, -100, -127, -86, -53, 203, 46, -79, -164, -275, 115, 49, 56, 8, 27, -15, 23, 5, 93, 100, 222, -23, 63, 111, 9, 208, -37, 72, -22, 81, 91, 207, -11, 30, -28, 11, 37, -85, -181, 96, -179, -196, 64, -317, 8, 83, -63, 212, 117, -79, 46, -160, -8, -7, -249, -137, -190, 36, 127, -74, -58, 39, -233, 185, 7, 304, 47, -22, 131, -92, 158, -85, -71, 121, -34, 153, 203, -37, 8, 45, 80, -6, 70, 106, -148, -137, 7, -19, -91, -40, 7, -173, -106, -58, 60, 15, -19, -93, 53, -103, 74, -44, -68, 231, 187, -4, 55, 26, -114, -27, -96, -114, 214, 55, 140, -31, -88, -48, -118, -196, -253, -96, 302, -121, -134, 293, 44, 68, 63, -43, 10, -52, -144, 24, 153, 21, -83, -240, 218, 73, -18, -194, -125, -48, -103, -112, 159, -7]
5446gO3q2Q7k56K28k28J70J11k00O7J83j54L47o14L47n4J4J55k03K10m00Q8K01
5469G3J55j65p8j83K72k0qJ23n6k12J42j9j48L38l91L50k34K12k57M8M22m00J72
5492A36k13JJ30l5k39M24k63J8R8K6r0N2j98J99L8m5O9j48K28o5J27m09J28J12
5516H1j82K02l30K96K52l12n9J10j10KJ26q1o5M2k07J74l3j24J81L03k90K37l70
5539a57N41m05r3L05l57K16K29o0j48j30N8k3j32L04j35j13P2L41l34o4L85k06
5561I4l69M81l61J1N33l76j91Q9N9J7r3K74r5N9j79K18j41P1p6Q3j13n4n6L15
5585B00Lk32Oj5K28p9k91K04m59O10r8k08L90l17J60j58J02j1l9J4j02J97l50
5608b45L05k83K95k79J79Q6p3Q7q8J20J15l30J05m4Q5J8j22N7N0j05k23L15J44
$$ y = [-7, 56, -26, 61, -195, 33, -195, -25, 86, -114, -47, 136, -18, 329, -285, 62, 8, 22, 177, -26, 184, -216, -128, 73, 228, 63, -15, -198, 74, 54, 46, 169, 113, -99, 43, 24, -124, 214, -177, 173, -61, 151, -106, -58, 364, -36, 136, -77, -76, 54, 19, -220, 204, -59, -41, 57, 83, -7, 45, -153, 46, 84, 39, 108, -40, 188, 123, 250, -159, -31, 81, -101, 101, -229, 67, 319, 7, -52, 58, -52, -50, 76, -5, -70, -28, -235, -61, -94, -218, -37, 266, -24, 213, -157, 384, -21, -114, 191, -166, 50, 279, 219, 71, -59, -1, -24, -156, 148, 13, -100, -28, 313, -21, -85, 300, 94, -275, 206, -155, -144, 389, 13, -178, -89, -30, -13, -106, 168, 73, 132, -47, 171, 30, 101, 25, 108, -5, -59, -115, 200, 203, -29, -23, -38, 190, 111, -180, 24, -435, 175, 77, -131, 259, -58, 102, -56, 46, 35, -4, 10, -92, 105, -245, 60, -223, 72, -207, -28, 58, -15, 72, -16, 104, 219, -111, -6, -50, 35, 53, -69, -12, 38, -67, -290, 25, 169]
5631A69l28J09J66j14R7m1l6P5k16L23q0l57Q9j1L5J26j07R9Q2j24M3O8k61J6
5655a78J28L5J08k74K07l12K98j05N2N3nm0J89k57N8j48J31J84j94K37lm03J95
5678d4M6j9q4N1J65j86O2R6j86J08l6k15J74J19k44K95j86p2%K01j98K48m5j15
5702f5k18N29j23J42j19j48J81j15n6R1k47L1P9l0n9J57M6m07J45K11q9L61j76
5725A21o1RJ53j56r3lmo2K19k63K93j56j76J34j20N8QJ19K23l12j8L6j45K02r
5750cj41K78k3r2LJ2J49Mj15q1J86l05N1k3J78j77J11j54M31m50J61K19j85K30
5774B64l47r9K50j15Jp3J03m3q0K11L4k6M2o6l5K94j76j38k6J15n85O26j1k8n1
5799D1J7KP7j79K20l03K26J0jJ00l84J45J10j50l7K16Q6q9K8N4O4k46j09J42j25
$$ y = [169, -159, -50, 116, 2, 99, 58, 22, 97, -119, 204, 124, -233, -144, -155, -120, 6, -101, -2, 80, -44, -1, 67, -194, -178, -50, -15, 93, -181, 26, -286, 12, -93, -41, 12, 7, -33, 156, -101, -43, -191, -60, 124, -70, 167, 164, -239, -44, 2, -17, -101, -50, 115, -71, -9, 87, -99, 9, -27, -242, -68, 51, -193, 102, -84, -156, -156, 45, -153, 95, 50, -65, -283, 246, 123, 265, 146, -2, 179, 64, 8, 99, -148, -117, -38, -68, -127, 30, 76, -331, -186, 25, -64, 297, 121, 60, 69, 222, 66, -27, -30, -34, -96, 123, -140, 153, -3, -179, -45, -165, -107, -99, 20, 243, -69, -87, -51, -196, 6, -3, -144, 134, 111, 19, 22, 34, 183, 187, 72, -9, 177, -128, -77, -100, 78, -99, 12, -142, 289, -161, 0, 219, 34, 264, -83, -182, 68, -47, -46, -119, -16, -59, -139, 72, 106, 80, 122, 56, 21, 315, 139, 1, -25, 90, -495, 131, 120, 92, 41, 58, 60, 137, -42, 178, -125, 101, 111, 110, 210, -174, -29, 81, -69, -106, 110, 196, 107, 135, 189, 253, 7, -102, 40, -85]
5824h5J98j25O7K42j29K8k00M0K03Rk75K2l1J91k27R6j03J92k12R5N9P4k56m7
5848a74K58j79M3j46K92k80K43L4j90k58J69L22M6M8l20P1m8j1n0J55J2J39o9
5871A07nJ01j57J41j89O9m0j10q9J57l4n2Q1M3Rj1j04n9J23J24k18K40l09K83
5895A01Jj94J18k2k0K45j38j48PL1j31l3R9J6K19k43J01j00J32k69O3M45k99l3
5919e2J2J91q9P8l3l2J32k38n9J08J00o5L3q6J47k16L8J1l3K29k54j00J92K4j90
5944a52P5Kj17J41R9n9L93m60J19k18L08k07n7K06k00K59m8J02k76J89J18k29
5966a2k15K48mq2L7j30J52J49l17K29j14o0J45J06j42J66j62o0J9j99J49j65M04
5989A42P1j90n6r9j30K95m8M1%K7J70l03J10J42jq9K9k8m9k8q0J8O6Nj37J18K14
$$ y = [-85, 113, -12, 55, 297, 168, 196, -4, 36, 239, 248, -27, -5, -36, 155, -72, 24, -79, 113, -99, -4, 55, 129, -127, -174, 84, -95, -52, -198, 94, -186, 57, 91, -99, -357, -188, 134, 180, 228, -92, -21, -69, -80, -130, 25, 37, 176, 107, 102, 203, 46, 187, -2, 67, 27, -83, -172, -15, -49, -101, -20, 23, 32, 21, -83, -142, -19, 105, -113, 127, -182, 101, 102, -92, 26, 4, -16, 229, 91, -57, -50, -19, -150, -183, -84, -68, 151, -92, 9, -91, 41, -228, -165, 280, -19, -52, -40, 151, 62, 140, 107, 75, 207, -31, -90, 18, 118, 53, 86, 0, 147, -69, -31, -20, -53, 176, -78, -178, 14, 38, -152, -77, -75, -192, -51, 48, -11, 382, -78, 41, -177, 131, -76, -133, 73, -127, 132, 84, 186, -90, 99, 217, -12, -227, 21, 17, -65, -28, -158, -6, 143, -174, 55, -59, -119, 26, 132, -10, 156, -6, -66, -47, -246, -97, -262, 142, 213, 23, -33, -132, -262, 33, -15, 26, 26, 53, 223, -80, 30, 172, 171, 82, 111, 83, 34, 6, -74, -56, 10, 15, -122, -4, 210]
6016B10k32j7M8j57N7J57j9j98J88j35j2L44l21J8J62j6N0j33M4j02n0J92j78
6039a00J47j66R6n2j10L50J3j30j13K34k64j3m8J80oK8l24L71j28lQ7J35k52j17
6063a85L39l21K24Q0l87J59K81k05Q3k28K30k42J5M29l20K78l13J24J69k80j22
6084a92L6J38K01k83J30K1o0k27N8J84J55p0L0l8p7j90J29J85m9oJ1j64K8O1n
6109Fk50L98l20L47r0k74J29M9m8l0k5k1K42J12k42R6j44J36q5M7n3J11n1p8K7
6134a1j9K4kJ41j25j02L34q8p0R6l87J26j71L39k17J97j97P2Q7J17k91J60r1J12
6158C4K5j58J15K5j83K86k39k08PL96j3j63P4q3J1k46K99J62j59J10J17m26N4
6181a63K02k9n9J8J26m09J84O3J1J85J27m3k19K1j06J13L4J53j52k18O4J6k7L88
$$ y = [210, -22, -39, 9, -148, -91, 66, 47, -151, 37, -98, -110, 234, -87, -69, 93, 77, 127, -6, 38, -64, -114, 78, -100, 47, -119, -23, -75, -185, 165, 178, 48, -65, 169, -95, -108, -156, 24, 18, 46, -278, 93, -35, -38, 49, 184, -68, -185, 154, -167, 57, 137, -250, -91, 190, -15, 68, -160, 70, -172, -157, 272, -48, 230, -83, 41, 210, -70, -192, -156, -18, 183, -100, 30, 51, -9, -236, -178, 6, 161, 91, 121, 83, 6, -184, -55, 130, 81, 75, 86, -78, -50, 11, 6, -244, 154, -166, 181, 91, -183, -54, -5, -53, -83, -108, -129, 113, 225, -17, 79, -65, 71, -14, 33, -20, 91, 40, -38, -11, -30, -6, -8, 133, 8, -94, 240, 152, 82, 178, -209, -83, -254, 85, -132, 65, -132, -60, 27, 144, -147, 13, -78, 34, 59, -99, 16, 41, -142, 144, -95, -303, -296, 100, 87, -76, -2, -85, -74, -320, -21, 141, -18, 92, 209, -217, -163, 39, 10, -49, -31, 95, -314, -130, -67, -56, 129, 256, 213, -6, 15, -91, 22, 56, 209, 57, -161, -97, -81, -108, 280]
6205B80l26O7L0J03j68RL6J20Nj57J16k58K31q7r4J12J32k18q8M18J86m64M6Q9
6229A20l1k9j8L8j09K24j41p6K52o4l1m24K38K05j79j64N5R1j99mR7P3m3J30N8
6254F9o0q0K45j78j27K43J10j24p4j8k03J8L41j30l1O0N0p2p8M8k3K60m08O3l
6279a02P7J20N9j69K15k9k30j0J21o3p3j47N9J86K49r4k93k3M2K45l73L30q4k30
6303b17M05N8m73J41m7K67k08j36M02m0J15n67L59J0j66l3K42k10K86l87J18K72
6325A91k01P8j50K31j09k79L99k03o9J57j3Nk2P9k6K4K8j15K2qJ05k36Q7o1L21
6350B35k16j24J5j30K27Q0n6J34k71K48m7j29J95k94J76pn6j72P6j2R2O4j0J62
6374A80j12K5l16J35J97j5l02K91j37M4J48m3K9k89J21J99P5j45j9J11l85qK80
$$ y = [280, -46, 21, 51, 154, -14, -5, 31, 151, 156, -1, 115, -143, 88, 1, -93, 19, 151, -67, -155, 263, 449, -15, 31, 120, 89, 60, 42, 80, -29, 195, 54, -22, 230, 166, 135, -289, -51, 154, -25, -189, -134, -43, -242, -246, -149, -76, -119, 11, 69, 9, -71, 174, -4, -131, 112, 222, 98, 24, 6, -197, -179, 162, 32, 1, 61, 111, 39, -39, 9, -14, 246, -162, -99, -102, -25, 95, 154, -15, 200, 171, -59, -69, 52, -11, -84, -231, -172, 14, 263, 169, -124, -147, -105, 140, -233, 97, 13, -217, 188, 246, -227, -86, -133, 134, -74, -210, 192, 152, 267, -300, 59, 69, -97, -130, 112, -98, 188, -199, -81, 191, -10, 68, -82, 149, 40, -239, 160, -43, -112, 45, 32, 37, 15, 94, 68, 92, 120, 5, 27, 19, 124, -112, -25, -86, 235, 19, -105, -90, -220, 7, 87, 31, 165, -106, 142, 95, -34, 161, -133, 43, 36, -20, -192, -116, -128, -36, 28, 18, 180, 68, 93, -223, -88, 109, 94, -208, 83, -54, -10, 138, 95, 124, -165, -44, 155, 230, 85, 66, 177, -208, -216, 64]
6397F4j74j07K45k1J64k77K30j54K6J02p0J42k12n9p9L75k15J56k19N3j50J72
6419hp5K43j69j78K64J0j22J51r9k2j16J87n0Ll4o2K6r2N5m8L57k33N7k86L46
6444A05J49j00k24k3K70j44N1N9k66K16l03J40K62k93J47r1oJ60K42m67n1n9J53
6467g3q7J50k39J27L53l34J6J3L12j51j95J71n1n5jO2o7p4K89K0k48n5m0J88N7
6492H8R2o4j97n%R6o4P7l05J75J25l7o3M6O8j60O5P2k35O3J85J03j28m0J75Q1
6518B13p1j20mK6n0M0p6R3ko2J1P8J11N1q5m32J48O3J44J50l20O3l8Q1Q1J1P0
6545A74m53K05M7J14j42P2K96k95J9L6q8r0O7J33q3j40J53%j25J71r5l2J52k88
6569a92J48l6j4J6n9K21q5n4j96J41J98j24J2k6j17J48J12l4P3J40k89r2O6j4
$$ y = [64, -110, -217, 28, 7, 171, -106, 124, -30, -4, 98, 28, 170, -42, -101, -180, 195, -20, 136, -83, -30, -180, -8, -83, 160, -9, -187, 77, 87, -35, 116, 17, -5, -121, 66, 16, 19, -15, -77, -51, -143, -88, -136, 221, -12, 45, -241, 105, 254, 154, -70, -93, 177, 33, 84, 143, -123, 93, -210, -70, 192, -101, 46, -45, -51, 109, 351, -116, -167, -226, -73, -160, -10, -249, -122, 231, -103, -87, -74, 238, 87, -108, 63, 12, -43, -44, 18, -49, -123, 166, 186, -62, -117, -157, 31, 88, 180, 116, -81, -86, -86, 10, -54, 23, -282, -107, 18, -19, -82, -36, 32, -128, -63, 9, -226, -163, 22, 125, -3, -43, 132, 213, 142, 22, 18, 44, -6, 34, -42, 51, 49, -13, -2, 76, 187, 238, 153, -279, -131, -68, 76, 226, -94, -31, -69, 12, 93, 104, 174, -279, -74, -27, 87, -55, 17, 313, 18, 37, 73, -15, -105, -38, 95, 12, -128, 25, 25, -100, 71, -24, -56, 96, -192, -44, -80, -94, -78, -137, 84, -1, -55, -251, -110, 88, -36, -24, -50, -167, -19, 93, 59, 132, 272, -17, -109, -43, -57]
6593e7J2J01j19n4mJ68k8p2j23L90j12m2P3j54j23L34m56L33L9j75K60j50j47
6616a06J78j72J17j38J89K37p94L75p4J03J68j73M3K52k61L9r8j77J53K62j32
6637ik6L20k06N1j68Q8K45m54K26j35k0O7K5J98l47KN0L78m55K10Jl7j0q4nL18
6663B23o3J3j15J78l33J69k15J38n1J56k22K3K22j71J83M6k44q9rK34N3l55L39
6686A10j83K42j44k0p6p9R6m7l3J96k95K24n2L10n56L11K19j20jj83K05j60j39
6709a75J05J57j15on3L4j7K87j45K77k09j64n1ll3J77J60q3j79L57m49mJ27j04
6733a09L9Mm8M7k6j03P6K09J50n54M48J9j70J06j71J08k86J82J2j32K17r3j15
6756a90J39q3K55N9K3k03K21l19K07K6k88K8K10j20K02j35j00J98k82N1L8M7j25
$$ y = [-57, -45, 56, -63, -117, -121, 47, 19, -53, -176, 214, 102, 60, 133, -21, -144, 190, -266, 67, 106, -69, 191, 41, -106, 72, -100, 17, -121, 68, 305, -489, -114, -188, -85, 83, -90, -47, 205, -56, -17, -115, -292, -139, 123, -9, -35, 285, 79, 130, -38, 50, 295, -159, 67, -68, -88, -21, 4, 202, -145, -143, -93, 285, -170, 40, 41, 4, -6, -90, -95, 223, 160, 173, 58, 236, -97, 72, -143, -5, -56, 100, -122, -99, 123, -48, 135, 181, -63, -152, -161, 73, 126, -229, 110, -73, 169, 25, 5, -71, -150, -54, -101, -134, 62, -233, -9, -61, 249, -307, 4, 223, 103, 102, -81, 124, -36, -175, -70, 87, -28, -34, -87, -53, -70, 217, 72, 349, 140, -24, -75, -78, -111, 66, 226, 143, -36, 321, -128, -132, -5, -109, -70, -66, -114, -67, -93, -196, -120, 89, 239, -315, 133, 152, -18, 88, -83, 25, -261, -79, -67, -199, 18, -75, -190, -51, -134, 121, 180, 203, 0, 221, -98, 109, 135, -153, -125, 85, -35, 167, 32, -68, 130, -152, -101, -63, -16, -141]
6779a41J36k7P8k42J26P2Q5k3N5k07J59j75M6J43q5j33L34l63J48j2mL63m41k2
6803a30J77pk72M19k79j10K21q0K29l57J46K47j47J07l51J77L72o11N1L51k16
6824f3J02j3P0j77K99l44Pj16K35j89J49l32K70K59l21K22p2k9l4kj1J79k6J16
6848A79j74o5J8K40j74j81O3nmJ61nj46P0K60j40m8K3j0jj79K91k02J64j63J91
6873A63k12K1N0j06K21j42K80l30J29r1j57K19N0q2m7j39LR2K68j13l5P4P1j90
6897cK15m61L55l77K21j23L23j38p1o5R8n9L02k30J75k88K34O6n6m8p6q0j04K72
6921H2j1l68J04J18O6P4k14L97k79K67j44rk0N7j52j12M70l74J75k39J41j19K56
6944A66l97K95K9j90j14J91K6L31k14n8j25L8k23J72K9Qq2JP5j45j43K18K64l68
$$ y = [-141, -5, -32, 46, -196, -70, 2, 87, 64, 119, -88, 71, -104, -58, 85, 0, -133, 201, -162, -14, -26, -30, 333, -108, -130, 47, 40, -232, 187, -92, -202, 19, -61, 168, -189, -43, 204, 57, 164, -187, -10, 362, -249, -198, 153, -63, 39, 26, 96, -81, 218, -126, -119, -235, 0, -189, -40, -372, -102, 157, -164, 58, -14, -43, -77, -79, -90, 89, 63, 179, 5, -60, -42, 198, 24, -157, -94, -99, -103, 58, 53, -93, -23, 237, 97, 49, 72, 62, 61, -118, 173, -29, 135, -28, 163, -49, -28, 22, -84, 137, -5, 275, -55, 74, -17, -174, 45, 95, 13, -34, -173, -170, -78, 190, 77, 42, 116, 187, -3, 212, -249, 106, -271, -50, -173, 150, 12, -59, -124, -26, -85, 217, -13, 162, -126, 108, 174, 118, 70, -6, -86, -190, 82, 71, -297, -193, -75, -9, 65, -149, 248, -31, 236, 92, 83, 63, 120, -32, -144, 326, -48, 127, -112, 29, -90, 166, -231, 64, 93, -97, -211, -20, 6, 337, 123, 65, -60, -22, -245, -73, -44, -36, -118, -117, -42, -187, -330, -112, 152, -216]
6968b16K17p4j8J56L5r0M7j97L31k55K94j75J46k16J50m2oR9j10r3n8J0J24R3
6992A52q5j40K61j71P9n9Kk23J25J54j63J02j7J43k54J05P4j91O5M0l5nj16J22
7016c5N2J9j51j85L42m4J4K3J3N3j51J69k47J19J31j16q5J94r0J25j42o2P6O9
7040I1k74K34Ok49R5J64j67O0j4J61o6j1m7j2K34j28n4o6j52L31j10J11m85L07
7064d1o1J06j85L8K54k82L14k04j19K49q7J13k28R6j40J50K85l88L55l27R2k56
7086b66M03M4k37L49l12jL7n0j4P8J25j13o5p8J11M5j59J61O9j36J5J29J53l19
7110c1j28K32j79L39k02O3j23j76J27Q0p1J24K0QN9k75J38o4J2N9j04J78k65Q9
7134i0J47q1J00k70K05J29n8j85J87K9j51R9n6K6J84k93J1J30J53l77J6L80n6
$$ y = [-216, 1, -73, -91, 65, 100, 10, 57, -140, 191, -64, 230, 55, 201, -15, 135, 93, 87, 186, 76, -17, -75, -65, 59, 152, 67, -73, 188, 17, 96, 37, 39, -184, -59, 95, -68, 34, 17, 160, -94, 11, 85, -106, -41, -1, -36, -41, -157, -35, 17, 36, -115, -300, 42, -2, 12, 35, 48, 101, -50, 119, -128, -9, 122, 6, -79, 115, 25, 150, 8, -54, 22, 91, -183, 51, 57, -192, -97, 67, -100, -40, -54, 107, 41, 30, -17, -29, 205, 77, 23, -43, -195, 136, 26, 137, -348, -41, -102, 4, -181, -143, 111, -171, 143, -61, -180, 69, -18, 95, -133, -37, -177, -27, 258, -130, 225, -102, -10, -266, 137, 181, -56, 293, -19, -20, 17, -33, -47, 31, 156, 43, -22, -100, 11, 56, -103, 58, 127, -9, 6, 135, 288, -31, -159, 73, -106, 233, 31, 94, -29, -205, -78, 2, -69, 55, 75, 83, 142, -133, 5, -59, -47, 12, -92, 86, -179, -90, 57, -24, 76, -194, 11, 140, 82, -103, 84, 113, -38, 61, 5, 31, 215, -78, -67, 63, 216, -161, -145, 235, 179]
7157A79lj35J32k56j04K45k40J05r1J43J1j35K5L80j79q9k32J05L6p0K35k19L09
7180A52k75L36j99p0p2J08Q9N5j20j8J05l24L31j39j72J51j8NM7r1L7K76j92k8
7204b6P5J2k13%J93o7N5j94j59K29J20k00R8J63J24j12J24j69J49r3J86k55J9
7227E9j8N5m8j91K44o6J05J5k02K54j84Qm2L0k9J12k20K44k70L78k83k85M14o9
7251A1k2m8N6K8j41J88q9l10K41J17k15K68k9l3m8k93M64k6q9N2k44J97q3k81
7275c29N05k26K02m2k74K29m7K91k74k71j6P9K18j84J93j89Q5L59k87J04k01m0
7297a15J27M9Q3l62J47K85m3k73K78k93J58o7K19l44P3J06p4k6k43K31J39k08
7319a53J68J6O6p9n1J75l55j04M36k46L31k66R9O5l25K02R3m0j20L63m54K94j31
$$ y = [179, 176, 41, 173, -83, -187, 58, -182, -77, -168, -25, -14, -149, -124, 256, 77, -12, -244, -139, -103, -173, 62, -157, 152, -123, 213, 14, -56, -128, -20, 69, 124, 4, -14, 91, -233, 98, -41, -213, -62, -80, -75, -28, -119, -82, 194, 2, -26, 49, 61, -152, -152, 41, -26, 29, -165, -324, -95, 25, -175, -77, 86, 210, 98, 222, 53, 202, 109, 295, 40, 59, 41, 96, 48, -143, 101, 35, 140, 155, -47, 207, 23, 31, -11, 19, -10, 102, -118, 126, -144, 234, -49, -334, 80, 11, -11, -59, -3, 25, -116, 72, -17, -327, -86, 31, -184, 84, 55, 22, -26, -319, 145, 119, 30, 82, -162, 35, -48, -329, 176, -50, 152, 110, -164, 65, 18, 309, 35, -236, -252, -173, 45, -139, 54, -135, -50, 309, 22, 126, -75, -115, 12, 61, 144, -218, -71, 214, 171, -102, 176, -117, 41, -26, 193, -151, -78, 28, -46, -72, -315, -84, 55, -153, 15, 31, 97, 18, -33, 142, -213, -317, 119, -127, 204, -62, 37, 102, -223, -21, 72, 32, -88, 275, -179, 115, -16]
7342a6K31q2k15k1J72k04J73qNl2J71k52M6M0J01k49J32J57j95j89J65J42k2K3
7366G3P2j77o3K79k73M30j51l56L4J88p7j50J33M7k02K32j11PL5J34j88Q0k1J3
7390a2j79M79k40K7pl9p1K36j14R8l9k82p3M47j59k10o4K39Q6l68J90J95m7J9
7414A12k92J75J76j75l33N19j57Ok8O5j92K15j1j78lQ4k09K05K11l44P5P0J00
7437I1J11l48P8J58j24LkO8j27K05r7j27J52R4k47J82M5J09j56j16j6K01k79J34
7461hJ00p1r5j04J92J65l67K97Q4l54K27J47m6j98n7j66J23J75j02J56r5P1j19
7484d5J34Pj9k48M1J89j32J11k9N4r7q8K01o4K05k45J16l35J98K39j64J04m17
7507b84J74P2K78l23k31M19K1j71J88k55L0J85l0j42R6k13J15O6M3j89J28J48
$$ y = [-16, 215, 133, -82, -103, 69, -135, 38, 30, 35, 3, 174, -78, -32, 8, 109, -140, -8, 149, -46, -235, -70, 72, 50, 73, 145, -32, -95, 184, -89, 341, 190, -166, -132, 56, -21, -171, -38, 9, -193, 39, -72, -65, -30, 104, -84, -4, -25, -12, -191, 288, 48, 75, 68, 29, -42, 194, 80, 178, 139, -143, -216, 231, 72, -138, -202, 37, 123, -245, -55, 140, 93, 112, -180, -5, 171, -4, -337, 182, 25, 31, 3, 68, -124, 91, 80, -98, -101, -17, -226, -21, 190, -154, -79, -9, 91, 202, -146, -68, 90, -34, -31, -33, 35, -92, 113, 16, -111, 41, 135, -112, 70, 115, 224, 68, -48, -64, 137, -142, -8, 92, 21, -74, -178, 14, 179, -188, 109, 193, -161, 66, 213, 167, -31, -88, -254, -131, 44, -58, 98, 3, 74, -45, 89, 96, 77, -171, -130, 59, -73, 38, 9, 63, -34, -122, 79, 15, 220, -25, 91, -244, -46, 193, 29, 133, -284, -110, -38, 240, -83, -314, 105, 126, -45, 143, -112, -82, 103, 73, -69, 27, -186, -71, -5, 38, -151, -23, 125]
7529A25%J05m8k31LR0j10J28j87m0J51Q1j88K10l39K05K59p0r2k1q2m7P9M4j82
7554a57L00K1j47k93k9L83j02l8J06O0n1j48P7Q0p6J43k40J73k29J87k13L93k20
7577b0p4J85J03j93nj25j22L00o7j33L0J49J86m72N22l55K05o8Q4j21j21r9M24
7600B13m7k86K37L4On3j99J64J6k19O9j02K50J92l87J03j75J29J38J1J2Lj06q2
7624g9J95k2m3K7j67R7j27O6j22K57O0k2k25j70p4K43M99l60R7n53M00J19j78
7647h2m4J09p8L62k70K93m76O1J37J6p8p4Q8K20j69j55o9K19N1o3J40j92K03k45
7671i6j7K58k92K13K46l04O3j35K19m22L66J03j73K09m08K01j37J75k2k34j01
7692b88M65l42p2J34n2L26k82j09K75Q0N9l15P0m9K70k34K23j32O9pK47k48k20
$$ y = [125, 125, 230, 182, -49, -46, 44, -66, 62, -125, -165, -14, 67, -121, 89, -250, -45, 214, 144, 52, 31, -51, -98, -19, 25, -157, 143, 164, 17, -276, -305, 78, -24, -62, 44, 104, 53, -95, -18, 62, -14, 129, -111, 62, -167, 20, -193, 200, -20, -94, 91, 194, 1, -4, -129, -251, 49, -18, -151, -121, 28, 214, -258, 264, -91, 114, 46, 130, 9, -112, -211, 213, 166, -120, 117, 151, 157, 104, -95, 69, 85, -134, -65, -167, 83, 275, -112, -9, -184, -55, 83, 94, 106, 109, 3, -79, 116, 94, 51, 78, -89, 8, -119, -53, -175, 82, 142, 120, -105, -275, -349, -106, 393, 33, 130, -423, -23, 96, -82, -126, -17, -95, 267, -3, 290, -186, -125, 12, 28, -50, -124, -36, 184, 15, -140, -209, 10, 61, -2, 138, -54, 149, -96, -113, 145, -147, 66, 312, 8, 71, -64, 155, -267, 99, 202, 29, 238, -170, 31, -106, 69, 47, -187, -288, 177, -165, -237, -103, -155, 171, -111, -220, 55, 135, 194, -121, -51, -100, 170, -64, 159, 27, 96, 89, 336, 88, -132]
7715a32L37r6k97J57L4m1j3Q5O4k95J35K5Q0P5j13j68K87k76K51k29J71L5m2J66
7739B00p6k2N0j66L6P3k27K51J0j17k11M4J90lj29J07J01k00J44J14k81K48m23
7762b87Q3L61k79J10J34K3n0j39m0J58j15J04q9M2J33j81j0O7j05L10k56K7Jp8
7786g6J40j58k2L7j9J19l37M13k23K37J6l12J37j62J10J10J68l13J46j50QJ95
7808F4m29L59o6j17M06m21J17M5J88J09j24j74O1j98nn5L36j55k47Q8K69j23K68
7831A96j33j06j36J31P7O8L18l80m3M12m3l17q4J67k24M06l70j39M75k74J27q1
7853D7M1j38L9j37K02J74k89o8K01j17K4j94J70J14k08K72K45k44k8l17K98k84
7875a97K53J69k03K58o9k60o6K92k81J52J17k80J97j18J2k62J79L11k17O6k3J9
$$ y = [-132, 205, 109, -188, -31, 3, -38, -51, 34, 98, -197, -62, -37, 43, 118, 5, -163, 124, -152, 99, -130, 41, 76, 34, 200, 124, 102, 152, -14, 22, 95, -132, 119, 129, 12, -199, -155, 35, 32, -97, 10, 111, -89, 55, 169, -112, 136, -287, -204, 157, -122, -12, 122, 145, 95, -44, -84, 74, -41, 63, -26, 16, 149, -32, -42, 25, -80, 230, -26, 1, 2, -76, 64, -94, -116, -79, -98, 21, -316, 97, -126, 111, 127, -185, -48, -210, -100, 10, 178, -135, 11, -139, -131, 64, -365, -6, -72, -189, 217, -204, -87, -42, 146, 255, 131, -43, 18, -180, -185, -240, 96, -59, -306, -218, 51, -72, 196, 63, -43, -179, -48, 29, 97, 415, 35, -8, 404, 361, 44, -40, 127, -97, 309, -61, -200, 275, 1, 128, 47, 88, -50, -11, -148, 54, 228, -61, -129, 72, -45, -21, -215, -45, 69, -139, 133, 378, 134, 106, -211, 87, -197, 56, 225, 22, 280, 211, -49, -115, 177, -104, 48, 165, -115, 82, -36, -24, -286, -107, 204, -13, 53, 30, 49]
7897D9N0j4K73m72L9K11j77K19j98j28J51J69j38m9j33K04J4j04j9J75k1M3q2
7920F2j1j71K22j59J65N1O4l33Q2L13m46J65j04J39j31J54j05k0K79k9k70J31
7942D8M4J31j59L0j45q3J04q7J19j38J75j21J65M6k99Q9J35k11J93j20O1K00j83
7965fK0j24Q9O9J34k2j26J97l69L50k31R9j42J12R2m8J27l08K38j54N8O0m02J07
7989a80m5K64k12J90j63Q3R7K0K72m75R7K75l13R3Q0j96o1K49K8Nj26j10K84k0
8013A36j28Q4j59n1k16N52n41L49j59K25k9k88L17k28K3lj51J91K28l79J33L5
8035e9m0M9k06J91J69k70P5N2K51k8l84J91J33o7J32R8k91L44k92O9k71J80q8
8058f2k00L56r3l0q1J76j39j14K21j75K05j27j05J39J39j28O0l3p4p8K17n3oJ95
$$ y = [49, 99, 85, 358, -114, -75, 136, -41, 178, -20, -148, 3, 172, 34, -15, -148, 56, 70, -34, -53, 122, 101, 144, 62, 51, -120, 102, -57, 108, 159, 223, -110, -28, 285, -161, 4, -100, 39, -92, 62, -43, -63, 216, 187, -83, 48, 92, 223, 64, 94, -51, -134, -30, -117, 2, -136, 39, -82, 83, 129, -170, -81, 54, -157, 36, -84, -23, 177, -6, 14, -110, -21, 48, 182, 160, 34, 231, -138, 212, -19, 80, -62, 50, 142, 94, 221, -87, 151, -3, 55, 115, -287, -180, -225, 39, -173, 17, -146, -63, 34, 54, 326, -149, -52, 223, -90, 3, 83, -113, -174, 75, 103, 108, -18, -128, 156, 136, 8, 92, -67, -118, -334, 218, -323, 26, -133, 92, 63, -225, 92, -136, -113, -116, -267, -76, 152, -227, -94, -59, -99, -50, -256, -65, 104, -166, -91, -39, 212, 184, -200, -9, 124, 57, 189, 287, -4, 340, 48, 117, -154, 26, -62, -262, 94, 1, -29, -110, 66, -73, -187, 34, -141, 64, -63, -168, -29, 110, -18, 42, 9, -65, -143, 74, 21, 15, 210]
8082B10l7j56O2k82K73r4m0J86k12K27p1k24K00q9m7N7J56J17r1j96r1L08k64
8105i8K21pJ40l02j63M71m00P7K12l15J76m0J37k65J86Ml29L85j81j65J70j74
8127b60L74k73Q0P9nP0R5k67J97j12p5L52j6j87K32k99j0j36M78k03j82oK15k11
8151g0j0L20k66J11k57K22j4K0L5j46M6K65j67q6r0J27m11L42k09L13p8j84Q5
8174a02qJ05J46o0j58P2J59k88N9L4k79L47j31J09j10J03j83
$$ y = [210, 173, 17, 79, -203, 70, -24, -64, 122, -90, 137, 66, -158, 42, -47, -94, -37, 119, 236, 145, -51, -142, 166, -98, 123, 116, 256, -46, -209, 262, -138, -61, 151, -164, 12, -28, 109, -156, 30, 34, -295, 90, -91, -256, -86, -260, 114, -159, -79, 0, -5, 65, 160, -107, 90, -22, -97, 255, 239, 52, 284, -15, -25, -161, 317, 114, -68, -74, 141, -70, -80, 240, -26, 85, -172, 50, 36, 56, 91, -55, -9, 256, 89, 3, -87, 40, -371, -29, -238, 75, -3, -187, -102, -110, -5, 141, 81, -77, -5, 154, -134, -75, -41, -320, 27, -104, 5, -105, -2, -185]
8191a85
$$ Imaginary data points
##PAGE= N=2
##DATA TABLE= (X++(I..I)), XYDATA
0@%%%%%%%qJ6j6K4l2L2m0N6p2R6j20J44j76K16k63L11l68M32n04N91o87P93r13
30d88J046j195J360j542J746j972K219k488K786l113L466l857M286m750N258n813
46c051O419p080P802q595R468j0428J1488j2665J3975j5444J7105j8998K1175
59A1171k3713K6715l0329L4781m0421M7827n8035P3118r7969J48604m20696M89688
71A60741n7156m91580P91012p46749M13871L25030o60803M83305j00566k34763
81a17658L82733l94249J98850k4101k43430K79765j57002M9722K0755j73698K98411
92A20098j68703J1676R2884j54904K25260j65766p866J92321k63501K05506q1851
103E154q9451K83525l39585J34235J35917k95988K97804j95603o2725K96158l33326
$$ y = [0, 0, 0, 0, 0, 0, 0, 0, -8, 8, -8, 16, -16, 16, -24, 32, -40, 56, -64, 80, -96, 120, -143, 168, -200, 232, -272, 319, -368, 425, -488, 558, -637, 723, -819, 927, -1045, 1174, -1314, 1472, -1641, 1825, -2032, 2254, -2496, 2762, -3051, 3368, -3712, 4090, -4505, 4963, -5465, 6023, -6642, 7333, -8111, 8994, -10004, 11171, -12542, 14173, -16156, 18625, -21796, 26031, -32004, 41114, -56855, 91749, -328947, 160741, 103585, -387995, 403017, -343732, 70139, 395169, -265634, 217671, 117105, -117658, 265075, -129174, 69676, 45575, -197855, 81910, -75092, -25370, -4615, -178313, 120098, -48605, -36929, 55955, -98949, 126311, -39455, -47321, 145000, -118501, 87005, 5154, -84297, 199228, -140357, -6122, 129795, -166193, 131611, -63992, -126717, 169441, -163885]
114a63885J74144N4465k13965K90645j89699K7117J68474k55157K10023n2911
124D9251j17534J84948k08409J06474M1230j94804J83502r3756O03R3548j57868
135a12815J52717k7435n7911J14223j22464J11767j2712j03979J59506j25153
145b4256L1458O6419j49341J49560p2173o6853J43163j47542O5541K2242j18090
156i9872J50961r7723j6493J14705j20283R5996j0570o5596J38509r3583J3525
167I576N6784r0613Q6102n1781m4090P6517q3478L1992j134m8584P3443n5711
179d0977K0716L7197n1946P0486l2977k956N5059p0954M9614r130m6860O1403
191C8675o5957J7912K6235p1861O5895k6813j8963O1312o4953M6059J6384n2988
$$ y = [-163885, 10259, 64724, -149241, 141404, -48295, -21178, 147296, -107861, 102162, 49251, -68283, 116665, -91744, 14730, 55960, -138844, 44658, -49098, -48495, 45053, -112815, 39902, 12467, -45444, 68779, -53685, 58082, 45370, -58609, 100897, -24256, 7202, 73621, -75720, 73840, 1667, -65186, 77977, -69565, -4024, 18218, -99872, 51089, -46634, -63127, 51578, -68705, 27291, 16721, -48875, 89634, -3949, 9576, 66360, -24253, 61849, 10068, -34022, 42495, -40983, -8991, -10125, -58709, 14734, -40977, -20261, 16936, -35010, 35476, 2499, -457, 54602, -16352, 33262, 24132, -22728, 38675, -27282, -9370, 16865, -54996, 10899, -15914, -34877, 26435, -38518, 7541, 23925, -29063]
203b9063O7667l9441K090M0801o5621M7374o950l8070M9533m6507J3331J9646
215A4790m6629M1654k0496j0254L3664l8110K7571j155k1053L9978k8176J1096
227B880J3174k5914L6249k3090m981K5263l3211K2496j0341j8805L3059l3776
239a6997Q567J2679k7287L2871k0112m206L2616l1734K0119L008j9689L1862k3959
252b262J406J7545k6670J8199p532j0149J8880k2413Q848P454j5683J5725r736
265f388L517J1748j5879J2142q13l457R542j3235Q775L69j0277Q974r028L637
279c73J069j2103J2741n736k944Q942j0369J1230k37r623J5204p375J116N523
293G065j1226J1654l926p871J0773q580J926J714p502Q989l987l907O744l967
$$ y = [-29063, 38604, -837, 1253, 42054, -23567, 23807, 16857, -21213, 28320, -18187, -4856, 14790, -31839, 9815, -10681, -20935, 12729, -25381, 2190, 1035, -20018, 19960, -8216, 2880, 16054, -9860, 26389, 3299, -1682, 23581, -9630, 12866, 2525, -16280, 16779, -16997, -8430, 4249, -23038, 9833, -10279, -14485, 18131, -13603, 6516, 9524, -10165, 21697, -2262, -856, 16689, -9981, 8218, 686, -9463, 9417, -12996, -4148, 3306, -12377, 3348, -6388, -2871, 8877, -7002, 5140, 4327, 870, 10412, -2823, 5952, 6321, -3956, 5018, -4010, -373, 696, -11407, 1334, -4402, -7346, 1596, -8773, 2457, 2220, -7403, 7801, 426, 1542, 7065, -4161, 7493, 3567, -4304, 6469, -2111, -185, 1529, -5973, 3016, -971, -4878, 1866, -2101]
307b101L444j176l841P384l783p47J589k268L657m607K72K949l605K595k122J399
323i61L687n065L739J700k154L475l505K086K382o531L349p01k651K444o730K278
339c158L140n757L436j834N72M903l707K891J929j491M212j280m96J176l234J225
355B527j151k424q03k544J821r32o68J083r18M376P96o0L010j148K201L59k499
372C026J454l672j836J565m532O04k235j481M423j688N44J477P01N430j693j43
388A944L295j644K526j727j613J452l849J208p36l537J323l640R70J774m836L268
404c822k00o0M683l432L989K576j956N859l041K47K179n300K613l479m480K218
420a406m729J157k8l820N899j188J792M826k963N268n5k55L663n968J972m84m404
$$ y = [-2101, 1343, 167, -3674, 3710, -73, -820, 769, -1499, 2158, -2449, -2177, 772, -2833, -238, -2360, -961, 2726, -2339, 1400, 3100, 946, 4421, 916, 3002, 5384, -1147, 2202, 1501, -1150, 1294, -5436, -3158, -18, -5775, -2339, -4173, -3601, 1302, -2405, 486, 2415, 924, 5136, 3856, 3360, 4536, 1302, 2527, 1376, -1048, -1851, -4395, -2574, -3506, -4174, -3091, -4009, 367, 1163, 1103, 4113, 2965, 5166, 5525, 3026, 4480, 808, -1028, 537, -3995, -3391, -5626, -7107, -2684, -4372, -3828, -2351, -1650, 3780, 2087, 1944, 5239, 3595, 6121, 4394, 2781, 4233, 384, 1592, 856, -2681, -1358, -4998, -4028, -2254, -7090, -3822, -4022, -4082, 601, -2831, 1158, 3734, 1778, 7637, 4596, 4843, 7022, 1722, 4335, 856, -3624, -1406, -6135, -4978, -5006, -8826, -2927, -4115, -2323, 2503, -460, 4808, 4753, 4498, 8161, 2193, 4165, 3681, -723]
437g23L241o342M12K970n509L952j482r82M211m746M313L86l430O031l920K921
453A303M047n720P486j332k069M745n689K816k478o326L995o261j537J17m937
468a1840O626k995O81P537k667Q305l5j459R144o642J255M53p476M414q260k390
484e349M177r141N675j417j957R576p501O029N365p159Q500m323J78O284j1731
499b794O495K49o977O976r073M220L747j1199P979l492j036N611r843Q377J831
514A071n982R387m549M840M136p506R899m335l262M781j0576N395m977r397Q540
529b535q535R82K295n781J2469l045k89J1106n402Q781j021n611J1671r606j150
544D329K452r868P342p932m299Q635r779M637O93m630R858o505K140N828o894
$$ y = [-723, 2518, -3824, -3412, -442, -5951, -1999, -3481, -4463, -252, -4998, -685, -299, -3729, 2302, -1618, 1303, 5350, -370, 7116, 5784, 3715, 8460, 2771, 5587, 3109, -3217, 778, -5483, -7020, -6903, -11840, -5214, -8209, -7528, 9, -2658, 5647, 5612, 4153, 13297, 6655, 7910, 8363, 887, 5301, -2959, -5349, -1172, -10313, -4638, -6055, -8012, 1564, -5937, 92, 5457, -1702, 6798, 2475, 2653, 8937, -2794, 3701, 3950, -3027, 3949, -5124, -904, 2843, -8356, -377, -3869, -4905, 706, -9137, -760, 1071, -4911, 4476, -73, 4767, 8903, 1397, 11296, 6961, 3699, 8480, -2096, 3299, -1678, -11075, -2535, -11070, -10088, -7793, -13574, -1105, -4150, -4439, 6667, 1265, 10046, 9025, 3414, 15085, 5479, 4329, 6781, -3087, 4255, -3677, -7976, 659, -9120, -4483, -3790, -8420, 1438, -5067, -2927, 2901, -3993]
559c993Q188l301j090Q836r819O097K346p585P308p533P17M237j0613M606l104
574d703k257O335q782O524L033m114R744m691L754N971r398Q186l685o703O180
589E394j0564K082l36r051P948l791R57N403m304R530q29j024Q799o589M151J11
605G887p262Q473q495k048M725q593O187l581n027R447p772K034K871o408Q504
620I42n056n06P918p334O915P44l527R951o917J561N113r123N007m716m521N705
636B156r729J705J683m973P070m216L012O318n446P068k57j277N558p965L638
651D345O24p898M636n310l1L394p196N889p49j831O285n647N266J983o061Q158
667E857l659j313N089p173N191q34o280O483n001m06K378o559N167j823l384N569
$$ y = [-3993, 4195, 894, -196, 8640, -1179, 4918, 7264, -321, 6987, -546, 171, 4408, -6205, -1599, -4703, -6960, -625, -9407, -2883, 150, -3964, 5780, 1089, 4843, 10814, 1416, 9602, 5917, -786, 5394, -5170, -3088, -3424, -12475, -4527, -8318, -7361, -1958, -6262, 3268, 2439, 1415, 10214, 3625, 7776, 7887, 625, 9098, 603, -1445, 3280, -5313, 874, -2707, -7734, 1713, -6059, -4025, -1154, -7562, 942, -4114, -4620, 3298, -4036, 2879, 3623, 96, 10047, 3130, 4691, 9804, 681, 5688, 972, -3549, 2156, -7573, -5868, -4185, -9158, -2088, -6304, -3292, 3026, -2420, 4648, 4391, 3114, 8672, 707, 4345, 4969, -2929, 1707, -3603, -3634, -240, -7436, -1547, -2296, -4127, 2158, -3489, 1777, 3760, -2301, 5857, 2198, 885, 5974, -1199, 3992, 3158, -3122, 3361, -1640, -2046, 332, -6227, -1060, -2883, -6267, -698]
683f98l229K828J231k583O830k146N45L090l624L582k366k967L378n519P57m77
699a368l310L546m024O70M290m224M359k9r76N195m276J823K465l954K953k674
715D66o38L185n239J705M89k347K808l172J258K377k961K904q47k57K714k903
731d58K053L19k295K424k069J33R06k779K371j566j042J823k534K545p04j127
747b000L023k028J748O74k452L584j414n45K259l238J662k51k522L177l227M61
763a089J553l295K668r53r08L024k612J787N90j915K663j110k71J543k294J718
779A099q69r37J617j663M53Q55j501J747q48j4J354j694J514n02p75J137j570
796e97M91K21j512J395j295k52J302j206J293j07p10K332j448Q28R72j826J761
$$ y = [-698, -3927, -1099, 132, -2451, 4379, 2233, 2778, 5868, 2244, 5826, 3460, 493, 3871, -1648, -891, -1368, -4678, -1132, -5156, -4486, -196, -4420, -61, -90, -1066, 4129, -147, 1676, 4141, 187, 3140, 466, -172, 3013, -2226, -521, -32, -2379, 429, -2743, -1485, 892, -2069, 835, -12, -269, 2445, -458, 1595, 1914, -381, 2043, -26, 107, 1013, -1766, 605, -961, -2003, -180, -2714, -169, -873, -2000, 1023, -1005, 743, 1417, -1035, 2549, 1135, 590, 2849, -389, 1273, 1022, -1500, 1677, -1550, -1089, 464, -2831, -163, -1116, -2024, 1000, -1612, 175, 765, -1150, 1513, 403, 132, 1675, -619, 1099, 230, -707, 910, -753, -300, 555, -946, 801, -47, -61, 1293, -401, 1113, 611, -164, 973, -597, -106, 115, -1397, -2, -1297, -1549, -247, -1453, -160, -267, -977, 1355, -93, 735, 1707, -119, 1642]
813A642j118l42J374j920P59k87j161J682j430k29J041j230P51j41o82J851j015
830d55O31M27o54J117p06J9N66p89M44p51j46L88j262M70R4j27J13J73J21R79
850F52p32N82J22N02M35j132O56j84r44L59j333J38L86j699Q83l92j67P72k42
869a338J275P86l02J632j66m5J007j352R38p63j519k96j051l88j24j417P91l8
887b370J91J384k7Q97Q10J06J005K58m22J66p25M28j363o05p9n33j35m35k26P80
907h95m02M86K94j65Q71q1R0P51k75N28j55L78O41j511M69L3j281L12j407m79
927a798N76j565O44L81j78J104o5J133J430j03O96L63k5k0j156l55n50j541j22
946a151m26n16j46k32O85M58M59L95N91R46l24L87K34j20M13o61m47J003j284
$$ y = [1642, 524, 182, 1556, -364, 395, 108, -1053, 629, -801, -1030, 11, -1219, -468, -609, -1291, 560, -455, 176, 603, -51, 1066, 360, 379, 945, 156, 600, -151, -297, 91, -1171, -701, -607, -734, -621, -448, -327, 652, -80, 502, 624, 1126, 1561, 429, 1085, 901, -43, 316, -1017, -879, -493, -2192, -1309, -1701, -1868, -1096, -1338, -63, 723, 421, 2053, 1887, 1842, 2849, 1497, 2435, 1672, 153, -143, -1194, -1582, -1706, -3123, -2332, -2370, -2179, -795, -822, 75, 885, 991, 1996, 2254, 1832, 1998, 1273, 1701, 338, -267, -346, -879, -1014, -1449, -1675, -895, -1297, -811, -517, -682, 189, 108, 198, 949, 674, 1202, 1047, 1425, 2066, 555, 1024, 1057, -224, 88, -1319, -1798, -1222, -2787, -2143, -1762, -1940, -836, -901, 232, 1662, 1559, 2255, 2618, 2593, 2573, 1417, 1062, 512, -1029, -1151, -1577, -2093, -2239, -2471, -1786, -1328, -869, -474, 117, 1063, 739, 1126, 1360, 1240, 1653, 992, 545, 1548, 264]
965B64k86J85n12J94r77k60K53p59K38M76k62Q78J46O74J500m08J073j19J57K6
985B481j268l58p35j547n96r10l61O64o65J038O80J329J326R9J267M50k77N56
1003C173p88o88o15j438j75p21q68L81n44O21Q3N1J242p1K63L45R1N97j55n96
1023A88Q95k15j92K62j81N63l89o12J52o44k64n42m13K39r62M21Q04j22Q26M16
1043B30P57P51k13N73k51m18l63j272j97j50r86m66J90K77L85J32N90Q88J37P15
1063A309k39L79j68lk93o22l45ml68p6p9m60M22K7o78J82K46L41j79m03P15N29
1085B33K50r0M56J037j40j13K7J83n61o85o12o86m34r16j01j59OQ13J49R69M38
1106F4N39O10L73J34l89l81M92k85j568L23n56J32m80l89P44M2Q3J47K28P59k76
$$ y = [264, -22, 163, -349, -155, -1132, -1392, -1139, -1898, -1660, -1184, -1446, -568, -422, 252, 1752, 1344, 2417, 2298, 2455, 2481, 1213, 855, 120, -1427, -2023, -2933, -3294, -2630, -3295, -2257, -1577, -248, 1078, 1177, 2444, 2894, 2617, 3173, 2385, 1697, 1082, -356, -531, -1252, -2120, -1739, -2283, -1662, -1579, -1528, -286, -357, -94, 251, 342, 939, 784, 188, 1083, 868, 676, 938, 757, 1320, 931, 319, 471, -173, -437, -979, -1392, -1153, -2115, -1694, -890, -1012, -186, 230, 987, 1738, 1525, 2098, 1847, 1429, 1066, -206, -403, -553, -1539, -2005, -1815, -1538, -1153, -1021, -431, 457, 594, 1309, 1070, 1449, 1281, 1278, 985, 363, 18, 14, -354, -430, -509, -969, -547, -520, -1198, -1016, -770, -429, -608, -1011, -296, 233, 483, 393, 849, 1886, 1746, 1633, 1660, 1843, 1282, 597, -15, -701, -1135, -2051, -2152, -2311, -2305, -1492, -1343, -374, 64, 603, 1213, 1586, 1720, 1331, 950, 1442, 1157, -411, -88, -644, -512, -992, -1381, -637, -595, -512, -365, -137, 622, 346]
1127C46k35P04o81O32r1p47O55m09j84K62j057O52j32o00Q15r54M02R7j65P04
1147A4j67N00P54q27J108n57O8P08j121N7j8j156M95j267K43M65q64O34j86M82
1167f35R72p54P74P1k1J253r47j27M93q65M51n43o77P82j033N23p3o91Q64n10
1187f93O26j38l17R46k93j17K53m09N56O4n38M48n01L09L16j292Q58j56m93R85
1207D14q63L84K31p15R26n50J65Q95j074O61k7m26O65q78q0N17n55j57k91N2N09
1228a97n92L78jK49O22o70N36R7LL24p52M48Q5m92J33k57m5J4k05K11m1l32M51
1251c3l71M89J1l53N39k2n27N30o95M46k1k42K30q4J77j87K3J95M16m00J74k60
1273C5M50K50r40J28K01r2R8o20M03j17k46n6l1K19K48r1L1pL15J14k06j14L34
$$ y = [346, 111, 815, 134, 766, 675, -72, 583, 174, -10, 252, -805, -153, -285, -885, -70, -1024, -622, -525, -690, 14, -153, 347, 1101, 274, 1382, 825, 893, 1601, 480, 537, 519, -637, -142, -1409, -1166, -701, -1565, -931, -1117, -635, 337, -417, 357, 428, 407, 1660, 713, 586, 1079, 214, 665, 122, -555, 227, -806, -283, -356, -1047, -183, -693, -67, -205, -522, 424, 131, 14, 267, -142, 414, 478, -60, 388, -113, 196, 512, -780, 78, -78, -571, 414, -449, -65, 166, -549, 377, -173, -8, 887, -187, 474, 447, 21, 686, -192, -272, 245, -310, -467, -758, -706, -197, -789, -411, -412, -163, 459, -211, 325, 422, 425, 749, -3, 445, 530, 38, 171, -86, -131, -117, -322, -111, -152, -484, -33, -404, 85, 96, -257, 282, 260, -267, 263, -432, 14, -7, -249, -19, -103, 74, -113, -90, 105, 521, 121, 295, 35, 485, 735, -205, -77, 124, 32, 130, -490, -87, -204, -450, -506, -537, -318, -70, -161, -130, -137, 178, 292, 86, -28, 306]
1296C06j91M65o58K71J98n17J62J1m64M23o17O06j83j69M64j93k3J64j78L30m3
1317A64k52L82j66k41k9p4J07k46M8J48j57K50J76l1K39k63K38J77k79J74O3l10
1339A18J19k30j68N24p21K15p0n02M11p1j6oK50L54J8j04K75J78J21O5m33R5k04
1362B18o2J43l21j62J08l90J47o6Np0J78k05M61L7j07K81K16J95l49K98j24N5
1384D86k12l07J67m56kJ25k47k83N64l35M42K08o3M46j49K97k53k13K85p1n02
1405g3K7l91o0P6m47K08J60j98L96K03J06K11K11J86j61j71M14o2l07l7o4j95
1427C2K60n57J25p8q0r7J8q1r3J70k93N21J46k09M94M42k59M86j49o7Rl14r8p22
1451c94j88P2l17r1J42J7K67P27k3K51j66O04l74L54j50m58J84m15n62L44l24
$$ y = [306, 115, 580, -78, 193, 391, -126, 36, 47, -417, 6, -611, -5, -188, -357, 107, -86, -109, 55, -123, 207, 164, -88, 294, 128, -113, -142, -216, -109, -355, -307, -159, -316, -66, 110, 79, 318, 55, 293, 470, 191, 365, 428, 118, 237, 7, -161, 363, -358, -143, -213, -715, -304, -375, -391, -397, -147, 207, 225, 121, 396, 574, 695, 760, 327, 422, 218, 156, 299, -22, -184, -76, -466, -319, -385, -380, -450, -272, -477, -16, 21, -86, 195, 411, 606, 257, 555, 431, 486, 274, -33, 134, -322, -324, -199, -446, -729, -165, -500, -58, 150, 87, 533, 384, 681, 428, 215, 500, 429, -73, -46, -437, -497, -421, -868, -660, -500, -698, -302, -99, 7, 218, 429, 615, 454, 283, 697, 635, 328, 291, 227, 32, 292, -265, -140, -218, -298, -395, -377, -458, -551, -381, -674, -153, -7, -216, 278, 720, 461, 947, 798, 731, 740, 426, 328, -394, -582, -510, -827, -918, -776, -759, -492, 235, 212, 463, 297, 901, 527, 881, 731, 273, 457, 42, -520, -176, -500]
1472e00r9l9J77j50K3L86J45l05L69K89l05M94l62L29J6M4K8N5m42K07m08k12
1494b60p9j53j50j72l6J72l16P85J41MM34K82O0k5l8K00m40j38K3l39k09j10l68
1517g32K99ql93J60O24K99N4j27j07n1K99j48n9K54k23l19K21k95K68j32m12M23
1539a05j79oJ98j47J53K62m33N30J2L8J60q7J82j58k15L29n16j8m49Ok36n5R8
1562f36p5m4K45L50M44N8k9K22L4lO4k57Mj59l52l0l25J48Nj80K16O0q5J02K06
1587a7J33J91o6o0J6j32j61M73m5l00P8l5J18J67l15j75L96o89L85m1j61L25l68
1610b83K39J96l21K01J28q8K75k05r3Or5k68K41o15M49j52Q7L66l84K57K99lK28
1633D65n1k08K23k15J80j63l0n7o4m12K99l40K59n19M17j01l2K02k06N00m50M81
$$ y = [-500, -599, -638, -461, -611, -588, -202, -57, -362, 7, 296, -9, 485, 123, 452, 468, 512, 540, 595, 153, 360, -48, -260, -339, -492, -642, -814, -850, -678, -994, -209, -68, -64, 370, 652, 712, 687, 649, 849, 409, 271, 294, -45, -254, -364, -732, -433, -441, -834, -674, -50, 249, 303, 176, 69, 18, 317, 169, 110, 364, 141, -178, 43, -252, 16, -116, -528, -105, -284, -290, -92, -239, -86, 176, -257, 273, 285, 323, 483, 396, 578, 420, 205, 534, 18, 0, -449, -443, -679, -734, -636, -711, -755, -510, -160, 284, 342, 313, 535, 569, 566, 630, 373, 377, 218, -134, -164, -489, -341, -336, -516, -300, -240, -325, -223, -17, 116, 307, 241, 181, 197, 65, -96, 377, 332, 32, 110, 75, 193, 360, 45, -130, 266, -423, -38, -79, -240, 85, -283, -44, 152, -169, 32, 160, 72, 347, 142, 49, 55, -40, -308, -67, -682, -233, -385, -298, 68, -316, -59, 240, 237, 465, 414, 206, 429, 214, 394, 231, 201, 144, 80, -332, -33, -373, -114, -633, -216, -317, -349, -147, -353, 147, -303, 178]
1655A78J61n0M9m8l09R6J83m56L17k95Q4K00l59n3L2L06n2M4j21K01k31J84K3
1678H4ll6J57l29K26k53J3j9J66P3k30l9rK57L9o3k15J32J05K74k89K38o5j64
1702E0j11K95j90j10l03m7M75o22L52lK13J78J4j56On7K44m78N82Ml72M9p8J51
1726H6L3k65K03j49K6L85m56K97l45L1K62m51K72O4l77J94J94j2J95k10J08o4
1748B1j17L57j56n0k25%L37j19k44M82k56J53J7j34K00k42k7ok99M25l85%M61
1771A93j55j06J73l26L44N5k00N4k74O23j90p9m2l04LL13l50J98k39J95J37j35
1793a12r4K91J83j7j95K17k26j65J98l32K47k70J42n4j15M31j49j60K13M3J7R2
1815A85q7k0Pk07M82m23J71o7J18K3k72k92M29l83K28j18j43P1N5q8M56k00J4
$$ y = [178, 339, 289, 338, 290, -19, 77, 260, -196, 121, -174, -90, 110, -249, -302, -270, 36, -16, 28, -93, 108, -123, 61, 84, 81, 45, 202, -127, 99, -154, -141, -160, 6, 79, -151, -190, -199, 58, 97, 34, -181, -49, 56, 330, 41, 279, 214, 50, -61, 234, 44, -66, -369, -416, 59, -563, -211, -214, -1, 177, 191, 35, 41, -16, 228, -250, 332, 336, -36, 13, -65, 86, 119, -146, 57, -92, -66, 319, -137, 160, -185, -154, 108, -343, -71, -7, -384, -190, 4, -8, 187, -23, 85, 21, -96, 261, 105, 55, -170, -170, 167, 48, -196, 286, 30, 183, 200, 66, 266, 24, -3, -9, -308, 117, -268, -268, 193, 38, -68, 105, -221, 123, 178, -22, 32, -242, 381, 191, 112, 70, -234, -231, 82, -268, -70, -309, -114, 23, -112, -206, 85, 268, 251, 56, 273, 47, -118, 80, -252, -5, -275, -133, -187, -302, 129, -20, -180, 33, 76, 93, 185, 98, 78, 85, -122, 360, -63, 108, 41, 159, 182, -90, -382, 47, -336, -108, -226, -369, -298, -243, -331, 125, -75, -61]
1838f1K95k34L39j83j83M20j80l8j11J53j57kQ2k36Qk64K06O9M5nJ35p3J79j14
1862I0r1m7J43J6K9k27J70j56p8J89l2j22P4l7l3J37o2M57m27J06L51k16j77J53
1886B10l52J4K25j86J00o7p9l32M33r0O4j64P7j3J57m5n6K41M5Lk5n7K31j33j55
1911D6k19L0M4k31K95j28j60J81j32K74J95k86J31K28n1l5P6k46O3j09k73k7K36
1934i8K39k01k5O0j71k7R9K72r1L20k49l13K62J89l39J56j20J11J20j14j72M1
1956e1j98J62Pj29J77j62j12K03M0N80m66L47k66J53L9j92l6J27q2k85j29P1K02
1979@l56N7L38l77K59K56l99M54j29J33k53o2M03m11J77ml65J97l9K18oj73J11
2002B9o5j97L74k68R6M38l09k32L1O0L35Q5m60J79M6m8o4j06m2k26R5J18j01j18
$$ y = [-61, 234, 0, 339, 156, -27, 393, 213, 175, 64, 217, 60, 58, 140, -96, -88, -352, -146, -77, -32, -37, 98, 25, 204, 90, -1, -48, 95, 111, 140, -87, 83, -73, -151, 38, 6, -116, -42, -79, -112, 25, -37, 420, -7, 99, 450, 234, 57, 210, -142, -128, 97, -89, 11, -56, -135, -467, -34, -124, -60, -224, -147, -160, -3, -48, -104, 137, 182, 185, 160, 103, 334, 201, 46, -173, -143, -99, -330, -35, -163, -323, -142, -274, 0, 195, -91, 40, 268, 217, 182, 258, 12, 75, -34, -307, -334, -98, 141, -60, -85, -25, -196, -223, -124, 148, 57, 377, 128, -185, 77, 266, -73, 83, -37, 74, 194, 80, -92, -51, -249, -87, -80, -209, -32, -194, -306, -103, -63, 517, 51, 398, 132, 285, 324, 132, 96, 223, 141, -144, -273, -202, 0, -356, -299, 39, -338, -79, 177, -222, 232, 103, 236, -17, -79, 324, -87, 90, 86, -279, -82, -121, 97, 91, -82, 29, -36, -233, 141, -127, -31, 407, 98, -134, -103, -43, 292, 377, -83, 96, 142, 94, 30, -76, -118, -344, -249, -131, -232, -350]
2026c50M52j77K14o8R8j09J82L3j1M4l11M3o7K4n9m8l05K27J68l27k6J69M29l56
2050a31k11O52k79L44j02J3p2j6k3j55n0L83j24k73K71k77Q0J4j9j61p7K41J3
2073D1j85M22k46kP2L8R4r4r4M2k67J85j55k3j4K16l5r7O1J00M33n71J54l2L2
2098G5J24k93K31l01j7J2j83J60K34Km40K56lJ46j86o2L40P7j42K18p1k35J64
2121A06K1M1k61J08p9K68m16j9J43J21j7j46j8j04K26R4R4j83k10J44MK4N4K35
2145B30j21m5j8n1K66k71J01k29K19J38j46P5q5k0q9l9J85M5k0k9rKj58j29K11
2170A3l02L87k99o1J28j8L99k89J27P9K08j72q7r8K08J02m03K66k37P3rj16o6
2193a67J71N4m3k4M2K68m19K51k74K17Jj78L52k90m1j83p3N64k58L7j61j01M0
$$ y = [-350, 102, -75, 139, 71, 169, 60, 242, 275, 264, 308, -3, 40, -27, -3, -62, -110, -415, -188, -20, -347, -373, -204, 225, -131, -342, 310, 31, 375, 273, 286, 214, 198, 175, 20, -30, 353, 229, -44, 227, -50, 30, 44, 25, -136, -213, 28, 41, -144, 278, 32, 30, 102, 140, 234, 140, 46, 88, -179, 6, -149, -172, -186, 30, -5, -102, -41, 59, 492, -79, 75, 43, 75, 199, -94, 137, -164, -181, -169, -352, -192, 42, 44, -396, -140, -143, 3, -183, -245, 95, 172, 30, 248, 177, -58, 106, 127, 168, -93, 15, -64, 204, -212, -231, -88, 33, 16, -130, -148, -252, -26, 68, 162, -21, -231, -87, -83, -59, -5, 230, 109, 64, 46, -5, 261, -10, 91, -138, 81, 219, 73, 148, 63, 43, -46, -85, 100, 145, 125, 96, 87, 89, -69, -198, 13, -289, 98, -201, -262, -134, -152, 247, -42, 85, 164, 372, 200, 113, 15, 223, 325, -78, 188, -49, 24, 15, -101, -167, 4, 58, 15, -9, 33, 301, -118, 133, -141, 76, 77, -101, 251, -39, -80, -263, -336, 228, -30, 7, -154, -255, -215]
2216b15K82l8J29m04J36J49n2K5P7j19P2k22J08J46j26j55L93q4o8q3O6J91j03
2239A05J48l08nJ6O9nJp8K0O0k18K75p4J10k91K89k44j49J36J52m9J01k51R8J05
2264A3k23Q5J0L16m54J50J22L6j95L85l37J27k4m9Q2j76R0l2R2J2L8n4j40K61
2288A35l7j47o5K37l65K76p7k8NK58k0M8j10J6l9p3l2K8J15j02J18j2j75J27j4
2313F7j69j0o1K89j08p1J32q1k04J96R5m3j42K63OL6n10J73L03j82q7L8j33L21
2337A18K24j94l13J44j12j44L43j39o2K56P8j41k89J89K28k21J69j87J23k96J72
2358e4j7q1L3K57j11j17P3QL21k84J32j7j13P1l51K11P8L1j89R6k00J43J04m7
2382b3K02k70l0J49K5Rj00K2N6r6l1j7J2j33K76m5j1L12l31J33j07r8J97P0l00
$$ y = [-215, 67, 29, 158, -246, -110, 39, -13, 12, 89, -30, 42, -180, -72, 74, -52, -207, 186, 102, 34, -49, 17, 208, 105, 253, -55, -60, -44, 25, 20, 21, -57, -37, 23, -195, 80, 6, 116, -175, 114, -130, -279, -143, 9, -40, 61, -190, -92, 13, -210, -125, -115, 201, -253, -103, 19, 55, -140, 245, -92, 35, 11, -38, 44, -132, -42, -74, 18, 30, 68, 14, -126, 135, 98, -49, -114, 123, -242, 34, -43, -71, -66, 192, 172, 220, 110, 126, 87, 14, -18, 10, 125, 23, 141, 129, -46, 81, 67, -102, -112, -173, 116, 8, -63, 69, -12, -216, -20, 75, 32, -110, 153, 159, 195, -315, -142, 161, -21, -108, -70, -203, 118, 342, 148, -165, -21, -133, -277, 66, -73, -135, 121, 199, 58, -231, -42, 186, -35, 134, -53, 70, -226, -54, -71, -152, -119, 138, 27, -90, -17, -9, 312, 28, 160, 143, 30, 101, -250, -39, 39, 70, -119, -23, -223, -80, 24, -23, 179, -91, -121, 28, 53, 62, -38, -16, 40, -56, -87, -104, -92, -225, 51, 6, -5, 307, -24, 109, 2, -96, 101, 171, -129]
2407a29K11j00K52l82J1K03j82L37k81J74j90J20r5K25p7j61K02k78o8M17k93
2428h4L03j64m4l46O06k68j27J38N4M3j70Q2q9N9j51J64r6K94J1k04K13k02nK35
2452B52l54L25j65k38K38M9j15o0J67K0m9k0k35K58n0j03L4l50K47J52M1L9m8
2475C5K16l52R6P0r7j79n4L79j37r1k0m6J73p7k3J34J11k51P2L6K20k46L8OQ8
2500A01J07k67p5l0K91l77K14P3k21M4J86J56j33k50N9K31qJ15k06K05Q6k75n22
2523d96N28M2J59k32q0L26o82J45K40j6P9K85j94l31J91J13J1k00K0J93j53P7
2545B5K3j27m0J74J32l37L30k1j55k1Q9j07j60Q7L5O1M7k73K63N8q2k24k0R3J56
2570FJ37pn9j94n6J43J89j19J86j71n4ko7J00p9K01j68K26m23L57J38o5l94Q0
$$ y = [-129, 82, -18, 234, -148, -137, 66, -116, 221, -60, 114, -76, 44, -51, 174, 97, -64, 138, -140, -208, 209, -84, 219, 55, 11, -335, 271, 3, -124, 14, 68, 111, -59, 23, -66, -7, -158, 6, -90, 204, 215, 11, 224, 22, 17, 252, -102, 223, 58, -180, 58, 107, -8, -68, 99, 119, 70, 50, -185, 73, 23, -80, -46, -396, -149, 3, 44, 83, 35, 251, -101, -5, 65, -32, -211, -265, 114, -23, -114, -134, -180, -7, -84, -107, 27, 138, -113, -41, -5, 215, -31, 7, 13, 101, 208, -59, -134, -164, 127, -250, -36, 37, -184, -140, 46, 202, 69, -181, -122, 109, 101, 216, 10, 215, 301, 26, -496, 32, 74, 233, 1, -79, 247, -435, -290, -50, -66, 13, 298, 104, -227, -36, 77, 88, -112, -92, 101, -52, 25, 48, -79, -119, 55, 187, -150, 180, 159, 4, -17, 72, -35, -195, -108, -73, -12, 35, -238, 25, 83, 1, -223, -243, -150, 6, 143, 136, 77, -117, -173, -30, 159, 40, 226, 55, 1, -1, -68, 32, -47, 154, -14, 212, -211, 146, 284, 219, -175, -95]
2594i5l1K3L78m31J14O7j50N9o3L24j45j96J37P4j21j98L38r9M2J80j83N1j0K7
2618I2p2k07J60K5Q7j61J75j23j33K8J04J59k35J33K2k56L29Q4k45K67j28q1J57
2641A81k62j24JJ86p7L67l84J9J71K2r0j42r6N0J00J63m6nO5l00P8M16l89R6m2
2666d2q4J64J21j61Ln3l3R1k43M47l28Q8J21O9j80j90J48K00l5j45j37Q9J01j06
2690i5J82j16K2K07j73K59q4O3m14K47Q4l40J88O7J45l35R2j33J27j3R5k94M10
2713A91j36k6k04J03L01l70K16j20LO7k4J92p5j69J31j28J11q6r6M05j23p9qo5
2737A1l3n7J60j13j07j4K02q8j6J81k40lN9K14l43K11Q8k46K45r0r3j5PL05j44
2762H1J24k35J03O8o1k32M6q1O8K21q6j57K33j65j12K14j9j23J02j46K19k08k3
$$ y = [-95, -126, -103, 275, -156, -42, 25, -125, -66, -129, 195, 50, -146, -9, 65, -56, -254, 84, -15, 27, 207, 24, 75, 65, 92, 20, -187, -27, -2, 85, -76, 99, -24, -157, -129, -25, 134, -101, 32, 54, -202, 127, 211, -34, 233, 105, 24, 181, -81, -205, -204, -18, -95, 272, -112, -93, 78, 100, 10, -132, -228, -178, -78, 85, 39, 34, 99, -201, -123, 293, -96, 0, -42, -126, 38, 159, -2, 1, -52, -85, 6, -237, 210, -118, -30, 91, 160, -20, -210, -62, 138, 103, -42, -179, -90, 11, -95, 87, -29, -7, 200, 27, 286, 202, 265, -149, 98, 182, -158, 30, 97, 242, -93, -1, -134, -7, -20, 75, -219, 191, 55, 29, -175, -72, 229, -141, 75, -45, -42, 25, 1, 193, 118, -51, 80, -48, 63, -23, -119, 286, 163, 84, 76, 11, -22, -79, 81, -32, -139, -153, 49, -39, -55, 126, -114, -117, -58, 156, -187, 24, 112, -134, 111, 21, -72, -87, -80, 225, 81, 205, -30, 73, 141, 80, -152, -106, -187, -119, 102, 16, -141, 92, -73, -185, 29, 10, -113, -11, -157, 62, -146, -169]
2785a69K9J46R4J00k10j47K10Q8j80J20k04K61k62R2Q5j47J19k09K24J36j32q1
2807c7J02l97M95k22N9N4J39m0k87J47k75J91p9Q4R4L9j44J83m1k28J80k3K13
2830B07k47L42k22j93L05j6l57J15K68k29q7K16k13m1j72K29p0JJ31J03L1r5r3
2853h7j33rK56M3K5k60rJ66j02K6j17J20j30R2K58m9Ok76QL67j47K01k95J90k73
2878a29K87k7k39K58l24K92m9r6N5k56L73j45j07o1J56J36l48J71O4K22l57p0
2900a94J26OL34o6m35Q8n4L17N1m2k72J73o8K23m05J59K56k34k7P7m6k87M43j38
2924a5J01rl42J51r9K04k29K94K7j62J33k5l9J44j46l8q2K62j09p8q7K87j28j75
2948a60J26%j29J96p1o8L02j93j19K14j08o5K68k08j00J21l8J71k60J7J14k2k4
$$ y = [-169, -140, 6, 100, 200, -10, -157, 53, 141, -39, 81, -123, 138, -124, -32, 53, -94, 25, -184, 40, 176, 44, -37, 65, -332, 163, -59, 0, 54, 193, 153, -134, 13, -262, -71, -150, -66, 28, 67, -77, 106, 65, -163, 17, -6, 207, -40, 302, 80, -113, 192, 176, -181, -66, 202, -27, -114, 102, -111, -152, -324, -95, -165, -164, -33, 70, 101, 6, -87, -220, -229, 27, 70, 95, -165, -174, -8, -110, -84, -201, -81, -211, -119, 139, 90, 96, -180, -172, 195, 48, 249, -46, 144, -129, 158, 131, -108, 150, -174, 118, 69, -27, 28, -228, 145, 0, -107, -168, -12, 124, -224, -53, 11, 233, -124, -194, -68, -62, 272, 206, -229, -141, -195, 122, 173, 131, -141, 32, -36, 187, -218, -59, 197, -37, -64, 13, -33, -320, 123, -15, 86, 77, -265, -114, -213, -9, -238, 56, 83, -79, 54, 29, -10, 134, -12, -50, -132, 130, 21, -57, -144, 143, 15, -160, -34, -34, -163, 33, -38, -106, 196, 3, -116, 98, -10, -75, 193, -15, -115, 6, -32, 139, -121, -104, 10, -12, -36]
2971c6n7o1N6K86k4j12J83m93J94l0k3J25J6j84K20k00J59J25j52j0j06K04j3
2994F7N5j75J29o6l3k9K01j67l2l42K57JJ40j07%K30l08K04j56J61j13L52l46
3017g7K6K9J71r3j07L1J94l66J50M5J45q4k1K36k41j63P8k3J96q0Rj27O8L8j76
3042a42K75k05M10l74L9K8Lj22L51j48j52P7Nl1J8j25K07k8K8J1k91L86k28j35
3066a43M1J4j52J61K5k00K06L16j47j10l7J86j51l2p4J86j06k27P0m0q5K11J29
3089D1k46M17l68j7J83k5m5J25J38l10K37k02j1L5K26k1l76R7OP9Q7k17J61L1
3113B5k2j85J18P3L9q2q4K42r8R6l49J34j8J78J87k24m9Q2J4k52K41O6k31P3k5
3138e1PK41j84J49m44K58J59j61j81R4M41k45J88l33j28L85j76k66L18j21j57
$$ y = [-36, -93, -154, -98, 188, 164, 52, 235, -258, -64, -94, -117, 8, 24, -160, 60, -140, 19, 144, -8, -18, -124, 80, 67, 122, -53, 76, 10, -23, -52, 149, -18, -50, -392, -135, -134, 6, -101, -101, 129, -179, 25, -131, 30, -83, 269, -77, -51, -22, 149, 56, -51, -20, 174, -192, -42, 3, 148, 64, 43, 279, 38, -125, -47, -70, 126, 46, 55, -72, -4, 34, -142, 133, -72, 338, -36, 3, 31, 34, -88, 263, 115, -37, 40, 45, 14, 32, -93, 114, 86, 114, 125, -166, 220, -8, -143, -102, -88, -240, -79, -54, -254, -48, 268, 121, 11, -26, 160, 9, -23, -97, 89, -17, -244, -174, -214, -299, -88, 41, -205, 212, -156, -173, 10, -15, -60, 65, 203, -107, 130, -72, -83, -48, 178, 157, -219, -122, -116, -37, 50, -167, -6, 25, 3, -182, -64, 9, 48, -34, -118, 124, 26, 122, -227, -93, -111, 67, 254, 30, -19, 63, 77, -175, 66, 132, -99, -26, -51, -44, 197, 13, 162, -282, -24, 135, -26, -207, -113, 328, 83, 271, -62, -190, 195, 19, -247, 71, -50, -207]
3159b07J06M3o2K65l08J75r2j68L36O1n6oj16L8R9k52j8R9J29j51J20n1l2L9n8
3184f7j62J36R8qj80J78K10n78L37j63K33K22k08J78L6j43M3q1j18n0l0n1N0J28
3208A0q8Q1k89K70M5r3P1J87j86j6J51q7k8n7R1m8L0q0j21m9M23m70J11j3K19
3233F4J6p5m0K38j16p2jLq3K81j34p8j40K09N0l02K90j37p7R1L1j95J53j55Q1
3258i8J77N4k23N1K26k91o5K16o7q1o8L95k10j08J33J43j8m68K79K16k82K2K22
3281A55Q1j37j60%J35P8j52K8k9k37J13j27J49mK06K39m00J7J13L3j13p1Q6j35
3305a32l8K25Rj69K6K61n18L94m9Kq3J98r9j42R4O3J03j67R4l8R2k81M95k07j68
3330c5L1n4J9P3l6J6N3j72K28j98o8j08K02J84j11J25l33J78j60n8L83j72j94
$$ y = [-207, -101, -58, -120, 145, -163, 12, -80, -248, 88, 149, 93, 87, -29, 9, 108, -144, -162, -63, 66, -85, 35, -16, -48, -9, -67, -229, -93, 5, -3, -183, -5, 205, -373, -36, -199, 34, 256, 48, 226, 262, 119, 162, 81, -37, -87, -117, -168, -118, 10, -78, 3, -286, -16, 29, -64, 7, 194, 8, -8, 143, 56, 28, -29, 62, 14, 44, -36, -157, -206, 217, -253, -142, -155, 64, 80, 5, -35, 203, 87, 15, 14, 17, -66, 215, 81, 3, -137, 72, 122, -180, 110, -27, -104, -13, 18, -177, -24, -179, -98, 79, 133, -90, -39, 187, -104, -169, 47, -20, -101, -169, 226, 16, -92, 41, 184, 166, -302, -23, 193, -89, -67, 155, 236, 99, -61, -61, 74, 152, 0, 28, -1, -238, -125, -252, -103, -107, 99, 338, -62, -45, 68, 101, -12, -83, 3, -132, -170, 55, 64, -105, -79, 182, -336, 58, 9, 11, -72, 126, 27, -115, -21, 42, 145, -22, 72, 34, 126, -155, 340, 133, -35, -4, -58, -39, 34, -2, 14, 67, -105, 123, -75, -143, -251, -49, 135, 24, 149, -184, -6, -166, -224, 159, -13, -207]
3353b07L15k37j0J35R8j02K9j54L5Pj70M05J09j48J17k85j77K92k33K42k71J23
3375h7N7Q5Jj23PJ55j90r4K57m52J40K93L2O6l17L7M2O4k0R4N4r3N0k9J20j42
3401GJ42k05j54L12M4j22J38k49J64j95j8L50O6j80kN0j89p2K3K06r4p8LO5j98
3426a86K42J36k78kJ01j71KK46j56R9R9k11j0K49m8k09N5n7L94k40j69K47J02
3449B35j11k68K21p6l3%n6K13k77Q3k9J75l1j10N4M8m2k36O12k92p5j02N7J38
3473I8Mj63p1k9K2J1L24k64L3l9j88J43m9J94J36j8j92K1J31K02k39j1J11k87
3497a20r0L19j07J12k22J76j7j37O6k33N8K51Pn3k8K15j46K0j09J35M4P2j88J04
3521A29n4K12l49K40l89J79K6k83N04m52J01M1K14j05J03r2p1J30Pj0j18L0j38
$$ y = [-207, 108, -129, -139, -4, 94, -8, 21, -133, -98, -91, -261, 144, 253, 105, 222, -63, -240, 52, -181, 61, -210, -87, -30, 55, 56, -67, -60, 95, -95, -189, 68, -384, -244, 49, 81, 147, -170, -133, -91, -27, -47, 47, 101, 8, 58, 29, 149, 7, 149, -56, -210, 102, 146, 24, 162, -87, 77, -118, -136, 214, 280, 100, 98, 148, -41, -113, -90, 116, 22, -56, -53, 12, -186, 56, 192, -86, -88, 13, -158, -156, 90, -66, 33, 132, -79, -89, 160, 112, -97, -42, -99, 295, 55, -114, 133, 235, 124, -144, 77, 1, -32, -32, -88, 125, -152, -69, -98, 77, 46, -64, -10, 38, -4, -240, 372, 80, 5, -97, -40, 98, 102, -61, -132, -161, -139, -128, 196, -68, -35, -74, -262, -119, -168, 26, 162, 144, -48, -27, 104, 306, 67, 56, 167, -120, -210, 109, 2, 114, -108, 68, 51, -86, -20, -253, -195, 56, 63, 10, -18, 197, 51, 71, -38, 97, 141, 213, 25, 129, 75, 287, -62, 178, -211, -32, -6, -289, 215, -237, -136, -95, 119, 14, 117, 25, -46, 84, 91, 81, -37, -7, -145]
3544a45J29J15p5k36K55k24R1k5M1L77o14L58ok9k39K16j65P5P0k07N19l18o5
3567a02Q5J71p8j87J78Oo6q4l6K20k2j78J50m6MJ8k5O5k21K89j56J25k06k0J90
3592G4K73j18k97J36r1J38j04n0J1N0l60L82l27L42r3J9p2L73m45J96j68J46j26
3615a11kJ64l64K02K20P7l23L44k55r0J72nk5R9j18o3R1J03j87n9J43K98m04R2
3639aOM2k1l5p9K7J96m57P7L96j76k03J85K08m36L69j24L07k19k05O0J63N2m8
3663H4J7j37j47L3n8L91j49k17J88J25k11l1J6J41K18o3q7k73J09q3J26J50j84
3686d2K66j23j10J37K7j81J07q1j54L53R1m17M7J55j03j13J19J70k12p1m4J50
3708b9J6j26J22J4P0Lo0k65K36J60p6L7rk61j3J24j03K18j76m8J52lO8L3l07L95
$$ y = [-145, -16, 99, 24, -212, 43, -181, -90, -115, -74, 303, -311, 47, 41, 12, -227, -11, -176, -101, -31, -238, 281, -37, -102, -17, 154, 76, -111, 67, 73, 7, -77, -113, 107, 85, -93, 57, 11, 15, 33, 8, 73, -148, 141, -15, 110, -96, -116, 74, 347, 229, -68, 68, -23, 115, 11, -39, -28, 22, -338, 44, -283, 59, -34, -15, -87, 286, -159, 37, -131, 15, -111, -113, 51, -313, -111, 109, 186, -137, 207, -48, -138, 34, 29, 4, 103, -15, -78, 13, 116, -71, -130, 13, 311, -93, -1, 5, 47, 26, -9, -88, -61, 135, -322, -245, 151, -25, -228, -43, 165, -271, 98, -26, 281, 62, -143, -83, 80, 132, 84, 101, -36, -183, -150, -208, 183, 34, -183, 5, 130, -81, -112, -96, 45, 263, 200, 113, -160, -51, -134, -8, 142, -42, 224, 101, -9, 128, 155, -26, 81, 0, -154, 199, 290, -127, -80, 75, -28, -141, -22, 148, -64, -135, -179, -29, -13, -139, -17, -3, 67, 70, 10, -255, -19, 141, 65, 102, 93, -168, -181, -57, -160, 58, -118, -166, -14, -17, 51, 84, -223, 172]
3734A72k84O2M87l03j72N4K3q5Q8J38l05J17N4j98QM40m42L01j78k3J87k4o1J11
3758A67k81J97M8k40J59j01m8J94r0j72L28%O0l72K76k70J66%l7N4j46N3n1M4
3782f2J44o9j84M38k68j18o1J06K08k86PJ77qJ42J6l08K53L7p9j6k13J77j10R3
3806A6K51k24k63J05j04L64l10n6K65p8J08p1J67k9j67K04j21M3j60J7n3k6K22
3829A00kQ1j32K5p9j26K68j44o2K23l05J64O0j92J78NMk71R8k6O3p1l8K99j16
$$ y = [172, -112, -50, 437, 134, -38, 16, 39, -46, 42, 180, -125, -8, 46, -152, -144, 296, -146, 155, -23, -46, 141, 117, 56, 167, -114, 83, 131, -109, 50, -51, -99, 95, 5, -167, 161, 161, 221, -151, 125, -145, 21, 21, -16, 38, -108, -55, -106, -62, 82, 13, -171, 267, -1, -119, -180, -74, 134, -152, -145, 32, 24, 166, 182, -126, 127, 164, 85, 69, -144, 33, -77, 16, 267, 43, -220, -115, -219, 145, -165, -221, 44, -34, 74, 3, 170, 141, -26, 178, 57, 100, -60, -43, -96, -122, 100, 98, 179, 47, 72, -7, -133, 135, -9, -71, 152, -153, 11, 71, -121, 57, 62, 66, -205, -107, -133, -70, -141, -179, 120, 4]
$$ [...]
8191B16
##END NTUPLES=NMR FID
##END=
