##TITLE=1H_LR-758-R6-P-MeOH-K1
 CDCl3
 8 sc, 
 2.10.2023
##JCAMPDX= 6.0         $$ Bruker NMR JCAMP-DX V2.0
##DATA TYPE= NMR FID
##DATA CLASS= NTUPLES
##ORIGIN= UXNMR, Bruker Analytische Messtechnik GmbH
##OWNER= root
$$ XWIN-NMR		Version 3.5
$$ Mon Oct  2 15:02:27 2023 Russian Standard Time (UT+4h)  she@DPX200
##.OBSERVE FREQUENCY= 200.13135
##.OBSERVE NUCLEUS= ^1H
##.DELAY= (6, 6)
##.ACQUISITION MODE= SIMULTANEOUS
##.ACQUISITION SCHEME= undefined
##.AVERAGES= 8
##.DIGITISER RES= 18
##SPECTROMETER/DATA SYSTEM= spect
##.PULSE SEQUENCE= zg30
##.SOLVENT NAME= CDCl3
##.SHIFT REFERENCE= (INTERNAL, CDCl3, 0, 15.7039)
##AUDIT TRAIL= $$ (NUMBER, WHEN, WHO, WHERE, WHAT)
$$ ##TITLE= Audit trail, XWIN-NMR		Version 3.5
$$ ##JCAMPDX= 5.01
$$ ##ORIGIN= Bruker BioSpin GmbH
$$ ##OWNER= she
$$ F:/spectra/data/she/nmr/H-F/1/audita.txt
$$ ##AUDIT TRAIL=  $$ (NUMBER, WHEN, WHO, WHERE, WHAT)
(   1,<2023-10-02 15:01:16.85 +0400>,<she>,<DPX200>,
      <created by zg, POWCHK disabled, PULCHK disabled
       configuration hash MD5:
       00 E9 B6 7A A2 85 ED C7 34 08 36 98 17 FE 4E 26
       data hash MD5: 16K
       53 E0 99 C8 6B 5F 1A 32 E2 C2 6B 8E 5B 85 A3 D5>)
$$ ##END=
$$ 
$$ hash MD5
$$ C7 7E FD EA 72 44 12 F5 A6 B8 74 94 6F 9C AF 02
##$RELAX= 
##$RELAX= 
##$RELAX= 
##$RELAX= 
##$RELAX= 
##$RELAX= 
$$ Bruker specific parameters
$$ --------------------------
##$DU= <F:/spectra>
##$EXPNO= 1
##$NAME= <H-F>
##$PROCNO= 1
##$TYPE= <nmr>
##$USER= <she>
##$AMP= (0..31)
100 100 100 100 100 100 100 100 100 100 100 100 100 100 100 100 100 100 
100 100 100 100 100 100 100 100 100 100 100 100 100 100 
##$AQSEQ= 0
##$AQ_mod= 1
##$AUNM= <au_zg>
##$AUTOPOS= <>
##$BF1= 200.13
##$BF2= 200.13
##$BF3= 200.13
##$BF4= 200.13
##$BF5= 200.13
##$BF6= 200.13
##$BF7= 200.13
##$BF8= 200.13
##$BYTORDA= 1
##$CFDGTYP= 0
##$CFRGTYP= 5
##$CHEMSTR= <none>
##$CNST= (0..31)
1 1 145 1 1 1 1 1 1 1 1 1 1 1 1 1 1 1 1 1 1 1 1 1 1 1 1 1 1 1 1 1 
##$CPDPRG= <>
##$CPDPRG1= <>
##$CPDPRG2= <>
##$CPDPRG3= <>
##$CPDPRG4= <mlev>
##$CPDPRG5= <mlev>
##$CPDPRG6= <mlev>
##$CPDPRG7= <mlev>
##$CPDPRG8= <mlev>
##$CPDPRGB= <>
##$CPDPRGT= <>
##$D= (0..31)
0 1.2 0 0 0 0 0 0 0 0.06 0 0.03 0 0 0 0 0.0002 0 0 0 0 0 0 0 0 0 0 0 0 
0 0 0 
##$DATE= 1696244476
##$DBL= (0..7)
120 120 120 120 120 120 120 120 
##$DBP= (0..7)
150 150 150 150 150 150 150 150 
##$DBP07= 0
##$DBPNAM0= <>
##$DBPNAM1= <>
##$DBPNAM2= <>
##$DBPNAM3= <>
##$DBPNAM4= <>
##$DBPNAM5= <>
##$DBPNAM6= <>
##$DBPNAM7= <>
##$DBPOAL= (0..7)
0.5 0.5 0.5 0.5 0.5 0.5 0.5 0.5 
##$DBPOFFS= (0..7)
0 0 0 0 0 0 0 0 
##$DE= 6
##$DECBNUC= <off>
##$DECIM= 32
##$DECNUC= <off>
##$DECSTAT= 4
##$DIGMOD= 1
##$DIGTYP= 9
##$DL= (0..7)
0 120 120 120 120 120 120 120 
##$DP= (0..7)
150 150 150 150 150 150 150 150 
##$DP07= 0
##$DPNAME0= <>
##$DPNAME1= <>
##$DPNAME2= <>
##$DPNAME3= <>
##$DPNAME4= <>
##$DPNAME5= <>
##$DPNAME6= <>
##$DPNAME7= <>
##$DPOAL= (0..7)
0.5 0.5 0.5 0.5 0.5 0.5 0.5 0.5 
##$DPOFFS= (0..7)
0 0 0 0 0 0 0 0 
##$DQDMODE= 0
##$DR= 18
##$DS= 0
$$ [...]
##$SUBNAM2= <"">
##$SUBNAM3= <"">
##$SUBNAM4= <"">
##$SUBNAM5= <"">
##$SUBNAM6= <"">
##$SUBNAM7= <"">
##$SUBNAM8= <"">
##$SUBNAM9= <"">
##$SW= 18.05172834244
##$SWIBOX= (0..15)
0 0 2 0 0 0 0 0 0 0 0 0 0 0 0 0 
##$SW_h= 3612.71676300578
##$TD= 16384
##$TD0= 1
##$TE= 0
##$TE2= 300
##$TE3= 300
##$TEG= 300
##$TL= (0..7)
0 120 120 120 120 120 120 120 
##$TP= (0..7)
150 150 150 150 150 150 150 150 
##$TP07= 0
##$TPNAME0= <>
##$TPNAME1= <>
##$TPNAME2= <>
##$TPNAME3= <>
##$TPNAME4= <>
##$TPNAME5= <>
##$TPNAME6= <>
##$TPNAME7= <>
##$TPOAL= (0..7)
0.5 0.5 0.5 0.5 0.5 0.5 0.5 0.5 
##$TPOFFS= (0..7)
0 0 0 0 0 0 0 0 
##$TUNHIN= 0
##$TUNHOUT= 0
##$TUNXOUT= 0
##$USERA1= <user>
##$USERA2= <user>
##$USERA3= <user>
##$USERA4= <user>
##$USERA5= <user>
##$V9= 5
##$VALIST= <valist>
##$VCLIST= <CCCCCCCCCCCCCCC>
##$VD= 0
##$VDLIST= <DDDDDDDDDDDDDDD>
##$VPLIST= <PPPPPPPPPPPPPPP>
##$VTLIST= <TTTTTTTTTTTTTTT>
##$WBST= 1024
##$WBSW= 4
##$XGAIN= (0..3)
0 0 0 0 
##$XL= 0
##$YL= 0
##$YMAX_a= 49644
##$YMIN_a= -80126
##$ZGOPTNS= <>
##$ZL1= 120
##$ZL2= 120
##$ZL3= 120
##$ZL4= 120
##$ABSF1= 10
##$ABSF2= 0
##$ABSG= 5
##$ABSL= 3
##$ALPHA= 0
##$AQORDER= 0
##$ASSFAC= 0
##$ASSFACI= 0
##$ASSFACX= 0
##$ASSWID= 0
##$AUNMP= <proc_1d>
##$AZFE= 0.1
##$AZFW= 0.1
##$BCFW= 1
##$BC_mod= 2
##$BYTORDP= 1
##$COROFFS= 0
##$CY= 11.3945322036743
##$DATMOD= 1
##$DC= 2
##$DFILT= <>
##$DTYPP= 0
##$F1P= 15.7292609196834
##$F2P= 12.9074282941183
##$FCOR= 0.5
##$FTSIZE= 0
##$FT_mod= 4
##$GAMMA= 1
##$GB= 0.15
##$INTBC= 1
##$INTSCL= 1
##$ISEN= 128
##$LB= 0.24
##$LEV0= 0
##$LPBIN= 0
##$MAXI= 10000
##$MC2= 0
##$MEAN= 0
##$ME_mod= 0
##$MI= 1.114404
##$NCOEF= 0
##$NC_proc= 0
##$NLEV= 6
##$NOISF1= 3.799351
##$NOISF2= 2.8
##$NSP= 1
##$NTH_PI= 0
##$NZP= 0
##$OFFSET= 15.70392
##$PC= 1
##$PHC0= -21708.85
##$PHC1= 10.45271
##$PH_mod= 1
##$PKNL= yes
##$PPARMOD= 0
##$PSCAL= 0
##$PSIGN= 0
##$REVERSE= no
##$SF= 200.130013532006
##$SI= 16384
##$SIGF1= 3
##$SIGF2= 2
##$SINO= 400
##$SIOLD= 16384
##$SREGLST= <1H.CDCl3>
##$SSB= 0
##$STSI= 0
##$STSR= 0
##$SW_p= 3612.71676300578
##$SYMM= 0
##$S_DEV= 0
##$TDeff= 0
##$TDoff= 0
##$TI= <>
##$TILT= no
##$TM1= 0
##$TM2= 0
##$TOPLEV= 0
##$USERP1= <user>
##$USERP2= <user>
##$USERP3= <user>
##$USERP4= <user>
##$USERP5= <user>
##$WDW= 1
##$XDIM= 8192
##$YMAX_p= 0
##$YMIN_p= 0
$$ End of Bruker specific parameters
$$ ---------------------------------
##NTUPLES= NMR FID
##VAR_NAME=  TIME,          FID/REAL,        FID/IMAG
##SYMBOL=    X,             R,               I
##VAR_TYPE=  INDEPENDENT,   DEPENDENT,       DEPENDENT
##VAR_FORM=  AFFN,          ASDF,            ASDF
##VAR_DIM=   8192,          8192,            8192
##UNITS=     SECONDS,       ARBITRARY UNITS, ARBITRARY UNITS
##FACTOR=    0.0002768,     1,               1
##FIRST=     0,             0,               0
##LAST=      2.2672688,     0,               0
##MIN=       0,             -80126,          0
##MAX=       2.2672688,     49644,           0
$$ Real data points
##PAGE= N=1
##DATA TABLE= (X++(R..R)), XYDATA
$$ [...]
$$ plain form
1854 209 -51 -14 -63 -218 -45 -130 -149 -281 -6 -104 -163 -355 -375 -403 -626 -162 -11 -235 -232 -87 -19 -158 -263 51
1878 51 -143 -91 -4 -215 29 -53 75 -44 225 -100 35 -11 -198 -91 30 -58 119 251 3 -168 16 104
1900 104 155 -102 31 20 -20 322 -19 28 79 -79 -2 -93 -14 2 -187 -267 -111 -329 -223 -176 -340 -447 -338 -391
1924 -391 -260 -185 -101 -177 -356 -294 88 24 -283 -247 -177 56 -60 -243 -16 317 81 111 126 13 205 63 131
1947 131 93 434 191 195 39 96 74 163 69 -107 -99 -159 -114 103 75 9 94 -86 -33 20 -94 49 -81 -198 -255 -290
1973 -290 -38 -78 -36 -185 26 -175 -94 -221 -191 68 -174 -126 -251 108 -128 -154 -143 124 345 50 155 7
1995 7 18 14 185 280 373 215 187 141 222 209 210 -69 93 -168 231 159 62 -188 -79 148 -81 -287 -432 -132 -37
2020 -37 -111 -94 -86 -332 -123 -210 -8 -313 -42 20 138 -211 82 238 -14 -171 21 343 -47 77 -85 21
$$ packed form
1854B09k60L7m9j55J73q5j9j32K75r8n9j92k0k8k23M64J51k24LJ45O8j39j05L14
1878E1j94N2Q7k11K44q2J28j19K69l25J35m6j87J07J21q8J77J32k48j71J84Q8
1900A04N1k57J33j1m0L42l41M7N1j58P7r1P9J6j89q0J56k18J06M7j64j07J09n3
1924c91J31P5Q4p6j79O2L82o4l07L6P0K33j16j83K27L33k36L0J5j13J92j42O8
1947A31l8L41k43Mj56N7k2Q9r4j76Qo0M5K17k8o6Q5j80N3N3j14J43j30j17n7l5
1973b90K52m0M2j49K11k01Q1j27L0K59k42M8j25L59k36k6J1K67K21k95J05j48
1995GJ1mJ71R5R3j58k8m6Q1j3Jk79J62k61L99p2r7k50J09K27k29k06j45L00R5
2020c7p4J7Qk46K09q7K02l05K71O2J18l49K93J56k52j57J92L22l90J24j62J06
$$ plain form
2042 21 57 123 150 42 130 264 -110 373 2 166 254 82 266 266 123 157 78 68 55 -15 49 0 186 -357 -156
2067 -156 -229 108 61 -93 -59 -77 117 -69 -338 -300 50 103 -127 167 -71 146 -52 -188 -249 -230 100 -21 301
2090 301 -50 -22 112 -76 -89 -47 95 -35 47 227 305 152 180 485 268 406 319 -89 -48 71 185 -21 -27
2113 -27 22 8 69 -33 -129 -58 -75 112 -65 -16 -186 -225 -189 -28 -197 -293 -184 -80 158 138 72 -149 28 76 86
2138 86 41 -26 -1 117 116 -97 -31 47 -228 94 64 -238 -26 -131 98 -250 -32 -80 145 -127 10 -78 10 96
2162 96 89 -101 20 218 -140 156 60 89 112 -187 -215 21 -11 -156 -133 -228 58 -149 -326 285 -420 -163 -14
2185 -14 -78 14 -52 73 -13 -22 93 98 67 -104 185 90 137 -259 -116 130 19 102 191 -340 107 -103 -215 25 -154
2210 -154 4 114 -165 -200 -58 -208 -68 53 16 -123 -297 -240 -32 233 137 -112 214 -108 55 76 -213 144
$$ packed form
2042B1L6O6K7j08Q8J34l74M83l71J64Q8j72J84%j43L4p9j0j3p0O4m9J86n43K01
2067a56p3L37m7j54L4j8J94j86k69L8L50N3k30K94k38K17j98j36o1J9L30j21L22
2090C01l51K8J34j88j3M2J42j30Q2J80P8j53K8L05k17J38q7m08M1J19J14k06o
2113b7M9j4O1j02r6P1j7J87j77M9j70l9L6J61j69r6J09J04K38k0o6k21J77M8J0
2138H6m5o7K5J18jk13O6P8k75L22l0l02K12j05K29l48K18m8K25k72J37q8Q8Q6
2162I6pj90J21J98l58K96r6K9K3k99k8K36l2j45K3r5K86k07j77O11p05K57J49
2185a4o4R2o6J25q6rJ15Nl1j71K89r5M7l96J43K46j11Q3Q9n31M47k10j12K40j79
2210a54J58J10k79l5J42j50J40J21l7j39j74N7K08K65r6k49L26l22J63K1k89L57
$$ plain form
2232 144 -143 -80 90 -123 -155 -80 122 -83 36 -86 -124 -201 59 27 -168 171 -243 -140 14 -35 -306 -209 -47
2255 -47 -75 -179 60 105 135 166 190 -31 -157 212 22 35 170 -41 -106 112 -180 121 -85 116 -35 -38 -219
2278 -219 26 109 -103 128 -93 -99 -150 -11 -69 -136 80 -110 -131 20 69 -36 -9 75 297 123 -76 -211 58
2301 58 108 -189 -10 -87 -35 -156 -79 -247 -129 -94 87 -56 -169 -225 180 103 -39 165 161 142 376 174 144 168
2325 168 21 300 24 228 93 -38 95 92 83 -305 222 202 -64 -229 -96 35 -10 111 -301 -125 -168 -111 -63
2348 -63 -40 127 -106 -175 37 -181 75 13 -43 -28 -128 34 29 -168 26 -98 -36 -19 104 66 48 -77 269 -17
2372 -17 131 -13 233 -32 -184 138 19 78 -30 41 -221 210 -157 -59 117 2 162 143 140 100 -112 -202 -111
2395 -111 270 -66 78 -33 -14 -255 -182 93 -98 -201 -14 -25 57 -242 -62 -223 -145 -72 -209 55 -2 -28 92
$$ packed form
2232A44k87O3J70k13l2P5K02k05J19j22l8p7K60l2j95L39m14J03J54m9k71R7J62
2255d7k8j04K39M5L0L1K4k21j26L69j90J3J35k11o5K18k92L01k06K01j51lj81
2278b19K45Q3k12K31k21on1J39n8o7K16j90k1J51M9j05K7Q4K22j74j99j35K69
2301E8N0k97J79p7N2j21P7j68J18L5J81j43j13n6M05p7j42K04mj9K34k02l0K4
2325A68j47K79k76K04j35j31J33lrl88N27k0k66j65J33J31m5J21m12J76m3N7M8
2348f3K3J67k33o9K12k18K56o2n6J5j00J62nj97J94j24O2J7J23l8j8j25L46k86
2372a7J48j44K46k65j52L22j19N9j08P1k62M31l67R8J76j15J60j9lm0k12r0R1
2395a11L81l36J44j11J9k41P3K75j91j03J87j1Q2k99J80j61P8P3j37K64n7k6J20
$$ plain form
2418 92 -112 86 218 57 69 -13 -127 -99 100 -138 -51 59 100 59 0 50 264 -138 -5 81 -26 13 -92 -265
2442 -265 -146 -31 -57 -111 -84 -104 -184 -236 -8 -32 -130 -111 -90 -171 -110 60 -17 -2 -29 -83 131 -64 32 -144 -348 118
2468 118 -30 -46 55 -15 128 -38 47 -89 -158 195 -84 -190 -97 91 29 397 -173 42 -78 -229 100 -85
2490 -85 -57 102 1 44 -133 45 30 28 -280 -103 -133 79 -300 -71 -259 -235 -95 -34 30 -337 -44 -141 62 -52
2514 -52 -79 160 258 -186 101 31 25 15 368 -57 7 210 14 120 -263 54 136 15 -34 158 56 190 2
2537 2 -122 17 -165 -112 -127 -83 196 134 -21 49 -71 -55 4 35 -30 -76 -232 80 29 94 -252 -77 200 -1 -83
2562 -83 15 -51 -73 361 117 -43 -26 -47 66 -120 281 307 -23 63 -53 146 156 112 185 34 44 76 83 266 -69
2587 -69 140 -48 59 199 -18 37 -27 220 229 -51 -36 -272 234 -77 23 14 -268 -148 -112 -387 91 -167 -121
$$ packed form
2418I2k04J98J32j61J2q2j14K8J99k38Q7J10M1m1n9N0K14m02J33Q6j07L9j05j73
2442b65J19J15k6n4K7k0q0n2K28k4r8J9K1q1O1J70p7J5k7n4K14j95R6j76k04M66
2468A18j48j6J01p0J43j66Q5j36o9L53k79j06R3J88o2L68n70K15j20j51L29j85
2490h5K8J59j01M3j77J78j5kl08J77l0K12l79K29j88K4J40O1O4l67K93r7K03j14
2514e2k7K39R8m44K87p0oj0L53m25O4K03j96J06l83L17Q2j21m9J92j02J34j88
2537Bj24J39j82N3j5M4K79o2j55P0j20J6N9L1o5m6j56L12n1O5l46J75K77k01q2
2562h3R8o6k2M34k44j60J7k1J13j86M01K6l30Q6j16J99J0m4P3j51J0L2PJ83l35
2587f9K09j88J07J40k17N5o4K47Rk80J5k36N06l11J00rk82J20L6k75M78k58M6
$$ plain form
2610 -121 51 85 96 -70 -3 56 170 182 9 -144 113 57 -4 -154 139 272 1 156 -19 5 14 62 265 -19
2634 -19 -11 18 -147 -92 23 134 -88 32 34 96 -200 -257 161 -326 -52 -117 -17 -45 -47 131 56 -142 56 -220 83
2659 83 1 95 -6 111 11 -41 30 -76 176 -116 11 33 110 -84 26 -72 -173 -210 -113 142 -123 244 20
2682 20 261 5 -133 -128 249 -8 -41 182 -10 -95 -89 -80 -342 69 139 -77 -178 31 2 -22 -334 39 56 49 -342
2707 -342 -9 93 -63 -228 21 51 -201 33 -15 -48 -223 27 -70 -119 -106 172 168 -50 -133 130 7 -317 25
2730 25 -18 115 -297 110 -104 -108 8 -303 -246 -141 -189 14 159 76 -110 214 -5 -74 -216 -149 74 107 -63
2753 -63 146 -107 222 -136 -78 107 -230 -86 -201 119 115 -23 105 49 211 75 -107 -212 63 141 138 -42 156
2776 156 59 -140 162 -281 45 58 -78 62 -67 -12 -105 -98 -150 44 -61 -107 -40 -124 261 -169 -28 -230 75
$$ packed form
2610a21J72L4J1j66O7N9J14J2j73j53K57n6o1j50K93J33k71J55j75K4RM8K03k84
2634a9QK9j65N5J15J11k22J20KO2k96n7M18m87K74o5J00k8kJ78p5j98J98k76L03
2659H3q2R4j01J17j00n2P1j06K52k92J27K2P7j94J10r8j01l7R7K55k65L67k24
2682B0K41k56j38NL77k57l3K23j92q5ORk62M11P0k16j01K09k9k4l12L73J7pl91
2707c42L33J02j56j65K49L0k52K34m8l3j75K50r7m9J3K78mk18q3K63j23l24L42
2730B5m3J33m12M07k14mJ16l11N7J05m8K03J45q3j86L24k19o9j42O7K23L3j70
2753f3K09k53L29l58N8J85l37J44j15L20mj38J28n6J62j36j82j05K75P8lj80J98
2776A56r7j99L02m43L26J3j36J40j29N5r3Pn2J94j05m6O7q4L85m30J41k02L05
$$ plain form
2799 75 -103 -201 103 250 -43 -166 -76 61 -125 -84 43 -4 -89 -164 -104 -93 -40 -135 106 -243 -52 -186 -5 -331
2823 -331 -133 -24 -177 -120 201 -100 -66 -46 208 -142 -280 119 43 190 210 -13 3 136 29 -167 63 233
2845 233 -160 126 -78 -187 32 46 4 38 37 -257 -41 82 86 -289 56 -26 -150 133 -5 -27 -259 166 -59
2868 -59 87 -18 319 -36 -207 149 -50 -51 195 39 -172 211 55 -20 202 194 -73 -82 152 -244 48 83 -208
2891 -208 -201 182 -206 95 44 -191 -123 156 -85 162 -73 -28 45 118 32 -61 0 134 -98 -194 171 311 160 193
2915 193 26 -97 -133 -75 112 82 -146 -116 266 -13 -219 -62 -251 -123 114 -83 -219 -344 -131 134 255
2936 255 -113 23 5 104 100 -44 29 -44 -183 11 2 266 -57 -68 25 -140 9 67 150 221 -65 -234 30 -159
2960 -159 118 35 155 -113 249 -50 44 228 114 -110 -28 108 133 -276 79 39 2 135 -11 256 75 -30
$$ packed form
2799G5j78r8L04J47k93j23R0J37j86M1J27m7q5p5O0J1N3r5K41l49J91j34J81l26
2823c31J98J09j53N7L21l01L4K0K54l50j38L99p6J47K0k23J6J33j07j96K30J70
2845B33l93K86k04j09K19J4m2L4jk94K16J23Ml75L45q2j24K83j38k2k32M25k25
2868e9J46j05L37l55j71L56j99jK46j56k11L83j56p5K22qk67rK34l96K92L5k91
2891b08PL83l88L01n1k35O8K79k41K47k35M5P3P3q6r3O1J34k32r6L65J40j51L3
2915A93j67j23l6N8J87l0k28L0L82k79k06J57j89J28K37j97j36j25K13K65J21
2936B55l68J36j8R9mj44P3p3j39J94rK64l23j1R3j65J49N8Q3P1k86j69K64j89
2960a59K77q3J20k68L62k99R4J84j14k24Q2J36K5m09L55m0l7J33j46K67j81j05
$$ plain form
2982 -30 -151 9 -210 79 96 -130 -127 -170 -142 163 -94 -210 22 -130 173 107 -28 83 131 -242 -172 35 -177
3005 -177 150 28 109 287 -55 90 -255 68 5 -141 43 -280 -73 -71 -113 76 -49 -36 -70 160 -40 -21 167
3028 167 5 -395 -173 121 -14 -46 18 143 -67 94 -139 1 28 -123 -104 64 46 -68 8 15 24 69 87 147
3052 147 -33 96 162 -159 90 -39 95 51 49 -37 156 47 -55 372 114 -347 -356 23 -139 -204 -270 259 292
3075 292 -95 -106 -204 98 21 189 140 131 -225 -87 -102 193 167 -61 231 -201 -222 -40 -158 -149 -87 -140 87 101 73
3100 73 -40 149 3 -242 176 42 -5 78 15 -140 -456 -174 207 -178 -49 148 -54 -28 -168 -213 -60 -171
3122 -171 -38 147 145 13 10 -120 -131 197 -85 -56 -77 -91 177 -164 323 80 47 -117 -386 -125 61 169 -131
3145 -131 -22 -254 -76 -225 251 39 -17 51 -178 -26 -96 -334 175 169 272 -226 -74 -171 21 85 5 -326 -69
$$ packed form
2982c0j21J60k19K89J7k26Lm3K8L05k57j16K32j52L03o6j35J11M8l73P0K07k12
3005a77L27j22Q1J78l42J45l45L23o3j46J84l23K07Km2J89j25J3l4K30k00J9J88
3028A67j62m00K22K94j35l2O4J25k10J61k33J40K7j51J9J68j8j14P6PRM5J8O0
3052A47j80J29O6l21K49j29J34m4kq6J93j09j02M27k58m61rL79j62o5o6N29L3
3075B92l87j1r8L02p7J68m9rl56J38j5K95k6k28K92m32k1J82j18RO2n3K27J4k8
3100G3j13J89j46k45M18j34m7Q3o3j55l16K82L81l85J29J97k02K6j40m5J53j11
3122a71J33J85kj32lj30j1L28k82K9k1j4K68l41M87k43l3j64k69K61J86J08l00
3145a31J09k32J78j49M76k12n6O8k29J52p0k38N09oJ03m98J52r7J92O4q0l31K57
$$ plain form
3168 -69 60 83 204 -115 -62 -77 10 120 12 -192 -142 104 84 18 -128 -117 217 150 -57 -91 -333 6 323 198
3192 198 -34 -45 -38 -96 239 -41 144 36 -181 145 -88 112 -130 -81 123 321 -120 209 -68 71 308 137
3214 137 -49 -77 187 57 -154 22 12 257 -107 158 201 274 39 -236 -68 144 26 -133 16 -34 142 100
3236 100 52 -33 131 26 -78 35 127 -35 60 -195 -77 52 -210 -31 -34 3 -31 -78 -263 73 101 -148 6
3259 6 17 42 75 68 -221 158 87 275 20 -334 81 -86 64 -51 68 -80 -192 100 -191 -26 -11 117 -21
3282 -21 -24 -42 87 102 117 -155 119 37 -63 75 326 -24 -4 -95 -129 20 0 -17 172 -236 85 -134 -90 -11 -122
3307 -122 -120 -87 -319 -195 98 -122 123 25 112 103 -104 -133 -79 185 -127 10 0 -83 -106 79 100 76 -73 -53 88
3332 88 -5 86 -131 177 -108 -261 109 7 -105 -116 76 32 -43 -117 -185 -8 -8 133 55 -83 167 -73 -64 -155 315
$$ packed form
3168f9J29K3J21l19N3j5Q7J10j08k04N0K46k0o6j46J1L34o7k07l4k42L39L17j25
3192A98k32j1Pn8L35k80J85j08k17L26k33K00k42M9K04J98m41L29k77J39K37j71
3214A37j86k8K64j30k11J76j0K45l64K65M3P3k35k75J68K12j18j59J49n0J76m2
3236A00m8q5J64j05j04J13R2j62R5k55J18J29k62J79lL7l4m7j85L36K8k49J54
3259FJ1K5L3pk89L79p1J88k55l54M15j67J50j15J19j48j12K92k91J65J5J28j38
3282b1lj8J29J5J5k72K74q2j00J38K51l50K0r1l4J49k0j7J89m08L21k19M4P9j11
3307a22KL3k32J24K93k20K45r8Q7rk07k9N4K64l12J37j0q3k3J85K1k4j49K0J41
3332H8r3R1k17L08k85j53L70j02j12j1J92m4p5p4o8J77%J41p8j38K50k40Rr1M70
$$ plain form
3357 315 81 137 -7 193 18 193 -19 7 -37 51 81 -243 -28 -179 43 -82 115 -44 -72 183 154 -97
3379 -97 -172 -187 133 254 145 132 -136 127 -22 -40 133 52 -171 -169 139 -209 -243 58 158 -45 -46 -42 -71 30 -260
3404 -260 -64 27 23 136 12 -81 -134 -42 0 -161 -7 91 -203 5 44 44 -9 143 -6 -5 13 -55 -88 83 183 32
3430 32 -175 174 -116 141 48 -9 -80 -66 130 43 -7 -46 -135 201 131 -163 89 -43 -129 -180 87 316 180 194
3454 194 62 161 -207 -178 -16 70 -258 -148 308 128 51 152 -139 -30 141 -90 -61 82 114 29 -12 124 15
3477 15 -133 113 -156 -216 47 53 -224 -4 81 76 -192 143 74 -29 -117 -30 -78 27 93 -75 8 -142 2 50 -205
3502 -205 -116 -203 104 -93 -45 -194 29 191 84 -287 88 -50 94 -43 102 136 -90 276 -106 85 63 -149
3524 -149 155 51 144 -29 -101 -39 44 123 -119 155 40 -87 155 86 -2 225 115 -135 -3 -161 -195 68 78
$$ packed form
3357C15k34N6j44K00j75J75k12K6m4Q8L0l24K15j51K22j25J97j59k8K55k9k51
3379i7p5j5L20J21j09j3k68K63j49j8J73q1k23KL08l48l4L01J00k03jMk9J01k90
3404b60J96R1mJ13j24r3n3R2M2j61J54R8k94K08L9%n3J52j49JJ8o8l3J71J00j51
3430C2k07L49k90K57r3n7p1J4J96q7n0l9q9L36p0k94K52j32q6n1K67K29j36J4
3454A94j32R9l68K9J62Q6l28J10M56j80p7J01k91J09J71k31K9J43L2q5m1J36j09
3477A5j48K46k69o0K63Ok77K20Q5nk68L35o9j03q8Q7m8J05O6j68Q3j50J44M8k55
3502b05Q9q7L07j97M8j49K23J62j07l71L75j38J44j37J45L4k26L66l82J91k2k12
3524a49L04j04R3j73p2O2Q3P9k42K74j15j27K42o9q8K27j10k50J32j58l4K63J0
$$ plain form
3547 78 17 -376 -63 -81 -181 -160 88 -137 15 133 92 -33 14 100 110 -66 -44 174 278 371 117 -58 84
3570 84 83 4 22 51 -22 -120 -19 245 3 21 67 -113 101 109 -176 -158 -163 -230 -183 -71 209 76 -27 67 117 137 168
3597 168 34 80 49 -103 88 -81 75 63 -127 173 333 -33 -151 -81 -53 222 209 132 -106 -258 26 76 -74
3620 -74 64 -217 21 52 -149 -109 3 62 13 -114 -86 88 -29 25 100 223 5 -21 -180 -156 256 56 -12 53
3644 53 183 135 -318 -117 -66 -190 -173 159 -22 203 70 -101 69 174 -240 -35 275 168 -44 100 73 -154
3666 -154 159 158 -219 129 -11 146 -75 -74 -20 -82 -162 -101 26 104 -83 -46 -60 3 75 -2 -26 -81 18 99 170 -86
3692 -86 -4 151 -12 21 29 220 109 -222 8 56 59 15 356 -81 -28 -272 43 -100 -97 -11 -131 40 17 81 -262
3717 -262 203 -76 -32 -167 -138 85 -289 -4 -62 16 -16 -114 -10 91 133 49 -39 365 -53 7 -182 151 145 40
$$ packed form
3547G8o1l93L13j8j00K1K48k25J52J18m1j25M7Q6J0j76K2K18J04R3k54j75J42
3570H4jp9J8K9p3r8J01K64k42J8M6j80K14Qk85J8no7M7J12K80j33j03R4N0K0L1
3597A68j34M6l1j52J91j69J56j2j90L00J60l66j18P0K8K75j3p7k38j52K84N0j50
3620g4J38k81K38L1k01M0J12N9m9j27K8J74j17N4P5J23k18k6j59K4M12k00o8O5
3644E3J30m8m53K01N1j24J7L32j81K25j33j71J70J05m14K05L10j07k12J44k7k27
3666a54L13jl77L48j40J57k21JN4o2q0O1J27P8j87L7j4O3P2p7k4n5R9Q1P1k56
3692h6Q2J55j63L3QJ91j11l31K30M8Lm4L41m37N3k44L15j43LQ6j20J71k3O4l43
3717b62M65k79M4j35K9K23l74K85n8P8l2r8J04J01M2q4q8M04m18O0j89L33oj05
$$ plain form
3741 40 72 -103 34 130 110 52 81 89 1 271 -94 -23 48 196 -114 -13 138 109 174 -131 71 194 -138 -157 -73
3766 -73 34 -15 145 128 30 -19 175 12 90 -249 8 -55 -47 192 -65 -44 -68 325 -19 10 -22 -102 -292 -85 104
3791 104 155 15 -291 -227 91 -159 -7 25 -63 67 59 70 20 -28 -109 -4 138 -255 -75 53 -205 -130 21 58
3815 58 -112 43 -236 307 -136 258 62 -5 -110 -92 -226 -104 -136 -33 142 -12 -136 -32 186 -454 6
3836 6 -168 91 108 -140 -102 11 190 -45 149 171 -220 -85 -38 1 81 203 178 -106 -69 155 31 195 4
3859 4 -233 157 -151 89 84 -122 -34 -58 169 42 17 -38 214 94 -7 -207 107 33 -17 59 44 -88 35 -264
3883 -264 191 176 101 -49 70 -208 -68 82 -104 40 71 38 -136 -180 -100 205 -129 118 -106 128 118 -133
3905 -133 96 76 -244 178 165 -31 -62 173 -123 -86 -109 168 -57 -216 -65 -138 125 76 51 277 72 -104 157
$$ packed form
3741D0L2j75J37R6k0n8K9Qq8K70l65P1P1J48l10J01J51k9O5l05K02J23l32j9Q4
3766g3J07m9J60j7r8m9J94j63P8l39K57o3QK39k57K1k4L93l44K9l2q0j90K07J89
3791A04N1j40l06O4L18k50J52L2q8J30qJ1n0m8q1J05J42l93J80J28k58P5J51L7
3815E8j70J55k79N43m43L94j96o7j05J8j34J22l2J03J75j54j24J04K18o40M60
3836Fj74K59J7k48L8J13J79k35J94K2l91J35M7L9Q0J22k5k84L7K24j24J64j91
3859Dk37L90l08K40nk06Q8k4K27j27k5n5K52j20j01k00L14p4n0P6j5j32J23k99
3883b64M55j5p5j50J19k78J40J50j86J44L1l3j74m4Q0L05l34K47k24K34j0k51
3905a33K29k0l20M22j3j96l1K35k96L7k3K77k25j59J51p3K63m9k5K26k05j76K61
$$ plain form
3928 157 -77 63 -74 103 2 -88 74 78 -20 -2 72 70 108 146 -41 187 7 90 -66 -179 171 -124 72 144
3952 144 -106 18 28 -30 -315 39 61 -134 33 28 -115 -301 31 38 -80 -132 -213 -294 132 -3 -56 -86 -23 -277
3976 -277 -217 40 -10 78 43 101 -138 -78 -70 -107 -32 -64 5 414 114 63 -149 148 -54 101 39 10 -61 65 37 164
4002 164 -305 -304 -25 115 -22 8 157 -13 -94 247 229 -274 12 207 99 -267 69 106 155 -43 174 -166
4024 -166 -151 -37 217 -65 35 12 134 -38 -170 -72 2 155 -56 141 0 -68 -100 -151 -189 -7 322 286 -236
4047 -236 -88 -158 127 35 45 -252 40 1 168 -1 -139 47 -34 -40 -172 75 145 -135 63 -61 118 -134 -74
4070 -74 -108 -76 -221 23 -23 -98 126 -51 207 260 78 1 -191 -243 -149 -3 71 5 -123 -96 74 180 68 52
4094 52 211 -186 -111 182 -29 130 9 32 55 -166 -139 -197 164 -250 42 42 -6 -113 148 16 345 -4 -171
$$ packed form
3928A57k34J40j37J77j01r0J62Mr8J8P4kL8L8j87K28j80Q3j56j13L50k95J96P2
3952A44k50J24J0n8k85L54K2j95J67nj43j86L32Pj18n2q1q1M26j35n3l0O3k54
3976b77O0K57n0Q8l5N8k39O0Ql7P5l2O9M09l00n1k12K97k02J55o2k9p1J26k8J27
4002A64m69JK79J40j37L0J49j70q1L41j8n03K86J95j08l66L36L7M9j98K17l40
4024a66J5J14K54k82J00k3J22j72j32R8P4J53k11J97j41o8l2n1l8J82L29l6n22
4047b36J48p0K85r2J0k97K92l9J67j69j38J86q1oj32K47P0k80J98j24J79k52O0
4070g4l4L2j45K44m6p5K24j77K58N3j82p7j92n2R4J46P4o6j28K7J70J06j12j6
4094E2J59l97P5K93k11J59j21K3K3k21K7n8L61m14K92%m8j07K61j32L29l49j67
$$ plain form
4117 -171 111 120 74 -239 89 -13 184 -10 -169 2 -104 -129 -161 -67 -166 -213 -107 -49 -26 74 115 83 101 6 160
4142 160 47 34 -151 -42 -154 41 -72 102 14 -156 152 -130 64 -133 -42 -2 -26 -85 208 261 -9 20 202
4165 202 -3 -106 47 12 -41 -102 182 168 -173 -160 -309 75 -239 76 -105 -74 -128 -157 -10 111 120 -99 132
4188 132 43 -54 -120 -62 -115 59 174 -60 -225 -19 -169 168 -27 296 -322 -98 222 36 217 -15 195 -125
4210 -125 470 38 13 -157 133 142 -301 -322 25 180 54 -166 185 11 -57 -61 -165 134 80 129 173 -62 14 102
4234 102 -39 93 -9 -141 -4 -54 80 70 19 -40 42 189 -177 99 77 168 -69 -92 311 96 -214 -190 -232
4257 -232 -169 -28 -38 -81 -197 -18 -3 -60 -306 -267 -148 -156 -81 -22 -86 -90 135 -126 -40 -138 98 105 190 -167 96 -78
4283 -78 1 -235 173 -108 188 -12 9 122 -314 26 23 -68 29 274 -14 236 -200 74 187 141 106 161 -44
$$ packed form
4117a71K82Rm6l13L28j02J97j94j59J71j06k5l2R4r9m7J06N8K3J00M1l2J8r5J54
4142A60j13j3j85J09j12J95j13J74q8j70L08k82J94j97R1M0k4n9K93N3k70K9J82
4165B02k05j03J53l5n3o1K84j4l41J3j49L84l14L15j81L1n4k9J47J21Rk19K31
4188A32q9r7o6N8n3J74J15k34j65K06j50L37j95L23o18K24L20j86J81k32K10l20
4210a25N95m32k5j70K90Rm43k1L47J55j26k20L51j74o8mj04K99n4M9M4k35P6Q8
4234A02j41J32j02j32J37n0J34j0n1n9Q2J47l66K76k2R1k37k3M03k15l10K4m2
4257b32O3J41j0m3j16J79J5n7k46L9J19qP5N9o4mK25k61Q6r8K36PQ5l57K63j74
4283g8P9k36M08k81K96k00K1J13m36L40lr1R7K45k88K50m36K74J13m6l5N5k05
$$ plain form
4306 -44 45 227 249 125 23 134 11 -70 -277 69 -34 138 -100 -123 143 129 -85 25 125 -48 109 -142
4328 -142 38 -17 35 -205 34 -1 124 -5 33 71 -8 -5 -20 -60 58 176 -120 -26 144 98 -92 115 27 171
4352 171 73 -12 -11 -70 -84 -72 -43 -127 155 156 -154 -99 143 85 -59 -92 97 -51 -155 160 38 -90 -63 162 -91
4377 -91 144 96 -252 262 -56 173 -75 170 -54 -184 38 -10 -139 16 -92 -366 -63 -138 -213 50 280 -153
4399 -153 66 -256 -138 -101 35 22 64 -26 -134 50 81 -166 -328 39 -82 -8 21 56 38 40 2 -38 -150 -286
4423 -286 -103 -4 92 66 -83 -29 183 6 28 -121 -190 -139 160 -132 141 259 114 74 19 -108 19 -88 -48
4446 -48 197 99 55 133 22 -21 -178 44 299 -97 -3 -147 127 83 -68 68 -51 -35 178 42 -37 47 -1 -138
4470 -138 -98 -102 -70 168 -203 -75 -214 87 -150 -196 193 -15 -300 -190 -70 112 127 -270 320 0 38 -3 -45
$$ packed form
4306d4Q9J82K2j24j02J11j23q1k07L46j03J72k38k3K66j4k14J10J00j73J57k51
4328a42J80n5N2k40K39l5J25j29L8L8p9Lj5m0J18J18k96R4J70m6j90K07q8J44
4352A71r8q5Jn9j4J2K9q4K82Jl10N5K42n8j44l3J89j48j04L15j22j28K7K25k53
4377i1K35m8l48N14l18K29k48K45k24j30K22m8j29J55j08k74L03p5p5K63K30m33
4399a53K19l22J18L7J36j3M2r0j08J84L1k47j62L67j21P4K9L5j8Kl8m0j12j36
4423b86J83R9R6k6j49N4K12j77K2j49o9N1K99k92K73J18j45m0n5j27J27j07M0
4446d8K45r8m4P8j11m3j57K22K55l96R4j44K74m4j51J36j19J6K13j36p9Q4m8j37
4470a38M0mL2K38l71J28j39L01k37m6L89k08k85J10J20J82J5l97N90l20L8m1m2
$$ plain form
4493 -45 -135 37 -141 99 4 -2 -220 -46 -2 -179 -117 -69 8 -57 -94 -243 -16 -85 180 17 43 206 -246 231
4517 231 47 -35 240 121 137 -170 56 -59 78 -221 187 61 138 46 -23 -113 196 111 39 -249 -185 56 38
4540 38 -117 -62 -59 17 -81 -51 18 -126 31 105 0 -128 97 156 116 98 -95 -29 -22 76 174 209 22 38 198 -128
4566 -128 -100 -15 85 -73 -117 -136 -188 55 23 -229 106 -164 -346 286 76 165 -251 -106 39 89 61 23 173
4589 173 -125 38 70 -120 126 183 11 177 151 -86 -71 -55 242 59 191 126 247 -40 177 205 146 -5 256
4612 256 121 33 195 54 -67 -31 -167 -41 -85 -119 1 -18 57 -84 365 -173 64 -190 -172 174 74 -47
4634 -47 64 85 85 -333 -104 307 42 -192 149 -197 43 -83 -18 5 -88 -75 -65 97 178 -138 -24 -6 258 -162
4658 -162 21 -65 -150 -116 -247 151 -222 87 -8 52 -51 106 -183 -17 -113 100 24 127 156 71 -73 -44 -93 -127
$$ packed form
4493d5r0J72j78K40r5ok18J74M4j77O2M8P7o5l7j49K27o9K65j63K6J63m52M77
4517B31j84q2K75j19J6l07K26j15J37k99M08j26P7r2o9r0L09q5p2k88O4K41j8
4540C8j55N5LP6r8L0O9j44J57P4j05j28K25N9m0j8j93O6PR8R8L5j87J6J60l26
4566a28K8Q5J00j58m4j9n2K43l2k52L35k70j82O32k10Q9m16J45J45N0k8l8J50
4589A73k98J63L2j90K46N7j72J66k6k37J5J6K97j83J32o5J21k87K17K8n9j51K61
4612B56j35q8J62j41j21L6j36J26m4l4J20j9P5j41M49n38K37k54J8L46j00j21
4634d7J11K1%m18K29M11k65k34L41l46K40j26O5K3r3J3J0J62Q1l16J14J8K64m20
4658a62J83q6q5L4j31L98l73L09r5O0j03J57k89J66r6K13p6J03K9q5j44K9m9l4
$$ plain form
4682 -127 -22 133 -232 -161 190 -40 -77 66 -124 43 -54 -173 -66 -219 114 -78 63 13 92 -86 146 -5
4704 -5 -149 -7 -101 -61 73 -85 95 34 83 -72 225 -116 279 -180 -98 185 23 12 3 28 -200 28 191 -70
4728 -70 73 -93 -1 318 -45 235 30 86 14 -262 -201 -92 31 20 -256 18 -206 -39 119 -312 -224 -39
4750 -39 184 163 229 269 -93 16 58 -65 -82 -10 -110 94 8 250 134 -192 -225 -24 -48 -144 63 205 25 13
4774 13 16 -278 -60 57 137 -69 15 176 -111 -74 92 -83 71 64 21 62 219 78 172 9 193 199 41 -24 86
4799 86 -234 103 220 11 -139 -48 147 130 267 91 51 1 190 -124 68 150 95 -14 -147 188 -21 -28 5
4822 5 44 45 -71 -58 18 81 -231 117 -221 55 87 12 -185 -2 -273 -19 28 -58 -1 63 78 -22 58 -135 112
4847 112 27 -113 -63 -233 -34 -25 393 -171 119 189 -76 16 -62 -44 -55 -95 -141 -41 -122 116 113 18 44 24 -25 -41
$$ packed form
4682a27J05J55l65P1L51k30l7J43j90J67r7j19J07j53L33j92J41n0P9j78K32j51
4704ej44J42r4M0J34j58J80o1M9j55K97l41L95m59Q2K83j62j1rK5k28K28J63k61
4728g0J43j66R2L19l63K80k05N6p2k76O1J09J23j1k76K74k24J67J58m31Q8J85
4750c9K23k1O6M0l62J09M2j23j7P2j00K04q6K42j16l26l3K01k4r6K07J42j80j2
4774A3Lk94K18J17Q0k06Q4J61k87L7J66j75J54pm3M1J57j41R4j63J84Oj58o5J10
4799H6l20L37J17k09j50R1J95j7J37j76m0n0J89l14J92Q2n5j09j33L35k09pL3
4822EL9Jj16J3P6O3l12L48l38K76L2p5j97J83k71K54M7q6N7O4J5j00Q0j93K47
4847A12q5j40N0j70J99RM18n64K90P0k65R2p8J8j1m0m6J00q1K38lr5K6k0m9j6
$$ plain form
4873 -41 146 -30 -115 -121 144 142 -12 -55 -160 -78 -77 -205 -8 235 59 -95 -94 102 -137 -31 154 42 -130 -243
4897 -243 144 58 -272 -51 -151 159 -50 -99 -138 -57 199 -176 -25 41 -195 41 73 225 -300 20 12 -336 -183
4920 -183 91 138 -49 9 -136 315 -24 -23 -234 100 139 53 -110 120 -305 -109 -83 -131 104 126 -79 -95 90
4943 90 -15 45 -298 64 -222 224 -160 -12 130 -52 77 21 -49 -128 -145 227 -36 -136 195 175 70 103 -4
4966 -4 -36 -63 -75 -4 -103 -265 39 -27 -139 -137 -90 -14 23 -100 -99 -137 -85 -47 -110 187 4 -126 -18 -267 148 -120
4992 -120 -182 -105 77 -74 -214 -59 17 -33 68 -54 -34 54 30 218 110 -84 43 49 29 -39 -96 206 184 44
5016 44 -153 217 40 138 74 -134 60 -41 10 57 207 24 -74 169 101 -151 -68 97 -63 -44 96 -46 210
5039 210 -145 -291 -132 -396 -24 -150 155 33 -170 -141 215 -126 -5 44 54 3 42 47 47 101 187 143 -55 190
$$ packed form
4873d1J87j76q5oK65kj54m3j05Q2Jj28J97K43j76j54JJ96k39J06J85j12j72j13
4897b43L87q6l30K21j00L10k09m9l9Q1K56l75J51O6k36K36L2J52n25L20ql48J53
4920a83K74M7j87N8j45M51l39Jk11L34L9q6j63K30m25J96K6m8K35K2k05j6J85
4943I0j05O0l43L62k86M46l84J48J42j82J29n6p0p9j7L72k63j00L31k0j05L3j07
4966dl2k7j2P1r9j62L04o6j12KM7P6L7j23Jl8N2L8o3K97j83j30J08k49M15k68
4992a20o2P7J82j51j40J55P6n0J01j22K0Q8k4J88j08j94J27Ok0o8n7L02k2j40
5016D4j97L70j77R8o4k08J94j01N1M7J50j83r8K43o8k52Q3J65j60J9J40j42K56
5039B10l55j46J59k64L72j26L05j22k03K9L56l41J21M9J0n1L9N%N4Q6m4j98K45
$$ plain form
5063 190 -32 66 -92 183 74 71 70 -205 13 299 158 124 -52 -57 79 142 77 -25 113 -246 109 -69 -274
5086 -274 183 -117 136 -186 -314 23 156 -55 292 -60 -48 97 306 125 -33 -199 29 111 38 -234 83
5107 83 -69 -116 342 134 -34 142 18 33 -142 -77 128 -125 -100 184 -325 51 58 -180 197 322 198 70
5129 70 -95 -44 -33 -116 32 -38 107 -65 -90 168 -81 -101 -38 -276 183 -27 210 48 -58 -7 -159 -319 41
5152 41 39 -448 -331 -118 271 -42 79 -132 -150 -127 100 231 89 -27 -92 -156 -117 34 45 90 100 -36 157 64
5176 64 51 178 137 -34 -65 -206 35 -227 30 70 165 278 275 88 -230 29 130 -173 -272 167 50 40 -224
5199 -224 63 -88 -91 134 -101 -102 -62 -63 -191 36 -63 -121 37 250 -219 62 -24 -251 100 65 -193 26 -180 32
5223 32 162 -49 39 -122 -198 -160 157 -102 118 -7 -9 -141 -96 30 -165 -82 166 9 241 -60 -23 114 275
$$ packed form
5063A90k22R8j58K75j09ljk75K18K86j41l4j76nJ36O3o5j02J38l59L55j78k05
5086b74M57l00K53l22j28L37J33k11L47l52J2J45K09j81j58j66K28Q2p3k72L17
5107H3j52m7M58k08j68J76j24J5j75O5K05k53K5K84n09L76Pk38L77J25j24j28
5129G0j65N1J1q3J48p0J45j72k5K58k49k0O3k38M59k10K37j62j06N1j52j60L60
5152D1km87J17K13L89l13J21k11j8K3K27J31j42j16o5o4L9J51J1M5J0j36J93r3
5176F4j3J27m1j71l1j41K41k62K57M0R5J13lj87l18K59J01l03r9M39j17j0k64
5199b24K87j51lK25k35jM0jj28K27r9n8J58K13m69K81q6k27L51l5k58K19k06K12
5223C2J30k11Q8j61p6L8L17k59K20j25kj32M5J26j95Q3K48j57K32l01L7J37J61
$$ plain form
5246 275 33 54 -114 -259 -90 42 -59 72 -62 -174 161 14 92 -133 67 108 -149 -19 -69 -43 75 -215
5268 -215 -290 65 206 -148 -82 -224 -151 33 78 -207 179 -43 -34 22 181 84 125 -237 19 -52 -352 -35 101
5291 101 119 -134 3 -35 -63 4 30 -70 -90 173 234 -118 236 183 -74 -23 36 73 3 -84 100 169 159 -84 -22
5316 -22 -60 218 147 -8 -126 50 127 -73 13 114 -138 -195 171 -12 121 -181 -64 222 11 113 -89 -241
5338 -241 103 102 42 -64 -344 -68 135 242 37 -20 341 -140 -98 -104 3 -114 28 100 172 -174 41 86 -149
5361 -149 -188 21 191 -2 -51 -48 138 -354 -150 -4 -317 35 83 161 -108 -38 253 7 89 -46 81 58 214
5384 214 199 39 -53 -33 4 -277 96 -23 27 218 190 -13 144 -40 -107 43 -157 -165 32 -9 -89 -93 48 -112
5408 -112 -147 245 -153 103 -189 64 117 -112 -24 102 102 -83 -33 118 -81 -52 194 -65 -31 58 39 -67 28 39
$$ packed form
5246B75k42K1j68j45J69J32j01J31j34j12L35j47P8k25K00M1k57J30n0K6J18k90
5268b15p5L55J41l54O6j42P3J84M5k85L86k22RN6J59r7M1l62K56p1l00L17J36
5291A01J8k53J37l8k8O7K6j00k0K63O1l52L54n3k57N1N9L7p0q7J84O9j0k43O2
5316b2l8K78p1j55j18J76P7k00Q6J01k52n7L66j83J33l02J17K86k11J02k02j52
5338b41L44jo0j06k80K76K03J07k05n7L61m81M2oJ07j17J42P2P2l46K15M5k35
5361a49l9K09J70j93m9LJ86m92K04J46l13L52M8P8k69P0K91k46Q2j35J27k3J56
5384B14j5j60r2K0L7k81L73j19N0J91k8k03J57j84o7J50k00qJ97m1q0mJ41j60
5408a12l5L92l98K56k92K53N3k29Q8J26%j85N0J51j99K9K46k59L4Q9j9j06R5J1
$$ plain form
5432 39 82 -144 84 8 -64 -75 42 -185 152 210 -76 293 -42 -176 115 186 131 75 128 -34 81 100 -177 15
5456 15 -35 18 151 -77 146 139 6 -160 -64 263 -18 -30 159 58 -153 -137 130 -29 -75 103 -237 119 64
5479 64 166 -90 -22 -118 37 142 72 160 -323 53 -13 -156 -104 111 -135 -167 419 30 -262 -139 57 343 101
5502 101 108 73 -228 142 -29 -65 31 10 207 -14 -105 -132 141 63 25 -97 100 40 -86 -223 70 -137 -116 24
5526 24 14 -41 -254 30 42 -80 -157 236 2 99 -164 183 298 -88 -23 53 81 -24 62 25 107 196 -6 -17 192
5551 192 146 199 24 -28 135 -15 -252 -116 -26 237 -65 -188 -55 102 -37 -91 182 56 -65 130 160 -186
5573 -186 105 -224 277 49 -51 -73 67 -114 39 -1 -131 33 60 25 183 -101 -313 11 245 145 157 -57
5595 -57 -241 193 -178 -100 -37 -101 -9 79 -93 -49 -114 48 -5 110 -52 153 153 8 -198 -193 -138 175 40 -437 135
$$ packed form
5432C9M3k26K28p6p2j1J17k27L37N8k86L69l35j34K91P1n5n6N3j62J15J9k77J92
5456A5n0N3J33k28K23pj33j66R6L27k81j2J89j01k11J6K67j59m6J78l40L56n5
5479F4J02k56O8r6J55J05p0Q8m83L76o6j43N2K15k46l2N86l89k92J23J96K86k42
5502A01Pl5l01L70j71l6R6k1J97k21r1k7K73p8l8j22J97o0j26j37K93k07K1J40
5526B4j0n5k13K84J2j22p7L93k34R7k63L47J15l86O5P6K8j05Q6l7Q2Q9k02j1K09
5551A92m6N3j75n2J63j50k37J36R0K63l02j23J33J57j39n4K73j26j21J95L0l46
5573a86K91l29N01k28j00k2J40j81J53m0j30J64K7l5J58k84k12L24K34j00J2k14
5595e7j84M34l71P8O3o4R2Q8j72M4o5J62n3J15j62K05%j45k06NN5L13j35m77N72
$$ plain form
5620 135 -136 24 29 126 -60 29 9 -14 18 -193 84 -24 -222 -46 -25 -12 -184 -248 -131 -41 260 201 -78 -221
5644 -221 -203 14 -217 272 49 0 110 206 -173 98 24 -27 67 -23 34 203 37 156 87 155 4 -114 81
5667 81 88 -17 -184 3 61 236 148 111 -51 -122 207 177 217 -201 -25 4 -318 -50 21 202 -72 127 31 98
5691 98 178 -214 -6 -72 24 -202 32 -138 35 -111 154 -18 215 151 95 107 -229 156 -87 -139 31 15 156
5714 156 -53 85 29 43 134 205 169 -147 173 -183 17 -52 -97 88 203 -75 -225 -89 -119 -114 83 90 -62 -24
5738 -24 155 122 -117 117 -53 -139 201 -45 -47 132 -9 155 65 109 -104 -211 180 189 -147 168 126 6 34 -71
5762 -71 157 -126 -232 -3 262 12 216 -240 93 -103 -366 -115 -2 74 -83 75 -86 71 -122 80 204
5783 204 7 -35 45 -181 -182 -1 52 -220 12 -12 -11 -62 234 52 -134 324 -127 55 -116 -14 -87 -290 -154
$$ packed form
5620A35k71J60NR7j86Q9k0k3L2k11K77j08j98J76K1J3j72o4J17R0L01n9k79j43
5644b21J8K17k31M89k23m9J10R6l79K71p4n1R4r0N7J69j66J19o9O8j51j18J95
5667H1Pj05j67J87N8J75q8l7j62p1L29l0M0m18J76K9l22K68P1J81k74J99r6O7
5691I8Q0l92K08o6R6k26K34j70J73j46K65j72K33o4n6J2l36L85k43n2J70j6J41
5714A56k09J38n6J4R1P1l6l16L20l56K00o9m5J85J15k78j50J36l0NJ97Pj52L8
5738b4J79l3k39K34j70q6L40k46kJ79j41J64r0M4k13j07L91Rl36L15m2j20K8j05
5762g1K28k83j06K29K65k50K04m56L33j96k63K51J13P6j57J58j61J57j93K02J24
5783B04j97m2Q0k26jJ81N3k72K32k4Jn1K96j82j86M58m51J82j71J02p3k03J36
$$ plain form
5806 -154 -30 49 226 -3 140 89 37 -92 -19 132 -10 17 -101 -225 -16 -73 -94 -2 15 -107 17 -168 -47
5829 -47 -249 -44 -4 117 117 -136 -8 -23 143 -51 -36 -11 -78 -148 -122 14 -51 -121 149 -39 102 336 -202 287
5853 287 136 101 142 -134 116 103 -79 102 104 -81 83 51 135 -116 -88 -62 68 106 -81 150 50 -76 105
5876 105 -229 162 126 2 157 162 83 136 73 -50 -118 -216 64 62 -95 -77 -186 202 -5 -80 -79 -55 54 -141 119
5901 119 -1 -32 -181 -126 50 32 -160 40 -212 -147 -28 68 25 -290 -48 105 34 153 216 115 -87 65 96
5924 96 88 118 -20 -83 -177 -1 -108 72 -9 -195 78 26 -173 75 -83 206 -39 153 -68 -195 23 151 8
5947 8 -105 41 47 309 79 -212 -140 4 -25 -69 -42 33 -220 -80 -112 27 71 -67 125 50 223 14 -100 199
5971 199 -181 159 26 196 -58 -264 68 -6 23 185 169 305 38 107 45 9 -172 65 141 84 45 70 -137
$$ packed form
5806a54J24P9J77k29J43n1n2j29P3J51j42K7j18j24K09n7k1R2J7j22J24j85J21
5829d7k02K05M0J21%k53J28j5J66j94J5K5o7p0K6J36o5p0K70j88J41K34n38M89
5853B87j51l5M1k76K50j3j82J81Kj85J64l2Q4k51K8K6J30L8j87K31j00j26J81
5876A05l34L91l6j24J55Np9N3o3j23o8r8K80kj57J8j09L88k07p5JK4J09j95K60
5901A19j20l1j49N5J76j8j92K00k52O5J19R6m3l15K42J53p1J19O3j01k02J52L1
5924I6qL0j38o3r4J76j07J80q1j86K73n2j99K48j58K89k45J92k21j27K18J28j43
5947Hj13J46OK62k30k91P2J44k9m4K7P5k53J40l2J39M4j38J92p5J73k09j14K99
5971A99l80L40j33J70k54k06L32p4K9J62j6J36k67O9o2l6j81K37P6n7l9K5k07
$$ plain form
5994 -137 -59 56 88 31 -110 -43 -333 -112 -350 -147 -61 -70 -134 117 -48 230 74 -94 -11 -119 10 144 -32
6017 -32 -101 239 -8 79 -18 -162 -39 -104 78 -265 112 60 116 -79 220 -91 156 -71 2 -14 -28 -71 10 -300
6041 -300 -266 70 -305 110 -12 16 -80 -6 -317 -111 213 36 89 4 -6 -82 -157 105 179 131 77 252 100 117
6065 117 194 -28 -162 131 58 64 11 -44 172 -51 -165 164 94 -233 95 175 29 122 72 -69 39 -95 -24 2
6089 2 -14 98 6 -113 -56 15 -53 -195 1 102 28 130 140 -51 -466 -46 -160 -15 125 115 -156 -19 -184
6112 -184 21 142 -100 -57 -230 90 137 -42 155 100 -14 63 -93 4 -167 197 -270 24 -64 -16 100 -158
6134 -158 104 39 -177 34 -162 -120 -57 -312 27 -18 43 91 182 -69 -68 83 -102 33 15 107 158 53 -125 276
6158 276 92 -147 204 34 -115 -71 148 -15 224 140 2 117 163 -248 126 -13 -224 6 3 29 5 128
$$ packed form
5994a37P8J15L2n7j41O7k90K21k38K03Q6ro4K51j65K78j56j68Q3j08J29J34j76
6017c2o9L40k47Q7r7j44J23o5J82l43L77n2N6j95K99l11K47k27P3j6j4m3Q1l10
6041c00L4L36l75M15j22K8r6P4l11K06L24j77N3q5j0p6p5K62P4m8n4J75j52J7
6065A17P7k22j34K93p3On3n5K16k23j14L29p0l27L28Q0j46R3n0j41J08j34P1K6
6089Bj6J12r2j19N7P1o8j42J96J01p4J02J0j91m15M20j14J45J40j0k71J37j65
6112a84K05J21k42M3j73L20M7j79J97n5j14P7j56R7j71L64m67K94q8M8J16k58
6134a58K62o5k16K11j96M2O3k55L39m5O1M8R1k51JJ51j85J35j8R2N1j05j78M01
6158B76j84k39L51j70j49M4K19j63K39q4j38J15M6m11L74j39k11K30lK6k4J23
$$ plain form
6180 128 -59 157 268 -122 23 -8 -82 -7 71 306 -34 -5 145 158 -57 -237 -17 -155 70 -304 -110 39
6202 39 -114 88 -100 -132 -37 129 33 -86 -159 134 -111 57 -195 -52 5 225 41 -110 -63 173 41 -227
6224 -227 -200 204 18 -129 -91 -70 66 -250 -110 165 108 -23 50 -274 191 68 -158 136 15 -266 -1 -89
6246 -89 -48 105 -293 -78 -81 -25 49 133 150 13 70 -64 83 -47 -15 -84 31 -12 -268 -60 -2 -80 30 -20 41
6271 41 -205 -202 27 -125 76 142 -54 85 -64 418 -26 32 70 -75 -340 -113 9 -200 -89 -269 -60 47
6293 47 255 -25 -100 169 -10 12 4 -61 51 -3 95 9 121 233 -132 -148 101 -158 105 47 39 209 27 105 160
6318 160 304 -102 -85 79 3 71 -241 6 15 76 120 47 -43 34 -343 -73 -113 -10 83 -24 -136 149 -264 -111
6342 -111 209 157 29 202 -187 -22 58 -63 -4 -164 109 -23 3 6 41 -32 107 -20 102 278 57 -63 73
$$ packed form
6180A28j87K16J11l90J45l1p4P5P8K35l40K9J50J3k15j80K20j38K25l74J94J49
6202C9j53K02j88l2R5J66r6j19p3K93k45J68k52J43N7K20j84j51M7K36j32k68
6224b27K7M04j86j47L8K1J36l16J40K75n7j31P3l24M65j23k26K94j21k81K65q8
6246h9M1J53l98K15lN6P4Q4J7j37N7j34J47j30L2o9J15m3k56K08N8p8J10n0O1
6271D1k46LK29j52K01O6j96J39j49M82m44N8L8j45k65K27J22k09J11j80K09J07
6293D7K08k80p5K69j79K2qo5J12n4R8q6J12J12l65j6K49k59K63n8qJ70j82P8N5
6318A60J44m06J7J64p6O8l12K47RO1M4p3r0P7l77K70m0J03R3j07j12K85m13J53
6342a11L20n2j28J73l89J65Q0j21N9j60K73j32K6LL5p3J39j27J22J76k21j20J36
$$ plain form
6365 73 242 -204 -51 -5 77 28 -141 129 -40 -94 46 -131 -257 150 9 183 -127 70 -31 37 -134 -22
6387 -22 36 132 98 -19 83 155 -51 -143 -22 120 -157 20 102 -153 -253 248 -51 19 -190 94 -105 124 59
6410 59 -73 148 55 230 95 -5 167 -3 -208 308 -76 114 22 64 29 -74 -50 -37 87 150 -123 -11 106
6433 106 -2 -21 43 -122 -268 -88 -163 -233 66 161 37 -41 71 -34 274 55 73 20 -39 -56 117 -6 -141
6456 -141 -113 118 -103 53 -214 84 -169 -24 -90 -27 73 -123 26 110 -27 -178 -185 -95 66 -154 165 -190
6478 -190 159 80 3 56 100 -19 -164 21 -73 -150 -32 -28 -76 -105 -75 15 -4 -170 -2 139 229 -85 10 25 -153
6503 -153 -84 21 158 -26 -133 -188 -20 6 -129 -292 -40 105 82 -191 -258 -27 11 -158 -150 -318 -17 39 42 50
6527 50 91 -91 54 -51 180 -196 -224 47 -128 -35 134 -9 -326 -96 -9 -178 -65 1 -208 -184 -50 -96 -58
$$ packed form
6365G3J69m46J53M6Q2m9j69K70j69n4J40j77j26M07j41J74l10J97j01O8j71J12
6387b2N8R6l4j17J02P2k06r2J21J42k77J77Q2k55j00N01k99P0k09K84j99K29o5
6410E9j32K21r3J75j35j00J72j70k05N16l84J90r2M2l5j03K4J3J24O3k73J12J17
6433A06j08j9O4j65j46J80p5p0K99R5j24p8J12j05L08k19J8n3n9j7J73j23j35
6456a41K8K31k21J56k67K98k53J45o6O3J00j96J49Q4j37j51pR0J61k20L19l55
6478a90L49p9p7N3M4j19j45J85r4p7J18Mm8k9L0R0j9j66J68J41R0l14R5J5j78
6503a53O9J05J37j84j07n5J68K6j35j63K52J45k3k73o7K31L8j69Qj68L01N6LQ
6527E0M1j82J45j05K31l76k8K71j75R3J69j43l17K30Q7j69J13O6k09K4J34m6L8
$$ plain form
6550 -58 221 286 -16 -182 84 49 51 -59 -98 -58 -96 45 -227 -43 -140 56 -126 -175 -209 48 144 66 11 41 49 -299
6576 -299 67 -209 135 -41 193 123 -6 22 178 79 -18 -213 94 100 88 -211 77 98 59 -170 23 225 -20
6599 -20 168 -335 -90 133 128 -141 138 -35 -13 124 -38 133 -26 146 255 -39 18 -117 -79 124 96 108 -128
6622 -128 74 -299 -157 -95 119 -211 3 -67 -12 123 129 -62 -88 186 -199 23 167 -58 66 -61 155 -75
6644 -75 -23 61 -141 -154 -234 145 183 62 245 50 77 204 50 -31 249 -77 -19 20 -173 132 221 104 -108 111
6668 111 197 -190 -169 -188 -24 105 -70 -189 58 -63 102 -37 95 72 103 104 -14 41 54 -106 -78 47 83 108
6692 108 159 -173 135 -13 -9 75 -140 27 -51 81 -63 56 -67 -224 -106 30 65 133 -15 34 92 -14 -188
6715 -188 217 -231 -105 109 158 64 -138 28 103 -133 46 -175 -87 -103 -57 218 -21 5 -122 -43 9 96 -188
$$ packed form
6550e8K79O5l02j66K66l5Kj10l9M0l8J41k72J84r7J96j82m9l4K57R6p8n5L0Ql48
6576b99L66k76L44j76K34p0j29K8J56r9r7j95L07Oj2k99K88K1l9k29J93K02k45
6599b0J88n03K45K23nk69K79j73K2J37j62J71j59J72J09k94N7j35L8K03k8J2k36
6622a28K02l73J42O2K14l30K14p0N5J35Oj91k6K74l85K22J44k25J24j27K16k30
6644g5N2Q4k02j3q0L79L8j21J83j95K7J27j54q1K80l26N8L9j93L05Q9j17k12K19
6668A11Q6l87K1j9J64J29j75j19K47j21J65j39J32k3L1Jj18N5J3j60K8J25L6K5
6692A08N1l32L08j48MQ4k15J67p8J32j44J19j23j57J18J36L5O8j48M9N8j06j74
6715a88M05m48J26K14M9r4k02J66P5k36J79k21Q8j6M6K75k39K6j27P9N2Q7k84
$$ plain form
6738 -188 106 158 69 -101 -149 73 104 175 -273 111 -167 -1 9 282 -140 -10 266 -97 248 -53 22 -11 -45
6761 -45 -42 100 -158 -34 -302 -106 -94 56 9 213 12 -121 -110 -117 134 26 -18 121 -26 -198 -3 243 95
6784 95 124 105 21 -53 3 29 48 -252 167 -261 -252 -16 28 -48 57 200 56 12 86 -93 -32 186 -133 92 9
6809 9 -75 -62 33 -18 -38 -88 99 135 -12 -131 68 -105 1 37 -114 -134 12 -98 -210 -84 -66 104 180 63
6833 63 1 92 -187 41 -202 -174 55 -69 -158 148 9 137 27 210 11 -1 -94 -109 -181 121 -142 -83 54
6856 54 31 -74 65 -100 -2 -34 150 81 116 10 -27 180 -208 10 -13 -321 210 6 -116 177 -91 29 174
6879 174 135 30 -174 -16 199 -16 -57 -85 166 47 19 -134 -13 79 107 -79 30 -154 -76 60 26 -133 -161
6902 -161 -169 153 50 86 230 187 -111 -124 -49 20 -204 115 179 191 -107 -6 146 -87 -37 147 -102 90 -137
$$ packed form
6738a88K94N2q9j70m8K22L1P1m48L84k78J66J0K73m22J30K76l63L45l01P5l3l4
6761d5LJ42k58J24k68J96J2J50m7K04k01j33J1pK51j08m4J39j47j72J95K46j48
6784I5K9j9q4p4N6K6J9l00M19m28RK36M4p6J05J43j44m4P4j79O1K18l19K25q3
6809Iq4J3R5n1k0n0J87L6j47j19J99j73J06L6j51k0J46j10j12J26J8J70P6j17
6833F3o2R1k79K28k43K8K29j24q9L06j39J28j10J83j99j2r3j5p2L02k63N9J37
6856E4k3j05J39j65R8l2J84o9L5j06l7K07l88K18k3l08N31k04j22K93k68J20J45
6879A74l9j05k04J58K15k15m1k8K51j19k8j53J21R2K8j86J09j84P8J36l4j59k8
6902a61qL22j03L6J44m3k98j3P5O9k24L19O4J2k98J01J52k33N0J84k49J92k27
$$ plain form
6925 -137 -181 80 -42 138 -14 154 129 -9 -15 -46 169 -40 -28 0 11 5 141 -70 -327 167 64 50 -231 38
6949 38 -85 -72 176 -109 -155 -491 8 -45 167 85 -110 -66 35 65 -219 -134 2 23 141 26 81 -97 195
6972 195 -57 72 -113 -101 150 -51 47 60 117 115 99 42 124 63 -4 -43 -286 -211 -47 12 -260 7 228 -127 -84
6997 -84 -86 -32 -140 -83 154 -237 22 17 94 145 97 217 271 36 -51 8 -126 209 -68 -82 80 -204 84 85 13 -98
7023 -98 -212 104 79 62 207 -64 41 67 -146 -27 -101 -94 -125 -142 -88 -120 -3 -136 159 217 112 94 298 -111
7047 -111 69 131 239 151 -26 -11 -88 -153 -3 64 -109 -197 179 -21 -268 -120 87 26 161 287 -47 39 145
7070 145 89 49 -95 -89 29 89 24 218 -118 -126 -130 8 -192 -42 0 -70 147 -55 -131 -101 189 147 -6 -115 -34
7095 -34 4 133 -78 -199 -161 -97 36 -239 -173 165 -173 -96 156 94 133 -208 -32 -166 25 39 65 -59 -147 41
$$ packed form
6925a37m4K61j22J80j52J68k5j38ol1K15k09J2K8J1oJ36k11k57M94j03j4k81K69
6949C8j23J3K48k85m6l36M99n3K12q2j95M4J01L0k84Q5J36K1J18j15N5j78K92
6972A95k52J29j85J2K51k01R8J3N7kj6n7Q2o1o7l9k43P5J64N9k72K67K21l55M3
6997h4kN4j08N7K37l91K59nP7N1m8J20N4k35q7N9j34L35k77j4J62k84K88Jp2j11
7023i8j14L16k5j7J45k71J05K6k13J19p4Pl1j7N4l2J17j33K95N8j05j8K04m09
7047a11J80O2J08q8j77J5p7o5J50O7j73q8L76k00k47J48K07o1J35J26l34Q6J06
7070A45n6m0j44OJ18O0o5J94l36qmJ38k00J50M2p0K17k02p6L0K90m2j53j09Q1
7095c4L8J29k11j21L8O4J33k75O6L38l38P7K52o2L9l41J76j34J91J4K6j24q8J88
$$ plain form
7119 41 -91 -130 98 44 22 -266 119 -191 -147 -63 -112 -335 -240 -178 -24 28 188 49 64 -95 40 -187 59 -165
7143 -165 -42 137 -87 -183 -130 2 -126 82 -254 9 -10 -31 -15 -174 -59 -106 144 -16 -14 -42 84 11 -143
7166 -143 211 47 -285 28 -2 -223 147 -107 -243 143 -55 43 -105 -187 -3 -91 -4 -85 -75 167 120 -82 -77
7189 -77 -225 -15 -157 -3 -14 17 251 203 -9 179 -27 -42 47 -50 -249 -358 -207 293 -10 -236 50 101 -88
7212 -88 -210 282 82 -119 -191 -51 -276 -249 87 20 -5 -21 -62 111 -146 -129 64 -135 -28 -69 -105 -46 -240 53
7236 53 -1 232 -157 47 -265 54 -245 5 62 -117 22 124 -274 21 -78 49 -401 159 135 -172 325 -2
7258 -2 -81 -129 -83 259 -44 -76 -48 -306 250 -235 -4 133 -88 34 -91 -136 -12 21 16 -162 -51 -45 -77 236 75
7283 75 75 88 35 242 -186 -90 10 191 30 183 -26 -59 -118 -59 -123 172 -205 180 85 -137 198 40 -120 61
$$ packed form
7119D1j32l9K28n4k2k88L85l10M4Q4m9k23R5O2J54N2J60j39J5j59J35k27K46k24
7143a65J23J79k24r6N3J32j28K08l36K63j9k1J6j59J15m7K50j60Kk8J26p3j54
7166a43L54j64l32L13l0k21L70k54j36L86j98R8j48q2J84q8Q7q1J0K42m7k02N
7189g7j48K10j42J54j1L1K34m8k12J88k06j5Q9r7j99j09J51N00l03k26K86N1j89
7212h8j22M92k00k01p2J40k25K7L36o7k5j6m1J73k57J7J93j99J07m1l6N9j94K93
7236E3n4K33l89K04l12L19k99K50N7j79J39J02l98K95r9J27m50N60k4l07M97l27
7258bp9m8M6L42l03l2K8k58N56m85K31J37k21J22j25m5J24L3nj78J11Ol2L13j61
7283G5%J3n3K07m28R6J00J81j61J53k09l3n9N9o4K95l77L85r5k22L35j58j60J81
$$ plain form
7307 61 71 -52 -33 -43 18 83 34 -195 -46 0 36 23 -32 -12 135 55 -46 -43 -13 -4 112 -33 38 134 -12 -185 22
7334 22 -272 125 147 253 -127 -4 124 -28 138 218 -26 154 69 -272 -226 111 -5 -131 -1 53 166 -16
7356 -16 4 -1 25 64 80 224 -77 -32 -92 64 55 -42 -120 49 33 60 -292 173 114 45 -61 -174 22 64 -135 6
7382 6 -17 92 168 100 248 143 72 100 120 -1 -16 -41 211 -65 76 97 -25 -167 108 -8 -42 81 -107 127
7406 127 93 164 145 148 -168 -99 94 45 190 23 99 -15 -66 106 -43 322 -229 -119 -68 131 -12 -53 1 99
7430 99 124 -78 -10 -98 -48 -14 44 171 -53 8 -47 97 131 118 226 -15 13 -175 5 91 41 -124 -74 -113 85
7455 85 -152 33 -41 196 138 -241 174 -102 51 -157 -26 109 -216 -91 113 -171 -182 24 -8 23 6 -43 19
7478 19 -12 -7 318 -214 28 -85 168 -125 -6 -65 -236 -115 -29 40 49 -123 71 287 108 -66 -76 -25 19 1
$$ packed form
7307F1J0j23J9j0O1O5m9k29J49M6L6j3n5K0J47q0j01LL0RJ16j45P1R6j46j73K07
7334B2k94L97K2J06l80J23J28j52J66Q0k44J80q5l41M6L37j16j26J30N4J13j82
7356a6K0nK6L9J6J44l01M5o0J56rr7p8J69j6K7l52M65n9o9j06j13J96M2j99J41
7382Fk3J09P6o8J48j05p1K8K0j21j5k5K52k76J41K1j22j42K75j16l4J23j88K34
7406A27l4P1j9Ll16O9J93m9J45j67P6j14n1J72j49L65n51J10N1J99j43m1N4R8
7430I9K5k02O8q8N0L4N8J27k24O1n5J44L4j3J08k41K8j88J80Q6n0j65N0l9J98
7455H5k37J85p4K37n8l79M15k76J53k08J31J35l25J25K04k84j1K06l2L1j7m9O2
7478A9l1NL25n32K42j13K53k93J19n9j71J21Q6O9Rj72J94K16j79j74j0N1M4j8
$$ plain form
7502 1 -156 20 231 -205 -131 157 148 105 -96 74 60 12 -202 -390 30 47 -79 87 34 -120 58 -379 -25
7525 -25 160 1 -88 -202 79 -141 247 -80 182 -141 -171 -24 -155 170 72 -36 -16 -150 29 90 -40 256
7547 256 47 -116 4 134 53 -2 -81 -25 -23 -44 68 151 160 152 280 37 126 -1 102 -157 19 -18 -248 -2 40
7572 40 70 -175 -2 -29 28 -115 179 -96 -62 -115 -161 179 59 44 -48 -296 66 40 -75 -113 -21 -9 -14 -133 71
7597 71 144 125 -22 240 -74 -64 -4 176 34 -213 -73 38 -143 337 -199 75 322 -252 236 -56 -39 -1
7619 -1 -101 -75 -124 -9 -2 -54 90 -75 -66 39 -3 -9 -61 52 -33 11 -14 -170 -235 4 241 -40 213 242 25 -149
7645 -149 -22 -79 -239 19 71 88 -204 114 -132 107 -74 -72 137 170 112 218 149 -96 306 -129 -42 -142 96
7668 96 0 -33 -63 134 -143 204 -261 9 -53 283 71 -11 197 -134 -131 -63 123 -113 204 120 5 292 112
$$ packed form
7502Aj57J76K11m36P4K88rm3k01J70j4m8k14j88M20J7j26J66n3j54J78m37L54
7525b5J85j59q9j14K81k20L88l27K62l23l0J47j31L25r8j08K0j34J79O1j30K96
7547B56k09j63J20J30q1n5p9N6Kk1J12Q3RqJ28k43Q9j27J03k59J76l7k30K46M2
7572D0L0k45J73k7N7j43K94k75L4n3m6L40j20j5r2k48L62k6j15l8R2J2nj19K04
7597G1P3j9j47K62l14J0O0J80j42k47J40J11j81M80n36K74K47n74M88k92J7L8
7619aj00K6m9J15Pn2J44j65RJ05m2on2J13q5M4k5j56o5K39K37k81K53K9k17j74
7645a49J27n7j60K58N2J7k92L18k46K39j81KK09L3n8J06o9k45M02m35Q7j00K38
7668I6r6l3l0J97k77L47m65K70o2L36k12q2K08l31LO8J86k36L17q4j15K87j80
$$ plain form
7691 112 156 -107 -89 100 -153 -230 -27 84 -164 49 -8 4 153 -335 40 -349 200 40 5 -64 -136 91 -175
7714 -175 -120 73 -92 -68 -11 22 83 -54 -86 21 196 -185 7 -22 -10 -196 -152 187 119 -97 132 -234 206
7737 206 -145 70 44 106 158 230 -36 -34 -67 72 -229 -140 -148 -26 126 -193 -2 -78 -102 -73 8 -215 -64 -60 -194
7762 -194 -153 -272 33 -221 -67 215 -14 40 135 -23 -277 47 -166 32 0 -41 20 -90 112 -134 -5 122
7784 122 113 -68 45 30 35 43 -2 -88 -150 -126 54 -241 -29 69 -50 -218 126 44 88 -73 -102 179 126 -94 -206
7809 -206 -80 -50 -62 -216 92 -14 5 118 -98 -197 39 114 -52 -17 76 -26 -100 20 -88 -140 -112 -200 -45 224
7833 224 -4 54 214 106 31 -347 -109 13 -287 233 5 113 81 4 -66 -3 -147 -121 -201 93 316 79 63
7856 63 -107 -62 -72 -115 -246 8 257 -17 30 153 78 -136 104 -96 68 -10 121 -196 -123 -72 -137 262 29
$$ packed form
7691A12M4k63J8J89k53p7K03J11k48K13n7J2J49m88L75l89N49j60l5o9p2K27k66
7714a75N5J93j65K4N7L3O1j37l2J07J75l81J92k9J2j86M4L39o8k16K29l66M40
7737B06l51K15k6O2N2P2k66Kl3J39l01Q9qJ22J52l19J91p6k4K9Q1k23J51Mj34
7762a94M1j19L05k54J54K82k29N4R5j58k54L24k13J98l2m1O1j10K02k46J29J27
7784A22rj81J13j5NQm5q6o2K4J80k95K12R8j19j68L44q2M4j61k9K81n3k20j12
7809b06J26L0j2j54L08j06J9J13k16r9K36P5j66L5R3j02p4J20j08n2K8q8J55K69
7833B24k28N8J60j08p5l78K38J22l00N20k28J08l2p7p0O3j44K6q0K94K23k37j6
7856F3j70M5j0m3j31K54K49k74M7J23p5k14K40k00J64p8J31l17P3N1o5L99k33
$$ plain form
7879 29 90 99 -123 -84 33 75 9 -50 28 -170 249 -106 193 81 -177 59 117 -74 -279 209 66 57 -65 51
7903 51 109 57 53 42 268 2 46 272 182 86 59 -36 -149 -187 -123 -119 -131 67 -122 27 57 223 -111 -120 -105 -31 -42
7930 -42 -121 -70 -107 108 59 30 206 113 135 -30 92 -145 -159 43 -10 -44 -94 -263 99 55 -97 11 261 23
7954 23 -52 304 -102 153 -24 -176 -41 5 -11 50 -39 -221 62 -49 275 -43 148 155 -46 -188 -95 111 -94
7977 -94 119 44 108 37 -153 -23 -49 -85 28 52 -116 -52 40 16 -66 107 -35 -134 -250 63 47 -102 115 52 -13
8002 -13 58 -156 -383 34 115 70 121 50 -255 18 -226 -226 -63 287 195 -98 -319 -223 26 -5 -59 75 -27 230
8026 230 174 -65 145 -20 -14 -99 -5 -80 -50 -233 22 -51 -15 -111 22 20 -38 -20 -119 212 -135 -94 -39 1 -142 44
8052 44 -153 -106 84 -162 -127 -40 140 101 -199 -10 51 -234 -290 -8 -136 -27 -259 -86 64 -246 -101 181
$$ packed form
7879B9O1Rk22L9J17M2o6n9P8j98M19l55K99j12k58K36N8j91k05M88j43rj22J16
7903E1N8n2mj1K26k66M4K26r0r6k7r5j13l8O4Mj2J98j89J49L0J66l34rJ5P4j1
7930d2p9N1l7K15m9k9J76r3K2j65J22k37j4K02n3l4n0j69L62m4j52J08K50k38
7954B3p5L56m06K55j77j52J35M6j6O1q9j82K83j11L24l18J91Pk01j42R3K06k05
7977i4K13p5O4p1j90J30k6l6J13K4j68O4R2k4q2J73j42r9j16L13j6j49K17o3o5
8002a3P1k14k27M17Q1m5N1p1l05K73k44%J63L50r2k93k21R6K49l1n4J34j02K57
8026B30n6k39K10j65Oq5R4p5L0j83K55p3L6r6J33kn8J8r9L31l47M1N5M0j43J86
8052D4j97M7J90k46L5Q7J80l9l00J89O1k85n6K82j28J09k32J73J50l10J45K82
$$ plain form
8074 181 -97 -73 4 -31 -57 -31 -165 2 121 -92 116 -95 -4 33 89 55 -65 -62 -83 67 -192 -133 -34 104 57
8099 57 42 79 70 44 -91 -53 63 117 -69 -68 -15 184 -211 -43 120 -102 149 160 7 22 29 -243 8 -328 -102
8124 -102 -279 -215 156 24 -325 -129 27 -197 227 40 -119 18 -16 -47 -142 -264 -120 82 99 -144 213 248
8146 248 82 181 -42 -62 53 -140 -259 124 -121 1 -23 57 284 222 87 185 85 -25 -107 181 -31 -274
8168 -274 117 68 89 186 0 126 -146 185 75 100 -70 49 137 1 17 -140 -25 -109 149 -244 -200 104 -25
$$ packed form
8074A81k78K4P7l5k6K6j34J67J19k13K08k11R1L7N6l4j20Lk1J50k59N9R9J38m7
8099E7j5L7rk6j35L8J16N4j86JN3J99l95J68J63k22K51J1j53J5Pk72K51l36K26
8124a02j77O4L71j32l49J96J56k24M24j87j59J37l4l1r5j22J44K02J7k43L57L5
8146B48j66R9k23k0J15j93j19L83k45J22k4Q0K27o2j35R8j00j10q2K88k12k43
8168b74L91m9K1R7j86J26k72L31j10K5j70J19Q8j36J6j57J15q4K58l93M4L04j29
8191b5
$$ Imaginary data points
##PAGE= N=2
##DATA TABLE= (X++(I..I)), XYDATA
$$ plain form
0 0 0 0 0 0 0 0 0 0 0 0 0 0 0 0 8 -8 8 -8 8 -16 16 -16 24 -24 32 -34 40 -48 56 -64 72 -81 95 -105 120 -136
36 -136 152 -170 189 -213 237 -261 292 -324 357 -393 433 -481 529 -582 642 -707 780 -860 950
55 950 -1052 1168 -1301 1454 -1636 1855 -2122 2461 -2899 3500 -4371 5762 -8338 14767 -70316
70 -70316 -72638 12200 -39506 -26818 -35980 -80126 -66636 -4488 -21954 -32645 -17499 -21956 -22940
83 -22940 530 -14982 -23388 -615 11528 12782 21376 2346 -11136 4033 14111 19298 31351
96 31351 13768 -4315 5876 7605 3108 17277 11651 -7038 670 2102 -13838 -7038 -4042 -19236
110 -19236 -11086 -1568 -21571 -26264 -18223 -28975 -26836 -10861 -21529 -32322 -25026 -30067 -32809 -18249
124 -18249 -19594 -28767 -20855 -19682 -25510 -17431 -13656 -18493 -10957 -5242 -9687 -5878 -2401 -5600 1539
$$ packed form
0@%%%%%%%%%%%%%%Qj6J6j6J6k4L2l2M0m8N6o6P4q8J04j20J36j53J76k00K25k56
36a36K88l22L59m02M50m98N53o16O81p50Q26r14J010j111J224j349J487j640J810
55I50k002K220k469K755l090L491l977M583n360O399p871J0133j4100K3105q5083
70g0316k322Q4838n1706J2688r162m4146J3490O2148j7466j0691J5146m457r84
83b2940K3470j5512q406K2773J2143J254Q594j9030j3482J5169J0078N187J2053
96C1351j7583j8083J0191J729m497J4169n626j8689P708J432j5940O800K996j5194
110a9236Q150R518k0003m693Q041j0752K139J5975j0668j0793P296n041k742J4560
124a8249j345r173P912J173n828Q079L775m837P536N715m445L809L477l199P139
$$ plain form
139 1539 8184 4262 7283 10638 5869 8822 15398 11111 11001 14384 9185 8194 12824 7692 4265 8208
155 8208 3151 -1712 2016 -1735 -8073 -4916 -6483 -13145 -10672 -10880 -16855 -14844 -13159 -18362 -17426 -13623
171 -13623 -17280 -16557 -12272 -14769 -14230 -9525 -10283 -10323 -5857 -5895 -6115 -1886 -1381 -1804 1965 2580 1642 4630
189 4630 5374 4179 6538 7200 5740 7558 8130 5671 7485 8586 6328 6544 7363 4679 4824 6207 3726
206 3726 3008 4237 1684 646 1794 -5 -1857 -614 -1502 -3507 -2631 -3771 -5209 -4564 -4924 -6811
222 -6811 -6231 -5729 -6854 -6009 -4977 -6230 -5622 -4729 -4751 -3886 -2377 -2556 -1687 -225 -209 674 2410 2438 3021
241 3021 4734 4663 4608 5268 5435 5253 6677 6440 5312 4859 4893 3707 4166 4270 2577 2121 1868 519 249
260 249 30 -1177 -1408 -840 -1182 -1943 -2135 -3032 -2795 -1291 -1364 -1640 -1667 -2360 -1809 -849 -283 -499 -491 -937 -434
$$ packed form
139A539O645l922L021L355m769K953O576m287j10L383n199r91M630n132l427L943
155H208n057m863L728l751o338L157j567o662K473k08n975K011J685n203R36L803
171a3623l657P23M285k497N39M705p58m0M466l8k20M229N05m23L769O15r38K988
189D630P44j195K359O62j460J818N72k459J814J101k258K16Q19k684J45J383k481
206C726p18J229k553j038J148j799j852J243q88k005Q76j140j438O45l60j887
222f811N80N02j125Q45J032j253O08Q93k2Q65J509j79Q69J462J6Q83J736K8N83
241C021J713p1n5O60J67j82J424k37j128m53L4j186M59J04j693m56k53j349k70
260B49k19j207k31N68l42p61j92q97K37J504p3k76k7o93N51R60N66k16Qm46N03
$$ plain form
281 -434 -59 -184 -756 -523 14 226 328 -392 -1274 -977 -9 551 160 -127 -1051 -830 237 567 672 386
301 386 212 675 1591 1462 1138 1056 1508 2311 2555 2148 1391 1079 1613 2043 1955 1558 337 237 573 685 436
322 436 -295 -1048 -680 -671 -504 -1003 -1363 -1721 -972 -623 -1147 -1372 -1486 -1422 -724 40 -646 -1355 -1507 -1190 -872
343 -872 -194 -588 -1291 -1362 -1027 -783 -1032 -1244 -1542 -1185 -854 -712 -942 -1416 -729 39 473 888 429 563 1020
364 1020 2153 2580 2755 3163 2658 3268 3915 4008 3762 3525 3853 3289 3606 3181 2570 2132 1983 2127 1326 568
384 568 -362 -1089 -1013 -1210 -1410 -2015 -2671 -3028 -3068 -3078 -3047 -3156 -3130 -2725 -2561 -2250 -1957 -1592 -1107 -727 191 842
406 842 496 907 1602 2176 3190 3445 3268 3721 3911 4308 4578 4699 4673 4755 5219 5000 4777 4880 4934 4726 5005
427 5005 4801 4244 3918 3478 3148 3410 2976 2574 1718 1657 665 344 -346 -575 -977 -1293 -1525 -1822 -2495 -2896
$$ packed form
281d34L75j25n72K33N37K12J02p20q82K97R68N60l91k87r24K21J067L30J05k86
301C86j74M63R16j29l24q2M52Q03K44m07p57l12N34M30q8l97j221j00L36J12k49
322D36p31p53L68RJ67m99l60l58P49L49n24k25j14O4O98P64o86p09j52L17L18
343h72O78l94p03p1L35K44k49k12k98L57L31J42k30m74O87P68M34M15m59J34M57
364A020J133M27J75M08n05O10O47R3k46k37L28n64L17m25o11m38j49J44q01p58
384E68r30p27P6j97k00o05o56l57m0j0L1j09K6M05J64L11K93L65M85L80R18O51
406H42l46M11O95N74J014K55j77M53J90L97K70J21k6Q2M64k19k23J03N4k08K79
427E005k04n57l26m40l30K62m34m02q56o1r92l21o90k29m02l16k32k97o73m01
$$ plain form
447 -2896 -2753 -2644 -3233 -2782 -2841 -2811 -2014 -1636 -1755 -1223 -431 -93 722 1597 2221 2850 3756 4169 4769 5461 6212
468 6212 6191 7145 7535 7273 7386 7778 7387 7024 7110 6674 5720 5412 5129 4253 3516 2899 2165 1637 769 179 -624
489 -624 -936 -1467 -1982 -2478 -2838 -2801 -3304 -3289 -2878 -3423 -3146 -2823 -2485 -2509 -1969 -1954 -1516 -534 -44 -278 499 1030
511 1030 1057 1748 2757 2960 2764 3550 3881 4199 4871 4902 4836 5063 5457 5418 5584 5073 4706 5129 4852 4487 3942
532 3942 3620 3070 2576 2096 1470 821 -81 -754 -1083 -1569 -2504 -3045 -3676 -4053 -4019 -4343 -4953 -4888 -4779 -4761 -4481
553 -4481 -4054 -4317 -3804 -3222 -2643 -1946 -1005 -868 -568 679 1283 1685 2545 2584 2764 3517 4028 4108 4571 4672
573 4672 4032 4373 4109 3602 3557 3305 2654 2527 1832 853 609 413 -89 -599 -864 -1668 -2226 -2232 -2644 -3230 -3251
594 -3251 -3849 -4235 -3661 -4183 -4543 -3922 -3946 -4463 -4089 -3721 -4256 -3962 -3434 -3284 -2691 -2220 -2408 -2268 -1494 -1200
$$ packed form
447b896J43J09n89M51n9L0P97L78j19N32P92L38Q15Q75O24O29R06M13O00O92P51
468F212k1R54L90k62J13L92l91l63Q6m36r54l08k83q76p37o17p34n28q68n90q03
489f24l12n31n15m96l60L7n03J5M11n45K77L23L38k4N40J5M38R82M90k34P77N31
511A030K7O91J009K03j96P86L31L18O72L1o6K27L94l9J66n11l67M23k77l65n45
532C942l22n50m94m80o26o49r02o73l29m86r35n41o31l77L4l24o10O5J09J8K80
553d481M27k63N13N82N79O97R41J37L00J247O04M02Q60L9J80P53N11Q0M63J01
573D672o40L41k64n07m5k52o51j27o95r79k44j96n02n10k65q04n58om12n86k1
594c251n98l86N74n22l60O21k4n17L74L68n35K94N28J50N93M71j88J40P74K94
$$ plain form
614 -1200 -1107 -138 18 91 1100 1362 1226 1685 1949 2126 2750 3010 2232 2705 2691 2128 2330 2251 1489 924 831
635 831 414 170 -425 -1184 -1736 -1983 -2508 -2778 -3152 -3742 -3919 -3855 -4474 -4585 -4461 -4508 -4481 -4147 -4225 -3760 -3158 -3095
657 -3095 -3002 -2117 -1975 -1832 -692 -450 -544 -16 403 319 956 1370 1221 1700 1790 1577 1616 1893 1878 1442 1410 1005
679 1005 900 913 810 429 266 88 -293 -165 -205 -556 -587 -703 -1130 -1082 -858 -1516 -1544 -1610 -1764 -1682 -2010 -2110
701 -2110 -2308 -2238 -2260 -2178 -1972 -2305 -2053 -2126 -1655 -1761 -1481 -1394 -882 -456 -464 -632 58 544 504 853 934 993 1313
724 1313 1450 1427 1638 1803 1434 1478 1620 1353 1158 1126 1194 968 523 388 230 130 -180 -269 -566 -621 -824 -826 -723
747 -723 -860 -1070 -1147 -1055 -893 -1001 -527 -630 -770 -533 -393 -282 -462 -25 2 69 104 77 89 266 191 76 242
770 242 116 -233 134 159 -258 -62 -125 -223 -191 110 11 236 87 636 369 623 628 580 746 649 1113 904 760
$$ packed form
614a200R3R69J56P3J009K62j36M59K64J77O24K60p78M73j4n63K02p9p62n65r3
635H31m17k44n95p59n52k47n25k70l74n90j77O4o19j11J24m7K7L34p8M65O02O3
657c095R3Q85J42J43J140K42r4N28M19q4O37M14j49M79R0k13L9K77j5m36l2m05
679A005j05J3j03l81j63j78l81J28m0l51l1j16m27M8K24o58k8o6j54Q2l28j00
701b110j98P0k2Q2K06l33K52p3M71j06K80Q7N12M26qj68O90M86m0L49Q1N9L20
724A313J37k3K11J65l69M4J42k67j95l2O8k26m45j35j58j00l10q9k97n5k03kJ03
747g23j37k10p7R2J62j08M74j03j40K37J40J11j80M37K7O7L5k7J2J77p5j15J66
770B42j26l49L67K5m17J96o3r8L2L01r9K25j49N49k67K54Nm8J66r7M64k09j44
$$ plain form
793 760 608 774 685 921 806 667 521 419 367 332 131 -55 -16 -213 -316 -469 -591 -586 -690 -663 -590 -638 -781
816 -781 -785 -540 -456 -387 -140 -351 -440 -246 -434 -382 -359 -244 -269 -235 -203 -366 -124 -440 -455 -103 -187 -67 -358 -183
840 -183 -5 -95 90 309 462 588 686 814 884 879 1046 1159 994 1112 948 934 849 1146 977 646 491 535 71
863 71 -253 -300 -751 -736 -963 -770 -1357 -1600 -1561 -1706 -1449 -1893 -1779 -1766 -1606 -1501 -1420 -1164 -944 -727 -778 -524 -33
886 -33 -31 129 193 482 814 612 1021 1006 1228 1267 1271 1344 1083 1014 1021 1083 1291 1087 764 857 1136 778 653 521 243
911 243 204 215 214 -131 -220 -238 -492 -520 -623 -695 -1053 -948 -1082 -1106 -927 -1227 -1466 -1131 -1283 -1231 -1368 -1234 -1054 -1173
935 -1173 -592 -620 -479 -9 246 70 393 632 836 1060 1240 1550 1657 1670 2272 2390 1973 2313 2203 2333 2093
956 2093 2065 1933 1642 1364 1145 955 973 650 361 404 -32 -381 -407 -271 -1032 -489 -833 -1039 -934 -1123 -801
$$ packed form
793G60j52J66q9K36j15j39j46j02n2l5k01j86L9j97j03j53j22Nj04K7P3m8j43
816g81mK45Q4O9K47k11q9J94j88N2K3J15k5L4L2j63K42l16j5L52q4J20k91J75
840a83J78r0J85K19J53J26R8J28P0nJ67J13j65J18j64j4q5K97j69l31j55M4m64
863G1l24m7m51J5k27J93n87k43L9j45K57m44J14J3J60J05Q1K56K20K17n1K54M91
886c3KJ60O4K89L32k02M09j5K22L9MP3k61o9PO2K08k04l23R3K79l58j25j32k78
911B43l9J1jl45q9j8k54k8j03p2l58J05j34k4J79l00k39L35j52N2j37J34J80j19
935a173N81k8J41M70K55j76L23K39K04K24J80L10J07J3O02J18m17L40j10J30k40
956B093k8j32k91k78k19j90J8l23k89M3m36l49k6J36p61N43l44k06J05j89L22
$$ plain form
977 -801 -799 -982 -738 -611 -288 -577 -328 64 215 262 626 673 932 906 1185 1393 1406 1383 1901 1781 1731 2141 2009
1000 2009 2109 1906 1969 2188 2013 2330 2007 1758 1807 1705 1743 1528 1482 1074 1067 1092 774 668 533 250 -16 -103
1022 -103 -198 -443 -346 -566 -665 -893 -638 -770 -950 -844 -743 -593 -700 -422 -245 -385 -24 446 712 845 1203
1043 1203 1330 1432 1553 1812 2215 2295 2202 2539 2517 2237 2341 2207 2371 2068 2069 1728 1391 1723 1489 1162 820
1064 820 620 544 373 44 -11 -184 -234 -530 -385 -540 -426 -684 -558 -553 -735 -781 -325 -354 -428 -78 -253 -207 -141
1087 -141 104 191 238 143 325 284 780 449 1019 933 988 1229 1186 1070 1434 1439 1485 1639 1317 1465 1403 1371 1347 1360 1264
1112 1264 1496 1170 813 748 493 131 328 67 -474 -367 -419 -757 -724 -861 -968 -1104 -986 -1392 -1045 -1051 -1072 -702
1134 -702 -968 -1151 -832 -465 -321 -233 -244 435 358 600 418 556 830 780 843 769 631 1011 986 941 738 687 699
$$ packed form
977h01Kj83K44J27L23k89K49L92J51M7L64M7K59k6K79K08J3k3N18j20n0M10j32
1000B009J00k03O3K19j75L17l23k49M9j02L8k15m6m08pK5l18j06j35k83k66q7
1022a03r5k45R7k20r9k28K55j32j80J06J01J50j07K78J77j40L61M70K66J33L58
1043A203J27J02J21K59M03Q0r3L37k2k80J04j34J64l03Jl41l37L32k34l27l42
1064H20k00p6j71l29n5j73n0k96J45j55J14k58J26Nj82m6M56k9p4L50j75M6O6
1087a41K45Q7M7r5J82m1M96l31N70q6N5K41m3j16L64NM6J54l22J48o2l2k4J3r6
1112A264K32l26l57o5k55l62J97k61n41J07n2l38L3j37j07j36J18m06L47ok1L70
1134g02k66j83L19L67J44Q8j1O79p7K42j82J38K74n0O3p4j38L80k5m5k03n1J2
$$ plain form
1157 699 689 566 387 570 400 313 394 164 -82 -170 -41 -193 -433 -297 -3 -538 -398 -370 -694 -479 -287 -475
1179 -475 -667 -475 -466 -646 -734 -463 -390 -517 -597 -526 -337 -339 -439 -234 -386 -387 -57 116 -125 -46 455 601 65 334
1203 334 559 441 560 524 402 549 409 460 181 445 497 286 612 96 337 -56 -59 43 -302 -201 -201 -213 -329
1226 -329 -252 -305 -637 -592 -238 -220 -448 -95 -169 -195 -99 -51 -165 98 224 237 42 25 85 56 179 52 234 310
1250 310 173 -245 -54 -78 -99 -371 -148 -149 -501 -23 -157 -240 47 266 -82 122 137 143 145 234 129 363 258 370
1274 370 409 378 133 351 281 237 333 22 419 170 -154 306 -2 -138 -198 -218 -179 35 -232 -493 -195 -202 -263 -324
1298 -324 -20 -165 -96 34 39 -53 -270 99 96 -135 -51 48 135 271 48 201 217 -205 104 120 309 319 138 55
1322 55 89 203 138 60 312 272 221 299 274 138 304 589 460 217 518 211 394 -69 77 213 299 194 22
$$ packed form
1157F99j0j23j79J83j70q7Q1k30k46q8J29j52k40J36K94n35J40K8l24K15J92j88
1179d75j92J92Rj80q8K71P3j27q0P1J89kj00K05j52jL30J73k41P9N01J46n36K69
1203C34K25j18J19l6j22J47j40N1k79K64N2k11L26n16K41l93lJ02l45J01%j2j16
1226c29P7n3l32M5L54J8k28L53p4k6R6M8j14K63J26J3j95j7O0k9J23j27J82P6
1250C10j37m18J91k4k1k72K23jl52M78j34q3K87K19l48K04J5OKQ9j05K34j05J12
1274C70L9l1k45K18p0m4R6l11L97k49l24M60l08j36o0k0L9K14k67k61K98po1o1
1298c24L04j45O9J30Nr2k17L69lk31Q4R9Q7J36k23J53J6m22L09J6J89J0j81q3
1322E5L4J14o5p8K52m0n1P8k5j36J66K85j29k43L01l07J83m63J46J36Q6j05j72
$$ plain form
1345 22 -282 -422 -336 -518 -536 -383 -268 -577 -653 -397 -488 -775 -987 -461 -460 -267 -419 -476 -39 -293 -4 110 136
1368 136 -129 236 258 399 742 469 353 572 500 458 211 408 363 388 235 154 400 238 241 -70 2 -241 -232 -142
1392 -142 -249 -427 -241 -260 -404 -302 -393 -406 -529 -605 -691 -557 -756 -706 -644 -542 -514 -737 -538 -567 -271 -450 -284
1415 -284 -200 -298 -176 40 -302 203 -107 223 220 236 3 522 354 423 335 406 484 589 615 358 293 332 142 63
1439 63 227 129 -11 -49 -193 -138 -616 -377 -500 -464 -858 -751 -659 -894 -940 -944 -873 -670 -698 -803 -954 -859 -592 -519
1463 -519 -283 -405 -300 -164 -323 -315 22 138 186 16 386 357 567 568 580 381 560 275 241 341 423 445 435 280
1487 280 -18 285 351 337 157 12 241 -215 96 -219 1 -342 -255 -288 -401 -631 -445 -486 -589 -679 -307 -706
1509 -706 -797 -329 -836 -371 -704 -416 -235 -269 -148 -346 -74 -47 153 245 526 124 621 696 365 781 666 672
$$ packed form
1345B2l04j40Q6j82j8J53J15l09p6K56r1k87k12N26JJ93j52n7M37k54K89J14K6
1368A36k65L65K2J41L43k73j16K19p2m2k47J97m5K5j53q1K46j62Ll11P2k43RR0
1392a42j07j78J86j9j44J02r1j3j23p6q6J34j99N0O2J02K8k23J99k9K96j79J66
1415b84Q4r8J22K16l42N05l10L30lJ6k33N19j68O9q8P1P8J05K6k57o5L9j90p9
1439F3J64r8j40l8j44N5m78K39j23L6l94J07R2k35m6mP1K03k8j05j51R5K67P3
1463e19K36j22J05J36j59QL37J16M8j70L70k9K10JJ2j99J79k85l4J00Q2K2j0j55
1487B80k98L03O6j4j80j45K29m56L11l15K20l43Q7l3j13k30J86m1j03r0L72l99
1509g06r1M68n07M65l33K88J81l4J21j98K72K7K00R2K81m02M97P5l31M16j15O
$$ plain form
1531 672 602 975 873 810 755 553 509 477 483 374 392 202 -174 -177 -98 -17 -159 -219 -513 -476 -289 -116 -316 -281 -329
1556 -329 -525 -351 -450 -217 -166 -335 -236 -231 -106 -199 -152 -13 -171 118 122 226 228 119 131 207 275 265 545 361 275
1581 275 175 284 631 422 529 464 339 566 319 335 342 403 427 324 467 136 193 149 -58 -1 44 -146 -143 46
1605 46 -97 -157 -190 -269 -442 -427 -229 -271 -3 -324 -359 -182 -185 221 85 26 98 120 182 138 351 355 334 229 584 313
1631 313 444 374 343 530 564 292 440 108 -43 156 238 46 43 99 36 -159 -130 34 -350 -144 -215 -95 16
1654 16 -99 -172 111 -234 12 -313 -96 -68 -291 -156 -241 -226 -34 -226 0 -73 -132 -289 -166 11 -283 -260 -1
1677 -1 -285 -135 191 26 -9 46 -83 -149 118 -89 289 133 -19 270 -140 82 116 158 135 104 98 -42 -212 -240
1701 -240 -55 -243 -232 -99 -176 -89 -388 -190 -174 -207 -79 -301 -341 -163 -405 -76 180 -301 -121 -78 -102 -14 -25
$$ packed form
1531F72p0L73j02o3n5k02m4l2Oj09J8j90l76lP9Q1j42o0k94L7J87J73k00L5m8
1556c29j96J74r9K33N1j69R9NJ25r3M7J39j58K89MJ04Kj09J2P6O8j0K80j84q6
1581B75j00J09L47k09J07o5j25K27k47J6PO1K4j03J43l31N7m4k07N7M5j90LJ89
1605D6j43o0l3p9j73J5J98m2K68l21l5J77lM06j36n9P2K2O2m4K13Mk1j05L55k71
1631C13J31p0l1J87L4k72J48l32j51J99Q2j92lN6o3j95K9J64l84K06p1J20J11
1654A6j15p3K83l45K46l25K17K8k23J35q5J5J92j92K26p3n9j57J23J77k94K3K59
1677ak84J50L26j65l5N5j29o6K67k07L78j56j52K89m10K22L4M2k3l1oj40j70k8
1701b40J85j88J1J33p7Q7k99J98J6l3J28k22m0J78k42L29K56m81J80M3k4Q8j1
$$ plain form
1724 -25 -34 -129 40 122 -159 -208 -29 169 -281 -76 -216 28 -160 -65 -87 132 -117 -321 -89 -142 53 76 -208
1747 -208 -37 101 -108 114 -72 -55 129 -195 159 179 -213 -47 -166 -215 2 87 -55 81 -9 -98 -84 35
1769 35 -292 -232 -88 -114 -306 179 -230 -74 -204 79 -243 -99 89 -10 31 79 229 162 -154 -203 32 78 105
1792 105 50 233 15 199 -30 279 10 -122 -59 -101 -49 -70 -54 118 -90 69 173 -154 149 287 221 -77
1814 -77 171 176 26 150 134 -26 220 160 -67 32 -153 151 34 199 -177 -67 -133 -283 -32 -243 112 -140
1836 -140 -98 52 92 -263 46 -105 34 -60 -160 17 -310 -5 177 133 -15 293 63 216 178 -33 45 103
1858 103 638 273 143 44 15 -38 154 70 51 -54 64 49 -131 -44 -71 -174 14 -309 -265 -528 -361 -223 -205
1881 -205 -350 82 10 67 24 -246 -199 -272 -305 -85 -138 -407 49 -6 22 -300 -66 -82 -108 94 -109 -187 -7 77
$$ packed form
1724b5rr5J69Q2k81m9J79J98m50K05j40K44j88R5k2K19k49k04K32n3J95K3k84
1747b08J71J38k09K22j86J7J84l24L54K0l92J66j19m9K17Q5j42J36r0q9J4J19
1769C5l27O0J44k6j92M85m09J56j30K83l22J44J88r9M1M8J50o7l16m9K35M6K7
1792A05n5J83k18J84k29L09k69j32O3m2N2k1J6J72k08J59J04l27L03J38o6k98
1814g7K48Nj50J24j6j60K46o0k27R9j85L04j17J65l76J10o6j50K51k11L55k52
1836a40M2J50M0l55L09j51J39r4j00J77l27L05J82m4j48L08k30J53l8k11P8N8
1858A03N35l65j30r9k9n3J92q4j9j05J18j5j80Q7k7j03J88l23M4k63J67J38J8
1881b05j45M32p2N7m3k70M7p3l3K20n3k69M56n5K8l22K34j6k6K02k03p8J80Q4
$$ plain form
1905 77 176 91 268 30 283 144 -55 41 146 312 55 63 190 126 -67 53 -75 112 -103 -86 -221 28 -185
1928 -185 -328 -432 -258 -244 -132 -364 -339 -114 -712 -295 -463 -432 -434 -213 -132 -333 8 -105 -118 54 -30 -74 -30
1951 -30 67 370 -127 26 67 -10 233 -4 59 97 130 53 18 -203 26 105 7 -49 -79 34 -35 181 21 17 -93
1976 -93 -67 -130 85 -270 -158 -98 -322 -70 -392 -224 -285 -596 -304 -447 -65 -251 -115 -125 -237 -127 -140 -252
1998 -252 -13 -306 -393 4 -58 31 73 98 11 48 -90 292 222 279 216 132 111 127 18 -24 113 -47 -117 -110 50 -30
2024 -30 189 -372 -366 -167 -424 108 -301 -70 -246 -555 -88 -209 -310 -103 -134 -87 -376 -60 -8 -212 -63 -123
2046 -123 22 35 42 44 23 176 -258 258 -129 0 -24 88 35 -136 -26 -136 -5 17 182 9 -9 31 53 16
2070 16 201 111 301 174 -45 83 42 127 94 -71 245 -117 -180 134 -131 -96 243 -186 34 -154 -248 -131 -247
$$ packed form
1905G7R9q5J77k38K53j39j99R6J05J66k57QJ27o4j93J20j28J87k15J7j35K49k13
1928a85j43j04J74J4J12k32K5K25n98M17j68L1kK21Q1k01L41j13j3J72q4m4M4
1951c0R7L03m97J53M1p7K43k37O3L8L3p7l5k21K29P9r8n6l0J13o9K16j60mj10
1976i3K6o3K15l55J12O0k24K52l22J68o1l11K92j43L82j86J36j0j12J10j3j12
1998b52K39k93q7L97o2Q9M2K5q7L7j38L82p0N7o3q4k1J6j09m2J37j60p0PJ60q0
2024c0K19n61OJ99k57N32m09K31j76l09M67j21j01K07l1M7k89L16N2k04J49o0
2046a23J45J3PKk1J53m34N16l87J29k4J12n3j71J10j10J31K2J65j73j8M0K2l7
2070A6J85r0J90j27k19J28m1Q5l3j65L16l62o3L14k65L5L39m29K20j88r4J17j16
$$ plain form
2093 -247 -102 45 -388 -313 -124 -128 24 5 147 -83 220 33 -38 44 58 -65 -4 199 201 166 56 323 190 151
2117 151 108 186 -19 121 171 72 99 10 -5 88 -32 -150 60 -103 -80 -64 31 -164 104 -21 -134 -158 -85 52
2141 52 -34 -388 356 19 117 -112 -293 -105 -53 129 10 -40 -112 41 99 226 -181 101 -34 -195 -297 113
2163 113 39 -37 53 -105 138 -221 47 172 126 45 141 35 322 -212 76 310 106 143 -91 -62 -104 -217 -369
2186 -369 27 -36 -153 -221 -19 -29 -241 -2 -189 -184 159 -176 -160 -50 -15 70 -362 57 121 243 142 158 -39
2209 -39 -20 -39 181 -12 6 -8 -92 -147 166 45 126 9 -220 207 -304 -108 78 -151 75 -369 -104 142 35
2232 35 -271 -154 -10 84 -58 19 87 156 3 102 -151 -139 -95 -6 -54 -213 -203 -30 138 120 -208 -52 6 -55 -231
2257 -231 77 58 -261 -77 -5 -83 -74 30 -14 78 129 -41 18 -93 227 108 -141 -110 -30 151 -62 6 -230 -190
$$ packed form
2093b47J45J47m33P5J89mJ52j9J42k30L03j87p1Q2J4j23O1K03Kl5j10K67j33l9
2117A51m3P8k05J40N0r9K7q9j5R3j20j18K10j63K3J6R5j95K68j25j13k4P3J37
2141E2q6l54P44l37R8k29j81J88N2J82j19n0p2J53N8J27m07K82j35j61j02M10
2163A13p4p6R0j58K43l59K68J25m6q1R6j06K87n34K88K34k04L7k34K9m2j13j52
2186c69L96o3j17o8K02j0k12K39j87NL43l35J6J10L5Q5m32M19O4J22j01J6j97
2209c9J9j9K20j93J8j4q4n5L13j21Q1j17k29M27n11J96J86k29K26m44K65K46j07
2232C5l06J17J44R4j42P7O8O9j53R9k53J2M4Q9m8j59J0J73J68j8l28J56N8o1j76
2257b31L08j9l19J84P2p8RJ04m4R2N1j70N9j11L20j19k49L1Q0J81k13O8k36M0
$$ plain form
2281 -190 12 -5 243 130 46 -43 73 -113 85 -36 59 38 -23 -38 92 -42 13 194 -19 -21 126 -10 69 121
2305 121 -216 -137 137 38 -37 38 172 0 111 -103 -204 -321 -68 -189 222 -231 13 -11 -135 -59 4 -123
2327 -123 95 -100 -191 8 -10 -48 -153 65 72 81 -25 313 -148 -57 67 88 135 -72 117 -56 126 -120 254
2350 254 182 -286 -226 54 -112 -185 11 -72 -181 39 -221 -244 132 -129 81 -268 -249 -77 32 4 -141 -26
2372 -26 23 63 119 -122 95 -99 181 4 -5 -95 117 -9 -62 218 109 118 14 109 -201 15 322 -136 185 58
2396 58 -111 264 -16 71 96 92 -11 -99 8 28 -111 20 -157 -465 -72 -189 -22 -26 -179 -168 -150 -195 177 -110
2420 -110 -51 6 -58 99 82 -12 -277 -61 161 222 -7 1 -157 141 47 93 8 128 296 63 85 -217 21 245
2444 245 154 157 1 -12 -116 -236 -52 -81 236 176 -99 76 -71 -36 286 -13 -10 0 3 -101 -152 -153 -110 -55 82 108
$$ packed form
2281a90K02j7K48j13q4q9J16j86J98j21R5k1o1j5J30j34N5J81k13kJ47j36P9N2
2305A21l37P9K74r9p5P5J34j72J11k14j01j17K53j21M11m53K44k4j24P6O3j27
2327a23K18j95r1J99j8l8j05K18PRj06L38m61R1J24K1M7k07J89j73J82k46L74
2350B54p2m68O0K80j66p3J96q3j09K20k60k3L76k61K10l49J9J72J09k8j45J15
2372b6M9M0N6k41K17j94K80j77rr0K12j26n3K80j09Rj04R5l10K16L07m58L21j27
2396E8j69L75k80Q7K5mj03q8J07K0j39J31j77l08L93j17J67mj53J1J8m5L72k87
2420a10N9N7o4J57j7r4k65K16K22O1k29Qj58K98r4M6q5J20J68k33K2l02K38K24
2444B45r1Lj56j3j04j20J84k9L17o0k75J75j47L5L22k99LJ0Lj04n1jM3N5J37K6
$$ plain form
2470 108 -139 -42 44 -32 61 -171 87 -54 -142 12 -103 -160 -189 -318 -32 17 -229 334 -36 37 163 252 216 77
2494 77 31 -82 45 -43 -95 -192 -103 133 -265 -55 -100 -137 11 127 175 -23 -235 -98 -299 -2 -37 -219 121
2517 121 162 27 -64 -52 25 -73 -88 203 155 75 72 189 -113 -43 76 -58 -6 57 223 103 -128 -78 69 126 -46
2542 -46 -156 30 -180 -124 178 47 -87 111 -32 -212 173 353 -442 -42 22 -114 92 -85 -145 -68 36 -105
2564 -105 87 -5 27 167 -68 -46 109 14 -61 -308 -93 -53 36 -101 -189 -277 -203 -107 -68 -217 -88 70 139 236 115
2589 115 117 337 20 225 -30 -33 134 26 92 -21 71 147 97 -138 -165 52 19 257 91 -5 140 -22 -57 27
2613 27 -73 -149 -336 -234 -240 -310 164 253 90 143 151 181 103 -299 -98 197 218 -75 104 39 -196 -82 -163 94 -87
2638 -87 8 -65 -276 -211 131 -137 151 217 15 -105 178 53 -113 148 167 63 -138 131 -116 123 28 47 43
$$ packed form
2470A08k47R7Q6p6R3k32K58j41q8J54j15n7k9j29K86M9k46N63l70P3J26Q9l6j39
2494G7m6j13J27q8n2r7Q9K36l98K10m5l7J48J16M8j98k12J37k01K97l5j82L40
2517A21M1j35r1J2P7r8j5K91m8q0lJ17l02P0J19j34N2O3J66j20k31N0J47N7j72
2542d6j10J86k10N6L02j31j34J98j43j80L85J80p95M00O4j36K06j77o0P7J04j41
2564a05J92r2L2J40k35K2J55r5p5k47K15M0Q9j37q8q8P4R6L9j49J29J58O9R7j21
2589A15KK20l17K05k55lJ67j08O6j13R2P6n0k35k7K17l3K38j66r6J45j62l5Q4
2613B7j00p6j87J02op0M74Q9j63N3QL0p8m02K01K95K1k93J79o5k35J14q1K57j81
2638h7R5p3k11O5L42k68K88O6k02j20K83j25j66K61J9j04k01K69k47K39r5J9m
$$ plain form
2661 43 84 103 -7 -115 -99 -118 11 -81 -94 -11 58 127 -160 70 83 -254 182 -244 62 12 -91 -160 52 61 167
2686 167 161 -61 -8 73 314 12 146 85 -66 -191 188 111 23 135 -70 -173 176 -46 26 68 -58 -198 -122
2709 -122 43 -254 101 239 -79 -246 70 74 121 -33 40 152 105 -2 132 -5 18 -30 48 -14 -113 73 -172
2732 -172 90 -99 -18 -45 -125 -288 -133 -162 141 193 -41 -148 220 -6 219 -36 -221 202 -84 133 -5 61
2754 61 -92 -164 -3 -149 31 171 -221 10 2 22 171 -154 0 100 24 -32 29 -128 -69 143 -268 69 -7
2777 -7 82 102 -60 -158 -103 66 -21 108 60 190 155 -38 -209 -1 208 23 140 -59 34 59 -129 69 181 103
2801 103 -88 17 66 -14 -198 -182 -96 71 -271 -63 233 -151 7 -19 24 51 331 116 103 -65 -99 84 -290
2824 -290 -15 -184 75 16 116 -179 -46 -99 3 -85 -153 -93 -191 -115 -142 370 55 70 -89 -257 -119 234 82
$$ packed form
2661D3M1J9j10j08J6j9J29r2j3Q3O9O9k87K30J3l37M36m26L06n0j03o9K12RJ06
2686A67ok22N3Q1K41l02J34o1j51j25L79p7q8J12k05j03L49k22P2M2j26j40P6
2709a22J65k97L55J38l18j67L16MM7j54P3J12m7j07J34j37K3m8P8o2r9J86k45
2732a72K62j89Q1k7q0j63J55k9L03N2k34j07L68k26K25k55j85M23k86K17j38O6
2754F1j53p2J61j46J80J40l92K31qK0J49l25J54J00p6n6O1j57N9K12m11L37p6
2777gQ9K0j62r8N5J69q7J29m8J30l5j93j71K08K09j85J17j99R3K5j88J98J12p8
2801A03j91J05M9q0j84J6Q6J67l42K08K96l84J58k6M3K7K80k15j3j68l4J83l74
2824b90K75j69K59n9J00k95J33n3J02q8o8O0r8P6k7N12l15J5j59j68J38L53j52
$$ plain form
2847 82 513 209 84 -10 121 258 -17 -48 260 -33 -106 -60 154 -55 184 273 61 16 19 220 -92 -4 -72 -157
2871 -157 94 -114 21 335 59 0 -40 -59 106 285 41 -52 -192 -214 -277 50 56 282 -76 51 -272 -13 -239
2894 -239 147 -100 123 -152 -49 -188 -62 130 -189 87 -48 73 -178 230 53 237 -50 11 66 125 231
2915 231 234 176 148 -246 -107 -33 94 -296 -156 -91 -13 19 6 -22 -20 6 81 4 -48 175 106 -169 40 50 150 173
2941 173 -234 107 -186 -183 117 -16 -78 108 -48 -16 -134 190 -78 22 90 81 2 367 61 -197 1 -152 82
2964 82 23 0 294 7 184 41 -150 26 29 52 -7 -39 -227 -19 -92 -127 94 10 -21 245 51 95 -218 -39
2988 -39 40 -260 -36 5 10 -293 -250 -275 -128 -30 30 -29 -271 -184 -6 -14 173 80 -227 121 -154 29 50 -16 40 28
3014 28 -54 148 105 -89 -17 32 285 43 -29 -126 95 -121 -14 -1 77 127 272 -355 48 -138 21 236 61
$$ packed form
2847H2M31l04j25r4J31J37k75l1L08k93p3M6K14k09K39Q9k12m5LK01l12Q8o8q5
2871a57K51k08J35L14k76n9m0j9J65J79k44r3j40k2o3L27OK26l58J27l23K59k26
2894b39L86k47K23k75J03j39J26J92l19K76j35J21k51M08j77J84k87O1N5N9J06
2915B31Ln8k8l94J39P4J27l90J40O5P8L2j3k8KK6P5p7n2K23o9k75K09J0J00K3
2941A73m07L41k93LL00j33o2J86j56L2j18L24k68J00O8rp9L65l06k58J98j53K34
2964H2n9k3K94k87J77j43j91J76LK3n9l2j88K08p3l5K21q4l1K66j94M4l13J79
2988c9P9l00K24M1Nl03M3k5J47R8O0n9k42Q7J78qJ87r3l07L48k75J83K1o6N6j2
3014B8q2K02m3j94P2M9K53k42p2r7K21k16J07J3P8N0J45o27M03j86J59K15j75
$$ plain form
3037 61 -119 -65 -78 192 -138 -263 253 -25 5 -98 -69 24 1 36 11 -46 9 -128 110 116 182 38 -125 -249 83
3062 83 -44 66 -87 -20 90 -89 75 176 -48 86 142 108 -84 33 273 247 133 52 42 -285 -72 165
3084 165 174 -132 110 243 -8 79 -177 -117 -74 18 -215 -53 272 -80 -81 94 104 2 171 83 -297 185 119 39
3108 39 -217 -366 -18 6 159 213 63 -79 226 151 141 223 -131 -81 -274 -81 20 -260 -55 -59 -69 67 -30 138
3132 138 -155 213 46 19 171 -356 87 123 155 -51 54 274 -22 -22 -44 58 -146 -157 103 -104 -23 12 -98
3155 -98 36 -219 200 49 -23 21 246 -42 -163 -15 14 -153 -158 319 -119 -112 -19 181 -10 21 24 -20 -108 233 14
3180 14 -173 48 -38 -169 -96 -53 -209 73 1 171 12 107 454 -160 75 -84 -53 124 85 -241 -5 123 -176
3203 -176 -35 -176 -42 -284 221 -316 76 -59 34 -149 -164 -28 -90 -16 -4 68 238 155 180 1 12 166 5
$$ packed form
3037F1j80N4j3K70l30j25N16k78L0j03K9R3k3L5k5n7N5j37K38OO6j44j63j24L32
3062H3j27J10j53O7J10j79J64J01k24J34N6l4j92J17K40k6j14q1j0l27K13K37
3084A65Rl06K42J33k51Q7k56O0M3R2k33J62L25l52jJ75J0j02J69q8l80M82o6q0
3108C9k56j49L48K4J53N4j50j42L05p5j0Q2l54N0j93J93J01k80K05mj0J36r7J68
3132A38k93L68j67k7J52n27M43L6L2k06J05K20k96%k2J02k04j1K60k07Q1L5j10
3155i8J34k55M19j51p2M4K25k88j21J48K9j67nM77m38PR3K00j91L1Lm4q8L41k19
3180A4j87K21q6j31P3M3j56K82p2J70j59R5L47o14K35j59L1J77l9l26K36J28k99
3203a76J41j41J34k42N05n37L92j35R3j83j5J36o2P4J2P2J70q3K5j79J1J54j61
$$ plain form
3226 5 152 -186 -65 190 7 77 211 116 51 -24 -60 -60 22 31 -108 117 -253 -107 -48 5 -110 -69 -33 3 -5 -21 128
3253 128 -12 -79 14 68 -154 31 -424 65 -205 -11 61 65 -27 165 120 24 39 181 -45 103 232 -103 -9 166
3277 166 193 63 122 -13 52 -139 -355 -147 22 -259 -3 101 175 -38 -82 34 263 9 164 122 -47 -105
3299 -105 -130 84 -90 25 -140 244 142 474 -103 -69 -174 -198 -130 -53 -99 194 89 -10 -10 136 107 -229 -80
3322 -80 6 151 -106 60 214 27 99 -72 110 224 128 -126 -148 -61 -85 73 114 96 -38 -21 78 -67 -31 -224
3346 -224 -29 91 -93 -260 66 88 65 6 -87 -135 72 35 -44 -58 -152 107 218 -90 153 118 -60 -146 -95 -123
3370 -123 -65 102 4 111 -91 65 23 53 -178 -140 -205 -189 -129 79 -162 -135 -54 188 41 -127 233 47 -148
3393 -148 196 35 -105 -25 15 -154 -113 14 -168 126 -68 -51 163 -115 37 89 111 -254 -9 -45 154 -63
$$ packed form
3226EJ47l38J21K55j83P0J34r5o5p5l6%Q2Rj39K25l70J46N9N3j15M1L6L6qj6J49
3253A28j40o7R3N4k22J85m55M89k70J94P2Mr2J92m5r6J5J42k26J48J29l35R4J75
3277A66K7j30N9j35O5j91k16K08J69k81K56J04P4k13m4J16K29k54J55m2j69n8
3299a05k5K14j74J15j65L84j02L32n77L4j05k4O8P7m6K93j05r9%J46k9l36J49
3322h0Q6J45k57J66J54j87P2j71J82J14r6k54k2Q7k4J58M1j8j34J7R9j45L6j93
3346b24J95J20j84j67L26K2k3n9r3m8K07l7p9j4r4K59J11l08K43l5j78q6N1k8
3370a23N8J67r8J07k02J56m2L0k31L8o5J6O0K08k41K7Q1K42j47j68L60j86j95
3393a48L44j61j40Q0M0j69M1J27j82K94j94J7K14k78J52N2K2l65K45l6J99k17
$$ plain form
3415 -63 311 68 295 23 -66 11 126 48 -4 54 -232 -101 99 -65 161 -176 30 269 -90 157 3 40
3437 40 -377 171 -142 -103 23 218 -146 -6 -207 -262 115 -191 38 162 -48 9 -157 193 14 46 199 52
3459 52 -68 123 -10 -48 261 -211 17 -33 -2 197 -82 -26 -77 63 59 -95 -116 3 60 143 138 -191 30 74 36
3484 36 89 135 97 -87 -132 -141 255 -8 -118 -179 -58 -12 60 137 -82 36 -87 10 -230 -63 129 -293 46 100
3508 100 -67 -23 -139 -168 -147 -179 41 85 151 -65 177 -153 -268 172 -51 -27 195 -105 -65 114 -10 103 41
3531 41 -31 30 42 205 -30 95 -141 28 -127 -86 132 132 59 138 -2 -79 218 -132 -102 65 1 -110 -145 -26
3555 -26 41 -105 -60 32 -121 -58 -24 28 -195 -45 286 -193 149 -168 -101 103 108 144 11 -104 147 -180 -193 176
3579 176 -1 50 95 121 88 -23 -211 121 23 -39 -150 -321 -183 -135 18 -233 -98 -219 -143 -83 -156 90 -26
$$ packed form
3415f3L74k43K27k72q9P7J15p8n2N8k86J31K00j64K26l37K06K39l59K47j54L7
3437D0m17N48l13L9J26J95l64J40k01n5L77l06K29J24k10N7j66L50j79L2J53j47
3459E2j20J91j33l8L09m72K28n0L1J99k79N6n1J40mj54k1J19N7Q3nl29K21M4l8
3484C6N3M6l8j84m5rL96k63j10o1J21M6P2P7k19J18j23R7k40J67J92m22L39N4
3508A00j67M4j16k9K1l2K20M4O6k16K42l30j15M40k23K4K22l00M0J79j24J13o2
3531D1p2O1J2J63k35J25k36J69j55M1K18%p3P9j40p7K97l50L0J67o4j11l5J19
3555b6O7j46M5R2j53O3L4N2k23J50L31m79L42l17O7K04NL6j33j15K51l27j3L69
3579A76j77N1M5K6l3j11j88L32r8o2j11j71J38M8J53k51J35j21P6O0p3K46j16
$$ plain form
3602 -26 -59 -168 114 26 52 24 163 4 -84 -83 169 -103 -182 -42 -34 -153 -50 115 -79 62 189 8 -237 -34
3626 -34 -164 153 -157 2 -59 46 -286 -6 -38 -195 10 -35 11 190 -25 76 -22 28 -33 152 45 -32 108
3649 108 -40 5 192 267 236 1 156 -113 261 166 -14 154 123 212 43 140 126 -106 159 62 -233 98 205
3672 205 -121 113 -241 73 -34 124 117 -135 232 178 -46 129 94 101 142 191 126 95 73 82 241 -41 -82 57 20
3697 20 244 13 -28 273 -52 199 -192 165 21 108 -155 -77 -150 -136 -129 -110 128 -68 152 49 -11 -23 98 148
3721 148 117 89 179 -164 -69 -82 -48 69 -197 -13 136 -86 -99 -261 -64 -134 -76 -139 -75 17 -72 33 -140 68
3745 68 140 -45 -182 99 24 -232 -71 -24 13 -227 -179 59 -34 -269 -171 -129 -24 -78 40 74 -148 -278 -95 208
3769 208 -100 31 67 69 -64 -93 87 -18 -136 -71 147 125 233 189 -110 -149 -9 163 -21 -53 73 264 278
$$ packed form
3602b6l3j09K82q8K6k8J39j59q8JK52k72p9J40Qj19J03J65j94J41J27j81k45K03
3626c4j30L17l10J59o1J05l32K80l2j57K05m5M6J79k15J01r8N0o1J85j07p7J40
3649A08j48M5J87P5l1k35J55k69L74r5j80J68l1Q9j69R7j4k32K65r7k95L31J07
3672B05l26K34l54L14j07J58pk52L67n4k24J75l5PM1M9o5l1k2RJ59k82m1J39l7
3697B0K24k31m1L01l25K51l91L57j44Q7k63P8p3J4PJ9K38j96K20j03o0j2J21N0
3721A48l1k8R0l43R5j3L4J17k66J84J49k22j3j62J97p0N8o3O4R2q9J05j73K08
3745F8P2j85j37K81p5k56J61M7L7k40M8K38r3k35R8M2J05n4J18L4k22j30J83L03
3769B08l08J31L6Kj33k9J80j05j18O5K18k2J08m4k99l9J40J72j84l2J26J91J4
$$ plain form
3792 278 -159 217 77 74 23 -176 81 82 231 40 -58 -241 -370 -273 58 -20 13 196 -184 -94 161 -9 -321
3815 -321 -163 -76 -58 98 36 228 -38 -138 -180 47 32 100 48 -136 -26 -71 -74 -225 163 -129 88 183 -87 -36
3839 -36 -197 27 184 -50 -115 -123 -95 158 26 174 55 132 277 123 87 93 12 0 -168 131 -148 -84 -89 172 20
3864 20 191 -189 61 182 190 -20 -15 139 31 47 99 -18 -6 -67 -280 55 -34 23 -56 -19 -178 -16 -192 316
3888 316 -141 181 337 141 10 -164 -122 43 -145 31 -139 56 61 69 -60 -65 111 -231 100 -100 2 102
3910 102 -184 -74 -104 118 101 -98 55 -151 -60 222 -49 81 -115 -145 -61 295 148 -128 93 -136 -131 -56 -25
3933 -25 -75 -208 -26 -138 148 204 0 14 -316 -16 -52 -75 69 -11 -71 15 -13 -55 12 -206 228 -65 66 44
3957 44 150 -41 -197 -29 110 -101 8 160 -49 -46 -44 -106 -149 -97 54 -137 -139 -3 21 -25 229 15 18 83 -31
$$ packed form
3792B78m37L76j40ln1j99K57JJ49j91r8j83j29R7L31p8L3J83l80R0K55j70l12
3815c21J58Q7J8J56o2J92k66j00m2K27j5O8n2j84J10m5lj51L88k92K17R5k70N1
3839c6j61K24J57k34o5qK8K53j32J48j19P7J45j54l6Oq1j2j68K99k79O4nK61j52
3864B0J71l80K50J21Qk10NJ54j08J6N2j17J2o1k13L35q9N7p9L7j59J62j76N08
3888C16m57L22J56j96j31j74M2J65j88J76j70J95NQj29nJ76l42L31k00J02J00
3910A02k86J10l0K22j7j99J53k06R1K82k71J30j96l0Q4L56j47k76K21k29NP5L1
3933b5n0j33J82j12K86N6k04J4l30L00l6k3J44q0o0Q6k8m2O7k18M34k93J31k2
3957D4J06j91j56J68J39k11J09J52k09LKo2m3N2J51j91kJ36K4m6K54k14LO5j14
$$ plain form
3982 -31 6 34 -85 -22 -122 -212 -356 21 24 189 -24 102 250 -248 123 -197 -26 -127 52 -237 -155 -107 -249
4005 -249 -142 -144 -191 131 -18 17 -90 -4 -107 126 -15 -47 443 61 61 87 110 -53 63 -197 2 -180 -63
4028 -63 118 -78 -69 66 -50 -305 8 82 12 -70 94 -191 -188 -108 132 118 -142 -120 82 -104 61 95 84 188
4052 188 -2 -76 -173 122 157 316 -43 -171 -23 -212 84 260 18 173 276 172 -33 -52 -62 -41 -256 -126
4074 -126 -68 185 127 -158 54 -149 -18 3 -70 41 -58 86 -112 -81 94 -21 -65 85 213 -9 -1 -55 -66 109
4098 109 57 -113 261 168 56 108 -94 -52 -27 56 -27 -25 126 -119 -262 124 -205 99 118 -425 0 31 -237 -166
4122 -166 104 -233 -288 0 -137 105 41 -17 -358 -263 64 13 -17 16 -155 114 -88 92 -34 -60 125 67 121
4145 121 43 167 36 43 -241 212 -65 -64 -78 286 -43 -47 326 -55 -24 109 -32 67 -65 170 -55 94 -153
$$ packed form
3982c1L7K8j19O3j00r0j44L77LJ65k13J26J48m98L71l20J71j01J79k89Q2M8j42
4005b49J07km7L22j49L5j07Q6j03K33j41l2M90l82%K6K3j63J16k60J99j82J17
4028f3J81j96RJ35j16k55L13P4p0q2J64k85LQ0K40j4k60K2K02j86J65L4j1J04
4052A88j90p4r7K95L5J59l59j28J48j89K96J76k42J55J03j04k05j9j0K1k15J30
4074a26N8K53n8k85K12k03J31K1p3J11r9J44j98L1J75j15m4J50J28k22Qn4j1J75
4098A09n2j70L74r3j12N2k02M2K5Q3q3KJ51k45j43L86l29L04J9n43M25L1k68P1
4122a66K70l37n5K88j37K42o4n8l41R5L27n1l0L3j71K69k02J80j26k6J85n8N4
4145A21p8J24j31Pk84M53k77Jj4L64l29mL73l81L1J33j41R9j32K35k25J49k47
$$ plain form
4168 -153 -40 -58 -217 -168 42 171 -199 -234 -81 -344 45 61 13 82 -93 29 8 -28 31 -17 -27 89 40 152
4192 152 314 -59 -93 -138 45 48 -39 349 177 185 126 183 -23 188 53 177 -132 -108 -87 -68 -58 -175 -65 313
4216 313 -374 18 132 165 -74 78 279 -16 148 -181 -26 83 26 -174 182 -11 -218 -52 218 131 -28
4237 -28 14 60 -147 129 -151 -189 143 -57 -108 -156 -32 -274 -131 -129 93 206 193 78 120 112 205 85 -39 -49 66
4262 66 -229 -142 -93 -182 43 -115 47 -85 -162 -309 -300 75 -212 -162 -27 -96 -110 107 -72 182 -44 114 35 -313
4286 -313 143 74 57 7 -104 1 132 -151 165 48 -173 -38 41 -236 94 10 -158 -285 67 -34 -12 -128
4308 -128 -40 134 -57 -140 27 -57 96 -141 61 -110 -118 -187 -51 73 -127 149 240 3 -161 260 208 -77 232
4331 232 -16 -35 33 -49 -218 -170 -87 207 193 -100 -119 -22 -71 -172 -76 -105 -115 -25 132 102 67 132 -66 63 188
$$ packed form
4168a53J13j8j59M9K10J29l70l5J53k63L89J6m8O9j75J22k1l6N9m8j0J16m9J12
4192A52J62l73l4m5J83Lq7L88j72Qn9N7k06K11j35J24l09K4K1J9J0j17J10L78
4216C13o87L92J14L3k39J52K01k95J64l29J55J09n7k00L56j93k07J66K70q7j59
4237b8M2M6k07K76k80l8L32k00n1m8J24k42J43KK22J13j3j15M2qR3j20j24j0J15
4262F6k95Q7M9q9K25j58J62j32p7j47RL75k87N0J35o9j4K17j79K54k26J58p9l48
4286c13M56o9j7n0j11J05J31k83L16j17k21J35P9k77L30q4j68j27L52j01K2j16
4308a28Q8J74j91q3J67q4J53k37K02j71qo9J36J24k00K76R1k37j64M21n2k85L09
4331B32k48j9O8q2j69M8Q3K94j4k93j9R7m9j01R6k9j0R0J57l0l5O5j98J29J25
$$ plain form
4356 188 33 -152 70 70 -305 50 80 -128 -75 -77 89 -173 159 -125 -128 -10 81 -197 -125 -201 64 100 203 -115
4380 -115 128 201 -126 184 41 88 -70 77 250 49 -43 12 4 -22 -44 88 239 -117 -114 -7 46 -68 -169 156
4404 156 -247 -66 31 56 87 53 33 -273 -45 19 132 -54 82 17 3 -38 -21 153 310 31 51 116 -153 92
4428 92 -19 83 217 -137 28 104 44 84 -12 147 163 104 77 -59 -26 66 -48 -34 -41 148 199 -92 -53 117 184
4453 184 -61 10 138 -140 74 155 19 -85 -98 -43 -21 281 122 -8 108 4 33 -191 68 -67 123 35
4475 35 -116 41 -73 42 -95 110 27 84 71 54 103 186 -148 183 132 -97 125 -57 110 132 -187 79 -30
4498 -30 -74 191 210 -10 48 222 18 -273 7 -55 -163 -13 -72 38 -119 49 27 72 -93 18 -46 89 69
4521 69 38 -213 -8 80 247 -61 122 169 -40 -222 -29 45 70 -171 88 -195 80 5 -261 -56 33 -177 299
$$ packed form
4356A88j55j85K22%l75L55L0k08N3kJ66k62L32k84lJ18R1k78P2p6K65L6J03l18
4380a15K43P3l27L10j43M7j58J47J73k01r2N5qk6k2J32J51l56LJ07N3j14j01L25
4404A56m03J81R7K5L1l4k0l06K28O4J13j86J36o5j4m1J7J74J57k79K0O5k69K45
4428I2j11J02J34l54J65P6o0M0r6J59J6n9k7j36L3R2j14J4pJ89N1k91L9J70O7
4453A84k45P1J28k78K14Q1j36j04j3N5K2L02j59j30J16j04K9k24K59j35J90q8
4475C5j51J57j14J15j37K05q3N7j3j7M9Q3l34L31n1k29K22j82J67K2l19K66j09
4498c0m4K65J9k20N8J74k04k91K80o2j08J50n9J10j57J68k2M5j65J11o4J35k0
4521F9l1k51K05Q8J67l08J83M7k09j82J93P4K5k41K59k83K75p5k66K05Q9k10M76
$$ plain form
4544 299 -191 -50 200 38 233 71 20 40 101 15 91 192 22 -3 -77 -46 39 32 -71 55 17 24 -414 -223 -238
4569 -238 -45 -4 90 -21 -81 27 135 71 -64 -46 203 151 51 -85 -62 49 -63 151 -165 88 190 -33
4591 -33 35 -62 0 92 -33 92 137 100 -11 -53 22 134 95 129 159 -35 -231 16 116 104 214 74 171 171 288
4616 288 -104 27 143 88 141 -35 140 -36 -224 150 2 -97 -204 64 123 56 -201 -232 177 -99 -72 -169 -178
4639 -178 -39 -263 -153 -167 181 90 60 48 -45 78 55 22 186 40 -69 104 -121 -5 235 -215 18 50 100
4662 100 -191 131 -43 78 5 -201 35 181 -76 110 230 119 44 11 86 171 125 -195 -25 115 -7 11
4684 11 47 -91 298 53 75 -82 -52 -141 -110 -150 -197 -26 -83 -96 -6 61 -62 155 5 189 146 21 -42 -300 -173
4709 -173 61 0 -92 241 156 -207 -67 -99 -188 68 89 81 -129 -120 -53 -125 -195 18 108 -294 -191 214 -87 -30 -84
$$ packed form
4544B99m90J41K50j62J95j62n1K0O1q6P6J01j70k5p4L1Q5pj03J26l8Pm38J91j5
4569b38J93M1R4j11o0J08J08o4j35J8K49n2j00j36K3J11j12K14l16K53J02k23
4591c3O8r7O2R2j25J25M5l7j11m2P5J12l9L4L0j94j96K47J00j2J10j40R7%J17
4616B88l92J31J16n5N3j76J75j76j88L74j48r9j07K68N9o7k57l1M09k76K7r7r
4639a78J39k24J10j4L48r1l0j2r3J23k3l3J64j46j09J73k25J16K40m50K33L2N0
4662A00k91L22j74J21p3k06K36J46k57J86J20j11p5l3P5Q5m6l20J70J40j22J8
4684A1L6j38L89k45K2j57L0q9L1m0m7J71n7j3R0O7j23K17j50J84m3j25o3k58J27
4709a73K34o1r2L33q5l63J40l2q9K56K1qk10RO7p2p0K13R0m02J03M05l01N7n4
$$ plain form
4734 -84 118 -11 105 44 14 157 61 81 -22 46 158 -129 -69 -20 -7 -46 -172 -100 109 -83 -20 -140 -24 74
4758 74 8 131 -241 -20 -98 -29 36 -31 -38 -204 150 -189 -37 -6 -160 71 -45 174 -89 0 40 -148 50 71
4782 71 61 -63 -199 -39 60 142 -80 87 1 -71 31 191 69 -67 -82 -187 -64 -18 -214 152 -106 104 298
4805 298 163 37 129 -42 95 -34 254 -34 11 -79 -164 225 -76 44 -140 -165 284 1 76 -157 -88 14
4827 14 113 -4 59 -32 -2 55 -39 -36 -37 87 32 35 10 100 212 346 23 62 113 31 51 55 132 -61 77 -239 -134 -96
4855 -96 39 38 -79 29 -180 309 -78 49 -230 16 186 33 -13 -47 -20 20 -24 -145 55 -127 17 -21 96
4878 96 49 -146 -5 118 177 12 255 32 -45 73 142 -88 45 151 -4 -205 89 33 -96 -17 -50 63 240
4901 240 33 -63 262 70 -32 -138 -288 32 158 356 -192 75 11 -125 127 -57 -51 26 70 45 -100 -95 192
$$ packed form
4734h4K02j29J16o1l0J43r6K0j03O8J12k87O0M9J3l9j26P2K09j92O3j20J16R8
4758G4o6J23l72K21p8O9O5o7pj66L54l39J52L1j54K31j16K19k63Q9M0j88J98K1
4782G1j0j24j36J60R9Q2k22J67q6p2J02J60j22j36j5j05J23M6j96L66k58K10J94
4805B98j35j26R2j71J37j29K88k88M5r0q5L89l01J20j84k5M49k83P5k33O9J02
4827A4R9j17O3r1L0N7r4LjJ24n5Lk5R0J12J34l23L9N1q2K0MP7j93J38l16J05L8
4855i6J35jj17J08k09M89l87J27k79K46J70j53m6l4K7M0m4j21K00j82J44l8J17
4878I6m7j95J41J23N9j65K43k23p7J18O9k30J33J06j55k01K94n6j29P9l3J13J77
4901B40k07r6L25j92j02j06j50L20J26J98n48K67o4j36K52j84OP7M4k5j45NK87
$$ plain form
4924 192 -104 -57 143 256 -53 170 90 77 -186 165 55 -44 -195 -80 -78 -110 -85 -58 198 169 -53 -108 49 26
4948 26 -182 -141 -218 163 324 -141 101 -11 -76 288 78 -80 173 133 -48 -129 131 11 -40 -113 187 41 -122
4971 -122 -105 -64 453 -164 20 -79 32 57 -26 -194 -110 -72 -12 23 44 -68 -238 39 -62 14 53 108 -177 -73
4995 -73 42 181 -162 -27 18 59 63 -42 -222 -108 20 90 -36 -74 -67 157 163 101 -46 -90 -116 100 273 166 56
5020 56 254 110 -90 -177 -4 121 48 171 155 17 137 44 -86 81 19 27 27 -23 23 -44 156 23 16 -6 51 -203
5046 -203 118 173 -253 6 -36 -104 -137 166 31 19 -131 -166 45 17 -135 126 -17 90 163 111 -185 -11 17
5069 17 142 -100 -97 -54 180 -24 169 69 -221 -137 267 -168 -123 -3 -95 238 -378 166 -62 84 18 64 76
5092 76 -199 -124 94 136 123 -109 -21 -37 -175 -74 -164 129 -65 213 24 19 143 206 99 34 72 -129 -143 -36
$$ packed form
4924A92k96M7K00J13l09K23q0j3k63L51j10r9j51J15Kl2K5K7K56k9k22n5J57k3
4948B6k08M1p7L81J61m65K42j12o5L64k10j58K53m0j81q1K60j20n1p3L00j46j63
4971a22J7M1N17o17J84r9J11K5q3j68Q4L8O0L5K1j12j70K77j01P6L9N5k85J04
4995g3J15J39l43J35M5M1Mj05j80J14J28P0j26l8PK24Oo2j47m4k6K16J73j07j10
5020E6J98j44k00q7J73J25p3J23j6j38J20r3j30J67o2Q%n0M6o7K00j33pk2N7k54
5046b03L21N5m26K59m2o8l3L03j35j2j50l5K11k8j52K61j43J07P3n2k96J74K8
5069A7J25k42LM3K34k04J93j00k90Q4M04m35M5J20r2L33o16N44k28J46o6M6J2
5092G6k75P5K18M2j3k32Q8j6j38J01r0K93j94K78j89nJ24O3j07o5L8k01j4J07
$$ plain form
5116 -36 178 123 25 -5 -167 123 -146 13 -200 23 -37 -73 110 207 -188 -79 13 -131 129 308 -74 421 58
5139 58 33 -55 233 60 -58 -102 -53 -44 -1 276 88 326 121 300 176 -13 -65 78 -136 -4 -71 -101 153 -55
5163 -55 -100 258 -115 57 -211 9 -100 -93 -3 -101 60 100 -31 34 -92 82 127 -45 218 -151 114 73 134 -177
5187 -177 -230 127 -25 -245 99 15 -51 -311 63 -187 56 -64 256 -74 156 -55 -136 -115 -203 -22 62 148 -47
5210 -47 20 -55 146 -100 240 -272 70 143 51 -112 217 -212 17 1 54 181 -14 25 278 -15 -118 109 156
5233 156 61 -173 -214 57 -38 120 132 -222 -206 -36 198 -100 16 71 29 -90 -321 38 146 169 -50 -34 1
5256 1 -254 -25 116 53 105 -28 94 40 23 -173 39 9 -52 110 -106 35 16 -80 95 -185 -103 -234 -237 190
5280 190 111 80 -81 -137 -42 43 -160 96 118 -37 69 -57 292 69 185 -117 130 -260 -45 30 -210 -102
$$ packed form
5116c6K14n5r8l0j62K90k69J59k13K23o0l6J83R7l95J09R2j44K60J79l82M95l63
5139E8k5q8K88j73j18m4M9RM3K77j88K38k05J79j24j89n2J43k14J32o7l0K54k08
5163e5m5L58l73J72k68K20j09PR0r8J61M0j31O5j26J74M5j72K63l69K65m1O1l11
5187a77n3L57j52k20L44q4o6k60L74k50K43j20L20l30K30k11q1K1q8J81Q4Q6j95
5210d7O7p5K01k46L40n12L42P3r2j63L29m29K29j6N3J27j95L9K53k93j03K27M7
5233A56r5k34m1K71r5J58J2l54J6J70K34k98J16N5m2j19k31L59J08K3k19J6L5
5256Ak55K29J41o3N2j33J22n4j7j96K12l0o1J62k16J41j9r6J75k80Q2j31lM27
5280A90p9l1j61n6R5Q5k03K56K2j55J06j26L49k23J16l02K47l90K15P5k40J08
$$ plain form
5302 -102 -34 21 -70 -86 233 -156 10 -129 -161 -31 282 -237 56 -62 -194 30 -189 -154 82 166 3 9 32
5325 32 377 34 -19 -26 83 214 -122 105 -11 -69 -12 -124 -52 -87 -115 127 230 34 -135 82 -55 31 287
5348 287 275 109 19 23 0 28 -151 -349 52 76 261 50 -166 17 77 54 -110 -240 180 -267 -78 -13 -123
5371 -123 128 10 -62 82 5 49 107 -130 -101 -30 -85 -64 -62 -65 235 -59 135 58 -5 140 31 -51 -162 -2 61
5396 61 -133 -61 96 -219 -348 -227 -11 -26 72 135 -174 63 -204 11 -134 -18 32 -107 -160 6 70 -135 -57
5419 -57 100 -132 -149 -71 163 -79 48 256 78 102 240 -118 -86 132 17 -223 -99 83 16 -141 -174 -20
5441 -20 36 169 -90 25 5 -24 -113 -182 255 74 21 29 195 -110 -49 -90 150 -110 135 167 38 57 -272 -16
5465 -16 -9 197 141 -13 -12 143 373 -114 -154 -208 123 80 -73 -158 -40 137 73 -73 -201 -190 67 52 -23 41 55
$$ packed form
5302a02O8N5r1j6L19l89J66j39l2J30L13n19K93j18j32K24k19L5K36Q4j63OK3
5325C2L45l43n3pJ09J31l36K27j16n8N7j12P2l5k8K42J03j96j69K17j37Q6K56
5348B87j2j66r0Mk3K8j79j98M01K4J85k11k16J83O0k3j64j30M20m47J89O5j10
5371a23K51j18p2J44p7M4N8k37K9P1n5K1KlL00k94J94p7o3J45j09q2j11J60O3
5396F1j94P2J57l15j29J21K16j5R8O3l09K37k67K15j45J16N0j39n3J66O4k05P8
5419e7J57k32j7P8K34k42J27K08j78K4J38l58L2K18j15k40J24J82o7j57l3J54
5441b0N6J33k59J15k0k9q9o9M37j81n3QJ66l05O1m1K40k60K45L2j29J9l29K56
5465a6PK06n6j54JJ55K30m87m0n4L31m3j53q5J18J77o4j46j28J1K57j5p5O4J4
$$ plain form
5490 55 -197 276 11 159 64 -13 121 212 -41 -167 -28 240 -58 -63 -268 16 25 -6 236 -329 -138 -25 47
5513 47 75 137 -51 66 -158 29 76 3 47 -99 -123 56 -15 67 56 82 -20 -109 135 66 -26 210 -74 57 -59
5538 -59 -189 97 -219 -68 82 -171 -29 -283 -24 35 3 -88 -190 -147 38 103 -136 169 -50 -49 114 71 -66
5561 -66 -162 -38 -212 247 168 173 -69 -172 -97 29 58 -53 -23 -107 18 142 76 122 -116 -43 -305 -226 33 -203
5585 -203 51 126 176 1 48 232 142 -14 -151 38 56 269 -62 -95 194 -10 271 22 -77 -70 -100 -12 173 -121
5609 -121 -14 -197 -72 39 -66 83 -56 81 -29 -111 -33 57 -43 13 133 -27 9 -86 -45 -105 -70 -302 -203
5632 -203 128 -86 18 -90 5 9 265 -132 54 145 -74 85 164 -169 -177 16 20 103 -120 -13 36 109 9 -143
5656 -143 21 -111 48 -31 99 -17 48 16 -143 20 165 -227 -93 -167 -59 177 -146 64 43 -57 100 35
$$ packed form
5490E5k52M73k65J48r5p7J34R1k53j26J39K68k98nk05K84Rl1K42n65J91J13P2
5513D7K8O2j88J17k24J87M7p3M4j46k4J79p1Q2j1K6j02q9K44o9r2K36k84J31j16
5538e9j30K86l16J51J50k53J42k54K59N9l2r1j02M3J85O5k39L05k19JJ63m3j37
5561f6r6J24j74M59p9Nk42j03P5J26K9j11L0q4J25J24o6M6k38P3k62P9K59k36
5585b03K54P5N0j75M7J84r0j56j37J89J8K13l31l3K89k04K81k49r9Pl0Q8J85k94
5609a21J07j83J25J11j05J49j39J37j10q2P8R0j00N6J20j60L6r5M1o0L5k32R9
5632b03L31k14J04j08R5MK56l97J86R1k19J59P9l33qJ93MQ3k23J07M9P3j00j52
5656a43J64j32J59p9J30j16O5l2j59J63J45l92J34p4J08K36l23K10k1j00J57o5
$$ plain form
5678 35 -26 -200 188 -101 20 149 -178 -152 -100 -70 68 131 56 -8 -72 101 65 -11 -225 75 -170 197 -34 -13
5702 -13 -56 -16 32 -27 42 -162 -197 105 -41 -52 -27 10 60 -134 -20 -38 44 -23 -171 102 -180 100 74 -227 -16
5727 -16 149 53 -201 45 146 290 -61 366 167 -81 -30 -15 -124 -37 107 0 -105 25 60 -99 -155 -56 263
5750 263 -60 47 124 -61 -366 -104 -94 -60 80 142 120 -288 -20 286 256 -350 252 66 -173 67 66 -29 213
5773 213 -113 -82 -307 -246 70 -200 -52 65 -129 -202 -19 -39 75 -141 -13 145 107 -272 -27 161 53 161
5795 161 119 3 -157 -27 131 -23 50 38 186 185 3 -103 -61 186 21 222 -47 -183 -70 226 -120 20
5817 20 77 -43 -74 108 230 -215 -32 97 -17 238 -216 128 118 127 -33 -55 113 57 -85 -110 12 108 -57
5840 -57 -95 -28 -73 -65 68 -168 -111 52 19 -182 91 60 12 3 -13 41 134 247 4 -119 19 72 -180 -90 132 -83
$$ packed form
5678C5o1j74L88k89J21J29l27K6N2L0J38O3p5o4o4J73l6p6k14L00k45L67k31K1
5702a3m3M0M8n9O9k04l5L02j46j1K5L7N0j94J14j8Q2o7j48K73k82K80k6l01K11
5727a6J65r6k54K46J01J44l51M27j99k48N1J5j09Q7J44j07j05J30L5j59n6R9L19
5750B63l23J07P7j85l05K62J0L4J40O2k2m08K68L06l0o06O02j86k39K40jr5K42
5773B13l26L1k25O1L16k70J48J17j94p3J83k0J14k16J28J58l8l79K45J88j08J08
5795A61m2j16j60J30J58j54P3j2J48jj82j06M2K47j65K01k69j36J13K96l46J40
5817B0N7j20l1J82J22m45J83J29j14K55m54L44j0Rj60k2J68n6j42k5J22R6j65
5840e7l8O7m5QJ33k36N7J63l3k01K73l1m8rj6N4R3J13k43j23J38N3k52R0K22k15
$$ plain form
5866 -83 31 125 -45 64 46 -126 121 -13 -95 -89 40 101 39 78 190 40 -116 115 -173 -95 -83 -95 -61 118
5890 118 -260 -28 61 44 39 -134 -6 -278 157 -122 284 -17 -224 22 115 96 213 135 3 -3 -125 -48 -79 -131
5914 -131 168 -101 6 2 243 -28 -130 91 200 218 89 -126 -146 143 60 304 83 290 250 -58 -155 -88 -15
5937 -15 45 -65 58 233 144 286 83 -17 -171 165 158 -42 -87 17 -69 -137 -15 200 125 -373 36 244 122
5960 122 -114 -68 43 20 175 238 136 -5 89 303 239 -33 23 93 40 -28 -228 -107 -103 -42 -9 -3 165 -3 -65
5985 -65 -35 -100 -108 221 -169 -92 -242 62 95 -313 -125 -219 -139 -52 129 -266 110 36 -20 -103 9 74 10 -74 -6 187
6011 187 44 -191 19 -61 -193 -115 -162 -84 -88 -56 -133 -127 -162 -91 -38 107 89 44 64 23 -80 -56 159 -117 -273 -121
6037 -121 339 -204 -200 -55 -64 22 -60 105 -438 -67 20 136 -105 -17 341 41 327 -241 -162 184 292 -32 5
$$ packed form
5866h3J14R4j70J09j8j72K47j34q2OJ29O1o2L9J12j50j56K31k88P8J2j2L4J79
5890A18l78K32Q9j7nj73J28k72M35k79M06l01k07K46R3j9J17p8j32oj22P7l1n2
5914a31K99k69J07mK41k71j02K21J09J8j29k15k0K89q3K44k21K07m0l08r7O7P3
5937a5O0j10J23J75q9J42k03j00j54L36pk00m5J04q6o8J22K15p5m98M09K08j22
5960A22k36M6J11k3J55O3j02j41R4K14o4k72N6P0n3o8k00J21MO1L3OJ68j68o2
5985f5L0o5qL29l90P7j50L04L3m08J88r4Q0Q7J81l95L76p4n6q3J12O5o4q4O8J93
6011A87j43k35K10q0j32P8m7P8mL2p7Ol5P1N3J45j8m5K0m1j03K4K15k76j56J52
6037a21M60n43MJ45rQ6q2J65n43L71Q7J16k41Q8L58l00K86n68P9L46J08l24L7
$$ plain form
6060 5 -141 -128 -25 -164 -294 58 27 69 204 127 -230 -113 105 -96 232 -61 -89 113 56 -176 -188 224 -155
6083 -155 -184 338 17 -82 277 151 -210 26 -72 156 22 -146 0 -229 188 -116 -13 189 -5 180 152
6104 152 -21 -79 140 -153 -207 -169 -99 147 76 -363 -215 1 103 115 -139 -21 107 -61 -79 35 203 54
6126 54 57 257 -312 38 -144 -142 133 -109 10 14 -171 -174 -47 43 -152 6 -77 -193 60 -97 -38 -167 37 -30
6150 -30 -189 50 73 169 -92 -203 67 154 -262 -19 -13 22 -162 304 -142 -134 -148 -85 -92 115 192 -115 190 -138 138
6175 138 68 14 19 -95 198 -7 43 -166 98 -73 128 49 85 -111 -239 65 -42 129 25 -36 -7 130 401
6198 401 90 -110 -104 -77 -129 127 -89 166 -85 -36 158 -29 50 27 -10 25 -279 -166 -112 24 75 -154 72 59
6222 59 155 36 192 -94 -125 -16 -139 99 7 39 292 39 246 -24 -418 -245 -105 -5 63 254 -1 -181
$$ packed form
6060Ej46J3J03j39j30L52l1M2J35p7l57J17K18k01L28k93k8K02n7k32j2M12l79
6083a55k9N22l21r9L59j26l61K36r8K28j34j68J46k29M17l04J03K02j94J85k8
6104A52j73n8K19k93n4L8P0K46p1m39J48K16J02J2k54J18J28j68j8J14J68j49
6126E4LK00n69L50j82KK75k42J19Mj85lJ27R0j95J58q3j16K53j57N9j29K04o7
6150c0j59K39K3R6k61j11K70Q7m16K43OL5j84M66m46Qj4O3pK07P7l07L05l28K76
6175A38p0n4Nj14K93k05N0k09K64j71K01p9L6j96j28L04j07J71j04o1K9J37K71
6198D01l11k00OK7n2K56k16K55k51M9J94j87P9k3l7L5l04J13N4J36N1k29K26j3
6222E9R6j19J56k86l1J09j23K38r2L2K53k53K07k70l94J73J40J00O8J91k55j80
$$ plain form
6244 -181 10 19 -166 -102 62 83 -2 -46 5 -46 77 245 -27 -127 -38 115 -163 -103 79 -120 85 100 99 -179
6268 -179 40 -148 114 -45 78 -94 -81 -72 89 137 -130 72 77 31 -101 -50 -98 67 259 71 50 -21 38 7
6292 7 180 185 279 67 -110 299 51 66 82 220 211 -7 41 193 162 27 -106 -279 -21 -151 34 -65 138 -104
6316 -104 124 -24 44 -34 -183 -21 -78 76 14 -59 -90 -60 241 13 128 170 64 -216 80 -136 56 -134 168
6339 168 -72 -13 271 276 178 -138 57 21 18 -7 307 -54 192 35 -247 -109 -115 237 77 21 -343 -116 -96 89
6363 89 141 199 60 122 -182 89 82 54 -211 -116 -86 -122 -27 241 -93 153 244 171 260 -7 165 308 72 84 15
6388 15 25 20 -28 177 -177 197 -161 243 -339 -61 -364 -49 22 94 149 135 -106 -129 -2 -176 201 18 267
6411 267 121 -55 -97 104 12 -43 357 -13 67 139 204 -28 213 -37 44 7 42 201 15 -143 36 -99 5
$$ packed form
6244a81J91Rj85O4J64K1q5m4N1n1J23J68k72j00Q9J53k78O0J82j99K05J5jk78
6268a79K19j88K62j59J23j72J3RJ61M8k67K02Nm6j32N1m8J65J92j88k1p1N9l1
6292GJ73NR4k12j77M09k48J5J6J38rk18M8J52l1j35j33j73K58j30J85r9K03k42
6316a04K28j48O8p8j49J62n7J54o2p3l1L0L01k28J15M2j06k80K96k16J92j90L02
6339A68k40N9K84Nr8l16J95l6lk5L14l61K46j57k82J38oL52j60n6l64K27K0J85
6363H9N2N8j39O2l04K71pk8k65R5L0l6R5K68l34K46R1p3Q9k67J72J43k36J2o9
6388A5J0nm8K05l54L74l58M04n82K78l03L15P1P2N5j4k41k3J27j74L77j83K49
6411B67j46j76m2K01r2n5M00l70Q0P2O5k32K41k50Q1l7L5J59j86j58J79j35J04
$$ plain form
6434 5 228 -293 -134 193 -177 -299 81 -127 7 -77 -52 -185 130 288 -251 -102 -54 79 -30 -91 -227 338
$$ packed form
6434EK23n21J59L27l70j22L80k08J34q4K5j33L15J58n39J49M8J33j09o1j36N65
$$ [...]
8191A55
##END NTUPLES=NMR FID
##END=
