##TITLE=1H_LR-758-R6-O-MeOH
 CCl4
 8 sc, 
 29.9.2023
##JCAMPDX= 6.0         $$ Bruker NMR JCAMP-DX V2.0
##DATA TYPE= NMR FID
##DATA CLASS= NTUPLES
##ORIGIN= UXNMR, Bruker Analytische Messtechnik GmbH
##OWNER= root
$$ XWIN-NMR		Version 3.5
$$ Fri Sep 29 16:00:38 2023 Russian Standard Time (UT+4h)  she@DPX200
##.OBSERVE FREQUENCY= 200.13135
##.OBSERVE NUCLEUS= ^1H
##.DELAY= (6, 6)
##.ACQUISITION MODE= SIMULTANEOUS
##.ACQUISITION SCHEME= undefined
##.AVERAGES= 8
##.DIGITISER RES= 18
##SPECTROMETER/DATA SYSTEM= spect
##.PULSE SEQUENCE= zg30
##.SOLVENT NAME= CDCl3
##.SHIFT REFERENCE= (INTERNAL, CDCl3, 0, 15.7039)
##AUDIT TRAIL= $$ (NUMBER, WHEN, WHO, WHERE, WHAT)
$$ ##TITLE= Audit trail, XWIN-NMR		Version 3.5
$$ ##JCAMPDX= 5.01
$$ ##ORIGIN= Bruker BioSpin GmbH
$$ ##OWNER= she
$$ F:/spectra/data/she/nmr/H-F/1/audita.txt
$$ ##AUDIT TRAIL=  $$ (NUMBER, WHEN, WHO, WHERE, WHAT)
(   1,<2023-09-29 15:58:49.09 +0400>,<she>,<DPX200>,
      <created by zg, POWCHK disabled, PULCHK disabled
       configuration hash MD5:
       00 E9 B6 7A A2 85 ED C7 34 08 36 98 17 FE 4E 26
       data hash MD5: 16K
       02 42 79 29 F4 25 0E 20 B0 EE 60 69 9E 2F BE 60>)
$$ ##END=
$$ 
$$ hash MD5
$$ 76 D6 3D 1E 75 D0 33 79 6E DB 56 03 73 7E 41 C4
##$RELAX= 
##$RELAX= 
##$RELAX= 
##$RELAX= 
##$RELAX= 
##$RELAX= 
$$ Bruker specific parameters
$$ --------------------------
##$DU= <F:/spectra>
##$EXPNO= 1
##$NAME= <H-F>
##$PROCNO= 1
##$TYPE= <nmr>
##$USER= <she>
##$AMP= (0..31)
100 100 100 100 100 100 100 100 100 100 100 100 100 100 100 100 100 100 
100 100 100 100 100 100 100 100 100 100 100 100 100 100 
##$AQSEQ= 0
##$AQ_mod= 1
##$AUNM= <au_zg>
##$AUTOPOS= <>
##$BF1= 200.13
##$BF2= 200.13
##$BF3= 200.13
##$BF4= 200.13
##$BF5= 200.13
##$BF6= 200.13
##$BF7= 200.13
##$BF8= 200.13
##$BYTORDA= 1
##$CFDGTYP= 0
##$CFRGTYP= 5
##$CHEMSTR= <none>
##$CNST= (0..31)
1 1 145 1 1 1 1 1 1 1 1 1 1 1 1 1 1 1 1 1 1 1 1 1 1 1 1 1 1 1 1 1 
##$CPDPRG= <>
##$CPDPRG1= <>
##$CPDPRG2= <>
##$CPDPRG3= <>
##$CPDPRG4= <mlev>
##$CPDPRG5= <mlev>
##$CPDPRG6= <mlev>
##$CPDPRG7= <mlev>
##$CPDPRG8= <mlev>
##$CPDPRGB= <>
##$CPDPRGT= <>
##$D= (0..31)
0 1.2 0 0 0 0 0 0 0 0.06 0 0.03 0 0 0 0 0.0002 0 0 0 0 0 0 0 0 0 0 0 0 
0 0 0 
##$DATE= 1695988728
##$DBL= (0..7)
120 120 120 120 120 120 120 120 
##$DBP= (0..7)
150 150 150 150 150 150 150 150 
##$DBP07= 0
##$DBPNAM0= <>
##$DBPNAM1= <>
##$DBPNAM2= <>
##$DBPNAM3= <>
##$DBPNAM4= <>
##$DBPNAM5= <>
##$DBPNAM6= <>
##$DBPNAM7= <>
##$DBPOAL= (0..7)
0.5 0.5 0.5 0.5 0.5 0.5 0.5 0.5 
##$DBPOFFS= (0..7)
0 0 0 0 0 0 0 0 
##$DE= 6
##$DECBNUC= <off>
##$DECIM= 32
##$DECNUC= <off>
##$DECSTAT= 4
##$DIGMOD= 1
##$DIGTYP= 9
##$DL= (0..7)
0 120 120 120 120 120 120 120 
##$DP= (0..7)
150 150 150 150 150 150 150 150 
##$DP07= 0
##$DPNAME0= <>
##$DPNAME1= <>
##$DPNAME2= <>
##$DPNAME3= <>
##$DPNAME4= <>
##$DPNAME5= <>
##$DPNAME6= <>
##$DPNAME7= <>
##$DPOAL= (0..7)
0.5 0.5 0.5 0.5 0.5 0.5 0.5 0.5 
##$DPOFFS= (0..7)
0 0 0 0 0 0 0 0 
##$DQDMODE= 0
##$DR= 18
##$DS= 0
##$DSLIST= <SSSSSSSSSSSSSSS>
$$ [...]
##$SUBNAM2= <"">
##$SUBNAM3= <"">
##$SUBNAM4= <"">
##$SUBNAM5= <"">
##$SUBNAM6= <"">
##$SUBNAM7= <"">
##$SUBNAM8= <"">
##$SUBNAM9= <"">
##$SW= 18.05172834244
##$SWIBOX= (0..15)
0 0 2 0 0 0 0 0 0 0 0 0 0 0 0 0 
##$SW_h= 3612.71676300578
##$TD= 16384
##$TD0= 1
##$TE= 0
##$TE2= 300
##$TE3= 300
##$TEG= 300
##$TL= (0..7)
0 120 120 120 120 120 120 120 
##$TP= (0..7)
150 150 150 150 150 150 150 150 
##$TP07= 0
##$TPNAME0= <>
##$TPNAME1= <>
##$TPNAME2= <>
##$TPNAME3= <>
##$TPNAME4= <>
##$TPNAME5= <>
##$TPNAME6= <>
##$TPNAME7= <>
##$TPOAL= (0..7)
0.5 0.5 0.5 0.5 0.5 0.5 0.5 0.5 
##$TPOFFS= (0..7)
0 0 0 0 0 0 0 0 
##$TUNHIN= 0
##$TUNHOUT= 0
##$TUNXOUT= 0
##$USERA1= <user>
##$USERA2= <user>
##$USERA3= <user>
##$USERA4= <user>
##$USERA5= <user>
##$V9= 5
##$VALIST= <valist>
##$VCLIST= <CCCCCCCCCCCCCCC>
##$VD= 0
##$VDLIST= <DDDDDDDDDDDDDDD>
##$VPLIST= <PPPPPPPPPPPPPPP>
##$VTLIST= <TTTTTTTTTTTTTTT>
##$WBST= 1024
##$WBSW= 4
##$XGAIN= (0..3)
0 0 0 0 
##$XL= 0
##$YL= 0
##$YMAX_a= 470171
##$YMIN_a= -369333
##$ZGOPTNS= <>
##$ZL1= 120
##$ZL2= 120
##$ZL3= 120
##$ZL4= 120
##$ABSF1= 10
##$ABSF2= 0
##$ABSG= 5
##$ABSL= 3
##$ALPHA= 0
##$AQORDER= 0
##$ASSFAC= 0
##$ASSFACI= 0
##$ASSFACX= 0
##$ASSWID= 0
##$AUNMP= <proc_1d>
##$AZFE= 0.1
##$AZFW= 0.1
##$BCFW= 1
##$BC_mod= 2
##$BYTORDP= 1
##$COROFFS= 0
##$CY= 11.3945322036743
##$DATMOD= 1
##$DC= 2
##$DFILT= <>
##$DTYPP= 0
##$F1P= 15.7292609196834
##$F2P= 12.9074282941183
##$FCOR= 0.5
##$FTSIZE= 0
##$FT_mod= 4
##$GAMMA= 1
##$GB= 0.15
##$INTBC= 1
##$INTSCL= 1
##$ISEN= 128
##$LB= 0.24
##$LEV0= 0
##$LPBIN= 0
##$MAXI= 10000
##$MC2= 0
##$MEAN= 0
##$ME_mod= 0
##$MI= 1.114404
##$NCOEF= 0
##$NC_proc= 0
##$NLEV= 6
##$NOISF1= 3.799351
##$NOISF2= 2.8
##$NSP= 1
##$NTH_PI= 0
##$NZP= 0
##$OFFSET= 15.70392
##$PC= 1
##$PHC0= -21708.92
##$PHC1= 10.25271
##$PH_mod= 1
##$PKNL= yes
##$PPARMOD= 0
##$PSCAL= 0
##$PSIGN= 0
##$REVERSE= no
##$SF= 200.130013532006
##$SI= 16384
##$SIGF1= 3
##$SIGF2= 2
##$SINO= 400
##$SIOLD= 16384
##$SREGLST= <1H.CDCl3>
##$SSB= 0
##$STSI= 0
##$STSR= 0
##$SW_p= 3612.71676300578
##$SYMM= 0
##$S_DEV= 0
##$TDeff= 0
##$TDoff= 0
##$TI= <>
##$TILT= no
##$TM1= 0
##$TM2= 0
##$TOPLEV= 0
##$USERP1= <user>
##$USERP2= <user>
##$USERP3= <user>
##$USERP4= <user>
##$USERP5= <user>
##$WDW= 1
##$XDIM= 8192
##$YMAX_p= 0
##$YMIN_p= 0
$$ End of Bruker specific parameters
$$ ---------------------------------
##NTUPLES= NMR FID
##VAR_NAME=  TIME,          FID/REAL,        FID/IMAG
##SYMBOL=    X,             R,               I
##VAR_TYPE=  INDEPENDENT,   DEPENDENT,       DEPENDENT
##VAR_FORM=  AFFN,          ASDF,            ASDF
##VAR_DIM=   8192,          8192,            8192
##UNITS=     SECONDS,       ARBITRARY UNITS, ARBITRARY UNITS
##FACTOR=    0.0002768,     1,               1
##FIRST=     0,             0,               0
##LAST=      2.2672688,     0,               0
##MIN=       0,             -369333,         0
##MAX=       2.2672688,     470171,          0
$$ Real data points
##PAGE= N=1
##DATA TABLE= (X++(R..R)), XYDATA
0 0 0 0 0 0 0 0 0 0 8 -8 8 -8 8 -16 16 -24 24 -32 38 -44 52 -60 68 -80 92 -108 123 -140 156 -175 197 -223
32 -223 248 -276 307 -340 377 -417 461 -508 560 -616 676 -741 813 -891 977 -1069 1174 -1290
50 -1290 1417 -1559 1721 -1903 2112 -2357 2643 -2983 3392 -3897 4531 -5345 6424 -7908 10044
65 10044 -13312 18766 -29192 55038 -217979 -351796 237970 -369333 207344 -221301 187603
76 187603 258439 -188584 252055 -191881 70101 -179232 -48816 42352 -56962 165661 -50502
87 -50502 137658 -37372 24585 -65299 -54439 7968 -88043 69148 -65547 101203 -47645
98 -47645 59768 7731 -58997 89715 -118185 85458 -106295 49347 9725 -63259 124762
109 124762 -89262 135104 -79753 18179 6769 -97558 69597 -115350 105164 -20356
119 -20356 40583 35151 -42794 56943 -108292 31886 -57504 35635 17519 -9903 79233 -45198
131 -45198 46555 -74617 9810 -18434 -35524 35793 -30415 72786 -33467 37623 -6724
142 -6724 -8558 13525 -63876 42323 -46883 26450 -13225 15767 48964 -38338 52585 -31424
154 -31424 13981 -41038 -18067 18755 -49102 43505 -7949 43919 -3867 6919 22506 -48511
166 -48511 5256 -41368 10555 -17817 9579 35449 997 33559 -21802 15211 -30160 -20574
178 -20574 -6406 -12605 25893 -11304 38441 3791 3964 -5895 -14598 3651 -32293 16288 -3932
191 -3932 13720 4597 3961 16229 -26407 9694 -17282 622 -6214 540 20723 -13455 18102
204 18102 -8704 3427 -11857 -7634 10056 -14724 14464 -3939 11722 -1879 -1983 7970 -10739
217 -10739 6991 -10866 4309 -4449 -2695 3128 -1177 13824 -4323 9162 -435 -3598 -10778
230 -10778 -8711 3373 -11968 9467 9159 12019 -113 1323 5066 -20363 -6043 -6779 2505 -2663
244 -2663 6843 18885 -2933 5678 -3698 -1525 -11541 -8256 4828 -4785 7740 3041 9317 1233
258 1233 -2982 29 -7223 -958 -6740 2657 3191 1677 2044 842 4427 -6472 -1444 126 56 -3688
274 -3688 -507 7591 -2650 -1416 2478 3667 -5269 -3513 5979 -2988 -2765 2395 5639 -2609 -2348
289 -2348 6133 -4182 -2991 993 1716 -2337 421 6101 -4493 -236 2313 -1840 -3397 1428 3377
304 3377 -4404 2027 2686 -2023 -449 2021 -1007 -3561 3177 -551 -3100 3170 4313 -3459 -926
319 -926 4611 -3077 -5070 2148 2938 -4000 1341 5782 -1982 -2135 1733 -700 -5439 -161 3397 -2778
335 -2778 1074 3627 2029 -1100 -946 757 -3702 -781 -2417 38 4423 629 1026 1729 3611 -4594
351 -4594 -5377 1809 -1026 -2192 645 5793 1905 -1011 959 -952 -2077 -2755 -1044 188 1659 1846
367 1846 1066 1757 610 -1338 -2648 -2501 -1230 225 1089 1172 3732 2407 -688 -2651 -756 -1403 -4015
384 -4015 381 2314 2708 1489 1594 1222 -1224 -904 -3542 -2065 -394 -652 160 2140 4948 1269 783
401 783 240 -1510 -3227 -4185 -1655 -466 3451 3153 2990 4322 1578 -3114 -5524 -2746 -3477 -3080 1779
418 1779 5332 5624 2606 2109 -1038 -3843 -5357 -4879 -646 1874 3651 3371 4764 1677 -2700 -3365
434 -3365 -2790 -2182 -2128 2112 2540 1145 1081 216 62 -1980 989 3 -949 162 -1162 -1089 -2288 2066
452 2066 2106 2297 2678 1163 -1099 -5173 -3782 -3086 -1053 3078 5558 5929 2718 222 -4099 -6922 -5762
469 -5762 -3025 1401 5076 7957 6043 2840 -2180 -5654 -8234 -6166 -1207 1581 6955 7528 5830
484 5830 1128 -2342 -4964 -8064 -4145 -1174 1694 3998 5754 4637 -38 398 -2565 -3856 -3807 -1471
500 -1471 -1125 -1184 3006 2895 3027 2859 2801 -640 -4163 -3441 -4782 -3499 -1035 3924 5242 5560 5657 211
518 211 -2258 -6166 -6457 -6301 -938 3914 4605 7498 5791 2358 -4112 -5148 -5534 -7096 -1383 2448
534 2448 5755 4548 5682 2801 -3385 -3590 -5354 -3477 -3068 2216 3894 2706 4645 1175 -62 -3470
550 -3470 -2138 -2912 -2865 974 -53 2474 2051 2430 955 -214 -32 -3530 -2636 -2214 -900 -727 2492
567 2492 5194 2710 2366 130 -1929 -5614 -4745 -2801 -1048 3557 5436 6760 4286 857 -3462 -7179
583 -7179 -6332 -5445 -902 4003 7967 7449 4748 1522 -4266 -7723 -8103 -4489 -923 4125 6841 6756 4873
600 4873 9 -3120 -6328 -5347 -3594 -1288 2788 4206 4828 2677 1117 -402 -2375 -3063 -2817 -1225
616 -1225 -423 230 1656 2523 2811 2143 858 -540 -2769 -3141 -3619 -2190 877 2735 4300 4215 3253 -59
634 -59 -3721 -4772 -4880 -2556 534 3712 5660 4985 2888 -1498 -3769 -4844 -4875 -2123 1692 4472 4493
651 4493 3945 1645 -1267 -4240 -3895 -3020 -1876 1188 2545 3357 2526 2190 -288 -2212 -1789 -2664 -1971
668 -1971 -1084 1413 1373 1939 3172 1262 920 -1475 -1306 -3297 -2506 -605 -172 2449 3136 3716 1182 195
686 195 -1315 -4020 -3166 -2236 270 1624 3374 3191 1700 299 -1785 -2672 -3675 -1164 -200 936 2810
703 2810 2488 1968 -892 -231 -2284 -2391 -1078 -655 1181 665 2695 605 124 167 -1909 -1128 -2050 460
721 460 -584 788 1917 799 1197 -501 -142 -2089 -1117 -145 -820 746 745 1824 8 750 8 -1581
739 -1581 -711 -692 -78 -599 1354 1263 669 929 -200 -403 -1651 -108 -904 -435 757 797 1597 29 1006
758 1006 -467 -1037 -423 -1001 -126 -381 1343 425 747 1017 -563 -66 -879 -152 -1264 126 898 187
776 187 879 189 586 -889 59 -107 -1084 417 -93 1239 -145 405 429 -1140 130 -712 192 24 449
795 449 744 -137 617 -778 -553 -454 -131 46 135 1120 227 428 -64 -37 -808 -1067 142 -585 161 550 1092
816 1092 24 141 415 -1265 -688 -893 171 -361 784 1248 187 901 -289 -290 -1196 -352 -210 -648 971
835 971 783 616 92 128 -404 -1399 -458 -644 -64 256 968 1031 266 551 -355 -857 -1027 -485 -664 68 1340
856 1340 860 1089 663 557 -951 -1104 -1125 -1008 -550 655 1446 1049 1269 926 -696 -1127 -1425 -1166 -1086 788
876 788 1290 1099 1522 976 -276 -1623 -1271 -1252 -1403 488 1356 1497 1403 970 -34 -1654 -1093 -1309 -770
895 -770 16 1180 1070 610 794 239 -804 -884 -466 -1005 -330 446 650 277 1018 1137 -48 200 -84 -814
915 -814 -1269 -813 112 -463 1422 1895 1382 765 -331 -950 -2639 -1116 -914 25 1473 1964 2165 756
933 756 214 -1284 -3092 -1795 -947 375 1018 2313 2090 587 119 -971 -1984 -1943 -482 -252 793
950 793 1648 1577 491 103 458 -1382 -1009 -685 -712 -243 235 853 472 1094 795 55 -279 -900 -678 -1795
970 -1795 -138 442 654 1761 1619 1168 -722 -675 -1901 -2338 -770 314 1493 1655 2490 989 -568
987 -568 -1330 -2615 -2105 -1074 747 1846 2308 2479 835 -646 -1836 -1818 -2317 -796 793 1493 1919 1410
1005 1410 1265 -694 -1031 -1192 -1278 -756 158 664 191 1149 809 55 395 -294 -331 -1453 -773 -1016 -798 799
1025 799 1113 1822 1220 1004 -305 -1710 -1863 -2083 -1155 -193 2254 2518 2226 1765 -633 -2165 -2766 -2012
1043 -2012 -1447 427 2419 2631 2115 648 -369 -2206 -2745 -1672 -864 872 1598 2210 1247 701 -212
1060 -212 -1637 -1667 -1286 -300 -134 1030 1123 566 803 193 -197 -893 -418 -551 -931 100 90 563 712 1660
1080 1660 459 -168 -608 -1312 -1572 -1248 37 626 1594 2360 1136 204 -1214 -1512 -2472 -1573 68 648
1098 648 1737 2066 1895 -191 -859 -1532 -2070 -1430 -216 1219 1155 1803 1411 66 -860 -1016 -1044 -1597 97
1117 97 455 483 1252 579 407 -394 -59 -702 -1084 -108 -136 321 217 1004 509 427 520 -68 -381 -1008 -367 -740
1139 -740 -271 1171 666 784 276 225 -1298 -1034 -582 -1090 -28 657 1709 510 483 246 -753 -1117 -1226
1158 -1226 -277 -78 799 1333 864 667 -132 -513 -1227 -616 -285 -430 623 533 661 496 464 -25 -915 -547
1178 -547 -399 -322 -369 596 559 107 758 287 -172 -690 -272 -525 -488 288 537 636 289 614 -164 -509 62 -907
1200 -907 -375 -225 307 290 673 743 -409 151 -491 -464 -653 -443 474 6 755 372 239 8 -241 -323 -809
1221 -809 -160 293 96 502 426 451 -249 -71 -339 -682 -270 -328 110 247 926 218 34 -27 -416 -881 -392
1242 -392 188 140 300 404 55 -163 -257 151 -482 -145 188 343 249 152 208 -809 -25 -51 -230 41 266 421
1264 421 -358 328 193 -430 105 -99 311 -101 342 214 -223 286 94 -113 -208 141 81 -276 -82 148 -355
1285 -355 156 222 203 -159 48 -157 -283 -443 416 -294 149 496 403 -55 -290 -89 -645 -203 -49 -151 292
1306 292 301 633 -362 -239 81 -459 -376 8 410 -58 503 366 28 -108 -742 -474 -393 -46 532 72 539
1327 539 210 94 -343 -289 -150 -389 110 110 312 532 629 64 -334 -97 -657 -561 -267 321 368 126 786 553
1349 553 -46 -383 -260 -697 -131 27 135 505 347 406 -74 -201 -58 -720 -540 -211 284 -84 480 687
1369 687 217 159 -10 -506 -630 -365 -313 -246 464 642 532 216 -50 -134 -711 -858 -482 -52 100 801 665
1390 665 377 220 -361 -533 -682 -320 34 238 730 389 253 -58 -364 -622 -866 27 11 348 467 219
1410 219 265 168 -87 -164 -332 -287 64 -246 184 346 -40 88 383 28 -207 -253 -205 -595 51 119 500 692
1432 692 859 117 -151 -449 -650 -787 -482 74 187 616 1073 485 -86 -603 -1099 -761 -383 220 355 592
1452 592 978 471 74 -391 -454 -933 -832 127 202 631 681 436 150 -349 -136 -521 -307 -2 96 103 329 548
1474 548 -57 -51 105 -380 -332 -350 -300 -54 133 728 334 588 644 -140 -613 -782 -631 -633 -79 756 926 706 575
1497 575 94 -751 -935 -754 -598 -289 813 805 862 641 -203 -439 -880 -717 -690 -104 667 932 931 145 -42 -316
1519 -316 -843 -326 -156 240 301 564 373 492 564 -280 -98 -181 -330 -292 -133 78 34 363 390 424 87 -289
1541 -289 -360 -601 -495 -164 -114 272 1062 807 273 -311 -396 -873 -864 -230 98 713 1036 860 539 -357 -530 -901
1563 -901 -903 -389 -25 642 1123 963 373 -331 -610 -752 -525 -397 174 345 450 595 114 78 -46 -462 -515
1584 -515 -558 31 -15 419 500 267 332 162 -239 -352 -403 -596 -323 -53 393 395 568 483 284 -341 -760 -434 -279
1607 -279 -283 343 386 705 567 -14 -428 -387 -204 -536 27 13 800 618 282 286 -450 -224 -289 -422 -136 191 679
1630 679 612 500 230 -68 -289 -447 -324 -552 31 246 243 265 176 183 33 -212 -318 -105 42 13 108 20 559
1653 559 383 37 -140 -143 -150 -129 54 392 63 486 312 371 -75 -50 -540 -441 -74 39 110 400 403 186 -48 -235
1677 -235 -231 -161 -240 -26 105 -17 674 25 26 -293 -180 -286 -163 -78 161 -89 225 434 -78 18 -146 -205 -230
1700 -230 -279 154 -124 196 156 -55 67 -261 -452 -125 43 105 80 319 17 39 -117 113 49 -167 375 67
1722 67 46 139 53 -145 -153 41 -222 -46 -271 -189 -440 69 270 -179 205 53 52 -172 -42 -83 29 220 136 224
1746 224 166 2 -232 -273 -140 -60 -233 -44 208 164 -6 -48 -60 -203 -332 66 -177 133 421 147 -12 -194
1768 -194 -48 -678 -432 -109 -165 304 225 532 76 139 -247 -81 -4 -135 76 -34 135 95 -146 -89 -375 -78
1790 -78 -464 23 126 -3 37 -119 67 -80 128 -74 -27 194 -12 -10 167 -20 -9 -322 19 -257 -375 -280
1812 -280 -41 -121 148 383 252 358 89 -126 -269 -216 -181 -120 331 320 175 -99 -92 127 -312 -344 -169 -22 94
1835 94 97 241 115 177 -224 -241 -253 35 -367 -96 263 270 342 209 291 -177 -337 -407 -209 -170 -56 444 429 395 17
1860 17 -194 -432 -275 -307 -239 11 125 413 182 347 135 -24 -420 -426 27 -267 -70 145 30 350 102 -33
1882 -33 -30 116 -141 -681 -176 121 278 161 507 36 -306 -67 -175 -255 -185 50 109 284 472 321 -36 147
1904 147 -359 -346 -306 48 110 207 421 236 61 -339 -445 -338 -263 -31 83 318 273 224 -111 -170 -260 -243 -173 68
1928 68 158 359 185 413 191 88 -126 -410 -412 -73 -115 -97 -125 98 -43 177 95 -102 -235 -184 -76 -212 -14
1951 -14 65 210 322 360 -99 -196 -135 -399 -326 -23 299 472 334 212 -114 -543 -390 -66 -307 150 459 632
1973 632 358 57 -55 -429 -520 -422 -330 -108 -136 209 -6 265 166 -191 -123 200 -90 71 -71 -173 116 226
1995 226 188 28 186 57 -276 -277 -191 -105 -8 112 584 390 -34 1 -393 -160 -604 -329 -67 313 415 554
2017 554 15 2 -254 -522 -252 14 96 -14 343 384 -228 81 -128 -543 -355 -143 -139 276 319 311 150 35 -180
2040 -180 -212 -381 -207 181 -46 -54 367 32 320 -56 -247 -219 -96 114 -44 80 229 208 170 429 -39 -333
2062 -333 -210 -75 -10 -12 172 84 246 420 44 -182 -162 -158 -193 -269 129 482 139 173 260 2 -159 -112 -227 -94
2086 -94 90 195 34 424 275 219 -81 -166 70 35 75 219 382 190 27 -169 5 -292 -111 -79 2 233
2108 233 -87 131 19 89 5 -181 -32 -312 -69 -135 -65 -226 207 167 5 137 -94 -254 -26 -33 194 50
2130 50 209 -45 147 -82 -11 -245 -116 -212 52 -109 165 181 19 48 -162 -151 -343 -325 -278 124 -229 259 126
2153 126 192 81 213 -25 -34 30 -61 59 284 217 43 -127 99 -273 -13 92 214 68 300 10 45 -231
2175 -231 -125 70 -47 281 -231 208 211 61 198 216 140 175 -22 -22 -256 319 -54 42 79 126 1 -50 -159 -133
2199 -133 -289 -34 -210 223 106 91 3 303 -10 75 -103 -267 161 6 108 -21 58 -226 -24 -254 -259 128
2221 128 39 302 -114 -14 131 74 -16 -378 158 34 130 84 41 -65 -193 -150 210 -406 60 -232 -63 127
2243 127 99 174 -148 212 92 76 -17 44 16 -84 107 -144 -112 196 -113 74 123 92 203 -201 76 -8 48 268
2267 268 172 -46 225 -89 118 -15 41 37 85 5 -39 -102 -106 -140 -51 -127 295 154 -92 51 -99 2 -285 -187 50
2292 50 154 157 144 145 -93 -68 -221 -627 -91 122 15 -123 -61 8 23 196 -71 -247 -228 -161 153 -182 55 137
2316 137 -164 -57 154 -21 13 -139 -162 -137 113 -130 146 156 318 208 -174 -60 62 84 -216 150 -26 218
2338 218 -51 -136 -222 -133 -43 -125 23 -2 72 -101 249 -101 272 34 -152 -53 121 -87 6 166 304 276 -135
2361 -135 74 -119 -125 -52 110 -24 6 353 187 -199 -76 64 8 -123 67 149 -151 203 305 95 -37 -240
2383 -240 -346 -173 -295 -23 159 259 272 68 -5 -223 -238 7 -20 126 -1 116 241 13 -91 10 25 -367
2405 -367 -83 34 -252 157 222 186 -57 99 54 -403 -57 132 189 -56 79 114 193 9 64 -49 -190 10
2427 10 -233 -186 21 317 27 31 95 18 -38 -22 -213 -137 167 157 396 -32 265 258 -78 83 -296 -241 -101 -12 31
2452 31 225 -4 -198 -33 -47 -52 -330 -137 52 -144 -77 44 282 -116 -15 97 -166 -220 -27 36 26 157 4
2475 4 281 73 -199 -168 62 -21 22 4 182 163 47 -198 31 120 -237 -255 76 80 72 -57 9 -97 13 -113 -112
2500 -112 -17 -220 -194 48 5 155 71 238 28 -196 -196 160 41 118 38 106 20 5 -148 -90 -182 95 149 74 116
2525 116 135 166 282 -29 -325 -164 -19 -114 -103 -3 122 164 -6 307 125 -137 88 -110 71 150 42 185
2547 185 37 -175 274 46 -84 -65 -168 -47 -47 149 75 -1 -38 -11 147 8 -279 -125 -327 -37 133 -8
2569 -8 97 -175 -100 -131 47 -109 35 -76 -48 35 -80 -91 -76 115 13 -204 -60 8 -163 -63 61 201 -13
2592 -13 -48 -197 -122 46 85 -64 -140 195 32 -255 -55 -311 -181 -21 -114 -104 -28 193 272 39 -216 1 56
2615 56 -191 -93 13 171 160 -46 171 150 117 -67 21 58 -101 83 -131 -64 3 48 -126 -306 -59 37 92 193
2639 193 -10 -112 -175 106 -201 195 58 93 -46 6 -50 -271 19 -92 146 14 -96 -84 -65 -146 -36 291
2661 291 134 160 258 171 -5 -93 -229 136 56 290 -3 -63 181 21 -86 -70 42 -28 -82 183 -154 72 -69
2684 -69 -368 -23 76 240 -10 -57 -12 -190 -117 -198 18 -241 -81 62 128 -149 21 36 -345 -166 -299 157 124
2707 124 -121 53 -41 187 68 25 -82 10 35 221 61 10 78 71 -59 -65 -141 189 -34 76 26 -92 -7 -51 -129
2732 -129 80 247 184 153 22 -125 -140 -156 -186 152 45 106 181 30 259 -277 -200 241 -82 80 63 -62 -201
2755 -201 -9 7 -131 5 206 -220 -60 33 -14 -118 -52 -44 169 64 89 -97 -84 -194 5 151 24 33 -51 -41
2779 -41 -161 82 -137 208 53 138 123 245 39 -106 -285 -190 -127 67 29 345 46 91 -148 -123 -112 -23 -129
2802 -129 -149 -91 7 -9 57 252 -97 57 -43 -60 70 143 17 -118 0 -24 0 147 69 71 200 21 -297 127
2826 127 186 -37 29 209 -28 -4 49 182 -164 -14 -107 70 37 99 -100 -27 -318 -156 -206 86 0 -61 44 -213
2850 -213 -213 -116 32 59 96 105 -101 114 2 334 -52 13 -354 -22 22 44 -35 65 87 99 39 353 -43 -193 -114
2875 -114 126 -47 -51 -125 115 -11 265 19 -166 -20 44 75 23 170 -91 -52 200 -2 -87 -45 128 -183 -178 -154
2899 -154 63 154 -80 -7 -11 -219 -101 -55 -14 67 30 137 84 191 -46 105 -194 -117 -23 169 26 327 191 40
2923 40 -115 79 -77 -137 -298 25 -81 86 64 13 -131 81 -134 28 42 -83 10 30 -206 67 -6 -114 36
2946 36 -30 -229 -154 -86 -320 -84 93 88 -112 -174 11 203 -99 69 -135 10 38 169 130 206 -30 229 56
2969 56 182 -54 -59 -238 -124 -110 -36 -35 -84 -83 73 195 -122 14 -127 -106 -9 -362 -123 -163 -174 -201 327 120 7
2994 7 73 17 213 -48 31 13 -17 150 40 81 152 1 64 -39 1 28 10 94 42 5 202 180 -96 44 146 121
3020 121 63 -12 -138 234 -21 133 -71 159 -267 16 -65 -192 -87 45 -140 78 -4 29 -31 -16 -272 -78
3042 -78 -286 275 -57 -159 -76 -19 -52 90 -159 -190 8 93 41 -109 316 -72 -175 -52 3 -203 -83 -7 -187
3065 -187 16 -85 -170 -83 -212 131 4 -58 -133 -310 190 -17 110 147 -77 41 -19 -149 103 100 19 11 36 3
3089 3 41 -107 30 157 51 -7 -163 181 -88 166 136 89 105 -23 -17 -105 -43 70 -210 121 -39 -42 254 -180
3113 -180 -56 -40 84 -114 -167 286 98 -175 88 229 -60 64 121 -146 -32 12 156 172 19 -82 205 -2
3135 -2 38 9 -129 37 120 101 -91 -87 -95 -258 -55 133 111 24 119 -67 -196 114 54 -87 -21 96 -343 63 264
3160 264 -342 -55 61 25 193 156 112 -84 135 20 -7 -104 13 203 -1 -176 154 23 0 92 227 35
3182 35 127 -23 57 -101 -51 86 -153 -45 -48 -13 338 -57 144 72 -147 -127 -46 -114 88 215 66 77 -125 -15
3206 -15 21 -71 -9 -115 155 170 8 -233 -89 196 -123 -73 192 -253 85 -38 -115 33 -143 -154 291 -108 -93
3229 -93 84 -105 -30 -68 -132 -17 -56 157 188 131 324 0 -142 -25 93 43 -27 90 -149 74 -148 134 69
3252 69 -175 218 192 66 12 62 11 -28 166 -174 49 9 -97 154 62 -241 -81 -139 69 -12 -73 -3 63 248
3276 248 -34 57 116 10 -277 28 115 -12 -53 -40 133 -23 -116 -123 23 -143 -84 -149 256 118 222 -4 195
3299 195 76 165 -15 -59 -229 18 29 -87 201 -144 -5 -333 -184 -134 -122 30 58 -228 -29 179 82 58 -29
3322 -29 -30 -140 154 63 127 -210 -30 -54 -5 -39 -45 -62 20 64 132 -116 -87 -116 6 -149 80 -27 67 136 -29 -121
3348 -121 -163 236 211 40 -213 30 -29 13 64 172 -34 160 175 10 -28 -80 -33 61 118 57 103 -44 104 74 -76
3373 -76 64 -86 14 119 -155 -19 -33 61 -182 -7 -166 -193 135 164 -275 33 26 33 68 107 -16 130 -193 59
3397 59 -35 -239 163 -110 -4 304 -62 7 -77 -163 -117 88 358 -32 24 -97 -42 -33 61 -38 164 60 62 76 8
3422 8 149 -40 -71 -128 -56 92 -303 113 -148 -15 -90 -106 210 -57 15 124 64 -57 80 -229 41 60 -7 45
3446 45 283 68 116 134 -78 287 71 -9 -152 -33 119 75 277 89 21 62 -5 20 59 105 182 130 -56 -122 264
3471 264 53 -97 -186 111 314 -75 -18 49 75 -228 239 224 46 127 -81 82 -119 -79 67 29 -123 -41 223
3494 223 -8 -77 -16 -47 243 -38 134 48 -89 28 -116 -147 -14 -72 279 98 194 244 -32 54 47 234 53 -59
3518 -59 128 268 166 -333 -49 45 190 130 -51 114 -86 253 300 -176 -50 28 -237 -204 60 151 92 -20 62
3541 62 -21 -109 -123 -192 153 3 -40 335 48 22 39 293 29 -51 -116 80 312 121 -108 44 78 -77 -103 -45
3565 -45 -90 -120 -177 31 170 -112 149 1 -47 50 -124 -58 21 43 -94 -192 -38 -223 -192 -157 -78 301 79 39 100
3590 100 -179 -61 55 0 -146 155 211 -51 248 -51 135 -111 -89 -198 -76 194 23 -82 125 224 -223
3611 -223 -131 -148 7 32 119 -30 185 16 244 31 227 146 -87 40 48 109 208 24 124 161 121 174 127 36 127
3636 127 148 -69 28 -125 0 111 -19 86 -9 -290 -16 86 95 -36 43 -29 -25 -206 -179 17 112 -178 -135 -92
3660 -92 51 122 -122 -131 -136 -154 99 5 0 18 154 -33 -231 188 -83 -33 270 -91 159 -6 -133 -272 45 -25
3684 -25 66 20 337 37 -11 -368 -24 248 139 61 -204 -56 -28 -34 135 49 -57 -16 93 343 -178 -251 -147 46
3708 46 -187 48 97 60 -89 -172 26 4 162 -1 -3 32 68 -214 -18 -280 -295 -178 34 -138 121 101 60 -219
3732 -219 -59 127 -177 50 -131 -6 -142 100 -108 -102 11 -228 11 -76 18 318 56 116 -135 -155 -280 -118
3754 -118 -172 -127 -22 -94 -238 -193 -48 -127 -14 26 -116 347 25 -8 54 77 39 -308 100 -121 -121 -29 179 63
3778 63 36 -346 -9 66 -112 346 -24 120 69 -119 -115 172 224 24 133 -112 -212 -60 -11 8 124 -218 -98
3801 -98 61 -105 32 185 122 -122 -217 -57 -17 -96 -101 -27 25 -287 161 30 161 -221 -85 134 18 34 -87
3824 -87 198 25 142 13 211 115 -61 121 309 80 391 26 -16 66 72 2 -103 59 129 -41 15 -34 32 25
3848 25 26 260 -229 60 134 -16 -23 -124 -216 -78 5 -7 -181 56 -37 -216 -117 67 6 -179 109 24 95 61 -239
3873 -239 -84 43 -15 110 190 -90 35 -43 28 -105 61 -21 178 -50 41 149 -137 117 9 74 12 119 2
3896 2 -31 -99 28 46 -74 141 38 -22 -155 -63 -87 -20 -48 109 -191 -115 -115 -60 25 -81 -28 209 134 7 123 34
3922 34 10 -67 60 125 225 -87 39 75 -58 -142 75 56 -280 1 10 14 9 17 -208 290 125 -312 -213 27 81 -31
3948 -31 286 168 19 -93 39 -108 167 -116 125 -179 20 -194 -23 33 -158 164 -123 -31 -159 -46 -134
3969 -134 152 -157 -75 -165 157 -23 -124 -51 -11 61 -45 127 -26 -141 -68 -230 106 110 -159 -9 -14 -90 274 -65
3993 -65 -14 -3 132 87 -40 122 102 -27 -101 140 39 -26 -12 -139 173 -115 61 140 -95 -27 11 73 14 -24 1
4018 1 156 -125 -3 5 -138 -130 126 -149 -261 -37 233 91 -69 -123 -23 -63 114 166 40 41 -108 -137 -176 117
4042 117 -4 0 105 31 -21 -3 350 -199 -186 6 114 -40 2 -129 -180 19 -218 70 117 103 36 410 52 -139
4066 -139 7 130 -137 204 92 -266 -96 52 75 0 -132 -137 10 185 -50 12 239 -100 -6 366 133 71
4088 71 -95 32 -84 158 -353 -228 104 225 131 129 -79 -218 28 -33 -141 125 -106 -78 99 -161 -79 227
4110 227 151 -150 75 74 127 -105 185 -86 124 -173 -3 -73 -148 -73 -108 -29 -190 -21 -3 102 217 123 22 22
4134 22 -275 -79 -95 15 -13 8 -189 81 -54 191 -143 15 -45 -21 72 57 31 -58 64 21 -124 27 -60 64
4158 64 241 253 -67 -184 -39 -194 80 130 -57 1 -148 58 -72 -108 177 65 -137 -121 -75 -8 -219 -25 -57
4181 -57 6 132 -166 -161 -93 -25 -83 264 172 74 -181 -209 16 -18 -275 -164 242 -78 -68 -47 73 -166 144 114 -46
4206 -46 -115 -41 -173 40 -83 77 40 12 -80 -117 34 -304 105 131 -204 -80 140 -33 246 94 -124 -146 108
4229 108 -108 163 -130 46 78 -127 -91 -26 177 -125 35 237 -236 99 -114 71 23 -141 113 -1 90 -26
4251 -26 106 -273 208 91 -94 -143 -41 206 73 -34 -139 -168 221 135 -77 -75 -61 -88 64 240 35 4 101
4274 101 3 36 166 -141 94 -79 -183 -34 111 75 60 -81 -152 -202 12 189 -160 -287 -54 -99 -69 151 -298
4297 -298 261 -282 -148 -332 -359 63 68 108 -32 26 87 -157 0 199 -132 -6 79 37 -199 46 105 297 -80
4320 -80 -19 -82 -103 161 64 114 88 168 -32 -103 -31 -190 285 158 62 -148 -182 10 43 75 -65 127 169 145 -143
4345 -143 4 -259 73 90 -26 -94 196 -131 171 -137 -23 78 73 145 -118 -2 -151 187 -165 -96 171 -233
4367 -233 71 -236 156 183 -61 -21 103 27 86 53 -141 -70 20 -33 -148 -23 -335 231 40 -104 37 -157 -173
4390 -173 -50 35 -121 14 62 16 -51 -192 -25 -68 -75 -115 -47 202 127 -57 -126 -81 3 -68 20 -89 84 -66 -133
4415 -133 41 -40 -20 -286 -5 23 80 54 50 -31 -69 -24 44 -308 -251 -39 114 -81 -63 -39 131 -27 -30 44 -38 -57
4441 -57 62 136 -51 -92 301 25 -60 -37 -50 -134 -121 86 152 -106 -94 -189 -43 3 -29 62 16 21 19 182 18 164
4467 164 52 -13 107 28 92 -2 -39 44 -23 109 158 34 -58 -76 -54 210 -84 65 37 -69 187 -152 81 -168
4491 -168 -25 32 80 -274 -220 -269 177 0 105 24 -146 -57 131 -41 -196 12 57 137 -111 -4 -7 -106 -13 -5 -19
4516 -19 151 156 -28 -92 -49 -142 -2 97 -112 53 -30 40 178 -111 -170 42 83 66 -8 239 106 -219 -164 76 69
4541 69 12 -104 -209 -53 -68 51 -146 -30 -217 -155 -147 -66 -149 65 234 -115 175 79 174 -50 248 162 75 1
4565 1 271 54 -69 -102 -43 65 -243 352 -132 -98 -39 -34 51 179 33 -89 -94 -272 -61 -59 -55 301 29 142 39
4590 39 125 71 -87 -61 -97 47 -16 90 50 260 66 114 154 294 245 -111 161 -32 -123 3 126 315 0 6
4614 6 -80 23 -144 -220 -96 61 -47 165 5 -6 -39 48 -164 28 110 -50 -3 49 -225 -104 55 -79 -90 37
4638 37 178 147 -72 -50 69 -64 -48 -145 -40 257 -74 -64 -30 -28 -27 147 115 -85 60 239 -34 0 110 34 109
4663 109 -179 -60 63 34 -6 -198 115 103 70 8 133 -7 134 -121 220 255 -133 -109 50 175 -30 166
4685 166 88 -16 14 -132 -123 -140 -151 143 -4 -309 8 -27 -175 73 97 -23 -109 -192 112 -189 69 15 -164 -3
4709 -3 -81 -93 52 -17 -198 -85 142 -139 -178 149 -15 -77 -20 49 64 -53 -81 -245 43 -69 -34 160 140 -311
4733 -311 -15 202 -38 18 219 247 -301 168 101 144 -79 -72 34 -181 -178 49 -105 -8 -123 104 -32 -65 17 -235
4757 -235 92 77 -19 -148 -67 95 -88 -22 99 95 3 111 -94 254 63 178 73 92 222 -22 -149 -109 13
4780 13 -73 86 222 105 86 18 -62 -193 29 -40 -92 -98 -128 -144 -53 -118 23 -17 109 140 2 246 -159 -185 -233 -101
4806 -101 -150 -192 -209 -237 75 155 -32 35 -205 80 219 -84 213 145 211 -323 42 -90 11 201 -22 93 -165
4829 -165 201 130 -138 -116 -128 13 26 -145 170 -96 -116 60 3 200 -59 95 124 -94 140 -139 -35 104
4851 104 31 175 -99 -83 -20 -109 18 -87 -83 -89 137 14 -48 -43 74 30 -411 -143 161 -105 33 0 86 -19 -87
4876 -87 83 20 -13 4 -62 6 -102 158 11 -47 -62 -20 247 192 13 -172 68 155 -6 -97 -59 -205 -126 -63 95
4901 95 -86 55 243 314 -74 59 -65 -17 -85 -101 159 177 8 -181 104 -31 -64 -276 -52 81 -2 -59 145
4924 145 105 109 33 67 -276 -94 -5 145 79 -32 -129 -181 56 112 147 222 106 -7 130 -103 122 103 -11 -90 30
4949 30 -266 -210 203 81 152 -42 -88 113 89 -238 228 12 -1 -276 -33 4 -70 97 -31 102 -57 -107 8
4972 8 -50 -183 117 64 274 -108 -153 14 -147 119 -106 153 25 -167 -100 -67 182 -43 13 58 133 -80 -109 -130
4996 -130 -19 -51 -44 -71 -132 101 -86 -1 -19 -12 98 119 137 11 -202 -153 -86 -94 -189 -192 -78 -26 -116 -58 -22 225 29
5023 29 -35 135 50 36 37 -217 361 165 -11 130 -56 185 -8 0 112 -101 -65 -103 92 12 -17 -3 -195 85
5047 85 21 225 312 -43 -38 14 265 106 -105 -36 -25 62 1 -90 119 21 -89 -148 -119 -78 178 236 -21 4 -75 -76 159
5074 159 -125 89 123 -46 189 147 188 -167 -188 218 -4 23 29 -209 -170 71 31 184 -240 -101 114 -208 -220
5097 -220 -58 -87 93 89 152 329 -17 -154 -35 187 57 -37 -129 -1 -175 -268 -174 104 73 7 -134 -271 -13
5120 -13 72 49 -289 -77 -63 231 50 -166 123 181 20 16 6 191 -59 198 1 -46 -189 -94 54 141 -53 -86
5144 -86 -125 -71 152 -30 -66 169 -67 144 50 88 62 -13 -164 95 13 -195 -112 -92 -167 163 -88 -62 -18 -157 68
5169 68 56 -119 -141 40 -188 -71 -174 7 -132 71 246 127 -48 25 91 -142 143 85 31 -82 200 -52
5191 -52 135 67 -53 40 -54 -125 165 211 59 -175 66 157 -112 101 -24 -30 -182 14 -167 283 173 95 -37
5214 -37 -48 -103 -79 -190 -19 -26 112 206 -69 69 -161 78 -62 30 -45 238 -278 182 -38 117 128 34 -8 10
5238 10 14 -72 0 -55 -45 -145 146 -79 12 57 -29 -15 30 156 -113 -227 5 205 -16 12 31 -58 11 198 -152
5263 -152 111 -146 95 -47 283 102 20 -45 241 -385 -126 -38 48 84 -103 -38 49 65 -97 -123 300 63 -112
5286 -112 69 -179 -236 -13 -56 19 83 91 46 -143 -47 122 17 -117 246 -16 91 -180 201 -200 36 -26 122
5309 122 -51 115 -25 42 137 48 -312 49 114 -55 -147 58 -132 104 17 169 50 73 157 153 -18 34 -6 -231
5333 -231 101 2 -11 -94 230 141 -42 -14 73 -18 -10 -43 90 -17 -209 4 82 -2 98 157 -58 170 291 15
5357 15 5 -194 -60 76 2 -200 80 -113 26 -15 -244 13 82 -24 -36 229 89 244 -123 49 112 -103
5379 -103 240 84 203 35 46 -17 -145 -91 22 93 60 -133 -9 237 -7 261 -43 -86 57 158 -151 39
5401 39 -14 -40 105 -45 92 -181 199 43 173 -68 121 -171 102 -12 132 158 31 85 -186 44 -13 57
5423 57 -109 13 -202 -94 61 18 -316 16 -211 -205 -99 -252 8 73 112 -108 171 46 -77 -138 -17 52 -48
5446 -48 -132 143 152 -91 -75 136 -65 30 -232 -13 193 152 -149 -312 -122 205 -361 -57 -100 90 -108 40 1
5469 1 177 -41 140 111 -142 131 5 -52 65 -89 -122 -33 -41 475 167 106 18 101 -98 -95 -2 134 -43 127 -5
5494 -5 -50 283 89 -282 1 -3 -59 118 -203 73 -257 37 100 216 62 -90 98 148 -51 -85 45 -114 -256
5517 -256 152 -4 73 216 131 30 64 -125 -209 95 57 -135 -119 259 -22 44 -107 -11 -259 39 135 -67 44
5540 44 -177 -26 21 66 -316 -119 -78 12 14 77 -46 -174 13 -76 -165 52 -269 36 -121 -430 -72 158 -96
5563 -96 -144 -146 -145 63 70 -29 88 26 176 -189 240 60 -213 -153 282 -90 98 -163 179 126 290 -140 -102 194
5587 194 -95 -31 -30 -35 15 -126 -145 434 -187 45 10 0 77 -170 -58 -71 216 40 9 -37 -192 40 -104 -57 34
5612 34 76 -128 -40 119 63 147 -42 -131 -63 -224 -205 -67 212 -289 194 -13 191 31 -63 60 -10 -157 -196 -141
5636 -141 100 171 246 24 -96 114 41 207 32 176 -69 83 -31 95 -13 252 51 12 43 -228 188 -44
5658 -44 228 15 -37 -69 19 -123 206 -9 55 -37 70 16 79 200 15 222 166 162 -32 38 4 -58 -157 22 135
5683 135 -58 96 65 -171 37 277 250 -86 -96 90 84 -12 -98 50 70 66 160 -55 30 -103 -15 242 131 -19
5707 -19 119 -43 -45 -6 -129 167 -68 10 -46 100 12 228 -184 -141 -64 -175 15 -52 -74 121 -196 20 -267 -41
5731 -41 52 -220 133 -44 126 15 165 20 144 -4 53 -54 -117 36 -71 -49 107 453 33 -211 -44 149
5753 149 344 -178 105 58 32 1 57 -110 107 -234 -18 59 -181 -88 -202 -156 -121 63 -102 -18 -84 -41 193 -48
5777 -48 -81 -5 -24 42 -61 -22 -63 -131 7 -93 -28 51 55 103 -28 281 -83 -4 -359 -179 -74 -35 -126 89 259
5802 259 -72 -188 -121 95 -108 174 158 -19 70 154 -107 299 -16 -12 -1 -207 165 31 -114 151 196 5 -197
5825 -197 278 203 211 -63 -15 -63 -183 41 27 28 42 6 52 181 -144 -89 158 -59 126 289 -12 -39 -81 -91 -33
5850 -33 -196 16 23 -33 -73 -50 195 -51 118 -57 42 -17 -101 -52 243 -339 -60 -70 12 -82 218 -286 56 48 120
5875 120 18 120 34 181 -131 -78 -49 146 106 -95 143 -90 83 -84 -103 8 -63 -44 257 31 6 83 -56
5898 -56 88 -118 170 -91 -197 -153 98 -126 11 -192 -22 -41 49 127 -145 122 150 62 -73 -27 -113 72 129
5921 129 32 47 155 -49 5 61 166 108 -205 -156 -167 275 -139 10 -14 -156 49 81 -151 39 -52 110 155 -69
5945 -69 -57 195 -53 94 -63 50 142 85 59 -308 -209 205 8 76 -133 -191 28 150 -73 -151 -189 -171 -1 -297
5969 -297 -72 -136 -55 -143 237 47 112 129 83 -39 153 -80 116 -120 -91 141 -142 -107 -60 165 -119 84 107
5992 107 26 -30 -164 149 -60 330 255 24 -147 -107 269 -194 281 57 122 5 -19 -167 -215 -154 129 27 43
6015 43 -75 -5 18 -53 -89 -116 115 -11 152 114 14 -117 -28 58 306 56 163 -129 -233 -164 5 247 -72
6038 -72 181 4 67 221 4 -89 34 -133 -179 36 116 -30 170 -303 -144 85 27 -210 36 54 76 107 -102
6061 -102 377 -44 -260 -171 55 -71 -37 161 -287 23 124 -12 -174 -49 -23 125 -125 108 -249 -66 117
6082 117 111 161 13 -7 -174 28 -164 -50 27 10 162 143 33 -89 34 205 -71 176 18 33 -132 -113 51
6105 51 -26 110 36 -1 -43 -209 9 41 -16 -34 -35 117 77 167 231 74 -37 30 0 37 53 -153 19 -182 -5 85
6131 85 51 78 15 -88 299 -35 98 -32 -141 21 116 81 285 107 -106 122 -49 -283 139 -29 -85 -96 75
6154 75 -168 204 -206 44 204 25 -241 -155 34 -79 66 -54 53 -91 -106 119 78 57 46 -103 39 23
6176 23 -6 91 -179 -331 73 -227 -209 -110 -25 65 73 -29 -69 136 9 -82 56 32 218 -32 -58 -78 -373 65 144
6201 144 94 101 62 165 76 -79 -216 10 -5 97 -97 97 313 51 -228 219 -108 -103 75 -88 33 155 -115
6224 -115 12 -236 45 23 -146 -150 -85 43 -208 88 126 -107 -152 301 -36 -97 -62 77 203 -38 -27 180 139
6247 139 64 228 -103 223 295 -89 54 52 19 215 -39 89 -20 270 69 -172 81 108 -85 125 -186 1
6269 1 -59 69 -113 -42 43 -106 -250 -58 253 -246 21 15 -379 2 36 15 229 -54 -210 -108 -145 -77 35 -230
6293 -230 146 144 -77 -96 11 242 -161 388 -17 135 41 -6 -151 160 69 102 67 -46 -130 -165 157 -331 36
6316 36 -200 99 65 -187 85 1 22 -57 24 85 -228 5 116 5 150 3 63 250 -131 -232 9 -108 214
6339 214 -7 -228 -198 -20 332 87 -35 23 -78 59 158 -148 252 -57 -307 -169 81 -119 30 -60 -125 -55
6361 -55 175 92 70 -12 -43 66 -55 -44 -1 119 66 157 -303 -148 -123 -161 -16 203 -278 -137 -147 -137 -60 -68 17 -45
6387 -45 -76 36 184 78 -15 -187 144 178 -198 -142 207 -58 30 21 -36 -148 102 -7 -89 -220 119 124 -26 -125
6411 -125 -182 46 -147 117 -108 146 -24 62 31 32 84 -16 51 173 164 274 -79 -66 -308 -306 132 -425 33 4
6435 4 438 -22 16 -153 -129 -112 -124 -34 -90 175 -12 -56 -103 0 48 15 4 11 15 -49 -7 120 -80 -11 16 -27 -11 57
6463 57 14 -105 -97 56 -30 -142 197 -69 28 113 4 -175 -21 134 -116 34 -81 -42 -231 -124 193 192 -167
6486 -167 -48 -87 14 -119 -15 -32 60 100 -238 -211 154 4 121 66 5 203 -192 -27 211 172 -51 8 197
6509 197 158 151 -22 -229 -57 205 -32 -4 101 -103 -14 -106 -117 -113 -17 -4 75 20 -56 -134 50 -163 -249 9 80 147
6535 147 -141 -266 -29 -134 92 14 -191 2 25 105 34 118 38 -58 -220 51 53 26 -166 110 127 81 34 155
6559 155 -44 12 -26 -48 -53 116 60 -126 -50 -109 -132 -123 27 -108 12 32 -34 206 170 21 204 38 219 104 -4
6584 -4 51 167 20 -115 81 180 -68 -79 -213 162 47 -35 -16 25 4 -169 -191 4 -100 -196 58 -129 -61 -123
6608 -123 118 -37 -31 -14 -283 -64 -236 180 -157 -84 75 27 -130 91 168 80 -199 120 26 -34 -9 -293 -129
6631 -129 -65 92 -16 -34 16 20 116 110 108 0 129 -81 -113 -74 -73 131 -149 -116 -186 135 -24 70 -130 42 43 -2 -169
6658 -169 -59 -70 53 -100 -191 -256 33 47 -104 137 75 -2 41 186 -12 92 122 95 -84 -67 -181 0 222
6681 222 -108 35 -277 19 71 15 -261 88 -178 74 -27 -138 74 -274 23 279 -58 38 -71 -16 -36 -44
6703 -44 -102 -276 -89 38 194 25 -16 -109 131 -127 -8 171 36 77 -71 42 105 -37 -80 27 -14 178 85
6726 85 148 -116 -2 -253 -27 46 26 -110 -65 81 -120 -109 50 -84 12 238 77 -68 -56 -239 130 -181 47
6749 47 110 -312 6 -187 -61 61 112 -85 98 -2 -8 130 -84 106 -114 195 -63 -33 96 73 160 -129 68
6772 68 11 115 -26 -34 12 13 38 228 21 -214 -13 180 -170 99 -162 179 -139 60 -185 56 159 174 113
6795 113 164 -232 16 -197 232 -79 258 123 -7 -177 171 211 -82 -162 -204 244 -28 51 -134 105 -258 -90
6817 -90 22 96 -90 107 -26 -149 -58 121 -121 -124 -136 -27 37 -39 -184 60 -103 -100 172 -329 -257 -184 -97 -152 251
6842 251 -278 -72 87 32 -259 171 -164 -148 294 146 69 -38 89 136 184 230 6 9 -35 88 43 -40 -193 -22
6866 -22 44 -107 -53 -250 255 124 -58 -74 -73 143 -199 8 216 69 -60 -268 193 0 -45 -256 -78 73
6888 73 229 6 -218 25 -19 -13 177 -7 -34 34 -39 147 -28 -241 202 -13 -226 52 70 -283 -85 149 154
6911 154 11 94 31 87 -189 -110 -47 -50 57 22 -158 -44 -73 46 190 105 -123 -28 -64 -220 107 115 -219 -200 -70
6936 -70 113 198 -45 117 53 -39 -35 -111 -218 136 -22 114 124 172 -43 22 68 -106 -121 -102 136 12 -202 -249 -47
6961 -47 3 -369 88 60 60 -89 -158 -178 288 114 -160 -12 -5 336 10 -24 -95 114 -21 -8 -185 -130 -45 84 2
6986 2 -29 -347 -186 96 -107 -190 35 -160 93 -205 0 245 179 -273 -104 69 -222 -114 -100 -146 -19 -89 17
7009 17 -206 -86 -35 74 -83 -218 -95 27 23 28 78 -14 158 2 184 176 33 19 -71 83 126 -3 9 107 64
7034 64 42 200 -25 347 53 -133 -73 10 -121 -152 -31 184 347 33 68 -11 -108 -27 7 -146 63 -154 -93 -100
7058 -100 -229 202 -156 -55 -92 -76 -29 231 -164 -36 19 -52 21 2 -15 101 89 -73 -49 -218 145 -90 87
7081 87 -52 -289 -180 -56 -109 -82 -67 44 -60 -81 -80 11 96 116 -40 56 137 146 -141 74 -31 -92 71 30 -57 -288
7107 -288 19 69 5 -3 32 -53 255 106 -88 -188 -113 -56 -131 150 -155 84 -79 149 -204 116 -79 195 -132
7130 -132 -74 92 -44 132 -269 -82 -171 -190 32 -36 233 111 -91 30 -140 -47 81 63 -214 -8 -134 -155
7152 -155 2 -168 41 -68 63 -24 -219 100 224 -237 30 -45 24 157 104 262 120 -26 99 -157 -293
7173 -293 84 5 -40 83 204 -120 160 96 81 19 -9 108 -35 112 -183 -188 -149 -295 -20 -84 220 154 124 -96
7197 -96 -130 43 -78 -15 89 -121 244 61 15 232 97 45 134 33 -66 -22 -62 -132 -54 61 -348 -262 40 -179
7221 -179 -135 -90 -15 57 -181 36 113 53 -56 110 110 199 -99 65 -161 185 186 61 -72 -7 -207 144 -92 126
7245 126 6 97 -56 -29 11 47 -13 288 24 125 -2 12 -69 -113 -19 -87 137 -200 -45 14 25 -272 227 -116
7269 -116 -121 150 134 -97 -98 28 147 218 71 -25 14 192 58 -26 -17 -9 -80 124 -211 94 143 -202 -78 80 -222
7294 -222 -46 235 42 123 109 102 -11 -200 -248 -4 -122 208 20 -76 -131 -66 97 -61 95 105 -194 8 50
7317 50 160 113 227 -11 3 -94 13 128 352 -237 -40 -37 -250 -99 -206 68 -84 -36 -29 -261 -92 -73 -58 25
7341 25 -122 154 -48 135 87 10 -140 -126 53 238 148 98 134 111 -34 -102 -115 26 138 -50 90 155 35 222
7365 222 145 -41 -57 257 61 210 -113 -29 7 16 4 -62 187 -135 -92 -118 182 67 -62 -110 2 72 10 -89 97
7390 97 -159 -71 84 -82 -25 8 -28 -89 16 -2 44 -63 -38 116 -2 172 -114 133 126 -34 166 -28 -76 -112
7414 -112 41 -201 -61 77 -126 96 63 -247 102 -148 160 -8 -79 205 131 101 -23 218 9 40 -153 166
7436 166 104 -255 65 -16 -43 98 109 -63 206 260 185 81 56 73 -247 -176 -182 -87 -145 98 78 -39 38 236 31
7461 31 -55 -1 92 30 129 300 1 -13 -15 75 -27 -80 -2 92 -5 105 -141 -161 35 -78 -38 87 96 -117 133 -208
7487 -208 32 -82 -74 -15 83 -46 -103 43 -66 -198 337 69 -216 131 -115 34 -24 75 40 -292 -161 -99 -64
7510 -64 256 200 128 61 12 -282 -94 -182 -41 -221 15 55 129 46 -131 -19 275 223 -233 63 269 41 314
7533 314 -253 38 57 -152 30 -176 163 10 13 179 -242 115 -75 -81 -35 -51 11 -132 -99 -132 50 11 13 118
7557 118 -145 -109 -67 43 57 -22 166 -28 3 49 -114 143 -137 28 -43 102 -8 -78 -240 72 -129 243 125
7580 125 -121 3 -98 -56 -347 -51 26 193 -95 -26 299 -88 -131 -48 3 68 -52 62 131 19 -21 104 50
7603 50 96 -62 174 -44 -6 -141 -74 172 82 -211 79 -86 -240 -212 -110 -71 143 227 -8 128 227 -105 -157
7626 -157 -14 -51 -28 -171 -273 -69 -105 104 110 -59 188 -62 -54 99 -248 -178 -16 -84 11 -118 -115 157 -68 196
7650 196 -187 39 -142 -267 2 1 17 147 -124 -183 -1 10 165 172 -73 -170 -12 86 219 134 -89 232 114
7673 114 -75 -170 -222 -32 -45 236 -69 -264 1 54 68 3 -5 -207 -156 -114 153 -35 -145 117 -213 -111 101
7696 101 132 -189 40 429 -76 -6 -282 143 209 92 29 8 243 139 -5 -132 159 172 -193 54 -27 -87 66
7719 66 -18 -8 85 52 160 -96 -7 -167 -261 -171 -34 -199 -24 -39 99 118 -77 -1 41 241 186 161 -143 -8 69
7744 69 95 -52 -208 -67 58 188 109 -36 -97 277 35 13 92 12 -24 -33 -103 -161 -206 5 -93 -76 -67 -216 -49 70
7770 70 0 33 288 80 -164 -183 -106 204 249 52 106 -78 -49 231 99 -21 59 -59 -102 20 -15 321 131 48
7794 48 -20 -104 -103 -78 -83 -133 233 84 77 -480 -48 11 -64 77 -8 -161 16 102 58 152 303 78 -104 -35 -263 -104
7820 -104 151 55 142 -32 121 -212 -65 -55 -91 -127 39 77 -85 -28 58 -119 -198 -85 -122 -53 50 -54 110 -138
7844 -138 22 -206 -120 83 -83 -50 293 -143 -91 142 149 -92 360 -164 -115 83 99 306 28 10 112 155 95
7867 95 97 82 -31 105 78 3 -22 -122 159 -143 -175 -21 -17 -222 86 20 -153 -2 -55 43 -41 124 50 -213 270
7892 270 242 10 -86 202 16 210 156 67 -31 -97 118 121 1 -3 -49 -284 71 6 145 -164 117 63 80 4 -58
7917 -58 -96 141 79 -39 -82 87 -221 159 7 -28 93 -142 90 16 231 15 195 -62 10 -214 -182 -71 167
7940 167 -1 -178 131 59 51 -114 67 177 116 88 -130 92 141 -252 445 309 44 -134 96 -44 67 -123
7962 -123 -54 -51 41 -81 42 -101 52 88 -126 -65 152 -3 11 68 -28 -80 151 -19 299 -205 -103 -300 14
7985 14 -152 98 -127 -91 127 123 19 -82 -119 -28 -61 8 -32 -39 115 55 437 6 -20 -79 115 -4 246 -190 -324
8010 -324 -53 22 9 -60 222 -146 128 54 -225 20 -41 -95 -6 197 228 -153 -40 40 129 -331 96 34 -97 181
8034 181 18 -81 -19 151 -330 -32 -10 22 16 -30 -124 -81 78 -82 110 -133 -5 -148 -18 275 -11 -238 -166
8057 -166 -201 48 -124 165 -118 -34 70 -104 28 31 111 120 176 266 87 116 67 -145 137 113 -86 73 69 93 77
8082 77 33 -263 48 71 8 51 -138 -15 -25 -10 -111 -187 -83 -214 50 171 -254 -224 -117 -119 93 134 -125 146
8106 146 -99 -1 105 -27 104 247 -170 -270 -235 -65 273 -110 -44 -36 86 30 62 -88 -11 -106 -127 -297 240
8129 240 -87 -146 164 56 -2 86 90 87 32 58 148 -47 52 53 26 -58 -139 -109 -28 -50 151 75 -20 -138 -97 208 -89
8156 -89 -161 27 127 142 -87 -35 327 -209 -60 -210 -85 223 40 -153 197 48 -48 -40 -15 -53 -148 34 -65 244
8180 244 -308 -206 -60 19 16 -11 38 -45 26 73 72
8191G2
$$ Imaginary data points
##PAGE= N=2
##DATA TABLE= (X++(I..I)), XYDATA
0 0 0 0 0 0 0 0 0 0 8 -8 8 -16 24 -32 40 -48 56 -72 88 -109 129 -159 188 -224 264 -308 359 -417 483 -556
30 -556 636 -728 828 -938 1063 -1200 1348 -1514 1693 -1893 2108 -2345 2605 -2885 3194 -3530
46 -3530 3896 -4298 4735 -5214 5740 -6319 6959 -7669 8458 -9343 10342 -11476 12781
59 12781 -14298 16088 -18237 20872 -24195 28541 -34500 43273 -57763 88127 -287199 192594
71 192594 -72177 -28244 221894 -117716 470171 -341454 113896 -95757 -125928 18691
81 18691 -142704 196058 -56929 142990 -3255 768 30734 -102484 27391 -106665 87398
92 87398 -68980 69128 -6782 18202 30392 -59856 81116 -116789 93282 -62384 5505
103 5505 24695 -66375 118736 -127567 113758 -53650 8266 23151 -110843 103778 -117269
114 -117269 89172 -25157 30073 77071 -73932 68905 -103457 36832 -63119 -5374 50081
125 50081 -8517 90774 -51659 65386 -51308 -23362 -26197 -50711 52530 -51737 68779
136 68779 -7134 42660 6472 -30102 29982 -61906 27154 -61315 22941 6141 -12480 46156
148 46156 -21672 66294 -45563 13364 -4835 -37699 4204 -45498 53254 -30957 33032 28694
160 28694 1247 20501 -38894 27919 -52180 -4993 -3565 -1858 26425 -9013 47921 -15392
172 -15392 8530 -20339 -17099 -2998 -32523 24939 -5482 30805 -818 8366 10484 -29431 1108
185 1108 -23497 13890 -12487 13384 22066 -3576 14646 -16691 11391 -26559 -3857 5296 -8277
198 -8277 17843 -4881 26128 -12109 730 -453 -16368 1560 -16565 18444 -8134 7675
210 7675 8420 -2364 7201 -13795 9637 -11557 216 -2698 -4330 6872 -6506 11501 -184
223 -184 11414 -1321 -3014 1985 -12555 -4546 -8514 10862 -1507 7273 15022 1487 -1122 -11429
237 -11429 2681 -16963 -6638 7216 3552 7751 1208 15989 -7972 -7146 -2305 -8272 -2505 -7105
251 -7105 12908 1647 4771 5336 -851 55 -10637 -10 -4603 602 1538 2679 8356 -889 1529
266 1529 -2945 812 -5554 -4137 4046 50 411 -638 7518 -1490 -4611 2307 684 -3991 -5294
281 -5294 6361 -48 -3798 4093 3794 -1054 -5029 4488 -1932 -5435 3259 1751 -426 -1101 5636
296 5636 -2694 -3099 4105 -1655 -2321 905 4036 -3353 -1190 4013 -2685 -1571 1623 -95 -3021 2464
312 2464 1884 -3269 2051 3306 -3591 -3414 4003 -1751 -4973 3457 4631 -2081 -305 5741 -2823 -4661
328 -4661 1090 -145 -3641 257 5464 -716 58 4119 -121 -2313 -3231 456 -2401 -1122 1362 654
344 654 5056 525 -1130 193 116 -3912 -6092 3590 1842 -1006 1908 4837 1327 -4190 -501 -1041
360 -1041 -1941 -1332 764 2259 2257 1873 -384 -284 -973 -2430 -2350 -746 1269 2087 2360 1106 1600 273
378 273 -3493 -3831 -1161 762 -1372 1869 4269 2030 465 -872 -632 -3171 -1903 -1837 -1127 2494 1739
395 1739 1730 2154 3481 -494 -2979 -1600 -2916 -2574 -1985 1826 2668 4256 3531 280 170 -2381 -5175
412 -5175 -5563 -639 1521 768 4771 6134 3304 -1076 -2836 -3661 -5402 -2968 -700 3343 5265 4056
428 4056 1834 236 -1608 -5713 -3737 -1235 1018 1128 2971 3508 -286 -120 -1099 -796 -1608 -141 1100
445 1100 -1869 225 -482 216 -90 2363 3511 -110 293 -2084 -2917 -4543 -2172 2032 2538 5160 4663
462 4663 2175 -2138 -4813 -5674 -5838 -1176 2984 6200 6563 5209 705 -4355 -6498 -7384 -4762 -605
478 -605 5397 6755 6933 5121 -1053 -4834 -7026 -5612 -4704 510 5453 5013 5543 3123 971 -4043
494 -4043 -3872 -3157 -4096 -1401 1210 2852 1124 4244 3187 273 -93 -1162 -3195 -5928 -2563 -1064
510 -1064 807 4064 5897 5603 1604 -123 -4788 -6885 -5583 -3666 930 4283 8226 5416 3897
525 3897 235 -4606 -7715 -6788 -1732 -1491 4204 7443 6040 2957 -405 -1753 -7517 -5180 -2850 -192
541 -192 2743 4235 5995 741 1199 -1734 -3327 -3564 -2995 269 -618 3321 1949 2245 1834 4 -644
558 -644 -2837 -1194 -3105 -1840 782 1337 2502 2530 4450 -89 -1757 -2880 -4066 -4111 -2485 2513 3678
575 3678 5992 5159 2510 -1368 -5563 -6461 -6919 -2290 1448 5152 7891 6875 3375 -2849 -5348 -8160
591 -8160 -7151 -3182 2353 6113 7291 6851 2316 -1310 -5593 -6813 -5839 -2706 1910 3407 5616 4557
607 4557 2141 -330 -3183 -3056 -3441 -2263 -808 891 2062 1786 2522 2264 1033 -306 -1958 -2701 -3143
624 -3143 -2370 -774 1070 4006 4617 3160 1140 -1617 -3853 -5914 -3678 -815 1900 5024 5243 4290
640 4290 940 -2495 -5060 -5562 -3014 -847 2561 5055 5200 2305 -154 -2610 -4522 -4654 -2438 499
656 499 1541 3958 3466 2441 201 -1418 -2617 -3547 -1541 -1043 215 1601 2539 2744 517 1402 -986
673 -986 -2066 -2622 -2515 -1484 -633 2529 2298 3109 2463 599 -1180 -3365 -2554 -3540 -975 1154 2851
690 2851 3420 2664 1679 -1792 -2292 -3200 -2545 -1387 765 2914 1826 2909 997 -338 -2555 -2094 -1360
707 -1360 -1857 930 1228 2306 1410 1130 449 -2226 -274 -1942 -822 -397 866 1465 284 2227 -654
724 -654 -347 -1207 -782 -798 -818 1705 83 1215 1118 626 -459 -978 -276 -1962 -188 250 869 525 1168
743 1168 1393 -850 -238 -1009 -1112 -1471 -314 742 -20 1819 718 758 -418 -437 -258 -1738 198 -420
761 -420 601 914 939 981 -645 506 -1197 -1022 -389 -178 242 192 1355 -96 602 76 -263 -787 -921
780 -921 594 -839 596 308 291 71 -674 721 -1562 -69 266 108 589 -56 962 -609 43 -364
798 -364 -1104 149 264 750 27 1133 459 -473 -356 -651 -530 -679 1020 162 386 650 681 -137 -841 -64
818 -64 -1132 -423 101 624 643 550 1213 -634 -673 -493 -556 -636 -164 884 129 1174 792 57 -471 -946 -374
839 -374 -1280 -209 687 575 942 751 539 -573 -459 -487 -991 -337 399 586 542 1377 697 47 -559 -531 -1444
860 -1444 -1277 -242 -138 639 1336 1502 456 -279 -325 -1890 -1673 -864 -126 548 1418 2270 630 336 -468
879 -468 -1654 -1838 -1097 237 212 1782 1804 914 106 -556 -1185 -2081 -1001 -51 165 1100 1669 1159 -314
898 -314 -129 -657 -1452 -1086 -47 -158 220 702 748 358 452 594 -841 -757 -612 -962 -546 96 1305 870
918 870 1208 1505 -330 -966 -1671 -1201 -1588 -304 1208 1296 2393 1888 304 -1348 -1896 -1531 -2471 -227
936 -227 935 1748 1884 1680 791 -1350 -1697 -1680 -1643 -649 1243 1421 1174 1490 363 -476 -942 -740 -1249 -1164
956 -1164 508 417 341 459 1046 472 -108 -46 -1137 -788 -1025 -662 -382 463 1710 827 1290 376 -511 -1921
976 -1921 -1674 -775 -1109 1038 1516 2290 1334 394 -523 -2587 -2088 -1571 -375 806 2225 2648 1195 586
994 586 -1533 -2392 -2213 -1542 -28 781 2326 2055 1232 233 -664 -2004 -1839 -351 -657 479 856 1319
1012 1319 673 300 469 -869 -596 -802 -945 -989 -533 607 324 1476 1327 1008 62 -637 -1363 -2510 -1057
1031 -1057 -394 724 2426 2504 2107 -276 -955 -2252 -2739 -1808 -236 1255 2105 2975 2164 53 -1364
1048 -1364 -2203 -2505 -1866 161 1100 2052 2156 1355 -469 -1354 -1226 -1967 -956 128 784 1070 1042 1207 -368
1067 -368 -226 -455 -963 -691 -267 315 -347 427 927 764 653 496 -117 -1539 -1144 -895 -671 175 1488
1086 1488 1910 1082 1420 -357 -1544 -1935 -1462 -856 -358 1951 1954 1883 1039 -328 -1447 -2430 -1379 -1204 -40
1105 -40 1514 2159 1489 550 -39 -1424 -1577 -1277 -378 -130 876 1444 572 642 326 -284 -1023 -746 -262 -666
1125 -666 168 504 498 430 454 468 -697 -141 -667 -985 -916 154 429 378 1454 368 -129 -591 -516 -904 -1261
1146 -1261 119 8 860 1056 1167 317 -948 -402 -1696 -1054 -175 396 962 720 1285 -87 -484 -489 -937
1165 -937 -796 -323 660 260 1031 995 131 -256 -326 -595 -1139 -337 198 144 562 738 661 -112 96 -83 -552
1186 -552 -565 -243 238 287 690 509 476 -83 -24 -364 -1020 -75 -467 136 584 593 409 -96 472 -502 -658 36
1208 36 -658 -26 142 653 219 239 328 18 -416 -582 -115 -490 163 615 306 333 337 177 -170 -522 -195 -532
1230 -532 -171 368 525 336 262 1 -306 -269 -198 -164 -156 616 305 -40 457 -137 -432 -600 -102 -225 -41 456
1252 456 -230 102 -198 181 -453 -222 2 -47 259 138 132 -166 -392 224 -589 111 100 -124 96 62 28 -554
1274 -554 77 26 -276 -118 67 485 -342 50 309 51 -23 276 -26 -189 -271 -171 -207 -13 563 285 110
1295 110 310 -20 -80 -324 -229 93 -93 588 294 231 -105 -55 -331 -405 221 -152 207 585 523 289 23 166
1317 166 -669 -409 -329 -37 57 509 357 89 215 87 -484 -405 -152 13 -103 271 454 153 111 -63 -185
1338 -185 -485 -170 -31 -6 170 343 617 -48 135 -274 -744 -427 -291 -236 -271 860 290 438 222 48 -336
1359 -336 -649 -212 -648 -112 330 667 374 382 291 -416 -314 -275 -365 -399 -171 467 239 563 373 317 -273 -512
1381 -512 -510 -975 -37 397 221 342 716 221 -81 -364 -643 -882 -323 51 619 657 863 512 -343 -247 -662
1402 -662 -523 -330 231 314 480 586 184 -19 -233 -602 -532 -263 -209 483 126 286 253 -82 -6 90 -165 -455
1424 -455 -114 65 -159 119 395 874 232 217 -346 -591 -544 -602 -87 8 775 872 727 356 -418 -634 -748 -870
1446 -870 -222 147 662 1052 784 522 -353 -612 -812 -537 -398 174 693 1021 327 518 76 -608 -503 -100
1466 -100 -64 -423 316 246 632 260 84 -227 -226 -343 -372 -276 -35 195 144 510 731 355 228 -230 -213 -654 -226
1489 -226 -90 170 606 810 905 286 -122 -733 -944 -717 -544 133 658 1068 715 -11 94 -783 -918 -851 -11
1510 -11 576 658 1150 561 178 -247 -498 -571 -617 -157 -250 355 559 346 179 -166 -31 -375 -504 -364 -225 -130
1532 -130 15 413 436 175 185 173 -338 -340 -539 -373 26 351 527 407 528 267 -512 -673 -634 -182 -172 536
1554 536 980 537 728 124 -603 -1055 -515 -575 -79 579 694 755 680 -233 -367 -930 -455 -624 -207 542 844
1575 844 735 263 268 -365 -476 -357 -404 -440 70 331 417 634 410 48 48 -130 -593 -370 -150 -252 -115 293
1597 293 533 332 -85 -34 -388 -652 -289 -253 34 233 412 404 376 19 -417 -525 -719 -226 46 253 809 563
1619 563 358 -155 -226 -558 -549 -255 46 286 361 585 152 -120 -126 -407 -410 -346 -51 66 211 659 284 191 40
1642 40 -77 -634 -320 -124 -86 51 30 490 99 40 -237 -380 -122 -176 -187 12 329 222 356 321 -16 -178
1664 -178 -550 -296 -169 -212 36 110 304 108 25 59 -95 -237 -497 -49 -362 42 229 -30 392 -112 -161 -179
1686 -179 -135 -127 -49 269 20 276 -11 84 -194 -234 -252 -88 -56 -12 12 99 167 63 -342 -279 -72 -176 80 -66
1710 -66 350 230 136 51 122 -337 -241 -57 -126 108 190 -37 105 133 96 -15 36 -184 276 -36 133 -156 -45
1733 -45 209 98 -14 9 -106 -256 189 339 -113 136 155 -78 -36 135 -2 -158 -225 -111 180 136 187 -148
1755 -148 -313 -122 -69 -151 -6 241 285 216 288 45 -96 -274 -193 -262 -109 410 80 274 -51 21 -367 -243 -203
1778 -203 -198 -131 79 323 118 90 -14 -236 -368 -292 -203 -106 311 70 154 148 73 129 -376 -27 -147 -29 272 82
1802 82 167 68 228 -11 31 -224 58 -62 -66 142 312 -7 272 -340 -125 -111 -206 -243 -257 170 200 192 289 393 -113
1827 -113 24 -274 -332 -285 13 201 178 237 278 -142 -105 131 -336 -243 150 145 183 185 534 278 23 -147 -487 -215
1851 -215 -76 -41 140 184 514 231 -72 91 27 -328 -409 163 39 170 377 203 25 -160 -399 -258 -245 -43
1873 -43 247 183 205 337 -83 -5 -201 -310 -113 -241 49 -29 167 246 258 151 9 -132 -327 -143 -292 -88
1895 -88 86 412 198 164 176 -285 -604 -463 -622 -284 76 286 522 400 402 85 -279 -290 -160 -209 135 513
1917 513 245 427 56 98 -331 -370 -380 -262 151 356 455 176 153 132 -40 180 -202 -170 -265 -167 -21 17 73 229
1941 229 -47 -140 -53 -393 -367 -292 44 109 431 320 446 75 -41 -4 -474 -359 -19 193 179 602 306 -20
1963 -20 -31 -382 -323 -657 57 106 223 427 324 172 -12 -169 -527 -476 -188 203 -93 220 362 -138 -126 -29
1985 -29 -335 -158 -7 195 6 78 454 154 144 145 72 -337 -138 -127 -120 -194 254 168 437 271 -62 -192 -348 -169
2009 -169 -526 -163 42 322 426 381 -112 -276 -489 -238 -188 36 213 158 253 163 7 -302 -611 -464 -385 -307
2031 -307 314 309 18 193 87 -34 -287 -261 -178 -519 201 152 282 143 -49 -6 -187 -200 -237 -23 -26 213 -209
2054 -209 -167 14 277 -1 27 -98 -240 -204 -46 234 121 313 157 52 -32 -70 -133 -323 -140 10 97 106 533
2077 533 55 -112 16 3 -144 -190 23 33 100 355 -182 4 85 -179 -228 -217 55 54 -28 118 -15 1 -95 -222
2101 -222 -85 -133 -50 170 340 263 -156 -47 36 -243 -207 8 130 25 -62 -69 157 98 -38 16 -173 -237 -76 -308
2125 -308 11 -11 185 3 77 108 -110 -130 -315 -209 -141 176 217 147 237 7 -158 70 89 -124 -394 -141 84
2148 84 40 270 -31 -113 -143 -192 -226 31 -29 27 -59 57 95 42 -403 -48 -223 -321 -55 69 203 128 -1 64 -219
2173 -219 -117 187 -157 -77 -99 79 21 77 45 -184 -159 63 -100 -106 130 -1 144 13 -101 297 -137 11 -176
2196 -176 115 187 -67 -101 88 149 295 75 -38 -14 -113 -402 102 209 -307 144 69 129 -244 -262 84 -161 -66
2219 -66 -24 266 -34 -34 -230 33 173 -47 -8 100 48 201 27 35 -6 18 -236 -264 1 55 41 -197 209 -142
2243 -142 -58 -6 -32 50 185 222 141 -122 117 -75 -188 -49 47 162 105 123 85 -101 -231 -129 83 -70 344
2266 344 -148 18 -296 -57 -104 394 334 -259 -15 229 -30 -219 72 -130 303 -167 230 49 -241 -95 198
2287 198 -191 -51 57 -10 -11 271 19 -79 -68 68 -262 -64 186 -108 222 360 25 154 -89 202 -210 22
2309 22 94 53 103 56 147 67 -93 -101 -106 21 -101 -105 -77 156 312 -136 -183 -37 171 -26 -99 13 0 10 53 84 195
2336 195 -6 -15 -141 -317 -217 98 -55 -106 63 130 247 -29 -70 -414 -120 -7 -120 -87 186 303 -3 -111
2358 -111 87 -104 -50 -119 -95 -27 85 136 -27 182 22 -164 -268 -218 -427 -28 139 322 39 187 402 -117
2380 -117 -70 -259 -40 272 253 230 14 -54 11 -198 -48 -103 -14 43 69 223 -171 68 -54 -92 19 135 -77
2403 -77 -216 -356 21 63 -132 -89 -13 23 99 54 -174 20 10 -110 8 -29 90 28 -62 -166 -6 -199 -3 237
2427 237 327 331 255 -93 -3 72 -14 -307 35 -6 -43 272 1 -174 -145 -149 -64 -364 -59 156 -258 101 57 132 -49
2452 -49 -12 127 -78 -101 -229 -73 183 379 127 231 142 102 -107 -218 -158 -137 -13 138 6 194 -29 163
2474 163 14 -101 -183 -34 -19 -52 124 -143 345 -56 -7 141 51 -220 -150 -141 131 163 262 130 65 -150 17 20
2498 20 -179 -4 167 105 134 222 -65 15 -116 1 55 -162 102 127 191 -67 358 100 92 -349 -19 -230 -84
2521 -84 -150 43 124 -34 -67 -21 102 -295 24 15 117 -76 492 322 -74 -34 -146 -13 -186 -50 -166 -74 225
2544 225 -37 -37 -97 100 70 258 -239 118 -222 21 89 -106 275 21 -111 -105 -172 -44 -132 84 62 255 66
2567 66 117 -59 -44 290 -110 -54 -91 20 -46 -182 73 -83 -205 -225 -212 25 103 344 -25 -16 -105 -12 -199 81
2591 81 -83 75 -40 15 -44 159 236 -123 -77 -306 -221 106 -223 48 111 113 -85 352 127 14 -66 129 108 220
2615 220 -123 119 -33 -55 108 -71 207 -108 -153 -31 -201 67 -98 43 5 6 -102 -230 -43 99 122 12
2637 12 16 122 -84 -73 -144 -33 -9 86 -118 93 326 -168 201 -24 61 -179 -330 -231 47 -82 -103 32 11 41
2661 41 139 -4 -84 -51 -19 60 -41 170 -86 260 12 165 81 -172 177 32 -33 239 53 133 -66 -251 125
2684 125 -112 -74 196 60 -27 -51 130 326 -54 -205 -147 65 -27 241 39 -235 -165 -196 -52 122 -157 -10
2706 -10 -16 -89 -69 -5 -390 242 164 219 -100 -29 -72 39 -268 61 0 -77 -168 314 170 6 15 -203 19 -149 48
2731 48 244 270 85 36 -45 -96 137 54 186 -87 51 -118 222 -98 -157 125 -80 99 104 95 -193 166 21 14
2755 14 -251 -153 -240 210 150 -30 131 100 52 26 20 -67 -134 23 -178 6 248 -214 -133 337 -241 -116 290 89
2779 89 189 -345 -48 41 131 18 -48 -91 -105 -180 -77 304 106 138 -19 -277 95 -134 -68 60 -75 60 80
2802 80 45 -3 72 92 -104 299 126 -240 -26 -129 33 58 -191 136 -47 -16 -3 -70 388 94 3 30 54 172
2826 172 41 59 11 -86 29 -159 173 47 -11 -82 34 -3 -154 -38 144 150 108 51 -106 -166 99 -185 -171 -51
2850 -51 -137 -4 -30 24 -60 -223 -194 -83 -67 234 -165 6 46 -197 -66 200 193 33 216 -143 -40 -84 38 136
2874 136 43 74 22 -65 -94 79 -45 -138 82 187 164 -38 103 -6 66 -132 -116 -80 43 122 167 60 23 45 -81
2899 -81 -43 -192 -218 246 -153 -38 -111 -24 73 65 -119 -124 -166 69 30 19 5 -142 -45 86 -126 179 -171 -242 20
2924 20 -150 -141 -186 -47 -30 45 -101 115 -230 -161 91 19 -9 -136 -170 -97 65 -80 -10 -194 -153 -176 -83 188 151
2949 151 88 -26 -139 193 -8 -288 12 -67 -188 -35 146 143 104 -86 -26 148 -103 -30 105 138 -10 -81 -48
2972 -48 -401 11 164 83 135 -291 35 120 -50 18 -93 34 180 -70 -93 146 16 80 -158 -111 201 57 -73
2995 -73 -196 35 16 43 103 8 -240 94 -95 -236 -208 -77 -53 -221 -279 -31 246 300 60 245 9 -138 -15
3018 -15 53 67 -27 188 15 64 341 12 -167 195 -175 52 -216 304 68 16 211 92 16 210 173 -138 -150
3041 -150 -95 -51 1 87 -50 4 -97 -13 97 52 -157 75 49 57 173 94 -56 -184 171 -233 -161 -210 3 -206
3065 -206 32 53 240 -206 -92 -28 -98 -178 -300 105 49 -35 36 146 47 -86 127 -44 239 140 187 80 77 170
3089 170 251 -47 137 192 -90 -156 -69 -128 -26 15 -74 67 -28 143 -73 8 -128 -27 -16 -157 -66 198 -33 -63
3113 -63 -63 110 -231 34 52 74 -185 -53 -116 -22 -36 -145 -92 -156 225 -66 -103 -41 95 153 -98 -7 52 -46 -149
3138 -149 -35 81 46 -50 -73 60 -25 57 309 -119 185 13 125 -55 53 3 193 96 -11 -122 50 -37 119
3161 119 88 -53 -78 -64 -245 244 -12 -106 -65 165 157 -5 -26 -85 7 197 82 -10 -126 154 147 5 20 -172 -119
3186 -119 58 -168 265 239 141 35 -185 -22 -125 -42 69 -92 22 -8 82 91 166 101 -64 -80 -46 15 37 17 -104
3211 -104 38 -259 107 303 101 -133 34 174 -41 -29 75 142 -23 15 -19 52 68 131 37 116 -60 167 181
3234 181 -11 -54 -80 27 -21 2 119 -13 314 132 185 -61 32 79 -72 298 52 59 -17 143 -90 13 237
3257 237 -54 -202 4 292 0 108 -59 -117 23 12 -216 50 119 -63 74 -27 32 -181 -74 89 -25
3278 -25 190 172 68 -60 -67 -95 6 -18 -107 141 86 -149 -79 -185 -85 347 136 83 -213 262 112 -4 69 -163
3302 -163 -286 237 -79 217 -106 -158 68 27 -11 -215 -295 86 111 -274 20 158 126 -31 -75 -127 -172 -286 237
3325 237 -63 -1 -22 -19 254 -189 47 170 1 213 21 223 75 -28 -7 -66 4 113 243 245 -140 -12 -63
3348 -63 -263 199 -33 246 70 8 45 -153 -10 -269 46 292 -41 -23 30 -91 35 -34 10 -132 52 291
3370 291 183 -133 -58 -133 14 59 -117 -104 159 150 77 -47 164 174 66 -229 -228 -46 66 80 -39 115 -16 -21
3394 -21 157 89 59 -259 113 192 -309 -55 -180 -58 214 -196 132 0 -176 120 -43 -177 156 -132 6
3415 6 79 158 178 228 -221 -302 56 -303 -51 182 -120 45 -5 154 390 59 25 -305 42 -18 -64 -59 -156 12 300
3440 300 139 118 -3 138 -154 -26 -33 278 58 81 -38 -73 -196 9 -122 37 -172 19 111 -193 42 -250
3462 -250 -53 -1 -148 6 143 86 342 108 20 -144 287 84 34 -108 135 66 -162 46 0 121 120 -40 14
3485 14 93 -22 114 -345 40 39 -93 -58 108 12 -95 -25 41 152 -127 -24 76 154 -89 -150 -282 47 -123
3508 -123 -332 -120 249 94 -205 -164 -38 -65 -166 -8 188 -14 4 121 -199 -153 -75 148 13 51 -157 -61
3530 -61 -52 127 -50 212 -67 -74 176 -44 -45 118 7 -33 -135 227 108 205 -108 -47 32 -51 34 102 2 47 -51
3555 -51 -69 -20 -150 146 91 -5 -79 -3 -93 -76 251 -101 -68 25 -177 -39 145 -57 62 -35 343 -94 103 39
3579 39 85 108 157 -55 -149 -87 264 -1 -210 -166 107 -79 174 -69 -51 83 220 130 149 -166 -92 -77 -8 0 33
3604 33 -19 20 83 -110 2 138 146 90 176 167 -156 14 160 -219 300 -39 -61 -131 91 -87 -231 -119 88 -183
3628 -183 33 26 217 -69 71 166 10 -191 128 173 -36 240 -127 -93 -96 -81 -32 -175 153 62 -37 124 169 -28
3652 -28 4 60 47 100 -132 -76 66 274 33 259 -47 -118 41 156 189 -74 -39 128 170 26 111 79 -34 -31 33
3677 33 94 -14 -117 -19 18 73 -20 373 169 165 -81 -127 -142 -87 -25 6 -66 62 199 -19 54 95 81 -40 -51 54
3703 54 44 32 -108 164 145 -6 305 185 138 28 42 -178 -94 -78 216 128 -86 94 -29 70 -92 112 -119
3726 -119 -212 -128 -68 -218 268 87 -331 91 39 -117 -51 -8 -13 -62 -92 -51 -96 -30 -18 43 -85 127 -60 74 38
3751 38 87 262 72 68 -99 -173 -148 -138 -296 -257 -106 105 173 85 -75 -122 168 -107 -79 179 257 237 -29 -123 122
3776 122 92 -139 30 133 -115 339 -377 -16 185 79 -219 14 -41 -290 -21 -216 -130 -25 -147 -38 -158
3797 -158 -52 -55 -62 193 158 52 -22 45 118 -43 133 -194 -172 192 131 -23 96 127 29 -126 130 32 62 -93 25
3822 25 113 -44 -28 28 -190 170 154 152 119 111 66 -20 269 -104 161 -26 -31 99 140 164 207 125 -182 342 -89 66
3848 66 33 80 86 -226 -233 86 -98 -112 -10 159 151 58 -122 -90 119 -118 -56 176 192 118 -44 -211 154 -39 -51
3873 -51 53 129 -36 300 -92 -95 81 139 -22 -53 -156 -28 65 16 -34 -84 154 -63 -66 -17 -67 -67 44 271 -58
3898 -58 46 1 -86 -90 -181 -70 -41 -291 -10 137 -160 -57 45 -58 -36 85 -105 -75 -145 -63 -85 54 -99 -35
3922 -35 76 -93 -61 -101 293 130 58 66 118 94 18 40 -106 -25 106 -87 75 -92 156 -10 -156 136 38 43 131
3947 131 27 -92 71 -228 -173 -83 -61 111 -81 -6 -32 100 10 81 40 -110 90 -275 -202 -98 -91 -5 -129 -174
3971 -174 9 32 -28 237 99 35 -61 184 68 -120 -142 -206 19 203 -127 -146 -101 -167 14 -180 -81 -16 173 77
3995 77 162 -248 98 -74 135 -135 -242 33 -190 -72 57 -24 -266 154 -203 270 -150 -171 26 74 59 143
4017 143 -97 13 -221 -128 188 -76 133 -118 107 -57 108 143 -173 76 -155 -46 6 34 162 211 -36 172
4039 172 26 -206 -75 126 81 -83 -100 117 81 -130 -52 -120 202 -312 -96 15 9 -194 174 -51 6 157 44
4062 44 -236 0 -178 -29 82 74 42 -194 -62 -59 69 -179 -37 -42 -80 64 -164 -175 5 -13 87 129 33 138
4086 138 -211 83 74 -3 -18 326 122 20 150 -83 107 79 20 -26 68 187 115 -48 32 218 -128 107 57 45
4110 45 40 119 -21 7 -114 -41 165 -20 232 -72 -28 -126 51 31 38 -25 -110 -167 -65 26 53 -15 152 254 53 105
4136 105 136 54 -102 -58 155 28 -100 64 117 104 61 0 22 194 154 20 -366 194 -206 19 -86 47 81
4159 81 2 -32 205 121 -165 -76 219 1 -254 139 -12 -27 208 -21 17 150 122 109 1 -118 40 -99 460
4182 460 29 1 161 46 236 -69 38 145 -148 -29 -99 169 153 236 67 179 -136 -135 60 -85 -149 201
4204 201 -85 -99 35 -47 -178 -42 -125 134 89 82 114 -62 -57 -94 -146 162 -108 51 -207 60 65 53 189 80 -51
4229 -51 60 29 -232 103 -10 138 56 -35 -232 -86 -89 95 -67 22 92 -20 63 270 115 -149 83 96 156 -42
4253 -42 -76 95 -8 29 52 -192 -235 71 -100 178 141 -150 -164 -7 -50 -46 -15 -51 256 269 -34 54 43 231 22
4278 22 121 195 -122 -183 2 197 111 -35 -158 -39 -2 19 -30 45 53 -78 167 -48 176 -212 -26 101 -13 27
4302 27 -166 145 30 26 -74 -78 -147 -76 -22 30 -79 -222 92 37 264 16 133 -242 80 36 -175 141 10 -121
4326 -121 46 -67 -30 -38 -77 132 -193 325 39 55 -90 10 138 128 144 -105 -253 178 -161 19 10 238 -115
4349 -115 139 236 -6 96 23 -92 -19 5 47 109 208 -159 57 23 53 -231 -14 111 -205 341 32 -46 112
4372 112 55 69 203 -67 92 26 87 -47 81 -19 -8 -110 -36 -148 -60 36 59 171 161 -98 -69 -34 75 212
4396 212 -48 -165 -255 -82 189 -113 66 9 -27 100 138 111 -95 150 -237 186 20 155 241 60 -72 17
4418 17 233 95 -285 -15 139 -158 66 214 35 41 72 -4 251 83 237 -21 36 -96 -118 234 -98 161
4440 161 19 -46 47 40 66 100 -158 212 153 167 -53 -293 -169 -36 -71 -105 77 121 15 54 -107 -61 -354 81
4464 81 200 -48 -112 -90 17 -128 71 32 -152 -32 -133 -126 144 121 27 91 56 -140 218 25 -164 115 50 175
4488 175 131 -56 -138 -152 123 331 156 -157 -54 -47 -34 7 -4 -103 -85 -10 -151 77 137 75 -67 37 50 -32 89
4513 89 138 -142 40 -205 181 -56 38 -13 94 43 -250 67 89 28 -71 -67 128 126 14 -250 15 106 -126 158
4537 158 95 40 -94 -15 96 -38 -216 86 31 72 36 354 20 -160 32 88 -121 -34 18 -230 9 115 251
4560 251 -46 14 8 -90 -201 199 -33 179 211 -290 79 98 -4 -162 369 -58 -54 175 38 126 29 14 11 142
4584 142 -125 -367 131 65 -114 207 104 2 -58 -209 -508 -176 -60 -15 -123 -119 -17 48 -158 -97 66 329
4606 329 221 30 68 -92 26 -48 -22 -129 -65 60 -39 312 43 192 -111 -85 -144 -109 -51 -94 -2 149 -353 91
4630 91 64 200 99 86 191 -41 -373 51 243 -142 13 2 -91 -4 199 -49 97 -91 -49 -203 2 -83 86
4653 86 -22 36 93 67 144 -11 -60 60 -154 85 -69 118 -182 125 55 -21 116 126 -167 33 367 115 -113
4676 -113 -43 -241 -58 174 56 -138 96 -115 57 74 37 -4 21 10 1 -123 -78 67 -39 317 57 -10 -136
4699 -136 21 -30 -55 -27 -37 -322 69 -11 -131 104 -264 -110 47 236 -230 229 21 284 -35 -289 186 -53
4721 -53 -48 -82 91 226 -37 -58 69 166 52 101 -19 -165 294 -187 -41 176 4 10 69 147 -34 160 139 43
4745 43 -107 -99 228 -253 253 -5 41 -55 -2 -147 105 168 -302 -90 -188 273 147 138 21 99 -67 -19 19 31 57
4770 57 -74 -67 -176 -302 -60 -131 0 -93 42 38 -98 -86 63 -224 -118 -91 -109 56 1 -75 -87 -149 -176 -112 185
4795 185 -91 40 220 -165 7 158 -35 144 -84 -159 -202 112 60 -18 -146 -161 85 -234 -41 6 212 16
4817 16 347 -68 -150 -350 50 -11 -69 -370 78 -65 -68 90 2 9 -56 -140 57 -137 145 -12 -52 191 49 -12
4841 -12 76 116 41 -106 47 39 -129 79 -87 -44 54 32 -111 -48 -61 162 17 -75 125 -110 -1 -126 -160 87
4865 87 -110 -171 182 13 48 153 329 53 -100 -97 -255 127 -172 156 -15 35 -96 -198 99 -105 -127 17
4887 17 75 -42 92 59 22 -63 -153 134 -268 -71 -79 -28 5 51 0 69 21 184 128 145 -174 -29 427 -14 -29 -9
4913 -9 51 29 -38 91 -24 124 232 -70 -40 93 83 173 -93 -143 -73 131 -88 53 361 21 -207 64 -48
4936 -48 -73 -27 107 -116 -143 -33 -21 -117 -85 121 115 -40 -251 168 203 36 -23 74 110 117 -31 -285 -41 34 -118
4961 -118 -62 68 92 -58 -75 116 132 -13 73 226 -108 -54 167 134 -9 -49 222 45 -19 -49 29 8 144 34
4985 34 26 30 -1 241 64 -17 23 21 -170 -57 -27 -136 -73 -65 90 -20 169 223 -42 41 191 229 -45 324 103 -245
5011 -245 -92 5 77 152 149 -68 -237 246 -139 -156 -137 43 155 45 -115 166 210 166 36 -4 263 144 -81
5034 -81 -78 95 -95 -121 135 15 49 -32 -34 -175 -105 227 -104 -248 55 -25 170 -127 -188 -60 234 177 -70 111
5058 111 5 -61 55 45 -169 -266 -111 -3 -129 119 -126 79 -6 -53 -162 -84 34 -2 -183 -53 81 -159
5080 -159 79 72 47 279 -147 70 -185 -62 -241 37 202 19 313 172 -95 -266 51 66 -253 12 84 30
5102 30 -17 23 2 49 -134 78 7 -15 -142 56 154 89 -23 -91 67 -106 44 -105 -70 254 0 171 -106 -10
5126 -10 98 85 -321 -4 197 -56 -43 -94 86 -62 -97 21 -109 -113 130 161 -35 20 302 207 245 229 29 -93
5150 -93 116 -160 -80 145 -90 45 -120 -33 -157 47 261 62 -87 23 256 122 67 90 -94 -17 223 -104
5172 -104 -83 -134 159 33 5 -77 114 -212 64 154 72 155 -95 -140 -133 250 -249 -51 -127 12 142 -64 125 -154
5196 -154 -28 82 15 -179 26 -87 62 66 55 4 264 93 -4 130 63 -47 46 -14 -148 17 79 -199 258
5219 258 74 104 -13 -63 -322 -46 15 -15 70 -211 -36 51 -60 -53 -79 -172 -21 67 65 -24 104 32 -17 55 218 6
5245 6 9 -123 148 -233 72 -102 -99 328 120 -22 -26 45 -132 -23 151 -151 -38 -379 -4 263 -87 -239 -12
5268 -12 3 20 53 -101 148 -45 -71 90 -57 -47 -137 -45 171 8 260 185 168 -85 21 -119 -134 35 187 -13
5292 -13 3 -33 229 7 -141 -136 148 -8 -134 -219 -21 109 355 14 46 -35 307 155 75 -36 91 104 -16
5315 -16 23 -37 81 16 -278 57 -84 -158 194 -212 64 67 235 -56 -238 212 21 177 119 75 -24 54 -213 -88
5339 -88 -78 102 301 144 120 -365 -52 69 -113 111 -69 166 17 11 3 -281 286 31 120 -155 38 22 -20
5362 -20 -25 83 -34 18 141 72 -132 10 133 -72 -89 -226 48 255 123 -177 -184 -134 107 138 -64 134 -10
5385 -10 16 145 -114 -73 35 -177 -221 128 -1 63 77 -133 41 -11 -135 187 -139 69 -23 73 -152 226 22
5408 22 87 97 142 -265 181 -51 127 125 330 56 -239 114 2 19 -2 -68 145 -131 64 -42 -62 0 19 139
5432 139 79 -169 -139 -1 101 -246 -210 120 -13 -365 -184 -36 -88 -268 -16 153 -112 46 107 -7 52 40
5454 40 -269 -131 -135 -29 -133 97 -66 6 -109 -32 38 -12 -240 -80 -2 15 -140 126 -8 96 101 -119 -37 92
5478 92 -148 64 124 64 235 9 -54 -1 -240 -23 21 325 105 -23 122 -160 -91 129 -115 -257 -73 -76 91
5501 91 57 119 13 86 -164 -78 57 -15 45 -41 67 159 -61 11 -112 83 41 -100 179 -191 -186 -312 14 -59 -49
5526 -49 -104 -192 61 -18 88 118 119 139 -182 156 94 -338 149 231 -17 -136 116 144 146 -96 12 -225 -216 -2 38
5551 38 -63 -146 27 -71 -66 -36 66 -94 -67 -90 -182 189 -81 -170 105 -204 -7 416 15 -72 291 215 -28 -153
5575 -153 -11 107 3 -11 -96 179 -41 41 -101 -309 -18 -200 47 208 -119 -118 69 -82 75 11 -21 15 131
5598 131 -101 -81 -155 11 -58 28 166 -127 -21 91 -19 -40 -135 -4 2 -148 14 -141 19 129 93 -119 11
5621 11 90 14 -66 101 -281 -98 85 316 29 -99 -232 -14 201 -43 -203 -126 -66 95 -97 182 -50 136
5643 136 -137 40 231 -82 65 -179 19 47 100 -106 -2 -207 -25 119 50 8 8 28 -29 -183 -107 -174 -41
5666 -41 101 -2 266 96 -31 -102 222 -246 96 -208 37 -53 -135 -95 -34 -54 205 39 92 -28 62 -60 200
5689 200 -36 65 96 -103 67 38 246 17 135 74 -67 21 60 -237 -15 93 -33 -77 157 -46 28 -132
5711 -132 -123 -37 -154 169 18 144 231 152 119 -1 84 -20 -30 144 243 152 145 -240 -106 -115 -115 54 -145 -147 -55 38 -204
5738 -204 -106 155 -32 30 36 -65 -107 222 -196 -29 270 180 -118 125 -49 -35 -246 220 -198 28 174 191 19
5761 19 37 -17 -253 -57 -288 131 -151 74 3 -225 -249 -55 -45 85 111 -14 83 63 -3 -263 37 -45 -56 -6
5785 -6 114 28 144 -4 -74 68 55 47 -73 -153 -91 51 30 80 -79 85 -119 7 287 -12 15 -69 -21 3 -265
5810 -265 145 218 59 -21 45 205 32 -30 49 -71 38 76 -156 20 -144 -84 -67 5 -23 -162 -198 12 -111 137
5834 137 33 47 -52 62 -30 53 -49 -72 -286 262 -54 -59 -15 -128 236 11 338 -2 -242 -149 114 163 -86
5857 -86 -127 -239 182 -130 73 184 51 146 -190 54 366 -143 -109 152 23 8 -357 -143 60 78 9 -131
5879 -131 147 5 122 360 87 -72 37 -107 -70 38 262 -7 -92 -217 -138 -125 32 135 19 228 -103
5900 -103 28 -166 -20 45 -133 -18 -23 -35 -50 -257 -201 -273 24 -85 -163 -224 142 -46 -160 -91 365 235 -47
5923 -47 41 -36 140 -19 -137 -82 37 -276 51 -221 -2 -71 -57 5 -37 -121 -161 -3 117 -231 -212 -183 -240 -306 188
5948 188 200 -2 -32 79 -81 52 264 -4 -151 -31 380 15 -164 219 184 -72 -13 55 -116 -92 139 -99
5970 -99 79 46 -12 -168 -1 270 -11 136 57 -96 -223 93 -8 89 -133 -4 -19 -22 -114 71 -16 -160 239
5993 239 119 26 -112 -86 -125 0 362 -103 53 -42 -237 -125 -1 -78 -55 131 280 45 -102 -80 64 56 137
6016 137 -31 -317 100 -155 -120 -4 85 76 45 10 -250 118 -111 196 -106 -94 -40 -7 -76 -40 164 -71 176 53
6040 53 -72 80 16 -91 266 -242 79 -17 122 31 96 89 -223 -73 -166 220 158 22 51 -2 -68 197 36 -49
6064 -49 58 -75 -53 -242 97 -95 67 213 -49 122 -82 -52 -48 -79 -29 -96 -52 67 126 77 -275 6 160 -34
6088 -34 200 242 -58 -152 103 -125 212 76 -2 215 -179 99 -138 -222 97 -109 -308 -132 -141 23 -113 -134 129
6111 129 -30 -63 -83 -86 94 25 -1 96 160 24 242 -97 60 266 121 -142 283 46 133 -300 110 -99 16
6134 16 -46 -66 -121 -127 -55 52 174 -21 52 -93 169 54 -63 291 163 52 -190 -291 17 -71 -60 27 212 -171
6158 -171 -87 305 -208 45 27 39 87 -160 -84 177 317 -89 -42 78 110 -57 -60 -70 66 -135 -35 -100 116 -89
6182 -89 63 56 110 79 -111 243 -14 9 140 321 52 -89 124 -245 -166 -2 -20 11 -50 111 -109 87 -175
6205 -175 -96 -183 -64 -72 -43 10 50 -104 99 -348 14 131 -150 135 -157 20 165 12 -4 -29 144 112 95 111
6229 111 236 -12 -87 108 351 -44 -133 35 195 32 -307 120 255 108 84 130 68 -23 192 32 -29 115
6251 115 86 -198 -115 168 -9 192 115 -102 263 -67 97 142 -78 -8 27 157 245 50 76 -10 -27 332 -92
6274 -92 34 -85 -183 15 -8 -57 219 -228 132 90 -219 174 -94 -146 28 196 -165 -67 -15 165 20 -45 114
6297 114 107 97 -139 225 328 -48 17 -71 -292 5 168 -166 -236 -46 132 55 35 -134 118 119 -196 82 -39
6320 -39 116 -62 -7 -106 30 -199 -199 5 76 87 -41 146 105 105 99 -54 -60 -102 -134 -126 117 -169 -37 -197 45 53 -82
6347 -82 -14 29 47 39 -88 4 -29 174 88 -57 205 -180 208 -23 -81 75 -147 259 167 326 12 -58 149 15
6371 15 15 -105 102 18 227 281 -220 76 -51 9 76 -5 -46 -6 11 103 -47 65 143 -163 -22 -87 55 127 228
6396 228 342 -290 -20 205 121 -217 -106 -114 -36 -33 -206 -31 -96 23 -33 118 -88 -29 222 207 -206 99 109 29
6420 29 5 -69 27 55 7 -189 182 196 -52 257 278 -126 -47 -109 -10 56 -145 58 23 -60 108 -36 134 58 226
6445 226 -34 118 108 35 63 230 137 9 -22 90 -9 119 -102 70 -179 -83 -87 -121 -71 98 109 -15 -69 116
6469 116 -68 52 -61 121 144 -202 -7 165 34 63 132 -386 89 -432 98 -138 -61 117 -74 102 -93
6490 -93 -117 -50 106 -18 204 -178 51 -272 76 49 85 163 325 -163 192 40 -89 -156 73 32 -25 17 3 54
6514 54 -34 59 81 -70 -210 85 134 63 -91 274 146 -75 9 232 -88 -4 -116 39 -48 87 184 161 -65 -293
6538 -293 41 -54 -307 -159 -223 118 40 -215 218 -115 -83 -58 -138 -298 20 -112 -73 -16 -15 -90 82 139 107 32 -40
6563 -40 -16 57 93 -96 3 -139 17 352 -67 42 82 -58 128 258 161 130 121 73 -73 -117 -21 -152 70 138 97
6588 97 139 -85 -72 140 270 -113 6 22 -106 64 -5 -27 77 20 -163 -56 -55 -162 -157 47 11 3 104 -47 343
6613 343 35 119 202 42 53 153 -58 -162 -227 41 -101 22 59 -353 -68 13 138 -37 151 203 64 -21 103
6636 103 -99 -5 9 13 -179 127 -79 -72 52 75 69 -316 -19 0 -96 -12 107 -139 74 123 102 -20 206 -45 -79
6661 -79 -127 62 72 175 222 202 33 20 -230 -202 -87 -52 -61 -286 -7 30 -101 -154 73 112 96 58 -121 159 -182
6686 -182 91 -306 63 96 76 -143 -78 -50 -113 -206 21 30 -228 82 -42 -206 -129 163 135 287 -328 -140 -4
6709 -4 -69 183 -71 328 120 109 69 -66 -74 90 26 162 -12 -241 -100 -130 100 111 102 55 -20 -84 -216 129 55
6734 55 10 -250 -179 53 23 -205 78 -136 -353 19 -50 -106 79 17 145 -29 -171 87 -229 112 110 70 -43
6757 -43 -45 -73 165 -256 -164 228 -72 213 164 130 -80 66 -135 -83 259 -91 181 -251 -62 279 -78 30 -22
6780 -22 -89 142 110 -77 -15 176 26 -62 -95 -126 30 -165 -11 60 105 91 28 36 57 -64 90 64 191 265 58
6805 58 -144 134 -192 51 115 -132 -30 -79 -163 -21 90 84 -106 -13 55 317 -164 -38 19 -193 -86 -27 65 -2
6829 -2 20 -214 112 46 -75 -67 -188 127 -41 -38 -38 -25 14 46 -112 -132 87 -138 224 -131 -116 131 176 -21 242
6854 242 -209 99 -134 -9 17 -194 119 -107 -115 -27 124 83 11 90 131 -10 43 242 -54 -102 79 17 -22 40
6878 40 98 -95 77 -55 5 -35 -138 93 -145 -96 86 -54 -216 -43 29 -164 -110 -194 -100 86 134 -206 146
6901 146 22 -9 55 38 217 -120 -236 -84 124 -183 57 -95 -71 -35 208 -161 3 42 -46 12 -28 7 1 34
6925 34 -52 -119 157 103 197 -172 -201 142 -68 -221 -241 78 19 -85 66 28 63 109 -137 -42 -385 -236 -74 29
6949 29 -285 -91 -127 -39 -124 -233 4 4 -156 75 -47 97 15 22 -155 43 -166 -187 -132 -20 -236 -188 -12 42
6973 42 -221 -3 16 40 78 -80 -17 32 -5 64 -102 -225 12 114 16 42 -62 -20 254 78 -127 260 -101 -90
6997 -90 94 196 -94 -440 -91 34 -53 -69 189 -2 69 98 51 182 -213 -151 -48 27 66 67 -75 21 -45 -64 7
7022 7 -145 -124 -180 97 -101 -123 -41 60 161 -60 190 204 76 -17 27 -21 -105 -5 109 -81 -128 -309 43 -70
7046 -70 196 -177 -90 169 208 77 -94 -54 159 16 215 39 -94 62 57 143 65 71 -38 149 57 -224 154 -14
7070 -14 -171 66 201 134 -244 -5 79 181 15 -9 -123 -55 -116 -114 -172 29 44 -8 55 -138 -117 -114 -129 -212 42 161
7096 161 82 -82 -189 -166 -72 189 18 -66 152 -30 -49 53 64 62 328 27 125 30 75 286 207 -101 212 -175
7120 -175 -62 77 -112 51 -80 267 -112 -168 68 -165 -140 139 83 57 -48 81 6 -238 313 -170 54 -47
7142 -47 -211 -110 169 93 -149 155 1 -290 -74 142 -97 260 3 142 -31 -35 -13 59 -81 9 -191 60
7164 60 208 12 -5 -280 -44 21 -91 -113 102 -4 65 -11 -158 -108 -133 -104 -38 -141 16 -107 -72 70 -159 -2
7188 -2 54 -191 68 -60 -5 -35 -23 202 -209 -68 -160 152 45 127 89 -127 76 -41 -73 293 2 -16 -114 116
7212 116 181 -271 19 -81 -17 22 -51 -2 -31 189 90 -72 -189 103 1 -134 20 -99 112 155 47 -85 -143
7235 -143 -17 -135 80 52 38 -203 1 140 -135 -253 -80 109 12 108 -231 -221 -69 -49 96 -39 -143 -66
7257 -66 -186 30 -71 -59 17 -68 69 -157 61 71 30 -159 -42 -130 95 186 20 21 -59 56 -46 -96 -166 50
7281 50 -64 234 36 212 48 17 135 56 -239 -76 -151 -8 12 132 -90 -25 6 -58 70 -140 -18 -33 27
7304 27 -72 29 -237 53 211 35 27 19 80 -100 -11 100 -12 -94 -126 30 -47 -130 14 62 -10 47 20 -98 -113 -47
7330 -47 -47 -84 55 315 -129 40 89 -157 115 -175 -88 -128 -51 62 -190 -197 -33 -121 20 -102 -4 265 72 -151
7354 -151 226 -109 15 -201 20 -2 244 153 -12 161 67 -115 -160 -74 109 61 -174 156 78 167 110 60 9 217
7378 217 -217 -40 173 -41 -47 25 197 -172 -38 -102 -168 36 -107 -184 -152 94 -98 33 129 71 44 -2 -201 69
7402 69 183 72 117 -117 45 116 -122 181 126 223 -206 69 -40 -313 105 163 94 18 278 192 -125 -97 -59 -25
7426 -25 -106 219 48 63 29 -25 -4 250 52 -151 -2 -142 199 95 25 247 -144 162 41 35 -76 -80 81 227
7450 227 127 215 116 -75 -49 -26 249 -213 179 23 -130 -249 264 -17 67 -123 -272 61 54 -106 170 27
7472 27 9 114 -199 -161 97 -116 -115 33 2 98 16 -52 -31 -185 -217 -172 -153 15 61 6 172 -195 60 121 23 72
7498 72 14 -282 25 218 -24 114 136 60 301 397 153 -51 8 -156 -58 170 137 -160 -115 105 237 -69 -34
7521 -34 239 13 10 34 55 244 -84 28 -274 41 174 337 145 -234 122 -195 -116 -352 -67 19 263 -91
7543 -91 -129 9 -56 -395 -202 179 -44 1 -80 123 62 152 -101 126 253 -60 -93 -122 96 206 39 15 75 -63
7567 -63 -82 -96 -18 62 -109 -13 -89 -81 -99 -28 -33 -139 80 0 8 201 41 -241 -39 163 -15 60 -3 106 -11 -103
7593 -103 57 143 206 175 -108 62 49 47 -91 -107 -173 -118 -173 148 -127 22 -145 96 -1 -165 41 103 119 18
7617 18 -60 198 -158 -156 84 -143 141 261 87 30 151 -360 -17 -90 304 -61 -264 263 59 157 7 11 52
7640 52 68 268 90 90 -359 129 -88 -277 268 68 140 -57 -310 185 61 347 107 -155 168 94 46 -15 131
7663 131 77 -173 -132 13 -191 -52 -95 -134 20 9 -251 81 -101 -121 29 -43 68 -37 70 77 -39 -22 131
7686 131 -123 -8 57 124 50 -186 -99 73 -4 -87 -33 233 288 265 189 226 46 -180 30 -11 179 -151 40 -20
7710 -20 159 70 193 -3 -83 -15 -44 23 -172 208 50 53 186 -201 -153 -227 43 71 55 -138 -117 19 127 67 347
7735 347 156 234 -58 -38 148 -1 39 -73 -122 229 139 -60 -9 -49 125 -112 -34 -60 17 155 -29 -59 90 -209
7759 -209 154 -35 130 -242 131 162 -77 -69 -186 -66 11 -183 204 -3 -131 -21 13 -54 4 136 205 -114 -22
7782 -22 -21 234 18 83 105 241 4 112 157 -144 17 -33 197 -62 -107 -12 64 -214 -136 63 146 118 -92 -391
7806 -391 -7 132 5 -108 -47 -71 71 -106 -148 -77 -62 15 -40 -291 -64 201 -83 15 -325 28 -10 -275 -134
7829 -134 142 -20 76 -194 85 14 117 286 -52 -83 298 -57 66 9 28 146 -173 250 78 152 108 174 73
7852 73 250 -22 94 -30 14 28 -116 -80 -66 104 115 -30 -29 -2 -113 7 -9 123 212 -218 -141 148 91 -99
7876 -99 -122 40 111 80 -6 32 -209 -56 -20 159 -9 44 37 245 -70 -127 252 11 33 -69 354 -255 -205 223
7900 223 -59 6 -57 -112 -117 -106 0 230 -43 -52 181 61 28 -101 199 -189 25 -111 -144 224 -65 71 -65
7923 -65 108 101 -157 86 100 36 -187 -242 -35 -65 -10 127 18 -148 127 84 -110 17 123 53 -127 -81 -103 15
7947 15 188 -16 100 78 -117 -49 -38 -113 171 191 -40 -2 135 123 53 -35 -98 107 -124 69 31 -72 132 -15
7971 -15 -227 -104 -63 260 27 0 2 -231 -118 -9 76 -124 62 72 -88 -192 -38 68 136 -38 -184 252 -71
7994 -71 129 73 -46 84 -102 308 83 -116 51 -155 -4 54 172 -8 -108 -163 -67 -42 -58 27 112 -92 70
8017 70 -192 -135 -171 -161 126 197 191 96 -10 89 5 -3 145 91 149 109 121 5 46 -9 -66 -98 111 -202 -38 0 106
8044 106 -87 -5 111 86 360 10 20 -92 -129 123 -54 -105 -112 -33 -104 70 -89 80 74 -40 56 -7 248 160 -168
8069 -168 270 -58 27 -113 138 -196 -166 61 7 -86 -77 81 -10 7 7 10 17 -26 -17 -55 57 91 109 113 -86 78 -166
8096 -166 -99 381 214 -14 32 -33 107 69 41 -187 32 -97 87 -156 142 -213 -19 -165 -119 45 -66 162
8118 162 114 70 -64 -151 -23 -6 -130 -68 -33 -360 17 7 8 -131 165 -3 -208 -23 -57 -9 224 52 -159 0
8142 0 275 73 -113 -141 -212 77 179 290 -113 -69 -95 -94 -270 -245 -31 6 113 -66 191 -8 216 17 217
8165 217 -152 -20 177 136 129 78 -231 115 -20 -67 32 25 -10 -33 149 -164 235 133 60 136 119 110 -93 65 41
8190 41 133
8191A33
##END NTUPLES=NMR FID
##END=
