##TITLE=1H_LR-758-R6-O-MeOH-M1
 CDCl3
 8 sc, 
 4.10.2023
##JCAMPDX= 6.0         $$ Bruker NMR JCAMP-DX V2.0
##DATA TYPE= NMR FID
##DATA CLASS= NTUPLES
##ORIGIN= UXNMR, Bruker Analytische Messtechnik GmbH
##OWNER= root
$$ XWIN-NMR		Version 3.5
$$ Wed Oct  4 14:05:24 2023 Russian Standard Time (UT+4h)  she@DPX200
##.OBSERVE FREQUENCY= 200.13135
##.OBSERVE NUCLEUS= ^1H
##.DELAY= (6, 6)
##.ACQUISITION MODE= SIMULTANEOUS
##.ACQUISITION SCHEME= undefined
##.AVERAGES= 8
##.DIGITISER RES= 18
##SPECTROMETER/DATA SYSTEM= spect
##.PULSE SEQUENCE= zg30
##.SOLVENT NAME= D2O
##.SHIFT REFERENCE= (INTERNAL, D2O, 0, 15.7039)
##AUDIT TRAIL= $$ (NUMBER, WHEN, WHO, WHERE, WHAT)
$$ ##TITLE= Audit trail, XWIN-NMR		Version 3.5
$$ ##JCAMPDX= 5.01
$$ ##ORIGIN= Bruker BioSpin GmbH
$$ ##OWNER= she
$$ F:/spectra/data/she/nmr/H-F/1/audita.txt
$$ ##AUDIT TRAIL=  $$ (NUMBER, WHEN, WHO, WHERE, WHAT)
(   1,<2023-10-04 14:04:18.06 +0400>,<she>,<DPX200>,
      <created by zg, POWCHK disabled, PULCHK disabled
       configuration hash MD5:
       00 E9 B6 7A A2 85 ED C7 34 08 36 98 17 FE 4E 26
       data hash MD5: 16K
       F5 6A C5 FE 54 60 A4 FD A1 B4 CA 49 93 D2 68 7D>)
$$ ##END=
$$ 
$$ hash MD5
$$ 40 16 07 FA A0 AD C2 3B AF A6 DA A9 F8 9D 04 08
##$RELAX= 
##$RELAX= 
##$RELAX= 
##$RELAX= 
##$RELAX= 
##$RELAX= 
$$ Bruker specific parameters
$$ --------------------------
##$DU= <F:/spectra>
##$EXPNO= 1
##$NAME= <H-F>
##$PROCNO= 1
##$TYPE= <nmr>
##$USER= <she>
##$AMP= (0..31)
100 100 100 100 100 100 100 100 100 100 100 100 100 100 100 100 100 100 
100 100 100 100 100 100 100 100 100 100 100 100 100 100 
##$AQSEQ= 0
##$AQ_mod= 1
##$AUNM= <au_zg>
##$AUTOPOS= <>
##$BF1= 200.13
##$BF2= 200.13
##$BF3= 200.13
##$BF4= 200.13
##$BF5= 200.13
##$BF6= 200.13
##$BF7= 200.13
##$BF8= 200.13
##$BYTORDA= 1
##$CFDGTYP= 0
##$CFRGTYP= 5
##$CHEMSTR= <none>
##$CNST= (0..31)
1 1 145 1 1 1 1 1 1 1 1 1 1 1 1 1 1 1 1 1 1 1 1 1 1 1 1 1 1 1 1 1 
##$CPDPRG= <>
##$CPDPRG1= <>
##$CPDPRG2= <>
##$CPDPRG3= <>
##$CPDPRG4= <mlev>
##$CPDPRG5= <mlev>
##$CPDPRG6= <mlev>
##$CPDPRG7= <mlev>
##$CPDPRG8= <mlev>
##$CPDPRGB= <>
##$CPDPRGT= <>
##$D= (0..31)
0 1.2 0 0 0 0 0 0 0 0.06 0 0.03 0 0 0 0 0.0002 0 0 0 0 0 0 0 0 0 0 0 0 
0 0 0 
##$DATE= 1696413857
##$DBL= (0..7)
120 120 120 120 120 120 120 120 
##$DBP= (0..7)
150 150 150 150 150 150 150 150 
##$DBP07= 0
##$DBPNAM0= <>
##$DBPNAM1= <>
##$DBPNAM2= <>
##$DBPNAM3= <>
##$DBPNAM4= <>
##$DBPNAM5= <>
##$DBPNAM6= <>
##$DBPNAM7= <>
##$DBPOAL= (0..7)
0.5 0.5 0.5 0.5 0.5 0.5 0.5 0.5 
##$DBPOFFS= (0..7)
0 0 0 0 0 0 0 0 
##$DE= 6
##$DECBNUC= <off>
##$DECIM= 32
##$DECNUC= <off>
##$DECSTAT= 4
##$DIGMOD= 1
##$DIGTYP= 9
##$DL= (0..7)
0 120 120 120 120 120 120 120 
##$DP= (0..7)
150 150 150 150 150 150 150 150 
##$DP07= 0
##$DPNAME0= <>
##$DPNAME1= <>
##$DPNAME2= <>
##$DPNAME3= <>
##$DPNAME4= <>
##$DPNAME5= <>
##$DPNAME6= <>
##$DPNAME7= <>
##$DPOAL= (0..7)
0.5 0.5 0.5 0.5 0.5 0.5 0.5 0.5 
##$DPOFFS= (0..7)
0 0 0 0 0 0 0 0 
##$DQDMODE= 0
##$DR= 18
##$DS= 0
##$DSLIST= <SSSSSSSSSSSSSSS>
$$ [...]
##$SUBNAM2= <"">
##$SUBNAM3= <"">
##$SUBNAM4= <"">
##$SUBNAM5= <"">
##$SUBNAM6= <"">
##$SUBNAM7= <"">
##$SUBNAM8= <"">
##$SUBNAM9= <"">
##$SW= 18.05172834244
##$SWIBOX= (0..15)
0 0 2 0 0 0 0 0 0 0 0 0 0 0 0 0 
##$SW_h= 3612.71676300578
##$TD= 16384
##$TD0= 1
##$TE= 0
##$TE2= 300
##$TE3= 300
##$TEG= 300
##$TL= (0..7)
0 120 120 120 120 120 120 120 
##$TP= (0..7)
150 150 150 150 150 150 150 150 
##$TP07= 0
##$TPNAME0= <>
##$TPNAME1= <>
##$TPNAME2= <>
##$TPNAME3= <>
##$TPNAME4= <>
##$TPNAME5= <>
##$TPNAME6= <>
##$TPNAME7= <>
##$TPOAL= (0..7)
0.5 0.5 0.5 0.5 0.5 0.5 0.5 0.5 
##$TPOFFS= (0..7)
0 0 0 0 0 0 0 0 
##$TUNHIN= 0
##$TUNHOUT= 0
##$TUNXOUT= 0
##$USERA1= <user>
##$USERA2= <user>
##$USERA3= <user>
##$USERA4= <user>
##$USERA5= <user>
##$V9= 5
##$VALIST= <valist>
##$VCLIST= <CCCCCCCCCCCCCCC>
##$VD= 0
##$VDLIST= <DDDDDDDDDDDDDDD>
##$VPLIST= <PPPPPPPPPPPPPPP>
##$VTLIST= <TTTTTTTTTTTTTTT>
##$WBST= 1024
##$WBSW= 4
##$XGAIN= (0..3)
0 0 0 0 
##$XL= 0
##$YL= 0
##$YMAX_a= 395201
##$YMIN_a= -631184
##$ZGOPTNS= <>
##$ZL1= 120
##$ZL2= 120
##$ZL3= 120
##$ZL4= 120
##$ABSF1= 10
##$ABSF2= 0
##$ABSG= 5
##$ABSL= 3
##$ALPHA= 0
##$AQORDER= 0
##$ASSFAC= 0
##$ASSFACI= 0
##$ASSFACX= 0
##$ASSWID= 0
##$AUNMP= <proc_1d>
##$AZFE= 0.1
##$AZFW= 0.1
##$BCFW= 1
##$BC_mod= 2
##$BYTORDP= 1
##$COROFFS= 0
##$CY= 11.3945322036743
##$DATMOD= 1
##$DC= 2
##$DFILT= <>
##$DTYPP= 0
##$F1P= 15.7292609196834
##$F2P= 12.9074282941183
##$FCOR= 0.5
##$FTSIZE= 0
##$FT_mod= 4
##$GAMMA= 1
##$GB= 0.15
##$INTBC= 1
##$INTSCL= 1
##$ISEN= 128
##$LB= 0.24
##$LEV0= 0
##$LPBIN= 0
##$MAXI= 10000
##$MC2= 0
##$MEAN= 0
##$ME_mod= 0
##$MI= 1.114404
##$NCOEF= 0
##$NC_proc= 0
##$NLEV= 6
##$NOISF1= 3.799351
##$NOISF2= 2.8
##$NSP= 1
##$NTH_PI= 0
##$NZP= 0
##$OFFSET= 15.70392
##$PC= 1
##$PHC0= -21707.68
##$PHC1= 7.25271
##$PH_mod= 1
##$PKNL= yes
##$PPARMOD= 0
##$PSCAL= 0
##$PSIGN= 0
##$REVERSE= no
##$SF= 200.130013532006
##$SI= 16384
##$SIGF1= 3
##$SIGF2= 2
##$SINO= 400
##$SIOLD= 16384
##$SREGLST= <1H.CDCl3>
##$SSB= 0
##$STSI= 0
##$STSR= 0
##$SW_p= 3612.71676300578
##$SYMM= 0
##$S_DEV= 0
##$TDeff= 0
##$TDoff= 0
##$TI= <>
##$TILT= no
##$TM1= 0
##$TM2= 0
##$TOPLEV= 0
##$USERP1= <user>
##$USERP2= <user>
##$USERP3= <user>
##$USERP4= <user>
##$USERP5= <user>
##$WDW= 1
##$XDIM= 8192
##$YMAX_p= 0
##$YMIN_p= 0
$$ End of Bruker specific parameters
$$ ---------------------------------
##NTUPLES= NMR FID
##VAR_NAME=  TIME,          FID/REAL,        FID/IMAG
##SYMBOL=    X,             R,               I
##VAR_TYPE=  INDEPENDENT,   DEPENDENT,       DEPENDENT
##VAR_FORM=  AFFN,          ASDF,            ASDF
##VAR_DIM=   8192,          8192,            8192
##UNITS=     SECONDS,       ARBITRARY UNITS, ARBITRARY UNITS
##FACTOR=    0.0002768,     1,               1
##FIRST=     0,             0,               0
##LAST=      2.2672688,     0,               0
##MIN=       0,             -631184,         0
##MAX=       2.2672688,     395201,          0
$$ Real data points
##PAGE= N=1
##DATA TABLE= (X++(R..R)), XYDATA
$$ [...]
1812e98J11M46k95m0O98l94j96N43J79o72N27K58p70M42M97p83L06J52n63M29
$$ -598 -487 -41 -336 -376 322 -72 -268 275 454 -218 309 567 -203 239 736 -47 259 411 -152 277
1832B77L1l08j81L49n09K71J89l59m19O10j55j76K30j4m32N73J68m38L00Q7l40
$$ 277 308 0 -181 168 -341 -70 119 -240 -659 -49 -204 -380 -150 -164 -596 -23 145 -293 7 94 -246
1853b46L33K40o60K56O35q38K74K82l87j37M83m25l29Q95l56o13P51l32l06M12
$$ -246 87 327 -333 -77 558 -280 -6 276 -111 -248 235 -190 -519 376 20 -593 158 -174 -480 -68
1873f8K18n05L77O1n20M51M48l26k29P18o09N79K18n65m1L20l34P1N32n32j83
$$ -68 150 -355 22 83 -437 14 462 136 -93 625 16 595 813 248 207 527 193 264 796 264 81
1894H1M34p41k20O91l72j46K20Lq30M92J9j65J65L37n30J33N33o00L46L98m93
$$ 81 515 -226 -446 245 -127 -273 -53 -50 -880 -388 -369 -534 -369 -32 -562 -429 104 -496 -150 248 -245
1915b45j5O23l27L5L75m30p5O13j72k96L63J77o37L90p9k90J70l9l44J59K63n56
$$ -245 -260 363 36 71 446 16 -59 554 382 86 449 626 -11 379 300 10 180 141 -203 -44 219 -337
1937c37L06R8n40J12N56n73m7O98m03k64N82k46k95M60K18p43N59n5l45R3J14
$$ -337 -31 67 -473 -361 195 -378 -425 273 -130 -394 188 -58 -353 107 325 -418 141 86 -259 -166 -52
1958e2o54L94K28l52J19m6k39J6L94n02L92J86j89l1K75K2k96K33J44k42O32j90
$$ -52 -706 -312 -84 -436 -317 -363 -602 -586 -192 -694 -302 -116 -305 -336 -61 -39 -335 -102 42 -200 432 242
1980B42j37O76m60k33K87j01l35L93L6n25L73L8m30J20M36o45o6K03k13k44N61
$$ 242 105 781 321 88 375 274 -61 332 368 -157 216 254 -176 -56 380 -265 -331 -128 -341 -585 -24
2001b4l74l83N54r7l99O54Q5o69M69K07n28L42L48o01M94j5k27N00j38k21mM25
$$ -24 -398 -781 -227 -324 -723 -69 16 -653 -184 23 -505 -163 185 -416 78 63 -164 336 198 -23 -27 398
2023C98j82j31K22m41Q9K51j57m24L65M4m52O13l58m0K81q5m50K67N27m35P2L15
$$ 398 216 85 307 -134 -45 206 49 -375 -10 34 -418 195 -163 -203 78 -7 -457 -190 337 -98 -26 289
2045B89l73K01J37m42k1M54l92k49N81o6m69K04L06n75K07J81m38J06M05l23O
$$ 289 -84 117 254 -188 -209 245 -147 -396 185 119 -350 -146 160 -415 -208 -27 -465 -359 46 -277 -271
2066b71J97j31j15K77J05j84J18p7j19M91l95K15K11j30n9L14j51k54N17k42l86
$$ -271 -74 -205 -320 -43 62 -122 -4 -81 -200 291 -104 111 322 192 133 447 296 42 559 317 -69
2087f9L92P5p87M37J00n63K21M27n82K87K8n42K05O30q35p0P46k31k77M86l08
$$ -69 323 398 -389 48 148 -415 -194 233 -349 -62 -34 -576 -371 259 -576 -646 100 -131 -408 78 -230
2108b30OL24J12l54L66K71n78L35O1k22l4J73m76L67J14l33L3P3k02K51K42m67
$$ -230 -224 100 212 -142 224 495 -83 252 313 91 57 230 -246 121 235 -98 -65 8 -194 57 299 -168
2130a68j05M34m51k45N49P4k33K76j38l9L30j59k76K21M95o42L99n5l38n9L63
$$ -168 -273 161 -290 -535 14 88 -145 131 -7 -46 284 125 -151 70 565 -77 322 267 -71 -130 233
2151B33m28K28J54k82j91M82k66k38L25k80j46M26k9p81P83K7l22MN22n17K79
$$ 233 -195 33 187 -95 -286 196 -70 -308 17 -263 -409 17 -12 -793 -10 17 -305 -301 221 -296 -17
2172a7L69m78O1N89n68J43M4J42j69K95k23l14L84l81p4L76k13l67O46n15j30
$$ -17 352 -126 -65 524 -44 99 143 285 116 411 188 -126 258 -123 -197 179 -34 -401 245 -270 -400
2193d00K26o3jJ40p2k17K39L49l02Q2L58o94K15N81o23PM52k61j81L95j56O6Q
$$ -400 -174 -237 -238 -98 -170 -387 -148 201 -101 -19 339 -355 -140 441 -182 -175 277 16 -165 230 74 140 148
2216A48p2l53L30R2o37N95l25q2J58J06l59R3K46m11K29M90m50J23J72l87L40
$$ 148 76 -277 53 145 -492 103 -222 -304 -146 -40 -399 -306 -60 -471 -242 248 -202 -79 93 -294 46
2237D6J39l80L95J22k45m5J84ok47L40j09j27J45j16m34N21j42m42L89m7l81L81
$$ 46 185 -195 200 322 77 32 216 210 -37 303 194 67 212 96 -338 183 41 -401 -12 -59 -440 -59
2259e9L10q51K01J80j7K9M08j28k80N79l22l58Q50l31m69N48k82k56K22K83j94
$$ -59 251 -600 -399 -219 -236 -207 201 73 -207 372 50 -308 542 211 -258 290 8 -248 -26 257 63
2280F3L61m27O7j58K25k53%K7k5j10M23j37k24M36n97L03K36j94k19L83j44q2
$$ 63 424 -3 64 -94 131 -122 -122 -95 -120 -230 193 56 -168 268 -329 -26 210 16 -203 180 36 -46
2302d6O49m61l79N46J2k78N7J81j44j9Q9k88n2K14N3j19j85J82l47L15j96j35
$$ -46 603 142 -237 309 321 43 100 281 137 118 207 -81 -133 81 134 15 -170 12 -335 -20 -216 -351
2324c51M72l26j82M13K98n35K65k46n4L77K4j97N73k72o8J40r8o6o2M50n79J91
$$ -351 121 -205 -387 26 324 -211 54 -192 -246 131 155 -42 531 259 191 331 233 167 105 555 -24 167
2346A67K96l00j55Q4l8j22J60k70K50o5j69j8J84Lk89n9K72J77k30J46l52M25
$$ 167 463 163 8 92 54 -68 92 -178 72 7 -162 -180 4 7 -282 -341 -69 108 -122 24 -328 97
2368I7J09j95n5Q5J55k25J39K64m26L96l11R1l92K36J2k59M40l25K06l8j42J66
$$ 97 206 11 -44 41 196 -29 110 374 -52 344 33 124 -268 -32 -20 -279 161 -164 42 4 -138 28
2390B8k3j72P6N3r8R3N12m39M9L1n5M3J25l19K08n2j67p2K91j56k70K34L17n39
$$ 28 5 -167 -91 -38 -136 -43 469 30 79 110 55 98 223 -96 112 60 -107 -179 112 -44 -314 -80 237 -302
2414c02J14K15l13K24k7l12K47P9j39L5K42m34J65J49n7j0L46p4l13K27K55l64
$$ -302 -188 27 -286 -62 -89 -401 -154 -75 -214 -179 63 -371 -206 -57 -114 -124 222 148 -165 62 317 -47
2436d7M99q6k62q7L31k31J31r7k98K53q0o6j6O8l86L20N9k05J63j83J4j23M80
$$ -47 452 366 104 17 348 117 248 151 -147 106 26 -40 -56 12 -374 -54 5 -200 -37 -220 -206 -329 151
2459A51j50l50K19J17j62M00O4n72M55j46l05K59M5n9J12L07l96j56K09n0j04
$$ 151 1 -349 -130 -13 -175 225 289 -283 172 26 -279 -20 25 -34 78 385 -11 -167 42 -8 -112
2480a12r3K28k67M22k60l8K25j13m8J02j00j58K40J58j82R6K8q7O6kk26L95J23
$$ -112 -205 23 -244 178 -82 -120 105 -8 -56 46 -54 -212 28 186 4 100 128 41 107 105 -121 274 397
2503C97m77J55L0q9j29O5j10O9K02lk32p4K35l20L3o8K7jK13q6O6r3J69J35q4
$$ 397 -80 75 105 16 -113 -48 -158 -89 113 110 -122 -196 39 -281 -248 -316 -289 -290 -77 -163 -97 -190 -21 114 30
2528C0j6o5J1K01j71J75J35j17P3k42j24M14J6k50O3R6k81J56q1l29N01k02j98
$$ 30 14 -51 -40 161 -10 165 300 183 256 14 -110 304 320 70 133 229 -52 104 23 -306 195 -7 -205
2551b05m3j94L37p5J46j22R7R2k1L6k02K09j07K25l71L99Kl04J44p0M2Q8k51L23
$$ -205 -248 -442 -105 -180 -34 -156 -59 33 12 48 -154 55 -52 173 -198 201 203 -101 43 -27 15 103 -148 175
2575A75j40R9O1k41j64J73J06N4R9l08R4j62J55k37M01kk65K39j03j8K42J04m00
$$ 175 35 134 195 -46 -210 -37 69 123 222 -86 8 -154 1 -236 165 163 -102 137 34 16 258 362 -38
2598c8J23p2Q2q7P8j42J20k8m0o5r9k38K73p6P5j39p6P3M29m50J33J55k26Q6l
$$ -38 85 13 95 8 86 -56 64 36 -4 -69 -168 -406 -133 -209 -134 -273 -349 -276 153 -297 -164 -9 -235 -149 -152
2623a52J12p0K99J7r5j65K37q7j6j81M03l37j8k61L52O5l33M41k86Oj6%k01K70
$$ -152 -40 -110 189 206 111 -54 183 96 80 -101 302 -35 -53 -314 38 103 -230 211 -75 -69 -85 -85 -286 -16
2647a6j07J90o5k10L27k20J10l45L22j14l6K77J12l60L04j60m9O5r1k47K87J78
$$ -16 -123 67 2 -208 119 -101 9 -336 -14 -128 -164 113 225 -135 169 9 -40 25 -66 -313 -26 152
2669A52l24J40k17K24M0J17j85r1M1l06J97K14k97J52K37k04j17J55N5o2L04k87
$$ 152 -172 -32 -249 -25 15 132 -53 -144 -103 -409 -212 2 -295 -143 94 -110 -227 -72 -17 -79 225 -62
2691f2o5J61K68j83j51J40J3J53l30L00q9j52r5r4K63n8N4j35k00J50J17o8n7
$$ -62 -127 34 302 119 -32 108 121 274 -56 244 155 3 -92 -186 77 19 73 -62 -262 -112 5 -63 -120
2714a20J81l40K26k01J23L15k32o4J14K13l75r0K25K34k35J34j66J67mo3j37J17
$$ -120 61 -279 -53 -254 -131 184 -48 -112 2 215 -160 -250 -25 209 -26 108 -58 109 105 42 -95 22
2736B2N3j73k86L60n5J8J88j62j57M7K74m55L38J17J1k74J57m1L84k63l7J71R8
$$ 22 75 -98 -384 -24 -79 -61 127 -35 -192 -145 129 -326 12 129 140 -134 23 -18 366 103 66 237 335
2759C35J72n64R5J96m04J96n8J7OK42l25K03l13J62rK0Q0k9k90LL14k93Q5K54
$$ 335 507 -57 38 234 -170 26 -32 -15 -9 233 -92 111 -202 -40 -49 -29 51 22 -268 -265 49 -244 -159 95
2783I5O2o9J57j37m0J87j78RL7k38M66l78PK22j47k77L45k14K97k7l81R2L4K2
$$ 95 157 88 245 108 68 255 77 86 123 -115 351 -27 -20 202 55 -222 123 -91 206 179 -202 -110 -76 -54
2807e4r7J36M2L4J40j14k71L07%j85J71j01L22l20K2j32J80k77K65m3q7L8L16
$$ -54 -151 -15 27 61 201 87 -184 123 123 -62 109 8 330 10 32 -100 80 -197 68 25 -62 -24 292
2830B92k67o0J36j24J86l14L45j63l53K66m5J51J96k41k60L21J85m00L95k8j63
$$ 292 25 -35 101 -23 163 -151 194 31 -322 -56 -101 50 246 5 -255 66 251 -149 246 218 55
2851E5K7J08j71mO8j22R6J83l20m4K06j43o1K40j33J00m8j96J84j13j3k06N74
$$ 55 82 190 19 15 83 -39 57 240 -80 -124 82 -61 -122 118 -15 85 37 -159 25 -88 -101 -307 267
2874B67m16RR8k7J43j0j49Po7k03L85L09m12j10K23On6J27m1m3L3l6M5n5rk9p8
$$ 267 -149 -140 -42 -69 74 64 -85 -78 -145 -348 37 346 -66 -176 47 53 -3 124 83 40 73 37 82 27 18 -11 -89
2901h9L9j6N5n9j80M09l1j28k9n6R9l17N54p5l94r9M02j25q2L35o1p6L5k71K94
$$ -89 -50 -66 -11 -70 -250 159 128 0 -29 -85 14 -303 251 176 -218 -317 85 -40 -122 213 152 76 111 -160 134
2926A34R2l79J48l2o6K06r7j1j01o8J06Q2Q1l62R2Q6J12j01L16k14k6j09L43k55
$$ 134 226 -153 -5 -37 -103 103 6 -5 -106 -174 -68 14 95 -267 -175 -89 23 -78 238 24 -2 -111 232 -23
2950b3o1J88l8o0J46k03j79K85J46k12L49k47L3N5k09J1j23P4p4R0Q5k48P8K9
$$ -23 -84 104 66 6 152 -51 -230 55 201 -11 338 91 124 179 -30 -19 -142 -68 -142 -52 33 -215 -137 -108
2974a08n1q8J66N0j87K79j78K76q2k1OQ5n1p9J96j03n9j37r3J11K3J22j37K22
$$ -108 -159 -247 -81 -31 -218 61 -117 159 77 56 62 147 96 17 213 110 51 -86 -179 -68 -45 77 -60 162
2998A62l4j53qp4J16j68k4K88m19L27L43m61K55p4rk42L52j46J08j04k03L79k45
$$ 162 128 -25 -33 -107 9 -159 -183 105 -314 13 356 -105 150 76 67 -175 177 31 139 35 -168 211 -34
3021c4q1J69j30J42N3j00M1k29L73m11R6R9j8l7j65j14M32j90J20J50k00r4R5
$$ -34 -115 54 -76 66 119 19 60 -169 204 -207 -111 -12 -30 -67 -232 -346 86 -104 16 166 -34 -128 -33
3044c3P4j17J23k83L71L3k52J88k65L5L52l28K95l53J27O6k08J01J51l34P9p1
$$ -33 41 -76 47 -236 135 168 -84 104 -161 -126 226 -102 193 -160 -33 33 -175 -74 77 -257 -178 -249
3066b49L4O3n2J38Q3J53j15J74l59J9J30j05L48j32j40J24k1j77L46k52K63k12
$$ -249 -215 -152 -204 -66 17 170 55 229 -130 -111 19 -86 262 130 -10 114 93 -84 262 10 273 61
3088F1jJ08l74m5J37p4J50K08k55J42j2o8l3J98l53J20K74l06Q6p7j03L41N0j69
$$ 61 60 168 -206 -251 -114 -188 -38 170 -85 57 45 -23 -56 142 -211 -91 183 -123 -37 -114 -217 124 174 5
3112EN8J31k21j2K48L5r2LK3k34Q6j37j16J40J46k39n3p1L30k68K74k75K05J05
$$ 5 63 194 -27 -39 209 244 152 155 178 -56 30 -107 -223 -83 63 -176 -229 -300 30 -238 36 -239 -34 71
3136G1m14K80J43l38N7K35R0q0N5j23j05L68K7j92q8j73K30LL9j77K73j33j60
$$ 71 -343 -63 80 -258 -201 34 124 44 99 -24 -129 239 266 74 -14 -187 43 46 85 -92 181 48 -112
3159a12K65j09k67J29L16m38Q0N7n6p7M7J38p4J36j37M85j15k16j92J62K31k0
$$ -112 153 44 -223 -94 222 -216 -136 -79 -135 -212 -165 -27 -101 35 -102 383 268 52 -140 22 253 233
3181B33j35o6J24r4L3qj49J35j5k63L18O7j76l4O8j28K45j51j16Q9Q0l20J84J85
$$ 233 98 32 156 62 95 87 -62 73 58 -205 113 180 4 -30 38 -90 155 4 -112 -23 57 -263 -79 106
3205A06j64L29j40p2J22n1k97J02J16j90K16J63j99j7J21n3j02R8r7M2J10k55
$$ 106 -58 271 131 59 181 130 -167 -65 51 -139 77 240 41 24 145 92 -10 88 -9 33 143 -112
3227a12j84J24j68L09M2k30LM57k73J9J40J00l82O2M64l06K70j83j53p2J30Q3
$$ -112 -296 -172 -340 -31 11 -219 -216 241 -32 -13 127 227 -155 -93 371 65 335 152 -1 -73 57 140
3249A40k60P3Q4j42J94N0o3l6Q3k09J99j95k48K22Rl4J36L6k59M90q5Q5k24k18
$$ 140 -120 -47 37 -105 89 139 76 40 123 -86 113 -82 -330 -108 -99 -133 3 39 -220 270 185 270 46 -172
3273a72J5J83L36l06q3M12m97L85q2q6j44N0j24j43J61J33j25K5K53k41O3n0j20
$$ -172 -157 26 362 56 -27 385 -112 273 191 105 -39 11 -113 -256 -95 38 -87 -62 191 -50 13 -37 -157
3296a57o6J01L10j36l1J42k15J04O4r3J34n0j33n9p4J24O1J0j6j14J49l32O6N55
$$ -157 -223 -122 188 52 21 163 -52 52 116 23 157 107 -26 -85 -159 -35 26 36 20 -94 55 -277 -211 344
3320C44m23J93j52r0m4k1M28n12L20J2j37J34j66J24J2k9M9p1j15j70M77j28m9
$$ 344 -79 114 -38 -128 -172 -193 235 -277 43 55 -82 52 -114 10 22 -7 42 -29 -144 -314 163 35 -14
3343a4J77n3k20r8M21k39r1j63K56j8J11j56J7RLl2J07j43K50r4j20K38j02K9
$$ -14 163 110 -110 -208 213 -26 -117 -280 -24 -42 69 -87 -70 -61 -58 -90 17 -126 124 30 -90 148 46 75
3367G5j38M1j11M37r1j16k09J89Q5j3m9j84Q8p0J56k97j03K99p2q0M2j22K00J4
$$ 75 -63 -22 -133 304 213 97 -112 77 162 149 100 -84 4 -66 90 -207 -310 -11 -83 -163 -121 -243 -43 -29
3391b9N9k84J55L14l22K34j38Q2P9m9k5m1J86k53m9L53n20J84J02K54q3n55M06
$$ -29 30 -254 -99 215 -107 127 -11 71 150 101 76 35 221 -32 -81 272 -248 -64 38 292 209 -346 60
3414F0j57K03j97J05Q0r0j86R5J19j88K45m98M17NK8j04L6J02m8lO0l0Q3k03l7
$$ 60 -97 106 -91 14 94 4 -182 -87 32 -156 89 -409 8 13 41 -63 -27 75 27 24 84 54 137 -66 -103
3439a03P6M8O7r5J03j16P1q8O0j71J51j03j0R9P0o4M5J4k10J30pL1o2k15L34%
$$ -103 -27 21 88 -7 96 -20 51 -37 23 -148 3 -100 -110 -11 59 -5 40 54 -156 -26 -33 -2 -64 -279 55 55
3465E5k5k41J45j2J27J24j66P7l8L8O7k41R7J1l5J22j79J02L8j18j40K43K2j09
$$ 55 30 -211 -66 -78 49 173 7 84 46 84 151 -90 7 18 -17 105 -74 28 66 -52 -192 51 73 -36
3489c6j68M9J12L2L3j19J08L62l79Pk02K37j08K11k36M63l30j63N4J20k11K41
$$ -36 -204 -155 -43 -11 22 -97 11 373 -6 1 -201 36 -72 139 -97 366 36 -127 -73 47 -164 77
3511G7k05q7RL75k29K7L7j8m1j34J13O4J8j23J89l8j4o5P4o6R6j64K51oq1j78
$$ 77 -128 -215 -206 169 -60 -33 4 -14 -55 -189 -76 -12 6 -117 72 34 20 -45 29 -37 59 -105 146 140 59 -119
3537a19K26K3m70L46j51K52m0k24j59M75j86JK1Pj04j36K7j06N51l66K29j60K72
$$ -119 107 130 -340 6 -145 107 67 -157 -316 159 -27 -26 -5 2 -102 -238 -211 -317 234 -132 97 -63 209
3560B09j16j11M2k03K24J31j40k44N65l05J47m59J10J51J32jj99K47k22M14l53
$$ 209 93 -18 24 -179 45 176 36 -208 357 52 199 -260 -150 1 133 132 -67 180 -42 372 19
3581A9j38O9j90K10j60J27J02j48J22J26k09J4L4J38l00J08J49Q9l9j04J43l2
$$ 19 -119 -50 -240 -30 -190 -63 39 -109 13 139 -70 -56 -22 116 -184 -76 73 162 123 19 162 130
3603A30l80N77l40J55J5j85J31K3r4j77K99l95L54j26L6j53M1J87k86N0R8K3J79
$$ 130 -250 327 -13 142 157 -28 103 126 32 -145 154 -241 113 -13 23 -130 -89 98 -188 -138 -40 -17 162
3626A62l41O4r3J71K75k25N2L3K14j40j10q1J82J2j62r2O9l6K0O5Q7j65L3J47
$$ 162 -179 -115 -208 -37 238 13 65 98 312 172 62 -19 163 175 13 -79 -10 -46 -26 39 126 -39 -6 141
3650A41j72o3J67j13q0J76p1j2J63p4j97J18j43K2Q4L17n02L41L3l1pk22N1j62
$$ 141 -31 -94 73 -40 -120 56 -15 -27 136 62 -135 -17 -160 -138 -54 263 -239 102 135 104 97 -125 -74 -236
3674b36L55k33J04j3N3l3j38l2J45O2P7k96L49k7l37M27j47oL8j38m6MJ67j82
$$ -236 119 -114 -10 -23 30 -3 -141 -173 -28 34 111 -185 164 137 -200 227 80 74 112 -26 -72 -68 99 -83
3698h3K10m1j00m5J82J34l65K62k5q7P0j07l47M04q8j19L1j99K43K24q9j73R2
$$ -83 127 86 -14 -59 123 257 -108 154 129 42 112 5 -342 62 -26 -145 -114 -313 -70 154 65 -108 -16
3721a6P2o7Jj07m1L03k19j22K24J46j25m0o0L2j14J02j75K67J40r0l27K87j04
$$ -16 56 -11 -10 -117 -158 145 -74 -196 28 174 49 9 -51 -19 -133 -31 -206 61 201 111 -216 71 -33
3744c3M4K7l04M08l11k10L13J46l6J05m00J39l8J66j64K15k21L05k19j06K30m51
$$ -33 11 38 -266 142 -169 -379 -66 80 44 149 -251 -112 -150 16 -148 67 -154 151 -68 -174 56 -395
3766c95L74Om3p5J90n1O1Oj87j44J54O0J15j85N6j98J38K78l01K39J21k14j74
$$ -395 -21 -15 -58 -133 57 6 67 73 -114 -258 -104 -44 71 -114 -58 -256 -118 160 -141 98 219 5 -169
3789a69J84k75N29j83l6k3j11J60K86k44k05K11Pj71q5Q5p3Op2K40o8n7K2k2K7
$$ -169 15 -260 269 86 50 27 -84 76 362 118 -87 124 131 -40 -125 -40 -113 -107 -179 61 -7 -64 -42 -64 -37
3814c7J1K8j97M56k18%J00k22N3P6J30j94j29K07j63O8J25m04M24j04J84n6k96
$$ -37 -26 2 -195 261 43 43 143 -79 -26 50 180 -14 -143 64 -99 -31 94 -310 114 10 194 138 -158
3837a58r6O0L75k33K2J04n6l8M1q2l1j09J23J78k00J7J33p5J04j92J86N2J83j92
$$ -158 -254 -194 181 -52 -30 74 18 -20 21 -61 -92 -201 -78 100 -100 -83 50 -25 79 -113 73 125 308 116
3861A16j07j51K22N9j20j32N3j15M38K6m77K42l3j5o2q5j00K68R9l45J75o2Q9
$$ 116 9 -142 80 139 19 -113 -60 -175 263 289 -188 54 21 6 -56 -141 -241 27 126 -219 -44 -106 -17
3884a7J42k68M74l85k74M52o3k2j12K34n6k7j7J07k33K07j76J11Q5l69L14j04
$$ -17 125 -143 331 -54 -328 124 61 39 -73 161 105 78 61 168 -65 142 -34 77 162 -207 107 3
3906Ck83K70J4Q2k20J68K5P5r9j41K2J48p3Lj53J63K35l61J85q6O8J43Qk3n4r6
$$ 3 -280 -10 4 86 -134 34 59 134 35 -106 -84 64 -9 -6 -159 4 239 -122 63 -23 45 188 196 173 119 23
3932B3j17J15k05L94k24k3o2K32j2n8N1R6k59q1Q1J28p5N3j16J05O8m6J95k41
$$ 23 -94 21 -184 210 -14 -37 -99 133 121 63 114 210 -49 -130 -49 79 4 57 -59 46 114 68 263 22
3956B2O1j31Q6l9J00l10K34K10p7j33K1kk32J35K9J73p9p5P6o9j83O7K06J6l4
$$ 22 83 -48 38 -1 99 -211 23 233 156 23 44 42 -190 -55 -26 147 68 -7 69 0 -183 -116 90 106 72
3981G2j89J26L12m94K45o6k37L51n7m6r3J65r3O6J91l73N4J05L7j12J56j60p6
$$ 72 -117 9 321 -173 72 6 -231 120 63 17 -76 89 -4 62 253 -120 -66 39 76 -36 120 -40 -116
4004a16J90k13J98J21k93l7K75o6j90M3j19J34K27m5r3OJ62k53K35k12R7j60j34
$$ -116 74 -139 59 180 -113 -150 125 59 -131 -88 -207 -73 154 109 16 22 184 -69 166 -46 51 -109 -243
4027b43J22L1J86o0l0J28Oj11j52M27j89j20J38j9j0N3p4j39j0Q6Q8j39L9j72
$$ -243 -121 -90 96 36 6 134 140 29 -123 304 115 -5 133 114 104 157 83 -56 -66 20 108 -31 8 -164
4051a64K02K31l96J86j9k32J75M2q6M6K49j88K17k02j63L14m06K09M3J2q3K01
$$ -164 38 269 -127 59 40 -192 -17 25 -61 -15 234 46 263 61 -102 212 -194 15 58 70 -13 188
4073A88l51J49p2L26l42l0j44L31K23m47M11j28q9k83N6K35nOJ03o6k54j3M77
$$ 188 -163 -14 -86 240 -102 -132 -276 55 278 -169 242 114 25 -258 -202 33 28 34 137 71 -183 -196 281
4096B81k42k21K17j00ML4R2o2K4J32j79J41j24j46K44k27J61j6L09q4Lpj72JK98
$$ 281 39 -182 35 -65 -61 -27 65 3 27 159 -20 121 -3 -149 95 -132 29 13 322 238 241 234 62 63 361
4121C61l26j12K9K35j52n1n9K25k51r1K10L0m2J09OM3k42K11j26j35N2K40l85
$$ 361 35 -77 -48 187 35 -16 -75 150 -101 -192 18 48 6 115 121 164 -78 133 7 -128 -76 164 -221
4144b21P6J57L13m40K20p4J55k94J32K0k37L66j7l23kL26j58j8L7j96L42k26j02
$$ -221 -145 12 325 -115 105 31 186 -108 24 44 -193 173 156 -167 -169 157 -1 -19 18 -178 164 -62 -164
4167a64k9K38o4J78mm49J85K25l3lN0p2j84J96j02J14r5n6P9j41J03n3K73k39
$$ -164 -193 45 -19 159 155 -294 -109 116 83 80 130 58 -126 70 -32 82 -13 -69 10 -131 -28 -81 192 -47
4191d7J11J79k13p0o4j12NJ09L9J85l85Q7J01oJ15l1p2K46j63p2oR8R7j94K26
$$ -47 64 243 30 -40 -104 -216 -211 -102 -63 122 -263 -176 -75 -81 34 3 -69 177 14 -58 -64 34 131 -63 163
4216A63k54K92L7k19k24M27p5k02J37J10j14j66J02J63m15M69k37Pj43J15K36
$$ 163 -91 201 238 19 -205 222 147 -55 82 192 78 -88 14 177 -238 231 -6 1 -142 -27 209
4237B09O1l39J12j29J12M1j91J22KK04l09J59o1k2N3j67j0j20K47L7Q8J6n8J86
$$ 209 270 -69 43 -86 26 67 -124 -2 0 204 -105 54 -7 -29 24 -143 -153 -273 -26 11 99 115 57 243
4261B43j55N0p6N0j54K6rj0QJ89L7l47J68J38k09l0j12J72J07l8J02l98L38k26
$$ 243 88 138 62 112 -42 -16 -25 -35 -27 162 199 -148 20 158 -51 -81 -193 -21 86 48 150 -248 90 -136
4285a36K74Ql35L23Pk06J8J64j27r7jJ39K49r1M5l38O0K19k73m2M0J68L4J54l39
$$ -136 138 146 -189 134 141 -65 -47 117 -10 -107 -108 31 280 189 234 -104 -44 175 -98 -140 -100 68 102 256 -83
4310h3J18j50j2qj43K64R9K8J0r2N5j46Q7J92k93K2n5L32k91j02K89k06J82j07
$$ -83 35 -115 -127 -135 -278 -14 85 113 123 31 86 -60 27 219 -74 -52 -107 225 -66 -168 121 -85 97 -10
4334a0J46n06N80j21J75k29K18k61m2L64l71j68J60L9p9J2j69J09K71J20k95l4
$$ -10 136 -370 210 89 264 35 253 -8 -50 314 -57 -225 -65 -26 -105 -93 -262 -153 118 238 -57 -91
4356i1J72j78k82L13nP0j30J58O6kj05k7J34n8Q8k09J79j01j13L83k96j9J46k55
$$ -91 81 -97 -379 -66 -71 -1 -131 27 93 91 -14 -41 93 35 123 -86 93 -8 -121 262 -34 -53 93 -162
4380a62M4L26m71L63j9k97K25n9J47l5r0Q9j14Q8j73j7J72j38J04Pj02M95l01
$$ -162 -118 208 -263 100 81 -216 9 -50 97 62 -28 61 -53 35 -138 -155 17 -121 -17 -10 -112 383 82
4403H2k14J96J18k2p6ML5j25k05l0J74k01P4J16Q9j29Q5J47j69n2k3J24L2j97
$$ 82 -132 64 182 160 84 88 123 -2 -207 -237 -63 -264 -190 -74 15 -114 -29 118 -51 -103 -126 -2 30 -167
4427a67J13M4k1K0K33l61L85l10M2k6J6Q9r1J27p2J9j20M8k8M1m6r6J78r2P7N8
$$ -167 -54 -10 -31 -11 222 -139 246 -64 -22 -48 -32 57 -34 93 21 40 -80 -32 -60 -19 -65 -161 17 -75 2 60
4453F0j53J95l8K42m83L14o5p0J36L7j06j80Qq1K26r3J32j87N03l04K19k05j32
$$ 60 -93 102 64 306 -177 137 72 2 138 175 69 -111 -103 -184 42 -51 81 -106 397 93 312 107 -25
4476b5Q6j42K04l38L46j6Pk50j30J58J23j38lJ12K0J0n3K7j06J34p3L17l31o7
$$ -25 61 -81 123 -215 131 115 122 -128 -258 -100 23 -115 -118 -6 14 24 -29 -2 -108 26 -47 270 -61 -128
4500a28M9J17j65j77L83j6Q3k22j42K25nj15J01j4J05K94m06k08L30k15r4L11
$$ -128 -79 38 -127 -304 79 63 146 -76 -218 7 2 -113 -12 -26 79 373 -33 -241 89 -126 -220 91
4522I1k06J30j46L27j43p6J59k54M20m23M71j66k38Q7n0r2L10j68o5J16j03J92
$$ 91 -115 15 -131 196 53 -23 136 -118 302 -121 350 184 -54 33 -17 -109 201 33 -32 84 -19 173
4544A73j45n3l4R5k14J82R4j19J51j71J64k1oJ15pk95J07j02J25K04k78k18K51
$$ 173 28 -25 -59 36 -178 4 98 -21 130 -41 123 102 96 211 204 -91 16 -86 39 243 -35 -253 -2
4567bq7K32j99k75K12J90p5L31j96j54J45k03R6k43J29l04J97J43J47j7k1j36
$$ -2 -89 143 -56 -331 -119 71 -4 327 131 -23 122 -81 15 -228 -99 -403 -206 -63 84 67 46 -90
4589i0R7ON0k77L16j87o5K57k34j3K67j57Q6o4K8L3Rp1j06K52O4l91J77J40j19
$$ -90 7 13 63 -214 102 -85 -150 107 -127 -140 127 -30 56 -8 20 53 62 -9 -115 137 201 -190 -13 127 8
4614HN6M5p7N0p0l7J05J95j51j07K6j10J25j63O5L8j23K48j83J23o4L8j63k2M
$$ 8 64 109 32 82 12 -25 80 275 124 17 43 -67 58 -105 -40 -2 -125 123 -60 63 -1 37 -126 -148 -144
4639a44j38R2K60J86k33q0J53k6o6Q8J02k21l00L68o3K12r0m48L64L06k50J18
$$ -144 -282 -190 70 256 23 -57 96 70 4 92 194 -27 -327 41 -22 190 100 -348 16 322 72 190
4661A90n6k63K41j37j33J33j08j56M06r6j97N3j10j45K09J21J3P3J20n01K24R5
$$ 190 134 -129 112 -25 -158 -25 -133 -289 117 21 -176 -123 -233 -378 -169 -48 -35 38 158 -343 -119 -24
4683b4j02K71p4k8N4k90K18j63J29n7j4J35j25J28J01j77%j14K93k47L12l13J06
$$ -24 -126 145 71 43 97 -193 25 -138 -9 -66 -80 55 -70 58 159 -18 -18 -132 161 -86 226 -87 19
4706A9k22M06l95P7J11k67L24j3k06J89j21K53J93n76K48R9j18J14P9j38k63K59
$$ 19 -203 203 -192 -115 -4 -271 53 40 -166 23 -98 155 348 -228 20 119 1 115 194 56 -207 52
4728E2J23k70J29J78N4l26K22j63k60L27k44k0J10J75j24Pj21k2K83j73L7j13
$$ 52 175 -95 34 212 266 -60 162 -1 -261 66 -178 -198 -88 87 -37 -30 -151 -173 110 -63 -26 -139
4750a39K38l45L47k2no9L2J0l59N63k35k13L93k57j03K91N8q8j71J07J02Q2k60
$$ -139 99 -246 101 79 74 5 37 47 -312 251 16 -197 196 -61 -164 127 185 97 -74 33 135 217 -43
4773d3k2j70K04n6L4R6j20M42m41J9q1J02pk3J60k17k18L97J32j91J70p6j03K04
$$ -43 -65 -235 -31 -87 -53 43 -77 365 -76 -57 -138 -36 -43 -66 94 -123 -341 56 188 -3 167 91 -12 192
4797A92j02j63o3J81j46P8J36k18M2JP6r5J57l9J76n41P5J92L92k62j30M9j02
$$ 192 90 -73 -136 45 -101 -23 113 -105 -63 -62 14 -81 76 37 213 -328 -253 -61 331 69 -61 -12 -114
4820a14K17j15J76j23r8J99l04l7L93r8k14m4K44k27J20p3J05K10l0k58N6L0Q5
$$ -114 103 -12 164 41 -57 142 -162 -199 194 96 -118 -162 82 -145 -25 -98 7 217 187 -71 -15 15 100
4843A00q1j44m5J19K46l77J56Q9k45qK42K14m07K51o9K2n8J0P9p9N8j37J53K4
$$ 100 19 -125 -170 -51 195 -182 -26 63 -182 -190 52 266 -141 110 41 63 5 15 94 15 73 -64 89 113
4867A13L6r6j73N5J5J39j90m6J50rj61L59k62K10p0k74M4R8j05J68p5K3M8j1r8
$$ 113 149 53 -120 -65 -50 89 -101 -147 3 -6 -167 192 -70 140 70 -204 -160 -62 -167 1 -74 -51 -3 -14 -112
4892a12Q9n5L6j3K7k4J35n5j22R7J51k50p4K04j01QK02k11N9R8j98K60j09j13
$$ -112 -23 -78 -42 -55 -28 -52 83 28 -94 3 154 -96 -170 34 -67 -59 143 -68 -9 89 -109 151 42 -71
4916g1q0K25jm4Q5j53k76L33N2j2Rj55M2Ll2L1J64K9j33N3j56K40k78Q9M0l7p9
$$ -71 -151 74 73 29 114 -39 -315 18 70 58 67 -88 -46 -43 -75 -44 120 149 16 69 -87 153 -125 -36 4 -33 -112
4943a12J68O7j48K12k31J49K31k65j45O0j76L59j69J59M5j39j32J50n2j49J33
$$ -112 56 123 -25 187 -44 105 336 71 -74 -14 -190 169 0 159 204 65 -67 83 31 -118 15
4964A5l3J57mj41p3k1Qj8K05q2o4K86j31j14k62L58q0K15n8j8k97j9J12J49Ql7
$$ 15 -18 139 135 -6 -79 -100 -92 -110 95 13 -51 235 104 -10 -272 86 6 221 163 145 -152 -171 -59 90 98 61
4990F1J6J4pl84K52J6J86k68Q2r9K0J69K3j0n5j13J21J42k29J53k12R1j48%K61
$$ 61 77 91 84 -300 -48 -32 154 -114 -32 -131 -111 58 81 71 16 -97 24 166 -63 90 -122 -31 -179 -179 82
5015H2k9j08K0j67K26K5Jk5k64J06J18r5R2k9k31J13K50m1j73J08J85k36k6J69
$$ 82 53 -55 -35 -202 24 49 50 25 -239 -133 -15 -110 -18 -47 -278 -165 85 44 -129 -21 164 -72 -98 71
5039G1J38j33j25J70j36l1k06M85l0k26R6J36R6k68j05J45k29L57k73J33J90l44
$$ 71 209 76 -49 121 -15 -46 -252 233 203 -23 73 209 305 37 -68 77 -152 205 -68 65 255 -89
5061h9o0J25L9j43N3m5j10K48J72l28J49j58K10k07j31L01J4j13J88m25N01l49
$$ -89 -149 -24 15 -128 -75 -120 -230 18 190 -138 11 -147 63 -144 -275 26 40 -73 115 -310 191 -158
5083a58Q3j27QL87l42J72N7j36jJ93k4l65K29M4k4j2Q0k38K25k19J43p%J73k22
$$ -158 -75 -202 -194 193 -149 23 80 -56 -57 136 112 -253 -24 20 -4 -16 64 -174 51 -168 -25 -32 -32 141 -81
5108h1Q4q2k21L66k33J80L5k29L64k91J25j31J99j06J21j47NJ5n3N9N2k42L35
$$ -81 3 -79 -300 66 -167 13 48 -181 183 -108 17 -114 85 -21 100 -47 -42 -27 -80 -21 31 -211 124
5131A24L7k10K07j8j96j79K03r9K86p2k10P4L0KK28j47k54J36M9r3K17k02L68
$$ 124 161 -49 158 140 -56 -235 -32 -131 155 83 -127 -53 -23 -21 207 60 -194 -58 -9 -102 115 -87 281
5154B81j82l40J98n8L7j09K75J45j36j85J24k32J34J87k40j2M06n22L29k71L78
$$ 281 99 -241 -43 -101 -64 -173 102 247 111 -74 50 -182 -48 139 -101 -113 293 -229 100 -171 207
5175B07j81Q4j17l6P2J03k67P9J88J12l19M05m04N3m0K04k38J03p9l65M20J54
$$ 207 26 110 -7 -43 29 132 -135 -56 132 244 -75 330 -74 -21 -61 143 -95 8 -71 -436 -16 138
5197A38j26j45o0K24J23P4k00N8O8k20K59k10j08K90k92k4J46J03kj42p5%R3J50
$$ 138 12 -133 -193 31 154 228 28 86 154 -66 193 -17 -125 165 -127 -151 -5 98 96 -46 -121 -121 -28 122
5221A22n3r0Q3O3j42K1J23n1j53L31k24k3Qk6rJ1J01o2O5j66j51J94j54m6L13
$$ 122 69 -21 62 125 -17 4 127 76 -77 254 30 7 15 -11 -20 -9 92 30 95 -71 -222 -28 -182 -228 85
5246H5l38L33o6M4k87L75r8q6pN1Mj02M7k52K63l9J39j11J04j06K69j64j99O6
$$ 85 -253 80 14 58 -229 146 48 -38 -45 6 10 -92 -45 -297 -34 -73 66 -45 59 -47 222 58 -141 -75
5270g5M4J55R3l33j25O02o08L25o6j05K29k34K94j04k66m8J20k26J73K00j1k3
$$ -75 -31 124 217 -116 -241 361 -247 78 12 -93 136 -98 196 92 -174 -222 -102 -328 -155 45 34 11
5292A1p4j00N6J99J20j00j04j18K09n9q8r1K18Qk41J17K05p9k7j03j73J28L18
$$ 11 -63 -163 -107 92 212 112 8 -110 99 40 -48 -139 79 87 -154 -37 168 89 62 -41 -214 -86 232
5315B32l3m14K30P9j75Q1o1J89j90K02r2n2m2J23J9o8n2K02j68K47j34j64Q2p0
$$ 232 199 -215 15 94 -81 0 -61 128 -62 140 48 -4 -46 77 96 28 -24 178 10 257 123 -41 41 -29
5339b9m2O5q5Q9n0K1K12k7r2j48jQ0K64j62k00J03M7K15j08l83O5Q6Q9M6j82R4
$$ -29 -71 -6 -91 -2 -52 -31 181 154 62 -86 -87 -7 257 95 -105 -2 45 260 152 -231 -166 -80 9 55 -127 -33
5365c3R7j25L2J87k96nJ21j42J47M7J72m25J80Q9rq3q5K67j21l38J64P0L02jj47
$$ -33 64 -61 -29 158 -138 -143 -22 -164 -17 30 202 -223 -43 46 37 -46 -131 136 15 -323 -159 -89 213 212 65
5390F5j42K87j79R3j80J25j59J63k8l11N17p1n1k87K33o6J10l02J92J95j94J20
$$ 65 -77 210 31 124 -56 69 -90 73 45 -266 251 180 129 -158 75 9 119 -183 9 204 10 130
5412A30k02N8k01K61j80K57O9l16L7O0j00K84q6j59L5pO6r1J06%j37K20q3j37
$$ 130 -72 -14 -215 46 -134 123 192 -124 -87 -27 -127 157 71 -88 -53 -60 6 -85 21 21 -116 104 21 -116
5436a16m5K31J57k75J69j2n0q4L33l31J93r1J70n74M23m3k28qJ59j3p1P0J86j80
$$ -116 -161 70 227 -48 121 109 59 -25 308 -23 170 79 249 -325 98 55 -173 -181 -22 -35 -106 -36 150 -30
5460c0k3K28j20l0om9n3K18k64j4l8m4L54N8m01K46k11J13P7Qj06J64j54j81L33
$$ -30 -53 175 55 25 19 -30 -83 135 -129 -143 -181 -225 129 187 -214 32 -179 -66 11 19 -87 77 -77 -258 75
5485G5J3k76K59k22K81k21r4K76K7j29J01n4O1k85K09m0J73q7j1j45K33k58J29
$$ 75 88 -188 71 -151 130 -91 -185 91 118 -11 90 36 97 -188 21 -19 154 67 56 -89 144 -114 15
5508A5J46k17Rj77J21L31l00R8L9j78n1K59q9l8j4p1Q3M1o4O1O8K3k2n0poN2j12
$$ 15 161 -56 -47 -224 -103 228 -72 26 65 -113 -164 95 6 -32 -46 -117 -34 7 -57 4 72 95 73 23 16 10 62 -50
5536e0J25j15J78r0QM0M8j55J06j95L26k55P7l1o4K07k78L36j94m6J9J61k64M4
$$ -50 75 -40 138 48 56 96 144 -11 95 -100 226 -29 48 17 -47 160 -118 218 24 -22 -3 158 -106 -62
5560f2M2L7L25m79LJ20n7N2Q3J66k23j66K22k9o7K12p0r7jq5l0L02ok25J53j56
$$ -62 -20 17 342 -137 -134 -14 -71 -19 64 230 7 -159 63 34 -33 179 109 12 11 -74 -104 198 192 -33 120 -36
5586c6L1j27J64o0j36M64k46J11k22J23qj82O5Q2j65K69n7l41K78j52J64j94K65
$$ -36 -5 -132 32 -28 -164 300 54 165 -57 66 58 -124 -59 23 -142 127 70 -271 7 -145 19 -175 90
5609I0m90M75J80j40l6o6K8P1q8M2n1LJ37j47l39K72J30n6j68R1R5n1j90K63m
$$ 90 -400 75 255 115 79 13 41 112 24 66 15 18 155 8 -331 -59 71 15 -153 -62 33 -18 -208 55 51
5634E1k56L60p9mj01Q1mn2J66k50O8J55l06k6K54j15K14j73J46k08K39m09L37
$$ 51 -205 155 76 72 -29 52 48 -4 162 -88 -20 135 -171 -197 57 -58 156 -17 129 -79 160 -249 88
5657H8J64l01J97J8O1j12k6jk76n1%L36j20oK29j37o6p6n6K37k92L49j58k04J55
$$ 88 252 -49 148 166 227 115 89 88 -188 -239 -239 97 -23 -29 200 63 -3 -79 -135 102 -190 159 1 -203 -48
5682d8kK62k07p4L12j34j01r6L25j42k98j3J98k3l00K1L79J81j53j09J0j70J28
$$ -48 -50 212 5 -69 243 109 8 -88 237 95 -203 -216 -18 -41 -341 -320 59 240 87 -22 -12 -182 -54
5705e4K9K33k98j29K92k15J82Q8r6k7J37k82K6j24K73j65P2l5K68j10J09r7rl12
$$ -54 -25 208 -90 -219 73 -142 40 128 32 5 142 -140 -114 -238 35 -130 -58 -93 175 65 174 77 68 -244
5729b44J56q8P0MK66o9J97l03J35k57J34n5M4N2j85J36q2M6k7L53o2j9K7k86J42
$$ -244 -88 -176 -106 -102 164 95 292 -11 124 -133 1 -54 -10 42 -143 -7 -89 -43 -70 283 221 202 229 -57 85
5754H5R7l24K11op3K2J07k59p8L04%n5j46J96J6k17J4K1N8r9O2L44j83j42J07
$$ 85 182 -142 69 63 -10 12 119 -140 -218 86 86 31 -115 81 97 -120 -106 -85 -27 -126 -64 280 97 -45 62
5779F2K17j68j44j17L7O2l9K62r8J27j19q5K54m11N8M7j09l82N25J09j46J33l9
$$ 62 279 111 -33 -150 -113 -51 -90 172 74 201 82 -3 251 -160 -102 -55 -164 -546 -21 88 -58 75 36
5802C6m9m8K14ONJ0j73l8j07J35j20L62k53P0pk43J14j07M51o6j13l97L18o9m3
$$ 36 -13 -61 153 159 164 174 1 -37 -144 -9 -129 233 -20 50 43 -200 -86 -193 258 192 79 -318 0 -69 -112
5827a12K8J02k02K91j52J6J99l45J54J26P0j80J01j34K86l57K82l01n1M14n22
$$ -112 -84 18 -184 107 -45 -29 170 -175 -21 105 175 -5 96 -38 248 -109 173 -128 -179 235 -287
5848b87M19n7j65J76k21J42L2l4Kl1K11k09L7R2k09j46P1L48r1O2k20k3J43j20
$$ -287 132 75 -90 86 -135 7 39 5 7 -24 187 -22 15 107 -102 -248 -177 171 80 142 -78 -101 42 -78
5872g8K0Q9k61P3L30j11L26n94M08j97n8J66P7r7k20K08Jj84M25m37j0j19P4J00
$$ -78 -58 31 -230 -157 173 62 388 -206 202 5 -53 113 190 93 -127 81 82 -102 323 -114 -124 -243 -169 -69
5896f9j27K63j58M9Q2k17J02L82k55n2J27j02k08N2K88j04k26J61k9L6j65L07
$$ -69 -196 67 -91 -42 40 -177 -75 307 52 0 127 25 -183 -131 157 53 -173 -12 -41 -5 -170 137
5918A37n8k10J42r6J33N2l0Lk03K61r6q0Q4o4O5j24nK18k36j92K87J30q8j18K11
$$ 137 79 -131 11 -85 48 100 70 73 -130 131 35 -45 39 -25 40 -84 -89 129 -107 -299 -12 118 30 -88 123
5943A23j1m1k79N1r8L78Rk4j58M9Q2j43L0J66k90J3J00q1J47O5J3j73L4n7jK45
$$ 123 112 71 -208 -157 -255 123 132 108 -50 -1 81 -62 -32 134 -156 -143 -43 -124 23 88 101 -72 -38 -95 -96 149
5969A49r8j61M5J41p5j70l2L94k25J86n0j92J62l43M36m65M44O1n7j07L4m3k62
$$ 149 51 -110 -65 76 1 -169 -201 193 -32 154 104 -88 74 -269 167 -298 146 207 150 43 77 34 -228
5992b28J50R1p1P3n2L6P7N9k17Q1M0N2j4j38q1j1J20j3L7j85N6K69j07J54k64
$$ -228 -78 13 -58 15 -37 -1 76 135 -82 -1 39 91 77 -61 -142 -153 -33 -46 -9 -194 -138 131 24 178 -86
6017h6L45k07j14K1K32k54M3k03K11j07j2M7O5O7r1q5K0MK48o3K34l95J32j67
$$ -86 259 52 -62 -41 191 -63 -20 -223 -12 -119 -131 -84 -19 48 -43 -128 -108 -104 144 81 315 -80 52 -115
6041a15O0J96j04L5j9k69L25j38j27K90k16j15J64J13k04J65J83k82n5J21j25
$$ -115 -55 141 37 72 53 -216 109 -29 -156 134 -82 -197 -33 80 -124 41 224 -58 -113 8 -117
6062a17R2o7M4m7J47j26K51q4J34l26J73%mj72r0M41j52J12q6j31N9j10J49k70
$$ -117 -25 -92 -48 -95 52 -74 177 93 227 -99 74 74 70 -102 -192 249 97 209 123 -8 51 -59 90 -180
6086a80J75j83J40q1p2M12l01k20M31k21q9J68j36K40J13q8p9J4k50J82m9j47
$$ -180 -5 -188 -48 -129 -201 211 -90 -310 121 -100 -189 -21 -157 83 196 108 29 43 -207 -25 -74 -221
6108b21R0J00j97K73l4j72J63p0R0K57k13o5j78J00J29n2j57J64l34M98k77J89
$$ -221 -131 -31 -228 45 11 -161 2 -68 22 279 66 1 -177 -77 52 0 -157 7 -327 171 -106 83
6130H3j41R8k57J48M8r8R2r0O3j2j6J99k2j72K56m2j02l5kN4k62K86j18q0K36
$$ 83 -58 40 -217 -69 -21 -119 -27 -117 -54 -66 -82 117 95 -77 179 137 35 0 -2 52 -210 76 -42 -122 114
6155A14m6r3j1j33K06J07l73O1nL4L49K9m23o8K96j35L14k87K19q3j08m8J40J07
$$ 114 68 -25 -36 -169 37 144 -229 -168 -173 -139 210 239 -184 -252 44 -91 223 -64 155 72 -36 -84 56 163
6179A63j67J26L0k72j15K66o9L3J8j90J78K8r7j16k1K01P5J8l8n9Q2N4k64K0K55
$$ 163 -4 122 152 -120 -235 31 -38 -5 13 -177 1 29 -68 -184 -205 -4 71 89 51 -8 74 128 -136 -116 139
6204A39r1o7K10k22l5J11k06J55j1q1J38J89j91J74Ml38O6k48L44q8k7j42K55
$$ 139 48 -19 191 -31 -66 45 -161 -6 -17 -98 40 229 38 212 216 -122 -56 -304 40 -48 -75 -217 38
6227C8j60J41p5K36j09j37q9j41K59J2K18r5K53j89r5R8j19l9j53J32K7j9l4L78
$$ 38 -122 19 -56 180 71 -66 -155 -296 -37 -25 193 98 351 162 67 165 46 7 -146 -14 13 -6 -40 338
6251C38l41O4J03j58k01J60j44K00Q0k57J83j13K63j95l5k10L42L95n70Q6p6j6
$$ 338 -3 61 164 6 -195 -35 -179 21 101 -156 27 -86 177 -18 -53 -263 79 474 -96 -10 -86 -102
6273a02K26j64Op8K52l4k96J13J21Q7P8j65q5Ok31P2L78j3j81l5L62l85L03l03
$$ -102 124 -40 -34 -112 140 106 -190 -77 44 131 209 44 -41 -35 -266 -194 184 171 -10 -45 317 -68 235 -68
6297f8k62L26M7k26K35Jl40M25K08m32m9J46O8r4M4q0lL61m38J81O3l96Q9M22
$$ -68 -330 -4 43 -183 52 53 -287 138 346 -86 -135 11 79 -15 29 -51 -54 307 -131 50 113 -283 -194 228
6321B28k19k25N3Q1J12J02l13K25K1j44p3L03j97p6P6l8p3L34l88L32N4j75o9
$$ 228 9 -216 -163 -82 30 132 -181 44 65 -79 -152 151 -46 -122 -46 -84 -157 177 -211 121 175 0 -69
6344f9J01J44j95q4J43j35J5P9q3J2J64M6j73K5J10J02k21m8j1J56k00K72r6N6
$$ -69 32 176 -19 -103 40 -95 -80 -1 -84 -72 92 138 -35 -10 100 202 -19 -67 -78 78 -122 150 54 110
6368A10N7K8p0j10J75k55K44k9l34K56J6m4P4l53L4J84o6J82LK28k33j4j76j86
$$ 110 167 195 125 15 190 -65 179 150 -184 72 88 44 118 -235 -201 -17 -83 99 102 330 97 83 -93 -279
6392b79L35j74J64K9J6q5p3m8K09j13J12J19r3J20j06q9j65K66l73M56n76M05
$$ -279 56 -118 46 75 91 6 -67 -115 94 -19 93 212 119 239 133 44 -121 145 -228 228 -348 57
6414E7j81N4J12k01J38n4J32k78K98R2l13L0L87k93R1j0j2j56J18J03J97m15K51
$$ 57 -124 -70 42 -159 -21 -75 57 -221 77 169 -144 -114 273 -20 71 61 49 -107 11 114 311 -104 147
6437A47k74K50j86R7j44l5m1J05N0j96l0Q6K21N8k45J54k5o5j74L41R2K8l50K63
$$ 147 -127 123 -63 34 -110 -145 -186 -81 -31 -227 -257 -171 50 108 -137 17 -8 -73 -247 94 186 214 -136 127
6461A27j09J30J3k98O8R8n9Q1q6q4L34l89K52k36J75J80k61J79j66j09N0jJ12
$$ 127 18 148 161 -137 -69 29 -30 51 -35 -119 215 -174 78 -158 17 197 -64 115 -51 -160 -110 -111 1
6484Ak28J17O3J53Lk35j0M83k90j00N8J30j24m8K9P8l22J79Q8Q8j42J71j67p5
$$ 1 -227 -110 -47 106 109 -126 -136 347 57 -43 15 145 21 -27 2 80 -242 -63 25 113 -29 142 -25 -100
6508a00rQJ02N1j02rK31m21J82j63L6R6K88j10k0k25L0M6l2M42l66J25J32k14
$$ -100 -109 -101 1 52 -50 -59 172 -249 -67 -230 -194 -98 190 80 60 -165 -135 -89 -121 321 -45 80 212 -2
6532bM3J12P7m02K59j40P8m8k6l3J25Q9l12L04l49M32k64J25j95J20N9q5l8%J44
$$ -2 41 153 230 -172 87 -53 25 -23 -49 -82 43 132 -180 124 -225 207 -57 68 -127 -7 52 -33 -71 -71 73
6557G3O4M3m19M00l47kK82j62K1K71j40j84R4P3j28K53k74j05R5K45o3l1j10J29
$$ 73 137 180 -239 161 -186 -188 94 -68 -47 224 84 -100 -6 67 -61 192 -82 -187 -92 153 90 59 -51 78
6581G8p1K9J5m2K36j63R3k65M7N2q2K68q7L9J5k85J61L5J11k07J52Q0l06L06j12
$$ 78 7 36 51 9 245 82 175 -90 -43 9 -73 195 108 147 162 -123 38 73 184 -23 129 209 -97 209 97
6606I7l95M74l74L42J78j35j36J14j61J25j51J1j24Q6N6J50j52j93R5M6Q1N0j43
$$ 97 -298 176 -198 144 322 187 51 165 4 129 -22 -11 -135 -49 7 157 5 -188 -93 -47 34 84 -59
6629e9L8m3K96o2o8j44J36o3J36k13M2K13m19J95r3O1J37n3o6k23J91J66j91K3
$$ -59 -21 -64 232 170 102 -42 94 31 167 -46 -4 209 -210 -15 -108 -47 90 37 -29 -252 -61 105 -86 -63
6653f3m4K21j04q4K8j53R7P7J82l04K18J07O7m83L22j74K22r5j48j26J6K5N4k2
$$ -63 -107 114 10 -74 -46 -199 -102 -25 157 -147 71 178 245 -238 84 -90 132 37 -111 -237 -221 -196 -142 -164
6677a64J58Q1M0j61L1M9M6mlr4l7K38j41j20P9L8QL9j78j5j6J07j09l8K91m9j90
$$ -164 -6 75 115 -46 -15 34 80 76 73 -21 -58 180 39 -81 -2 36 44 83 -95 -110 -126 -19 -128 -166 125 76 -114
6704a14k44K13K15K42l02k12J35J04j75K40j08k9R3k58L37m00J77L3M47n31M13
$$ -114 -358 -145 70 312 10 -202 -67 37 -138 102 -6 -35 58 -200 137 -263 -86 -53 394 -137 276
6725B76k71k07J67p0Q3J09j49J6m3P1k2K0l6M21l20k10K90j03N7n7J21q5j05j2
$$ 276 5 -202 -35 -105 -22 87 -62 -46 -89 -18 -40 -20 -56 365 45 -165 125 22 79 22 143 58 -47 -59
6749e9J90j66J8K15k34j01n0K86j14Ol9L05l9k06Okj7L1K12m47N2M71n63N65m89
$$ -59 131 -35 -17 198 -36 -137 -187 99 -15 -9 -48 257 218 12 18 16 -1 30 242 -205 -153 318 -245 320 -169
6774a69Q8L0J00k0O5j51J36l0J05k67JJ65m04K22J41N3j68J76J30k70j38K63J84
$$ -169 -81 -51 49 29 94 -57 79 49 154 -113 -112 53 -351 -129 12 65 -103 73 203 -67 -205 58 242
6797B42l66K26j90p2M56j5n64PL84K63n12J9L62l49k8j03J85M0j82N02m02l6m1
$$ 242 -124 102 -88 -160 296 281 -283 -276 108 371 -141 -122 240 -109 -137 -240 -55 -15 -197 305 -97 -133 -174
6820a74M81k36j39Q1j81K59pj04k5J10o5O9j14j13p7R0K07l42K70N5m03N20n6
$$ -174 307 71 -68 13 -168 91 84 -20 -45 65 0 69 -45 -158 -235 -145 62 -280 -10 45 -358 162 106
6843A06l1L1n7j12J96l55K60j42qM45p00N66j43R2l06K49q9J0NJ03k98K46k43
$$ 106 75 106 49 -63 133 -222 38 -104 -112 333 -367 199 56 148 -158 91 2 12 17 120 -178 68 -175
6866a75K3L21k85Q9K2K8j6j1%j28J4j22R2J32j40o2M00j93j63K24j2j36J32J93
$$ -175 -152 169 -116 -27 -5 23 7 -4 -4 -132 -118 -240 -148 -16 -156 -218 182 -11 -174 50 38 -98 34 227
6890B27k7l22J55J9O4j58P4n0J08p9OK9l0j80L08k18K2j25k3J17j44L16R0k40
$$ 227 200 -122 33 52 116 -42 32 -18 90 11 17 46 16 -164 144 -74 -52 -177 -200 -83 -227 89 179 -61
6914f1J31q6LJ03j64J75j43q7M2J84j20L6J4JJ49k93K02j22J81k12k2k06M83k41
$$ -61 70 -16 -13 90 -74 101 -42 -129 -87 97 -23 13 27 28 177 -116 86 -36 145 -67 -89 -295 188 -53
6938e3N6m7K99l95J06K8k11K14K07j43k44N65n36J23J89n0j22q5M22k08j16J82
$$ -53 3 -44 255 -140 -34 -6 -217 -3 204 61 -183 382 -154 -31 158 108 -14 -99 323 115 -1 181
6960A81j17M3k51K97m18J59J0n0m2J18kM6K79k90J4Km5o7K29R9l53M44j73K0k12
$$ 181 64 107 -144 153 -265 -106 -96 -146 -188 -70 -72 -26 253 -37 -23 -21 -66 -133 96 195 -158 286 113 133 -79
6985g9L91n45K63K13l82L8J41k29J87M7k05K12K0Nr6j33J43P5j71j1P2J52k17
$$ -79 312 -233 30 243 -139 -101 40 -189 -2 45 -160 52 72 77 -19 -152 -9 66 -105 -116 -44 108 -109
7008a09L42o6k7j6j54p2j2J95K1k55K70j89k7J40j02J63k15O7O1M8J84k31j65
$$ -109 233 167 140 124 -30 -102 -114 81 102 -153 117 -72 -99 41 -61 102 -113 -46 15 63 247 16 -149
7031a49K85R5j4k52R5j53J24l1N4j60O5R0J03l63L84k03p5J03N2J70o6Rq4J02
$$ -149 136 231 217 -35 60 -93 31 0 54 -106 -41 49 152 -211 173 -30 -105 -2 50 220 154 163 79 181
7055A81l59K57j19J24l12K64j8lj19mM0K26M3l48r4J20P2%rj47j14K28j16J75
$$ 181 -178 79 -40 84 -228 36 18 15 -104 -108 -68 158 201 -147 -241 -121 -49 -49 -58 -205 -319 -91 -207 -32
7079c2rJ12J93l47K51p8m6p1K17k0k09L6J59m4l2r2j26L03k6Rk37J3p4J99M7K
$$ -32 -41 71 264 -83 168 90 44 -27 190 170 -39 -3 156 112 80 -12 -138 165 139 148 -89 -76 -150 49 96 98
7105I8p7k16J87rK27k88k4K22l1j69K02k12K50k48R4kJN5m2p4o1J3k76J89J51
$$ 98 21 -195 -8 -17 210 -78 -102 120 89 -80 122 -90 160 -88 6 4 5 60 18 -56 -117 -104 -380 -191 -40
7130d0K17j01J61m95J94j26L44k54J41m5P5j66L2Q1j27J17l4K66n5m02K02J04
$$ -40 177 76 237 -258 -64 -190 154 -100 41 -4 71 -95 -63 18 -109 8 -26 240 185 -217 -15 89
7152H9k43J47J62l06M34j89k62L66l0k61qJ95l4l72L19M8o7jo1J94k25L5j5L35
$$ 89 -154 -7 155 -151 283 94 -168 198 168 -93 -101 94 60 -312 7 55 -12 -13 -74 120 -105 -70 -85 250
7176B50l10J32j70M3Q7nm3j4q2K94l92K73p3m3Om2j30L31k01k4L63k44N2k42k2
$$ 250 -60 72 -98 -55 32 27 -16 -30 -112 182 -210 63 -10 -53 -47 -89 -219 112 -89 -113 250 6 58 -184 -206
7201b06K72r0L1J37l50K26J88l84J72K68k33J65k71J26j56R4k9J76l07p8O4L22
$$ -206 66 -24 7 144 -206 20 208 -176 -4 264 31 196 -75 51 -105 -11 -40 136 -171 -249 -185 137
7223A37l33K87q4j30L51m98P4J55j29k4K70K35n00J47P9j13O2R6J6j41J66l0J2
$$ 137 -196 91 7 -123 228 -270 -196 -41 -170 -194 76 311 -189 -42 37 -76 -14 82 98 -43 123 93 105
7246A05j94o2J83l2k8J53p5j8j54K10j83J11n1j88K70p1K15j1j13p9Q0N5l16O1
$$ 105 -89 -151 32 0 -28 125 50 32 -122 88 -95 16 -35 -223 47 -24 191 180 67 -12 68 123 -193 -132
7270a32J88J35k88J53l00K02J62J6j20j97M93k07JQ6m07K05K32k00j84Q0J26r3
$$ -132 56 191 -97 56 -244 -42 120 136 16 -181 312 105 106 192 -215 -10 222 22 -162 -82 44 -49
7292d9j92K92p6o8r8K9K04k30K67j92J32J19M3N3m13M3o1j01M82k37k2k49K57
$$ -49 -241 51 -25 -93 -191 -162 42 -188 79 -113 19 138 181 234 -179 -136 -197 -298 184 -53 -75 -324 -67
7315f7J06j54j05L0Q8L28l10j15l9Q1Q4P1l33M04N3m31O45l57N5J93k30k64J30
$$ -67 39 -115 -220 -190 -102 226 -84 -199 -238 -157 -73 -2 -335 69 122 -309 336 -21 34 227 -3 -267 -137
7338a37N2K63j67j6m56N17j73J11K03k26J0P7j45K53Kj26m8j65p8J79K92k18o0
$$ -137 -85 178 11 -5 -461 56 -117 -6 197 -29 -19 58 -87 166 168 42 -6 -171 -249 -70 222 4 -56
7361e6J78J12l04O1j02J06l9J42p5J73m55L83J27j54J01k77n8J32J4nK6m3j04
$$ -56 122 234 -70 -9 -111 -5 -44 98 23 196 -259 124 251 97 198 -79 -137 -5 9 4 30 -13 -117
7384a17J41Mj21r3K27j56J50p1K7J69j34r2j45J50k3l9P0j33M5M5L30m6k50K7
$$ -117 24 28 -93 -186 41 -115 35 -36 -9 160 26 -66 -211 -61 -84 -123 -53 -186 -141 -96 234 188 -62 -35
7408c5KO7J1j45R7j09L29K1j99j07l1J02K0m5j47K01K0m16K85P4L6j43J09J36
$$ -35 -33 34 45 -100 -3 -112 217 238 39 -68 -99 3 23 -22 -169 32 52 -364 -79 -5 31 -112 -3 133
7432A33j50l7K87k33p9L20j30q0k0j03L52l11Q2L5k88K03J11k25J77k52L19k55
$$ 133 -17 -54 233 0 -79 241 111 31 11 -92 260 -51 31 66 -222 -19 92 -133 44 -208 111 -144
7454a44R3J75l26L09k48J73j3j96Q0P0O1O2J06j53j1J1l8r9K89j00j27R2j07M7
$$ -144 -51 124 -202 107 -141 32 19 -177 -97 -27 34 96 202 49 38 49 11 -88 201 101 -26 66 -41 6
7478FN0j42P9j27j36L28Oj18J07jO1j85N3J0p3J87k78J55J35j91k2K22k46N5j42
$$ 6 56 -86 -7 -134 -270 58 64 -54 53 52 113 -72 -19 -9 -82 105 -173 -18 117 -74 -96 126 -120 -65 -207
7503b07K73l00L44Q2k51m4K42q2k50J38n5N0J2K37l19J55j20R4K21j69M7k34L44
$$ -207 66 -234 110 192 -59 -103 139 57 -193 -55 -110 -60 -48 189 -130 25 -95 -1 220 51 98 -136 208
7526B08l51J36l2r8K57j18j39J65j44J42o1j08J10L4k94L09j0j58L66k33j6j73
$$ 208 -143 -7 -39 -137 120 2 -137 28 -116 26 -35 -143 -33 1 -293 16 6 -152 214 -19 -35 -208
7548b08J5J17J88j00j84R8M5J09j16k6M4K84j56k30K5n8J14J71j16P4m3l6m5K12
$$ -208 -193 -76 112 12 -172 -74 -29 80 -36 -62 -18 266 110 -120 -95 -153 -39 132 16 90 47 11 -34 178
7572A78j41P4j98K7K06k2k14L42q7j17j85L05o9j05k6m6m0N0J28j37jJ41K5p0
$$ 178 37 111 -87 -60 146 124 -90 252 165 48 -137 168 99 -6 -32 -78 -118 -68 60 -77 -78 63 88 18
7596A8M4j28J71j10L96l17j59j33K86j65Q6N2K8o0q5rP9o8J01J86k14o4Oq4M13
$$ 18 62 -66 105 -5 391 74 -85 -218 68 -97 -11 41 69 9 -76 -85 -6 -74 27 213 -1 -65 -59 -143 270
7621B70k19J08k18N9j51Q1O1R6j43J82q9n7mL8J25l95M29k75K64j52M6rmQ5j99
$$ 270 51 159 -59 0 -151 -70 -9 87 -56 126 37 -20 -24 14 139 -256 173 -102 162 10 56 47 43 128 -71
7646g1L93l26j57O0J67r3J26k92J05J74n41L91J95m1j37J48m1J49m18L48j48k2
$$ -71 322 -4 -161 -101 66 -27 99 -193 -88 86 -455 -64 131 90 -47 101 60 209 -209 139 -9 -31
7668c1L2Q0q2R7j26o4K37l51J84j78M0P1P9j30O9K22j86j35J50L2j0K15l15J44
$$ -31 1 81 -1 96 -30 -94 143 -208 -24 -202 -162 -91 -12 -142 -73 149 -37 -172 -22 10 0 215 -100 44
7692D4k60M61k52J97l84O2K42k94K33K2q4lo1J36j81J85J05k81J3M7J7r5m0J14
$$ 44 -216 245 -7 190 -194 -132 110 -184 49 71 -13 -16 -77 59 -122 63 168 -113 -100 -53 -36 -131 -171 -57
7716e7m9K48k02J60j71K83j33Pl7m5Q3l7j53J96q6k48J43K22j13l43L62M6K23
$$ -57 -106 142 -60 100 -71 212 79 86 49 4 87 50 -103 93 7 -241 -98 124 11 -332 30 76 299
7739B99n49J13j2J80k05J00J41k1o9o5L06j13j45j32L45j51M4J71l5l6P7j64m7
$$ 299 -250 -137 -149 31 -174 -74 67 46 -23 -88 218 105 -40 -172 173 22 66 237 202 166 243 79 32
7762C2k35N6O7L8J78p6j36J17oN3j54J21M6km4j36Q1j40J09J46j36J73L2j17J71
$$ 32 -203 -147 -80 -42 136 60 -76 41 35 88 -66 55 101 99 55 -81 0 -140 -31 115 -21 152 184 67 238
7787B38k46J56j17J01P4j64m16M33O2j13L3M3m4J63k83j54K86Rj59k8P8L48m35
$$ 238 -8 148 31 132 206 42 -374 59 121 8 41 84 40 203 -80 -234 52 61 -98 -126 -48 300 -135
7810a35J76L9J06l5l76J43M9J38m4j26n3M12r7j20J54m5k09k1q1J91q0kK79p0
$$ -135 41 80 186 151 -225 -82 -33 105 61 -65 -118 294 197 77 231 186 -23 -44 -125 66 -14 -16 263 193
7834A93P5m97L83l22J75J14j10K0j13RR5J1N1j61K21M5j68J70j45p1M9l3k15K86
$$ 193 268 -229 154 -168 7 121 11 31 -82 -73 22 33 84 -77 144 189 21 191 46 -25 24 -9 -224 62
7858F2j19J50j53K1oJ11k14J66l7j84L11J14j84o4J89k47J26J32l25L06qk43J6
$$ 62 -57 93 -60 -39 -45 66 -148 18 -19 -203 108 222 38 -26 163 -84 42 174 -151 155 147 -96 -80
7881h0J60k26J66l3J86j08o6p9l7J56j74K46j18O6j64P3K7O2k93N06k82q6J7p8
$$ -80 80 -146 20 -13 173 65 -1 -80 -117 39 -135 111 -7 59 -105 -32 -5 57 -236 270 -12 -98 -81 -159
7905a59J03l6K18j62q4J65Pk72L57j24k51L12k31K00M3n5n8K96l65p6J06J70m6
$$ -159 -56 -92 126 -36 -120 45 52 -220 137 13 -238 74 -157 43 86 31 -27 269 -96 -172 -66 104 58
7928E8l38K43J54j92R2j76J9K8K19k20Q8j91QJ65J67l26M48k16L53l84P1P3k4
$$ 58 -280 -37 117 -75 17 -159 -140 -112 107 -113 -25 -216 -208 -43 124 -202 246 30 383 -1 70 143 119
7951A19r1j02J78j36M80k54J03k16Q9k07k01J46N1J44k87k8K38kK43J4k03j78
$$ 119 28 -74 104 -32 448 194 297 81 170 -37 -238 -92 -41 103 -184 -212 26 24 267 281 78 -100
7973a00K74k82n1j44K72q0R2L6j90J81o5J43K17l61m4%J43J06j29l9l7J95l11
$$ -100 174 -108 -159 -303 -31 -111 -19 17 -173 8 -57 86 303 -58 -102 -102 41 147 18 -21 -58 137 -174
7996a74K06j2j2Q0K3l59L51j70R8KJ19k80K7L14j41j81J13l4lj05K02j83K24K7
$$ -174 32 20 8 88 111 -248 103 -67 31 33 152 -128 -101 213 72 -109 4 -30 -33 -138 64 -119 105 132
8020A32j82Q5j05K87j17j78J61k49L57j94m3j13L52j92qk6K05j25j14L37n23P5
$$ 132 -50 35 -70 217 100 -78 83 -166 191 -3 -46 -159 193 1 -7 -33 172 47 -67 270 -253 -178
8042a78oJ06O4j3Q2r5J17o3J72m5M4l16KL03j28J11l42K18j07Nn1j21J44J81j27
$$ -178 -184 -78 -14 -27 55 -40 77 14 186 141 185 -131 -129 174 46 157 -185 33 -74 -69 -120 -241 -97 84 -43
8067d3%l6Q0Q0l98K73Q5L39m74j52J10K71k8l04J20M41l66O7j98K56j00M0L1j83
$$ -43 -43 -79 1 81 -317 -44 41 380 -94 -246 -136 135 107 -197 -77 364 -2 65 -133 123 23 63 94 -89
8091h9J23L30l08k5J65k78K15k71J09L1J00k0j67J33j20k4m6L19j26O7j0P0j23
$$ -89 34 364 56 31 196 -82 133 -138 -29 2 102 82 -85 48 -72 -96 -142 177 51 118 108 178 55
8114E5J5k38L08N4k58j3J46k85R2K08j20J75k38K5O0J81N7l42K60q9J15l15J28
$$ 55 70 -168 140 194 -64 -77 69 -216 -124 84 -36 139 -99 -74 -14 167 224 -118 142 53 168 -147 -19
8137a9J69j26P3M1j72M5j80O2K56j92k5L07l71J31j98M02l00N2N0M5M3m9P5O3
$$ -19 150 24 97 138 -34 11 -169 -107 149 -43 -68 239 -132 -1 -199 203 -97 -45 5 50 93 44 119 182
8161A82n3M9m2j7nj98M7J14L4j67O7J55k08R5J98j76M3r1r2J32j62J41P7j92M4
$$ 182 129 178 136 119 114 -84 -37 77 111 -56 11 166 -42 53 251 75 118 27 -65 67 -95 46 123 -69 -25
8186b5j32J12NJ99j68
$$ -25 -157 -45 -40 159 -9
8191i
$$ Imaginary data points
##PAGE= N=2
##DATA TABLE= (X++(I..I)), XYDATA
0@%%%%%%%qJ6j6J6k4L2m0N6p2Q8j04J28j60J92k24K64l14L71m34N06n89O80p81
$$ 0 0 0 0 0 0 0 0 -8 8 -8 8 -16 16 -24 32 -40 48 -56 72 -88 104 -120 144 -170 201 -233 273 -316 364 -417
30d17Q96j024J166j323J494j685J897k129K382k660K964l296L660m058M491m962
$$ -417 479 -545 621 -702 792 -893 1004 -1125 1257 -1403 1561 -1735 1925 -2133 2358 -2604
46b604N479o045O664p341Q086q910R818j0826J1952j3217J4650j6285J8174k0382
$$ -2604 2875 -3170 3494 -3847 4239 -4671 5147 -5679 6273 -6944 7706 -8579 9595 -10787
60a0787K3003k6182L0126l5170M1881n1299O5567q9980J42793m53574L21124M10236
$$ -10787 12216 -13966 16160 -19010 22871 -28428 37139 -52841 89952 -363622 -42498 367738
72C67738r05451M86783L09029p52489J21576O96853m65473j24318M31033k51753
$$ 367738 -537713 -50930 258099 -494390 -372814 324039 -141434 -265752 165281 -86472
82h6472j94794M04270j25409j63161K60306m5448j52167J80343p6885o9579J74011
$$ -86472 -281266 123004 -2405 -165566 94740 49292 -102875 77468 583 -68996 105015
93A05015r3746q8195J88232j29210p7936K56908j27983j98661K77405n0781k38965
$$ 105015 11269 -76926 111306 -17904 -95840 161068 33085 -165576 111829 61048 -177917
104a77917K80900K7161l39825K16989J46348l43435J34684K56953l16438k649
$$ -177917 102983 130144 -209681 7308 153656 -189779 -55095 201858 -114580 -117229
114a17229K84139k49713j01507L04138j26295j56381K38130p2267j83432K04557
$$ -117229 166910 -82803 -184310 119828 -6467 -162848 75282 3015 -180417 24140
124B4140K827j77861J56347L8815j79000J04310O7215j53780P6712R3087j23298
$$ 24140 26967 -150894 5453 44268 -134732 -30422 36793 -116987 -40275 52812 -70486
135g0486M2421P6517j13204L8213Q4727j05297L2637R5276j14981N150J09129
$$ -70486 -28065 48452 -64752 -26539 58188 -47109 -14472 80804 -34177 -29027 80102
146H0102j08487j4199J41026r2780p0496J34873o0935r4126J44875j9947j42892
$$ 80102 -28385 -42584 98442 5662 -64834 70039 9104 -85022 59853 39906 -102986
157a02986J11375L9502j35937P8926O9850j45051K5558J09073r6692p168J01913
$$ -102986 8389 47891 -88046 -9120 60730 -84321 -58763 50310 -46382 -53550 48363
168D8363p9640m4417J02095k8282m7185Q0330j6973o5021N6927J0155m1911M6593
$$ 48363 -31277 -75694 26401 -1881 -49066 31264 14291 -50730 6197 16352 -25559 21034
180B1034N799n0699K9848Q675l1163M0711M146n0904L1800J3527m8453L8085K8229
$$ 21034 26833 -23866 5982 14657 -16506 24205 28351 -22553 9247 22774 -25679 12406 40635
193D0635o3733J6052M2645n5861P567O0176n2737k2582O0483l4941l0836O9054
$$ 40635 -23098 -7046 35599 -20262 -12695 47481 -5256 -27838 32645 -2296 -33132 35922
205C5922j8406n7154N1797M764n3831M4456K1886o4114J7388L7407m5462N325
$$ 35922 17516 -39638 12159 16923 -36908 7548 29434 -34680 -17292 20115 -25347 -20022
217b0022M2214l9498j5294M2040j9033j9289L6487q161k4263K3225j199j7072
$$ -20022 22192 -17306 -32600 9440 -9593 -28882 7605 -556 -24819 -1594 -2793 -19865
229a9865K1469M968j3785Q368n342p290K0366L60j1086J2409j1051j6088K9415
$$ -19865 1604 6572 -7213 1155 -4187 -11477 8889 9249 -1837 10572 -479 -16567 12848
242A2848N025k6719J7160K418l4963K2610K8735l5905o10K5596l3415o672M4885
$$ 12848 17873 -8846 8314 10732 -24231 -1621 27114 -8791 -9401 16195 -17220 -23892 20993
255B0993j5250k7023K7103p545k7978L0487J5391l0129O216J4461k2149L659K3134
$$ 20993 5743 -21280 5823 -1722 -29700 787 16178 -13951 -7735 6726 -15423 -11764 11370
268A1370j1465q370J2847m520o907Q197J889k487K581j30q55k359j837P637K337
$$ 11370 -95 -8465 4382 -138 -7045 1152 3041 554 3135 3005 2150 -209 -2046 5591 7928
283G928r599J384M830p470N107J0244j4961q284J5904r39o822J2480q229j9194
$$ 7928 -1671 -287 4543 -2927 2180 12424 -2537 -10821 5083 4144 -2678 9802 1573 -17621
297a7621J6120J3630j3271K617M186j7602L883K1963p889j2471R908l090q332
$$ -17621 -1501 12129 -1142 1475 5661 -11941 -8058 13905 6016 -6455 3453 363 -7969
310g969J5392L485j7153K978J0718q013j435P712o669m315R109L39r970J31P460
$$ -7969 7423 10908 -6245 -3267 7451 -562 -1997 5715 -954 -5269 3840 4179 -5791 -5660 1800
325A800R6j923K32m581n583P310J1718m524j1227R70K939r67J0198N987j6479
$$ 1800 1896 -27 205 -4376 -9959 -2649 9069 4545 -6682 -5712 -2773 -3740 6458 12445 -4034
340d034n495J3907k385m578J0828l135j2299J0657N837j4758J372J3095o819l944
$$ -4034 -9529 4378 1993 -2585 8243 5108 -7191 3466 9303 -5455 -4083 9012 2193 -1751
354a751R050q116j0014J3471N170j0192K883M656q045l5P514n196l687Q723K750
$$ -1751 7299 -817 -10831 2640 7810 -2382 501 5157 -2888 -2923 4591 -605 -4292 4431 7181
369G181p494j297J430k750K805P023k741p227R16K161k973j8M221k431k778N115
$$ 7181 -313 -1610 -180 -2930 -125 6898 4157 -3070 -2154 7 -2966 -2984 1237 -1194 -3972 1143
385A143j883q110M373N841m715J252M499o315j298R096j375o517O276M375n586
$$ 1143 -740 -8850 -4477 1364 -3351 -2099 2400 -3915 -5213 3883 2508 -4009 2267 6642 1056
400A056N116M171j0129r99R943j751j912O366l752q667L797L637m432J749M315
$$ 1056 6172 10343 214 -785 9158 7407 5495 11861 8109 -558 3239 6876 2444 4193 8508
415H508o292o353K736N85l330K819K121n432l755L392k12n534K550M684m937j115
$$ 8508 2216 -4137 -1401 -816 -4146 -1327 794 -4638 -8393 -5001 -5213 -10747 -8197 -3513 -8450 -9565
431i565N880n120n615Q698K486o940L840L979p898O64Q550m801l390R259j67p114
$$ -9565 -3685 -8805 -14420 -5722 -3236 -10176 -6336 -2357 -10255 -9591 -1041 -5842 -9232 27 -140 -7254
447g254N206J763n843M817O523n824j804M594j212o84M398L77m171Q00L088j314
$$ -7254 -2048 -285 -6128 -1311 5212 -612 -2416 2178 966 282 4680 5057 886 1686 4774 3460
463C460r22J662n93k569P41J857j982k151J748j479m695J927K034m561N3K050
$$ 3460 2538 4200 3607 1038 1779 3636 1654 -497 1251 -228 -4923 -2996 -962 -5523 -5470 -3420
479c420n517j409N325j776m025L207J6m789M119L301m719J224M976l620o30O393
$$ -3420 -8937 -10346 -5021 -6797 -10822 -7615 -7599 -12388 -8269 -4968 -9687 -8463 -3487 -7107 -7737 -1344
495a344p89k657M683L49m567L662M977k435o79K741k622k630M908K548m584p76
$$ -1344 -2133 -4790 -107 242 -4325 -663 4314 1879 1200 3941 1319 -1311 3597 6145 1561 785
511G85J317l603m66L913p24l982k57Q42l047j81K929k228l274J998M75l316P82
$$ 785 2102 -1501 -1967 1946 1222 -2760 -3017 -2175 -5222 -5403 -2474 -4702 -7976 -5978 -5503 -8819 -8037
528h037K658k382j492L859n46l915K742K992l475J171L956l715j035O797l91l950
$$ -8037 -5379 -7761 -9253 -5394 -5940 -9855 -7113 -4121 -7596 -6425 -2469 -6184 -7219 -422 -813 -4763
544d763L734Q52m280M940N174n374j058M093k053r6N354k328l397K950O4j190
$$ -4763 -1029 -177 -4457 483 5657 283 -775 3318 1265 1169 6523 4195 798 3748 3812 2622
560B622K062j766j894K352l53j151M22k707j332K907j200k359K712l024l402M866
$$ 2622 4684 2918 1024 3376 3023 1872 2294 -413 -1745 1162 -38 -2397 315 -2709 -6111 -1245
576a245r03n401N119N68p151M821K960q463M062O720q318K20Q022o494j810J0382
$$ -1245 -2148 -7549 -2430 -1862 -9013 -4192 -1232 -9695 -5633 1087 -7231 -7011 1011 -5483 -7293 3089
592C089m237n962Q976r50o211Q659J248p986N478L168p349M403M500o666J806
$$ 3089 -1148 -7110 1866 916 -5295 3364 4612 -3374 2104 5272 -2077 2326 6826 160 1966
607A966M349o440Q62M876l948oL127n850r61M993l124j114M276n649k614O864
$$ 1966 6315 -125 737 5613 1665 1659 4786 -1064 -2025 2968 -156 -1270 3006 -2643 -5257 1607
623A607k980l746O047k481m935P700o14p376N911K739o406N372L316q280K342
$$ 1607 -1373 -5119 928 -1553 -6488 1212 598 -6778 -867 1872 -4534 838 4154 -4126 -1784
638a784O800n216L47N298n097j248P594l508l380N055k238k047N489k254m544
$$ -1784 5016 -200 147 5445 348 -900 6694 3186 -194 4861 2623 576 6065 3811 -733
653g33M140l64k348L205j378m478M063Q86l727K213j88n099M047K850n473J134
$$ -733 3407 3043 695 3900 2522 -1956 2107 2993 -734 1479 1291 -3808 239 3089 -2384 -1250
669a250K070n897K114N672n693r89M345m821j401P000k971l828N379j448l988
$$ -1250 820 -5077 -2963 2709 -2984 -3973 372 -4449 -5850 1150 -1821 -5649 -270 -1718 -5706
684e706N645J052n292L678K666m871K602L446m081J469M007l182j0K764j862N9
$$ -5706 -61 991 -4301 -623 2043 -2828 -226 3220 -861 608 4615 1433 1423 4187 2325 2384
700B384K937j961j102J806k002N85K132k769j511K396k232r46L507l462l043M172
$$ 2384 5321 3360 2258 4064 2062 2647 4779 2010 499 2895 663 -283 3224 -238 -3281 891
716H91p48l604L718n64n016L984K265m893J982L111m687R94M247l268j033M326
$$ 891 143 -3461 257 -307 -5323 -1339 926 -3967 -1985 1126 -3561 -2567 1680 -1588 -2621 1705
732A705j553k604L731p63k583L515R6l104J962L34j622J594K30k048J172J76j120
$$ 1705 152 -2452 1279 516 -2067 1448 1544 -1560 402 736 -886 708 938 -1110 62 238 -882
749h82J619p3k076J978N66k080J711J567l053R23K809l388M65L707l427j329L712
$$ -882 737 664 -1412 566 1132 -948 763 2330 -723 200 3009 -379 86 3793 366 -963 2749
766B749k027k282M145q97m032K647J071l800K149K268m105r8K854k375n58L501
$$ 2749 722 -1560 2585 1688 -2344 303 1374 -2426 -277 1991 -2114 -2212 642 -1733 -2291 1210
782A210j819j676J811j86j581K641K88j189K65P2m44J336j92k97O12o90k56J333
$$ 1210 -609 -2285 -474 -660 -2241 400 688 -501 -236 -164 -608 728 536 239 851 161 -95 1238
800A238m07j516J700o5j927J975P9l029J684J778l006O93K511k550o48K945j700
$$ 1238 831 -685 1015 950 -977 998 1077 -1952 -268 1510 -1496 -803 1708 -842 -1490 1455 -245
817b45j999L696K73k696K144O56l122J752J989k403P21J266k195jJ511q38j93
$$ -245 -2244 1452 1725 -971 1173 1829 -1293 459 2448 45 766 2032 -163 -164 1347 509 316
834C16O45l70j070O93m65l74M0j87O5O11r37k21M82r54J92K059j039q72J120p05
$$ 316 961 591 -479 214 -251 -625 -585 -772 -707 -96 -1033 -1254 -772 -1726 -1534 525 -514 -1386 -266 -971
854i71o19K723j83k062J636R58j749J247J475k574K85K638j337j055J582j432
$$ -971 -1590 1133 950 -1112 524 1482 -267 980 2455 -119 166 2804 1467 412 1994 562
870E62r42K153kk051N18N73j410P13O20j630k96J063j0l37l05m54k47R40N92l18
$$ 562 -380 1773 1771 -280 238 811 -599 114 734 -896 -1192 -129 -139 -476 -781 -1235 -1482 -542 50 -268
890b68o25n45M73J125l83J70J51j756R66J557j447o10J054m04p16J831o15k048
$$ -268 -893 -1438 -965 160 -223 -53 98 -1658 -692 865 -582 -1192 -138 -542 -1258 573 -42 -2090
908b090J444R57j225K09J150j581k07K239o69r65J734l86p28J639O9j324N40P97
$$ -2090 -646 311 -914 -705 445 -1136 -1343 896 227 -738 996 610 -118 1521 1590 266 806 1603
926A603m54N03L56q57p18O40K6n33L3j016j23N12o95p9J76j389L96O50q92l6P22
$$ 1603 1149 1652 2008 1151 433 1073 1099 566 599 -417 -540 -28 -723 -802 -626 -2015 -1619 -969 -1861 -1897 -1175
947a175r10k92J964p43k64J370J85j318J828J95j483J099J252j806R50J244j926
$$ -1175 -2085 -2377 -413 -1156 -1420 -50 135 -1183 645 840 -643 456 1708 -98 852 2096 170
964A70p1J583j189q09J297q30q20J289p16r93O85K48o63M96J52j435J303L33q22
$$ 170 99 1682 493 -316 981 151 -669 620 -96 -1089 -404 -156 -819 -323 -171 -1606 -303 30 -792
983g92Q98N9r56J095N04r55J030L07j589Q38J051j714M14R68j261l31J574j634
$$ -792 106 165 -791 304 808 -147 883 1190 -399 439 1490 -224 190 1158 -103 -434 1140 -494
1001d94n35J775q15j524J735m66j278J980K87j653J242M87j133J272P45j495O67
$$ -494 -1029 746 -69 -1593 142 -324 -1602 378 665 -988 254 741 -392 880 1625 130 797
1018G97J144q38L06P93j062j86J024r59j99J306j588p59J106q88p77J111q96j039
$$ 797 1941 1103 1409 2202 1140 954 1978 1019 820 2126 538 -221 885 -3 -780 331 -565 -1604
1036a604J266p98j183J235K19j576J470L73j644J449J006j214P71J402j645R6
$$ -1604 -338 -1136 -2319 -1084 -865 -2441 -971 -598 -2242 -793 213 -1001 -230 1172 -473 -377
1052c77J877r08n8J632r35r09J445k41j129J326j39j266Q23N96j291L58L30j044
$$ -377 1500 592 534 2166 1231 322 1767 1526 397 1723 1584 318 1141 1737 446 804 1134 90
1070I0M63O65j447L60N44j127P09O59j522L16J100m87p48J190q92l69J491o54
$$ 90 553 1218 -229 131 675 -452 257 916 -606 -290 810 323 -425 765 -127 -496 995 341
1088C41j390J580l96j714J631N97k056O82P67j726R61J261j865J53J734j407K17
$$ 341 -1049 531 135 -1579 52 649 -1407 -725 42 -1684 -723 538 -1327 -1174 560 -847 -630
1105f30J381p94o22J364J59q16J434K3j295J562L20j271R12K57j351J286L65j720
$$ -630 751 -43 -665 699 858 42 1476 1499 204 1766 2086 815 1727 1984 633 1919 2284 564
1123E64L11L18j138L64O71j734Q9R13j381k27J227j475n57J603m95j411K020o07
$$ 564 875 1193 55 419 1090 -644 -555 358 -1023 -1250 -23 -1498 -2055 -452 -947 -2358 -338 -945
1141i45j522K075N13j678J463O59j539R59J271j497K05J609j290j96J349j321
$$ -945 -2467 -392 121 -1557 -94 565 -974 -15 1256 -241 -36 1573 283 87 1436 115
1157A15n93J896q47q51J323q41j121J551Q4j137R28k80q16P77M3o25O44J44j023
$$ 115 -478 1418 571 -280 1043 202 -919 632 716 -421 507 227 -589 188 231 -394 250 394 -629
1176f29Q04N13j126K84J097j283J48J173j179q2J163j348l74J367p61o63Q77k44
$$ -629 175 688 -438 -154 943 -340 -192 981 -198 -280 883 -465 -839 528 -233 -896 -19 -263
1194b63j505J065L53j167R78M64j354M19J082j059M57J059r92n1J233q91J48J148
$$ -263 -1768 -703 -350 -1517 -539 -75 -1429 -1010 72 -987 -530 529 -463 -514 719 -172 -24 1124
1212A124j48l23O66m93o74R64M7o79q0M54p63M05K30p88K58k1j042O97K87r40
$$ 1124 976 653 1319 826 152 1116 1163 484 404 858 95 500 730 -58 200 179 -863 -166 121 -819
1232h19O50K49j236N06Q94r70M1J250p82m05J214l51n86J050Qj357R55P57j296
$$ -819 -169 80 -1156 -650 244 -726 -685 565 -217 -622 592 241 -345 705 713 -644 311 1068 -228
1251b28O02N75j056q5J023r77NN61n38m09N71P0o00M95l5n04J69J31m28R40l16
$$ -228 374 949 -107 -192 831 -146 -141 420 -118 -527 44 114 -486 9 -26 -530 -361 -230 -658 282 -34
1272c4J2N50n44K42M11kn77O88q2n87O38K01q14L21L65j041L25O82j250M73N14
$$ -34 -22 528 -16 226 637 635 58 746 664 77 715 916 102 423 788 -253 72 754 -496 -23 491
1293D91o80p72J265n92n03Q42j24o88L77L79l11k1P41o03j61M87K8o7L46J2m99
$$ 491 -189 -961 304 -288 -791 51 -73 -761 -384 -5 -316 -337 404 -199 -360 127 155 88 434 446 -53
1314e3O82j57l30L45k06O3O4k29PM79q15L3L20l14l72N86l31l07P48k85q05R61
$$ -53 629 472 142 487 281 344 408 179 186 665 -150 -117 203 -111 -483 103 -228 -535 213 -72 -877 84
1336H4L14n29R6P07r99L72P96r67l20J185n92m50R51l66o08M21K4j073N66K64
$$ 84 398 -131 -35 672 -327 45 841 -126 -446 739 147 -303 648 282 -326 95 119 -954 -388 -124
1356a24n94j4L93o22L06K14m71L65J82j60K08J01j46J32K94q9J50N56o47J37R23
$$ -124 -718 -732 -339 -961 -655 -441 -912 -547 -365 -525 -317 -216 -362 -230 64 -25 125 681 34 171 1094
1377A094m49n56J138o91m19Q53k64r87J045l74q99Q72j55p29K76L55r15l40J060
$$ 1094 645 89 1227 536 117 970 706 -281 764 390 -509 363 208 -521 -245 110 -805 -1145 -85
1396h5r72M7O22L7o34N32O2n06Q40O7n08M07o9PJ46J34k56J90J6MK65k39j40o9
$$ -85 -1057 -1010 -388 -351 -985 -453 -391 -897 -57 10 -498 -91 -160 -153 -7 127 -129 61 77 81 346 107 -33 -102
1420a02N05l61n8l4j59M0N57n96k0Q65n97m87J051k74q21J179q4o42P25m0n02
$$ -102 403 42 -16 -50 -209 -169 388 -208 -228 637 40 -447 604 330 -491 688 604 -38 687 647 145
1441A45j57N76m54J09L96o29j34O59p22k36M86n13l4K40Pm87J09o0j30K14j8j16
$$ 145 -12 564 110 219 615 -14 -148 511 -211 -447 39 -474 -508 -268 -261 -748 -639 -699 -829 -615 -633 -749
1463g49M76r6Q2M24J53o79O09K64n36N17N85n49K03N17o22l3P46m57o15P20j83
$$ -749 -273 -369 -287 137 290 -389 220 484 -52 465 1050 501 704 1221 599 566 1312 855 240 960 777
1484G77p22Q05j95o34L94j08o24J74L95p41J30L17o29J55N27l18j86Q26l73n51
$$ 777 55 860 665 31 425 317 -307 -133 262 -479 -349 -32 -661 -506 21 -297 -483 343 -30 -581
1504e81O66l38K6M75n31j3Q19m95m24M98k92m16Q14k28l98O39N3r45M91L25o85
$$ -581 85 -253 -227 248 -283 -296 523 28 -396 102 -190 -606 208 -20 -418 221 274 -671 -180 145 -540
1525e40R45N69q79o8Q26p27j64J085m63n13P93k02l85N44j38n39O13m2r27O25
$$ -540 405 974 95 27 853 126 -38 1047 584 71 864 662 277 821 683 144 757 715 -212 413
1545D13K14o04R3N7q23M85N7p15J27M02o25J10N09p34J51O84o24O2O01l25j13
$$ 413 627 23 116 173 -650 -165 -108 -823 -696 -294 -919 -809 -300 -1034 -883 -199 -823 -761 -160 -485 -598
1566e98J167n50m02J299l71o83J018j64p96R07K40j045M90N94j013P6O26q82R7
$$ -598 569 19 -383 916 545 -138 880 716 -80 827 1067 22 512 1106 93 169 795 -87 10
1585A0M42n07k97Q25p39j62N31l08k66L73j91j63L60P3j51L5J13k58L58%l89N71
$$ 10 452 -55 -352 473 -266 -428 103 -205 -471 -98 -289 -452 -92 -19 -170 -135 -22 -280 78 78 -311 260
1607B60P0r84O69L02r97K76N94j181N76L61o73r8N57k11n51Q55J19r92J127j39
$$ 260 330 -654 15 317 -680 -404 190 -991 -415 -54 -727 -825 -268 -479 -1030 -175 -56 -1048 79 -60
1627f0p59R19L68q34P81M49p50J24P84r63P7O29n63R2Q1r6l11M38o53K11nk15
$$ -60 -819 100 468 -366 415 864 114 238 1022 59 136 765 202 294 375 279 -32 406 -247 -36 -41 -256
1649b56k60K40o1k97N67k68m93O62j29o28Q51J11l20L57K17n98K57M71k96PO08
$$ -256 -516 -276 -337 -634 -67 -335 -828 -166 -295 -923 -72 39 -281 76 293 -305 -48 423 127 134 742
1670G42r66J73Q41m90m85O91j62o52P46l20o47L85L92r48N39L13o56J06O25o58
$$ 742 -224 -51 790 300 -185 506 344 -308 438 118 -529 -144 248 -700 -161 152 -504 -398 227 -431
1690d31P7L05k74j11Q03o46M32L03m38J3L61k65k4M68m58k22O02k94p12P09l11
$$ -431 -354 -49 -323 -434 369 -277 155 458 20 33 394 129 105 573 115 -107 495 201 -511 198 -113
1711a13m02L95M26p42J11N20r90L65N91l61j65P64o49j81R18j04o11P87j20l82
$$ -113 -515 -120 306 -436 -325 195 -795 -430 161 -200 -365 399 -250 -431 487 383 -228 559 439 57
1731E7O36j27n88O45J7o07J46K66m52L16K36o59J26J44m04q9L92n57K79M74l86
$$ 57 693 566 -22 623 640 33 179 445 -7 309 545 -114 12 156 -248 -337 55 -502 -223 251 -135
1752a35j55L09l21k35N83K2o28P63J12m26K79L37p90L50M10n22K98K96o76O6M38
$$ -135 -290 19 -302 -537 46 68 -560 203 315 -111 168 505 -285 65 475 -47 251 547 -129 -63 375
1773C75m08k38M17j15m04N50l72l93O56j44m04O73k66l91N99q9l75K45K03j74
$$ 375 -33 -271 146 31 -373 177 -195 -588 68 -76 -480 193 -73 -464 135 46 -329 -84 119 -55
1793e5K61J54m59L00N67p50J51L44q73J54O42l90o0L15l43l41P30o32l53O31j36
$$ -55 206 360 -99 201 768 18 169 513 -360 -206 436 46 -14 301 -42 -383 347 -285 -638 -7 -143
1814a43m31M26j67l93L50L26m97K2Q55o21M8N04l45k2K74j5j27N02l97j43N18
$$ -143 -574 -148 -315 -708 -358 -32 -529 -507 348 -273 -225 279 -66 -88 186 171 44 546 149 6 524
1835E24l45K6M12m58k97L01j10j72L97j5o28L36K63n61j4M95n17K25K82m17nM57
$$ 524 179 205 617 159 -138 163 53 -119 278 263 -365 -29 234 -327 -341 154 -363 -138 144 -273 -278 179
1857A79o66L8O52k38k53Q62j31o06N41q6p17M37L68o52M6L74n81O6K83l93K61
$$ 179 -487 -449 203 -35 -288 574 443 -163 378 292 -425 12 380 -272 -226 148 -433 -367 -84 -477 -216
1878b16J74m67K71M08n47N3O50m21KO04j54j95M32k89k62N90J49l97K60J22n79
$$ -216 -42 -509 -238 170 -377 -324 326 -95 -93 511 357 162 594 305 43 633 782 385 645 767 188
1899A88L83J54j026L07M24o76L99M91j245N25J22l04k95N94m84j17N74l58o0N42
$$ 188 571 725 -301 6 430 -246 153 644 -601 -76 46 -258 -553 41 -443 -560 14 -344 -404 138
1919A38j85k96M53ol01L49K43l54K34P9k57L48K45p15L2M55m08j50N13k58k06
$$ 138 -47 -343 110 104 -197 152 395 41 275 354 97 445 690 -25 7 462 54 -96 417 159 -47
1940d7O05l36k95O31m97m32R64k47o22P55l6p65M39M51l16j42K64k86J3N17n91
$$ -47 558 222 -73 558 61 -371 593 346 -276 479 443 -322 117 568 252 110 374 88 101 618 27
1961B7J00L51m16k20O46o88O7J67k0l57M46l65k81M41l46J06J22K02l48M37j22
$$ 27 127 478 62 -158 488 -200 -133 34 14 -343 103 -262 -543 -102 -448 -342 -220 -18 -366 71 -51
1982e1m42P97m4l83J46N36n35P5O54n58j50P99l56k72N31n90k98P82r5m68L0J24
$$ -51 -493 304 260 -123 23 559 24 99 753 195 45 844 488 216 747 157 -141 641 546 78 108 232
2004B32o61L94k7k10J76K70n94L32P1k72o4J88n8K4R9j6N0K16N2m68O24k88l04
$$ 232 -429 -35 -62 -272 -96 174 -420 -88 -17 -289 -353 -165 -223 -199 -100 -116 -66 150 202 -266 358 70 -234
2027b34O10k7n60L30J75m69M95L2m78O4J44m07K23K28k75J2M62k73k23L75j47
$$ -234 376 349 -211 119 294 -175 320 352 -126 -62 82 -325 -102 126 -149 -137 325 52 -171 204 57
2048E7j63M19k1l94L74K39m76J3K22m26J69K80m79Q1J85l40N8M68p29J50N45m71
$$ 57 -106 313 292 -102 272 511 35 48 270 -156 13 293 -186 -105 80 -260 -202 266 -463 -313 232 -239
2070b39l3m7k79QM64r8j57K99k17R4M45k79j45M64q8j28P6M46n76K79K25l22J20
$$ -239 -272 -319 -598 -590 -126 -224 -381 -82 -299 -205 240 -39 -184 280 192 64 140 586 10 289 514 192 312
2093C12K98o52J0M91m64j43L57l76k52N93m25j27L01j74j23J52J71l49J24M51
$$ 312 610 -42 -32 459 -5 -148 209 -167 -419 174 -251 -378 -77 -251 -374 -222 -51 -400 -276 175
2113A75k47k38N48n48K38M73l21k50O94m34j43M34l20j42K06J45o05M07kn7l4
$$ 175 -72 -310 238 -310 -72 401 80 -170 524 90 -53 381 61 -81 125 270 -335 72 70 13 -21
2134b1j83j48M53j24l54L64K6o5M4J45m18L21L92l29j36L53m19J54M68j12m93
$$ -21 -204 -352 101 -23 -377 -13 13 -52 -8 137 -281 40 432 103 -33 320 -99 55 523 411 -82
2155h2N38j36k08r0J53l77M67k52n57L98K27m07LN76p47K27K19m04P8M89l40k7
$$ -82 456 320 112 22 175 -202 265 13 -544 -146 81 -326 -323 253 -494 -267 -48 -452 -374 115 -225 -252
2177b52J90J50l45O19o3k44M69j85n33Q6N84o13M44j97k60M53j9q3r1J10m64p6
$$ -252 -62 88 -257 362 299 55 524 339 -194 -108 476 -137 307 110 -150 303 284 201 110 220 -244 -320
2199c20M35k75O9l6O0l10P29n65j84O09J00o26O19m64O8L01R5l45M01k24k54M30
$$ -320 115 -160 -91 -127 -67 -377 352 -213 -397 212 312 -314 305 -159 -91 210 305 -40 361 137 -117 313
2221C13k13q7j40K21k82L69K0j93k58L99m91L02K15m52j19M36j56k0J67J17m61
$$ 313 100 13 -127 94 -188 181 201 8 -250 149 -342 -40 175 -277 -396 40 -116 -136 31 148 -313
2242c13M75k88L72j87P4m19O10l0m98M80K63n37j44P41q12R6K51j43j53L96m29
$$ -313 162 -126 246 59 133 -286 324 294 -204 276 539 2 -142 599 -213 -117 134 -9 -162 234 -195
2263a95m4L37j39m35L43r8m87M80M63m82J27J95j79j90J71k08L59K1k57K89J47
$$ -195 -239 98 -41 -476 -133 -231 -718 -238 225 -257 -130 65 -114 -304 -133 -341 18 39 -218 71 218
2284B18j81k25M14r7J11j35m9j10J98k77k70K54p5k5j6k6l3L34n4l44O24R5o15
$$ 218 37 -188 226 129 240 105 56 -54 144 -133 -403 -149 -224 -249 -265 -291 -324 10 -44 -388 236 331 -284
2307b84J4N13p5k02L24o9k86M10l40OL10k92l22L52K06k8p1j3m10L00L35p00K60
$$ -284 -270 243 168 -34 290 221 -65 345 5 11 321 29 -293 59 265 237 166 153 -257 43 378 -322 -62
2330f2l05k3J19jj8K86N9k89J66l0n5K01P8J7O7J68k73k62N23k26m7L55m00j4
$$ -62 -367 -390 -271 -272 -290 -4 55 -234 -68 -98 -153 48 126 143 210 378 105 -157 366 140 93 448 48 34
2354C4L41l56J76j23K82m62o7J64l54L31J82q2j60J64N9m27L65k58Q2L04j49j35
$$ 34 375 19 195 72 354 -108 -175 -11 -365 -34 148 66 -94 70 129 -298 67 -191 -109 195 46 -89
2376h9J47J25j14j02M02l11J34P9k75K58l89J29K3j78N1K8P6J05m01M57k65L1
$$ -89 58 183 69 -33 369 58 192 271 -4 254 -135 -6 17 -161 -110 -82 -6 99 -302 155 -110 -79
2398g9O9j14k51J80J14K03L4m5j63L92K27p69L99j67P5J53J08k59l0K42j63k28
$$ -79 -10 -124 -375 -195 -81 122 156 111 -52 340 567 -202 197 30 105 258 366 107 77 319 156 -72
2420g2J11j59j90L9J18q1J22q1p6r0M94n56L33J2o4K08r5j07K42l2m2k16L90o1
$$ -72 39 -120 -310 -271 -153 -234 -112 -193 -269 -359 135 -421 -88 -76 -140 68 -27 -134 108 76 34 -182 208 147
2444A47k65J10Q8L0o7kn5J41L3k39M2K27l11K53P2l34R3J86n20L22M9k17J60K18
$$ 147 -118 -8 80 110 43 41 -14 127 160 -79 -37 190 -121 132 204 -130 -37 149 -371 -49 0 -217 -57 161
2468A61l31J32J04p1J9J61k01J22L14l96K3Q2J32l72K39m4k38J49L6l62R9J08
$$ 161 -170 -38 66 -5 14 175 -26 96 410 14 37 119 251 -121 118 74 -164 -15 21 -341 -242 -134
2490a34J04Jl4k68j7K22l9k59P13k60k63L78J18l51J2K63m69O33l13k8jJ79N1
$$ -134 -30 -29 -63 -331 -348 -126 -165 -424 289 29 -234 144 262 -89 -77 186 -283 350 37 9 8 187 238
2513B38K3Q4m28o1K66k66n1K03k07R6J6J94l35J30k05L7J54j47r7M41j00n0j35
$$ 238 261 345 -83 -144 122 -144 -195 8 -199 -103 -87 107 -228 -98 -303 -266 -112 -259 -356 85 -15 -65 -200
2536b00K38m0K26j04O0N4j03j87K34J65l28L9J20k2o5k95K7O0M4J85k48j40K70
$$ -200 38 -2 224 120 180 234 131 -56 178 343 15 54 174 152 87 -208 -181 -121 -77 108 -140 -280 -10
2559a0j94J52m32K49J34K26k29J51k05J04J14J10M6j29l7O5j43L4J16p7J82k15
$$ -10 -204 -52 -484 -235 -101 125 -104 47 -158 -54 60 170 216 87 50 115 -28 6 122 45 227 12
2581A2Lj38K14l83L11k58K23j22K21k30j4nm1J10K00k0P9Nj41K2Q9NM4J63k85
$$ 12 15 -123 91 -292 19 -239 -16 -138 83 -147 -161 -166 -207 -97 103 83 162 167 26 48 137 142 186 349 64
2606F4K81m18K34m3M9j75L04q6k34j98K93j24lM5p8LJ35l94L34j35J72m5j44K72
$$ 64 345 -73 161 118 167 -8 296 210 -24 -222 71 -53 -56 -11 -89 -86 49 -345 -11 -146 26 -19 -163 109
2630A09k15J20n7J23j7Q6p7l2K38r2MO5p8j76Q1j93R6j28K03j15j87L29j01k11
$$ 109 -106 14 -43 80 63 149 72 40 278 186 190 255 177 1 82 -111 -15 -143 60 -55 -242 87 -14 -225
2654b25l9j0J73m8R1J46j81K3J34k23J31j49O5K84J2j26Q2r1Lr6J60j52K11m35
$$ -225 -264 -274 -101 -149 -58 88 -93 -70 64 -159 -28 -177 -112 172 184 58 140 49 52 -44 116 -36 175 -260
2678b60L26Ok57L31r3k18n6J93j66K2Q7k13J64j5L4J70j04O7k66L66P4l28J06
$$ -260 66 72 -185 146 53 -165 -221 -28 -194 -172 -85 -298 -134 -149 -115 55 -49 18 -248 118 192 -136 -30
2701c0M33o92L93K64n00J48j5r0o6L58N1l08o6q8O2R4J04j49Q8N2p1j35n5J61
$$ -30 403 -289 104 368 -132 16 1 -89 -155 203 254 -54 -120 -208 -146 -52 52 -97 -9 43 -28 -163 -218 -57
2725e7J4J65l79J08J27j32K52M2Mo8j41k1J78J04j60J05j29O1n8OR0j12q8jj07
$$ -57 -43 122 -257 -149 -22 -154 98 140 144 76 -65 -86 92 196 36 141 12 73 15 21 111 -1 -89 -90 -197
2750a97k9M37k57L2k02p3J01j1N3J71Q9l49K00M7P5k13L0L01j86K64k75j6L5k33
$$ -197 -226 211 -46 -14 -216 -289 -188 -199 -146 25 114 -235 -35 12 87 -126 -96 205 19 283 8 -8 27 -206
2774b06L83n5N3k90r9p2J46O2J00j40O7j78LN8L74n3r2P5j75Q7J40l91J75PJ69
$$ -206 177 122 175 -115 -214 -286 -140 -78 22 -118 -51 -229 -226 -168 206 153 61 136 -39 48 188 -203 -28 -21 148
2799A48j48q1K29j58O6k81K76p2j99lJ46R7j32M01m92J25K99l59r1q1L96j54J08
$$ 148 0 -81 148 -10 56 -225 51 -21 -220 -223 -77 20 -112 289 -203 -78 221 -138 -229 -310 86 -68 40
2822D0O7j64k09R2J16O0M71k86o0J50k77k69K64M00m08k01K83k1O2j00N8o4j75
$$ 40 107 -57 -266 -174 -58 2 473 187 127 277 0 -269 -5 395 -13 -214 69 48 110 10 68 4 -171
2845a71J51m2L21l18k30L46l28J0L49q5k85L38P2j42K72R3k20j06lq6KK51p3J38
$$ -171 -20 -62 259 -59 -289 57 -271 -261 88 3 -282 56 128 -14 258 351 131 25 22 -64 -62 189 116 254
2869B54K5l19R7q8j48m4K33j80l4M0p3L5K52p2j58K62j03j64J4J79N2l20K69j29
$$ 254 279 -40 57 -31 -179 -223 10 -170 -204 -164 -237 -202 50 -22 -180 82 -21 -185 -171 8 60 -260 9 -120
2893a20L5o2J71J17L9j40J46l7k74J02K46j20j39L34l14J2j56n9L24j09K1J69
$$ -120 -85 -147 24 141 180 40 186 149 -125 -23 223 103 -36 298 -16 -4 -160 -219 105 -4 17 186
2915A86l98L45q8j97J17j3%J27j76K08L11m04k77L92p3l1l5K08l33N8J80K0q8
$$ 186 -212 133 45 -152 -35 -48 -48 79 -97 111 422 18 -259 133 60 29 -6 202 -131 -73 107 127 39
2938C9m5r3q0O7l29R6L56j23K78q5l63J76K04j63l6J21k86K22J53n6J09j89J50
$$ 39 -6 -99 -179 -112 -441 -345 11 -112 166 81 -282 -106 98 -65 -101 20 -266 -44 109 53 162 -27 123
2961A23J37m5j72l9J09MJ23k00R3o4J52Mj79j40lJ77n69M74l2j71J88J40k55l3
$$ 123 260 215 43 4 113 117 240 40 133 69 221 225 46 -94 -97 80 -489 -15 -47 -218 -30 110 -145 -178
2985a78J39J9Q8l1k0L7J48k32K38j54p0KKk42K82Q1j78k2M1J39k93K63M8l22M32
$$ -178 -39 -20 68 37 17 54 202 -30 208 54 -16 -14 -12 -254 28 109 -69 -91 -50 89 -204 59 107 -215 217
3010B17k39k38L51Mm27M30n5r8p5k00K95q8J67J79O5k1k78L97k34j40J03k96R9
$$ 217 -22 -260 91 95 -332 98 43 -55 -130 -330 -35 -123 44 223 288 267 -11 386 152 12 115 -181 -82
3033h2O4QN0k18J1K16l51K33J31n2Q0m3k66J86O7j32O4M37m01k97K70m5K06J07
$$ -82 -18 -10 40 -178 -167 49 -302 -69 62 10 90 47 -219 -33 34 -98 -34 403 2 -295 -25 -70 136 243
3057B43j54J59M0k15j05K45n40K89K1K57k27K4l0j76k40L27J5M5O3j91NK42j99
$$ 243 89 248 288 73 -32 213 -327 -38 -17 240 13 37 7 -169 -409 -82 -67 -22 41 -150 -145 97 -102
3080a02o1M30o70M11K03l15j00L59J06j75l96K56M1O2J45n15L03J51Pk12L11k79
$$ -102 -163 267 -403 8 211 -104 -204 155 261 86 -310 -54 -13 49 194 -321 -18 133 140 -72 239 -40
3102d0J29Q5j18j82K57k93l44L07PJ88J99j63j75K5J83J05k92M31l67M1R8k4L24
$$ -40 89 174 56 -126 131 -162 -506 -199 -192 -4 195 32 -143 -118 65 170 -122 309 -58 -17 81 57 381
3125C81m99Q7L8K21m1k68L3p3r7j13K1L41J8j10m0j18L6r2M00k39kK36k20J70
$$ 381 -118 -31 7 228 187 -81 -48 -121 -218 -331 -310 31 49 -61 -101 -219 -183 -275 125 -114 -116 120 -100 70
3149G0k44R5J72J46l52J48l9l33N78k96K68j77M7l3j79J1J34k80K1J96k34K98
$$ 70 -174 -79 93 239 -113 35 -4 -337 241 -55 213 36 83 50 -129 -118 16 -264 -243 -47 -281 17
3171A7jj65j19K20P9n5P4J77l64Q8L83n83K70nO8k0J35j50P2J67j25k51Q4K32
$$ 17 16 -149 -268 -48 31 -24 50 227 -137 -49 334 -249 21 16 84 64 199 49 121 288 163 -88 -4 228
3195B28m42J8P6K6J44j1k54K89O3k95N32l89j30L52k21k58J03J59K16l65M9J56
$$ 228 -214 -196 -120 -94 50 39 -215 74 137 -158 374 -15 -145 207 -14 -272 -169 -10 206 -159 -110 46
3217D6l4J28O9j95jL1jQ9j66j79J33K04l41K46r7j3R6o4l46M00q1j75K27K3k4
$$ 46 12 140 209 14 13 44 43 132 -34 -213 -80 124 -217 29 -68 -81 15 -49 -395 5 -76 -251 -24 -1 -25
3242b5J9j40K32K2k0j86J60j76k3J67k4N8J18r0P8l36K11L0P9k69j18J46K03k48
$$ -25 -6 -146 86 108 88 -98 62 -114 -137 30 6 64 182 92 170 -166 45 75 154 -115 -233 -87 116 -132
3266a32n9J98o3J77k58J6K5J77k8j98L88k19j20K78J7j95J54k0J89n0l39M2J39
$$ -132 -191 7 -56 121 -137 -121 -96 81 53 -145 243 24 -96 182 199 4 158 138 327 277 -62 -20 119
3289A19L8R3m75M20r8N5k62q5J16JJ19j34J7J82j11j51J34O0J0k00J77k09K99
$$ 119 157 250 -225 195 97 152 -110 -195 -79 -78 41 -93 -76 106 -5 -156 -22 38 48 -152 25 -184 115
3312A15k56K2J08J46r4l63K63q3J24k79P0K25J16j5Q6n3j53J21Mk5k71J95N4k35
$$ 115 -141 -119 -11 135 41 -322 -59 -142 -18 -297 -227 -2 114 99 185 132 -21 100 104 79 -192 3 57 -178
3336a78J33O0j29kJ00o7K63k2j64k1L01l88J24m0K5J76K6l11L06n3j18L5j74K59
$$ -178 -45 15 -114 -116 -16 -83 180 158 -6 -27 274 -114 10 -30 -5 171 197 -114 192 139 21 56 -118 141
3360A41k19L10k83j84L73j80J54j66k04K91J05Q5m53L58q0o0K71J12m59K06M0
$$ 141 -78 232 -51 -235 138 -42 112 -54 -258 33 138 223 -230 128 48 -12 259 371 -88 118 158
3381A58O5j23q8J70k17kL18m77P1m5pL77l49K44j64O7k21P2j57K37l9L5j2L9J0
$$ 158 223 100 12 182 -35 -37 281 -196 -125 -170 -177 200 -149 95 -69 -2 -223 -151 -308 -71 -110 -75 -87 -48 -38
3406c8K25K3k77O6J13J4j6j65q0K38j01L5R5j83L42j95j91K93q6k84j16M19k63
$$ -38 187 210 -67 -1 112 126 110 -55 -135 103 2 37 132 -51 291 96 -95 198 112 -172 -288 131 -132
3429a32J11L0k40L90k95K11l32R6J44k2K69m80K91k8P4j39K40j26k5J01J84l18
$$ -132 -21 9 -231 159 -136 75 -257 -161 -17 -39 230 -250 41 13 87 -52 188 62 37 138 322 4
3451DL3J57l71K07m9j02l0M27j37j15j25K39m05L40r0r7J38Pr6qJ48o5J72k95
$$ 4 37 194 -177 30 -19 -121 -151 276 139 24 -101 138 -267 73 -17 -114 24 31 -65 -73 75 10 182 -113
3475a13j4J53J60j48n4J95n8j45J58P4Q5k93Q8k23Q8K88k58j06N0P9N1J91k83
$$ -113 -127 26 186 38 -16 179 121 -24 134 208 293 0 88 -135 -47 241 -17 -123 -73 6 57 248 -35
3498c5q2J27k7L0K8K6j02o1K80p1n6J06j92J62j27J48p8j80O4L7J03O4j81J62
$$ -35 -117 10 -17 13 41 67 -35 -96 184 113 57 163 -29 133 6 154 76 -104 -40 -3 100 164 -17 145
3522A45j21m36M48j16j62N29l06j84M4n6L31K2l40M3M01j34j83J19j10K20j53
$$ 145 24 -412 36 -80 -242 287 -19 -203 -159 -215 116 138 -202 -159 242 108 -75 44 -66 154 1
3543AL00n01L74j30k46K80j58J88l6J87k78L21m00r5L27j5p1j38J58p6k11N6j59
$$ 1 301 -200 174 44 -202 78 -80 108 72 259 -19 302 -98 -193 134 119 48 -90 68 -8 -219 -163 -322
3566c22J18K50j10r9J47J26j94P7j29R8J11p3L25m31K40l86J92J32n4j02K30l15
$$ -322 -204 46 -64 -163 -16 110 -84 -7 -136 -38 73 0 325 -106 134 -252 -60 72 18 -84 146 -169
3588a69J91J45n7k43K18j20O6j21J83k23K39k28o2N27k73J87l29J05l2J56j8k05
$$ -169 22 167 110 -133 85 -35 31 -90 93 -130 109 -119 -181 346 73 260 -69 36 4 160 142 -63
3610f3K24j04L5p8n9J66k21J58r3k8Q9J50l74M60m34J68o0o9L30k12J11k08lN6
$$ -63 161 57 92 14 -45 121 -100 58 -35 -63 26 176 -198 262 -172 -4 -64 -133 197 -15 96 -112 -115 -59
3634e9R9K26j92q4K07k48R8rJ33l31P3J24J98k47K86j59O7m24K57j41J24L3p4
$$ -59 40 266 74 -10 197 -51 47 38 171 -160 -87 37 235 -12 274 115 182 -242 15 -126 -2 31 -43
3657d3R2l42K26o5j09J75K17NJ81j94M0j62L8l3N7k03J80RJ27j8k38J29j6o4j35
$$ -43 49 -293 -67 -132 -241 -66 151 156 337 143 183 21 59 26 83 -120 60 69 196 178 -60 69 53 -11 -146
3682a46L38j93r6Q9o6j04L35J99m37K24q3n6L6j89q7L78j88m3P0l6j22L45j09
$$ -146 192 -1 -97 -8 -74 -178 157 356 -81 143 60 4 40 -149 -236 142 -46 -89 -19 -55 -177 168 59
3705E9Pr7N2j99q9M99l88j09J39J57r7p2K01q4K35Q0r7j7K2k29j04J17j17L43
$$ 59 66 -31 21 -178 -267 232 -156 -265 -126 31 -66 -138 63 -21 214 294 197 180 202 -27 -131 -14 -131 212
3729B12n8n5r4L04m42N5O3j38j62K18j39q2K42J83J21k19O8k50J91j68R4J83r7
$$ 212 154 99 5 309 -133 -78 -15 -153 -315 -97 -236 -318 -76 107 228 9 77 -173 18 -150 -56 127 30
3752C0O5j5J13n41L78K02l31K6J69k82J18J5J43k40K47p4Olj4j3N3p4M3L1J17
$$ 30 95 80 193 -348 30 232 -99 -73 96 -186 -68 -53 90 -150 97 23 29 26 12 -1 52 -22 21 52 169
3777A69k55R3l6r5J89J48r3j34r1J61l63l9M76r1J79k89J39J7o9P2k28L29k72
$$ 169 -86 7 -29 -124 65 213 120 -14 -105 56 -307 -346 130 39 218 -71 68 85 16 88 -140 189 -83
3800h3j01M49m62N8J71j29O6J60J1k37K70j93j05L43j09k33K12k63l5K48j00R6
$$ -83 -184 265 -197 -139 32 -97 -31 129 140 -97 173 -20 -125 218 109 -124 88 -175 -210 38 -62 34
3822C4K20l00J42J73j10j99k1O0o6J77J54k64MM8j6l9J7J63j63j0J0j01J07j1
$$ 34 254 -46 96 269 159 -40 -61 -1 -67 110 264 0 4 52 36 -3 14 177 14 4 14 -87 20 9
3846Ij22J75k44J20J17j12r1K40R3j1l79M36j56J36j75L8r9j21K72k37J76r5J00
$$ 9 -113 62 -182 -62 55 -57 -148 92 185 174 -205 231 75 211 36 74 -25 -146 126 -111 65 -30 70
3869G0j18n1J97nl29R2n3J36P9O9m0o2L4K5J5j34Jp7K96mj67M6N2n6k89J52J8
$$ 70 -48 -99 98 93 -236 -144 -197 -61 18 87 47 -15 19 44 59 -75 -74 -151 145 141 -26 20 72 16 -273 -121 -103
3896a03J42j01Q2o0L8k4j48J96O0M5l02L9J84J3k4n8Q0j66L12l70K35Nk0j25J31
$$ -103 39 -62 20 -40 -2 -26 -174 22 82 127 -175 -136 48 61 37 -21 59 -107 205 -165 70 75 55 -70 61
3921F1k03M5M75m20O2Q0j64L3J7R1RJ28l88L92k11J18m1l19K03J98o3k31J31k92
$$ 61 -142 -97 378 -42 20 100 -64 -31 -14 77 86 214 -174 218 7 125 84 -235 -32 166 103 -128 3 -289
3945b89K00j07L24j63k28L10N4po4j26N7J93k16m6K1n6J54J02q3r6L7Q2o3j91
$$ -289 -89 -196 128 -35 -263 47 101 94 30 -96 -39 154 -62 -108 -87 -143 11 113 30 -66 -29 53 -10 -201
3969b01J82j04J66J31q7rm2l7q8q6j03K18K41k07k08L55k60r3L88m70L36j94K02
$$ -201 -19 -123 43 174 87 78 36 -1 -89 -175 -278 -60 181 -26 -234 121 -139 -232 156 -314 22 -172 30
3992C0K07k82L49n51J12j96N18j9Rk23k16L91k15J19o9K22j53k8j0k17J75m0J35
$$ 30 237 -45 304 -247 -135 -331 187 168 177 -46 -262 129 -86 33 -36 186 33 5 -5 -222 -47 -87 48
4015D8Q7j83j34J80l5k7K16j68o9K9o1J68J2K06k45J2P2r9k6n3J97r4J75k60J87
$$ 48 135 -48 -182 -2 -37 -64 152 -16 -85 -56 -117 51 63 269 24 36 108 9 -17 -70 127 33 208 -52 135
4040A35l07O3K01j31j1J71k1l61J62K19n6K45n8J6l07J62m6J45k83N2J15j43J64
$$ 135 -172 -109 92 -39 -50 121 100 -261 -99 120 64 309 251 267 -40 122 76 221 -62 -10 105 -38 126
4063A26j09O4j61K16k77j2P0J77j97J01J8q8L13k94J7J14k19K65oj44P1j68J32
$$ 126 17 81 -80 136 -141 -153 -83 94 -103 -2 16 -72 241 -53 -36 78 -141 124 118 -26 45 -123 9
4086IJ61k66J98j33J9J2l38L34j92L27q9j08j65L08k2r5K20j97J81k30J3J60J54
$$ 9 170 -96 102 -31 -12 0 -338 -4 -196 131 42 -66 -231 77 55 -40 180 -17 164 -66 -53 107 261
4109B61k31M8O5m8k18J9n4K57j43L36j72j42J16l2k8J08j64Q0q8Q7mN6j64K82
$$ 261 30 78 143 95 -123 -104 -158 99 -44 292 120 -22 94 62 34 142 -22 58 -30 57 53 109 -55 227
4133B27j19j44J06j27J81k59K90L1O0j74K1L1j00J34j09k0j03m1j62N90l18r6
$$ 227 108 -36 70 -57 124 -135 155 186 246 72 93 124 24 158 49 29 -74 -115 -277 313 -5 -101
4155a01N23n68K67K43n35J19J96k07K06l59N5J76p9J4O7r7J17J46k96p1JL88k28
$$ -101 422 -146 121 364 -171 -52 144 -63 143 -216 -161 15 -64 -50 17 -80 37 183 -113 -184 -183 205 -23
4178b3O2M0l2Q7n0j00j74L92j91M2O3q8j03M62k14l31J71J49k86K78K37o43J69
$$ -23 39 79 47 134 84 -16 -190 202 11 53 116 28 -75 387 173 -158 13 162 -124 154 391 -252 -83
4201h3K70j72k97J74J27j98K54k30J62J04j43K47m1l87K18p8l8L4j57K99O4J2
$$ -83 187 15 -282 -108 19 -179 75 -155 7 111 -32 215 174 -213 5 -73 -111 -77 -234 65 129 141
4223A41p8j38Q4M1l5j69l0J53J85k77J46m8L3m1q8L79m10K08M5l65M21k96L4K20
$$ 141 63 -75 9 50 15 -154 -184 -31 154 -123 23 -25 8 -33 -121 258 -152 56 101 -264 157 -139 -105 115
4247A15J08j43k26J95J49l80lL62o6R6j43Q8j63J14j06q6J20J40o2k14J49j00
$$ 115 223 80 -146 49 198 -182 -185 177 111 207 64 152 -11 103 -3 -89 31 171 109 -105 44 -56
4269e6M9k4lr1M4J38j87J37K0k76L72J32m03K06k9l9N7j3p5o6lj27L52j8l4k14
$$ -56 -7 -31 -34 -125 -81 57 -130 7 27 -249 123 255 -148 58 29 -10 47 34 -41 -107 -110 -237 115 97 63 -151
4295a51J7L0J24J95j90l8Q6q1o0J80j8j05J84q4j3r2M3l9J28k54J69J61l92L14
$$ -151 -134 -104 20 215 25 -13 73 -8 -68 112 94 -11 173 89 76 -16 27 -12 116 -138 31 192 -200 114
4319A14n4o4N1o7J73r3j03j3M4j17K23j68j33K47R3j5K17k12j75j6mL0R2J39j10
$$ 114 60 -4 47 -20 153 60 -43 -56 -12 -129 94 -74 -207 40 133 118 335 123 -52 -68 -72 -42 50 189 79
4344G9N7J07j29k56K27k28L15j91l7k3L30k55J45l93J60K03q0j36J9J05j4M0J80
$$ 79 136 243 114 -142 85 -143 172 -19 -56 -79 251 -4 141 -252 -92 111 31 -105 -86 19 5 45 225
4367B25l37J25j09OK23j55k0Q2K3Kk26J48Q2p0J43k11k4P1J55qrk76K34J0l74
$$ 225 -112 13 -96 -90 133 -22 -42 40 63 65 -161 -13 69 -1 142 -69 -93 -22 133 125 116 -160 74 84 -290
4392b90m4K99k28K20o7J64r1j51M14j55k29LJ98R4j47R0P4J1lj11J96l49K34j73
$$ -290 -334 -35 -263 -43 -110 54 -37 -188 226 71 -158 -155 43 137 -10 80 154 165 162 51 247 -102 132 -41
4416d1l0J25j08j27L3L48k04m4K18o6j30j92J96j40R8L6K4K8j5j37P9Q8j7J91
$$ -41 -71 54 -54 -181 -148 200 -4 -48 170 104 -26 -218 -22 -162 -64 -28 -4 24 9 -128 -49 39 22 213
4440B13j18k16L88k46JR3j75K58j62n2J56j33j75M4K21o2l4M9mk07l4J34j10K88
$$ 213 95 -121 267 21 22 115 -60 198 36 -16 140 7 -168 -124 97 35 1 50 46 -161 -195 -61 -171 117
4464A17j56L8M4l7N2j31J0N8r1K2J02j47K73K6p4Q4j99J95p3k4k87L20j13k01
$$ 117 -39 -1 43 6 58 -73 -63 -5 -96 -74 28 -119 154 180 106 190 -9 186 113 89 -198 122 9 -192
4488a92L1J58J62j3J11k48k35J34p2J81k3q0J10J12O3l54j7K47O4q6p1K7k21M08
$$ -192 -161 -3 159 146 257 9 -226 -92 -164 17 -6 -86 24 136 199 -155 -172 75 139 53 -18 9 -212 196
4512A96q4k64N8qj01K47K20l54J81k7Oj85K37q5K27k41o6J43n3m12M80l5j95k5
$$ 196 112 -152 -94 -102 -203 44 264 -90 91 64 70 -115 122 37 264 23 -43 100 47 -365 115 80 -115 -140
4536a40J21P8R4J56l48J83j33M5j34R5r1J32J94k91L0j16J12pj56L44l19k9K04
$$ -140 -19 59 153 309 -39 144 11 56 -78 17 -74 58 252 -39 -9 -125 -13 -20 -176 168 -151 -180 24
4559B4k40K43jJ2l7o8p4L4J25l5nKj36P3o0q1K17k38M52j68j12Rj44J44k4K28
$$ 24 -216 27 26 38 1 -67 -141 -107 18 -17 -22 -20 -156 -83 -143 -224 -7 -245 207 39 -73 -64 -208 -64 -88 140
4585A40k92J81r0k9J21L0l41L16k02j2K18M1k6k20J64nqj10M2J77n2j24j0j0J30
$$ 140 -152 29 -61 -90 31 61 -280 36 -166 -178 40 81 55 -165 -1 -6 -14 -124 -82 95 43 -81 -91 -101 29
4610B9J49j98L9J80l52K12L14n27j1J12p4J46K00k93K90m18N02k66J40k1j7j11
$$ 29 178 -20 19 199 -153 59 373 -154 -165 -53 -127 19 219 -74 216 -202 300 34 174 153 136 25
4632B5M0j28L02l76P1L00l59K28j25J04k9j0J20k35J44k30K07o0l0J68j26K2j14
$$ 25 65 -63 239 -137 -66 234 -125 103 -22 82 53 43 163 -72 72 -158 49 -11 -41 127 1 23 -91
4655i1j06K66r8O9M6k72J56P4k04J47k0l1j31K94j47J14k75K93q8R9p0l6O7k79
$$ -91 -197 69 -29 40 86 -186 -30 44 -160 -13 -33 -64 -195 99 -48 66 -209 84 -4 95 25 -11 56 -223
4679b23J51L26k50k89J94P9r0L4o5nj06K55j1J14k64J37J08Rk21J23N6O0k62J49
$$ -223 -72 254 4 -285 -91 -12 -102 -68 -133 -138 -244 11 0 114 -150 -13 95 104 -117 6 62 122 -140 9
4703IK36k04J56r1oj50O4K15k99J98l09J25J54j65l11M29k12M1J81p2J43j57P6
$$ 9 245 41 197 106 100 -50 14 229 -70 128 -181 -56 98 -67 -378 51 -161 -120 61 -11 132 -25 51
4726E1Q7j85J92J6o3L7k80J09J21k1L4k87O7k22J22L39m60J53l9L13j4k37l9K13
$$ 51 138 -47 145 161 98 135 -145 -36 85 64 98 -189 -122 -344 -222 117 -343 -190 -229 84 70 -167 -206 7
4750Gl6K08r2n0k7J21k2j5j58K9P3m7P1j46L35K1j91p7L0r3j07J68Q1o5OJ29k25
$$ 7 -29 179 87 37 10 131 109 94 -64 -35 38 -9 62 -84 251 272 81 4 34 -59 -166 2 83 18 24 153 -72
4777g2K42k32J4J64k49L30k88Q5n0J71k81J75K29J9l07J59l33L35Q4k04Om5J1
$$ -72 170 -62 -48 116 -133 197 -91 -6 -56 115 -166 9 238 257 -50 109 -224 111 195 -9 -3 -48 -37
4800c7j20L28j28J47p4k81j76J35J34R0j27J02j67J44k9K32R4j65j99N5j1K69
$$ -37 -157 171 43 190 116 -165 -341 -206 -72 18 -109 -7 -174 -30 -59 173 267 102 -97 -42 -53 216
4822B16j79o4p2J33r6J88k14N04m40j09j16L53l1L7r5Q8r5j17J24k20L9K30j40
$$ 216 37 -27 -99 34 -62 126 -88 416 -24 -133 -249 104 73 110 15 103 8 -109 15 -205 -166 64 -76
4845g6p0K11l25L12K03l99K57n7m3r3j02j3ML42j6j57o6J50k10J50j20k4K39M8
$$ -76 -146 65 -260 52 255 -144 113 56 13 -80 -182 -195 -191 151 135 -22 -88 62 -148 2 -118 -142 97 145
4869A45k26J77p6J6k5p0o7J52k9n5j6jK16k01J35r5O3p6o9J39r4j03P8J57%j0
$$ 145 -81 96 20 36 11 -59 -126 26 -3 -58 -74 -75 141 -60 75 -20 43 -33 -102 37 -57 -160 -82 75 75 65
4895F5k00J16j3l3J90l32M57j30k95N9R4N4J3Pl08K50m9mN8m9Q8j96P3k13M06
$$ 65 -135 -19 -32 -65 125 -207 250 120 -175 -116 -22 32 45 52 -256 -6 -55 -59 -1 -50 38 -158 -85 -298 108
4920A08O0j92R9j3k68l8L96l28K58m4J4k24K17j12J06p3R6j97K72l0p3P2r5R2
$$ 108 168 -24 75 62 -206 -244 152 -176 82 38 52 -172 45 -67 39 -34 62 -135 137 107 34 106 11 103
4944A03o8j44J0j64L93l06K7M84m01J3J71j16P8p6J82j48n9K39k16p2n7L53r1
$$ 103 35 -109 -99 -263 130 -176 -149 335 -66 -53 118 2 80 4 186 38 -21 218 2 -70 -127 226 135
4967A35j19j52K18N1p8o8J53k41J66J12j7l66nJ94J71j17j81N6q8K81R6L2l10
$$ 135 16 -136 82 133 55 -13 140 -101 65 177 160 -206 -211 -17 154 37 -144 -88 -176 105 201 233 -77
4990g7J23J04m9k61l7K18k9P9q3j44R4m4r8K94k1K56l00j2J05l11L01k88jJ76
$$ -77 46 150 101 -160 -197 21 -8 71 -12 -156 -62 -106 -204 90 69 325 25 13 118 -193 108 -180 -181 -5
5014eJ33j58J2Q5M4N6l18R3l8q5J02M18l39q2L2j76K30j73K38j82qLL06l35N5
$$ -5 128 -30 -18 67 111 167 -151 -58 -96 -181 -79 339 0 -82 -50 -226 4 -169 69 -113 -121 -118 188 -147 -92
5039i2l3L1M6j15J2L57j72L1q7Q4m0p4K07j8k3j26k17K15N2j41J04J7l8k76J17
$$ -92 -125 -94 -48 -163 -151 206 34 65 -22 62 22 -52 155 137 114 -12 -229 -14 38 -103 1 18 -20 -296 -179
5064a79K15j36J61j3M5O6m8k12J51J96l00j00K1K78k13J94M8k72K63p3J8n7j32
$$ -179 36 -100 61 48 93 159 111 -101 50 246 -54 -154 -133 145 -68 126 174 -98 165 92 110 53 -79
5087g9k22K70J88l58J81l5o1K10Kk67L67rj36j81l4r3K81j5Q0p8J40j05m6r9M0
$$ -79 -301 -31 157 -201 -20 -55 -116 94 96 -171 196 187 51 -130 -164 -257 24 9 89 11 151 46 0 -99 -59
5112e9J48M0Oj50J1J31qK8j10K05k54j32J98m9o2K65j40j00k20J23K57k05kj8
$$ -59 89 129 135 -15 -4 127 119 147 37 242 -12 -144 54 5 -57 208 68 -32 -252 -129 128 -77 -79 -97
5136i7j87M50j76rk22L48J0k54j05K38j3J80j51m1p2K16O3ok1m39L67j64N4J04
$$ -97 -284 166 -10 -19 -241 107 117 -137 -242 -4 -17 163 12 -29 -101 115 178 172 151 -288 79 -85 -31 73
5160G3j05k57ln1N19k95J05M0o3n1j42L48q7j95L28j63J19J76l38O3j02J36k27
$$ 73 -32 -289 -292 -343 176 -119 -14 26 -37 -88 -230 118 31 -164 164 1 120 296 -42 21 -81 55 -172
5183a72J14J99j78J46l06K17p9K55k28j11K30j54M2K18j48k18J63k6k4M8K09m01
$$ -172 -58 141 -37 109 -197 20 -59 196 -32 -143 87 -67 -25 193 45 -173 -10 -36 -60 -12 197 -204
5205b04M4J30L3q8J9j05K85k04k3J53J99k17j2k7l1K29j73m2J47j24l86K56N3
$$ -204 -160 -30 3 -85 -66 -171 114 -90 -113 40 239 22 10 -17 -48 181 8 -34 113 -11 -397 -141 -88
5228h8J56p4Q9K6k20N2O1K00k06M2KRR5j31k36Q5J15Q1j41J0M36l24oj3l2j20
$$ -88 68 -6 83 109 -111 -59 2 202 -4 38 40 49 144 13 -223 -138 -23 58 -83 -73 363 39 33 20 -12 -132
5254a32J47J8j35m3J20P3l7J54j24o1J34j97J32j35j10J25J21k95J56K1O4l0K5
$$ -132 15 33 -102 -145 -25 48 11 165 41 -20 114 -83 49 -86 -196 -71 50 -245 -89 -68 -4 -34 -9
5277iR7Qj42o4K90n9M8m2j97O2j39j61L16J04j03M2j33R7Q4k05j4J76j1r4J84
$$ -9 88 96 -46 -110 180 121 169 127 -70 -8 -147 -308 8 112 9 51 -82 15 99 -106 -120 56 45 -49 135
5302A35M4J71n31k4J20J25m6L5J54j84n1P0q4j42K46j87J84m1K09Q9k35p2J01
$$ 135 179 350 -181 -205 -85 40 -6 29 183 -1 -52 18 -66 -208 38 -149 35 -6 203 292 57 -15 86
5325H6j55K2L2Q6j86LP3JK3lL10l17J41J36k54q4q0L38j3m22K20K7J30O2l54L73
$$ 86 -69 -47 -15 71 -115 -112 -39 -38 -15 -18 292 -25 116 252 -2 -86 -166 172 159 -263 -43 -16 114 176 -178 195
5351A95k08R4lm5k03K57j50K09N2l10M4J80J73j47j41j83J89n4k2J22R0Pk59M4
$$ 195 -13 81 78 33 -170 87 -63 146 198 -112 -68 112 285 138 -3 -186 3 -51 -73 49 139 146 -113 -69
5375f9K99n6k56P3k40L36R9j12J64m32L26j43p3K07k28RJ28q5j14K57m3k30P9
$$ -69 230 174 -82 -9 -249 87 186 74 238 -194 132 -11 -84 123 -105 -96 32 -53 -167 90 47 -183 -104
5398a04L14J9m06J6P4R7L95l39j88L2L51m29J92J23j32K49k71k58M91k01L0k95
$$ -104 210 229 -177 -161 -87 10 405 66 -122 -90 261 -168 24 147 15 264 -7 -265 226 25 55 -240
5420b40K37k8QJ63q5j60o8K70j93k2j07K09p0o5L43l41O2J71j75oJ9M0N8o1p5
$$ -240 -3 -31 -23 140 55 -105 -173 97 -96 -118 -225 -16 -86 -151 192 -149 -87 84 -91 -97 -78 -38 20 -41 -116
5445a16K85O8m36L64k99P5J58k95k6k7K79j82K0K63N0j23j30p4Q5q2l6O0J76R6
$$ -116 169 237 -199 165 -134 -59 99 -196 -222 -249 30 -152 -132 131 181 58 -72 -146 -61 -143 -179 -119 57 153
5469A53K4k29J97k29R3K44k70J14nPj22l03J72N3p9J63J59r1L0j32J32p4M4K20
$$ 153 177 -52 145 -84 9 253 -17 97 92 99 -23 -326 -154 -101 -180 -17 142 51 81 -51 81 7 51 271
5493B71l23J01j42L9R1k28L6K18j03OK2R9j15J81j74J15k80O1N6J68j07j05j83
$$ 271 -52 49 -93 -54 37 -191 -155 63 -40 -34 -12 87 -28 153 -21 94 -186 -125 -69 99 -8 -113 -296
5516b96J80R5Pn6J64l92L80p6j74q8J89K8k7J37J20l37J48rp7J74K8k67M91k16
$$ -296 -116 -21 -14 -70 94 -298 82 6 -168 -256 -67 -39 -66 71 191 -146 2 -7 -84 90 118 -149 342 126
5540A26o7J9J54l69K87j21j57K64j25k16J8j08K82K44N2m99K98j3k04L15l35r7
$$ 126 59 78 232 -137 150 29 -128 136 11 -205 -187 -295 -13 231 283 -216 82 69 -135 180 -155 -252
5562b52Q8K23k02Q0J56J89l18J49j51K11j05q5j2O0n9Q0k24J09K59j93p0O0o8
$$ -252 -164 59 -143 -63 93 282 -36 113 -38 173 68 -17 -29 31 -28 52 -172 -63 196 3 -67 -7 -75
5585g5J59qk56j0P4Q8J1Q7M4n1j19J03q9O2J47k05J9J49j94J61q8L1pK88j78l02
$$ -75 84 76 -180 -190 -116 -28 -17 70 114 63 -56 47 -42 20 167 -38 -19 130 -64 97 9 40 33 321 143 -159
5611a59j10L81j05R9r7M9j60K37j98J84p8k01K13j78K36L8O0M4k82K6J09k9J64
$$ -159 -269 112 7 106 9 58 -102 135 -63 121 43 -158 55 -123 113 151 211 255 -27 -1 108 79 243
5634B43m37K86P4k15L7j01j5m2K14j18N8m4p8P0K04oj99k9j02J85rM1K1q8k32
$$ 243 -194 92 166 -49 -12 -113 -128 -170 44 -74 -16 -60 -138 -68 136 130 -69 -98 -200 -15 -24 17 38 -50 -282
5659b82L35j4j39J12O1mj96L18l10J9J61r3J32J99j49k10L58m71K39j68m6K45
$$ -282 53 39 -100 12 73 69 -127 191 -119 -100 61 -32 100 299 150 -60 298 -173 66 -102 -148 97
5681I7j55q6R9L4l7P6q0p3J50m7j19L13j42J08q8Q1j63o1r7K93n0l6m5J64j01
$$ 97 -58 -144 -45 -11 -48 28 -52 -125 25 -22 -141 172 30 138 50 131 -32 -93 -190 103 53 17 -28 136 35
5706C5J9k03K44p0j68L26j91k72K18J02j40q1K05L28k95j75l5J57J50r4J3q9L7
$$ 35 54 -149 95 25 -143 183 -8 -280 -62 40 -100 -181 24 352 57 -118 -153 4 154 60 73 -16 21
5729B1J59k25o5J18J20j99m3k38M19j38m8o9K8K15o3j05L71l64N5J03P3k92J32
$$ 21 180 -45 -110 8 128 -71 -114 -352 67 -71 -119 -188 -160 55 -8 -113 258 -106 -51 52 125 -167 -35
5752c5p2J16K22l51J96Lj02K87j17j6N6k02o2K95q8n7R0L9j73j70J61m9J9m3J83
$$ -35 -107 9 231 -120 76 79 -23 264 147 131 187 -15 -77 218 130 73 163 202 29 -141 20 -29 -10 -53 130
5777A30j81L6P6k30J35j89P1M2J10O9J7m4J4r5r7jJ37l5qJ80M0k36J1j42J88J95
$$ 130 -51 -15 61 -169 -34 -223 -152 -110 0 69 86 42 56 -39 -136 -137 0 -35 -43 137 177 -59 -48 -190 -2 193
5803A93j26k4j85J87r2P0j43J72m6K8N0k20j27K02J25q2j42J66J3j04P1K8J12
$$ 193 67 43 -142 45 -47 23 -120 52 6 34 84 -136 -263 -61 64 -18 -160 6 19 -85 -14 14 126
5826A26l36%K56j8Pn5Q3K67l36K01j98J04r3n9J47k4j48R5j87L52jm23K29O9k
$$ 126 -210 -210 46 28 35 -20 63 330 -6 195 -3 101 8 -51 96 72 -76 19 -168 184 183 -240 -11 58 56
5851E6l33M03j07J33o5j65o2Q3J37N4J04k49j6K70j87Nl40L07l0J26k35L28j95
$$ 56 -277 126 19 152 87 -78 -140 -57 80 134 238 -11 -27 243 56 61 -279 28 -2 124 -111 217 22
5874B2N4j38J45o9k31M21j95J87J2k45p4l4K07l1p3k94L82J67q8o6j40J51j3j92
$$ 22 76 -62 83 14 -217 204 9 196 208 -37 -111 -145 62 31 -42 -336 46 213 125 59 -81 70 57 -135
5898a35J81R4l3K2k90K24l2k28J67j48J89rj96J22K08r5l19L25K24j97R2o1k51
$$ -135 46 140 107 129 -161 63 31 -197 -30 -178 11 2 -194 -72 136 41 -278 47 271 74 166 105 -146
5921a46M01l35J29j7Q1J3k54K54j99K73Q4J35l02m2j21J47j55m9J22k53J69K2
$$ -146 255 -80 49 32 113 126 -128 126 -73 200 284 419 117 75 -46 101 -54 -103 19 -234 -65 -43
5943d3p1m3Q7N6j55q1L94j81m0J10NR3k03k5J18n2K74j52J9k33K07k84J50P6n4
$$ -43 -114 -157 -70 -14 -169 -250 144 -37 -77 33 38 131 -72 -97 21 -31 243 91 110 -123 84 -200 -50 26 -28
5968b8K74l49Q4j48J85rp1J72K7k03K67m10R9J12r0K1k2K43k30J62j21K2P9m6
$$ -28 246 -103 -19 -167 18 9 -62 110 137 -66 201 -209 -110 2 -88 -67 -89 154 -76 86 -35 -13 66 20
5992B0J16k19L6k0o8K13k60O3O8m3J44k30R5M18l57l4j11J31J19k03Q1N7p6K67
$$ 20 136 -83 -47 -67 -135 78 -182 -119 -51 -94 50 -180 -85 333 -24 -58 -169 -38 81 -122 -41 16 -60 207
$$ [...]
8191I
##END NTUPLES=NMR FID
##END=
