##TITLE=1H_LR-758-R6-3CR6
 CDCl3
 8 sc, 
 26.10.2023
##JCAMPDX= 6.0         $$ Bruker NMR JCAMP-DX V2.0
##DATA TYPE= NMR FID
##DATA CLASS= NTUPLES
##ORIGIN= UXNMR, Bruker Analytische Messtechnik GmbH
##OWNER= root
$$ XWIN-NMR		Version 3.5
$$ Thu Oct 26 14:55:28 2023 Russian Standard Time (UT+4h)  she@DPX200
##.OBSERVE FREQUENCY= 200.13135
##.OBSERVE NUCLEUS= ^1H
##.DELAY= (6, 6)
##.ACQUISITION MODE= SIMULTANEOUS
##.ACQUISITION SCHEME= undefined
##.AVERAGES= 8
##.DIGITISER RES= 18
##SPECTROMETER/DATA SYSTEM= spect
##.PULSE SEQUENCE= zg30
##.SOLVENT NAME= CDCl3
##.SHIFT REFERENCE= (INTERNAL, CDCl3, 0, 15.7039)
##AUDIT TRAIL= $$ (NUMBER, WHEN, WHO, WHERE, WHAT)
$$ ##TITLE= Audit trail, XWIN-NMR		Version 3.5
$$ ##JCAMPDX= 5.01
$$ ##ORIGIN= Bruker BioSpin GmbH
$$ ##OWNER= she
$$ F:/spectra/data/she/nmr/H-F/1/audita.txt
$$ ##AUDIT TRAIL=  $$ (NUMBER, WHEN, WHO, WHERE, WHAT)
(   1,<2023-10-26 14:54:12.92 +0400>,<she>,<DPX200>,
      <created by zg, POWCHK disabled, PULCHK disabled
       configuration hash MD5:
       00 E9 B6 7A A2 85 ED C7 34 08 36 98 17 FE 4E 26
       data hash MD5: 16K
       D0 14 69 42 5F EA 2A 3E ED 28 01 83 CD 98 23 C2>)
$$ ##END=
$$ 
$$ hash MD5
$$ BF 07 20 A6 C5 24 86 9C 27 DA E9 91 E4 7D B6 E0
##$RELAX= 
##$RELAX= 
##$RELAX= 
##$RELAX= 
##$RELAX= 
##$RELAX= 
$$ Bruker specific parameters
$$ --------------------------
##$DU= <F:/spectra>
##$EXPNO= 1
##$NAME= <H-F>
##$PROCNO= 1
##$TYPE= <nmr>
##$USER= <she>
##$AMP= (0..31)
100 100 100 100 100 100 100 100 100 100 100 100 100 100 100 100 100 100 
100 100 100 100 100 100 100 100 100 100 100 100 100 100 
##$AQSEQ= 0
##$AQ_mod= 1
##$AUNM= <au_zg>
##$AUTOPOS= <>
##$BF1= 200.13
##$BF2= 200.13
##$BF3= 200.13
##$BF4= 200.13
##$BF5= 200.13
##$BF6= 200.13
##$BF7= 200.13
##$BF8= 200.13
##$BYTORDA= 1
##$CFDGTYP= 0
##$CFRGTYP= 5
##$CHEMSTR= <none>
##$CNST= (0..31)
1 1 145 1 1 1 1 1 1 1 1 1 1 1 1 1 1 1 1 1 1 1 1 1 1 1 1 1 1 1 1 1 
##$CPDPRG= <>
##$CPDPRG1= <>
##$CPDPRG2= <>
##$CPDPRG3= <>
##$CPDPRG4= <mlev>
##$CPDPRG5= <mlev>
##$CPDPRG6= <mlev>
##$CPDPRG7= <mlev>
##$CPDPRG8= <mlev>
##$CPDPRGB= <>
##$CPDPRGT= <>
##$D= (0..31)
0 1.2 0 0 0 0 0 0 0 0.06 0 0.03 0 0 0 0 0.0002 0 0 0 0 0 0 0 0 0 0 0 0 
0 0 0 
##$DATE= 1698317652
##$DBL= (0..7)
120 120 120 120 120 120 120 120 
##$DBP= (0..7)
150 150 150 150 150 150 150 150 
##$DBP07= 0
##$DBPNAM0= <>
##$DBPNAM1= <>
##$DBPNAM2= <>
##$DBPNAM3= <>
##$DBPNAM4= <>
##$DBPNAM5= <>
##$DBPNAM6= <>
##$DBPNAM7= <>
##$DBPOAL= (0..7)
0.5 0.5 0.5 0.5 0.5 0.5 0.5 0.5 
##$DBPOFFS= (0..7)
0 0 0 0 0 0 0 0 
##$DE= 6
##$DECBNUC= <off>
##$DECIM= 32
##$DECNUC= <off>
##$DECSTAT= 4
##$DIGMOD= 1
##$DIGTYP= 9
##$DL= (0..7)
0 120 120 120 120 120 120 120 
##$DP= (0..7)
150 150 150 150 150 150 150 150 
##$DP07= 0
##$DPNAME0= <>
##$DPNAME1= <>
##$DPNAME2= <>
##$DPNAME3= <>
##$DPNAME4= <>
##$DPNAME5= <>
##$DPNAME6= <>
##$DPNAME7= <>
##$DPOAL= (0..7)
0.5 0.5 0.5 0.5 0.5 0.5 0.5 0.5 
##$DPOFFS= (0..7)
0 0 0 0 0 0 0 0 
##$DQDMODE= 0
##$DR= 18
##$DS= 0
##$DSLIST= <SSSSSSSSSSSSSSS>
$$ [...]
##$SUBNAM2= <"">
##$SUBNAM3= <"">
##$SUBNAM4= <"">
##$SUBNAM5= <"">
##$SUBNAM6= <"">
##$SUBNAM7= <"">
##$SUBNAM8= <"">
##$SUBNAM9= <"">
##$SW= 18.05172834244
##$SWIBOX= (0..15)
0 0 2 0 0 0 0 0 0 0 0 0 0 0 0 0 
##$SW_h= 3612.71676300578
##$TD= 16384
##$TD0= 1
##$TE= 0
##$TE2= 300
##$TE3= 300
##$TEG= 300
##$TL= (0..7)
0 120 120 120 120 120 120 120 
##$TP= (0..7)
150 150 150 150 150 150 150 150 
##$TP07= 0
##$TPNAME0= <>
##$TPNAME1= <>
##$TPNAME2= <>
##$TPNAME3= <>
##$TPNAME4= <>
##$TPNAME5= <>
##$TPNAME6= <>
##$TPNAME7= <>
##$TPOAL= (0..7)
0.5 0.5 0.5 0.5 0.5 0.5 0.5 0.5 
##$TPOFFS= (0..7)
0 0 0 0 0 0 0 0 
##$TUNHIN= 0
##$TUNHOUT= 0
##$TUNXOUT= 0
##$USERA1= <user>
##$USERA2= <user>
##$USERA3= <user>
##$USERA4= <user>
##$USERA5= <user>
##$V9= 5
##$VALIST= <valist>
##$VCLIST= <CCCCCCCCCCCCCCC>
##$VD= 0
##$VDLIST= <DDDDDDDDDDDDDDD>
##$VPLIST= <PPPPPPPPPPPPPPP>
##$VTLIST= <TTTTTTTTTTTTTTT>
##$WBST= 1024
##$WBSW= 4
##$XGAIN= (0..3)
0 0 0 0 
##$XL= 0
##$YL= 0
##$YMAX_a= 277385
##$YMIN_a= -397596
##$ZGOPTNS= <>
##$ZL1= 120
##$ZL2= 120
##$ZL3= 120
##$ZL4= 120
##$ABSF1= 10
##$ABSF2= 0
##$ABSG= 5
##$ABSL= 3
##$ALPHA= 0
##$AQORDER= 0
##$ASSFAC= 0
##$ASSFACI= 0
##$ASSFACX= 0
##$ASSWID= 0
##$AUNMP= <proc_1d>
##$AZFE= 0.1
##$AZFW= 0.1
##$BCFW= 1
##$BC_mod= 2
##$BYTORDP= 1
##$COROFFS= 0
##$CY= 11.3945322036743
##$DATMOD= 1
##$DC= 2
##$DFILT= <>
##$DTYPP= 0
##$F1P= 15.7292609196834
##$F2P= 12.9074282941183
##$FCOR= 0.5
##$FTSIZE= 0
##$FT_mod= 4
##$GAMMA= 1
##$GB= 0.15
##$INTBC= 1
##$INTSCL= 1
##$ISEN= 128
##$LB= 0.24
##$LEV0= 0
##$LPBIN= 0
##$MAXI= 10000
##$MC2= 0
##$MEAN= 0
##$ME_mod= 0
##$MI= 1.114404
##$NCOEF= 0
##$NC_proc= 0
##$NLEV= 6
##$NOISF1= 3.799351
##$NOISF2= 2.8
##$NSP= 1
##$NTH_PI= 0
##$NZP= 0
##$OFFSET= 15.70392
##$PC= 1
##$PHC0= -23508.33
##$PHC1= 11.05272
##$PH_mod= 1
##$PKNL= yes
##$PPARMOD= 0
##$PSCAL= 0
##$PSIGN= 0
##$REVERSE= no
##$SF= 200.130013532006
##$SI= 16384
##$SIGF1= 3
##$SIGF2= 2
##$SINO= 400
##$SIOLD= 16384
##$SREGLST= <1H.CDCl3>
##$SSB= 0
##$STSI= 0
##$STSR= 0
##$SW_p= 3612.71676300578
##$SYMM= 0
##$S_DEV= 0
##$TDeff= 0
##$TDoff= 0
##$TI= <>
##$TILT= no
##$TM1= 0
##$TM2= 0
##$TOPLEV= 0
##$USERP1= <user>
##$USERP2= <user>
##$USERP3= <user>
##$USERP4= <user>
##$USERP5= <user>
##$WDW= 1
##$XDIM= 8192
##$YMAX_p= 0
##$YMIN_p= 0
$$ End of Bruker specific parameters
$$ ---------------------------------
##NTUPLES= NMR FID
##VAR_NAME=  TIME,          FID/REAL,        FID/IMAG
##SYMBOL=    X,             R,               I
##VAR_TYPE=  INDEPENDENT,   DEPENDENT,       DEPENDENT
##VAR_FORM=  AFFN,          ASDF,            ASDF
##VAR_DIM=   8192,          8192,            8192
##UNITS=     SECONDS,       ARBITRARY UNITS, ARBITRARY UNITS
##FACTOR=    0.0002768,     1,               1
##FIRST=     0,             0,               0
##LAST=      2.2672688,     0,               0
##MIN=       0,             -397596,         0
##MAX=       2.2672688,     277385,          0
$$ Real data points
##PAGE= N=1
##DATA TABLE= (X++(R..R)), XYDATA
$$ plain form
0 0 0 0 0 0 0 0 0 0 0 0 0 0 0 0 0 -8 8 -8 8 -8 13 -16 16 -21 24 -28 32 -36 41 -47 52 -60 68 -76 85 -94 106
37 106 -118 130 -145 161 -177 197 -214 236 -261 288 -317 349 -382 423 -467 515 -570 632 -706 789
57 789 -889 1010 -1155 1342 -1577 1895 -2339 2996 -4048 5920 -9887 21389 -115731 -397596
71 -397596 185497 158948 -250520 169273 277385 -229732 -45893 250501 -66084 -38150
81 -38150 232266 7677 -64987 168225 50956 -73933 91143 77585 -18683 49437 37597
92 37597 -22144 8881 6043 12491 28647 -36188 -16969 46415 -29831 -35843 33339 -53282 -61026
105 -61026 64580 -10994 -79823 42337 -11821 -112462 35440 42316 -104217 2264 62607
116 62607 -91175 -40874 57051 -62885 -44244 70698 -28879 -63174 41575 -16094 -55792
$$ packed form
0@%%%%%%%%%%%%%%%qJ6j6J6j6K1k9L2l7M5n2O0o8P7q8R9j12J28j44J61j79K00
37A06k24K48k75L06l38L74m11M50m97N49o05O66p31Q05q90R82j085J202j338J495
57G89j678J899k165K497k919L472m234N335p044R968j5807L1276j37120k81865
71c97596N83093k6549m09468M19793J08112n07117J83839K96394l16585K7934
81c8150K70416k24589p2664K33212j17269j24889J65076j3558r6268O8120j1840
92C7597n9741L1025k838O448J6156o4835J9219O3384p6246o012O9182q6621p744
105f1026J25606p5574o8829J22160n4158j00641J47902O876j46533J06481O0343
116F2607j53782N0301R7925j19936J8641J14942r9577l4295J04749n7669l9698
$$ plain form
127 -55792 50729 24294 -42958 26038 21514 -34761 19169 33802 -4215 26122 19349 -13843
139 -13843 25978 22907 -6455 35400 19240 -29441 21246 24937 -31336 13860 27476 -44755
151 -44755 -6543 32360 -43906 -21404 40893 -38528 -49583 33924 -21366 -55218 37381 3772
163 3772 -67437 13020 22819 -51504 9794 43611 -42976 -16069 47355 -18329 -21072 51573 4843
176 4843 -33443 30799 17403 -28533 21750 33641 -20260 -5282 20297 -9605 -5293 21232
188 21232 314 -16936 1095 3812 -7659 -971 5530 -5428 -10849 758 2368 -8883 -3221
201 -3221 8047 -6240 -11154 6530 -1698 -12424 6606 1993 -17096 1402 6336 -16299 -2791
214 -2791 7297 -16567 -6893 11700 -13578 -14481 12010 -5435 -14978 12686 -379 -18947 12146
$$ packed form
127e5792J06521k6435o7252O8996m524n6275N3930J4633l8017L0337o773l3192
139a3843L9821l071k9362M1855j6160m8681N0687L691n6273M5196J3616p2231
151d4755L8212L8903p6266K2502O2297p9421j1055Q3507n5290l3852R2599l3609
163C772p1209Q0457R799p4323O1298L3817q6587K6907O3424o5684k743P2645m6730
176D843l8286O4242j3396m5936N0283J1891n3901J4978K5579k9902M312K6525
188B1232k0918j7250J8031K717j1471O688O501j0958n421J1607J610j1251N662
201c221J1268j4287m914J7684q228j0726J9030m613j9089J8498M934k2635J3508
214b791J0088k3864R674J8593k5278r03K6491j7445r543K7664j3065j8568L1093
$$ plain form
227 12146 11767 -14893 7813 16656 -11043 5566 21906 -6691 -337 24058 2543 -2742 19586
240 19586 1665 -9471 17375 9148 -9985 9372 4534 -16640 2768 8030 -14868 -2277 6262
253 6262 -17752 -10597 6224 -12406 -12222 7505 -7402 -15021 5736 -1921 -15999 3805 7403
266 7403 -8973 3070 9586 -9465 -3294 13856 1975 -3447 9560 2702 -7621 6129 8601
279 8601 -8231 -2622 9635 -2550 -6282 6031 -3805 -13087 3931 6907 -10047 -4666 5164 -7051
293 -7051 -5349 10471 -657 -10970 6765 7930 -5667 3525 7492 -6730 199 13598 3046
306 3046 -2432 6573 1219 -4269 5361 5018 -3936 304 2894 -3197 -1692 -790 -4432 -483 1967 -1705
322 -1705 -929 -3263 -6526 2059 5623 -1541 641 3086 -4014 1740 12148 834 -4210 7853 3484
$$ packed form
227A2146l79k6660K2706Q843k7699J6609J6340k8597O354K4395k1515n285K2328
240A9586j7921j1136K6846q227j9133J9357m838k1174J9408N262k2898J2591Q539
253F262k4014P155J6821j8630J84J9727j4907p619K0757p657j4078J9804L598
266G403j6376J2043O516j9051O171J7150j1881n422J3007o858j0323J3750K472
279H601j6832N609J2257j2185l732J2313r836r282J7018K976j6954N381R830j2215
293g051J702J5820j1128j0313J7735J165j3597R192L967j4222O929J3399j0552
306C046n478R005n354n488R630l43q954M240K590o091J505R02l642L949K450l672
322a705P76k334l263Q585L564p164K182K445p100N754J0408j1314n044J2063m369
$$ plain form
337 3484 -2933 10205 5973 -9763 3383 9827 -7548 -2331 8035 -7861 -7450 9154 -5202
350 -5202 -16230 4783 3282 -13606 943 3831 -18271 -4914 14766 -6614 -9893 10936 -2273
363 -2273 -12347 13237 8796 -14854 3605 15481 -9024 -3917 16161 -5329 -11320 16238 4513
376 4513 -17915 4190 9294 -15790 -3287 13006 -12792 -14413 12758 -1723 -18831 5960 5805
389 5805 -17264 1858 14976 -12481 -9105 15293 -718 -9309 14906 6953 -13927 6638 15888
402 15888 -6953 -493 15480 -3644 -7955 13719 3940 -12232 4182 7045 -9425 -1540 8352
415 8352 -6994 -8992 6575 920 -9030 1615 3598 -7014 -1414 6333 -2330 -5039 5701 5598
429 5598 -2621 957 4935 -2522 -1114 8525 2799 -5561 1542 3395 -4605 -1069 4571 -4242 -7132
$$ packed form
337C484o417J3138m232j5736J3146O444j7375N217J0366j5896M11J6604j4356
350e202j1028K1013j501j6888J4549K888k2102J3357J9680k1380l279K0829j3209
363b273j0074K5584m441k3650J8459J1876k4505N107K0078k1490n991K7558j1725
376D513k2428K2105N104k5084J2503J6293k5798j621K7171j4481j7108K4791j55
389E805k3069J9122J3118k7457L376K4398j6011q591K4215p953k0880K0565R250
402A5888k2841O460J5973j9124m311K1674r779j6172J6414K863j6470P885R892
415H352j5346j998J5567n655r950J0645J983j0612N600P747q663k709J0740j03
429E598q219L578L978p457J408R639n726q360P103J853q000L536N640q813k890
$$ plain form
444 -7132 2428 -1409 -9369 -1332 1407 -7937 -3618 3651 -5629 -6663 4226 204 -6354 3096 5564
459 5564 -3736 1212 8377 -1185 -1263 10693 4424 -3294 7364 6842 -4230 3822 9516 -3401 -2695
474 -2695 8839 -653 -7429 6048 2405 -10020 1391 5491 -9588 -2927 7551 -6032 -7604
487 -7604 6605 -1009 -8153 5674 4666 -8554 1107 7599 -5015 -1660 8597 -923 -4710 6100
501 6100 1874 -5170 3369 4663 -4176 -1529 3280 -2398 -3318 3353 -67 -4833 -12 1793 -2384
516 -2384 -359 2842 -514 -1352 2703 2402 474 3012 4163 1363 2429 4488 3202 3319 4237 2080
532 2080 2044 2651 2084 2736 1133 -1661 472 1231 -2812 -1723 395 -3967 -4236 643 -3562 -7435 -237
549 -237 -835 -6532 -368 471 -7097 -2145 4455 -2735 -2387 4732 -376 -2760 4964 2995 -2866 3384
$$ packed form
444g132R560l837p960Q037K739r344M319P269r280j034J0889m022o558R450K468
459E564r300M948P165r562p8J1956o269p718J0658n22j1072Q052N694j2917P06
474b695J1534r492o776J3477l643j2425J1411M100j5079O661J0478j3583j572
487g604J4209p614p144J3827j008j3220R661O492j2614L355J0257r520l787J0810
501F100m226p044Q539J294q839K647M809n678r20O671l420m766M821J805m177
516b384K025L201l356q38M055l01j928K538J151k800J066K059j286J17R18k157
532B080l6O07n67O52j603k794K133P59m043J089K118m362k69M879m205l873P198
549b37n98n697O164Q39p568M952O600p190L48P119n108k384P724j969n861O250
$$ plain form
565 3384 5608 -1100 863 4306 -1174 -1017 4559 1639 -1430 940 294 -2856 -591 2109 -943 -2176
581 -2176 709 -810 -3292 591 1546 -2108 -164 2504 -683 -1406 1988 200 -1578 2745 2580 -2092
597 -2092 538 1330 -3151 -701 2282 -2976 -2631 1450 -2785 -4461 -906 -2465 -4486 8 -12 -4228
613 -4228 -2764 -875 -2734 -1049 1647 84 -812 909 1023 969 1329 2239 3547 1859 1620 3977 788
630 788 -993 3364 2691 -1476 1982 2600 -3957 -2279 2625 -3199 -3947 2742 -2202 -7004 855 -144
646 -144 -7320 -613 2801 -4631 -1918 3883 -2974 -4263 4270 2682 -2945 2498 3568 -2760 547
661 547 5472 -871 -2352 4021 1344 -2778 1400 1755 -4358 -2114 2780 -2694 -4539 1368 -1058 -6090
677 -6090 -106 840 -5374 -1456 3458 -3100 -3561 3637 137 -3704 3892 3545 -4044 1871 5693 -3024
$$ packed form
565C384K224o708J963L443n480J57N576k920l069K370o46l150K265K700l052j233
581b176K885j519k482L883R55l654J944K668l187p23L394j788j778M323j65m672
597b092K630P92m481K450K983n258L45M081m235j676L555j559k021M494k0m216
613d228J464J889j859J685K696j563q96J721J14n4L60R10J308j688k39K357l189
630G88j781M357o73m167L458O18o557J678M904n824p48O689m944m802P859r99
646a44p176O707L414p432K713N801o857j289Q533j588n627N443J070o328L307
661E47M925o343j481O373k677m122M178L55o113K244M894n474j845N907k426n032
677f090N984R46o214L918M914o558m61P198l500l841P596l47p589N915L822q717
$$ plain form
693 -3024 -337 6444 -791 -2967 5241 941 -5524 2177 2957 -5610 -1278 3890 -4605 -4583 3871 -1937
709 -1937 -6459 2790 1085 -5743 723 4168 -3814 -1666 5357 23 -2926 5482 3589 -3078 2777
724 2777 5508 -1931 170 5603 15 -2752 3949 1794 -4921 -20 3065 -4025 -3080 2620 -3324
739 -3324 -6172 1256 587 -5900 -943 2293 -4133 -2933 4062 -600 -3912 3426 3265 -3214 1620 5517
755 5517 -1401 -392 5988 1045 -2744 4286 3428 -3308 1017 4281 -3350 -2459 4071 -1551 -5569 2252
771 2252 301 -6094 -228 2366 -4460 -2619 3540 -1804 -3810 3547 1890 -3615 2086 3900 -2417
786 -2417 804 5448 -259 -1728 4380 2131 -2368 2184 3224 -3035 -636 3470 -2315 -3596 2355
801 2355 -682 -5088 342 629 -4998 -1622 2414 -3117 -3198 2804 -168 -3840 2246 2629 -3300 1195
$$ packed form
693c024K687O781p235k176Q208m300o465P701P80q567M332N168q495K2Q454n808
709a937m522R249j705o828O466L445p982K148P023n334k949Q408j893o667N855
724B777K731p439K101N433n588k767O701k155o715M901L085p090R45N700n944
739c324k848P428o69o487M957L236o426J200O995m662l312P338j61o479M834L897
755E517o918J009O380m943l789P030q58o736M325L264p631Q91O530n622m018P821
771B252j951o395N866K594o826J841O159n344k006P357j657n505N701J814o317
786b417L221M644n707j469O108k249m499M552J040o259K399M106n785j281N951
801B355l037m406N430K87n627L376M036n531q1O002k972l672O086L83n929M495
$$ plain form
817 1195 5013 -1426 -470 5256 1097 -1822 4272 2939 -2765 1592 3894 -2596 -1406 3802 -1403
832 -1403 -4002 2051 -121 -4712 -324 1309 -4086 -2248 2052 -1510 -3119 1617 665 -2982 1271
847 1271 2998 -1497 -201 3658 787 -975 2781 2531 -1056 1357 3241 -860 -1266 2409 23 -2526
863 -2526 970 308 -3433 -811 978 -2556 -2726 845 -1018 -2571 1251 524 -2583 288 2455 -746
879 -746 -287 2384 926 -23 2236 2221 -131 1398 3198 461 -284 1856 435 -949 669 662 -2194
896 -2194 -1378 -38 -1830 -2548 -431 -1238 -2923 -723 -110 -2861 -1247 662 -1033 -739 1910 333
912 333 -772 2038 1950 -149 1830 2795 233 788 2875 1205 -348 2389 890 -951 569 1371 -1470
929 -1470 -1014 510 -1446 -2266 -53 -820 -2846 -501 195 -2131 -1202 1065 -821 -1003 1191 814 -1069
$$ packed form
817A195L818o439R56N726m159k919O094j333n704M357K302o490J190N208n205
832a403k599O053k172m591M388J633n395J838M300l562j609M736r52l647M253
847A271J727m495J296L859k871j762L756k50l587K413J884m101m06L675k386k549
863b526L496o62l741K622J789l534j70L571j863j553L822p27l107K871K167l201
879g46M59K671j458r49K259j5k352J529J800k737p45K140j421j384J618pk856
896b194Q16J340j792p18K117q07j685K200O13k751J614J909j695K94K649j577
912C33j105K810q8k099J979R65k562N55K087j670j553K737j499j841J520Q02k841
929a470M56J524j956q20K213p67k026K345O96k326R29K267j886j82K194l77j883
$$ plain form
946 -1069 1255 2324 -350 536 2762 170 -261 2441 1199 -1116 1182 1457 -1181 -557 1330 -1081
962 -1081 -2306 685 -324 -2653 -281 666 -2133 -1151 1524 -845 -1494 1343 1177 -941 1124 2631
978 2631 -349 341 3175 915 -187 2588 1524 -880 1135 1871 -1101 -730 1358 -891 -2013 453
994 453 -347 -3022 -989 104 -2756 -1916 308 -1501 -2141 485 260 -2025 305 1925 -715 400
1010 400 2997 289 -153 3343 1830 -231 2511 2869 -832 898 2736 -650 -684 2156 -117 -2242
1026 -2242 1068 241 -2662 -168 1173 -2566 -1715 1508 -1057 -2475 1180 387 -1987 872 2292 -1470
1042 -1470 -49 3157 -43 -706 2879 1512 -1222 1849 2744 -1424 -506 2730 -370 -1926 2038 210
1058 210 -3274 483 1204 -3189 -1181 1735 -2349 -2263 1821 -390 -2731 1769 1904 -2274 561 3189
$$ packed form
946a069K324J069k674Q86K226k592m31K702j242k315K298K75k638O24J887k411
962a081j225K991j009k329K372R47k799R82K675k369o49K837j66k118K065J507
978B631k980O90K834k260j102K775j064k404K015P36k972L71K088k249j122K466
994D53q00k675K033J093k860Q40K224j809o40K626k25k285K330J620k640J115
1010D00K597k708m42L496j513k061K742L58l701J730J838l386l4K840k273k125
1026b242L310q27k903K494J341l739Q51L223k565j418L655p93k374K859J420l762
1042a470J421L206l200o63L585j367k734L071Q95m168R18L236l100j556L964j828
1058B10l484L757P21m393K008K916m084Q6M084k211k341M500J35m178K835K628
$$ plain form
1074 3189 -484 -280 3636 994 -947 2677 2272 -1096 1121 2619 -793 -1019 1930 -455 -2654 952
1090 952 497 -3245 -1114 410 -2754 -2287 723 -1596 -3205 236 531 -2944 -271 1633 -1472 -698
1106 -698 2923 60 -1167 2767 1774 -1285 1730 3097 -890 7 2726 -426 -1616 2097 302 -2593
1122 -2593 533 656 -3044 -1340 928 -2230 -2344 1033 -905 -3152 134 816 -2234 -38 2022 -1028
1138 -1028 -880 2715 710 -1337 2026 1760 -1002 1328 2686 -771 -715 2539 145 -2098 1524 392
1154 392 -3083 -15 943 -3017 -2114 702 -1602 -2816 841 -251 -3408 230 1327 -2307 -370 2494
1170 2494 -872 -1005 2757 1007 -897 2151 2078 -918 766 2464 -281 -532 2071 241 -1774 891
1186 891 394 -2669 -622 623 -1789 -1686 343 -1370 -2323 473 -25 -2175 -242 1001 -1191 -422
$$ packed form
1074C189l673K04L916k642j941L624m05l368K217J498l412k26K949k385k199L606
1090I52m55l742K131J524l164M67L010k319j609L441K95l475K673J904l105P74
1106f98L621k863j227L934r93l059L015J367l987Q97K719l152j190L713j795k895
1122b593L126J23l700J704K268l158j14L377j938k247L286O82l050K196K060l050
1138a028J48L595k005k047L363k66k762K330J358l457N6L254k394k243L622j132
1154C92l475L068R58l960R03K816k304j214L657j092l157L638J097l634J937K864
1170B494l366j33L762j750j904L048p3k996J684J698k745k51K603j830k015K665
1186H91m97l063K047J245k412J03K029j713r53K796m98k150J933J243k192P69
$$ plain form
1202 -422 1578 -199 -450 1836 1360 -562 1248 1933 -330 419 2105 -227 -636 1493 -86 -1513
1218 -1513 306 223 -2063 -934 254 -1742 -1797 22 -1003 -1919 455 -128 -1627 638 951 -540 476
1235 476 1804 300 332 1756 1109 322 1388 1760 345 579 1619 214 -354 718 94 -1167 -197
1252 -197 -56 -1550 -1355 -71 -1388 -1979 -669 -499 -1716 -271 85 -1335 -233 957 -368 -110 1573
1269 1573 859 -203 1683 1225 77 964 1759 133 460 1645 14 -338 878 166 -1183 -154 -297
1286 -297 -1254 -653 -235 -1156 -1058 30 -558 -817 -152 -103 -791 487 748 17 407 1028 692 258 1091 924
1306 924 232 1005 1256 82 309 706 -205 -454 85 -718 -1183 -429 -616 -1480 -1011 -192 -1317 -1114 -111
1325 -111 -1035 -789 329 -265 -383 880 631 163 875 1013 476 773 1299 619 457 1256 905 422 862
$$ packed form
1202d22K000j777k51K286m76j922J810O85k263P49J686k332m09K129j579j427
1218a513J819q3k286J129J188j996n5J819j025r16K374n83j499K265L13j491J016
1235D76J328j504L2J424o47p87J066L72j415K34J040j405n68J072o24j261R70
1252a97J41j494J95J284j317n91J310J70j217J445L56j420J102J190j325K58J683
1269A573p14j062J886m58j148Q87P95j626L27J185j631l52J216p12j349J029j43
1286b97r57O01M18r21R8J088n88k59O65M9o88J278K61p31L90O21l36m34Q33j67
1306I24o92P73K51j174K27L97r11k49N39q03m65P54j87q64M69Q19j125K03J003
1325a11r24K46J118n94j18J263k49m68P12J38n37K97N26o80j62P99l51m83M40
$$ plain form
1344 862 572 -199 -417 53 -336 -775 -381 -602 -928 -634 -572 -963 -786 -436 -779 -593 -7 14 60 267 500
1365 500 458 505 793 806 946 867 806 575 704 491 222 379 34 -247 -81 -250 -926 -656 -598 -1070 -1157 -598
1387 -598 -949 -914 -505 -626 -532 31 39 -121 240 430 12 763 1201 902 493 1058 1028 699 982 835 287 177
1409 177 544 -277 -595 34 -260 -922 -772 -668 -971 -1321 -635 -942 -1231 -661 -219 -965 -384 66 -248 105
1429 105 729 159 209 795 619 241 759 1012 -215 202 1190 145 -319 395 -196 -773 -139 -162 -1229 -591
1449 -591 -49 -1168 -749 -94 -765 -762 9 -73 -653 673 717 225 701 1239 878 597 1105 1236 489 1293 1144
1470 1144 262 624 998 -97 -261 246 -750 -934 -444 -444 -1484 -1039 -459 -1514 -1376 -260 -876 -1373 -52
1489 -52 -328 -914 353 400 -223 238 1083 361 210 1258 1032 187 1142 943 -75 686 692 148 -248 364
$$ packed form
1344H62k90p71k18M70l89m39L94k21l26K94O2l91J77L50l43J86N86K1M6K07K33
1365E00m2M7K88J3J40p9o1k31J29k13k69J57l45k81J66j69o76K70N8m72q7N59
1387e98l51L5M09j21R4N63Qj60L61J90m18P51M38k99m09N65l0l29K83j47n48j10
1409A77L67q21l18O29k94o62J50J04l03l50O86l07k89N70M42p46N81M50l14L53
1429A05O24n70N0N86j76l78N18K53j227M17R88j045m64P14n91n77O34k3j067O38
1449e91N42j119M19O55o71LP71q2n80J326M4m92M76N38l61k81N08J31p47Q04j49
1470A144q82L62L74j095j64N07r96j84M90%j040M45N80j055J38J116o16m97J321
1489e2k76n86J267M7o23M61Q45p22j51J048k26q45R55j99j018P61On44l96O12
$$ plain form
1509 364 -212 -594 131 -655 -704 -578 -252 -1108 -803 -232 -534 -685 138 -124 -249 353 429 254 283 605 416
1530 416 259 804 804 -66 660 675 -138 -60 359 -348 -631 -228 -571 -1056 -769 -575 -1021 -679 -462 -707 -557
1551 -557 -325 -502 -408 315 136 0 396 572 721 822 993 638 667 1024 873 565 679 763 81 318 86
1572 86 -367 -681 -142 -605 -953 -707 -652 -1268 -850 -433 -1009 -768 -4 -244 -412 227 -191 -179 211 710 120
1593 120 547 906 203 230 979 784 166 918 334 -322 338 234 -604 -287 -142 -598 -911 -78 -813 -992
1613 -992 -262 -500 -940 -312 -143 -767 177 643 -160 84 741 318 -31 702 548 45 810 889 15 146
1633 146 771 -253 -298 247 -670 -834 -211 -223 -1265 -841 -251 -992 -1059 -118 -603 -1059 -205 -115 -505 282 723
1654 723 -100 245 913 448 261 1048 952 175 983 1066 41 172 881 -20 -127 381 -452 -771 -112 -316
$$ packed form
1509C64n76l82P25p86m9J26L26q56L05N71l02j51Q23k62j25O02P6j75K9L22j89
1530D16j57N45%q70P26J5q13P8M19p07k83M03l43m85K87J94m46L42K17k45J50
1551e57K32j77R4P23j79j36L96J76J49J01J71l55K9L57j51l08J14Q4o82K37k32
1572H6m53l14N39m63l48K46N5o16M18M17n76K41P64k40j68O39m18J2L90M99n90
1593A20M27L59p03K7P49j95o18P52n84o56O60j04q38L17J45m56l13Q33p35j79
1613i92P30k38m40O28J69o24R44M66q03K44O57m23l49P33j54n03P65P9q74J31
1633A46O25j024m5N45r17j64O23j2j042M24N90p41o7R41m85m56Q54R0l90P87M41
1654G23q23L45O68m65j87P87r6p77Q08Q3j025J31P09r01j07N08q33l19O59k04
$$ plain form
1674 -316 -1099 -826 -238 -1144 -933 -179 -491 -670 -123 -224 -460 -52 531 29 181 877 505 283 1055 752
1694 752 452 508 1019 126 -117 626 47 -277 13 -158 -1006 -618 -453 -1171 -1015 -200 -844 -1116 -29 -261
1714 -261 -824 -82 283 -427 -270 815 65 129 1057 878 -140 1260 1110 -253 663 1084 -79 -80 738
1733 738 -6 -821 198 -22 -822 -452 236 -774 -990 58 -752 -996 163 -161 -1009 28 561 -379
1751 -379 7 1307 239 -382 1369 949 -297 1092 1144 -322 462 1200 -210 -428 771 -84 -1117
1768 -1117 281 -198 -1309 -418 223 -1178 -843 286 -707 -734 277 -33 -869 40 834 -178 233 1094
1786 1094 476 -17 1300 873 25 962 998 -341 424 810 -193 -201 695 -103 -770 -148 19 -1301 -753
1805 -753 99 -1082 -841 53 -529 -1146 83 335 -666 -14 817 -188 -195 1021 580 -52 890 897 -95 329
$$ packed form
1674c16p83K73N88r06K11P54l12j79N47j01k36M08N83n02J52O96l72k22P72l03
1694G52l00N6N11q93k43P43n79l24K90j71q48L88J65p18J56Q15o44k72J087k32
1714b61n63P42L65p10J57J085p50O4R28j79j018J400j50j363R16M21j163jQ18
1733G38p44q15J019k20q00L70O88j010k16J048q10k44J159l24q48J037N33r40
1751c79L86J300j068o21J751m20j246J389N2j466P84P38j410k18J199q55j033
1768a117J398m79j111Q91O41j401L35J129r93k7J011l10q36R09P94j012M11Q61
1786A094o18m93J317m27q48R37L6j339P65L86j003qQ96p98o67O22J67j320N48
1805g53Q52j181K41Q94n82o17J229K52j001O52Q31j005pJ216m41o32R42Pr92M24
$$ plain form
1825 329 815 -72 89 1071 339 -450 255 99 -977 -332 167 -941 -955 156 -628 -1068 163 -19 -989
1844 -989 -318 632 -332 -149 1111 -85 -406 966 1028 -54 808 1182 -333 187 1130 81 -480 868
1862 868 -166 -995 88 154 -1242 -510 307 -1064 -1112 229 -824 -1411 310 1 -871 -243 792 -444
1880 -444 115 1398 391 -169 1047 936 -134 1006 1307 50 264 1156 217 -235 859 236 -900
1897 -900 197 230 -1000 -683 135 -1128 -1044 29 -514 -1128 35 193 -762 43 785 -426 -114 791 369
1916 369 -232 572 844 -139 650 1074 374 4 610 269 -94 386 24 -709 177 -41 -582 -768 -348 -468
1936 -468 -861 -237 -70 -681 -477 243 -526 -171 679 220 -200 861 651 209 522 997 0 247 1032 247
1956 247 -330 488 446 -457 -153 23 -868 -663 -62 -817 -1136 -219 -259 -1126 -285 -43 -959 -514 409 -277 -266
$$ packed form
1825C29M86q87J61R82p32p89P05j56j076O45M99j108j4J111p84m40J231j82r70
1844i89O71R50r64J83J260j196l21J372O2j082Q62L74j515N20R43j049n61J348
1862H68j034q29J083O6j396P32Q17j371m8J341j053n87J721l09q72O28J035j236
1880d44N59J283j007n60J216j11j070J140L01j257K14Q92r39m52J094o23j136
1897i00J097L3j230L17Q18j263Q4J073n43o14J163J58r55Q05P42j211L12R05m22
1916C69o01Q04K72r83P89M24p00l70O06l41l63M80l62p33Q86k18n41j86M20j20
1936d68l93O24J67o11K04P20p69L55Q50m59m20J061k10m42L13M75r97K47P85p85
1956B47n77Q18m2r03L04J76q91K05O01p55l19R17m0q67Q41K42r16M45R23o86J1
$$ plain form
1977 -266 943 340 -271 893 989 189 686 928 369 158 1013 377 -192 844 269 -561 -15 19 -450 -577
1997 -577 51 -506 -825 -91 -221 -832 -5 139 -694 -26 456 -158 -40 731 229 28 877 463 96 444
2017 444 830 -62 287 735 177 -47 313 -31 -579 -118 -13 -746 -370 -478 -522 -574 -459 -290 -617 -263 123
2038 123 -234 112 102 90 71 492 586 300 495 762 451 502 435 523 230 96 190 108 -83 -107 -250 -370 -188
2061 -188 -440 -614 -602 -244 -475 -640 -420 -331 -193 31 -84 -92 203 202 279 203 568 541 233 486 534 287 588
2084 588 430 136 212 297 -41 -273 -173 -129 -505 -290 -436 -741 -359 -418 -830 -500 -187 -234 -356 -18 118 51
2106 51 359 364 125 248 604 298 442 519 488 242 673 318 82 171 -51 -238 -334 63 -366 -363 -533 -711 -307
2129 -307 -500 -506 -299 -415 -57 -102 -101 52 224 243 541 259 402 56 385 781 484 410 309 505 380 141
$$ packed form
1977b66J209o03o11J164R6q00M97K42n59k11Q55o36n69J036n75q30N46L4m69j27
1997e77O28n57l19P34j30o11Q27J44q33O68M82o14J18P71n02k01Q49m14l67L48
2017D44L86q92L49M48n58k24L60l44n48M61J05p33L76j08m4n2J15J69l27L54L86
2038A23l57L46j0j2j9M21R4k86J95K67l11N1o7Q8k93j34R4q2j91k4j43j20J82
2061a88k52j74J2L58k31j65K20Q9J38K24j15qK95jP7p6L65k7l08K53M8k47L01
2084E88j58k94P6Q5l38k32J00M4l76K15j46l05L82n9m12L30L13m7j22L38J36o7
2106E1L08Nk39J23L56l06J44P7l1k46M31l55k36Q9k22j87r6L97m29Lj70j78M04
2129c07j93oK07j16L58m5JJ53J72J9K98k82J43l46L29L96k97p4j01J96j25k39
$$ plain form
2151 141 253 -143 139 155 -439 -281 -274 -402 -639 -432 -390 -485 -488 -148 -330 -253 -202 -99 -147 332 150 63 349 712
2175 712 397 216 814 461 216 661 294 -158 221 200 -569 -224 35 -407 -665 46 -301 -949 -196 -233 -684
2196 -684 -432 190 -338 -330 335 9 -423 297 437 -66 540 611 226 287 779 314 102 690 267 -165 335
2217 335 194 -601 -172 105 -358 -451 5 -333 -903 -418 -186 -728 -153 56 -473 -304 240 -197 124 681
2237 681 520 40 361 631 260 374 849 253 0 429 255 -94 190 -32 -259 -349 -34 -596 -632 -192 -128
2258 -128 -584 -499 -19 -675 -348 191 -166 -453 338 237 -67 470 540 -98 456 643 608 100 759 420 -178
2279 -178 411 360 -529 -308 203 -458 -605 33 -425 -795 -69 -290 -870 -260 189 -423 -376 350 35 -527 533
2300 533 318 -302 470 534 186 268 742 102 -229 825 672 -189 542 661 -603 -71 381 -588 -628 133
$$ packed form
2151A41J12l96K82J6n94J58Pj28k37K07M2r5lL40j82P7N1J03m8M79j82q7K86L63
2175G12l15j81N98l53k45M45l67m52L79k1p69L45K59m42k58P11l47o48P53l7m51
2196f84K52O22n28QO65l26m32P20J40n03O06P1l85O1M92m65k12N88m23m32N00
2217C35j41p95M29K77m63r3M56l38n70M85K32n42N75K09n29J69N44m37L21N57
2237F81j61m80L21K70l71J14M75n96k53M29j74l49K84k22k27r0L15n62l6M40O4
2258a28m56Q5M80o56L27N39l57k87P91j01l04N37P0o38N54J87l5n08O59l39n98
2279a78N89n1q89K21N11o61j47O38m58l70P26k21n80O10M49o12M7P26l15n62J060
2300E33k15o20P72O4l48Q2M74o40l31J054j53q61P31J19j264N32M52r69m0P61
$$ plain form
2320 133 -429 -1086 -96 -358 -914 -441 343 -674 -201 661 -31 -394 766 285 -116 738 846 184 268 982
2340 982 -252 -164 786 319 -205 392 304 -692 44 468 -459 -540 171 -290 -888 44 -157 -934 -265 251 -483
2361 -483 -125 467 -225 -219 751 147 -299 568 720 -212 64 1088 -57 53 832 114 -431 310 268 -622
2381 -622 -1 175 -362 -580 4 -295 -826 -99 -139 -609 -36 409 -493 -327 545 -84 -259 630 566 -30 416
2402 416 611 120 151 865 71 -189 952 244 -494 -103 172 -677 -316 69 -322 -695 26 -290 -1087 -28
2422 -28 125 -759 -443 549 -301 -283 747 239 -270 857 547 -161 189 1052 252 111 789 109 -220 644
2442 644 303 -524 203 330 -668 -688 238 -313 -911 198 -58 -871 147 206 -839 -126 293 -531 -69 565
2462 565 26 -245 680 557 -286 648 851 -205 4 706 -258 -193 627 46 -728 325 170 -692 -167 317
$$ packed form
2320A33n62o57R90k62n56M73P84j017M73Q62o92l63J160m81m01Q54J08o62Q4P14
2340I82j234Q8R50m67n24N97q8r96P36M24r27q1P11m61n98R32k01p77O69N16p34
2361d83L58N92o92OR70o04m46Q67J52r32K76J024j145J10P79p18n45P41m2q90
2381f22O21J76n37k18N84k99n31P27m0m70N73M45r02J66Q72o29j75Q89o4n96M46
2402D16J95m91L1P14p94k60J141p08p38L91K75q49L61L85l91l73P21l16p97J059
2422b8J53q84L16R92q50J8J030n08n09J127l10p08L50Q63q00j41O78o80l29Q64
2442F44l41q27P27J27r98k0R26n51n98J109k56q13J018N9j045P13M19q24M62O34
2462E65n39k71R25j23q43R34K03j056K09P02r64O5Q20n81p74J053j55q62N25M84
$$ plain form
2482 317 -655 -813 -3 -302 -789 -59 8 -545 -178 507 -295 -220 758 300 -280 525 388 -302 406 828 -56
2503 -56 226 530 -66 -337 316 275 -370 21 99 -675 -238 227 -526 -730 -26 -224 -527 83 -2 -566 -126
2524 -126 461 -247 -30 564 300 -118 683 649 61 158 696 -53 44 320 95 -204 22 93 -514 13 151
2545 151 -710 -431 15 -405 -386 -70 117 -500 106 153 -329 67 284 -133 -44 883 218 4 467 630 35
2566 35 233 669 -216 74 511 163 -314 311 -160 -414 -227 154 -654 -377 222 -435 -879 -76 -164 -394 -1
2587 -1 306 -209 192 514 14 200 604 -20 259 452 522 172 503 495 -224 224 318 -42 -258 128 -96 -643
2609 -643 -153 41 -691 -384 164 -485 -424 148 -343 -254 244 26 -319 10 291 16 29 478 363 107 523
2630 523 314 -3 320 460 87 -8 112 39 -217 169 -144 -575 -30 -252 -718 -353 -45 -390 -337 -26 -492
$$ packed form
2482C17r72j58Q10k99m87P30O7n53L67O85q02P5R78m58n80Q05j37o90P08M22q84
2503e6K82L04n96k71O53m1o45L91P8p74M37M65p53k04P04j98l03O10q5n64M40
2524a26N87p08K17N94k64m18Q01l4n88R7N38p49R7K76k25k99K26P1o07N27J38
2545A51q61K79M46m20J9L16J87o17O06M7m82L96K17m17Q9R27o65k14M63J63n95
2566C5J98M36q85K90M37l48m77O25m71k54J87L81q08K77N99o57m44Q03q8k30L93
2587aL07n15M01L22n00J86M04o24K79J93P0l50L31qp19M48R4l60k16L86k24n47
2609f43M90J94p32L07N48o49O1N72m91Q9M98k18l45L29K81k75J3M49j15k56M16
2630E23k09l17L23J40l73r5J20p3k56L86l13m31N45k22m66L65L08l45N3L11m66
$$ plain form
2651 -492 -207 -11 125 -86 130 225 -104 297 406 -5 181 477 179 38 411 232 -90 117 67 -178 -90
2672 -90 76 -376 -461 -77 42 -585 -233 -300 -710 -47 -82 -103 -188 230 189 -157 350 317 89 201 533 121 -43
2695 -43 303 411 56 144 222 2 58 91 -319 -162 -123 -441 -395 -215 -423 -479 -68 -319 -419 -295 2 16 -309
2718 -309 7 223 -111 414 182 188 198 438 -24 321 360 38 -39 366 60 -252 32 69 -407 -81 98 -596
2740 -596 -258 -31 -423 -463 -228 -57 -523 -106 49 65 -121 288 169 220 567 458 -12 310 437 24 -92
2761 -92 452 98 13 411 17 -95 127 35 -426 -112 -157 -566 -204 51 -247 -339 -139 -86 -425 -7 267 -316
2783 -316 193 150 54 129 272 177 20 421 359 -199 113 425 -297 21 243 -331 -152 169 -261 -583 -77 16
2805 16 -460 -328 -37 -383 -117 -106 -8 -422 -43 151 -150 25 501 141 90 501 271 50 168 436 -31
$$ packed form
2651d92K85J96J36k11K16R5l29M01J09m11J86K96k98j41L73j79l22K07n0k45Q8
2672i0J66m52q5L84J19o27L52o7m10O63l5k1q5M18m1l46N07l3k28J12L32m12j64
2695d3L46J08l55Q8P8k20N6L3m10J57L9l18M6J80k08n6M11k51j00J24K97J4l25
2718c09L16K16l34N25k32OJ0K40m62L45L9l22p7M05l06l12K84L7m76L26J79o94
2740e96L38K27l92m0K35J71m66M17J55J6j86M09j19N1L47j09m70L22J27m13j16
2761i2N44l54q5L98l94j12K22r2m61L14m5m09L62K55k98r2K00N3l39M18K74n83
2783c16N09m3r6P5J43r5j57M01o2n58L12L12p22L18K22n74J79L21m30l22N06R3
2805A6m76J32K91l46K66J1R8m14L79J94l01J75M76l60n1M11k30k21J18K68m67
$$ plain form
2826 -31 138 349 123 -69 250 -198 -267 217 149 -436 -132 -309 -694 -174 91 26 -252 -24 -394 -335 40 73
2848 73 -104 185 465 -88 200 462 318 8 403 132 -2 253 323 -144 -63 280 -114 -450 42 -65 -188
2869 -188 -186 -63 -485 -213 109 -445 -27 25 -65 -394 156 601 -261 374 501 213 94 636 246 -6 323
2890 323 374 -12 116 238 -52 7 103 -162 -231 192 -374 -685 -143 -245 -368 -41 -74 -367 -329 81 -17 75 224
2913 224 52 -208 204 401 -46 83 347 195 178 227 218 99 244 77 -263 -156 426 -230 -452 -42 -167
2934 -167 -270 -90 -91 -381 81 176 -282 -109 22 41 -227 171 120 -21 378 566 80 40 275 -111 83 282
2956 282 238 -191 6 248 -95 -259 189 -153 -417 35 -176 -541 -140 -224 -624 -61 -27 -519 -45 164 -41
2977 -41 -189 419 85 -136 268 573 126 233 538 354 2 454 189 -353 18 56 -322 -98 200 -204 -238
$$ packed form
2826c1J69K11k26j92L19m48o9M84o8n85L04j77l85N20K65o5k78K28l70N9L75L3
2848G3j77K89K80n53K88K62j44l10L95k71j34K55P0m67Q1L43l94l36M92j07j23
2869a88KJ23m22K72L22n54M18N2r0l29N50M45q62O35J27k88j19N42l90k52L29
2890C23N1l86J28J22k90N9R6k65o9M23n66l11N42j02j23L27l3k93L8M10r8R2J49
2913B24j72k60M12J97m47J29K64j52j7M9rj19J45j67l40J07N82o56k22M10j25
2934a67j03J80jk90M62R5m58J73J31J9k68L98n1j41L99J88m86m0K35l86J94J99
2956B82m4m29J97K42l43j64M48l42k64M52k11l65M01q4m00N63L4m92M74K09k05
2977d1j48O08l34k21M04L05m47J07L05j84l52M52k65n42L71L8l78K24K98m04l4
$$ plain form
2998 -238 -209 -527 -524 -239 -204 -393 -159 305 -321 -315 120 284 -218 201 341 0 533 402 173 302 385 -197
3020 -197 -142 208 -10 -218 202 168 -206 80 110 -456 -448 92 -58 -460 13 96 -335 -36 434 -499 22 265
3042 265 143 -90 178 311 161 430 504 162 91 217 33 8 135 110 -255 112 62 -193 -318 8 -254 -356
3064 -356 -99 -160 -396 55 -165 -107 -243 250 -28 -283 190 197 10 9 557 7 229 357 218 -49 468 82
3086 82 208 372 -120 -170 119 148 -449 -183 274 -173 -96 153 -150 -289 -18 68 -472 -48 97 -89 -221 250
3108 250 143 -145 219 280 109 233 562 130 185 273 262 -7 318 91 -578 28 49 -224 -53 -136 -388 -234
3130 -234 -61 59 -226 -57 29 -207 150 -102 -181 176 262 248 137 214 300 72 356 291 101 188 197 178 -70 174
3154 174 -17 -52 -64 -33 -311 5 -128 -399 -242 196 -274 -16 68 -7 -228 -200 242 -82 -53 278 42 51 215
$$ packed form
2998b38K9l18LK85L5j89K34M64o26OM35J64n02M19J40l41N33j31k29J29Q3n82
3020a97N5L50k18k08M20l4l74K86L0n66QN40j50m02M73Q3m31K99M70r33N21K43
3042B65j22k33K68J33j50K69P4l42p1J26j84k5J27k5l65L67n0k55j25L26k62j02
3064c56K57o1k36M51k20N8j36M93k78k55M73Pj87jN48n50K22J28j39k67N17l86
3086H2J26J64m92n0K89K9n97K66M57m47P7K49l03j39K71Q6n40M24J45j86j32M71
3108B50j07k88L64O1j71J24L29m32N5Q8j1k69L25k27o69O06K1k73J71q3k52J54
3130b34J73J20k85J69Q6k36L57k52p9L57Q6j4j11P7Q6k28K84o5j90Q7Rj9k48K44
3154A74j91l5j2L1k78L16j33k71J57M38m70K58Q4p5k21K8M42l24K9L31k36RJ64
$$ plain form
3177 215 179 213 17 384 253 -53 241 93 -264 96 -32 -77 177 163 -295 -180 -120 -103 -258 -247 -179 -137 9
3200 9 -34 -26 326 139 100 61 320 188 207 477 86 37 424 334 187 203 6 26 -77 207 -35 -249 -44 -221
3224 -221 -154 -2 -175 -265 -192 -255 -230 -365 83 -102 -233 146 205 212 159 205 117 238 44 58 197 38 117 -164
3248 -164 2 73 -143 -3 -61 -47 102 2 -173 -388 -117 19 -265 -84 -261 30 -417 -111 109 -186 252
3269 252 95 -55 292 260 302 129 331 -135 137 -47 204 174 120 -193 26 -44 -214 -201 -188 -177 -327 -270 -319
3292 -319 -85 -281 62 -27 -15 -168 129 -126 166 178 -57 8 353 582 -42 342 154 183 128 393 138 -123
3314 -123 193 135 45 71 49 -117 63 -156 -360 -311 -167 -21 -398 -213 -61 -292 166 290 85 58 403 115
3336 115 186 128 327 96 181 185 365 88 244 -63 -10 -10 -10 -286 -24 88 -189 -193 -13 -100 -419 -69 -255 -344 -120
$$ packed form
3177B15l6L4j96L67j31l06K94j48l57L60j28m5K54j4m58J15O0J7j55J1O8M2J46
3200Im3QL52j87l9l9K59j32J9K70l91m9L87r0j47J6j97K0j03K84k42k14K05j77
3224b21O7J52j73r0P3o3K5j35M48j85j31L79N9Pn3M6q8J21j94J4J39j59P9k81
3248a64J66P1k16J40n8J4J49j00j75k15K71J36k84J81j77K91m47L06K20k95M38
3269B52j57j50L47l2M2j73K02m66K72j84K51l0n4l13K19p0j70J3J3J1j50N7m9
3292c19K34j96L43q9J2j53K97k55K92J2k35O5L45K29o24L84j88K9n5K65k55k61
3314a23L16n8r0K6k2j66J80k19k04M9J44J46l77J85J52k31M58J24k05k7L45k88
3336A15P1n8J99k31Q5MJ80k77J56l07N3%%k76K62J12k77mJ80q7l19L50j86q9K24
$$ plain form
3361 -120 -163 -143 48 65 100 -24 192 121 -10 187 96 51 339 177 148 73 169 216 -229 -121 -215 -203 -50 -35 -112
3386 -112 -410 -209 153 -491 -76 -218 -220 116 241 -161 218 151 143 134 232 146 120 129 66 76 281 156 112 31 109 -72
3412 -72 -171 3 -167 -154 229 -53 -255 -175 -187 -364 -147 83 70 -87 -45 -74 53 128 50 42 -47 320 299 14 138
3437 138 33 -164 268 224 -155 1 261 -72 -101 -1 -138 -132 -202 -129 -301 -229 -1 -262 -218 -15 -73 -212 59
3460 59 -167 29 -26 97 -180 116 584 209 176 333 222 -127 69 210 2 37 153 -76 32 -137 -90 -122
3482 -122 -125 -7 -221 -248 -77 -132 -16 -61 -126 106 88 -17 0 -55 27 113 15 124 -9 38 161 302 80 -168
3506 -168 178 -121 87 89 -158 -64 -8 -102 -255 -221 -266 -55 -215 16 -145 -54 40 -94 39 87 145 -125 86 277
3530 277 144 363 358 133 247 339 174 -7 95 117 62 95 -39 -70 75 -86 -103 -223 -90 11 -160 -64 -188
$$ packed form
3361a20m3K0J91J7L5j24K16p1j31J97r1m5K88j62k9p5R6M7m45J08r4J2J53J5p7
3386a12k98K01L62o44M15j42kL36J25m02L79o7qrR8q6k6Ro3J0K05j25m4q1P8j81
3412g2r9J74j70J3L83k82k02Q0j2j77K17K30j3j57M2k9J27P5p8qq9L67k1k85J24
3437A38j05j97M32m4l79J56K60l33k9J00j37Op0P3j72P2K28k61M4K03n8j39K71
3460E9k26J96n5J23k77K96M68l75l3J57j11l49J96J41k08L5J16k29J08j69M7l2
3482a22lJ18k14k7J71n5J16m5o5K32j8j05J7n5Q2Q6r8J09j33M7J23J41k22k48
3506a68L46k99K08Kk47R4N6r4j53L4m5K11j60K31j61R1R4j34J33M8N8k70K11J91
3530B77j33K19nk25J14R2j65j81J02K2n5L3j34l1J45j61j7j20J33J01j71R6j24
$$ plain form
3553 -188 -384 69 65 -12 -136 211 188 51 144 232 -2 -43 343 -37 -178 104 -61 34 115 361 -72 340 220
3576 220 -164 -40 -3 -190 -332 -34 237 -298 -316 -67 -17 -285 45 137 -36 58 265 123 110 297 -12 120
3598 120 171 108 -120 99 203 32 200 -18 -140 -252 -70 -166 -354 -209 -199 -86 -62 -286 194 -277 51 -89
3620 -89 91 144 -68 -29 20 58 38 192 308 -177 339 77 128 206 230 -110 -31 209 -159 -259 -10 82 -65 -260
3644 -260 -250 -151 48 206 -200 103 88 144 -18 29 155 74 144 127 281 47 235 263 90 223 179 64 24 222
3668 222 57 -60 134 74 59 -228 -101 -43 88 -163 381 -282 7 66 -76 -6 156 -177 -39 6 63 108 277
3691 277 56 104 136 -64 4 -157 321 -139 -153 13 46 -127 118 -35 -235 -89 -115 -268 -346 -149 -207 -85 -98
3714 -98 41 -54 188 -39 13 44 71 152 -159 174 190 123 162 209 -68 115 71 -235 208 -45 238 3 54 -93
$$ packed form
3553a88j96M53mp7j24L47k3j37R3Q8k34m1L86l80j41K82j65R5Q1K46m33M12j20
3576B20l84J24L7j87j42K98K71n35j8K49N0k68L30R2j73R4K07j42j3J87l09J32
3598A20N1o3k28K19J04j71J68k18j22j12J82r6j88J45J0J13K4k24M80m71L28j40
3620h9J80N3k12L9M9L8k0J54J16m85N16k62N1P8K4l40P9K40l68j00K49R2j47j95
3644b60J0R9J99J58m06L03j5N6j62M7J26q1P0j7J54k34J88K8j73J33m4j15m0J98
3668B22j65j17J94o0j5k87J27N8J31k51N44o63K89N9j42P0J62l33J38M5N7M5J69
3691B77k21M8L2k00O8j61M78m60j4J66L3j73K45j53k00J46k6j53p8J97n8J22j3
3714i8J39r5K42k27N2L1K7Q1l11L33J6o7L9M7k77J83m4l06M43k53K83k35N1j47
$$ plain form
3738 -93 -9 -37 -43 -437 129 -62 -34 34 -72 -37 11 -5 16 130 147 197 83 -37 233 271 -146 213 -143 56 14
3763 14 -141 23 245 28 -127 -168 78 -161 -163 -268 -12 -333 -5 -59 -227 91 -24 -18 14 103 228 30 291
3786 291 213 24 -6 -41 204 217 178 52 -127 39 78 -248 35 111 -89 12 88 -194 -255 24 -23 -63 152 12
3810 12 -173 -205 -100 -96 -120 -149 2 -71 163 237 8 92 204 307 188 404 -43 52 91 109 24 -26 -28 30 -231 29
3836 29 94 -344 -250 -303 -121 -213 -205 -63 55 12 48 -88 98 255 120 220 -133 50 197 309 37 290 149
3859 149 145 108 23 -191 -113 42 -152 -100 -123 -12 -350 -66 -17 -433 -68 -64 1 -95 162 105 46 -40 17 176 -112
3884 -112 316 10 67 47 176 99 -87 121 16 -1 -35 55 37 -119 53 -17 -195 -106 -159 -48 -111 -50 -398 95
3908 95 -97 -147 208 105 149 -7 -75 152 -32 274 -53 13 316 123 86 193 207 102 35 -115 146 -138 -56
$$ packed form
3738i3Q4k8ol94N66j91K8O8j06L5M8j6K1J14J7N0j14j20K70L8m17L59l56J99m2
3763A4j55J64K22k17j55m1K46k39kj05K56l21L28n4j68L18j15OL2Q9J25j98K61
3786B91p8j89l0l5K45J3l9j26j79J66L9l26K83P6k00J01P6k82o1K79m7m0K15j40
3810A2j85l2J05Mk4k9J51p3K34P4k29Q4J12J03j19K16m47R5L9J8q5n0kN8k61K60
3836B9O5m38R4n3J82r2QJ42J18m3L6j36J86J57j35J00l53J83J47J12k72K53j41
3859A49ml7q5k14P8J55j94N2k3J11l38K84M9m16L65MO5r6K57n7n9q6N7J59k88
3884a12M28l06N7k0J29p7j86K08j05j7l4R0j8j56J72p0j78Q9n3J11o3O1l48M93
3908I5j92n0L55j03M4j56o8K27j84L06l27O6L03j93l7J07J4j05o7j50K61k84Q2
$$ plain form
3931 -56 -171 -10 -204 -155 -274 -227 -84 -52 -212 -403 -155 -38 -3 -33 57 156 59 -58 84 -59 71 152 84 307
3955 307 26 -122 46 101 -13 -163 -233 -24 -14 150 -264 81 73 -101 261 -94 -212 -66 -78 52 -133 -16
3977 -16 77 -31 83 192 164 -89 248 194 95 -195 218 -80 -13 225 8 20 142 28 11 -16 122 -147 -87
4000 -87 -142 -180 -80 -39 -217 -211 219 118 34 -113 -163 106 47 98 -151 89 376 -28 211 134 144 -148 154 266
4024 266 -155 -40 -80 -39 -124 143 183 -337 -211 342 -119 -230 94 97 -286 85 75 -338 281 82 -246 195
4046 195 164 -37 -221 233 195 -122 256 104 -88 -26 171 -85 -106 -267 -85 -84 -209 -28 192 211 -70 -83 -278
4069 -278 235 -102 -86 2 186 -204 -87 90 -206 203 307 78 62 76 182 153 54 57 -222 6 5 -4 -187 61
4093 61 -85 -265 107 6 50 -78 -37 -6 57 215 -99 -190 61 123 -232 -26 12 301 -43 308 315 65 72 77 -107
$$ packed form
3931e6j15J61j94M9j19M7J43L2j60j91K48J17L5l0R0R9r7j17J42j43J30Q1o8K23
3955C07k81j48J68N5j14j50p0K09J0J64m14L45qj74L62l55j18J46j2J30j85J17
3977a6R3j08J14J09k8k53L37n4r9k90M13k98O7K38k17J2J22j14j7k7J38k69O0
4000h7n5l8J00M1j78OM30j01q4j47n0K69n9N1k49K40K87m04K39p7J0k92L02J12
4024B66m21J15m0M1q5K67M0n20J26N53m61j11L24Ll83L71j0m13O19j99l28M41
4046A95l1k01j84M54l8l17L78j52j92O2J97k56k1j61J82Jj25J81K20J9k81j3j95
4069b78N13l37J6Q8J84l90J17J77k96M09J04k29j6J4J06k9r9Lk79K28jrj83K48
4093F1j46j80L72j01M4j28M1L1O3J58l14r1K51O2l55K06L8K89l44L51Pk50PNj84
$$ plain form
4118 -107 281 67 -117 -20 -21 -215 -132 151 61 -366 -131 -159 -61 -74 -104 -22 95 74 -271 -246 158 208 -202 7
4142 7 140 35 166 7 -113 9 136 154 -24 167 26 -239 33 -97 162 -281 65 -13 93 -114 57
4163 57 -214 -80 -15 -46 -43 92 -326 -32 28 350 -223 149 229 108 172 189 113 138 157 -60 63 151 83 -142 104
4188 104 -194 -241 -196 -106 -195 -184 -347 -78 -104 -73 -59 84 -106 -148 -45 -285 61 77 151 -76 75 -158 184 259
4212 259 72 142 41 -3 -209 171 304 -46 31 14 -47 -119 -24 -147 -208 -62 -209 -150 -192 -200 -126 -49 47 -24 -210
4237 -210 292 1 88 88 -55 96 -67 134 -18 37 179 213 -82 -7 -135 32 48 -38 -197 -225 -16 -84 -7 -397
4261 -397 21 -3 -48 34 -48 -52 -22 114 -56 83 -111 -7 164 229 167 227 129 206 -32 -145 -77 120 32 -81 1
4286 1 -289 -91 -1 -35 -124 -244 -68 -92 -145 -140 -345 -80 61 -210 -14 155 76 287 -25 134 164 162 123 324 35
$$ packed form
4118a07L88k14j84R7jj94Q3K83r0m27K35k8R8j3l0Q2J17k1l45K5M04N0m10K09
4142GJ33j05J31j59j20J22J27J8j78J91j41k65K72j30K59m43L46p8J06k07J71
4163E7k71J34O5l1LJ35m18K94O0L22n73L72Q0j21O4J7p6K5J9k17J23Q8o8k25K46
4188A04k98m7M5R0q9J1j63K69k6L1J4J43j90m2J03k40L46J6P4k27J51k33L42P5
4212B59j87P0j01m4k06L80J33l50P7j7o1p2R5j23o1J46j47N9m2qP4P7R6p1j86
4237b10N02k91Q7%j43J51j63K01j52N5J42L4k95P5j28J67J6q6j59k8K09o8P7l90
4261c97M18k4m5Q2q2mL0J36j70J39j94J04J71O5o2O0r8P7k38j13O8J97q8j13Q2
4286Ak90J98R0l4q9j20J76k4n3Nk05K65J41k71J96J69p9K11l12J59L0kl9K01k89
$$ plain form
4311 35 107 2 147 -256 105 -205 90 -109 20 81 -68 16 38 -185 -12 -127 -72 52 -135 132 11 -97
4333 -97 97 65 164 63 -123 280 -21 -102 -40 -119 270 -3 83 -12 1 -83 -60 151 -194 -67 28 -18 -48 -13 -54
4358 -54 41 -89 -92 -18 -142 156 -149 -112 -35 115 -127 -23 292 -122 -1 153 -91 -108 99 -28 211 127 74
4381 74 -56 -133 -180 -12 -61 -127 -206 -8 -36 -21 -180 -54 -108 -1 -218 -61 227 33 33 90 61 10 232 45 65
4406 65 45 19 -33 -49 -138 34 17 -273 38 -23 -203 16 -149 -104 -463 -40 -3 -197 169 99 -130 -225 -163 -112 -75
4431 -75 48 186 39 244 205 -3 131 -4 175 28 -158 -161 14 -147 109 26 -11 -7 -283 55 -34 110 -113
4454 -113 -128 -222 -305 251 167 -124 46 -165 -39 36 70 152 314 71 120 89 67 6 -37 -92 -44 -130 -14 178 -72
4479 -72 -15 -13 -226 -117 229 -5 198 -60 -148 -60 205 -104 -129 107 -68 160 51 125 87 65 175 -104 -275
$$ packed form
4311C5P2j05J45m03L61l10K95j99J29O1j49Q4K2k23J73j15N5J24j87K67j21j08
4333i7J94l2R9j01j86M03l01q1O2p9L89k73Q6r5J3q4K3K11l45J27R5m6l0L5m1
4358e4R5j30lP4j24K98l05L7P7J50k42J04L15m14J21J54k44j7K07j27K39q4n3
4381G4j30p7m7J68m9o6p9J98k8J5j59J26n4J07k17J57K88j94%N7k9n1K22j87K0
4406F5k0k6n2j6q9J72j7k90L11o1j80K19j65M5l59M23L7j94L66p0k29r5O2N1L7
4431g5J23J38j47K05l9k08J34j35J79j47j86lJ75j61K56q3l7Mk76L38q9J44k23
4454a13j5r4q3N56q4k91J70k11J26P5L4Q2J62k43M9l1k2o1m3n5M8q6J16J92k50
4479g2N7Kk13J09L46k34K03k58q8Q8K65l09k5K36j75K28j09P4l8k2J10k79j71
$$ plain form
4502 -275 -172 -18 -120 -6 -100 7 250 210 -110 -160 -123 -7 -111 -84 -161 130 5 -106 -146 -210 76 -153 -137
4525 -137 -194 -148 5 -87 -47 296 -125 -25 -41 58 -39 25 101 -150 -22 -50 222 34 29 -78 -194 -69 -120 10
4549 10 79 36 138 -122 -74 29 -100 106 -164 160 -19 29 325 326 -96 243 283 -172 237 -45 -32 141 77
4572 77 130 119 -138 -75 -8 -171 45 -70 -87 -127 -174 108 23 36 -137 -29 12 148 189 -54 164 37 155 154 123
4597 123 44 106 30 -156 -110 135 83 97 232 177 28 -128 93 37 11 -280 -250 -201 -155 -309 51 -255 -61 -20
4621 -20 68 17 -38 -122 169 222 8 31 -89 332 86 43 148 7 -329 100 117 72 -76 -195 24 220 -15
4644 -15 8 144 -24 54 -148 21 53 -250 66 62 -80 5 190 22 -47 -36 35 21 174 84 -77 -48 10 81 -258
4669 -258 193 -99 -277 56 -5 -66 -254 208 22 -125 212 -337 -35 -200 -268 229 313 163 51 163 159 134
$$ packed form
4502b75J03J54j02J14r4J07K43m0l20n0L7J16j04K7p7K91j25j11m0o4K86k29J6
4525a37n7M6J53r2M0L43m21J00j6R9r7O4P6k51J28k8K72j88nj07j16J25n1J30
4549A0O9m3J02k60M8J03j29K06k70L24j79M8K96Jm22L39M0m55M09k82J3J73o4
4572G7N3j1k57O3O7j63K16j15j7m0m7K82q5J3j73J08M1J36M1k43K18j27J18jl1
4597A23p9O2p6j86M6K45n2J4J35n5j49j56K21n6k6k91L0M9M6j54L60l06J94M1
4621b0Q8n1n5q4K91N3k14K3j20M21k46m3J05j41l36M29J7m5j48j19K19J96k35
4644a5K3J36j68P8k02J69L2l03L16mj42Q5J85j68o9J1P1j4J53r0j61K9N8P1l39
4669b58M51k92j78L33o1o1j88M62j86j47L37n49L02j65o8M97Q4j50j12J12mk5
$$ plain form
4691 134 -101 11 234 48 262 101 -51 214 -3 86 -148 61 -207 -48 -165 -29 24 102 -40 -127 -92 207
4713 207 -149 -7 -53 -80 171 -212 142 -85 1 -7 248 164 113 90 85 -40 62 177 -66 355 139 -37 8 -312
4737 -312 -275 53 -87 -81 40 72 -148 -195 -122 -264 -90 -163 53 -236 0 227 100 22 148 194 -120 29 146
4760 146 69 -24 252 127 89 151 -63 43 -152 82 -119 -7 -200 8 -41 -5 -162 14 -35 -81 -8 -27 261
4783 261 -43 34 158 38 -67 214 206 -112 -47 -26 36 -26 131 75 -43 55 -98 -102 -95 198 -217 -242 138 36 -105
4808 -105 210 3 -13 45 -55 -207 207 39 68 193 124 145 79 98 190 108 75 -59 -221 -26 39 13 -142 44
4832 44 174 -50 17 -231 -88 203 23 18 102 -266 -153 -130 -200 -8 -290 72 193 -57 245 141 -61 -61 144
4855 144 -35 103 211 -42 -97 -29 104 -35 -116 -74 -47 -79 -142 -333 -182 -143 61 -13 -60 -83 -93 70 25 -93
$$ packed form
4691A34k35J12K23j86K14j61j52K65k17Q9k34K09k68J59j17J36N3P8j42q7L5K99
4713B07l56J42m6k7K51l83L54k27Q6qK55q4n1k3nj25J02J15k43M21k16j76M5l20
4737c12L7L28j40OJ21L2k20m7P3j42J74p3K16k89K36K27j27p8J26M6l14J49J17
4760A46p7r3K76j25l8O2k14J06j95K34k01J12j93K08m9L6j57J76m9m6P3j9K88
4783B61l04P7J24j20j05K81ql18O5K1O2o2J57n6j18R8j53mPK93m15k5L80j02j41
4808a05L15k07j6N8j00j52M14j68K9J25o9K1o6J9R2q2l3j34j62J95O5k6j55J86
4832D4J30k24O7k48J43K91j80nQ4l68J13K3p0J92k82L62J21k50L02j04k02%K05
4855A44j79J38J08k53n5O8J33j39q1M2K7l2o3j91J51L9K04p4m7k3j0J63m5j18
$$ plain form
4879 -93 39 196 109 -133 130 172 47 -377 -66 131 -120 -61 -67 -148 133 -133 68 58 -140 -161 -219 64 74 -38
4903 -38 -124 46 64 -73 -30 52 196 41 -14 -131 110 -147 -74 -66 57 -53 -80 191 -95 90 73 52 -280 63
4927 63 -49 -23 7 66 109 49 -141 -90 138 -158 -125 68 74 42 82 31 23 -49 -39 176 -120 7 -264 92 78 77 170
4954 170 18 231 52 -40 193 -171 -136 326 -65 1 -117 -150 -212 156 -91 -34 -117 -57 162 -65 -48 91 -76
4977 -76 -84 40 34 4 108 115 -30 199 196 10 248 175 50 112 45 5 -100 0 -80 11 -27 -296 -270 -154 -21 -134
5003 -134 -122 -82 -255 -132 -181 -196 -66 47 53 139 -210 -128 -45 110 -134 143 11 -51 147 -71 -97 -25 189 14
5027 14 -123 -6 -120 10 -32 -7 191 -253 220 -48 16 -25 -51 -124 -22 -73 15 117 35 -50 172 51 -59 -112
5051 -112 42 16 -117 212 -32 75 -140 125 147 -101 74 -246 -178 197 142 -15 -125 288 99 -22 69 64
$$ packed form
4879i3J32J57q7k42K63M2j25m24L11J97k51N9oq1K81k66K01j0j98k1n8K83J0j12
4903c8q6J70J8j37M3Q2J44j55n5j17K41k57P3QJ23j10k7K71k86J85j7k1l32L43
4927F3j12K6L0N9M3o0j90N1K28k96L3J93Ol2M0n1qp2J0K15k96J27k71L56j4jR3
4954A70j52K13j79r2K33l64L5M62l91O6j18l3o2L68k47N7q3O0K19k27J7J39j67
4977g6qJ24ol0J04Pj45K29lj86K38p3j25O2o7m0j05J00q0R1l8k69K6J16J33j13
5003a34J2M0j73J23m9j5J30J13OQ6l49Q2Q3J55k44K77j32o2J98k18k6P2K14j75
5027A4j37J17j14J30m2K5J98m44M73k68O4m1k6p3J02n1Q8J02q2q5K22j21j10n3
5051a12J54k6j33L29k44J07k15K65K2k48J75l20O8L75n5j57j10M13j89j21R1n
$$ plain form
5073 64 -67 -56 -104 -56 90 180 213 144 31 -8 2 -16 123 8 104 -5 -39 6 109 82 111 -185 -210 107 8 151
5099 151 -111 -33 -35 -57 189 148 -140 -150 229 140 -208 36 32 55 261 -135 161 -86 110 -48 -89 -80 -261 93
5123 93 -84 -129 -154 -74 -93 -33 -93 96 156 -214 -36 18 7 -68 150 115 -138 109 128 12 -100 36 -27 70 -121
5148 -121 -65 -30 311 43 -69 87 91 25 -259 -101 -94 -85 242 -201 -131 102 -29 144 92 -131 -25 -54 49 138
5172 138 96 51 190 111 47 -60 -62 -57 156 118 -151 27 -113 124 -3 209 -30 -13 -214 -262 -241 54 -209 -43
5196 -43 -37 -88 -4 -86 74 68 -114 237 69 78 95 -5 190 -37 -122 -14 -77 168 60 -213 88 46 17 -35 19 -204
5222 -204 -91 195 -89 76 51 -69 -130 -105 207 118 66 112 107 -196 128 36 -86 52 150 83 -48 31 -45 -110 12
5247 12 183 -34 78 16 -31 94 64 175 -193 34 -34 88 228 34 50 61 -136 -8 -18 -50 225 -7 -179
$$ packed form
5073F4j31J1m8M8J46R0L3o9j13l9J0j8J39j15R6j09l4M5J03k7K9k96k5L17r9J43
5099A51k62P8kk2K46m1k88j0L79q9l48K44mK3K06l96K96k47J96j58m1Rj81L54
5123I3j77m5k5Q0j9O0o0J89O0l70J78N4j1p5K18l5k53K47J9j16j12J36o3R7j91
5148a21N6L5L41k68j12J56Mo6k84J58PRL27m43P0K33j31J73n2k23J06k9J03Q9
5172A38m2m5J39p9o4j07kNK13l8k69J78j40K37j27K12k39J7k01m8K1K95k63J66
5196d3On1Q4q2J60oj82L51j68RJ7j00J95k27q5J08o3K45j08k73L01m2k9n2N4k23
5222b04J13K86k84J65k5j20o1K5L12q9n2M6nl03L24r2j22J38R8o7j31P9p6o5J22
5247A2J71k17J12o2m7J25l0J11l68K27o8J22J40j94J6J1j97J28j0l2K75k32j72
$$ plain form
5270 -179 133 33 -99 -171 -105 86 10 24 148 117 -86 -137 -72 79 41 -63 -103 -3 337 -76 -51 -108 86 87
5294 87 218 -107 -257 128 326 54 -92 75 185 -105 60 18 -40 188 -12 -41 -22 44 -166 -277 23 33
5316 33 4 -285 -148 26 -88 134 -13 -93 -49 -21 -74 -18 216 -84 -389 216 146 -105 102 -60 -65 94 3 14
5340 14 -124 47 10 72 14 -151 130 133 13 127 -112 13 88 -152 -92 -19 -56 -22 138 198 -98 92 -1 -68 -57
5365 -57 138 -83 -63 73 290 106 -35 217 -318 -66 276 305 -30 27 92 58 -99 -86 -69 -150 -114 -85 76 -255
5389 -255 -34 40 -21 8 -78 63 69 -98 -130 173 -105 99 -38 20 170 -136 25 229 -78 74 -40 -21 23
5412 23 -53 -151 8 28 -203 38 35 -14 -221 232 -35 113 -50 -101 -122 -65 -99 98 133 92 157 33 36 190 46
5437 46 16 -107 202 -194 -10 33 -21 143 245 -1 13 -304 24 -55 211 -92 88 110 -86 -202 219 -4
$$ packed form
5270a79L12j00j32p2O6J91p6J4J24l1k03n1O5J51l8j04m0J00L40m13K5n7J94J
5294H7J31l25j50L85J98k72j46J67J10k90J65m2n8K28k00k9J9O6k10j11L00J0
5316C3k9k89J37J74j14K22j47q0M4K8n3N6K34l00l05O05p0k51K07j62nJ59r1J1
5340A4j38J71l7O2n8j65K81Lj20J14k39J25P5k40O0P3l7L4J60O0k96J90r3o7J1
5365e7J95k21K0J36K17j84j41K52n35K52L42K9l35N7O5l4j57J3J7q1L6K9J61l31
5389b55K21P4o1K9q6J41Oj67l2L03k78K04j37N8J50l06J61K04l07J52j14J9M4
5412B3p6r8J59K0k31K41lm9k07M53k67J48j63n1k1N7l4J97L5m1O5j24LJ54j44
5437D6l0j23L09l96J84M3n4J64J02k46J4l17L28p9K66l03J80K2j96j16M21k23
$$ plain form
5459 -4 213 131 -206 -57 38 -129 159 223 15 -106 58 -28 -370 155 97 153 -31 47 -179 200 -97 -155 -32
5482 -32 80 -8 21 -149 63 -24 -193 70 -155 91 -23 197 -275 373 153 -13 81 -101 3 188 147 27
5504 27 -127 39 56 -51 199 52 -199 -114 -71 91 109 -21 -170 44 2 -334 7 -28 -122 -58 -22 -83 156 -23
5528 -23 232 46 274 -111 118 -41 215 76 82 172 -127 136 -114 -116 90 28 -86 -104 -306 -231 -129 -51 -82 -141
5552 -141 -54 75 -77 78 -52 -57 -117 149 106 -25 208 -147 89 -14 48 -89 16 -72 -74 -65 -21 -106 -10 131 -7
5577 -7 -43 20 -59 -79 -148 73 -194 -20 178 43 67 -213 -267 -92 -24 -127 134 -62 -12 124 -23 99 -21 66
5601 66 -55 61 -147 75 -161 -142 17 7 168 -16 96 -44 -205 120 -21 24 29 25 25 -130 -366 221 -30
5624 -30 125 -26 43 228 -10 37 103 83 40 119 16 96 30 -60 -78 203 -98 -291 89 -137 20 -125 -74 87
$$ packed form
5459dK17q2l37J49R5j67K88O4k08j21J64q6l42N25n8N6j84P8k26L79k97n8J23
5482c2J12q8K9j70K12q7j69K63k25K46j14K20m72O48k20j66R4j82J04J85m1j20
5504B7j54J66J7j07K50j47k51Q5M3J62J8j30j49K14m2l36L41l5r4O4L6o1K39j79
5528b3K55j86K28l85K29j59K56j39OR0k99K63k50kK06o2j14j8k02P5J02P8l1n9
5552a41Q7J29j52J55j30no0K66m3j31K33l55K36j03O2j37J05q8kRM4q5R6J41j38
5577gl6O3p9k0o9K21k67J74J98j35K4k80n4J75O8j03K61j96N0J36j47J22j20Q7
5601F6j21J16k08K22k36J9J59j0J61j84J12j40j61L25j41M5Nm%j55k36N87k51
5624c0J55j51O9J85k38M7O6k0m3P9j03Q0o6r0j8K81l01j93L80k26J57j45N1J61
$$ plain form
5648 87 -25 -36 -240 148 226 183 149 59 101 -36 -216 -185 82 216 105 43 -170 -42 -45 -225 228 16 -107 112
5672 112 86 -136 24 101 34 36 -47 -170 -215 258 -79 114 77 79 117 -121 64 -32 -71 162 -89 131 -207 -95
5696 -95 -49 -57 178 -34 -39 -102 -106 -48 29 97 -163 107 121 -8 -144 -91 391 112 52 125 -163 332 -185 -335 103
5721 103 180 216 17 -84 27 -124 -108 60 10 177 144 3 184 -32 56 -108 8 -173 -8 115 32 -397
5743 -397 85 -175 -43 -253 -39 -32 16 159 24 16 102 233 135 91 -29 167 -141 -88 -119 -31 -236 94 -15 326
5767 326 111 -105 -121 -116 -38 -139 -55 96 -170 137 -73 -87 -197 82 70 -50 147 296 42 -209 201 191 -4
5790 -4 -30 -6 131 226 149 -243 203 -47 -23 -132 -272 -170 -141 -21 -147 -122 -82 69 -181 -48 -157 80 -249
5813 -249 75 148 14 133 -58 156 49 -2 26 -39 -53 -26 -3 163 -107 -152 -120 -20 110 148 -167 19 -102
$$ packed form
5648H7j12j1k04L88P8m3l4r0M2j37j80L1K67J34j11o2k13J28lj80M53k12j23K19
5672A12k6k22J60P7o7Kq3j23m5M73l37J93l7KL8k38J85r6l9K33k51K20l38J12
5696i5M6qK35k12no3mN8P7O8k60K70J4j29j36N3M82k79o0P3k88M95n17j50M38
5721A03P7L6j99j01J11j51J6J68n0J67l3j41J81k16Q8j64J16j81J65J23q3m29
5743c97M82k60J32k10K14PM8J43j35qQ6J31r8m4j20J96l08N3l1Q8k05L30j09L41
5767C26k15k16j6NP8j01Q4J51k66L07k10j4j10K79j2j20J97J49k54k51M10j0j95
5790dk6K4J37R5p7l92M46k50K4j09j40J02K9J20j26K5M0J51k50J33j09K37l29
5813b49L24P3j34J19j91K14j07n1K8o5j4K7K3J66k70m5L2J00J30L8l15J86j21
$$ plain form
5836 -102 -105 108 196 -121 62 -155 70 -119 -160 27 83 -116 -216 97 87 -90 199 30 94 254 155 -19 149
5859 149 103 31 63 -44 83 -46 -12 175 -9 32 10 56 -53 -42 147 -88 83 -109 341 82 229 57 140
5882 140 191 58 227 194 163 49 231 36 -195 -170 -29 -1 -182 -20 1 62 200 27 -160 -213 -167 -109 -159 -114
5906 -114 158 -71 -220 32 -83 32 306 -125 -11 -112 -49 61 -15 -29 -23 -72 -52 185 -199 94 115 55 46 -31
5930 -31 -34 -216 -125 116 145 -41 221 -21 -34 204 -116 -35 -97 -55 -32 245 -59 37 65 -78 -140 190 -31 24 101
5955 101 -31 -124 -187 -226 248 120 -7 -7 -326 -197 25 -14 -87 -181 170 -188 -117 -146 4 -217 4 -88 91 132
5979 132 126 110 20 54 -195 91 194 -82 113 -82 -134 52 34 -76 -92 85 -100 -106 64 109 56 7 0 -135 -47
6004 -47 -2 -20 54 36 -119 188 -48 132 -20 106 272 -166 -106 -66 -5 0 -74 48 118 -113 -35 -38 -218 -94 264
$$ packed form
5836a02lK13Q8l17J83k17K25j89m1J87N6j99j00L13j0j77K89j69O4J60r9j74J68
5859A49m6p2L2j07J27j29L4J87j84M1k2M6j09J1J89k35J71j92M50k59J47j72Q3
5882A40N1j33J69l3l1j14J82j95k31K5J41K8j81J62K1O1J38j73j87n3M6N8n0M5
5906a14K72k29j49K52j15J15K74m31J14j01O3J10p6j4Om9K0K37l84K93K1o0rp7
5930c1lj82R1K41K9j86K62k42j3K38l20Q1o2M2K3K77l04R6K8j43o2L30k21N5P7
5955A01j32r3o3l9M74j28j27%l19J29K22l9p3r4L51l58P1k9J50k21K21r2J79M1
5979A32oj6r0L4k49K86J03k76J95j95n2J86j8j10j6J77j85oJ70M5n3m9pj35Q8
6004d7M5j8P4j8j55L07k36J80j52J26J66m38O0M0O1Np4J22P0k31P8lj80J24L58
$$ plain form
6029 264 -50 -95 -127 -163 19 -99 -166 -3 6 -228 106 52 -105 -105 -61 181 -37 29 115 -168 364 118 79 98 69
6054 69 161 152 -83 163 22 -101 85 182 -61 -281 -24 -116 -32 -71 -4 62 195 -64 -74 95 8 -202 -28 -139
6078 -139 -82 251 45 -34 50 61 -157 -55 -30 121 120 65 102 111 -101 -158 52 100 6 60 51 -70 41 -170 -79 -181
6104 -181 64 159 -47 126 2 280 30 -33 -28 209 -12 -72 35 67 -70 -70 -6 -75 87 -15 -96 -126 151 112
6128 112 -74 2 -7 105 -117 -115 -178 -166 -122 107 118 316 -81 -99 47 255 355 4 -174 49 84 233 99 101
6152 101 62 -208 223 106 -140 -177 11 -144 -26 80 52 -49 151 -120 -127 -4 58 69 -28 -167 -85 -127 -2
6175 -2 51 -162 -148 82 5 25 -8 -115 46 -18 51 49 -89 -8 -32 -127 242 131 41 -22 -6 144 84 27 71 112 89
6202 89 136 -11 6 -41 -37 -227 64 -17 209 121 88 166 -98 -19 -76 177 80 -178 50 -352 -143 239 145 7 -130
$$ packed form
6029B64l14m5l2l6J82j18o7J63Rk34L34n4j57%M4K42k18O6Q6k83N32k46l9J9k9
6054F9R2rk35K46j41j23J86R7k43k20K57r2Q4l9O7O6J33k59j0J69q7k10J74j11
6078a39N7L33k06p9Q4J1k18J02K5J51jn5L7Rk12n7K10M8r4N4rj21J11k11R1j02
6104a81K45R5k06J73j24K78k50o3NK37k21o0J07L2j37%O4o9J62j02q1l0K77l9
6128A12j86P6rJ12k22Ko3J2M4K29J1J98l97j8J46K08J00l51j78K23L5J49j34K
6152A01l9k70M31j17k46l7J88j55J18J06k8j01K00k71pJ23O2J1r7j39Q2m2J25
6175bN3k13J4K30p7K0l3j07J61o4O9kj38Q1k4r5L69j11r0o3J6J50o0n7M4M1k3
6202H9M7j47J7m7Mj90K91q1K26q8l3P8k64P9n7K53r7k58K28m02K09L82r4j38j37
$$ plain form
6227 -130 111 -215 -101 115 235 -52 -82 -14 -58 40 368 37 -18 12 203 -39 43 -79 -21 173 26 -59 -130
6250 -130 -73 -55 -184 -57 -55 -39 156 -116 -136 -151 217 56 201 -52 19 108 17 116 155 -39 111 135 137 8 81
6275 81 -141 -27 181 -151 -8 -7 182 82 136 131 216 -61 -108 62 -195 17 13 -151 133 -296 11 -84 126 -147
6299 -147 259 54 29 117 37 -50 27 -16 166 104 -112 -76 182 -75 51 -94 -57 -68 -210 -65 -53 -62 6 -75 1
6324 1 157 42 -50 -96 96 14 -131 -23 -167 -91 57 10 29 -144 74 -15 132 96 -40 -129 99 -129 149 -172
6348 -172 -431 10 81 29 -123 -202 76 190 16 -109 -155 68 -61 192 -43 -70 178 45 93 161 34 -134
6370 -134 -173 129 -49 155 368 -109 89 -250 139 -136 -48 45 -25 -272 -58 -30 -232 118 30 -104 314 139
6392 139 135 218 40 43 8 81 -57 249 27 -160 1 58 134 -140 143 -138 122 -73 72 75 -210 -53 219 -82
$$ packed form
6227a30K41l26J14K16J20k87l0O8m4R8L28l31n5L0J91k42Q2j22N8J94j47q5p1
6250a30N7J8j29J27KJ6J95k72k0j5L68j61J45k53P1Q9r1R9L9j94J50K4Kj29P3
6275H1k22J14K08l32J43JJ89j00N4nQ5k77m7J70k57K12mj64K84m29L07r5K10k73
6299a47M06k05k5Q8q0q7P7m3J82o2k16L6K58k57J26j45L7j1j42J45J2rO8q1P6
6324AJ56j15r2m6J92q2j45J08j44P6J48m7J9j73K18q9J47l6j36q9K28k28K78l21
6348a72k59M41P1n2j52p9K78J14j74j25m6K23j29K53k35k7K48j33M8O8j27j68
6370a34l9L02j78K04K13m77J98l39L89k75Q8R3p0k47K14K8k02L50q8j34M18j75
6392A39mQ3j78Ll5P3j38L06k22j87J61N7P6k74K83k81K60j95J45Lk85J57K72l01
$$ plain form
6416 -82 -122 125 -55 -53 -90 -71 -128 -82 -68 199 -40 112 105 80 159 56 29 321 -114 15 -30 180 -37 135 149
6441 149 -87 235 4 -33 -83 82 -112 74 -29 110 -11 -15 141 -74 104 -25 28 33 70 29 -74 -21 137
6464 137 94 115 230 135 -50 -34 213 -13 107 49 108 -46 146 -53 -70 -29 62 284 -26 -115 159 -20 -208
6487 -208 -220 -140 -52 42 -56 -103 -166 11 -61 56 70 307 105 265 -174 -12 -16 97 137 -94 9 -252 -96 -29
6511 -29 -62 173 183 185 83 151 98 -111 -27 -211 126 2 -18 256 122 7 39 -77 164 247 -101 -38 -111 -96 -55
6536 -55 111 68 25 239 -186 127 157 -254 40 -88 37 -58 60 -4 -174 -166 84 -42 -152 55 -61 0 57
6559 57 66 162 4 -150 186 -121 6 241 100 99 11 -155 -90 20 -138 124 3 93 27 -169 41 174 45
6582 45 218 -224 -193 -23 -20 -65 -10 -15 2 228 -88 1 -199 77 -161 -55 121 -113 144 106 126 226 6 -81
$$ packed form
6416h2m0K47j80Kl7J9n7M6J4K67k39J52pk5P9j03k7K92m35J29m5K10k17J72J4
6441A49k36L22k31l7n0J65j94J86j03J39j21mJ56k15J78j29N3NL7m1j03N3J58
6464A37m3K1J15r5j85J6K47k26J20n8N9j54J92j99j7M1R1K22l10q9K74j79j88
6487b08j2Q0Q8R4r8m7o3J77p2J17J4K37k02J60m39J62mJ13M0k31J03k61J56O7
6511b9l3K35J0Kj02O8n3k09Q4j84L37j24k0K74j34j15L2j16K41Q3l48O3p3J5M1
6536e5J66m3m3K14m25L13L0m11K94j28J25r5J18o4j70QK50j26j10K07j16O1N7
6559E7RR6j58j54L36l07J27K35j41jq8j66O5J10j58K62j21R0o6j96K10J33j29
6582D5J73m42L1J70Lm5N5nJ7K26l16Q9k00K76k38J06J76k34K57l8K0J00k20q7
$$ plain form
6606 -81 -87 55 -74 45 -315 -59 17 54 -148 27 80 13 -198 79 -6 49 32 -277 5 70 -57 55 -114 142
6630 142 -77 -51 9 -50 -248 -180 32 -15 -6 67 -86 87 -93 89 178 92 97 -142 -95 -194 -96 -208 53 48 119 -175
6656 -175 58 60 -103 -71 69 -104 55 -1 -238 -149 -51 -46 79 18 -194 146 -97 -184 -139 -177 -11 117 80 -87
6680 -87 125 106 -91 114 115 93 -56 -76 -64 -40 95 70 -137 -162 94 10 139 243 -309 69 162 88 19 155 -105
6705 -105 -107 -55 165 -77 200 -165 28 123 168 -8 -73 -115 56 -69 65 20 -14 95 -145 -165 -146 -83 147 185
6729 185 8 163 218 123 271 3 97 44 -143 -165 284 -59 -119 358 -105 137 101 119 130 27 -25 162 -83
6752 -83 2 93 170 -143 24 14 191 178 -41 -206 92 -47 161 56 131 9 -70 -74 -53 59 -73 -157 19 -254
6776 -254 -6 69 -66 -24 -366 -183 53 111 160 4 -27 -323 -28 -91 -155 245 172 -16 -106 177 -61 -83 -259
$$ packed form
6606h1oJ42j29J19l60K56P6L7k02J75N3o7k11K77q5N5j7l09K82O5j27J12j69K56
6630A42k19K6O0n9j98O8K12m7RP3j53J73j80J82Q9q6Nk39M7r9R8j12K61nP1k94
6656a75K33Kj63L2J40j73J59n6k37Q9R8NJ25o1k12L40k43q7M5l8J66J28l7j67
6680h7K12j9j97K05Jk2j49k0J2K4J35k5k07k5K56q4J29J04n52L78R3p4o9J36k60
6705a05kN2K20k42K77l65J93R5M5j76o5m2J71j25J34m5l4J09k40k0J9O3K30L8
6729A85j77J55N5r5J48k68R4n3j87k2M49l43o0M77m63K42l6J8J1j03n2J87k45
6752h3Q5R1P7l13J67j0J77j3k19j65K98j39K08j05P5j22p9mK1J12j32q4J76k73
6776b54K48P5j35M2l42J83K36N8M9j56l1k96K95o3o4M00p3j88r0K83k38k2j76
$$ plain form
6799 -259 -18 -92 27 -73 61 104 40 -212 43 -194 8 -242 73 -90 -130 141 122 -11 -132 -47 52 31 -109
6822 -109 -45 -121 -135 -143 30 148 27 -130 -258 -191 63 125 34 -65 15 -25 145 -166 46 6 87 406 53 138 236
6847 236 113 -9 -63 -187 170 -30 74 52 140 -31 76 94 125 -41 9 102 -267 153 -126 -114 7 -3 58
6870 58 -84 -158 -51 77 59 16 -116 114 92 177 -114 237 -21 -3 -169 -60 -75 -44 -125 -88 -132 -12 165 75
6894 75 -50 117 123 99 130 231 -58 -87 -186 139 -255 83 176 16 133 -4 43 -54 14 184 -31 73 -45 -234
6918 -234 -95 -20 -34 -267 -209 -198 306 53 -125 -6 117 78 76 254 43 249 134 -92 74 -105 182 -104
6940 -104 112 136 -41 -32 -124 133 -152 60 -252 264 326 38 76 -125 53 -249 74 9 -102 52 -5 -7 185
6963 185 -58 -35 27 30 -110 -179 -76 -181 39 105 63 -165 177 28 255 183 170 2 -40 84 -87 -170 -24 -75
$$ packed form
6799b59K41p4J19j00J34M3o4k52K55k37K02k50L15j63m0K71j9j33j21Q5R9k1j40
6822a09O4p6j4qJ73J18j21j57j28O7K54O2r1r9Q0m0J70l11K12m0Q1L19l53Q5R8
6847B36j23j22n4j24L57k00J04k2Q8j71J07J8L1j66N0R3l69M20k79J2J21j0O1
6870E8j42p4J07J28j8m3j32K30k2Q5k91L51k58J8j66J09j5L1q1L7m4J20J77r0
6894G5j25J67Ok4L1J01k89k9r9L25l94L38R3j60J17j37M7r7O8J70k15J04j18j89
6918b34J39P5j4k33N8J1N04k53j78J19J23l9kJ78k11K06j15k26J66j79K87k86
6940a04K16K4j77Rr2K57k85K12l12N16O2k88L8k01J78l02L23o5j11J54n7kJ92
6963A85k43K3O2Lj40o9J03j05K20O6m2k28L42j49K27p2j3j68m2J24j71q3J46n1
$$ plain form
6987 -75 263 286 -28 -245 168 -73 -131 -244 -50 37 254 96 -80 112 -233 24 -26 -196 -100 172 108 -59
7009 -59 185 86 9 -26 53 -186 -79 -142 -54 -24 116 33 -26 41 6 57 -336 -150 59 56 46 -2 133 -13 -17 154
7035 154 -214 358 161 -40 -54 65 -52 -47 15 22 -22 152 -47 -129 -49 126 34 -1 95 -112 -55 -160 130 258
7059 258 -91 -64 -63 31 -155 -155 -240 22 -144 -154 -85 79 -158 168 -153 -307 17 260 137 -131 127 183 -113
7082 -113 53 -211 -47 72 93 10 2 133 163 6 12 17 -49 -112 -10 85 -71 -56 120 -170 11 55 93 -61 72
7107 72 93 -134 207 23 -96 132 -26 -66 156 150 60 48 53 -64 -143 -74 -207 193 106 76 -118 71 246 -48
7131 -48 -66 182 51 174 189 -109 1 -210 1 -14 -167 -89 -94 162 139 71 195 -32 186 195 190 17 -142 -131 66
7156 66 -129 -28 70 43 204 41 179 -177 -240 -41 -17 47 57 30 61 139 99 174 74 -51 -2 -140 11 -24 -40
$$ packed form
6987g5L38K3l14k17M13k41n8j13J94Q7K17j58j76J92l45K57n0j70R6K72o4j67
7009e9K44r9p7l5P9k39J07o3Q8L0J40q3n9O7l5N1l93J86K09lj0m8J35j46mJ71
7035A54l68N72j97k01j4J19j17NO2Pm4J74j99q2Q0J75r2l5R6k07N7j05K90J28
7059B58l49K7JR4j86%q5K62j66j0O9J64k37L26l21j54L24K43j23k68K58N6k96
7082a13J66k64J64J19K1q3qJ31L0j57ONo6o3J02R5j56J5J76k90J81M4L8j54J33
7107G2K1k27L41j84j19K28j58m0K22or0j2Nj17p9O9j33M00q7l0j94J89J75k94
7131d8j8K48j31J23J5k98J10k11K11j5j53P8nK56k3o8J24k27K18Rnj73j59J1J97
7156F6j95J01R8k7J61j63J38l56o3J99K4O4J0k7L1P8m0P5j00j25M9j38J51l5j6
$$ plain form
7181 -40 70 27 71 258 -89 -22 202 201 55 -210 -134 -20 -108 244 33 -104 -53 -101 151 154 123 15 -111 172
7205 172 99 -177 148 22 -28 -36 58 -19 -55 191 76 22 -7 -269 40 -54 -123 237 0 -122 25 148 155 27
7229 27 7 125 -40 180 39 -155 -14 202 -85 -15 260 -186 136 -106 10 -156 41 -112 -15 -71 22 4
7251 4 -196 21 -164 -42 -121 10 -6 267 -51 268 -274 -231 173 50 -68 80 39 -68 253 105 -90 205
7273 205 -93 -199 -108 -126 116 -53 5 -109 129 19 -11 78 120 145 -25 121 -17 -27 -270 112 -108 -129 -29
7296 -29 127 -201 22 57 -151 130 -7 -26 -308 -19 58 -186 -65 205 56 -61 -37 173 -49 13 -91 2
7318 2 -59 -18 170 69 -163 -38 185 267 77 -76 -2 -119 -174 -13 156 117 -184 -8 38 -81 35 -36 -134 -76
7342 -76 -21 -4 -117 -109 -68 77 54 -12 179 -5 117 -253 -276 42 -67 -113 174 104 181 -45 -10 68 38 125 270
$$ packed form
7181d0J10m3M4J87l47O7K24jj46k65P6J14q8L52k11j37N1m8K52Ll1j08j26K83
7205A72p3k76L25j26n0qR4p7l6K46j15n4k9k62L09r4o9L60k37j22J47J23Pj28
7229B7k0J18j65K20j41j94J41K16k87P0K75m46L22k42J16j66J97j53R7n6R3j8
7251Dk00K17j85J22p9J31j6K73l18L19n42M3M04j23j18J48m1j07L21j48j95K95
7273B05k98j06R1j8K42j69N8j14K38j10l0Q9M2K5j70J46j38j0k43L82k20k1J00
7296b9J56l28K23L5k08K81j37j9k82K89P7k44J21K70j49j17K4K10k22O2j04R3
7318Bo1M1J88j01k32J25K23Q2j90j53P4j17n5J61J69l9l01J76M6j19J16p1r8N8
7342g6N5J7j13QM1J45k3o6J91j84J22l70k3L18j09m6K87p0P7k26L5P8l0Q7J45
$$ plain form
7367 270 106 -20 -9 -47 -240 -253 41 -110 -286 101 38 -89 -76 -89 -105 -106 -58 -25 -245 -107 184 153 134 14
7391 14 15 -54 36 -138 -19 3 -19 56 -189 -20 81 -132 -73 -31 98 59 -1 -6 127 -31 187 -215 95 47 219
7416 219 104 70 233 247 21 -41 268 1 174 29 -21 298 26 119 59 113 -90 99 -127 -106 -254 -30 -101
7439 -101 -42 83 44 -36 -173 1 -250 -147 -169 106 220 -337 -251 33 -253 121 93 103 19 -122 104 181 92
7462 92 -125 -177 185 -9 139 -109 103 89 117 11 -109 1 138 -276 60 -9 -157 -118 18 34 104 128 -6
7485 -6 -66 -7 -42 67 -88 -124 171 -179 -35 -73 126 43 -83 28 25 -132 164 2 143 3 55 16 -76 -61 34
7510 34 36 -75 -126 56 -69 -56 109 -115 -86 91 67 105 103 158 -102 11 -2 118 -162 81 142 116 78 -160 -273
7535 -273 -23 15 30 22 -172 134 -111 17 -93 11 -213 161 76 -146 72 57 -108 25 -11 -76 154 171 -18
$$ packed form
7367B70j64j26J1l8j93j3K94j51j76L87o3j27J3j3j6jM8L3k20J38K91l1j9j20
7391A4Jo9R0j74J19K2k2P5k45J69J01k13N9M2J29l9o0nJ33j58K18m02L10m8J72
7416B19j15l4J63J4k26o2L09k67J73j45n0L19k72R3o0N4k03J89k26K1j48K24p1
7439a01N9J25l9q0j37J74k51J03k2K75J14n57Q6K84k86L74k8J0q4j41K26P7q9
7462I2k17n2L62j94J48k48K12j4K8j06j20J10J37m14L36o9j48L9J36J6P0K4j34
7485fo0N9l5J09j55l6K95l50J44l8J99q3j26J11lj57K96j62J41j40N2l9r2J5R5
7510C4Kj11n1J82j25J3J65k24K9J77k4L8kN5k60J13j3J20k80K43O1k6l8k38j13
7535b73K50L8J5qj94L06k45J28j10J04k24L74q5k22K18j5j65J33l6o5K30J7j89
$$ plain form
7558 -18 34 58 90 58 94 -37 208 -66 -152 -28 -214 73 48 -43 -23 -35 209 102 -63 -44 25 7 -45 -96 62
7583 62 -53 175 64 164 67 232 -25 134 156 64 -31 -219 -43 79 -139 206 -96 137 -21 14 -264 -178
7605 -178 -59 -110 73 147 41 -17 -209 155 -164 -129 10 -34 -86 -72 -26 -80 116 36 -97 145 -107 -211 238
7628 238 225 -136 -153 -129 -187 121 -102 3 65 -48 185 -195 54 42 200 101 21 -296 163 -133 -129 -29 -45 56
7652 56 -130 4 -8 -77 147 33 -57 218 -29 75 -76 184 91 -205 45 -16 62 86 107 279 215 -49 98
7675 98 -119 -30 85 -115 -112 -159 80 -32 141 -145 2 -136 142 -18 121 -213 92 -3 -132 5 -131 17
7697 17 -109 83 19 -18 -115 -142 -239 -7 -209 157 129 -304 -192 -48 -206 -266 129 65 -49 -220 -9 94 -91
7720 -91 -44 138 8 -192 62 142 -2 -193 29 -70 35 19 -53 -48 89 211 106 110 0 -12 -197 124 -40 -54
$$ packed form
7558a8N2K4L2l2L6j31K45k74q6J24j86K87k5r1K0j2K44j07j65J9O9j8n2n1J58
7583F2j15K28j11J00r7J65k57J59K2r2r5j88J76J22k18L45l02K33j58L5k78Q6
7605a78J19n1J83P4j06n8j92L64l19L5J39m4n2J4M6n4J96q0j33K42k52j04M49
7628B38j3l61j7K4n8L08k23J05O2j13K33l80K49j2J58r9q0l17M59k96MJ00j6J01
7652E6j86J34j2o9K24j14r0K75k47J04j51K60r3k96K50o1P8K4K1J72o4k64J47
7675I8k17Q9J15k00Lm7K39j12J73k86J47j38K78j60J39l34L05r5j29J37j36J48
7697A7j26J92o4l7r7k7r7K32k02L66k8m33J12J44j58o0L95o4j14j71K11J03j85
7720i1M7J82j30k00K54Q0j44j91K22r9J05j6p2NJ37J22j05Mj10j2j85L21j64j4
$$ plain form
7744 -54 -26 -60 200 67 51 -44 34 -117 -170 -71 123 -136 -56 271 -145 142 76 -32 -53 142 -127 -25 -85 -211
7768 -211 112 168 -192 77 -119 56 -22 -138 -68 -58 317 -101 -24 -206 -102 -72 -322 116 47 17 99 -13 -14 -89
7792 -89 175 -86 -17 -99 55 -39 -154 96 35 97 139 -130 53 107 -155 -42 59 25 -166 -106 26 -29 28 178
7816 178 -170 153 57 81 111 -18 184 43 35 107 61 117 126 -12 -39 64 -208 -97 -151 -174 -104 -24 113 169 -83
7841 -83 140 -20 202 45 -33 112 126 85 310 -72 -59 -231 2 55 -136 -63 -43 -112 -145 -250 -258 93 -284 -113
7865 -113 92 -189 -15 -97 23 -6 -19 -22 136 -18 -64 219 6 -126 -105 58 31 51 -37 -22 39 -49 124 27 -138
7890 -138 124 -242 115 95 245 71 -202 -11 -150 153 189 130 -170 187 169 14 -1 -102 -76 156 55 139
7912 139 124 75 0 211 -208 44 -35 100 196 -47 111 80 -221 -372 -9 77 141 108 -155 169 -22 131 13
$$ packed form
7744e4K8l4K60j33j6r5P8j51n3R9J94k59Q0L27m16K87o6j08k1J95k69J02o0j26
7768b11L23N6l60K69j96J75p8j16P0J0L75m18P7j82J04L0k50M38o9l0Q2j12jp5
7792h9K64k61O9q2J54r4j15K50o1O2M2k69J83N4k62J13J01l4j91O0J32n5N7J50
7816A78l48L23r6K4L0j29K02j41qP2m6N6Rj38k7J03k72J11n4k3P0Q0J37N6k52
7841h3K23j60K22j57p8J45J4m1K25l82J3j72K33N3j91P3K0o9l3j05qL51l77J71
7865a13K05k81J74q2J20k9j3lJ58j54m6K83k13j32K1J63k7K0q8J5O1q8J73r7j65
7890a38K62l66L57k0J50j74k73J91j39L03L6n9l00L57j8j55j5j01K6K32j01Q4
7912A39j5m9p5K11m19K52p9J35R6k43J58l1l01j51L63Q6O4l3k63L24j91J53j18
$$ plain form
7935 13 -131 18 -5 -184 4 14 -51 27 -217 164 90 115 -157 115 130 60 -38 26 -125 100 -19 165 -9 84
7959 84 225 120 -67 -94 -124 259 146 -32 -229 41 14 329 14 -6 106 61 66 -91 -2 127 109 30 -31 13
7983 13 -18 80 23 -51 27 136 -28 75 142 -151 -86 -143 -334 83 -170 58 -128 31 -127 60 306 -128 -225
8006 -225 7 -29 46 232 -192 -7 66 6 -164 103 -2 -63 15 -97 59 -42 -5 36 -197 -31 84 94 -171
8029 -171 168 -30 -78 -136 -110 -200 -140 -172 124 51 51 103 243 7 162 95 -96 197 -318 -121 -205 -71 21 44 -48
8054 -48 153 -18 48 -201 -38 263 -80 -111 86 -36 36 -116 -49 101 85 0 148 201 -71 76 21 -142 -94
8077 -94 -75 230 32 -175 379 -3 -150 -79 33 59 -23 464 -163 21 -100 12 265 -173 96 16 -45 -22 166
8100 166 69 -94 -162 5 56 64 126 340 -187 65 205 -208 -123 209 -121 13 203 -183 38 27 -31 68 -82
$$ packed form
7935A3j44J49k3j79J88J0o5P8k44L81p4K5k72K72J5p0r8O4j51K25j19J84j74R3
7959H4J41j05j87k7l0L83j13j78j97K70k7L15l15k0J12m5Nj57Q9J29j8p9o1M4
7983A3l1R8n7p4P8J09j64J03O7k93O5n7j91M17k53K28j86J59j58J87K46m34r7
8006b25K32l6P5J86m24J85P3o0j70K67j05o1P8j12J56j01L7M1k33J66J15J0k65
8029a71L39j98m8n8K6r0O0l2K96p3%N2J40k36J55o7j91K93n15J97q4J34R2K3r2
8054d8K01j71O6k49J63L01l43l1J97j22P2j52O7J50j6q5J48N3k72J47n5j63M8
8077i4J9L05j98k07N54l82j47P1J12K6q2M87o27J84j21J12K53m38K69q0o1K3J88
8100A66r7j63o8J67N1QO2K14n27K52J40m13Q5L32l30J34J90l86K21j1n8R9j50
$$ plain form
8123 -82 -73 -31 38 -152 -32 -98 4 -130 28 107 51 74 -22 -256 -52 38 -85 -50 -27 29 -12 -162 -42 249 -105
8148 -105 56 24 228 -112 -25 51 73 -148 -215 -165 144 43 135 92 60 292 221 -150 68 107 -110 82 -92 40
8172 40 211 29 155 14 -114 31 -61 -126 -2 -129 -125 -125 118 68 18 -108 89 -75 30
$$ packed form
8123h2RM2O9j90J20o6J02j34J58P9n6K3r6k34K04R0j23L5K3N6m1j50J20K91l54
8148a05J61l2K04l40Q7P6K2k21o7N0L09j01R2m3l2K32p1l71K18L9k17J92j74J32
8172D0J71j82J26j41j28J45r2o5J24j27M%K43n0n0j26J97j64J05
8191C0
$$ Imaginary data points
##PAGE= N=2
##DATA TABLE= (X++(I..I)), XYDATA
$$ plain form
0 0 0 0 0 0 0 0 0 0 8 -8 8 -8 16 -16 16 -24 32 -40 48 -56 64 -80 96 -112 128 -152 176 -202 233 -269 307
31 307 -352 398 -450 509 -573 645 -722 807 -901 1000 -1112 1235 -1368 1512 -1672 1845 -2036
48 -2036 2242 -2471 2719 -2997 3303 -3646 4027 -4456 4946 -5507 6160 -6927 7847 -8971
62 -8971 10382 -12220 14709 -18297 23935 -34127 58326 -239503 -42186 246422 -331041 -40778
74 -40778 185570 -291665 -252073 212741 -70651 -185578 120569 -10995 -193975 74796
84 74796 41692 -126871 37544 100993 -46007 10684 47433 -15916 13830 40423 13755 34220
96 34220 -2267 -344 66962 12210 -34432 48628 5475 -40447 70970 35011 -75633 29727
108 29727 35150 -89579 20687 83726 -77727 -30327 74610 -67477 -67254 71723 -26625
$$ packed form
0@%%%%%%%%Qj6J6j6K4l2L2m0N6p2Q8j04J20j44J76k08K40k80L28l78M35n02N76
31C07o59P50q48R59j082J218j367J529j708J901k112K347k603K880l184L517l881
48b036M278m713N190n716O300o949P673q483R402j0453J1667j3087J4774j6818
62h971J9353k2602K6929l3006M2232n8062R2453k97829J97317K88608n77463K90263
74d0778K26348m77235L9592M64814k83392j14927L06147j31564j82980K68771
84G4796l3104j68563J64415O3449j47000N6691L6749o3349K9746K6593k6668K0465
96C4220l6487J923O7306n4752m6642Q3060m3153m5922J11417l5959j10644J05360
108B9727N423j24729J10266O3039j61453M7400J04937j42087K23J38977r8348
$$ plain form
119 -26625 -74801 51390 -13660 -92824 16822 -3152 -83427 10527 19007 -74500 -21925 10026
131 10026 -56857 -18982 19718 -32245 -17322 4694 -30656 -4214 13705 -20625 14174 29086
143 29086 -23603 7887 37563 -15921 12975 53160 -16687 -8810 53096 -5492 -14346 58444
155 58444 -1166 -44354 43534 17756 -49332 28227 27218 -62242 -2283 37581 -47873 -18170
167 -18170 41985 -38702 -44583 35065 -13119 -44174 31818 6213 -52985 9619 25536 -32134
179 -32134 2536 32470 -21573 -15011 26817 -192 -10890 21360 8835 -13991 4046 11899
191 11899 -1891 3229 12026 -364 -8742 3489 10241 -413 -1000 8025 -2237 -8337 11109 8929
205 8929 -8622 5286 10043 -9418 2433 14884 -7342 -2244 14980 -7187 -9241 14291 -2756
$$ packed form
119b6625m8176J26191o5050p9164J09646j9974q0275R3954Q480r3507N2575L1951
131A0026o6883L7875L8700n1963J4923K2016l5350K6442J7919l4330L4799J4912
143B9086n2689L1490K9676n3484K8896M0185o9847P877O1906n8588q854P2790
155E8444n9610m3188Q7888k5778o7088P7559j009q9460N9959L9864q5454K9703
167a8170O0155q0687n881P9648m8184l1055P5992k5605n9198O2604J5917n7670
179c2134L4670K9934n4043O562M1828k7009j0698L2250j2525k2826J8037P853
191A1899j3790N120Q797j2390q378J2231O752j0654n87R025j0262o100J9446k180
205H929j7551J3908M757j9461J1851J2451k2226N098J7224k2167k054K3532j7047
$$ plain form
218 -2756 -13881 11374 -1034 -21308 5674 5256 -21982 -1223 7552 -22559 -7716 11752 -16304
231 -16304 -12238 12669 -10780 -15246 14437 789 -13231 11950 4800 -13417 12848 16628 -7093
244 -7093 7749 13559 -8608 7063 22379 -2642 -380 15813 -4044 -4475 15571 -1380 -10887
257 -10887 10657 3070 -13665 1873 1138 -16272 617 9771 -12419 -9227 4216 -9915 -8864
270 -8864 9754 -91 -10697 4648 4935 -8667 1749 9488 -4538 -1600 12331 1242 -7728
283 -7728 6214 4120 -7631 5127 10434 -8502 -7608 5173 -4609 -8569 7007 -906 -16081 -1235
297 -1235 6168 -9228 -4442 3833 -9818 -7157 9770 1326 -9027 1444 1738 -3970 5351 7740
311 7740 -3045 -105 6317 422 -586 2759 -301 1918 5113 -666 -2681 -1719 -3942 1796 4685
$$ packed form
218b756j1125K5255j2408k0274K6982m18k7238K0759Q775l0111J4843J9468k8056
231a6304M066K4907k3449m466K9683j3648j4020K5181p150j8217K6265L780k3721
244g093J4842N810k2167J5671J5316k5021K262J6193j9857m31K0046j6951r507
257a0887K1544p587j6735J5538p35j7410J6889R154k2190L192J3443j4131J051
270h864J8618r845j0606J5345K87j3602J0416P739j4026K938J3931j1089q970
283g728J3942k094j1751J2758N307j8936Q94J2781r782l960J5576p913j5175J4846
297a235P403j5396M786Q275j3651K661J6927q444j0353J0471K94n708R321K389
311G740j0785K940O422n895j008L345l060K219L195n779k015R62k223N738K889
$$ plain form
326 4685 -4950 -5570 1409 -3155 -2615 5799 -2209 -8245 5650 5596 -5292 4314 7593 -6183 3284
341 3284 14640 -2110 -2040 13476 1799 -4898 12221 4741 -9567 8148 11215 -10090 -1716 9819
355 9819 -10339 -7062 13440 -5325 -16371 6837 1369 -15582 4446 8089 -16291 -3802 15759
368 15759 -6585 -10405 13420 -308 -12964 14754 12574 -14766 2246 16196 -7946 -2530 18555
381 18555 -3537 -14442 13356 6995 -16759 2870 10041 -15299 -4730 14283 -11466 -17105 10855
394 10855 1051 -15691 5076 5000 -17954 -1238 15502 -7441 -9060 12403 409 -9294 12104
407 12104 7724 -11727 3430 13992 -4076 -2651 10576 -1878 -7543 8667 5701 -8293 227
420 227 5675 -5869 -4457 5253 -1682 -6856 2562 3205 -5947 -2333 5426 -553 -2692 5951 3405
$$ packed form
326D685r635o20O979m564N40Q414q008o036J3895n4j0888R606L279j3776R467
341C284J1356j6750P0J5516j1677o697J7119p480j4308J7715L067k1305Q374J1535
355I819k0158L277K0502j8765j1046K3208n468j6951K0028L643k4380J2489J9561
368A5759k2344l820K3825j3728j2656K7718k180k7340J7012J3950k4142N416K1085
381A8555k2092j0905K7798o361k3754J9629P171k5340J0569J9013k5749n639K7960
394A0855r804j6742K0767p6k2954J6716J6740k2943j619K1463j1994r703K1398
407A2104m380j9451J5157J0562j8068J425J3227j2454n665J6210k966j3994Q520
420B27N448j1544J412R710o935n174R418O43r152L614P759n979k139Q643k546
$$ plain form
435 3405 -4380 2942 7748 -369 848 8347 2273 -2384 6649 5550 -4610 945 5862 -3482 -2638
450 -2638 5819 -3013 -8792 1298 383 -8025 -1620 1853 -8574 -6403 3666 -3343 -7733 3977
464 3977 1495 -7402 1964 6040 -5457 51 9998 -440 -3854 8959 4110 -4698 7178 7742
478 7742 -6734 1337 10575 -3641 -3575 8864 -1902 -8410 6716 3052 -9828 1387 5232 -8639
492 -8639 -3064 7089 -4726 -5813 6954 -332 -7404 4022 3956 -5459 1434 5327 -3096 -1391 5402
507 5402 24 -3853 2668 1949 -3783 -288 1593 -3832 -3188 717 -2362 -4706 -1305 -937 -4081 -2722
523 -2722 -739 -3119 -2471 749 -784 -1865 358 616 1361 2692 1310 1608 2913 1648 3056 4133
539 4133 1083 1603 4829 1414 -819 3542 1467 -3659 1472 2514 -5010 -1782 1860 -6181 -5030
$$ packed form
435C405p785P322M806q117J217P499o074m657R033j099j0160N555M917r344Q44
450b638Q457q832n779J0090r15q408O405L473j0427K171J0069p009m390J1710
464C977k482q897R366M076j1497N508R947j0438l414J2813m849q808J1876N64
478G742j4476Q071R238j4216O6J2439j0766o508J5126l664j2880J1215L845j3871
492h639N575J0153j1815j087J2767p286p072J1426o6r415O893L893q423J705O793
507E402n378l877O521p19n732L495J881n425O44L905l079k344L401L68l144J359
523b722J983k380O48L220j533j081K223K58P45J331j382K98J305j265J408J077
539D133l050N20L226l415k233M361k075n126N131J042p524L228L642q041J151
$$ plain form
554 -5030 2359 -4004 -6710 706 -2834 -7965 -385 961 -6025 -1646 2848 -3506 -2754 3119 -952
569 -952 -2295 3652 2259 -2821 182 1930 -875 684 2936 -400 -2563 659 371 -2985 -1133 493
585 493 -2455 -1421 1604 -1616 -3957 -102 196 -2031 1260 1978 -2857 -676 2723 -1080 72 4479
601 4479 531 -888 2941 -57 -2923 1691 1337 -2111 294 1112 -3486 -3340 -529 -3057 -2903 -165
617 -165 -2316 -4659 -3421 -2513 -2365 -1622 -1595 -468 -1323 -1342 1451 256 -2000 2525 4093 128 2072
634 2072 4390 -1030 -329 6551 1838 -1527 5002 2393 -4134 2037 3576 -4716 -935 4597 -3476
649 -3476 -4391 2436 -2402 -6098 1502 1650 -5221 -623 2853 -3952 -2336 4134 297 -2531 3785 3145
665 3145 -1944 1903 5260 -448 -103 5295 1562 -2335 3402 2594 -3891 749 3590 -3061 -2544 3318
$$ packed form
554e030P389o363k706P416l540n131P580J346o986M379M494o354P52N873m071
569i52j343N947j393n080L003J748k805J559K252l336k163L222k88l356J852J626
585D93k948J034L025l220k341L855K98k227L291P18m835K181L399l803J152M407
601D479l948j419L829k998k866M614l54l448K405Q18m598J46K811k528J54K738
617a65k151k343J238R08J48P43K7J127q55j9K793j195k256M525J568l965J944
634B072K318n420P01O880m713l365O529k609o527O171J539q292L781N532q073
649c476r15O827m838l696P600J48o871M598L476o805J616O470l837k828O316o40
665C145n089L847L357n708L45N398l733l897N737q08o485M640K841o651N17N862
$$ plain form
681 3318 -2313 -5537 1777 -137 -5652 737 2794 -5514 -2449 4237 -2538 -2782 5455 589 -3860
696 -3860 4751 3679 -3913 1932 6035 -2446 -475 6126 -1042 -4324 4928 1585 -5548 1474 2879
711 2879 -5442 -1547 3504 -4403 -5090 3079 -419 -5594 1617 2194 -5044 -121 4937 -1966 -2263 5562
727 5562 1764 -2670 3991 4464 -1959 1828 6662 -388 -1639 5018 1676 -3668 2474 3206 -4171 -1220
743 -1220 3187 -3147 -4865 2216 -699 -6072 38 1614 -5615 -2424 3453 -2772 -3744 3906 1050
758 1050 -4232 2283 4026 -2509 223 5985 -519 -1929 5535 2195 -3700 2945 3409 -3790 -178
773 -178 3969 -2888 -3631 2803 -813 -5241 1121 1094 -5683 -964 2943 -3752 -2836 3534 -481 -3543
789 -3543 2649 2422 -2739 1924 4911 -1149 -721 4981 759 -1687 3958 2521 -2766 1418 3440 -2938
$$ packed form
681C318n631l224P314j914n515O389K057q308L065O686o775k44Q237m866m449
696c860Q611j072p592N845M103q481J971O601p168l282R252l343p133P022J405
711B879q321L895N051p907o87Q169l498n175P211N77p238M923N058o903k97P825
727E562l798m434O661M73o423L787M834p050j251O657l342n344O142P32p377K951
743a220M407o334j718P081k915n373O110J576p229L191N877o225r72P650k856
758A050n282O515J743o535K732N762o504j410P464l340n895O645M64p199L612
773a78M147o857p43O434l616m428O362k7o777M719L907o695R16O370m015l062
789c543O192k27n161M663K987o060M28N702m222k446N645j437n287M184K022o378
$$ plain form
805 -2938 -1473 3254 -1573 -4104 1583 -336 -5466 -307 1752 -4644 -2931 2463 -2426 -3515 3214
820 3214 526 -3895 1905 3300 -2589 519 4988 -527 -990 5314 1664 -2237 3504 3310 -2512 600
836 600 3153 -1867 -2119 2670 -733 -4113 333 640 -3894 -1344 1659 -2514 -2718 1509 -431 -2903
852 -2903 704 2177 -1536 -9 3082 95 -747 3304 2020 -1319 2184 3131 -1010 28 2936 -623
868 -623 -1854 1578 313 -2845 -204 573 -3147 -1803 856 -2141 -2735 492 -581 -2656 74 969
884 969 -1077 -481 2187 629 -412 2120 1655 91 2088 2791 502 473 2456 929 -368 1718 809
901 809 -1757 -346 954 -2187 -1834 203 -1810 -2875 -144 -1258 -3337 -874 237 -2042 -1254 962
917 962 -1121 -994 1786 476 -1106 1523 2098 -126 1308 2465 315 440 2576 679 -786 1381
$$ packed form
805b938J465M727m827k531N687j919n130N159K059o396J713N394m889j089O729
820C214k688m421N800J395n889L108M469n515m63O304l650l901N741j94n822L112
836F00K553n020k52M789l403l380M446L07m534K550L003m173k04M227j940k472
852b903L607J473l713J527L091k987q42M051j284l339L503R47m141J038K908l559
868f23j231L432j265l158K641P77l720J344K659k997n94L227j073k075K730Q95
884I69k046N96K668j558j041K532m65j564J997P03k289k9J983j527j297K086r09
901H09k566J411J300l141L53K037k013j065K731j114k079K463J111k279P88K216
917I62k083J27K780j310j582K629N75k224J434J157k150J25K136j897j465K167
$$ plain form
933 1381 1431 -1199 -109 802 -1923 -1843 355 -1269 -2684 -287 -487 -2462 -927 601 -1663 -1694 1316
950 1316 -110 -1657 1483 1499 -891 829 2289 -84 131 2409 838 -986 1514 1386 -1263 2
966 2 1326 -1312 -1568 717 -777 -2906 -567 181 -2249 -1074 588 -1971 -2021 1231 41 -1699 1044
983 1044 1561 -992 1042 2405 167 238 2828 1368 -305 1784 1885 -799 156 1613 -947 -1363 1250
1000 1250 -855 -2874 -312 -613 -3325 -1746 487 -2466 -2782 143 -1328 -3261 263 526 -2547 52
1016 52 1859 -1478 -380 2685 359 -990 2534 1576 -1225 1958 2659 -1390 261 2434 -1025 -1475
1032 -1475 1766 -510 -2760 176 240 -3146 -1387 781 -2436 -2565 1155 -1011 -2937 1175 1028 -2684
1048 -2684 256 2256 -977 -610 2892 497 -1491 2199 1807 -2483 856 2923 -1870 -1257 2399 -1287
$$ packed form
933A381N0k630J090R11k725Q0K198j624j415K397k00j975J535J528k264l1L010
950A316j426j547L140J6k390J720J460k373K15K278j571j824K500j28k649J265
966BJ324k638k56K285j494k129K339P48k430J175J662k559n0L252j190j740K743
983A044N17k553K034J363k238P1K590j460j673K089J01k684R55J457k560m16K613
1000A250k105k019K562l01k712J579K233k953l16K925j471j933L524K63l073K599
1016E2J807l337J098L065k326j349L524r58k801L183P01m049J651K173l459m50
1032a475L241k276k250K936O4l386J759K168l217j29L720k166j926M112j47l712
1048b684K940K000l233L67L502k395j988L690l92m290L339K067m793O13L656l686
$$ plain form
1064 -1287 -2931 1350 54 -3644 -388 883 -3470 -2186 1567 -1868 -2874 1443 0 -3001 755
1079 755 1751 -1482 145 2783 -58 -714 2829 1803 -973 2014 2433 -1002 -37 2732 -451 -1544
1095 -1544 1527 2 -2648 -58 508 -3270 -1714 776 -2465 -3068 782 -558 -3426 61 548 -2559
1111 -2559 -82 2036 -992 -861 2655 686 -1240 2490 2072 -1226 1191 2651 -820 -330 2646 -199
1127 -199 -1343 1337 172 -2898 -267 664 -2705 -1468 881 -1941 -2839 1061 -116 -2878 710 1366
1143 1366 -1858 -236 2415 -434 -1049 2927 1546 -1331 2402 2669 -1248 701 3200 -738 -927 2297
1159 2297 -5 -2053 1360 1276 -3019 -665 1512 -2454 -1839 1040 -1724 -3061 916 414 -2496 -14
1175 -14 1444 -1327 -347 2324 326 -957 2592 1497 -873 1607 2239 -514 763 2535 -212 -666
$$ packed form
1064a287j644M281j296l698L256J271m353J284L753l435j006M317j443l001L756
1079G55R96l233J627K638k841o56L543j026k776K987M19l435R65K769l183j093
1095a544L071j525k650K590N66l778J556K490l241o03L850j340k868L487M87l107
1111b559K477K118l028J31L516j969j926L730m18l298K417J460l471M90K976k845
1127a99j144K680j165l070K631R31l369J237K349k822q98L900j177k762L588O56
1143A366l224J622K651k849o15L976j381k877L733K67l917J949K499l938j89L224
1159B297k302k048L413q4m295K354K177l966O15K879k764j337L977n02k910K482
1175a4J458k771R80K671j998j283L549j095k370K480O32k753J277J772k747m54
$$ plain form
1191 -666 1466 148 -1608 519 758 -2010 -1017 753 -1938 -1752 581 -1236 -1920 173 254 -1391 5
1208 5 1133 -731 -249 1965 506 -606 1993 1501 -271 1111 2151 -500 332 1691 -135 -994 1016
1225 1016 -166 -1656 -29 -55 -2092 -1245 29 -1696 -1650 0 -1075 -1688 235 179 -1017 2 1192
1242 1192 81 116 1850 903 -11 1935 1546 214 833 1677 530 1 1380 287 -694 418 262
1259 262 -1723 -643 194 -1546 -1348 -111 -1181 -1673 -176 -517 -1633 -196 391 -1166 -53 1164
1275 1164 -271 -177 1673 595 -85 1511 1189 221 1140 1396 132 144 819 -96 -408 298 -289 -895 -569
1294 -569 -39 -1299 -710 -161 -1014 -900 -86 -427 -860 371 68 -298 370 1301 499 515 1362 816 486 1452
1314 1452 1252 7 1121 833 -141 510 696 -424 -768 190 -480 -1264 -183 -626 -1703 -684 -289 -1368
$$ packed form
1191f66K132j318j756K127K39k768R93J770k691J86K333j817o84K093Q1j645J396
1208EJ128j864M82K214j459j112K599m92j772J382J040k651Q32J359j826q59K010
1225A016j182j490J627k6k037Q47J274j725M6J650j075o13J923n6j196J019J190
1242A192j111L5J734r47r14J946l89j332O19Q44j147n29J379j093r81J112j56
1259B62j985J080Q37j740J98J237j070m92J497l41j116J437N87j557J113J217
1275A164j435R4J850j078o80J596l22r68R19K56j264J2O75r15l12P06n87o06L26
1294e69N30j260N89N49q53J14Q14l41m33J231l03l66O68R31q02J6Q47n46l30R66
1314A452k00j245J114k88r74O51J86j120l44R58o70p84J081m43j077J019L95j079
$$ plain form
1332 -1368 -853 -220 -742 -607 192 -18 -305 570 674 219 961 1114 539 919 1076 770 370 851 558 52
1352 52 201 145 -221 -384 -379 -805 -960 -529 -982 -1249 -1142 -586 -694 -718 -544 -617 -374 -36 151 72 347 688
1374 688 427 890 845 570 961 976 672 660 823 267 234 471 -157 -545 -135 -317 -1224 -796 -498 -1171 -825
1395 -825 -421 -699 -1036 -468 -391 -503 9 277 -74 331 680 374 405 1217 1180 565 951 882 100 642 804
1416 804 189 -149 78 63 -493 -424 -234 -1219 -999 -237 -1024 -1094 -695 -785 -1222 -371 -386 -595 -149 385 4 -32
1438 -32 1017 475 190 1011 933 -90 719 754 -314 -182 580 -146 -620 61 -614 -1055 -569 -632 -1264 -998
1458 -998 -591 -1364 -800 -265 -503 -668 -24 163 -289 365 733 279 454 1394 848 573 1356 1290 410 951
1478 951 1094 -139 226 910 -218 -703 348 -348 -1225 -325 -432 -1609 -820 -350 -1495 -1241 -16 -725
$$ packed form
1332a368N15O33n22J35P99k10k87Q75J04m55P42J53n75L80J57l06m00M81k93n06
1352E2J49n6l66j63Nm26j55M31m53k67J07N56j08k4J74p3K43L38J87p9K75L41
1374F88k61M63m5k75L91J5l04j2J63n56l3K37o28l88M10j82r07M28K98o73L46
1395h25M04k78l37N68P7j12N12K68l51M05L49l06L1Q12l7o15L86o9p82N42J62
1416H04o15l38K27j5n56O9J90r85K20P62p87p0L99r0m37Q51j5k09M46N34l81l6
1438c2J049n42k85Q21p8j023Q09L5j068J32P62p26m74O81o75m41M86o3o32K66
1458i98M07p73N64N35k38j65O44J87m52O54L68m54J75R40n46k75P83o6q80N41
1478I51J43j233L65O84j128m85J051o96q77R00j07j177P89M70j145K54J225p09
$$ plain form
1496 -725 -944 39 -142 -957 244 824 -292 449 1168 240 235 1134 695 201 575 779 42 96 493 -176
1516 -176 -218 46 -477 -847 -212 -525 -965 -817 -555 -702 -785 -252 -204 -292 57 245 -154 168 800 215 366
1537 366 1036 333 490 783 453 120 466 368 -321 -308 87 -442 -859 -347 -736 -1203 -799 -684 -1137 -870 -564
1558 -564 -845 -576 -311 -218 -130 156 162 154 620 828 550 828 1118 705 771 873 860 425 596 748 18 -74 309
1581 309 -511 -517 -69 -600 -1055 -440 -543 -1075 -770 -549 -857 -804 65 -525 -488 388 0 -133 692 801 223
1602 223 609 977 331 535 1096 447 242 565 23 -258 177 86 -589 -405 153 -778 -800 -490 -874 -826 -263
1623 -263 -572 -695 83 -71 -414 -248 397 175 85 1065 365 310 922 905 166 827 663 -20 35 809 -4
1644 -4 -443 153 -229 -997 -318 -202 -1192 -1011 -128 -975 -1191 -305 -654 -612 68 156 -387 -135 913 330 325 1038
$$ packed form
1496g25k19R83j81q15J201N80j116P41P19r28nQ99m39m94L74K04p37N4L97o69
1516a76m2K64n23l70O35l13m40J48K62j47q3N33M8q8L49J88l99L22O32n85J51
1537C66O70p03J57K93l30l33L46r8o89J3L95n29m17N12l89m67M04J15m53K67L06
1558e64k81K69K65R3Q8K86OqM66K08k78K78K90m13O6J02j3m35J71J52p30r2L83
1581C09q20oM48n31m55O15j03n32L05K21l08N3Q69n90L7Q76l88j33Q25J09n78
1602B23L86L68o46K04N61o49k05L23n42k81M35r1o75J84N58r31k2L10l84M8N63
1623b63l09j23P78j54l43J66O45k22r0R80p00n5O12j7p39O61j64o83N5P74q13
1644dm39N96l82p68O79J16r90J81Q83q47k16Q86l49M2O80Q8n43K52J048n83nP13
$$ plain form
1666 1038 585 213 1160 910 -121 731 953 88 138 558 -37 -196 198 -153 -942 -409 -372 -886 -1014 -376
1686 -376 -957 -1065 -263 -263 -774 -149 312 -254 92 756 467 121 780 658 69 801 1044 167 329 1051 119
1707 119 -133 631 16 -660 -117 -120 -1234 -605 -167 -1150 -811 -32 -669 -1033 -92 -158 -860 -50 653 -375
1727 -375 156 1294 294 271 1248 935 -22 859 1137 27 294 1120 -107 -531 566 -37 -1135 66
1745 66 -8 -1014 -835 66 -1036 -1142 81 -309 -1126 90 88 -960 158 1046 -226 -127 1118 562 -112
1764 -112 1282 855 -236 953 1194 -138 4 1027 -239 -581 469 15 -1131 -59 -337 -1228 -597
1781 -597 43 -1039 -1149 190 -507 -1053 173 395 -789 130 836 -144 229 1320 412 -2 1200 1096
1799 1096 -40 659 1129 -18 121 1011 -182 -611 102 34 -843 -270 -232 -1097 -697 167 -866 -1211 -73
$$ packed form
1666A038m53l72R47k50j031Q52K22q65N0M20n95j59L94l51p89N33L7n14j28O38
1686c76n81j08Q02%n11O25M61n66L46O64k89l46O59j22n89P32K43q77J62P22r32
1707A19k52P64o15o76N43lj114O29M38r83L39P79o37l64R41o6p02Q10P03j028
1727c75N31J138j000k3R77l13r57Q81K78j110K67Q26j227m24J097o03j098J201
1745F6p4j006J79R01j102j06J223l90q17J216kj048J118Q88j272R9J245n56o74
1764a12J394m27j091J189K41j332J42J023j266l42J050m54j146J072k78q91O31
1781e97O40j082j10J339o97n46J226K22j184R19P06r80L73J091r08m14J202j04
1799A096j136O99M70j147J39Q90j193m29P13o8q77N73L8q65M00Q64j033l45J138
$$ plain form
1818 -73 -233 -982 -104 630 -619 88 784 55 -253 982 753 54 591 1006 23 277 1126 402 -352 819
1838 819 10 -785 141 147 -1179 -726 272 -467 -1063 146 -624 -1353 449 553 -1022 -99 762 -514 -191
1857 -191 980 250 -215 1017 878 -270 766 1317 -129 -146 1051 132 -549 790 -17 -1232 -235 -17
1875 -17 -1398 -1061 58 -1184 -1390 20 -518 -1213 -120 -70 -670 57 915 -189 -65 939 555 -80
1893 -80 1067 883 -75 614 927 148 293 1083 -59 -437 738 87 -733 -335 243 -586 -681 393 -719
1912 -719 -927 74 -342 -1116 169 152 -429 -385 745 -52 -126 700 643 50 1014 748 -7 -36 711 -24 -57
1933 -57 461 149 -129 -207 -45 -520 -798 171 -449 -897 -93 -364 -1117 -202 230 -753 -110 228 -68 -82 772
1954 772 360 -220 773 1036 105 518 758 249 1 944 514 -207 234 189 -479 -186 57 -629 -734 73
$$ packed form
1818g3j60p49Q78P34j249P07O96p29l08J235k29o99N37M15r83K54Q49p24p54J171
1838H19q09p95R26Oj326M53R98p39n96J209p70p29J802J04j575R23Q61j276L23
1857a91J171p30m65J232j39j148J036N51j446j7J197r19o81J339q07j215R97K18
1875a7j381L37J119j242k06J410n38o95J093N0o00P27Q58j104J24J004l84o35
1893h0J147j84r58O89L13p79J45P90j142l78J175o51q20L98N78q29r5J074j112
1912g19k08J001m16p74J285j7n81M4J130p97p4Q26n7n93R64k66p55k9P47p35l3
1933e7N18l12k78p8J62m75k78R69o20m48Q04k71p53R15M32r83O43L38k96j4Q54
1954G72m12n80R93K63r31M13K40n09k48R43m30p21M41m5o68K93K43o86j05Q07
$$ plain form
1974 73 -608 -1084 -157 -373 -1188 -464 -18 -604 -85 233 -29 -193 679 572 -220 524 950 81 327 960
1994 960 239 293 1036 304 -127 408 228 -453 -191 28 -823 -529 -182 -573 -998 -109 41 -593 -34 201
2014 201 -381 130 274 105 279 727 373 147 683 400 159 378 781 125 350 538 48 44 33 -148 -350
2035 -350 -179 -159 -511 -394 -453 -337 -625 -258 -211 -164 -329 -297 -78 -118 138 406 163 396 340 327 396 687 333
2058 333 337 389 314 186 -38 75 -71 -373 -145 -189 -758 -296 -551 -533 -509 -616 -386 -414 -205 -52 -531 -15 -181
2081 -181 -145 186 514 204 483 843 436 442 582 508 206 112 349 172 -32 294 -336 -584 221 -173 -571 -527
2103 -527 -350 -681 -462 -347 -588 -544 79 -244 -470 258 141 80 136 513 3 372 659 313 462 639 165
2124 165 322 248 111 -97 3 -14 -318 -127 -420 -464 -481 -578 -573 -607 -422 -311 -330 -276 -366 -78 54 -213 282 522
$$ packed form
1974G3o81m76R27k16q15P24M46n86N19L18k62j64Q72j07p92P44M26q69K46O33
1994I60p21N4P43p32m31N35j80o81K62K19q51K94L47l91m25Q89J50o34N59K35
2014B01n82N11J44j69J74M48l54k26N36k83k41K19M03o56K25J88m90mj1j81k02
2035c50J71K0l52J17n9J16k88L67M7M7j65L2K19m0K56K68k43K33n6j3O9K91l54
2058C33MN2p5j28k24J13j46l02K28m4n69M62k55J8K4j07K30k8K09J53m79N16j66
2081a81L6L31L28l10K79L60m07OJ40p4l02r4K37j77k04L26o30k48Q05l94l98M4
2103e27J77l31K19J15k41M4O23l23k26P28j17o1N6L77n10L69K87l46J49J77m74
2124A65J57p4j37k08J00j7l04J91k93m4j7r7Nl4J85J11j9N4r0K88J32k67M95K40
$$ plain form
2148 522 252 365 439 714 350 533 526 389 474 485 188 144 181 -85 -392 -221 -397 -624 -294 -226 -842 -461 -97
2171 -97 -846 -605 -18 -329 -305 -139 89 -259 313 493 -6 354 852 322 331 691 518 115 701 375 -314
2192 -314 413 100 -192 -174 223 -83 -593 -102 -297 -756 -162 -207 -914 -246 563 -124 48 271 194 -54 425
2213 425 501 27 470 928 58 389 703 177 -206 577 396 -204 25 208 -532 -355 -38 -407 -735 -221
2233 -221 -223 -838 -275 -435 -555 -68 155 -253 -322 279 35 23 501 396 23 377 818 341 370 475 382 76
2255 76 284 240 149 -32 185 -282 -435 -66 -553 -887 -119 -337 -776 -368 -311 -656 -552 -3 -35 -395 268 257
2277 257 0 393 777 150 218 791 316 184 571 318 -67 141 225 -528 -134 434 -290 -683 203 -663 -888
2298 -888 -335 -266 -875 -536 86 -606 -581 154 -319 -513 432 528 -403 284 717 278 197 1137 130 -193 794
$$ packed form
2148E22k70J13P4K75l64J83pj37Q5J1k97m4L7k66l07J71j76k27L30O8o16L81L64
2171i7p49K41N87l11K4J66K28l48N72J80m99L60M98n30RL60j73m03N86l26o89
2192c14P27l13k92J8L97l06n10M91j95m59N94m5p07O68Q09o87J72K23p7k48M79
2213D25P6m74M43M58q70L31L14n26l83P83j81o00K29J83p40J77L17l69l28N14
2233b21ko15N63j60j20M87K23m08o9O01k44j2M78j05l73L54M41m77K9J05r3l06
2255G6K08m4r1j81K17m67j53L69m87l34P68k18m39M08N7l45J04N49l2l60O63j1
2277B57k57L93L84o27O8N73m75j32L87k53l85K08Q4p53L94N68p24l93Q86q66k25
2298h88N53O9o09L39O22o92K5P35m73j94R45R6r31O87M33m39q1R40j007l23R87
$$ plain form
2319 794 389 -508 256 447 -642 -360 289 -606 -800 260 -498 -980 26 -331 -960 -309 241 -521 -492
2338 -492 460 64 -486 532 431 -208 402 899 195 299 778 20 -65 768 82 -436 315 404 -671 -296
2358 -296 320 -701 -503 267 -554 -1036 -130 49 -806 -24 278 -537 -187 503 -32 -295 810 405 -38
2377 -38 492 763 -139 150 839 -9 -90 746 160 -507 253 412 -435 -202 352 -409 -668 50 -330 -1095 -96
2398 -96 114 -480 -160 461 -227 -545 496 168 -77 525 611 -233 381 881 45 114 601 33 -282 193 343
2419 343 -526 -213 430 -679 -641 455 -376 -877 282 -414 -838 -351 -44 -867 -469 557 -370 -476 530
2438 530 327 -315 524 715 -328 544 804 186 37 1010 84 -433 204 426 -922 -18 384 -622 -638
2457 -638 171 -364 -733 -1 -197 -913 -188 51 -931 61 750 -233 -258 780 161 -258 621 639 -31 348
$$ packed form
2319G94m05q97P64J91j089K82O49q95j94J060p58m82J006l57o29O51N50p62K9
2338d92R52l96n50J018j01o39O10M97p04J04M79p58q5Q33o86n18P51Q9j075L75
2358b96O16j021J98P70q21m82R06J79q55P82L02q15L50O90n35k63J105m05m43
2377c8N30K71r02K89O89q48q1Q36n86o67P60J59q47K33N54p61k59P18l80p65R99
2398i6K10n94L20O21o88l18J041l28k45O02Q6q44O14N00q36O9M87n68l15M75J50
2419C43q69L13O43j109L8J096q31n01J159o96m24M87L07q23L98J026r27j06J006
2438E30k03o42Q39J91j043Q72K60o18j49R73r26n17O37K22j348R04M02j006j6
2457f38Q09n35l69P32j96p16P25K39r82R92O89r83k5J038o19m19Q79J8o70L79
$$ plain form
2477 348 949 -32 -270 825 149 -396 501 -202 -581 11 84 -919 -244 305 -549 -431 89 -252 -593 -20
2497 -20 190 -639 -3 348 -415 -40 570 290 -45 714 425 -369 327 766 196 -57 674 82 -485 376
2517 376 -16 -642 -157 39 -757 -452 -5 -338 -412 -26 -378 -539 44 266 -212 -263 518 67 107 683 400
2538 400 33 433 547 243 311 387 48 182 256 84 -307 99 48 -477 -260 -7 -544 -270 49 -486 -762
2559 -762 -97 -266 -333 96 290 -294 -106 343 -30 -66 687 464 105 702 359 -38 297 503 -179 -107 239
2580 239 -184 -363 185 52 -442 -364 -240 -730 -654 26 -392 -736 -215 37 -144 -125 581 -278 -166 357 -65
2601 -65 16 546 136 66 487 251 136 321 542 -16 147 306 -193 -484 318 -33 -465 -340 -194 -551 -376
2622 -376 -76 -224 -435 28 -72 -348 62 309 -121 154 223 -66 504 661 272 272 654 309 88 267 542
$$ packed form
2477C48O01r81k38J095o76n45Q97p03l79N92P3j003O75N49q54J18N20l41l41N73
2497b0K10q29O36L51p63L75O10k80l35P59k89p94O96M39n70k53P31n92n67Q61
2517C76l92o26M85J96p96L05M47l33p4L86l52j61N83K22m78n1P81m51M0N76k83
2538D00l67M00J14l04O8P6l39J34P4j72l91M06n1n25K17K53n37K74L19n35k76
2559g62O65j69o7M29J94n84J88M49l73l6P53k23l59N97l43l97L35K06o82P2L46
2580B39m23j79N48j33m94P8J24m90P6O80m18l44N21K52j81J9P06q59J12N23m22
2601f5Q1N30m10p0M21k36j15J85K21n58J63J59m99k91Q02l51m32J25J46l57J75
2622c76L00j48k11M63j00k76M10K47m30K75O9k89N70J57l89%L82l45k21J79K75
$$ plain form
2643 542 -346 -90 -46 -333 -218 231 -322 -352 -543 -287 -458 -261 -220 -498 -311 21 69 -251 296 212 -177 367
2665 367 429 -70 225 530 333 222 407 502 10 180 347 44 76 112 -57 -19 31 -250 -278 -164 -265 -354 -303
2688 -303 104 -518 -535 137 12 -160 558 23 -28 291 145 142 202 602 199 -58 -55 347 282 304 135 -190 0
2711 0 205 -218 -354 353 -236 -389 -46 -366 -301 -147 30 -152 -266 482 -169 -167 317 202 -309 386 340 177
2733 177 372 353 215 -26 621 324 -195 298 101 -343 186 -39 -482 -428 -260 -465 -456 -5 -390 -230 -220 -65
2755 -65 -93 -119 134 -57 -177 403 64 16 303 283 153 360 331 181 276 325 95 122 403 -193 -116 44 -64
2778 -64 -592 -291 120 -355 -473 -68 -193 -341 148 -143 -311 82 137 94 201 430 -36 134 357 229 263
2799 263 485 443 164 447 140 -202 -59 441 -84 -217 178 -99 -672 -211 7 -615 -394 -78 -427 -283
$$ packed form
2643E42q88K56M4k87J15M49n53l0j91K56j71J97M1k78J87L32M8l20N47q4l89N44
2665C67O2m99K95L05j97j11J85R5m92J70J67l03L2L6j69L8N0k81k8J14j01q9N1
2688c03M07o22j7O72j25j72P18n35n1L19j46lO0M00m03k57LM02o5K2j69l25J90
2711@K05m23j36P07n89j53L43l20O5J54J77j82j14P48o51KM84j15n11O95m6j63
2733A77J95j9j38k41O47k97n19M93j97m44N29k25m43N4J68k05RM51l85J60J0J55
2755f5k8k6K53j91j20N80l39m8K87k0j30K07k9j50R5M9k30K7K81n96P7J60j08
2778f4n28L01M11m75j18M05j25j48M89k91j68L93N5m3J07K29m66J70K23j28L4
2799B63K22m2k79K83l07l42J43N00n25j33L95k77n73M61K18o22K21L16l49J44
$$ plain form
2819 -283 -130 -113 -68 -120 321 -177 115 416 -10 38 580 248 93 268 285 194 160 528 -158 -275 70 6 -165
2842 -165 224 -271 -640 -116 -210 -456 -193 92 -124 -305 -98 -58 -49 52 425 40 110 558 229 376 385 290 182
2865 182 478 206 31 -49 147 -51 -117 112 -117 -506 48 -41 -454 -239 -16 -423 -302 166 -62 -280 109
2886 109 155 -143 448 153 -6 162 405 51 41 430 311 126 484 328 -59 -60 148 -97 135 119 -119 -271
2908 -271 49 -157 -596 -178 -90 -457 -478 -139 -324 75 286 -14 -366 281 472 113 283 346 130 122 400 336
2930 336 -104 350 157 1 180 86 -159 -226 103 -150 -300 182 -172 -424 -168 95 -343 -138 121 -593 -52
2951 -52 330 -134 -262 314 81 -63 297 480 21 27 371 117 160 376 314 -98 341 101 -215 -34 277 -494
2973 -494 -329 -245 -262 -572 -57 8 -450 -266 -101 -363 -96 84 138 -276 275 287 65 324 286 9 183 395
$$ packed form
2819b83J53J7M5n2M41m98K92L01m26M8N42l32j55J75J7r1l4L68o86j17L45o4j71
2842a65L89m95l69N24r4k46K63K85k16j81K07M0RJ01L73l85P0M48l29J47Rr5j08
2865A82K96k72j75q0J96j98o6K29k29l89N54q9m13K15K23m07J21M68k28k18L89
2886A09M6k98N91k95j59J68K43l54j0L89j19j85L58j56l87jK08k45K32j6k38j52
2908b71L20k06m39M18Q8l67k1L39j85L99K11l00l52O47J91l59J70O3k16qK78o4
2930C36m40M54j93j56J79r4k45o7L29k53j50M82l54k52K56K63m38K05K59p14N41
2951e2L82m64j28N76k33j44L60J83m59OL44k54M3K16o2m12M39k40l16J81L11p71
2973d94J65Q4j7l10N15O5m58J84J65k62K67J80N4m14N51J2k22K59l8k77J74K12
$$ plain form
2995 395 94 -106 478 158 -376 120 287 -342 -303 12 -235 -372 -126 -380 -433 -77 -2 -428 -53 155 -319
3016 -319 -207 397 370 -20 563 411 239 211 400 128 -34 415 304 -154 139 -89 -376 55 206 -177 -278
3037 -278 17 -24 -300 -354 -435 -457 7 130 -262 -59 -77 -206 79 520 -6 -66 364 443 179 382 618 216
3059 216 279 557 -3 174 132 57 -336 -268 -101 -352 -46 -105 -379 33 -40 -260 -444 -103 173 -654 -60 -5
3081 -5 -134 -67 144 78 115 355 259 135 284 529 212 -42 207 123 -47 332 33 -119 -6 -12 -460 -424 -42
3104 -42 -193 -508 -348 -110 -492 99 -179 -351 112 380 161 134 358 184 -180 14 358 -27 253 257 -84
3125 -84 -39 154 -235 53 423 -100 -72 7 19 -354 -243 -85 -348 -245 -257 124 -200 -206 236 40 -56 95 -38
3148 -38 113 283 230 -67 299 123 88 181 452 -154 224 278 -130 -100 297 10 -367 -125 -15 -134 -164 -128 -534
$$ packed form
2995C95l01k00N84l20n34M96J67o29L9L15k47j37K46k54n3L56P5m26L75K08m74
3016c19J12O04k7l90N83j52j72k8J89k72j62M49j11m58K93k28k87M31J51l83j01
3037b78K95m1k76n4q1k2M64J23l92K03j8j29K85M41n26o0M30P9k64K03K36m02
3059B16O3K78n60J77m2p5l93O8J67k51L06n9k74M12p3k20j84L41K76q27N94N5
3081ej29O7K11o6L7K40r6j24J49K45l17k54K49q4j70L79k99j52J13om48L6L82
3104d2j51l15J60K38l82N91k78j72M63K68k19k7K24j74l64J94L44l85K80Ml41
3125h4M5J93l89K88L70n23K8P9J2l73J11J58k63J03j2L81l24oM42j96r6J51j33
3148c8J51J70n3k97L66j76l5R3K71o06L78N4m08L0L97k87l77K42J10j19l0L6m06
$$ plain form
3171 -534 -559 72 -341 -205 2 -192 -307 -12 133 22 41 219 -39 130 175 389 79 234 268 -124 89
3192 89 73 17 47 19 -136 152 -370 -129 -452 -257 -183 -254 -219 -135 -119 -265 -32 206 -164 -64 168 322 146
3215 146 366 296 271 347 231 183 278 196 13 157 132 157 -233 13 8 -187 -83 -151 -158 -295 94 -191 -105 -173 -304
3240 -304 -356 45 30 -10 192 197 -57 202 200 211 115 257 125 112 293 145 -82 -11 31 20 -300 15 -210 -200 -78
$$ packed form
3171e34k5O31m13J36K07j94j15K95J45j11J9J78k58J69M5K14l10J55L4l92K13
3192H9j6n6L0k8j55K88n22K41l23J95P4p1L5Q4J6j46K33K38l70J00K32J54j76
3215A46K20p0k5P6j16m8R5q2j83J44k5K5l90K46nj95J04o8pj37L89k85Q6o8j31
3240c04n2M01j5m0K02Nk54K59kJ1r6J42j32j3J81j48k27P1M2j1l20L15k25J0J22
$$ [...]
8191A68
##END NTUPLES=NMR FID
##END=
