##TITLE=1H_LR-758-R6-C1M
 CDCl3
 8 sc, 
 27.9.2023
##JCAMPDX= 6.0         $$ Bruker NMR JCAMP-DX V2.0
##DATA TYPE= NMR FID
##DATA CLASS= NTUPLES
##ORIGIN= UXNMR, Bruker Analytische Messtechnik GmbH
##OWNER= root
$$ XWIN-NMR		Version 3.5
$$ Wed Sep 27 13:47:46 2023 Russian Standard Time (UT+4h)  she@DPX200
##.OBSERVE FREQUENCY= 200.13135
##.OBSERVE NUCLEUS= ^1H
##.DELAY= (6, 6)
##.ACQUISITION MODE= SIMULTANEOUS
##.ACQUISITION SCHEME= undefined
##.AVERAGES= 8
##.DIGITISER RES= 18
##SPECTROMETER/DATA SYSTEM= spect
##.PULSE SEQUENCE= zg30
##.SOLVENT NAME= CDCl3
##.SHIFT REFERENCE= (INTERNAL, CDCl3, 0, 15.7039)
##AUDIT TRAIL= $$ (NUMBER, WHEN, WHO, WHERE, WHAT)
$$ ##TITLE= Audit trail, XWIN-NMR		Version 3.5
$$ ##JCAMPDX= 5.01
$$ ##ORIGIN= Bruker BioSpin GmbH
$$ ##OWNER= she
$$ F:/spectra/data/she/nmr/H-F/1/audita.txt
$$ ##AUDIT TRAIL=  $$ (NUMBER, WHEN, WHO, WHERE, WHAT)
(   1,<2023-09-27 13:46:04.06 +0400>,<she>,<DPX200>,
      <created by zg, POWCHK disabled, PULCHK disabled
       configuration hash MD5:
       00 E9 B6 7A A2 85 ED C7 34 08 36 98 17 FE 4E 26
       data hash MD5: 16K
       A8 7C EC 26 E9 61 76 8A CE E9 C2 CF 05 A1 CD C4>)
$$ ##END=
$$ 
$$ hash MD5
$$ F7 E5 17 A4 48 15 6B F4 78 94 F9 4A 12 01 3D 1C
##$RELAX= 
##$RELAX= 
##$RELAX= 
##$RELAX= 
##$RELAX= 
##$RELAX= 
$$ Bruker specific parameters
$$ --------------------------
##$DU= <F:/spectra>
##$EXPNO= 1
##$NAME= <H-F>
##$PROCNO= 1
##$TYPE= <nmr>
##$USER= <she>
##$AMP= (0..31)
100 100 100 100 100 100 100 100 100 100 100 100 100 100 100 100 100 100 
100 100 100 100 100 100 100 100 100 100 100 100 100 100 
##$AQSEQ= 0
##$AQ_mod= 1
##$AUNM= <au_zg>
##$AUTOPOS= <>
##$BF1= 200.13
##$BF2= 200.13
##$BF3= 200.13
##$BF4= 200.13
##$BF5= 200.13
##$BF6= 200.13
##$BF7= 200.13
##$BF8= 200.13
##$BYTORDA= 1
##$CFDGTYP= 0
##$CFRGTYP= 5
##$CHEMSTR= <none>
##$CNST= (0..31)
1 1 145 1 1 1 1 1 1 1 1 1 1 1 1 1 1 1 1 1 1 1 1 1 1 1 1 1 1 1 1 1 
##$CPDPRG= <>
##$CPDPRG1= <>
##$CPDPRG2= <>
##$CPDPRG3= <>
##$CPDPRG4= <mlev>
##$CPDPRG5= <mlev>
##$CPDPRG6= <mlev>
##$CPDPRG7= <mlev>
##$CPDPRG8= <mlev>
##$CPDPRGB= <>
##$CPDPRGT= <>
##$D= (0..31)
0 1.2 0 0 0 0 0 0 0 0.06 0 0.03 0 0 0 0 0.0002 0 0 0 0 0 0 0 0 0 0 0 0 
0 0 0 
##$DATE= 1695807963
##$DBL= (0..7)
120 120 120 120 120 120 120 120 
##$DBP= (0..7)
150 150 150 150 150 150 150 150 
##$DBP07= 0
##$DBPNAM0= <>
##$DBPNAM1= <>
##$DBPNAM2= <>
##$DBPNAM3= <>
##$DBPNAM4= <>
##$DBPNAM5= <>
##$DBPNAM6= <>
##$DBPNAM7= <>
##$DBPOAL= (0..7)
0.5 0.5 0.5 0.5 0.5 0.5 0.5 0.5 
##$DBPOFFS= (0..7)
0 0 0 0 0 0 0 0 
##$DE= 6
##$DECBNUC= <off>
##$DECIM= 32
##$DECNUC= <off>
##$DECSTAT= 4
##$DIGMOD= 1
##$DIGTYP= 9
##$DL= (0..7)
0 120 120 120 120 120 120 120 
##$DP= (0..7)
150 150 150 150 150 150 150 150 
##$DP07= 0
##$DPNAME0= <>
##$DPNAME1= <>
##$DPNAME2= <>
##$DPNAME3= <>
##$DPNAME4= <>
##$DPNAME5= <>
##$DPNAME6= <>
##$DPNAME7= <>
##$DPOAL= (0..7)
0.5 0.5 0.5 0.5 0.5 0.5 0.5 0.5 
##$DPOFFS= (0..7)
0 0 0 0 0 0 0 0 
##$DQDMODE= 0
##$DR= 18
##$DS= 0
##$DSLIST= <SSSSSSSSSSSSSSS>
$$ [...]
##$SUBNAM2= <"">
##$SUBNAM3= <"">
##$SUBNAM4= <"">
##$SUBNAM5= <"">
##$SUBNAM6= <"">
##$SUBNAM7= <"">
##$SUBNAM8= <"">
##$SUBNAM9= <"">
##$SW= 18.05172834244
##$SWIBOX= (0..15)
0 0 2 0 0 0 0 0 0 0 0 0 0 0 0 0 
##$SW_h= 3612.71676300578
##$TD= 16384
##$TD0= 1
##$TE= 0
##$TE2= 300
##$TE3= 300
##$TEG= 300
##$TL= (0..7)
0 120 120 120 120 120 120 120 
##$TP= (0..7)
150 150 150 150 150 150 150 150 
##$TP07= 0
##$TPNAME0= <>
##$TPNAME1= <>
##$TPNAME2= <>
##$TPNAME3= <>
##$TPNAME4= <>
##$TPNAME5= <>
##$TPNAME6= <>
##$TPNAME7= <>
##$TPOAL= (0..7)
0.5 0.5 0.5 0.5 0.5 0.5 0.5 0.5 
##$TPOFFS= (0..7)
0 0 0 0 0 0 0 0 
##$TUNHIN= 0
##$TUNHOUT= 0
##$TUNXOUT= 0
##$USERA1= <user>
##$USERA2= <user>
##$USERA3= <user>
##$USERA4= <user>
##$USERA5= <user>
##$V9= 5
##$VALIST= <valist>
##$VCLIST= <CCCCCCCCCCCCCCC>
##$VD= 0
##$VDLIST= <DDDDDDDDDDDDDDD>
##$VPLIST= <PPPPPPPPPPPPPPP>
##$VTLIST= <TTTTTTTTTTTTTTT>
##$WBST= 1024
##$WBSW= 4
##$XGAIN= (0..3)
0 0 0 0 
##$XL= 0
##$YL= 0
##$YMAX_a= 418748
##$YMIN_a= -684271
##$ZGOPTNS= <>
##$ZL1= 120
##$ZL2= 120
##$ZL3= 120
##$ZL4= 120
##$ABSF1= 10
##$ABSF2= 0
##$ABSG= 5
##$ABSL= 3
##$ALPHA= 0
##$AQORDER= 0
##$ASSFAC= 0
##$ASSFACI= 0
##$ASSFACX= 0
##$ASSWID= 0
##$AUNMP= <proc_1d>
##$AZFE= 0.1
##$AZFW= 0.1
##$BCFW= 1
##$BC_mod= 2
##$BYTORDP= 1
##$COROFFS= 0
##$CY= 11.3945322036743
##$DATMOD= 1
##$DC= 2
##$DFILT= <>
##$DTYPP= 0
##$F1P= 15.7292609196834
##$F2P= 12.9074282941183
##$FCOR= 0.5
##$FTSIZE= 0
##$FT_mod= 4
##$GAMMA= 1
##$GB= 0.15
##$INTBC= 1
##$INTSCL= 1
##$ISEN= 128
##$LB= 0.24
##$LEV0= 0
##$LPBIN= 0
##$MAXI= 10000
##$MC2= 0
##$MEAN= 0
##$ME_mod= 0
##$MI= 1.114404
##$NCOEF= 0
##$NC_proc= 0
##$NLEV= 6
##$NOISF1= 3.799351
##$NOISF2= 2.8
##$NSP= 1
##$NTH_PI= 0
##$NZP= 0
##$OFFSET= 15.70392
##$PC= 1
##$PHC0= -21708.61
##$PHC1= 8.65271
##$PH_mod= 1
##$PKNL= yes
##$PPARMOD= 0
##$PSCAL= 0
##$PSIGN= 0
##$REVERSE= no
##$SF= 200.130013532006
##$SI= 16384
##$SIGF1= 3
##$SIGF2= 2
##$SINO= 400
##$SIOLD= 16384
##$SREGLST= <1H.CDCl3>
##$SSB= 0
##$STSI= 0
##$STSR= 0
##$SW_p= 3612.71676300578
##$SYMM= 0
##$S_DEV= 0
##$TDeff= 0
##$TDoff= 0
##$TI= <>
##$TILT= no
##$TM1= 0
##$TM2= 0
##$TOPLEV= 0
##$USERP1= <user>
##$USERP2= <user>
##$USERP3= <user>
##$USERP4= <user>
##$USERP5= <user>
##$WDW= 1
##$XDIM= 8192
##$YMAX_p= 0
##$YMIN_p= 0
$$ End of Bruker specific parameters
$$ ---------------------------------
##NTUPLES= NMR FID
##VAR_NAME=  TIME,          FID/REAL,        FID/IMAG
##SYMBOL=    X,             R,               I
##VAR_TYPE=  INDEPENDENT,   DEPENDENT,       DEPENDENT
##VAR_FORM=  AFFN,          ASDF,            ASDF
##VAR_DIM=   8192,          8192,            8192
##UNITS=     SECONDS,       ARBITRARY UNITS, ARBITRARY UNITS
##FACTOR=    0.0002768,     1,               1
##FIRST=     0,             0,               0
##LAST=      2.2672688,     0,               0
##MIN=       0,             -684271,         0
##MAX=       2.2672688,     418748,          0
$$ Real data points
##PAGE= N=1
##DATA TABLE= (X++(R..R)), XYDATA
$$ [...]
1968f07l1J94m7l3L48K51o8Q0N27j95J78J23L7m8K56l22n04N77l19O5m04J4m26
$$ -607 -638 -444 -491 -524 -176 75 7 87 614 419 597 720 757 709 965 643 139 716 397 462 58 72 -354
1991c54j90n6l11o4j06k00J2P2r2l2M30J86j16O10j86J61L58J45J41L06M09m8
$$ -354 -544 -600 -911 -975 -1081 -1281 -1269 -1197 -1289 -1321 -891 -705 -821 -211 -397 -236 122 267 408 714 1123 1075
2013A075K27k14J06P0k85K59j70k14j85j61q2n03j5j61n70K81j32l84L10j20M9
$$ 1075 1302 1088 1194 1264 979 1238 1068 854 669 508 426 -77 -92 -253 -823 -542 -674 -1058 -748 -868 -819
2034h19m9L23l20M06J54k9j57O97L67k71M9L22k91L4N15n11N0K56k78o3j56k26
$$ -819 -868 -545 -865 -459 -305 -334 -491 206 573 302 351 673 382 416 931 420 470 726 448 385 229 3
2056CN0J80l27o9j64k44o5R1Q0M7p4L84m26O06l4M4L44K11k90M53q3R9M31k13
$$ 3 53 233 -94 -163 -327 -571 -636 -545 -465 -418 -492 -108 -534 72 38 82 426 637 347 800 717 816 1247 1034
2080A034L5j69k67m11K33o5k65m56K2l38J0o44N48j99M5j71k17J40L26Q6oL46
$$ 1034 1069 900 633 222 455 390 125 -331 -309 -647 -637 -1281 -733 -932 -887 -1058 -1275 -1135 -809 -723 -729 -383
2102c83J64P6P9K37J75N74j68j74N02M8m10N12l30k39K5Pj67j23l0o28JK41q44
$$ -383 -219 -143 -64 173 348 922 754 580 1082 1130 720 1232 902 663 688 695 528 405 375 -253 -252 -11 -855
2125h55j12J12J8j93L72p6k83M20l2J98J29L35l25K25M04j77L48Q6K4j88K4J52
$$ -855 -967 -855 -837 -1030 -658 -734 -1017 -597 -629 -431 -302 33 -292 -67 337 160 508 594 618 430 454 606
2147F06L5p9l47M7j85l32N0J20o72K50n7l1l2P2k83J70L03k45PN51o4N4L54Q4
$$ 606 641 562 215 262 77 -255 -205 -85 -757 -507 -564 -595 -627 -555 -838 -668 -365 -610 -603 -52 -116 -62 292 376
2171C76j49K16J26K12m09N97n27J78n1O6p2l79M8m17j14j42P1k11l48R1J8j51
$$ 376 227 443 569 781 372 969 442 620 569 635 563 184 232 -185 -299 -441 -370 -581 -929 -838 -820 -971
2193i71J84j85l7K32K26K27j95L50K05r3M11J3J10K59O0j51J11J10j40j84J33
$$ -971 -787 -972 -1009 -777 -551 -324 -519 -169 36 -57 354 367 477 736 796 645 756 866 726 542 675
2214F75k97j09k18n7l33J8j52j34J35k34k22m0J20J84J42k1J80J99n0pP64R0k08
$$ 675 378 269 51 -6 -339 -321 -473 -607 -472 -706 -928 -968 -848 -664 -522 -543 -363 -164 -214 -221 543 633 425
2237D25K55Q1j34K3J54j16N2j53j80J57j23k74k43J71n48j67J09Rl54J66J65k09
$$ 425 680 761 627 650 804 688 740 587 407 564 441 167 -76 95 -453 -620 -511 -502 -856 -690 -525 -734
2259g34K6K25Lj25K19M44j96L81pK44J51j07L62J73J7j45Q9k63J0r4j57k27J46
$$ -734 -708 -483 -480 -605 -386 58 -138 243 236 480 631 524 886 1059 1076 931 1020 757 767 673 516 289 435
2282D35k47m40K58n26K68k37k30K30k06J12p3K22M30l45j53N02R6m2L52J13j02
$$ 435 188 -252 6 -520 -252 -489 -719 -489 -695 -583 -656 -434 -4 -349 -502 0 96 54 406 519 417
2303D17M6J38M2J8j8j39p3k45J69l14J92l66L1j83q7R4j9k15l52K48O1J73R4j29
$$ 417 463 601 643 661 643 504 431 186 355 41 233 -133 -102 -285 -372 -278 -297 -512 -864 -616 -555 -382 -288 -417
2327d17K09nK71J29m1J24K26K66k80L98J6k85nK13j24j80k20k73J12l28M7m50
$$ -417 -208 -213 58 187 146 270 496 762 482 880 896 611 606 819 695 515 295 22 134 -194 -147 -597
2349e97nk56k6L51o21K07K56j20j62J20K57K85K2L59J4J51K34l44K88J23K68M
$$ -597 -602 -858 -884 -533 -1154 -947 -691 -811 -973 -853 -596 -311 -289 70 84 235 469 125 413 536 804 808
2371H08q8J83j05q5m91o4L3l02M09k91l62M4k15kk3R7m27K70K38k81J02K80j65
$$ 808 720 903 798 713 222 158 191 -111 298 7 -355 -311 -526 -528 -551 -454 -881 -611 -373 -654 -552 -272 -437
2394d37K95K09Q8k3J6L58j38J02k4P1k29J18j39j34j11j02R4m52o8K90j42j43
$$ -437 -142 67 155 132 148 506 368 470 446 517 288 406 267 133 22 -80 14 -438 -506 -216 -358 -501
2416e01L0J26l45Q3M13k87n5M41K0K5K3K07L20K09l02K28K87k57J58K00k33l34
$$ -501 -471 -345 -690 -607 -194 -481 -536 -95 -75 -50 -27 180 500 709 407 635 922 665 823 1023 790 456
2438D56orJ16m09P8l75j16L39k54j39l65j8p1J36Kk03k9J59L48j14L87K17j72
$$ 456 450 441 557 148 226 -149 -265 74 -180 -319 -684 -702 -773 -637 -635 -838 -867 -708 -360 -474 -87 130 -42
2461d2M32k24K89M7L96l0j87KL9J7M9l74K67l10k6rk32k51P6p1k40J58j87j16
$$ -42 390 166 455 502 898 868 681 683 722 739 788 414 681 371 345 336 104 -147 -71 -142 -382 -224 -411 -527
2485e27K36j66kJ63Q4j06L38P3R8o8L68q2P5Q1j18n9J4J51l91pK92l63J9l19k85
$$ -527 -291 -457 -459 -296 -212 -318 20 93 191 123 491 409 484 565 447 388 402 553 162 155 447 84 103 -216 -501
2510e01Q8M4k1K59n43l1M3k7L03m6M7L46J31p2L49r2K02K30k4j22J38j98K83J57
$$ -501 -413 -369 -390 -131 -674 -705 -662 -689 -386 -432 -385 -39 92 20 369 277 479 709 685 563 701 503 786 943
2534I43m19pk60J28j62k51j70r6j9k52jj23P2J45m06K00j61O1L54n8K25J75p8
$$ 943 524 517 257 385 223 -28 -198 -294 -313 -565 -566 -689 -617 -472 -878 -678 -839 -778 -424 -482 -257 -82 -160
2557a60L91O2j10K99M2m6K51l31J96m2l8k00J15o2k04j39O0m02M6q8k03rj44L28
$$ -160 231 293 183 482 524 478 729 398 594 552 514 314 429 367 163 24 84 -318 -272 -360 -563 -572 -716 -388
2581c88l16J02J25l0K44L15k76Q2L08N4j76K43J88j64R6J47m0j47l03O0J10m26
$$ -388 -704 -602 -477 -507 -263 52 -224 -142 166 220 44 287 475 311 407 554 514 367 64 124 234 -192
2603a92L8J09l06j20L2K54m93K41k6j54r3K30K5O8M53m28L30K48K1k26M85n0n0
$$ -192 -154 -45 -351 -471 -439 -185 -678 -437 -463 -617 -710 -480 -455 -387 66 -362 -32 216 237 11 496 446 396
2626C96M29k08j32R8L0j88k28L03m07o4J13o8l64L9l43L64j13l76L56j27m6J06
$$ 396 825 617 485 583 613 425 197 500 93 29 142 74 -290 -251 -594 -230 -343 -719 -363 -490 -536 -430
2648d30P4J5J50J15M9j2M81j54j44K49K70l72M26j44r7O1K98p77J81J53l62K44
$$ -430 -356 -341 -191 -76 -27 -39 442 288 144 393 663 291 717 573 476 537 835 58 239 392 30 274
2670B74k95j0l38j35K49k32m3rJ25Q4J70p9J73OR7J16R7J4K55j12J18J62k2l7
$$ 274 -21 -31 -369 -504 -255 -487 -530 -539 -414 -330 -160 -239 -66 -60 37 153 250 264 519 407 525 687 665 628
2694F28q7J22j16j02r1j74J09j69l64L4K96n59P7J74l39M2J24j21J38L92k19N
$$ 628 541 663 547 445 354 180 289 120 -244 -210 86 -473 -396 -222 -561 -519 -395 -516 -378 14 -205 -200
2716b00K1Q0K99j07K18K33mj55L29R3k40n1J7J49k34o9j19j82o6L4k50j25j94
$$ -200 -179 -99 200 93 311 544 540 385 714 807 567 516 533 682 448 379 260 78 12 46 -204 -329 -523
2739e23L76j09l26L14kj51k7J73K17n0qJ50L46l47K62Q2Q5j23nj3J84Q3l29m2
$$ -523 -147 -256 -582 -268 -270 -421 -448 -275 -58 -108 -116 34 380 33 295 377 462 339 334 321 505 588 259 217
2763B17J48j92l54J14j10j79o1r3j82L36l13J66K97j76k56J23L45p8J49Q5K64
$$ 217 365 173 -181 -67 -177 -356 -417 -510 -692 -356 -669 -503 -206 -382 -638 -515 -170 -248 -99 -14 250
2784B50K81j76N1K21j28J7J24k82L92m09k5Oj96J29j23l29K59j79k26k46O1K07
$$ 250 531 355 406 627 499 516 640 358 750 341 316 322 126 255 132 -197 62 -117 -343 -589 -528 -321
2806c21l27J12k12Q5K51k38L07MJ74J01J56o5R1Q3ppN0K60oj60J56l11o7k0k00
$$ -321 -648 -536 -748 -663 -412 -650 -343 -339 -165 -64 92 27 118 201 194 187 237 497 491 331 487 176 109 89 -111
2831a11rj04J48j72j59M21p15M15P4Pk65m7O8K62Q4J61J14j73N21k58j20P6K99
$$ -111 -120 -224 -76 -248 -407 14 -701 -286 -212 -205 -470 -517 -449 -187 -103 58 172 -1 520 262 142 218 517
2854E17J1j00j12j43L2n9M7k42K8r6n8j58J51j57p6p7j27K77m2m4J52j50K10j13
$$ 517 528 428 316 173 205 146 193 -49 -21 -117 -175 -333 -182 -339 -415 -492 -619 -342 -384 -428 -276 -426 -216 -329
2878c29K96KJ16J4L20K00l9j50M2J43j82M90o22J3J53k44l58KN3k66j53N52m05
$$ -329 -33 -31 85 99 419 619 580 430 472 615 433 923 301 314 467 223 -135 -133 -80 -346 -499 53 -352
2901c52j18k98K47k6N1J39J29k00L8L73j72K81j07N9J78K9k0Q7J90m0k26M68l74
$$ -352 -470 -768 -521 -547 -496 -357 -228 -428 -390 -17 -189 92 -15 44 222 251 231 318 508 468 242 710 336
2924C36r1j50K37j80j7l2j93n5k36J65l11K50j22K02N2j26J67p4K9J81K61m19
$$ 336 245 95 332 152 135 103 -90 -145 -381 -216 -527 -277 -399 -197 -145 -271 -104 -178 -149 32 293 -126
2946a26K44L23k04jL88j61J5k04o6L60m58K26m36J1M7j80P1n4l21J19j07M0J78
$$ -126 118 441 237 236 624 463 478 274 208 568 110 336 -100 -89 -42 -222 -151 -205 -526 -407 -514 -474 -296
2969b96j62J88j35R3M1K68k61K41K26K0J03p9K06L04l69L12m04J00j95O9J7n0
$$ -296 -458 -270 -405 -312 -271 -3 -264 -23 203 223 326 247 453 757 388 700 296 396 201 270 287 237
2991B37M0k59j57K57k04j56j2k27l3K8Q8j01O1L29k59mm9O07k92O0L68n3l1J25
$$ 237 277 18 -139 118 -86 -242 -254 -481 -514 -486 -398 -499 -438 -109 -368 -372 -421 186 -106 -46 322 269 238 363
3015C63J33j50kL9l83J08R4L1j93j91L17k47r7p4l71M37k32K8jJ86rj64J61j76
$$ 363 496 346 344 383 0 108 202 233 40 -151 166 -81 -178 -252 -623 -186 -418 -390 -391 -205 -214 -378 -217 -393
3039c93K94J42J36M2l48K87M66m32L19K49l39j30J96k57j26J53l6l9m67J92rk71
$$ -393 -99 43 179 221 -127 160 626 194 513 762 423 293 489 232 106 259 223 184 -283 -91 -100 -371
3061c71O4j64L4j97L53K9j89O8K20l12K12K44l9J87j39J16K06J38J12L2J9l5m25
$$ -371 -307 -471 -437 -634 -281 -252 -441 -373 -153 -465 -253 -9 -48 139 0 116 322 460 572 604 623 588 163
3084A63P3j8K56j41j79J01p3m72N9q4P2M6J66l94K29p3j73J31q5K56J70R1Qk60
$$ 163 236 218 474 333 154 255 182 -290 -231 -315 -243 -197 -31 -425 -196 -269 -442 -311 -396 -140 30 121 129 -131
3108a31M11l9j01J09K00l11L03lp2l8P0j11l4L5n23K6j04j8K41l11Q5r7J11K55
$$ -131 280 241 140 249 449 138 441 438 366 328 398 287 253 288 -235 -209 -313 -331 -90 -401 -316 -413 -302 -47
3132d7k72J95n0J89J23n9j3K13j67o1M44r3l2no3j74J44n4m1N7m3j63J37n90J74
$$ -47 -319 -124 -174 15 138 79 66 279 112 51 495 402 370 365 302 128 272 218 177 234 191 28 165 -425 -251
3157b51L15n14M2J55k31J50K28k89j15K20L50j68K51J30k4j60K26j87L60n5n8
$$ -251 64 -450 -408 -253 -484 -334 -106 -395 -510 -290 60 -108 143 273 249 89 315 128 488 433 375
3178C75k02K30j74l4J39k19j0M7M2l31j26M5j15l49K64r6K61j8J15m42L76j88
$$ 375 173 403 229 195 334 115 105 152 194 -137 -263 -218 -333 -682 -418 -514 -253 -271 -156 -598 -222 -410
3200d10L46j69K09Q2j27N18j28l61N10j08k19K56k76K71k9k22J5k40J53l10L0
$$ -410 -64 -233 -24 58 -69 449 321 -40 470 362 143 399 123 394 365 143 158 -82 71 -239 -209
3221b09n4M1j50j32k8m3K2J04J62r4j82M69M2K19j9j60J05j15K70K23p0j87K2
$$ -209 -263 -222 -372 -504 -532 -575 -553 -449 -287 -381 -563 -94 -52 167 148 -12 93 -22 248 471 401 214 236
3244B36oJ13k24n4rK88n50K34k43q4L4L6m7J09k13j56N20m76J14K64Qj7k76L75
$$ 236 230 343 119 65 56 344 -206 28 -215 -299 -265 -229 -276 -167 -380 -536 -16 -492 -378 -114 -106 -123 -399 -24
3268b4K10k14O6J56M8K08K6j62Q5p3j71n4P4j70OK34m57m0J1j52R7k6r5K50j35
$$ -24 186 -28 38 194 242 450 476 314 399 326 155 101 175 5 11 245 -212 -252 -241 -393 -296 -322 -417 -167 -302
3293c02N6lJ70k08J69P6j30J05M60l86L94m2o2R7J01r9p0k08R0J4p3r1j02J31
$$ -302 -246 -249 -79 -287 -118 -42 -172 -67 393 7 401 359 297 394 495 396 326 118 208 222 149 58 -44 87
3317H7j65l11Q3m9N8j97J81k05J35mK03k8p6J09L66m0l8J45l49K89J7L73j51p4
$$ 87 -78 -389 -306 -355 -297 -494 -313 -518 -383 -387 -184 -212 -288 -179 187 147 109 254 -95 194 211 584 433 359
3341C59J77m39L13k68K8j16j5j27j83K82n7k82R0m2r6J52J34k55J94q7K85j98
$$ 359 536 97 410 142 170 54 39 -88 -271 11 -46 -328 -238 -280 -376 -224 -90 -345 -151 -238 47 -151
3363a51o6N7L07kJ88k73K50o0j57J36k23M32l31J89j96O4k32O9j98J86j43k83
$$ -151 -217 -160 147 145 333 60 310 250 93 229 6 438 107 296 100 164 -68 1 -197 -11 -154 -437
3385d37J28J15j40Oj14K53r8K20n9K9J14k21L03K21k6j0K1j15J88k80J17K40l86
$$ -437 -309 -194 -334 -328 -442 -189 -287 -67 -126 -97 17 -204 99 320 294 284 305 190 378 98 215 455 69
3408F9J05P0k40k7n9q7j86M5q3L72j37j60q4q7K67mp9J32o1J53J32Q5j40J14L09
$$ 69 174 244 4 -23 -82 -169 -355 -310 -393 -21 -158 -318 -402 -489 -222 -226 -305 -173 -234 -81 51 136 -4 110 419
3433D19j92M65l86J14lL2j89j05k37J95l1O7j60j83k0L2M5m42L78J16j72J34k13
$$ 419 227 692 306 420 417 449 260 155 -82 113 82 149 -11 -194 -214 -182 -137 -579 -201 -85 -257 -123 -336
3456c36J15J08P2j38M8L11j36L37l29J92P4n7j40M07k95p8J39j02n3K14n11r7
$$ -336 -221 -113 -41 -179 -131 180 44 381 52 244 318 261 121 528 233 155 294 192 139 353 -158 -255
3478b55J13O7k71m0K32j35L25l40p7k4K68K43l19K52n2q7J83K75l28J25K65J10
$$ -255 -142 -75 -346 -386 -154 -289 36 -304 -381 -405 -137 106 -213 39 -13 -100 83 358 30 155 420 530
3500E30m20p0J69j13RP5j33J9kq0K69m03j95M02j93j80l5L97k37k06L36k52K8
$$ 530 110 40 209 96 105 180 47 66 64 -16 253 -150 -345 57 -136 -316 -351 46 -191 -397 -61 -313 -285
3523b85J61R7J10M9j0p4j05J69K84J14n2l48K33p3j09K94l37j25m1l50N01r0j03
$$ -285 -124 -27 83 132 122 48 -57 112 396 510 458 110 343 270 161 455 118 -7 -48 -398 103 13 -90
3546i0P7j14J33k53R6R3j42j63P9O7L95j68p6L94j46J39k9j00j00K74j00J70k59
$$ -90 -13 -127 6 -247 -151 -58 -200 -363 -284 -217 178 10 -66 328 182 321 292 192 92 366 266 436 177
3569A77o8J59j58J3j62Kk58K46j50j73M9n5J15l52O46l93P4K76J9l4J07k25M73
$$ 177 109 268 110 123 -39 -37 -295 -49 -199 -372 -323 -378 -263 -615 31 -362 -288 -12 7 -27 80 -145 328
3592C28k47J51j23NK71j67P4QJ4m18K57r6L7l1m3l3j68J54l2j26m1j2n9n5J88
$$ 328 81 232 109 114 385 218 292 300 314 -104 153 57 94 63 20 -13 -181 -27 -59 -185 -226 -238 -297 -352 -164
3617a64o6K21M3k32P7J16J58l08K01K08j71L7j6J74j12r9K40k13j01l2K0K9j37
$$ -164 -230 -9 34 -198 -121 -5 153 -155 46 254 83 120 104 278 166 67 307 94 -7 -39 -19 10 -127
3640a27k20J42OJ11q9j5j75o1k90L88J86nn1j22L17K6K36j18Q5k83M03K0j31J17
$$ -127 -347 -205 -199 -88 -177 -192 -367 -428 -718 -330 -144 -149 -200 -322 -5 21 257 139 224 -59 344 364 233 350
3664C50m2l00L38R8k78k96J71q5j35p3j83j39L56P9k35J01j6Ml3P5L7K94j11J3
$$ 350 308 8 346 444 166 -130 41 -44 -179 -252 -435 -574 -218 -139 -374 -273 -289 -285 -318 -243 -206 88 -23 -10
3688a0J9J27j27K33k47K83j09k57K65J04m74L99J15q8l13j53J67j40l1qJ28p9
$$ -10 9 136 9 242 -5 278 169 -88 177 281 -193 206 321 233 -80 -233 -66 -206 -237 -245 -117 -196
3710a96k11J11N7L24k00k48J93l7K86n5J71j88J95k35K14M1j42L00n3j03N2k01
$$ -196 -407 -296 -239 85 -115 -363 -170 -207 79 24 195 7 202 -33 181 222 80 380 327 224 276 75
3732G5k0J06N5j42j36r1Oj13J36j94o0N43l04k05K04j00j1R8%J9m7J28k32M47
$$ 75 55 161 216 74 -62 -153 -147 -260 -124 -318 -378 165 -139 -344 -140 -240 -251 -153 -153 -134 -181 -53 -285 162
3756A62l0QN4N1K8L6k62K12P5m0l40K62m19J15j04J11j32m9K9J15J5k77J27K16
$$ 162 132 140 194 245 273 309 47 259 334 294 -46 216 -203 -88 -192 -81 -213 -262 -233 -118 -103 -380 -253 -37
3780c7%Q0k06J41O5J61l9o0R0J49N3j37j03j91K19J03P9k52J17l39J07J73l41
$$ -37 -37 43 -163 -22 43 204 165 105 195 344 397 260 157 -34 185 288 367 115 232 -107 0 173 -168
3803a68K45k58j46J67K3lk1j91K05L09k56P4n5l1J76o2kR7k4L71j50j15k52L52
$$ -168 77 -181 -327 -160 -137 -140 -161 -352 -147 162 -94 -20 -75 -106 70 8 6 103 79 450 300 185 -67 285
3827B85k35R9J4k40q4K6o2p5n8J21k5PQ4K51m20K1rK25j36R9N2Q2J96l26J66R8
$$ 285 50 149 163 -77 -161 -135 -197 -272 -330 -209 -234 -227 -143 108 -312 -291 -300 -75 -211 -112 -60 22 218 -108 58 156
3853A56M49m04K45l54nQ9qJ18J6k86P2j64L2j0j44L60l25j25k50L31j77J36L0
$$ 156 605 201 446 92 87 176 168 286 302 16 88 -76 -44 -54 -198 162 -163 -288 -538 -207 -384 -248 -218
3876b18O9m1K44j5j04j2L52m3j25K54j69m2J06j92J63k83L27k35J37j57k5o4r7
$$ -218 -149 -190 54 39 -65 -77 275 232 107 361 192 150 256 64 227 -56 271 36 173 16 -9 -73 -170
3899a70q2J60J45k91K36l03J05pkJ14k28L31q5J9K8K3J88K1l10K40J58o7J08m7
$$ -170 -252 -92 53 -238 -2 -305 -200 -207 -209 -95 -323 8 -77 -58 -30 -7 181 202 -108 132 290 223 331 284
3923B84k28pJ18j28q7o3m3L5J05k93K7K44k13m8J19O3L5J50k11L3K09l3k22J52
$$ 284 56 49 167 39 -48 -111 -154 -119 -14 -307 -280 -36 -249 -297 -178 -115 -80 70 -141 -108 101 68 -154 -2
3947bj89K27M1m7M22k98j73K07P4r2K4j03Rj12J90k76jQ9j26O5j4k29J63n7j20
$$ -2 -191 36 77 30 452 154 -19 188 262 170 194 91 100 -12 178 -98 -99 -10 -136 -71 -85 -314 -151 -208 -328
3972c28K80j70K30j34J02j46O3J79k9L24m06K87k06P8J52J19j14L7m5k18J90k71
$$ -328 -48 -218 12 -122 -20 -166 -103 76 47 371 -35 252 46 124 276 395 281 318 273 55 245 -26
3994b6pk5O0j12j07KJ00P4k10K04j21N1o0L54k3Q3l64L12JJ05N0k52Q4J14j19
$$ -26 -33 -58 2 -110 -217 -215 -115 -41 -251 -47 -168 -117 -177 177 154 237 -127 185 186 291 341 89 173 287 168
4019A68j63K69k06K16k59O7k0L4j03K80n12J81q9l20J93L70k15k31L51k2l01N4
$$ 168 5 274 68 284 25 92 72 106 3 283 -229 -48 -137 -457 -264 106 -109 -340 11 -11 -312 -258
4041b58J70M2R0o6k6K93J4j82q9J96j00J68n5j00Qj22r5K05r2j78O1j3J39k16
$$ -258 -88 -46 44 -22 -48 245 259 77 -12 184 84 252 197 97 105 -17 -112 93 1 -177 -116 -129 10 -206
4065b06j18J34L18l05O3L31l88J82q5J23j12J20J41j85J50j81K61J72k93J26j4
$$ -206 -324 -190 128 -177 -114 217 -171 11 -74 49 -63 57 198 13 163 -18 243 415 122 248 234
4086B34o6qj79J33k13O7J83k61P0j16l19L85k54P2m5K54J6j87K40LR1kR7l45K85
$$ 234 168 160 -19 114 -99 -32 151 -110 -40 -156 -475 -90 -344 -272 -317 -63 -47 -234 6 9 100 98 195 -150 135
4111A35K02n00o6L73O3J89j74k58J62j9j87J76j79M8n0M3l41L6L50j15k4j02j63
$$ 135 337 -163 -229 144 207 396 222 -36 126 107 -80 96 -83 -35 -85 -42 -383 -347 3 -112 -136 -238 -401
4134d01N11l92J70M4J52Oo8J13kk08J10M8K2L45j40j36pk69K05P0p9J62m23k54
$$ -401 110 -282 -112 -68 84 90 22 135 133 -75 35 83 105 450 310 174 167 -102 103 173 94 256 -167 -421
4158d21L42j6j05r3L44k87J12j27j94J06K41m8J82j26L8K91k28K15j32J42O6l15
$$ -421 -79 -95 -200 -293 51 -236 -124 -251 -445 -339 -98 -146 36 -90 -52 239 11 226 94 236 302 -13
4180a3K10q7J47o3j23J22k61J98p4j36l06L65l7r1J6J1r4M9Qj16J5K6J25M2o6
$$ -13 197 110 257 194 71 193 -68 130 56 -80 -386 -21 -58 -149 -133 -122 -216 -167 -159 -275 -260 -234 -109 -67 -133
4205a33K02j57P4k6j8j02K16J27k11K56k33L38r4k72p5J14j3j13M4k99J1L22m14
$$ -133 69 -88 -14 -40 -58 -160 56 183 -28 228 -5 333 239 -33 -108 6 -7 -120 -76 -375 -364 -42 -456
4228d56N77l66J03k4j9J60j17J08j1K62K73l91J60k04n9K48k09n6J16k20L97L2
$$ -456 121 -245 -142 -166 -185 -25 -142 -34 -45 217 490 99 259 55 -4 244 35 -21 95 -125 272 304
4250C04k49J46k62o3J05NJj36o9j07J36Q4j56J45N4P0n6j09L01j59J8L92l47O8
$$ 304 55 201 -61 -124 -19 -14 -13 -149 -218 -325 -189 -105 -261 -116 -62 8 -48 -157 144 -15 3 395 48 116
4274A16j39K14k63K25n4K9q9Q4j63j50K97j10Q7l20Q3N3k60J63K6k4K7n9%J10
$$ 116 -23 191 -72 153 99 128 39 123 -40 -190 107 -3 84 -236 -153 -100 -360 -197 -171 -195 -168 -227 -227 -117
4298a17O3n2j6J4K21L5j62J24N7J02k98M2J89k24L68n22J43J08q8m6n8L7J42l08
$$ -117 -54 -106 -122 -108 113 148 -14 110 167 269 -29 13 202 -22 346 -176 -33 75 -13 -59 -117 -80 62 -246
4322b46J95j46J4Q6N5l80K72J75k35j47M04o2N5O6J32p7m4J68p8N1l51K62l69
$$ -246 -51 -197 -183 -97 -42 -422 -150 25 -210 -357 47 -15 40 106 238 161 117 285 207 258 -93 169 -200
4345b00M24j71j88J86j02R2QM4l79Q0j10Q2J42K26k71J20o8o1J11k78J99Q0K55
$$ -200 224 53 -135 51 -51 41 49 93 -286 -206 -316 -234 -92 134 -137 -17 -85 -146 -35 -313 -114 -34 221
4368B21j91j18J68O8M6K47m12J26o4M2l51J08N4qR2j02L44m14K25j56P5K0j62
$$ 221 30 -88 80 148 194 441 29 155 91 133 -218 -110 -56 -64 28 -74 270 -144 81 -75 0 20 -142
4391a42l6p4l4J87j77J13M95k90J2J20r1K45l53K57q8Q2k01q4K30o4j63OL4pq3
$$ -142 -178 -252 -286 -99 -276 -163 332 42 54 174 83 328 -25 232 144 226 25 -59 171 107 -56 -50 -16 -23 -106
4416a06j1L09n71K00p1L4MM21l62J26n6m7J46J15r0J1q1J19J06q6l29K64K18r9
$$ -106 -117 192 -379 -179 -250 -216 -212 209 -153 -27 -83 -130 16 131 41 52 -29 90 196 110 -219 45 263 164
4440A64j76R0k56K42o4m0J63j67N8l8q0M8k02K95K3j20k5j00L09j03j6r0J73J72
$$ 164 -12 78 -178 64 0 -40 123 -44 14 -24 -104 -56 -258 37 60 -60 -85 -185 124 21 5 -85 88 260
4464B60k53J27L6k3J9m67L68J06j84J68p6j0m2j81J04J36j14k65J67o4J19M1q7
$$ 260 7 134 170 147 166 -301 67 173 -11 157 81 71 29 -152 -48 88 -26 -291 -124 -188 -69 -28 -115
4487a15Q0Kr2O4j72K56j23K00k06J95L0L9k17K15J46j95l7P9j85J23o4k10R2R8
$$ -115 -35 -33 -125 -61 -233 23 -100 100 -106 89 119 158 -59 156 302 107 70 149 -36 87 23 -187 -95 3
4511Cr4K02p8q0J9k61K16J54k31R4Q8o8l2o6L78k98K40Jp0L9O4j96J49q0k02K79
$$ 3 -91 111 33 -47 -28 -289 -73 81 -150 -56 32 -36 -68 -134 244 -54 186 187 117 156 220 24 173 93 -109 170
4537A70k61J77J5k5p5K02l51L42l62j77K92J77j75j18K26j84k4K7J73j70J86J5
$$ 170 -91 86 101 76 1 203 -148 194 -168 -345 -53 124 -51 -169 57 -127 -151 -124 49 -121 65 80
4559H0l05M48k5k76K43j08N7L76n72K32l04K46j60l7K81j62m1p9m5J37J58l38
$$ 80 -225 223 198 -78 165 57 114 490 -82 150 -154 92 -68 -105 176 14 -27 -106 -151 -14 144 -194
4581a94J30p5m4KP7ojM3N3j57K99J8j53J80J42l05J3J20jO7k93J62Q3L03m26J1
$$ -194 -64 -139 -183 -181 -104 -110 -111 -68 -15 -172 127 145 -8 172 314 9 22 142 141 208 -85 77 160 463 37 48
4607D8L4k25M1J48k44J66o0j68K23O8j00L2K83k79K5J21n3J16J17m37o9K09j99
$$ 48 82 -143 -102 46 -198 -32 -92 -260 -37 31 -69 -37 246 -33 -8 113 60 176 293 -144 -213 -4 -203
4630b03N36l35O2j4j20L9KJ22j21Q8J00k51j48K84j21m8o0M4n3j42K92P6j87J30
$$ -203 333 -2 60 46 -74 -35 -33 89 -32 56 156 -95 -243 41 -80 -128 -188 -144 -197 -339 -47 29 -158 -28
4654b8P9p4qp1P8K4J35l7p7J83M1j02J90k35J12j32Q8m2j08o1j24Oj44K17k3M3
$$ -28 51 -23 -31 -102 -24 0 135 98 21 204 245 143 333 98 210 78 166 124 16 -45 -169 -163 -307 -90 -113 -70
4680g0O5q4j2k51K22O9J19J28p1r1n8J59l7J12j69Q1K30l27k15K34J30k39R7P5
$$ -70 -5 -89 -101 -352 -130 -61 58 186 115 24 -34 125 88 200 31 112 342 15 -200 34 164 -75 22 97
4704I7j58j79K20o9J16N5q4kJ15j40l6j8K31j84lk5M1K69r8j3j84j79J64K97l73
$$ 97 -61 -240 -20 -89 27 82 -2 -4 111 -29 -65 -83 148 -36 -39 -64 -23 246 148 135 -49 -228 -64 233 -140
4729a40N03m48K38k16J38p3l3K6j59K08k38K02p7j28j9Pj29N58j92k05J17N8J47
$$ -140 363 -85 153 -63 75 2 -31 -5 -164 44 -194 8 -69 -197 -216 -209 -338 220 28 -177 -60 -2 145
4752A45o2j94k4Q0Q4p0P0PL24j90j32N3q5j16K36m44M31j59j27J43j96J96j32
$$ 145 83 -111 -135 -55 29 -41 29 36 360 170 38 91 6 -110 126 -318 113 -46 -173 -30 -226 -30 -162
4775a62j86K49%R8k6j52K36L12j28l38PK78m6j47P1J72q1Jr7k61L25j09K82k29
$$ -162 -348 -99 -99 -1 -27 -179 57 369 241 -97 -90 188 142 -5 66 238 157 158 61 -200 125 16 298 69
4799F9P6n6nM1j83p9p5R6j21J54p9J15k5p5j99K44J06k37K96j48J6J47j43J61
$$ 69 145 89 84 125 -58 -137 -212 -116 -237 -83 -162 -47 -72 -147 -346 -102 4 -233 63 -85 -69 78 -65 96
4823I6k1n5J95k27K25k25j22k3J67q0K73j66j02M5J49q4R7k53j0j14J78O1l61
$$ 96 75 20 215 -12 213 -12 -134 -157 10 -70 203 37 -65 -20 129 45 142 -111 -121 -235 -57 4 -357
4846c57L93j35k1p6J39QQ5J28k31Q0M14l66n6j74L17p6j5R9j03k89L9R3Jp2L20
$$ -357 36 -99 -120 -196 -57 -49 36 164 -67 13 427 61 5 -169 148 72 57 156 53 -236 -197 -104 -103 -175 145
4871A45j45p8J53n05K17J00n5L7k67M93K35k06O8l0k59M82l85R3j14J74k07J97
$$ 145 0 -78 75 -430 -213 -113 -168 -131 -398 95 330 124 192 162 -97 385 0 93 -21 153 -54 143
4893A43k42r3M06l07J03o5J65p4j91r7o5K91o8J95k43R7j59M7Q1r3j05J20K15
$$ 143 -99 -192 214 -93 10 -55 110 36 -155 -252 -317 -26 -94 101 -142 -45 -204 -157 -76 -169 -274 -154 61
4916F1P7J34l54R5P0J83k83l6J48k88M38k85J47j20L0k0K67l10l27J16J10J23
$$ 61 138 272 -82 13 83 266 -17 -53 95 -193 245 -40 107 -13 17 -3 264 -46 -373 -257 -147 -24
4938b4O7j31l53L44L38j37k61P7L5n1q1J05KP9K33k17k3l2n6M7K9k8rJ60j59J19
$$ -24 43 -88 -441 -97 241 104 -157 -80 -45 -96 -177 -72 -70 9 242 25 2 -30 -86 -39 -10 -38 -47 113 -46 73
4964G3k02P8R1j67O1q4m0J59l86M70j61L7Q7J13k95J15k1J1K32k06K12j55J87
$$ 73 -129 -51 40 -127 -66 -150 -190 -31 -417 53 -108 -71 16 129 -166 -51 -72 -61 171 -35 177 22 209
4987B09j70o8K39n2k80N26l51M2j55J65j07j25J86j77L29l67q3m3J19K45m62J38
$$ 209 39 -29 210 158 -122 404 53 95 -60 105 -2 -127 59 -118 211 -156 -239 -282 -163 82 -380 -242
5009b42K52j63J28K34l49K42J48j57m3n1Q4n1k5o6J93k91K82j51J05j89lPJ21
$$ -242 10 -153 -25 209 -140 102 250 93 50 -1 83 32 7 -59 134 -157 125 -26 79 -110 -113 -106 15
5032A5q1j22K33l22J39K09j35k55L97j32m9M1K42J78k11k77K33Q0r0%R6j69L2
$$ 15 -66 -188 45 -277 -138 71 -64 -319 78 -54 -103 -62 180 358 147 -130 103 183 93 93 189 20 52
5055E2L28k36j07OKk29K55k77M8P6M2r2K94k75K70q4l22K57L2o6K83j29m9o2Q4
$$ 52 380 144 37 43 45 -184 71 -206 -158 -82 -40 -132 162 -113 157 73 -249 8 40 -26 257 128 79 17 101
5080A01O6j92L10k29L7J14q8l1pj04p4J04j13J13p3j73K04j10K87j86j11l4j00
$$ 101 167 -25 285 56 93 207 119 88 81 -23 -97 7 -106 7 -66 -239 -35 -145 142 -44 -155 -189 -289
5103b89J33j36L47n2R7l37J89J91j82P2J11m8r4K69j80j19l19M42l7k0j29K18
$$ -289 -156 -292 55 3 100 -237 -48 143 -39 33 144 96 2 271 91 -28 -347 95 58 38 -91 127
5125A27M8j5n8k32J52p0o1Q9J48j91k12J83J56r1L17j92k11J15L9j39J42k7M4
$$ 127 175 160 102 -130 22 -48 -109 -20 128 -63 -275 -92 64 -27 290 98 -113 2 41 -98 44 17 61
5148F1k19K84m6K51m69pJ52J12J44m44L46K93n89nN1K51k77O2J57k02n1J12J91
$$ 61 -158 126 80 331 -138 -145 7 119 263 -181 165 458 -131 -136 -85 166 -111 -49 108 -94 -145 -33 158
5171A58l7O8k69J36J3j4j20R7L06j37j15j50L33l10j83M7K50J84l05K77k95m7
$$ 158 121 189 -80 56 69 55 -65 32 338 201 86 -64 269 -41 -224 -177 73 257 -48 229 -66 -113
5193a13K9j3J9n5pK71j76k19L40l24J25n9J60J7J29N8l05j29K26k5N0m3J51j86
$$ -113 -84 -97 -78 -133 -140 131 -45 -264 76 -248 -123 -182 -22 -5 124 182 -123 -252 -26 -51 -1 -44 107 -79
5217g9o3K70k87J41J81k59K19J26n85N59n52K67O1k07J12K5R6j44K32Q1j77l5
$$ -79 -142 128 -159 -18 163 -96 123 249 -336 223 -329 -62 -1 -208 -96 -71 25 -119 113 194 17 -18
5239a8j51L17J19p8j09Q7j51J95pj17n3LJ74k68j94L70P1k42O7k65Q1L50l03K03
$$ -18 -169 148 267 189 80 167 16 211 204 87 34 37 211 -57 -251 119 190 -52 15 -250 -169 181 -122 81
5263H1k07n9L8j3J27j23R7j13J59J18j50j32K58j23j19K65j23ro5L7J91k15J82
$$ 81 -126 -185 -147 -160 -33 -156 -59 -172 -13 105 -45 -177 81 -42 -161 104 -19 -28 -93 -56 135 -80 102
5286A02O4n25L07J02j22j07n3J59L1n0L30k18R4k68k0K31j38M2P1J12j99K54j46
$$ 102 166 -359 -52 50 -72 -179 -232 -73 -42 -92 238 20 114 -154 -174 57 -81 -39 32 144 -55 199 53
5309E3O9j20K67m15M1J1Q9P2j67K72q5k84L10o6k05LP0r5Q3L82k41J10j93rK00
$$ 53 122 2 269 -146 -105 -94 -5 67 -100 172 87 -197 113 47 -158 -155 -85 -180 -97 285 44 154 -39 -48 152
5334A52k9k92L09O3k13N0n8K5n6K06o8m5j19J02m1N8j09K08k05j55J42K4L7Pj63
$$ 152 123 -169 140 203 -10 40 -18 7 -49 157 89 44 -75 27 -14 44 -65 143 -62 -217 -75 -51 -14 -7 -170
5359a70K9J07l9J36Qj28k3L4K9M6J3j19O4J53o7o5k1N2K06l30o8K74Qk54j01K64
$$ -170 -141 -34 -73 63 71 -57 -80 -46 -17 29 42 -77 -13 140 73 8 -13 39 245 -85 -153 121 129 -125 -226 38
5385C8Q8p7p8j12J2k5n3J38o7J98P8K2J11m24K85N9j61m6K12j97L7N3K0j12L9
$$ 38 126 49 -29 -141 -129 -154 -207 -69 -136 62 140 162 273 -151 134 193 32 -14 198 1 38 91 111 -1 38
5410C8L1O6j05n9P0j30J58p0l07K37j1O7j86K32k27J35j45K60l0Rk75J00K63K78
$$ 38 69 135 30 -29 41 -89 69 -1 -308 -71 -82 -15 -201 31 -196 -61 -206 54 24 33 -242 -142 121 399
5434C99m45J35K4nl72J43J51lj04L48l70p1L50l84K07l9J7O6j26r6rJ28p5M3Q3
$$ 399 -46 89 113 108 -264 -121 30 27 -77 271 -99 -170 180 -204 3 -36 -19 47 -79 -175 -184 -56 -131 -88 -5
5459ej62K58r1L1j68J51q9J01j59KL13p2j31j92K15k3J01p9j87K01j28M00m34
$$ -5 -167 91 0 31 -137 14 -75 26 -133 -131 182 110 -21 -213 2 -21 80 1 -186 15 -113 287 -147
5482a47Q6R3J56k97q1J87o2K0J47l9m4J73j50l33K55J35q1M0m8N9L7J33l8l07
$$ -147 -61 32 188 -109 -190 -3 -65 -45 102 63 19 192 42 -291 -36 99 18 58 10 69 106 239 201 -106
5506a06q0K10J24l33N3J59L1O9j88M1J96k19j7j76K66J10l47O2J76M1k34P5Q5
$$ -106 -186 24 148 -185 -132 27 58 127 -61 -20 176 -43 -60 -236 30 140 -207 -145 31 72 -162 -87 -2
5529bJ25QP4m37M18j2j68p2K37k51J24K8k09K9p4j02K90J25p2J11k43PL0m5l3
$$ -2 123 131 205 -232 186 174 6 -66 171 -80 44 72 -137 -108 -182 -284 6 131 59 170 -73 -66 -36 -81 -114
5554a14J21m2R7M9K4k73K74j85j35OJ5J66M0J1L7n37O37Rk65K12o8k98L29Q2N7
$$ -114 7 -35 62 111 135 -138 136 -49 -184 -178 -163 3 43 54 91 -446 191 200 -65 147 79 -219 110 192 249
5579B49n72L14n5j32K32k02K23l24L36j94j34P7PJ56J15J77j80J28j23L3j81J89
$$ 249 -323 -9 -64 -196 36 -166 57 -267 69 -125 -259 -182 -175 -19 96 273 93 221 98 131 -50 139
5601A39l01K25j6j03O7j03P2J12j85j15J57pJ16j07n7J01J86k36q1oM1M5kM3l
$$ 139 -162 63 47 -56 11 -92 -20 92 -93 -208 -51 -58 58 -49 -106 -5 181 -55 -136 -142 -101 -56 -58 -15 -18
5626a8KJ57k38R3J29k19K72j80j42K17J36k75J27J13k04J61q6m1K1J80j19k6p9
$$ -18 -16 141 -97 -4 125 -94 178 -2 -144 73 209 -66 61 174 -30 131 45 4 25 205 86 60 -19
5649a9R7j98M8o7n5J50l1J03P3q6J43j09j41J91P4r1q4R5K4l64O9K49j38L1J27
$$ -19 78 -120 -72 -139 -194 -44 -75 28 101 15 158 49 -92 99 173 82 -2 93 117 -247 -178 71 -67 -36 91
5674I1k57O3ro3O6J33j38K74l47N1rK14n1lj29J77j96J90j55k5J47J17r5J99k81
$$ 91 -166 -103 -112 -175 -109 24 -114 160 -187 -136 -145 69 18 15 -114 63 -133 57 -98 -123 24 141 46 245 -36
5699c6L8L2k15M2k3K64j49j32J34j04o2K46l39N1K78j35n6K73p6N5q0r1J16k32
$$ -36 2 34 -181 -139 -162 102 -47 -179 -45 -149 -211 35 -304 -253 25 -110 -166 107 31 86 6 -85 31 -201
5723b01J46j02J16j42K20R9j63K14j32r6Lm2M4R4l48J78J8J36l7o1k39K28J01
$$ -201 -55 -157 -41 -183 37 136 -27 187 55 -41 -38 -80 -36 58 -290 -112 -94 42 5 -56 -295 -67 34
5746C4j79K20l99o1L53p2j16J08LK01j1k71l8M53m05K58j02L1j8K8K2j12M5J4
$$ 34 -145 75 -324 -385 -32 -104 -220 -112 -109 92 81 -190 -228 225 -180 78 -24 7 -11 17 39 -73 -28 -14
5770a4J62m27M26k37o8J3R1k4P4O5N1j74J7L6ll6p5K82o6k11M4J3O3j8K6q5J29
$$ -14 148 -279 147 -90 -158 -145 -54 -78 -4 61 112 -62 -45 -9 -12 -48 -123 159 93 -118 -74 -61 2 -16 10 -75 54
5797E4q1L47m22N5K0j57J97l2K21j71l8K9o8J86j56L61k42n4rP9k3m9J41p4j27
$$ 54 -27 320 -102 -47 -27 -184 13 -19 202 31 -7 22 -46 140 -16 345 103 49 40 119 96 47 188 114 -13
5822a3P5K8J40m09J78J80J15l14k9J50l36K47J89m01J23n6J08P7k48L81j99P7
$$ -13 62 90 230 -179 -1 179 294 -20 -49 101 -235 12 201 -200 -77 -133 -25 52 -196 185 -14 63
5844F3r7L4k10l2Q8J91J27q6j26K34l02J95J70j94j0M3j59L83k24j39L19m54K47
$$ 63 -34 0 -210 -242 -154 37 164 78 -48 186 -116 79 249 55 45 88 -71 312 88 -51 268 -186 61
5867F1j01K20j01j21j93K03n1L24l39K59m27K29K86j62k12K31k77m1J39J11K5
$$ 61 -40 180 79 -42 -235 -32 -83 241 -98 161 -266 -37 249 87 -125 106 -171 -212 -73 38 63
5888F3r4J22j29J15K84m11j5J9N8O2j6j02K36k08j76P1J48k4K09l84J4K99m4K66
$$ 63 -31 91 -38 77 361 -50 -65 -46 12 74 58 -44 192 -16 -192 -121 27 3 212 -172 -158 141 97 363
5912C63k15l20J47o4J14j17L52j89N4J74o2k21Q1l8j16j7M9k9J61Q2j99Q7k70
$$ 363 148 -172 -25 -89 25 -92 260 71 125 299 237 16 97 59 -57 -74 -25 -54 107 189 -10 77 -193
5935a93L09l50R7K34l56J06N0J32j91L09J17j75j14J02l09L31l3j18J02k42N27
$$ -193 116 -234 -137 97 -259 -153 -103 29 -162 147 264 89 -25 77 -232 99 66 -52 50 -192 335
5956C35k48l43J17j6J54J56k65J34j18J81N5j11Q0Q0k34P0J1j90pL15N6k44L11
$$ 335 87 -256 -139 -155 -1 155 -110 24 -94 87 142 31 111 191 -43 27 38 -152 -159 156 212 -32 279
5979B79j54j66j46R8L22O6j00k45J97j25L72k85r7n1pL3N5L2J68k92J41J57k12
$$ 279 125 -41 -187 -89 233 299 199 -46 151 26 398 113 16 -35 -42 -9 46 78 246 -46 95 252 40
6002D0j31R6K1j16J19lJ30l26J57k78L67J18q6M2j04O3r3j09J4K99j92k8N7o1
$$ 40 -91 5 26 -90 29 26 156 -170 -13 -291 76 194 108 150 46 109 16 -93 -79 220 28 0 57 -4
6026dn3kJ54J8j44J6K28j83q0L2l2K53j3n1J17p5m4j02J26j67l15L62j93k11N00
$$ -4 -57 -59 95 113 -31 -15 213 30 -50 -18 -50 203 190 139 256 181 137 35 161 -6 -321 41 -152 -363 137
6051A37j52J88k22K79l05M8J23j33J81k18J60q9L2r6K31j2q6J19j91j48K11J01
$$ 137 -15 173 -49 230 -75 -27 96 -37 144 -74 86 -3 29 -67 164 152 66 185 -6 -154 57 158
6073A58p6j2j73p5L31k76K40j45j04J24J1N8k6n2k13M31k20p9j28L40j57J6Nj55
$$ 158 82 70 -103 -178 153 -123 117 -28 -132 -8 3 61 35 -17 -230 201 -19 -98 -226 114 -43 -27 -22 -177
6097a77n8J36J57J16m2j86j33J16L98m35J74j07K44k02J14J3l58J39lL3J47q8
$$ -177 -235 -99 58 174 132 -54 -187 -71 327 -108 66 -41 203 1 115 128 -230 -91 -94 -61 86 -2
6119bJ27k4k5m7LJ33m50L59k09P9J92j16J1k26q0J02J20mp0J43J9J31l11J62L4
$$ -2 125 101 76 29 32 165 -285 74 -135 -56 136 20 31 -195 -275 -173 -53 -57 -127 16 35 166 -145 17 51
6144E1j63Q8K80j43k04L8K61j71P5J7N4k23q0J30j0RJ71k75l2K5J6q8M65m03j25
$$ 51 -112 -24 256 113 -91 -53 208 37 112 129 183 -40 -120 10 0 9 180 -95 -127 -102 -86 -174 291 -112 -237
6169b37K18K0M3j81K09oj81M45m14r0J73Jr9K40n43L39j34J19P4k27M24l34J47
$$ -237 -19 1 44 -137 72 66 -115 330 -84 -174 -1 0 -99 141 -402 -63 -197 -78 -4 -231 193 -141 6
6192FL9m0L6j8q2P1o3K10l9J13l00J35k96K54l34N06k40K42k66M4P6j2j43o0K92
$$ 6 45 5 41 23 -59 12 -51 159 120 233 -67 68 -228 26 -308 198 -42 200 -66 -22 54 42 -101 -161 131
6217A31j8n4P4k85L95k55q5mq2J44J36k35J30j49J09L24k18q4o6K26k45oK51m17
$$ 131 113 59 133 -152 243 -12 -97 -101 -183 -39 97 -138 -8 -157 -48 276 58 -26 -92 134 -111 -117 134 -283
6241b83N6Q7L45j14J16k5j95J16l37J24m5K05N8j37O8J53j69k40K27j78n6J34
$$ -283 -227 -140 205 91 207 182 -13 103 -234 -110 -155 50 108 -29 39 192 23 -217 10 -168 -224 -90
6263i0K2rk4N6J42m0ok76J97J23M7q6j57K33n37J77J15J21j40P2K12n4n1k9M5
$$ -90 -68 -77 -101 -45 97 57 51 -225 -28 95 142 56 -101 132 -405 -228 -113 8 -132 -60 152 98 47 18 63
6288F3j11Q0O3k01p3K35k29K02l5l2J97q2K27k50J06N7j52j9r4J8K44j09j26L2
$$ 63 -48 32 95 -106 -179 56 -173 29 -6 -38 159 77 304 54 160 217 65 46 -48 -30 214 105 -21 11
6312A1m2K01k72l01L25J75j75K7l75N48j76M3j03K32k23J0J57m8r6m36L10J03
$$ 11 -31 170 -102 -403 -78 97 -78 -51 -426 122 -54 -11 -114 118 -105 -95 62 14 -82 -518 -208 -105
6334a05K66k68j93M67k00l77M60K03l44J56j35J61n8q4r7K08J45j57m7J30j50
$$ -105 161 -107 -300 167 -33 -410 50 253 -91 65 -70 91 33 -51 -148 60 205 48 1 131 -19
6355a9R6Pk43j30M11j8q3M9k82L10o8M1j89K6K09l5j21R9r6j48L04P9l9j74r5
$$ -19 77 84 -159 -289 122 104 21 70 -212 98 30 71 -118 -92 117 82 -39 60 -36 -184 120 199 160 -14 -109
6380a09p0K81l07J32J64K0j48kJ66k50L12k88J18k18K53j31j80N2L85j46j93K16
$$ -109 -179 102 -205 -73 91 111 -37 -39 127 -123 189 -99 19 -199 54 -77 -257 -205 180 34 -159 57
6402E7p9J48l69L63j32n6O0P6l5l8QoJ28J9J3j22k20J21j4K61j4l92L28m6k3j4
$$ 57 -22 126 -243 120 -12 -68 -8 68 33 -5 3 -3 125 144 157 35 -185 -64 -78 183 169 -223 105 59 36 22
6428B2m0mK31rj6m08L96j80P5j63J76NM1J74n0k88m4K50l40j8K85K5k86M05l38
$$ 22 -18 -22 209 200 184 -224 172 -8 67 -96 80 85 126 300 250 -38 -82 168 -172 -190 95 120 -166 239 -99
6453i9O6m1l7M38k74m5Om52M14j14J90l6j37L61L6k26K00k69k3l9q5L46l74L3
$$ -99 -33 -74 -111 327 53 8 14 -438 -24 -138 52 16 -121 240 276 50 250 -19 -42 -81 -166 180 -194 -161
6477a61K08k39N0K5K23k9l6Q8j41l45O06k51J12k41J17mk00J08L6L1k9l5K38j22
$$ -161 47 -192 -142 -117 106 77 41 129 -12 -357 249 -2 110 -131 -14 -18 -218 -110 -74 -43 -72 -107 131 9
6501Ij23l8j09J12j7M26l60j05k7J61Q3k17R7j05N59l78L3o9m6J21J36k59J18
$$ 9 -114 -152 -261 -149 -166 260 -100 -205 -232 -71 12 -205 -108 -213 346 -32 1 -68 -114 7 143 -116 2
6524Bk00J9J80r6K67Ol48J15ko5J11N9M0m8j86M0K99l56J74n8J00j2j46l1K13
$$ 2 -198 -179 1 -95 172 178 -170 -55 -57 -122 -11 48 88 40 -146 -106 193 -163 11 -47 53 41 -105 -136 77
6549G7j05J48j60J18m0j28N6p2K83j34k40K93k51J29L1M16n29L42j54l8o1j55
$$ 77 -28 120 -40 78 38 -90 -34 -106 177 43 -197 96 -155 -26 5 421 -108 234 80 42 -19 -174
6571a74K4j29L58j53K43l76J77J15k53M9O3K65j70j08K1L4LR0j36J09k69K26N
$$ -174 -150 -279 79 -74 169 -207 -30 85 -168 -119 -56 209 39 -69 -48 -14 -11 79 -57 52 -217 9 14
6594A4K42k42J58q0k3j81OP8J0J12k05PM0j13j63M28P7k23M9k21Q6M8J75o6Q9
$$ 14 256 14 172 92 69 -112 -106 -28 -18 94 -111 -104 -64 -177 -340 88 165 -58 -9 -230 -144 -96 79 13 102
6619A02M0k55J64N7j35P4j45J43k01L28N7l92M47l65J32k05J14J74j79L67q6j68
$$ 102 142 -113 51 108 -27 47 -98 45 -156 172 229 -163 284 -81 51 -154 -40 134 -45 322 236 68
6641F8k42J47k59K09j33K27Kj90P7Q6M8j39K1J99k07J21j79J86k12J71P1k1J61
$$ 68 -174 -27 -286 -77 -210 17 19 -171 -94 -8 40 -99 -78 121 -86 35 -144 42 -170 1 72 51 212
6664B12l39K11M9j71J06j19o0K39j77K05r9l2L3p7J51o3j36L4q1R8k19J12K21
$$ 212 -127 84 133 -38 68 -51 -111 128 -49 156 57 25 58 -19 132 69 -67 -33 -114 -16 -235 -123 98
6687I8j1J1k98J76J75k26o5R0O4m6p4O0mJ72k48K00j9j17q4M5%J25l8j71P6K03
$$ 98 87 98 -200 -24 151 -75 -140 -50 14 -32 -106 -46 -50 122 -126 74 55 -62 -146 -101 -101 24 -14 -185 -109 94
6713I4l9r9j9j6j8R2k6P1R2M3j48P5j2l30K33l0K14j39k0j07nMlJ41k94J38j40
$$ 94 55 -44 -63 -79 -97 -5 -31 40 132 175 27 102 90 -240 -7 -37 177 38 18 -89 -94 -90 -93 48 -246 -108 -248
6740b48O7J89n8j15O8L23j46j09R1j98J59K05k44n3N9p3K09n1n6n6L1R4J39l88
$$ -248 -181 8 -50 -165 -97 226 80 -29 62 -136 23 228 -16 -69 -10 -83 126 75 19 -37 -6 88 227 -161
6764a61k8K80k39K02J7j56p1k1Q2J96K2r5N0K8j58j29k5K20J78k91J58J9q5j96
$$ -161 -189 91 -148 54 71 -85 -156 -177 -95 101 123 28 78 106 -52 -181 -206 14 192 -99 59 78 -7 -203
6788b03K26J69k02j40M46j36j56j2kj12q4n5J98Q0k06K13J89M5l55l0L75j62k38
$$ -203 23 192 -10 -150 296 160 4 -8 -10 -122 -206 -261 -63 17 -189 24 213 258 -97 -127 248 86 -152
6811a52K45L9j53J99j60k89L47j72M27l41o2J30P0J1rn9P5j52q0kK04l08K32r4
$$ -152 93 132 -21 178 18 -271 76 -96 331 -10 -72 58 128 139 130 71 146 -6 -86 -88 116 -192 40 -54
6835e4M8L0n4J37J8j55r9N7J35l2r6J55m08K67R0k6O9N3k33j80M21k31J32K5k
$$ -54 -6 24 -30 107 125 -30 -129 -72 63 31 -65 90 -318 -51 39 13 82 135 -98 -278 143 -88 44 69 67
6860F7M5j20j05j0N2q8R0q1J33j15K05q7j47K02j87J00J63Q0k24k0j54K17l0j0
$$ 67 112 -8 -113 -123 -71 -159 -69 -150 -17 -132 73 -14 -161 41 -146 -46 117 197 -27 -47 -201 16 -14 -24
6884b4m8J82k2k3j68K2Q1j24L00k88K57k81J68j04N0M9k81J84M4K08k24K23nk14
$$ -24 -72 110 88 65 -103 -81 0 -124 176 -112 145 -136 32 -72 -22 27 -254 -70 -26 182 -42 181 176 -38
6908c8M3j31Q8Q7j04P6K16j33J38m17J27j49K78k29K98j85Q8O4j50N5qJ64l32
$$ -38 5 -126 -38 49 -55 21 237 104 242 -175 -48 -197 81 -148 150 -35 53 117 -33 22 14 178 -154
6931a54j66J62j35M11l8R7Nj59k44K53O3q7J87j3j40j83K32R9m25N55L5k49J60
$$ -154 -320 -158 -293 118 80 177 182 23 -221 32 95 8 195 182 42 -141 91 190 -235 320 355 106 266
6954B66j31j29p9q0J58j27J91j66j02K35l28K3L15j69m9Q8K19k94J65j39j36J53
$$ 266 135 6 -73 -153 5 -122 69 -97 -199 36 -292 -269 46 -123 -172 -84 135 -159 6 -133 -269 -116
6976a16J66K98m24J43j44K8k3J26j08j09J45J43q0k49J45R4m0j17K85K4j02l22
$$ -116 50 348 -76 67 -77 -49 -72 54 -54 -163 -18 125 45 -204 -59 35 -5 -122 163 187 85 -237
6998b37J11K86j88K5k69L44%K5o6j14K05j59Q0j04N0M7k67J93p9L04j47n8n0J85
$$ -237 -126 160 -28 -3 -272 72 72 97 31 -83 122 -37 43 -61 -11 36 -231 -38 -117 187 40 -18 -68 117
7022A17j49K36L9j84o8K44j81L1Q7l09L4J06n3j92K73Ro4j40L09k15M0N6K64m17
$$ 117 -32 204 243 59 -9 235 54 85 172 -137 -103 3 -50 -242 31 40 -24 -164 145 -70 -30 26 290 -127
7046a27l0K22Kk09oJ08j7J60j33k4J45r8O6j07p5K62k34p5N9j45Q8R8P2j37R0
$$ -127 -157 65 67 -142 -148 -40 -57 103 -30 -54 91 -7 59 -48 -123 139 -95 -170 -111 -256 -168 -70 2 -135 -45
7071d5J89m10L05m7M3O2J51l46L6j73L38r2m6J11j3J20k36o7J29M2j38K9K8K73
$$ -45 144 -266 39 -8 35 97 248 -98 -62 -235 103 11 -35 76 63 183 -53 -120 9 51 -87 -58 -30 243
7095B43l14K38j54p0J46K4j29q2J4m5J77j6J18Q6M7k13j19N8K81l10J66l45K08
$$ 243 -71 167 13 -57 89 113 -16 -98 -84 -129 48 32 150 236 283 70 -49 9 290 -20 146 -199 9
7118Ik6J63j53r4J87k24j12L00J01r1J37k35o7o5J94J47k09j02n1O2J85O2k48
$$ 9 -17 146 -7 -101 86 -138 -250 50 151 60 197 -38 -105 -170 24 171 -38 -140 -191 -129 56 118 -130
7141a30J68k18R1J58r0J39P7k93K51j15k76K65jn3n4P1N1j45Q2O2m4j92L40J6
$$ -130 38 -180 -89 69 -21 118 195 -98 153 38 -238 27 26 -27 -81 -10 41 -104 -22 40 -4 -196 144 160
7165A60k82J74l70J77J93N5O3j73l01L13Q6j23j77L08K6j33P9J28j28l03J94j76
$$ 160 -122 52 -318 -141 52 107 170 -3 -304 9 95 -28 -205 103 129 -4 75 203 75 -228 -34 -210
7187b10K45J24l84J71K28K0j41K2O5l45O1J12k3j78J36P6Nk41L53j43J65k08O4
$$ -210 35 159 -225 -54 174 194 53 75 140 -205 -144 -32 -55 -233 -97 -21 -16 -257 96 -47 118 -90 -26
7210b6l8j04K91l28K29J61J07k73m5O2L7j50j1q8M94l04oqO0j64J61l29M46J01
$$ -26 -64 -168 123 -205 24 185 292 19 -26 36 73 -77 -88 -176 318 14 8 0 60 -104 57 -272 174 275
7234B75j72r7k13K55n0J56l10J80P9J40k13NN6k68L27j62J90j80p7k1j72L59j04
$$ 275 103 6 -207 48 -2 154 -156 24 103 243 30 35 91 -177 150 -12 178 -2 -79 -100 -272 87 -17
7257a7K6J9l5l22M79R8j85j97J04L2Nj19K01O2m37K86O8R0j71j38K8K02j86J04
$$ -17 9 28 -7 -329 150 248 63 -134 -30 2 7 -112 89 151 -286 0 68 158 -13 -151 -123 79 -107 -3
7281cl9R4O0k29J88J01j18j85L25l15J71j86K16j22J4J15j49N03m57K8M7l64M13
$$ -3 -42 52 112 -117 71 172 54 -131 194 -121 50 -136 80 -42 -28 87 -62 441 -16 12 59 -305 108
7304A08j92q0J86N1o5n8K06k8j55O2l8K29l41Q0m4R6k35L24k41J20q3l8Q8K03
$$ 108 -84 -164 22 73 8 -50 156 128 -27 35 -3 226 -115 -35 -79 17 -218 106 -135 -15 -98 -136 -48 155
7328A55k9q2O0j63J91j46J52J40j34k38j0K8K23q3j10p2J50J83l0l86M9n8K67
$$ 155 126 44 104 -59 132 -14 138 278 144 -94 -104 -76 147 64 -46 -118 32 215 185 -201 -152 -210 57
7351E7j68L70m6l66L55j42Q0k45K54j45J11j68l8P8J4%l3K65k34R8k1R8k92K59
$$ 57 -111 259 213 -153 202 60 140 -105 149 4 115 -53 -91 -13 1 1 -32 233 -1 97 76 174 -118 141
7375A41j53k0K59k00rk03L65k66J16J0N9j04J28j88Q1K8N6m80N46j27j82J70J41
$$ 141 -12 -32 227 27 18 -185 180 -86 30 40 99 -5 123 -65 16 44 100 -380 166 39 -143 27 168
7398A68k53J44j75J17K0l7k26K70Jl62M32j57K82m43N7K29%J12k61J91o6Mk1m4
$$ 168 -85 59 -116 1 21 -16 -242 28 29 -333 99 -58 224 -219 -162 67 67 179 -82 109 43 47 26 -18
7422a8K41l19j03K82l6P8k44O1P9R1O2j20j25K0L09m4l43K95k66o2J76M8P4r1
$$ -18 223 -96 -199 83 47 125 -119 -58 21 112 174 54 -71 -51 258 214 -129 166 -100 -162 14 62 136 45
7446D5j58J70j78J59J48k99q4L49j50L7J9o6j42pL12J42o62K61M26l15J50k38
$$ 45 -113 57 -121 38 186 -113 -197 152 2 39 58 -8 -150 -157 155 297 -365 -104 322 7 157 -81
7468h1J20p3NL92l54l3N9k96L50K02l33O6qj88L50j16P2m47K82n4J42j23PJ00
$$ -81 39 -34 -29 363 9 -24 35 -261 89 291 -42 24 16 -172 178 62 134 -313 -31 -85 57 -66 -59 41
7492D1k14J60q7r3K10J11k35J0l8K98J43o49K82K14J6j71j74K13k52L39j76k68
$$ 41 -173 -13 -100 -193 17 128 -107 -97 -135 163 306 -343 -61 153 169 -2 -176 37 -215 124 -52 -320
7514c20K84j3jJ86k48L3Q0J06K02l77K57J40k11o6O4j63O5r5J52k12j34J71K41
$$ -320 -36 -49 -50 136 -112 -79 1 107 309 -68 189 329 118 52 116 -47 18 -77 75 -137 -271 -100 141
7537A41k89r1K66n7J77j02q1J68j41j2j41L9K31k1j01r1P4l27L02R2n7J11k26
$$ 141 -148 -239 27 -30 147 45 -36 132 -9 -21 -162 -123 108 87 -14 -105 -31 -358 -56 36 -21 90 -136
7560a36K18O8j98Q8j69K40k7J26k5j11k41J91m6J64k50P2oj23J27O0J39l23j04
$$ -136 82 150 -48 40 -129 111 84 210 185 74 -167 24 -22 142 -108 -36 -42 -165 -38 22 161 -162 -266
7583b66J88R6J8J87j58j30k9K85j54M0k69J33J14J23j98K32l16j41o3N88k62Q3
$$ -266 -78 18 36 223 65 -65 -94 191 37 77 -192 -59 55 178 -20 212 -104 -245 -308 280 18 101
7605A01k09K67k64K76j45r3J50k92M37k68K29l54M0K35k50L17K3j2l25K65k50
$$ 101 -108 159 -105 171 26 -67 83 -209 228 -40 189 -165 -125 110 -140 177 200 188 -137 128 -122
7626a22l4N44l28j38q3K76j92K64k56J55j04k17K59K1o8K1r1L6K9k6Po7K39k18
$$ -122 -156 388 60 -78 -161 115 -77 187 -69 86 -18 -235 24 45 -23 -2 -93 -57 -28 -54 -47 -114 125 -93
7650i3K42j36k7J56n2KK0J49k82j83L37j64J44k03L34j44k35J01kM6j03L0R4J4
$$ -93 149 13 -14 142 90 92 112 261 -21 -204 133 -31 113 -90 244 100 -135 -34 -36 10 -93 -63 31 45
7674D5j08m4n2K92k63K37O4l24q6M9J97J40r4j72n0M3K44j99R2j24J31j27K97
$$ 45 -63 -107 -159 133 -130 107 171 -153 -239 -190 7 147 53 -119 -169 -126 118 -81 11 -113 18 -109 188
7697A88j37Q7J8k54K71m54M63m50L30kk09K18r6K37k11j46k17L68M9j56j09M19
$$ 188 51 138 156 -98 173 -281 182 -268 62 60 -149 69 -27 210 -1 -147 -364 4 53 -103 -212 207
7719B07p4L7j42K9Q8m1j38J54j21J24m47L76P6J12j62k30K01J1j91O6J18l1O6
$$ 207 133 170 28 57 145 104 -34 120 -1 123 -324 52 128 240 78 -152 49 60 -131 -65 53 22 88
7742H8k15K41q4j2j71J16L26l67m4k9L49j22L8j35J18j40l1pK58k52J26M4n4l12
$$ 88 -127 114 30 18 -153 -37 289 -78 -122 -151 198 76 114 -21 97 -43 -74 -81 177 -75 51 95 41 -271
7766b71J03J77R6J18k18M2L1J3j85J1j8O3n4J81o2p4L03m0l84J11J99j03o3m0
$$ -271 -168 9 105 223 5 47 78 91 -94 -83 -101 -38 -92 89 27 -47 256 216 -168 -57 142 39 -24 -64
7790f4J55k39Q8L23N4n93K25M2p3J76K3k20L4J16R4p8j69J51l76L68K0j09Q9k5
$$ -64 91 -148 -60 263 317 -276 -51 -9 -82 94 117 -103 -69 47 141 63 -106 45 -331 37 57 -52 37 12
7814A2j1l9lJ10k57K46J7k51J25j3O8j52J69k0j71J52k47M73j24k60L22j21j31
$$ 12 1 -38 -41 69 -188 58 75 -176 -51 -64 4 -148 21 1 -170 -18 -265 208 84 -176 146 25 -106
7837a06K02k12J8O6k7k70M45l50N00j16j62K02k72j42J22J78Mj7k01K72j26K03
$$ -106 96 -116 -98 -32 -59 -329 116 -234 266 150 -12 190 -82 -224 -102 76 80 63 -138 134 8 211
7859B11o7j42jk3q3L90l13j19L05q2k8m5J4j34K67j85Q2J2K0l5R6k63K57j12Q6
$$ 211 144 2 1 -22 -105 285 -28 -147 158 76 48 3 17 -117 150 -35 47 59 79 44 140 -123 134 22 108
7884A08r8R9%m82L28L5J16N9k43J81j58k09L39k76M03k17Rj46J75j12K09k49J21
$$ 108 10 109 109 -373 -45 -10 106 165 -78 103 -55 -264 75 -201 202 -15 -6 -152 23 -89 120 -129 -8
7907hJ02r4J25k85J6J45P0%J51k98M60l12J35j70P9k79J15p6r6K26j51J90j18
$$ -8 94 0 125 -160 -144 1 71 71 222 -76 384 72 207 37 116 -163 -48 -124 -220 6 -145 45 -73
7930g3J88j03n1K2j90n4J11J25K30q9j67q5k8K6K54k76J16P9J86o2k66J3J01J22
$$ -73 115 12 -39 -17 -207 -261 -150 -25 205 116 -51 -136 -164 -138 116 -160 -44 35 221 159 -107 -94 7 129
7954A29k65J27J26k86K30j2K4P9j4m49O5L26M6j93J03k1r3k2J80mK2r0k21J66
$$ 129 -136 -9 117 -169 61 49 73 152 138 -311 -246 80 126 -67 36 15 -78 -100 80 76 98 8 -213 -47
7978d7l2j28O8j1K51L2l1J93j98m5j83J04j37J27J32k29K13m12L14M9J7l4p3J84
$$ -47 -79 -207 -139 -150 101 133 102 295 97 52 -131 -27 -164 -37 95 -134 79 -333 -19 30 47 13 -60 124
8002A24o3l9J56k90J1K70k04p2K00Qr0J28j32K1K26l27J92j81J68k47J86n4J44
$$ 124 61 22 178 -112 -101 169 -35 -107 93 101 11 139 7 28 254 -73 119 -62 106 -141 45 -9 135
8025A35K1j23l1K4nP2J6ok09j26J97o7K6J74j21K29l73K53J45j73k9o3jR2K55
$$ 135 156 33 2 26 21 93 109 103 -106 -232 -35 -102 -76 98 -23 206 -167 86 231 58 29 -34 -35 57 312
8050C12k59J54j61j14N6N4L0Ok64O0J7K74l2j26L7R4l7r3K95l31o9J13j16j2J36
$$ 312 53 207 46 -68 -12 42 72 78 -186 -126 -109 165 133 7 44 138 101 8 303 -28 -97 16 -100 -112 24
8075B4M5j46M2P2j1lo6j2L4j28JM4J31kl1n7j66L68r9O3j12J12l22K37j0k50K68
$$ 24 69 -77 -35 37 26 23 -43 -55 -21 -149 -148 -104 27 25 -6 -63 -229 139 40 103 -9 103 -219 18 8 -242 26
8102B6l7n0o9K73j60r2l0J08l1J00p9J59m22J30L39O3k04m0L0j93j86L90Q7j16
$$ 26 -11 -61 -130 143 -17 -109 -139 -31 -62 38 -41 118 -304 -174 165 228 24 -16 14 -179 -365 25 112 -4
8126dj04N2M3N7j1j87K34k70O7J97J18l99L44o9O2l95M37j14j19K42j64o9r2K61
$$ -4 -108 -56 -13 44 33 -154 80 -190 -123 74 192 -207 137 68 130 -265 172 58 -61 181 17 -52 -144 117
8150A17r5N1j69K21j48N8j4J95l00p2o2K86k1j03K01k48K85k40P9k10J46J5M2
$$ 117 22 73 -96 125 -23 35 21 216 -84 -156 -218 68 47 -56 145 -103 182 -58 21 -189 -43 -28 14
8173A4J7M4k68K57n1Mj81R3JJ26l31L65r3M9N3M8m68L36
$$ 14 31 75 -193 64 13 17 -164 -71 -70 56 -275 90 -3 46 99 147 -321 15
8191A5
$$ Imaginary data points
##PAGE= N=2
##DATA TABLE= (X++(I..I)), XYDATA
0@%%%%%%%qJ6j6J6k4M0m8N6p2Q8j12J44j74K06k42K87l41M00m71N51o37P34q44
$$ 0 0 0 0 0 0 0 0 -8 8 -8 8 -16 24 -24 32 -40 48 -64 80 -94 112 -130 157 -184 216 -255 296 -341 393 -451
30d51R68j106J258j427J613j820K048k296K568k869L198l556L951m380M844n353
$$ -451 517 -589 669 -758 855 -965 1083 -1213 1355 -1514 1684 -1872 2079 -2301 2543 -2810
46b810N913o523P189p922Q726r612J0594j1684J2899j4264J5810j7576J9613k1995
$$ -2810 3103 -3420 3769 -4153 4573 -5039 5555 -6129 6770 -7494 8316 -9260 10353 -11642
60a1642K4826k8254L2509l7956M5203n5368P0776r7152J54245m91724L43422M48719
$$ -11642 13184 -15070 17439 -20517 24686 -30682 40094 -57058 97187 -394537 -51115 397604
72C97604r67511N07527L19877p96684J41802P54736m93103j44772M40295k60469
$$ 397604 -569907 -62380 257497 -539187 -397385 357351 -135752 -280524 159771 -100698
82a00698j77484M32535j49306j63452K71644q0678j40673K32440j11581r7321
$$ -100698 -278182 154353 5047 -158405 113239 32561 -108112 124328 12747 -84574
92h4574K16941j12605j24471K41576j22689j34490K74786j08166k37043K98927
$$ -84574 132367 19762 -104709 136867 14178 -120312 154474 46308 -190735 108192
102A08192j7587k85406K66954O6447l54371K03373J81365l50034R7757K70783
$$ 108192 90605 -194801 72153 138600 -215771 -12398 168967 -181067 -83310 187473
112A87473k94189j3754K79009k36947j00616K88725j26942j38265K35225r0416
$$ 187473 -106716 -120470 158539 -78408 -179024 109701 -17241 -155506 79719 -10697
122a0697j69551K14882k1139j74403J76647J4081j85762J39027N5545j78885J04421
$$ -10697 -180248 34634 13495 -160908 15739 29820 -155942 -16915 38630 -140255 -35834
133c5834R0213j57883P3808J02787j55765M0384J20488j36382K2264J45434j27435
$$ -35834 54379 -103504 -29696 73091 -82674 -42290 78198 -58184 -35920 109514 -17921
144a7921l5339J43635r5045n3649J60956o0612j09456J23601k3873j08871J23808
$$ -17921 -53260 90375 -4670 -58319 102637 42025 -67431 56170 32297 -76574 47234
155D7234J4277j43703P1390N2832j13300N5595P0038j21450M762Q8004p0305j43
$$ 47234 61511 -82192 -10802 42030 -71270 -15675 54363 -67087 -62325 25679 -44626 -44769
167d4769Q1660p2820l1686Q4700l1330k5734P7169l4537n3732O9804m941m4115
$$ -44769 36891 -35929 -67615 17085 -14245 -39979 37190 2653 -51079 18725 13784 -30331
179c0331O5961k738o6863M8095J6168n4885M7081K2404p1622K3473L8485n8219
$$ -30331 35630 32892 -33971 14124 30292 -24593 22488 44892 -26730 -3257 35228 -22991
191b2991J7901N0075o1293j2103N5961l7571j7457N8770k8878l9750M8935q327
$$ -22991 -5090 44985 -16308 -28411 27550 -10021 -27478 31292 2414 -37336 11599 3272
203C272l4582M7971r7m8361L1029J3700l7468K7107J8792m4035J0090K6799l1993
$$ 3272 -31310 16661 16564 -31797 -768 12932 -24536 2571 21363 -22672 -12582 14217 -17776
216a7776O603K8993l2446o905L1111k1841j0119L2654j6348j7772K8155j1086
$$ -17776 -11173 17820 -14626 -21531 9580 -12261 -22380 10274 -6074 -23846 4309 -6777
228f777j8488L1487j503k1738K1547k264k4280K6006J3674k3653J1614O313k7122
$$ -6777 -25265 6222 4719 -17019 4528 2264 -22016 3990 17664 -5989 5625 11938 -15184
241a5184J5556K5365k1649k135J2738k4725K245L0372j4229j3750J3306j6566
$$ -15184 372 25737 4088 1953 14691 -10034 -7789 22583 8354 -5396 7910 -8656
253h656j0073K7367j854j7633R321o646j5817J7798R322j2639N421j36j5487R704
$$ -8656 -18729 8638 6784 -10849 -1528 -8174 -23991 -6193 3129 -9510 -4089 -4225 -19712 -10008
267a0008J3219q012M012M621j2863M789J2513p217J404Q463q896o26R609o040
$$ -10008 3211 -4801 -789 3832 -9031 -4242 8271 1054 2458 10921 2025 1399 11008 4968
281D968k732R219n493o882O671j672l833O813m672j1304N484N510k725M058m532
$$ 4968 2236 11455 5962 -920 5751 4079 246 7059 2387 -8917 -3433 2077 -648 3410 -1122
296a122j3377O035J1805j122L93k975j0504M823J3985l11m525m42n212J678J0851
$$ -1122 -14499 -8464 3341 2219 2612 -363 -10867 -6044 7941 7630 3105 2663 -2549 -871 9980
311I980k98p223K022r65l014M609j383o078M166K125o548j923m07k235O523M228
$$ 9980 9682 2459 4481 3516 502 5111 3728 -2350 1816 3941 -2607 -4530 -4937 -7172 -649 3579
327C579q348o172J400K547P007O298q798q511O009N501L312N770n657q859N887
$$ 3579 -4769 -10941 -9541 -6994 13 6311 -2487 -10998 -4989 512 3824 9594 3937 -4922 965
342I65O091j978K045O65m877K185K683n953k207M288J556j422j768n929k214N599
$$ 965 7056 5078 7123 7788 2911 5096 7779 1826 -381 3907 5463 4041 2273 -3656 -5870 -271
358b71K527j829j038k152j103L503j70k650J329L106J831N52l070k973J119L968
$$ -271 2256 427 -611 -2763 -3866 -363 -533 -3183 -1854 1252 3083 3635 565 -2408 -1289 2679
374B679K178o39k665k866l3q8o46N26N90p08q41k200l874J548K636N12K80p71
$$ 2679 4857 4218 1553 -1313 -1346 -1434 -2080 -1554 -964 -1672 -2513 -4713 -8587 -7039 -4403 -3891 -3611 -4382
392d382k771K542M266k79n92J908R64J748M075O22l315J37K281Q02L688J249l549
$$ -4382 -7153 -4611 -345 -624 -1216 692 1656 3404 7479 8101 4786 4923 7204 8006 11694 12943 9394
409I394k729j555r16J295P21j334k217m568l801K48J7o73n02j658l628j167R29
$$ 9394 6665 5110 4194 5489 6210 4876 2659 -1909 -5710 -5462 -5445 -6118 -6620 -8278 -11906 -13073 -12144
426a2144j849j41K646q85j19K593j748j754L253J696P24K657n8j483J679J467
$$ -12144 -13993 -14134 -11488 -12373 -12492 -9899 -11647 -13401 -10148 -8452 -7728 -5071 -5129 -6612 -4933 -3466
442c466P59J839R99k68N39J66n66L83J107P19J162j88k090O75J339q46J798P63
$$ -3466 -2707 -868 131 -137 402 568 2 385 1492 2211 3373 3185 1095 1770 3109 2263 4061 4824
460D824l255O68J842k130O04J768l508j251K314j809j519J513k865l845J666r28
$$ 4824 1569 2237 4079 1949 2553 4321 813 -438 1876 67 -1452 61 -2804 -6649 -4983 -5911
476e911k683K173k042n189J824P22l016K204O26m717J776K570j410K476K522k501
$$ -5911 -8594 -6421 -8463 -13652 -11828 -11106 -14122 -11918 -11292 -16009 -14233 -11663 -13073 -10597 -8075 -10576
492a0576J739L571o48K097M884j546l78M560j735J297O113j795l160L849k576
$$ -10576 -8837 -5266 -5914 -3817 1067 -479 -857 3703 1968 3265 9378 7583 4423 8272 5696
507E696k428O430p54o130J859k190m934M514J054p426n64J977o187R44L924o678
$$ 5696 3268 9698 8944 2814 4673 2483 -2451 2063 3117 -4309 -4873 -2896 -9083 -8139 -4215 -10893
523a0893j452M692l816k11M082m208r47O418j777j748M903j700j197P113o29l289
$$ -10893 -12345 -7653 -11469 -11680 -7598 -11806 -12753 -6335 -8112 -9860 -4957 -6657 -7854 -741 -1370 -4659
539d659M839K87k974O390J569n950L222K020m383M576L541p686O35M516m600J615
$$ -4659 180 467 -2507 3883 5452 -498 2724 4744 361 4937 8478 792 1427 5943 1343 2958
555B958M657n748k312M743j466q07K359l023j829M022n97k617J635k675j769M530
$$ 2958 7615 1867 -445 4298 2832 2025 4384 1361 -468 3554 2957 340 1975 -700 -2469 2061
571B061j193l635K108k229l120M486j544m749M287l27m583K848L68m725M768L173
$$ 2061 868 -2767 -659 -2888 -6008 -1522 -3066 -7815 -3528 -3855 -8438 -5590 -5222 -9947 -5179 -2006
587b006n562J460L816l490K704O398m453j262N977j239L59O146k639k342M585
$$ -2006 -7568 -6108 -2292 -5782 -3078 3320 -1133 -2395 3582 2343 2702 8848 6209 3867 8452
602H452r92j453M393j485l417K935k011l739L130j02m858K456q23o927K308K687
$$ 8452 7460 6007 10400 8915 5498 8433 6422 2683 5813 5711 853 3309 2486 -4441 -2133 554
618E54n236J298K787o417J82N685l741j276N276k130j717N497o24k563L902J910
$$ 554 -4682 -3384 -597 -7014 -6832 -1147 -4888 -6164 -888 -3018 -4735 762 138 -2425 1477 3387
634C387k223K711P96l357K315L062k819n94J494j534L03J268k707j201R71o67
$$ 3387 1164 3875 4671 1314 3629 6691 3872 3278 4772 3238 3541 4809 2102 901 1872 1205
650A205O63J89k858J21J291q09J041L61k615L04L395j373r33J974j326j956L607
$$ 1205 1868 2057 -801 -680 611 -198 843 1204 -1411 -1107 2288 915 -18 1956 630 -1326 2281
667B281K34l131J271j80l074J438J733l210K86Q94k685k19J976q14j045J260p94
$$ 2281 2515 -616 655 475 -2599 -1161 572 -2638 -2352 -1458 -4143 -4362 -2386 -3200 -4245 -2985 -3779
684c779m83K203P03k58J475O26K46J520M75J056J681n65M24J260r22l7J923q69
$$ -3779 -4262 -2059 -1356 -1614 -139 487 733 2253 2728 3784 5465 4900 5324 6584 5662 5625 7548 6679
702F679j799J99j006j297M71j44k950q42j8j761l92M61j905p49Q79k82j14M03
$$ 6679 4880 5079 4073 2776 3247 3103 153 -689 -707 -2468 -2860 -2399 -4304 -5053 -4174 -4456 -4570 -4167
720d167o36K87J658O37N16O14L53O95K24P62R81L55n57Q2P88q86o58Q92o12j060
$$ -4167 -4803 -4516 -2858 -2221 -1705 -1091 -738 -43 181 943 1924 2279 1722 1804 2592 1706 1048 1940 1328 268
740B68M81o41j207O17K1j563J53K45k57K10Q96k07K0O36O73PJ057L44l13P70M91
$$ 268 749 108 -1099 -482 -461 -2024 -1871 -1626 -1883 -1673 -777 -984 -964 -328 345 352 1409 1753 1440 2210 2701
761B701k92O82J55l98p26k0J15m70n14l56p81j554K00k17m24n24m12q00m11L25
$$ 2701 2409 3091 3246 2848 2122 2102 2217 1747 1233 877 96 -1458 -1258 -1475 -1899 -2423 -2835 -3635 -4046 -3721
781c721J340m36J56N48n09L70K072L97K56N05o9k76J215J024l16P0N46q37k24
$$ -3721 -2381 -2817 -2661 -2113 -2622 -2252 -180 217 473 978 909 633 1848 2872 2556 2626 3172 2335 2111
800B111O51n42j512L32K6j434Q38p57j055k81L65l28m92O49O82p34NP94N18K46
$$ 2111 2762 2220 708 1040 1066 -368 470 -287 -1342 -1623 -1258 -1586 -2078 -1429 -747 -1481 -1476 -682 -164 82
820H2J061O09n60J13P30K75l62J274P0j801O04L04j409P8J56j499k39J11j584
$$ 82 1143 1752 1192 1305 2035 2310 1948 3222 3292 1491 2095 2399 990 1068 1224 -275 -514 -403 -1987
839a987o40L86n85q46M97m4n90K69N41m31O56J145N48M17L08N37R44P05O40N71
$$ -1987 -2627 -2241 -2826 -3672 -3175 -3219 -3809 -3540 -2999 -3430 -2774 -1629 -1081 -664 -356 181 1125 1830 2470 3041
859C041m80O19R05l45r01P45l95k48o1o67j648o08P22l71j247l48j189j98R56
$$ 3041 2561 3180 4085 3740 2839 3584 3189 2941 2880 2213 565 -43 679 308 -939 -1287 -2476 -2674 -1718
878a718n61o14k06J95L23J175p0n48K41Q24R35M69k5k93j59M99L69M92l18j040
$$ -1718 -2279 -2893 -3099 -2904 -2581 -1406 -1476 -2024 -1783 -959 -24 445 420 127 -32 467 836 1328 1010 -30
898c0L68J83m65j68m12p97K19K87p33M9k21j41Q21J27L17L52K66P79N75jO58L12
$$ -30 338 521 56 -112 -524 -1321 -1102 -815 -1548 -1499 -1720 -1861 -1040 -913 -596 -244 22 801 1376 1375 2033 2345
920B345N71L44k2K87q0n13L43K8o95n55j069m42j30j221k97m62j089m83j65n73
$$ 2345 2916 3260 3238 3525 3445 2932 3275 3303 2608 2053 984 542 412 -809 -1106 -1568 -2657 -3140 -3305 -3878
940c878j73j51j47J75O90O38J53O29P71K91J017Q81O21N65Q66j07R23N36l93L34
$$ -3878 -4051 -4202 -4349 -4174 -3484 -2846 -2693 -2064 -1293 -1002 15 896 1517 2082 2948 2841 3764 4300 3907 4241
960D241J86J98n53k31m82n91m67m52m56q40j45l80n85m96J6L63n65L04O65n05
$$ 4241 4427 4625 4072 3841 3359 2768 2301 1849 1393 553 408 28 -557 -1053 -1037 -674 -1239 -935 -270 -775
980g75o1J302j16L69N76K28p9R63l54N2N94j63n90o9o4o17J33N9r89j53l42j11
$$ -775 -836 466 350 719 1295 1523 1444 2407 2053 2105 2699 2536 1946 1877 1813 1196 1329 1388 399 246 -96 -207
1002b07l84N52k77j61J20Q5Q56N60j99P95j51J80J556J85J73P20j89k55O81J49
$$ -207 -591 -39 -316 -477 -357 -272 584 1144 945 1740 1589 1769 3325 3510 3683 4403 4214 3959 4640 4789
1022D789n56l49M9q53o47M92j709p11K53j206p82K24q60n36N00n10l91K20J35
$$ 4789 4233 3884 3933 3080 2433 2925 1216 505 758 -448 -1230 -1006 -1866 -2402 -1902 -2412 -2803 -2583 -2448
1041b448M20N65M54K80O72L79R48O31N85J18N44N28K09M19M97q08K91K94j046
$$ -2448 -2028 -1463 -1009 -729 -57 322 1270 1901 2486 2604 3148 3676 3885 4304 4801 3993 4284 4578 3532
1060C532O7q2j213J63m43r64l40K15q62n06L93j74j191R02P1n70N64O19o36J36
$$ 3532 3599 3517 2304 2467 2024 1060 720 935 73 -433 -40 -214 -1405 -503 -432 -1002 -438 181 -455 -319
1080c19O37j05O30K0j08J45K51m35N79n70k14P3k81m9Q6l87l97k21J14j36J16
$$ -319 318 213 843 863 755 900 1151 716 1295 725 511 584 303 254 340 -47 -444 -665 -551 -687 -571
1101e71R2m07O25M95j01K91O79n25O33J281m83j07P79PK87n3q1l32n2m53J32m52
$$ -571 -479 -886 -261 234 133 424 1103 578 1211 2492 2009 1902 2681 2688 2975 2922 2841 2509 2457 2004 2136 1684
1123A684m33p73j90o39n38k44o12p34J86k38n73N5k65j34R80J15m62O40N47J73
$$ 1684 1251 478 288 -351 -889 -1133 -1745 -2479 -2293 -2531 -3104 -3049 -3314 -3448 -2468 -2353 -2815 -2175 -1628 -1455
1143a455Q50J190m1m3J321n25J71J054J49p97P56j01m83j12j80o35o1j15o20l47
$$ -1455 -605 585 544 501 1822 1297 1468 2522 2671 1874 2630 2529 2046 1934 1754 1119 1058 943 323 -24
1163b4l09n87k70K76l84j88K57m39K89N60q3k92R28M1j74P87R6o23P87j7j54N91
$$ -24 -333 -920 -1190 -914 -1298 -1486 -1229 -1668 -1379 -819 -902 -1194 -266 -225 -399 388 484 -139 648 631 477 1068
1185A068k45n51kK62o89k72K37o70n58O01l23p30N51J50o61P12j9m46Q97K46M3
$$ 1068 823 272 270 532 -157 -429 -192 -862 -1420 -819 -1142 -1872 -1321 -1171 -1832 -1120 -1139 -1585 -688 -442 -399
1206c99O87M86l41O97O45l4L54N55p81M03M52q80k74P48j110n18O12r70r53O39
$$ -399 288 774 433 1130 1775 1741 2095 2650 1869 2272 2724 1844 1570 2318 1208 690 1302 332 -621 18
1226A8q41r30P67o19p55R86j18j059N99N71n87M95J168m84P9J469o95L25J146
$$ 18 -823 -1753 -986 -1605 -2360 -1374 -1492 -2551 -1952 -1381 -1968 -1473 -305 -789 -710 759 64 389 1535
1245A535n21J80P93l46q3M17m61m70N29p18r95N76k57j007N54r8j279K98L75m21
$$ 1535 1014 1194 1987 1641 1558 1975 1514 1044 1573 855 -140 436 179 -828 -274 -372 -1651 -1353 -978 -1399
1265a399K79N23q44L68P20n25N32R41j25pR99j25k61J111j70j002Q56J91r94O99
$$ -1399 -1120 -597 -1441 -1073 -353 -878 -346 595 470 463 1462 1337 1076 2187 2017 1015 1871 2062 1068 1767
1285A767k41j158j02K04j121J58r4p75jK94q35r8O40n15O7O56m52J3J293o7k34
$$ 1767 1526 368 266 470 -651 -493 -587 -1362 -1363 -1069 -1904 -2002 -1362 -1877 -1810 -1154 -1606 -1593 -300 -367 -601
1306f01J309j21j31R12K6m30P55J37m81L59M9n87k6K21r85j96K52r62m67N60n14
$$ -601 708 587 456 1368 1394 964 1719 1856 1375 1734 1783 1196 1170 1391 406 210 462 -500 -967 -407 -921
1327i21l29N53m25m91O87o5M8N98J01O0L03j7J20K99M73l73N19m8j13j06l7l14
$$ -921 -1250 -697 -1122 -1613 -926 -991 -943 -345 -244 -184 119 102 222 521 994 621 1140 1092 979 873 836 522
1349E22k88L05n54l95M08r70m36P74j229J34L10r8l55N78J51n50J010P49l17L36
$$ 522 234 539 -15 -410 -2 -972 -1408 -634 -1863 -1729 -1419 -1517 -1872 -1294 -1143 -1693 -683 66 -251 85
1369H5O42J37j55J121Q1k95O11M7OK5j23k15k10l71j64m08o42k45l01l17p3p01
$$ 85 727 864 709 1830 1911 1616 2227 2274 2280 2305 2182 1967 1757 1386 1222 814 172 -73 -374 -691 -764 -1465
1391a465j61l75RP5l04L85p9r6R38P6J5O24N52k39O90O88Q2l45N62J84m11N36
$$ -1465 -1626 -2001 -1992 -1917 -2221 -1836 -1915 -2011 -1073 -997 -982 -358 194 -45 645 1333 1415 1070 1632 1816 1405 1941
1413A941m3m31l5Q0n00j10k61m60L5P3l53k6k09j5m17O24P2J63j13J44K09K20
$$ 1941 1898 1467 1432 1512 1012 902 641 181 216 289 -64 -90 -299 -314 -731 -107 -35 128 15 159 368 588
1435E88j7K07J15J10L12J0j90j85J64%m12J23m29l57j84j79m32O8m20k11K38j42
$$ 588 571 778 893 1003 1315 1325 1135 950 1114 1114 702 825 396 39 -145 -324 -756 -688 -1108 -1319 -1081 -1223
1457a223l06K90J22K99J55Q58k03O0Q59J60K19M90K34K9N30j14K57J08k1m17q9
$$ -1223 -1529 -1239 -1117 -818 -663 195 -8 52 911 1071 1290 1780 2014 2043 2573 2459 2716 2824 2803 2386 2297
1478B297l57l22j30k90o93j28k43n23m31p8n39k25J67n19J48j3J58K45J52K3K79
$$ 2297 1940 1618 1488 1198 505 377 134 -389 -820 -898 -1437 -1662 -1495 -2014 -1866 -1879 -1721 -1476 -1324 -1301 -1022
1499a022K76M77K30L70J07J6O75j01J92J11J65m72J94j36J78l95j03m28M2k36
$$ -1022 -746 -269 -39 331 438 454 1129 1028 1220 1331 1496 1024 1218 1082 1260 865 762 334 376 140
1519A40l89M3k47j51L47j79k53M65J07K65k88M27l9j09M35J65K42N89n76m17K57
$$ 140 -249 -206 -453 -604 -257 -436 -689 -224 -117 148 -140 287 248 139 574 739 981 1570 994 577 834
1540H34l32k61K35o67m06K20o50o1m02n6j76P2k06j10J18m25O03J34J48J48L51
$$ 834 502 241 476 -191 -597 -377 -1027 -1088 -1490 -1546 -1722 -1650 -1856 -1966 -1848 -2273 -1670 -1536 -1388 -1240 -889
1561h89N07J24O42M66n15P02M59j32K80M35lm97L89m59m0j83l93m25k29k09q73
$$ -889 -382 -258 384 850 335 1037 1496 1364 1644 2079 2076 1579 1968 1509 1469 1286 893 468 239 30 -843
1582h43K41k96m52k75m7R8q5l95J2L86q2K09O59M5Q2L67J5O8M84N42m56J84P04
$$ -843 -602 -898 -1350 -1625 -1672 -1574 -1659 -2054 -2042 -1656 -1738 -1529 -870 -825 -743 -376 -361 -293 191 733 277 461 1165
1605A165p06J13L70m64l11J73n50j11K26m79l70J97M0k37K77k5j77K2L26k2J30
$$ 1165 459 572 942 478 167 340 -210 -321 -95 -574 -944 -747 -707 -944 -667 -692 -869 -847 -521 -543 -413
1626d13M40n9M76K11k53N18J79l11P75k83l49K40j93o16o4j2o84K5k62m34j11
$$ -413 27 -32 444 655 402 920 1099 788 1563 1280 931 1171 978 362 298 286 -398 -373 -635 -1069 -1180
1647a180j73q0j45K54j74N7L4L55k69N74J15n3P50o9K92O73K95j26K88L72k28
$$ -1180 -1353 -1433 -1578 -1324 -1498 -1441 -1407 -1052 -1321 -747 -632 -685 65 -4 288 961 1256 1130 1418 1790 1562
1668A562M5K48n76k24K02m97p1k18j36m41M8m01l66J80n00k8KJ50l46N25J41q6
$$ 1562 1607 1855 1279 1055 1257 760 689 471 335 -106 -58 -459 -825 -645 -1145 -1173 -1171 -1021 -1367 -842 -701 -787
1690g87K54L57j68O17k73M46L63J13j48O18j86l78J19L0k47q8J25n78K8k12o30
$$ -787 -533 -176 -344 273 0 446 809 922 774 1392 1206 828 947 977 730 642 767 189 217 5 -625
1711f25rM71o73m20L91k44J20N30l10k7K14K95K6N94P9N0N24N7j00K20K3M5j40
$$ -625 -634 -163 -836 -1256 -865 -1109 -989 -459 -769 -796 -582 -287 -261 333 412 462 986 1043 943 1163 1186 1231 1091
1734A091r5q3j94m5j83j37j71k21m78j92N0j96j80j2k26j06K55j59N01lk4M74
$$ 1091 996 913 719 674 491 354 183 -38 -516 -708 -658 -854 -1034 -1046 -1272 -1378 -1123 -1282 -781 -784 -808 -334
1756c34j86L12L23O1K96K70M01k90m6J73l69J92j15o3l58L9j29j56j25l84m0l7
$$ -334 -520 -208 115 176 472 742 1143 853 807 980 611 803 688 625 267 306 177 21 -104 -488 -528 -565
1778e65m02J45q2n7n6r9J70j37N17K64Q5K14M48R8K97j36J47j4J21k9j67l9J32
$$ -565 -967 -822 -904 -961 -1017 -1116 -946 -1083 -566 -302 -217 -3 445 543 840 704 851 837 958 929 762 723 855
1801H55k47j74k03k06j48k56l44k59N1j02n39K50N3q0J54J83J37J34Q3L85J39
$$ 855 608 434 231 25 -123 -379 -723 -982 -931 -1033 -1572 -1322 -1269 -1349 -1195 -1012 -875 -741 -658 -273 -134
1822a34R9N76K75j03K82J3k26M20L10k54l15P8o0j37k00l77k75K12j34o28j61
$$ -134 -35 541 816 713 995 1008 782 1202 1512 1258 943 1021 961 824 624 247 -28 184 50 -578 -739
1843g39j26k07j44O1j26M14m27O41J12j42N36k88K23M52L00l15J94K39j79k9M76
$$ -739 -865 -1072 -1216 -1155 -1281 -867 -1294 -653 -541 -683 -147 -435 -212 240 540 225 419 658 479 450 926
1864I26j15k95J64m18k14N3k03j79j61M52q65L39k2l9j03N5J20L5K18K08k4K75
$$ 926 811 516 680 262 48 101 -102 -281 -442 10 -855 -516 -538 -577 -680 -625 -505 -470 -252 -44 -68 207
1886B07L63K1J10L19K0J56J07l10J81k24r1R2n01k52L3l41l10j47l90j29oj11
$$ 207 570 591 701 1020 1040 1196 1303 993 1174 950 859 951 450 198 231 -110 -420 -567 -957 -1086 -1092 -1203
1908a203l85J48J33J6j55N97k75K16P32l44J34N24K44j0M05N18k14N0K30r7j58
$$ -1203 -1588 -1440 -1307 -1291 -1446 -849 -1124 -908 -176 -520 -386 138 382 372 777 1295 1081 1131 1361 1264 1106
1929A106r8j39K34r3k52k74m4l91k00J05p22o6K90m39k47M92l10M6K0J93J11L26
$$ 1106 1008 869 1103 1010 758 484 440 49 -151 -46 -768 -834 -544 -983 -1230 -738 -1048 -1002 -982 -789 -678 -352
1951c52j35K14K7K57J71j94M81q4p7K55l77J43O1n18o3R5n77M7m9k12P9K4q4J14
$$ -352 -487 -273 -246 11 182 -12 469 385 308 563 186 329 390 -128 -191 -96 -673 -626 -675 -887 -808 -784 -868 -754
1975g54j52j15J68K49L6K79K88J22j78O33j5q7L54J46j75o1K63m96j07J03l43
$$ -754 -906 -1021 -853 -604 -568 -289 -1 121 -57 576 561 474 828 974 799 738 1001 505 398 501 158
1996A58m07J55l39l37L13l52m20o8p1Qk80L86k29R2J7L13K19j46L89J40L86J80
$$ 158 -249 -94 -433 -770 -457 -809 -1229 -1297 -1368 -1360 -1640 -1254 -1483 -1391 -1374 -1061 -842 -988 -599 -459 -73 107
2018A07K51Q6J97J61J31n6j2J89m44k35L03N4m44l02j52J01rm19l08K45k57K7
$$ 107 358 444 641 802 933 877 865 1054 610 375 678 732 288 -14 -166 -65 -74 -493 -801 -556 -813 -786
2040g86J9o5r4J62M40o77L97K96K03P8K50J21j56K55M4K0p7j72K58k9k24o0l33
$$ -786 -767 -832 -926 -764 -324 -1001 -604 -308 -105 -27 223 344 188 443 487 507 430 258 516 487 263 203 -130
2063a30m3rk20j31j07j23L6j78K53J0j96J63K92J6J6L86O8J73M21k49j7N63J00
$$ -130 -173 -182 -402 -533 -640 -763 -727 -905 -652 -642 -838 -675 -383 -367 -351 35 103 276 697 448 431 994 1094
2086A094Q0j95J67l74mJ9p64K88m9k16l20J53m73k95K67k77k65J17l78L24K55
$$ 1094 1174 979 1146 772 768 787 23 311 262 46 -274 -121 -594 -889 -622 -899 -1164 -1047 -1425 -1101 -846
2107h46l3Q4K84K13O6L34L36p3j09M69l25N93n9o3J81J02l98j33M5l09N0Jm15
$$ -846 -879 -795 -511 -298 -232 102 438 365 256 725 400 993 934 871 1052 1154 756 623 668 359 409 410 -5
2130el05%p4l45K98l28m9R1K11k65K65K18j16K66K43q8J31K23r1J36J65O6j9r1
$$ -5 -310 -310 -384 -729 -431 -759 -808 -717 -506 -771 -506 -288 -404 -138 105 17 148 371 280 416 581 647 628 537
2154E37j57k29M74j03o82N42l24o23M52n5l69n2p5o7J02M0m45L65J04OJ93K60
$$ 537 380 151 625 522 -160 382 58 -565 -113 -168 -537 -589 -664 -731 -629 -589 -1034 -669 -565 -559 -366 -106
2176a06j16R6M24J21j70L57K84l05L17j97j48M35k66l47K9l49k35l36K58j68l1
$$ -106 -222 -126 298 419 249 606 890 585 902 705 557 992 726 379 408 59 -176 -512 -254 -422 -453
2197d53K7n95L21j53P7r6K33k94J10K50L4L03K59l28M49K38o4Q0O6J27j45P5J41
$$ -453 -426 -1021 -700 -853 -776 -872 -639 -933 -823 -573 -539 -236 23 -305 144 382 318 398 464 591 446 521 662
2220F62j05r4j50m26O3j02k05Pm2j28J63l25k94K30J66k78K89K00k07M0O19j94
$$ 662 557 463 313 -113 -50 -152 -357 -350 -392 -520 -357 -682 -976 -746 -580 -858 -569 -369 -576 -536 83 -111
2242a11J43L51j14O65l19r2oL26k04J1M5j05m40n9r2m67K76q0n26L53r2k95q1
$$ -111 32 383 269 934 615 523 517 843 639 650 695 590 150 91 -1 -468 -192 -272 -798 -445 -537 -832 -913
2265i13J21Q7m48K09J73L96r5mM39M2L11j8K08j49K86M06k49p2qm8J25j50j16
$$ -913 -792 -705 -1153 -944 -771 -375 -470 -474 -35 7 318 300 508 359 645 1051 802 730 722 674 799 649 533
2288E33m09n7L9l2l12k8J42m90J11j43L6K24k5j54L68Q8n8J24J8J5M09m19L02
$$ 533 124 67 106 74 -238 -266 -124 -614 -503 -646 -610 -386 -411 -565 -197 -109 -167 -43 -25 -10 399 -20 282
2311B82K68K33j60K9j37M0j53m4k49L5p6j68p8j66k23J5j01q4K00m7J8M7k6k5
$$ 282 550 783 623 652 515 555 402 358 109 144 68 -100 -178 -344 -567 -552 -653 -737 -537 -584 -566 -519 -545 -570
2335e70N47l38L45M38k90K87j02L09j7J43L07k65Q9m2K1k40k20J5p4j59o21J21
$$ -570 -23 -361 -16 422 132 419 317 626 609 752 1059 794 883 841 862 622 402 417 343 184 -437 -316
2357c16l37N6j55k34J77K9k3j68K31J08J23K33j73L20J5K67Q2K60k9J54j37L0
$$ -316 -653 -597 -752 -986 -809 -780 -803 -971 -740 -632 -509 -276 -449 -129 -114 153 235 495 466 620 483 513
2379E13J98k34K49j81m4k58lJ9j97q4l34p3j04L11m12k4M84n28J77J47L2K65J69
$$ 513 711 477 726 545 501 243 240 259 62 -22 -356 -429 -533 -222 -634 -658 -174 -702 -525 -378 -346 -81 88
2402H8j54j73N03pJ31n3L66n3l84K99o4j3k35RJ97k64l88p7m05K36k6j7j15j07
$$ 88 -66 -239 264 257 388 335 701 648 264 563 499 486 251 260 457 193 -195 -272 -677 -441 -467 -484 -599 -706
2426g06j52K4J79K16l11L57L26k32N13j23J03j68L13K45k1L44k43L8K07j28j75
$$ -706 -858 -834 -655 -439 -750 -393 -67 -299 214 91 194 26 339 584 563 907 664 702 909 781 606
2447F06qk08n4j84j74K3o08k0L72o56K3L41l79P2K71l17L41n0K5P0K16J71k6M01
$$ 606 598 390 336 152 -22 1 -607 -627 -255 -911 -888 -547 -926 -854 -583 -900 -559 -609 -584 -514 -298 -127 -153 248
2471B48K3L32J6N0j23m6L06k33p9L0l68J92r5j10k70j37j57J40j84j94M31j50
$$ 248 271 603 619 669 546 500 806 573 494 524 156 348 253 143 -127 -264 -421 -281 -465 -659 -228 -378
2493c78RP0k39N0K77rN88j05O3N9l73M78K3O5L0q6J48l08K7j24J6k48m3j30k47
$$ -378 -369 -299 -538 -488 -211 -220 368 263 326 385 12 490 513 578 608 522 670 362 389 265 281 33 -10 -140 -387
2518c87M7j80j27K62j58N8p8j17K24o3K33J48J04J23K10o7P9N54k62N3L76k78
$$ -387 -340 -520 -647 -385 -543 -485 -563 -680 -456 -519 -286 -138 -34 89 299 232 311 865 603 656 1032 754
2540G54J66k85L3k60J47j01l32j24j33M6j29r1l00J49n8Kr3K55m18J46K64l00
$$ 754 920 635 668 408 555 454 122 -2 -135 -89 -218 -309 -609 -460 -518 -516 -609 -354 -772 -626 -362 -662
2562f62K62K09l4L90J46J78mR7K20l56J62J10l64j7K52l76k42M99m34j86J30k45
$$ -662 -400 -191 -225 165 311 489 485 582 802 446 608 718 354 337 589 213 -29 470 36 -150 -20 -265
2584b65j20P7k01J06j98j34K59J02j4K55R7O6n0L7J21J63J79o9o3o2j7j2K43m2
$$ -265 -385 -308 -509 -403 -601 -735 -476 -374 -388 -133 -36 30 -20 17 138 301 480 411 348 286 269 257 500 458
2608D58m74J70J00j34j56L6l42l01L48l97M9K10m11J79N1J53k28L89K4MK02K54
$$ 458 -16 154 254 120 -36 0 -342 -643 -295 -692 -643 -433 -844 -665 -614 -461 -689 -300 -276 -272 -70 184
2630A84N1p4K23J90j41J5Q9J53Q4n53J97K61m41K6M1m27j98q5j4k03K10k08l27
$$ 184 235 161 384 574 433 448 537 690 774 221 418 679 238 264 305 -122 -320 -405 -419 -622 -412 -620 -947
2653i47M57o1j16L79p6j87M16N8j06J07%K17j7M72k83J70J71j24J10l55k78J17
$$ -947 -490 -551 -667 -288 -364 -551 -135 -77 -183 -76 -76 141 124 596 313 483 654 530 640 285 7 124
2675A24M8M8m98L3J5j49N6j75J21j27Rp7O4r9J06J89K46j65L02J69j27L06J83
$$ 124 172 220 -278 -245 -230 -379 -323 -498 -377 -504 -495 -572 -508 -607 -501 -312 -66 -231 71 240 113 419 602
2698F02J34l36K65k89J31j87J91k09K9j13j00N7m37K49k50Pl19N8j13K13l71L30
$$ 602 736 400 665 376 507 320 511 302 331 218 118 175 -262 -13 -263 -256 -575 -517 -630 -417 -788 -458
2720d58rK15k4J90P5J62j75M19r4J68J17j38J57m16N59m36J34J0j30L1k08K2j95
$$ -458 -467 -252 -276 -86 -11 151 -24 395 301 469 586 448 605 189 748 312 446 456 326 357 149 171 -24
2743b4j6j00l43K75k44q6q6M30p2k41K29J28k4L22p7j20K41j09M71L7j16K15k53
$$ -24 -40 -140 -483 -208 -452 -538 -624 -194 -266 -507 -278 -150 -174 148 71 -49 192 83 554 591 475 690 437
2766D37j10N3K31J16m59Q6L1k56j92J01k50k26P2j21L7Q3j21N8K44j67N9K84k3
$$ 437 327 380 611 727 268 354 385 129 -63 38 -212 -438 -366 -487 -450 -367 -488 -430 -186 -353 -294 -10 -33
2789c3O9mK96J46k47L26j16J94p3j8Q6n6Jm6k80K53l75J02l17P9m4j76j88K80
$$ -33 36 32 328 474 227 553 437 631 558 540 626 570 571 525 245 498 123 225 -92 -13 -57 -233 -421 -141
2813a41k40j95j5K53j37J60J74o0J16J5L43M6q0j65M48k02K23j06P5N8nj47j37
$$ -141 -381 -576 -591 -338 -475 -315 -141 -201 -85 -70 273 319 239 74 522 320 543 437 512 570 565 418 281
2836B81j44J50k78jk34O1N1l38K13k01j14j51M00r3r0M61J76j26r5J82j33M41
$$ 281 137 287 9 8 -226 -165 -114 -452 -239 -440 -554 -705 -305 -398 -488 -27 149 23 -72 110 -23 418
2858D18j32N4Q8J81J42m26q5K69j65j61J34k59J26l32p5Q5Q9m22q4R4j3m2j40
$$ 418 286 340 428 609 751 325 240 509 344 183 317 58 184 -148 -223 -138 -49 -471 -555 -461 -474 -516 -656
2881f56J9P4K10P7J55K9j44L97K16k96K92J96l4J26j2o8k68N2K34r3j94k28L5
$$ -656 -637 -563 -353 -276 -121 -92 -236 161 377 81 373 569 535 661 649 581 313 365 599 506 312 84 119
2904A19l8j36k20k11J26j58K15j0K7k3m9ML5J05K31R1J30L2j87J82j12J03J51
$$ 119 81 -55 -275 -486 -360 -518 -303 -313 -286 -309 -358 -354 -319 -214 17 108 238 270 83 265 153 256 407
2927D07lR0j49orj81K06n08m2M33m34j21L32k23l00K62l6j96J52lL0J66K06P4
$$ 407 404 494 345 339 330 149 355 -153 -195 238 -196 -317 15 -208 -508 -246 -282 -478 -326 -329 -299 -133 73 147
2951A47j75L4L48j19K07k79J90N03l79r6J0k7j14J87k70l26M02o07R0P3Q5l77
$$ 147 -28 6 354 235 442 163 353 856 477 381 391 364 250 437 167 -159 243 -364 -274 -201 -116 -493
2973d93j14K68l24Q3L07L1k81K38J15J42q9R5M5K51K08k06N9j44L20J6j05Q3j21
$$ -493 -607 -339 -663 -580 -273 -242 -523 -285 -170 -28 -117 -22 23 274 482 276 335 191 511 527 422 505 384
2996C84q8PJ3j60j17p7L2k68J6k2j53q6J80L1K01j42k64J93J57Q4K30m7J12j70
$$ 384 296 303 316 156 39 -38 -6 -274 -258 -280 -433 -519 -339 -308 -107 -249 -513 -320 -163 -79 151 104 216 46
3020D6K27j41K15J3J28k21m2L75o76L79p7k11k84K41j39j68K03l3k60j35L81k24
$$ 46 273 132 347 360 488 267 225 600 -76 303 226 15 -269 -28 -167 -335 -132 -165 -425 -560 -179 -403
3042d03j0L79%j01K26l2j78O6L44l15M91M0j11k50K18Q6m6pK91n76J99j22l09
$$ -403 -413 -34 -34 -135 91 59 -119 -53 291 -24 467 507 396 146 364 450 404 397 688 112 311 189 -120
3065a20n9L4q8l01K80k24K51m0q9j12J97K0l30J56J81J55L6K17j09J86m9K60q5
$$ -120 -179 -145 -233 -534 -254 -478 -227 -267 -356 -468 -271 -251 -581 -425 -244 -89 -53 164 55 241 192 452 367
3088C67K29k10J22l9J1k47j29K35k61k49J38R3k41jp0P2k82J36j07J34o4j0K96
$$ 367 596 386 508 469 480 233 104 339 78 -171 -33 60 -181 -182 -252 -180 -462 -326 -433 -299 -363 -373 -77
3111g7j32K16o8Q6K29J35p3j15K28P9k08K16m45K16j28J30m68J36J39k34k3P1
$$ -77 -209 7 -61 25 254 389 316 201 429 508 300 516 71 287 159 289 -179 -43 96 -138 -161 -90
3133i0k12r9K0r7J57J38q5P0K51k05P7J2J75M3J29k71L11R1j38K30j79l7L11m23
$$ -90 -302 -401 -381 -478 -321 -183 -268 -198 53 -152 -75 -63 112 155 284 13 324 415 277 507 328 291 602 179
3157A79J61j37j8j61J06j82J5q5P1k57l6j3M4k32J41K89k20P9j13J31LM55n7O3
$$ 179 340 203 185 24 130 -52 -37 -122 -51 -308 -344 -357 -313 -545 -404 -115 -335 -256 -369 -238 -235 220 163 226
3181B26j06K74k17L01J99k45K31N2m85j66J46J7j43qL8l48N2J95m3l32k61L16
$$ 226 120 394 177 478 677 432 663 715 230 64 210 227 84 76 114 -234 -182 13 -30 -362 -623 -307
3203c07J21K29j63j37K80J5j32Q2R3K07J31k02K10M6j50J04J07n5k11P5k78M4
$$ -307 -186 43 -120 -257 23 38 -94 -12 81 288 419 217 427 473 323 427 534 479 268 343 65 109
3225A09k4n6j99M9J05j68Q6Q6n00M69n58J66J3k9L39k31K98Lk9L4K17K87k49j52
$$ 109 85 29 -170 -121 -16 -184 -98 -12 -512 -43 -601 -435 -422 -451 -112 -343 -45 -42 -71 -37 180 467 218 66
3249F6N70m83K59j45J66K32m26k51L1L2m6l8k21K43j88k97L95N8k39J8j04J58
$$ 66 636 153 412 267 433 665 239 -12 19 51 5 -33 -254 -11 -199 -496 -101 -43 -282 -264 -368 -210
3271b10Q6m4J63m2j20K15J33j14O1L76J63n16L9J63Lk20j23J30Q6n3j12j2j65
$$ -210 -124 -168 -5 -47 -167 48 181 67 128 504 667 151 190 353 356 136 13 143 229 176 64 52 -113
3294a13r9j29J46R9k95J6p8K61M6N5j58J59K39j25j40K31J73j46J64L35l04Q2
$$ -113 -212 -341 -195 -96 -391 -375 -453 -192 -146 -91 -249 -90 149 24 -116 115 288 142 306 641 337 419
3316D19lK2k24l8J15j17j63j80N2qj45j15L8P9k9j22j50K66K55o3j57K65k2O1
$$ 419 416 438 214 176 291 174 11 -169 -117 -125 -270 -385 -347 -268 -297 -419 -569 -303 -48 -111 -268 -3 -25 36
3340C6k3J79j9KN2j35K84K58k67p3k08K17M8O0l36k62J16J13k77R1k25R2j55O2
$$ 36 13 192 173 175 227 92 376 634 367 294 86 303 351 411 75 -187 -71 42 -235 -144 -369 -277 -432 -370
3364c70oK12qj19K7R4J41M9k1L2J30J21l7K0k7K36k94J81M2l27K7n1pJj24KK39
$$ -370 -376 -164 -172 -291 -264 -170 -29 20 -1 31 161 282 245 265 238 474 180 361 403 76 103 52 45 46 -78 -76 163
3391A63j43l24O4J10j05k07J78m0J44j12J10K6K45j5J2L2J54j00j06L54r0k8k4
$$ 163 20 -304 -240 -130 -235 -442 -264 -304 -160 -272 -162 -136 109 94 106 138 292 192 86 440 350 322 298
3414B98m6j20K93l02L5l15K70J9k01k71o0K22j68J88M8k93L3o6K60j04K6L56k8
$$ 298 252 132 425 123 158 -157 113 132 -69 -340 -400 -178 -346 -158 -110 -403 -370 -436 -176 -280 -254 102 74
3437G4k42K10K46q2N0q8Q4R2n4J34j82J54j14k58J65m74L09LJ08l72j4K15j24
$$ 74 -168 42 288 206 256 168 252 344 290 424 242 396 282 24 189 -285 24 27 135 -237 -251 -36 -160
3460a60L1Ok26L02N5l9j10Q7O5J0r2K36r8j30M42k83K53J26k86J1N7o7j2j04n0
$$ -160 -129 -123 -349 -47 8 -31 -141 -54 11 21 -71 165 67 -63 379 96 349 475 189 200 257 190 178 74 24
3485B4J60l55K9k51J08J46k17o2J16j31J38J81k19K57K88j53n7J61J8L5j18K14
$$ 24 184 -171 -142 -393 -285 -139 -356 -418 -302 -433 -295 -114 -333 -76 212 59 2 163 181 216 98 312
3507C12n4R1l12K58l6p8J0j18K60m12kN9n0j6q6n4k69M15M0Ml50O8p6J93K7j52
$$ 312 258 349 37 295 259 181 191 73 333 -79 -81 -22 -72 -88 -174 -228 -497 -82 -42 -38 -388 -320 -396 -203 -176 -328
3533c28L23L83k17n5r2L37j32o7J39K2j01P7k3k22K32K9j64r2j05r5j49P8j69
$$ -328 -5 378 161 106 14 351 219 152 291 313 212 289 266 44 276 305 141 49 -56 -151 -300 -222 -391
3556c91K6L63j84K42l58J31k9J31k20M84L6k0P4j65k28K88O9L28l89N6J87k06
$$ -391 -365 -2 -186 56 -302 -171 -200 -69 -289 195 231 211 285 120 -108 180 249 577 188 244 431 225
3578B25k74J58O6j95J6R9j57J04k07J0j29q4J44k70L97r0q5L16j61J81p7J42m7
$$ 225 -49 109 175 -20 -4 95 -62 42 -165 -155 -284 -368 -224 -494 -97 -187 -272 44 -117 64 -13 129 82
3601H2R2J50l4p3o9m0K9NJ66j10o7R7j94j32R0J48o1k50j09M9J1M7r0J55j79K90
$$ 82 174 324 290 217 148 108 137 142 308 198 131 228 34 -98 -8 140 79 -171 -280 -231 -220 -173 -263 -108 -287 3
3627CL4o4j40L61j14r8M89j85L9Q2j39k99M25l86K16k32p6K04J86j90q9k96N4
$$ 3 37 -27 -167 194 80 -18 471 286 325 407 268 -31 394 8 224 -8 -84 120 306 116 27 -269 -215
3650b15k67L96k24K35n5p9mJm2K1Q8L0R2k2l6J28K35o7j76J49j28M76m5k27pO4
$$ -215 -482 -86 -310 -75 -130 -209 -213 -212 -254 -233 -145 -115 -23 -45 -81 47 282 215 39 188 60 536 491 264 257 321
3676C21l85L12j78k45J55o8l6p6K6j92J56o4k63N00j90K47j3k4R9k83M46j92k5
$$ 321 -64 248 70 -175 -20 -88 -124 -200 -174 -366 -210 -274 -537 -37 -227 20 7 -17 82 -201 245 53 28
3699B8n3M17l00J99l8j59J66j79R4k13m0J57j91j65Q6P6m72M76j2k71K81j56j71
$$ 28 -25 392 92 291 253 94 260 81 175 -38 -78 79 -112 -277 -191 -115 -587 -111 -123 -394 -113 -269 -440
3722d40J29J49M9R4j88K71LKK93l54J73O0l22K10q5L47J25l30q2O1l29P4N5j86
$$ -440 -311 -162 -113 -19 -207 64 67 69 362 8 181 241 -81 129 44 391 516 186 104 165 -164 -90 -35 -221
3746b21OL99l10j94R7J49j99j51K95L55l43k00K91R8r8K24j56J05O8n1J82n2j74
$$ -221 -215 184 -126 -320 -223 -74 -273 -424 -129 226 -117 -317 -26 72 -26 198 42 147 215 164 346 294 120
3769A20Q5m5j07J23j12L54p72K55J01P2l06j46L18k28K3K12k71Q9J32o0k08M98
$$ 120 205 160 53 176 64 418 -354 -99 2 74 -232 -378 -60 -288 -265 -53 -324 -235 -103 -163 -371 127
3791A27J93l38Q4J44K4k85K57p8k7K20j25j94J79k1k33J6J2L8m6k1k9OJ7k69J24
$$ 127 320 -18 66 210 234 -51 206 128 101 321 196 2 181 160 -73 -57 -45 -7 -53 -74 -103 -97 -80 -349 -225
3816b25P9q3J29k1k70K73J87j70L9J01N7k6L55k65m42L37j4K63n7j88j82M18k55
$$ -225 -146 -229 -100 -121 -391 -118 69 -101 -62 39 96 70 425 160 -282 55 41 304 247 59 -123 295 40
3839D0j23M8n8J51k17n9J29q4P7r1O1N7J27k50K25J10j55m6j13K78J81j84k7K07
$$ 40 -83 -35 -93 58 -159 -218 -89 -173 -96 -187 -126 -69 58 -192 33 143 -12 -58 -171 107 288 104 77 284
3863B84p9K7k4l7PL9k98K30O8l25O7k47K68q7J1j19p1K37m2j66O9J5J77j60Q7
$$ 284 205 232 208 171 178 217 -81 149 217 -108 -41 -288 -20 -107 -96 -215 -286 -49 -91 -257 -188 -173 4 -156 -69
3888f9l0J38k15K79J33p1J91j88l1K63j85r2r1K35k00n9K77k30Qk49J33j30J01
$$ -69 -99 39 -176 103 236 165 356 168 137 400 215 123 32 267 67 8 285 55 63 -186 -53 -183 -82
3911h2r9K5K73m84K03p3J72P2j3k60L15q1j0J07k3J07PJ26jK2j33K00k77k7M9
$$ -82 -181 -156 117 -367 -164 -237 -65 7 -6 -266 49 -32 -42 65 42 149 156 282 281 303 170 370 93 66 115
3936A15j49l5L5k10N8l04M04k37N7j23J80k1j01K69m1J08k36J93m6o0M51j34j36
$$ 115 -34 -69 -34 -244 -186 -490 -86 -323 -266 -389 -209 -230 -331 -62 -103 5 -231 -38 -84 -144 307 173 37
3959C7P5L49j96l3l8J29J68m77J45l33J01o9N2P8J36k57J08j75J19k26K30j84
$$ 37 112 461 265 232 194 323 491 14 159 -174 -73 -142 -90 -12 124 -133 -25 -200 -81 -307 -77 -261
3981b61K52j48J10jj5K9Q1m9R6J47L5k50PK34k0J89j25j61k21J2l0J73o5j06J5
$$ -261 -9 -157 -47 -48 -63 -34 47 -2 94 241 276 26 33 267 247 436 311 150 -71 -59 -89 84 19 -87 -72
4006g2j78J64L4n5j28m0L88k14q4K3L26p4j87K95l38J64J3K02k84M08l60L48k09
$$ -72 -250 -86 -52 -107 -235 -275 113 -101 -185 -162 164 90 -97 198 -140 24 37 239 -45 363 3 351 142
4029A42qJ13j56k6J97j97k91L86k84m5L55n99L30M8j91k24J70J19J66k22L21L3
$$ 142 134 247 91 65 262 65 -226 160 -124 -169 186 -413 -83 -35 -226 -450 -280 -161 5 -217 104 137
4051A37l01J26l7Q1J43J57J19k83P4j59JO1k54L34k19l1L6K7j82J8K5K46l15J39
$$ 137 -164 -38 -75 6 149 306 425 142 216 57 58 119 -135 199 -20 -51 -15 12 -170 -152 -127 119 -196 -57
4075e7n3r2P3j06J3O1J40P4j1n9J02n1J37Jj64J56j58J62P4J51n22J87o9P8j60
$$ -57 -110 -202 -129 -235 -222 -161 -21 53 42 -17 85 34 171 172 8 164 6 168 242 393 -129 58 -11 67 -93
4100i3Q3k82L44q5j85Q7pl22j15K91J53k26L74R5n4j2Q1P3j79J70J19n7r9J36
$$ -93 -10 -292 52 -33 -218 -131 -138 -460 -575 -284 -131 -357 17 112 58 46 127 200 21 191 310 253 154 290
4124B90j67j53j3Ln7K45N4j18j43j09r1J09K17l37N9K12k01j49K92j28j22M22
$$ 290 123 -30 -43 -40 -97 148 202 84 -59 -168 -259 -150 67 -270 -211 1 -200 -349 -57 -185 -307 115
4146A15l00L24l56K70j88M49M3l06J98j72k8J29k2L3nJ85k73k14ok6M6q8K38l88
$$ 115 -185 139 -217 53 -135 314 357 51 249 77 49 178 156 189 184 369 96 -118 -124 -150 -104 -192 46 -342
4170c42J36J64rj54R1j24j2M47l53q7K29K06p9m7k1J69l64K86j90J43J46k74R6
$$ -342 -206 -42 -51 -205 -114 -238 -250 197 -156 -243 -14 192 113 66 45 214 -150 136 -54 89 235 -39 57
4193E7P6n6K6K0n1q3J49k76p4l2J16P1l06L66l06J50J59Q5k30J09j7M77m65L62
$$ 57 133 77 103 123 72 -11 138 -138 -212 -244 -128 -57 -363 3 -303 -153 6 91 -139 -30 -47 430 -35 327
4217C27o1k93J58J07L0L9l39M02n54L23J10l23J02q5k6k10K59j23o4p5O8K19r2
$$ 327 266 -27 131 238 268 307 -32 370 -184 139 249 -74 28 -57 -83 -293 -34 -157 -221 -296 -228 -9 -101
4240a01k3J48j26M4K1L01l94n9K64O8j71K78k6l10Q8J33M6j39j12j82L47k1m7
$$ -101 -124 24 -102 -58 -37 264 -130 -189 75 143 -28 250 224 -86 2 135 181 42 -70 -252 95 74 27
4263B7k98j0K77k31R2J2r5JR3K10J4k58J64p1J52k45K76K7j02j6J26j23K90n4
$$ 27 -271 -281 -4 -235 -143 -131 -226 -225 -132 78 92 -166 -2 -73 79 -166 110 137 35 19 145 22 312 258
4287B58J0k78L1M9j28J23j24j12o8J31J27j74j39lN04k80o2k12L22J32r2Q4M9
$$ 258 268 -10 21 70 -58 65 -59 -171 -239 -108 19 -155 -294 -297 207 -73 -135 -347 -25 107 15 99 148
4310A48k85K59k49L65j83K1K48k44J75K13n12L0K15L1j73k07L63n56J49m0J08
$$ 148 -137 122 -127 238 55 76 324 80 255 468 -44 -14 201 232 59 -148 215 -341 -192 -232 -124
4331a24Q5N5k9k1qk8o9m7N5J76m8J91j95J29K21l23K88j90J56q0k17J05J94j24
$$ -124 -39 16 -13 -34 -42 -70 -139 -186 -131 45 -3 188 -7 122 343 20 308 118 274 194 -23 82 276 152
4355A52j88J43k33j22L70o3l12J95L5J77l07J51j76J48K0k19J50Q2J51j72J38
$$ 152 -36 107 -126 -248 122 59 -253 -58 -23 154 -153 -2 -178 -30 -10 -229 -79 3 154 -18 120
4376A20Q1N5j21j23L87k27L9j5k9jN5k05N2k17L57j33k13L7k94J70J04j43K92
$$ 120 201 256 135 12 399 172 211 196 167 166 221 16 68 -149 208 75 -138 -101 -395 -225 -121 -264 28
4399B8k44m1RJ85k25J84K12L0J9r8N1K0ml03K70k24J96j04Q1K08l3l7Rk07MJ06
$$ 28 -216 -257 -248 -63 -288 -104 108 138 157 59 110 130 126 -177 93 -131 65 -39 42 250 217 180 189 -18 -14 92
4425I2k65J10p6J22m0k7m6K7j78J42q9J27J20lK3O3K3r7KO0J05j27Pk01R3K34
$$ 92 -173 -63 -139 -17 -57 -84 -130 -103 -281 -139 -228 -101 19 16 39 102 125 28 30 90 195 68 75 -126 -33 201
4451B01l6j29K2l82L88r9o4j83L08l71M45j18j48K58k26J5J74J24n19L89l02M82
$$ 201 165 36 58 -324 64 -35 -99 -282 26 -345 100 -18 -166 92 -134 -119 55 179 -340 49 -253 229
4473B29K2m5j09J34k45J83N1Kq8J62j98m0qr4j65J68N0j31j19K06M2j55m3j41
$$ 229 251 206 97 231 -14 169 220 222 134 296 98 58 50 -44 -209 -41 9 -122 -241 -35 7 -148 -191 -332
4497c32J25R3j98K09J60k36m6L79M8M9p8l00K23J24j57K49k17L9j31N2L01l67
$$ -332 -207 -114 -312 -103 57 -179 -225 154 202 251 173 -127 96 220 63 312 95 134 3 55 356 -11
4519a1j28K42j68OK48j94J7k31K74k77M4OJ29L1QK0kK84k21j25K18j66L94l36
$$ -11 -139 103 -65 -59 189 -5 12 -219 55 -222 -178 -172 -43 -12 -4 16 14 298 77 -48 170 4 398 62
4543F2J19r2M4m0o2P7l9J1q2n1k2q1m8L8O2k68K10J86k33P9K34j23m6J35l36L05
$$ 62 181 89 133 93 31 108 69 80 -2 -53 -75 -156 -204 -166 -104 -372 -162 24 -209 -130 104 -19 -65 70 -266 39
4569C9M8N0l6pJ94k43J66k65q6L15j18R2k47o4L22l91R5j03R0n2N8O0K60j91p8
$$ 39 87 137 101 94 288 45 211 -54 -140 175 57 149 -98 -162 160 -231 -136 -239 -149 -201 -143 -83 177 -14 -92
4594i2qJ23J84j61p5l8J50M6p8k87K26J31j25L5J73k32J78j23k04N01k85p8K2
$$ -92 -100 23 207 46 -29 -67 83 129 51 -236 -10 121 -4 31 204 -28 150 27 -177 324 39 -39 -17
4617a7j37q1K41l06J05L2N5K16k52K84k54J39q7j5O2m1K76j80K90l79J93j20p9
$$ -17 -154 -235 6 -300 -195 -163 -108 108 -144 140 -114 25 -62 -77 -15 -56 220 40 330 -49 144 24 -55
4640e5J2J5q2K37J5j62k52J75K57k03L2p5M8J09K4m6j80NJ5k33L13j30J89k5j34
$$ -55 -43 -28 -110 127 142 -20 -272 -97 160 -43 -11 -86 -38 71 95 49 -131 -126 -111 -344 -31 -161 28 3 -131
4665a31L08n4K14j45k05J68k67K87J15k82L2J59j26j5p6J28j55l4J93k79J56j65
$$ -131 177 123 337 192 -13 155 -112 175 290 8 40 199 73 58 -18 110 -45 -79 114 -165 -9 -174
4687a74J36k34L28k21K40l59R7K13j05J99q1j20J06Q2k28M06k77j9J13O0k4j06
$$ -174 -38 -272 56 -165 75 -284 -187 26 -79 120 39 -81 25 107 -121 285 8 -11 102 162 138 32
4709C2J44k02J55p8q3qj13J65l9O1j73K25j86J85o9k42K87l08L8L90j35K10l67
$$ 32 176 -26 129 51 -32 -40 -153 12 -27 34 -139 86 -100 85 16 -226 61 -247 -209 181 46 256 -111
4732a11J31J04k7M1r8J54j87K28l54L49k03L9q0k26L16r9o5J54q3r1J19m83N26
$$ -111 20 124 97 138 40 194 7 235 -119 230 27 66 -14 -240 76 -23 -88 66 -17 -108 11 -472 54
4755E4r6Q3l6j22J23J75k13j22J45L42j47j52k81J02M22l26J19j6L8p5j53K39
$$ 54 -42 41 5 -117 6 181 -32 -154 -9 333 186 34 -247 -145 277 -49 70 54 92 17 -136 103
4777A03j03K5k71j08K56j6j00J73k02J05M9q7J19K53j28q6L9P9j40J86rj94J62
$$ 103 0 25 -246 -354 -98 -114 -214 -41 -243 -138 -89 -176 -57 196 68 -18 21 100 -40 146 137 -57 105
4800A05R8k15L24j1l24K9J72p3n0p4k0k72K59k49K89j23Q6k18K11OM6j6m4j08
$$ 105 203 -12 312 301 -23 6 178 105 55 -19 -39 -311 -52 -301 -12 -135 -49 -267 -56 -50 -4 -20 -64 -172
4824a72N3n5L23m1j08J86j35J60k04K73k56K4J0j6R5r2N5k43J35j09r8J48l5o4
$$ -172 -119 -174 149 108 0 186 51 211 7 280 24 48 58 42 137 45 100 -143 -8 -117 -215 -67 -102 -166
4848a66J9K5J82k43J82J84k41J18j06P9R5j98K2K4J38J2J18k64J01J37j50q7j31
$$ -166 -147 -122 60 -183 -1 183 -58 60 -46 33 128 -70 -48 -24 114 126 244 -20 81 218 68 -19 -150
4871a50L86j12m4l8l48L84p4M19m45r2p3J76j70O1Q9j54K73m8Q6j27l2J94m65
$$ -150 236 124 80 42 -306 78 4 423 -22 -114 -187 -11 -181 -120 -31 -185 88 40 126 -1 -33 161 -304
4894c04K97R1J0J78j04k34pK29n3Lo8l5P7l0J04j58o5K7j5k0q0K67m2k01j16K12
$$ -304 -7 84 94 272 168 -66 -73 156 103 106 38 3 80 50 154 -4 -69 -42 -57 -77 -157 110 68 -133 -249 -37
4920c7o8K49j31K94j24j09LJ45K7o9k04j33L39j52J14j61J02m1J17j72l10J71
$$ -37 -105 144 13 307 183 74 77 222 249 180 -24 -157 182 30 144 -17 85 44 161 -11 -321 -150
4942a50J28M0j11O0J75r4j22n5O2M6k30Q9J75p5J39J1O6L2j91j73K70j24J92r3
$$ -150 -22 18 -93 -33 142 48 -74 -129 -67 -21 -251 -162 13 -62 77 88 154 186 -5 -178 92 -32 160 67
4966F7l17M35l1j7O9n5k23k2o1K37m8j87K06j42K07k05lM0J85p8N8j43R3k50K41
$$ 67 -250 185 154 137 206 151 -72 -94 -155 82 34 -153 53 -89 118 -87 -90 -50 135 57 115 -28 65 -185 56
4991E6L10k55k73K7L5M7N1L20j17k35J46O6p9j80M9M2r3J61l85P5k6L72j47J7
$$ 56 366 111 -162 -135 -100 -53 -2 318 201 -34 112 178 99 -81 -32 10 -83 78 -307 -232 -258 114 -33 -16
5015a6n9J46J05P4k19k09K51p7k10J51K87J9l44J28Ro0K20j44Q6j25O6j8k51J74
$$ -16 -75 71 176 250 31 -178 73 -4 -214 -63 224 243 -101 27 36 -24 196 52 138 13 79 61 -190 -16
5039a6J25k66L32m54J83P1j39J10J73r4l9M26l00k90J45J31J40j21j18P2j5Ok2
$$ -16 109 -157 175 -279 -96 -25 -164 -54 119 25 -14 412 112 -178 -33 98 238 117 -1 71 56 62 40
5062D0j24J81k92J28J63n0k71L16l43M24M1j09j3j52J16l62K32j42L63r6q9J98
$$ 40 -84 97 -195 -67 96 46 -225 91 -252 172 213 104 91 -61 55 -307 -75 -217 146 50 -39 159
5084A59n5r2OL11k89kj6p4L9O6L87l91J38n1k26K15J1j89QM7N1k67L45k71j47
$$ 159 104 12 18 329 40 38 22 -52 -13 53 440 49 187 136 -90 125 136 -53 -45 2 53 -214 131 -140 -287
5109b87L39K3j41q1K62r8j49K56j45O1J68k4k80n3K05J22j42j52K73j83L3R1j28
$$ -287 52 75 -66 -147 115 17 -132 124 -21 40 208 184 -96 -149 56 178 36 -116 157 -26 7 98 -30
5132c0J86k66L2J13L5k11K34k20l7J25L8j34O2J01M1j53J35J36q5J15l36J25L26
$$ -30 156 -110 -78 35 70 -141 93 -127 -164 -39 -1 -135 -73 28 69 -84 51 187 102 217 -119 6 332
5155C32j87k84J17R1J22j22l91L19j22J79K8p6k40K0J30J78k24o9K39j99J81k62
$$ 332 145 -139 -22 69 191 69 -322 -3 -125 54 82 6 -234 -214 -84 94 -130 -199 40 -159 22 -240
5177b40J97O9m6k71M43j95J80J2j63Q7j4J51k44Q8k84J23K32J5J11p4n7j19J53
$$ -240 -43 26 -20 -291 152 -43 137 149 -14 73 59 210 -34 54 -230 -107 125 140 251 177 120 1 154
5200A54k47KJ93k89K90j88J39J82k67Q6r5R4K1l1k80L03o7m6J04j6K9N4k91K01
$$ 154 -93 -91 102 -187 103 -85 54 236 -31 55 -40 54 75 44 -236 67 0 -46 58 42 71 125 -166 35
5224C5L0l00L18j2j57q0J85j60J23o4k7q4L47l36Q2J67k04j0M6mM8J67L3k35K46
$$ 35 65 -235 83 71 -86 -166 19 -141 -18 -82 -109 -193 154 -182 -100 67 -137 -147 -101 -105 -57 110 143 -92 154
5249A54j75L3n8M2J72k01J91j59r8j68M71k70K31k76J05lj11l6M11k94j55j06
$$ 154 -21 12 -46 -4 168 -33 158 -1 -99 -267 204 -66 165 -111 -6 -9 -120 -156 255 -39 -194 -300
5271c00K96R5l5l52L39O2j06j6M4J55J03j09J59j68q1p3j09L3L67m20K69m7j6
$$ -300 -4 91 56 -296 43 105 -1 -17 27 182 285 176 335 167 86 13 -96 -63 304 -116 153 106 90
5294I0K01m02j8J68J24k65j77N6O5K38J3j93q1L98l00j47J06K06r4M3j06k60L83
$$ 90 291 -111 -129 39 163 -102 -279 -223 -158 80 93 -100 -181 217 -83 -230 -124 82 -12 31 -75 -335 48
5317D8j28Q2J37m8J14j9k71M0j26K50L7k41J69j55q0K60k13K81j83o5L7N0J12
$$ 48 -80 2 139 91 205 186 -85 -45 -171 79 116 -125 44 -111 -191 69 -144 137 -46 -111 -74 -24 88
5340H8q9j16j8k6J69P7q0j28L43R7l03O0Kn3J16j93OL52l74J68J53j71r2PL9j78
$$ 88 -1 -117 -135 -161 8 85 5 -123 220 317 14 74 76 23 139 -54 -48 304 -70 98 251 80 -12 -5 34 -144
5366a44J55j47J63J21j64p9K85k68J03mj43R5Q0ML19k12q8l2r4J83M0l4j31Q8
$$ -144 11 -136 27 148 -16 -95 190 -78 25 21 -122 -27 53 57 376 164 76 44 -50 133 173 139 8 96
5390I6j61J43o7j64J37J16j97k9J37j78J47j67K17J84j69L4j35K05k01J67k03
$$ 96 -65 78 11 -153 -16 100 -97 -126 11 -167 -20 -187 30 214 45 79 -56 149 -52 115 -88
5411h8K91n20M35j56k3L2M9k31K10M2J90l01k1R8J38k45L0J54K7j78J9p0j16j18
$$ -88 203 -317 118 -38 -61 -29 20 -211 -1 41 231 -70 -91 7 145 -100 -70 84 111 -67 -48 -118 -234 -352
5435c52J21L18J7n2R2p7k8k2O5k03L19j06O1k87N4J67N7k72L4L0q2K67o0K44l02
$$ -352 -231 87 104 52 144 67 39 17 82 -121 198 92 153 -134 -80 87 144 -128 -94 -64 -146 121 61 305 3
5460Ck09J08p1J00K02l65K69q2O6J31k70M2K37n9j79J54O3k8k33J23n3J49j01
$$ 3 -206 -98 -169 -69 133 -232 37 -45 21 152 -118 -76 161 102 -77 77 140 112 -121 2 -51 98 -3
5483cm2K72j59j53jJ44j57J42k3j30J21J0L4k79P5K19k39M6L8R8j39L84L3k97
$$ -3 -45 227 68 -85 -86 58 -99 43 20 -110 11 21 55 -224 -149 70 -169 -123 -85 13 -126 258 291 -6
5507fj03K85K6j42K6j6M7j01p4lK3K65j24l37J32j80L37K01l12R4l5r8n0O1K85
$$ -6 -109 176 202 60 86 70 117 16 -58 -61 -38 227 103 -234 -102 -282 55 256 -56 38 3 -95 -145 -84 201
5532B01l92K41%J7q5Q3o6L5J98j10m0j01Q3J13l19L05k17P3k0J36J3k05J28J40
$$ 201 -191 50 50 67 -18 65 -1 34 232 122 82 -19 64 177 -142 163 -54 19 -1 135 148 -57 71 211
5556B11l36p0Lj40K61kP7j3J34j78J06J4r2m1J67J44j10j62Q9j5Q2j01j04P8o3
$$ 211 -125 -195 -192 -332 -71 -73 4 -9 125 -53 53 67 -25 -66 101 245 135 -27 62 47 129 28 -76 2 -61
5581f1K3Q1j0j12J7K58j36J02J2K2k56P1j78J7J50O1l18L65n7m6K46n00L81j66
$$ -61 -38 43 33 -79 -62 196 60 162 174 196 -60 11 -167 -150 0 61 -257 108 51 5 251 -249 132 -34
5605c4O0M37l60j20J01q9M8QK8Kj24M4K1j54L8K51J57m29J09m4kR2O8j73P6J89
$$ -34 26 463 103 -17 84 -5 43 51 79 81 -43 1 22 -132 -94 157 314 -115 -6 -50 -52 40 108 -65 11 200
5631B00k41J14J17k89K76j76k5K75q3j92o8K72k95L02o2j41j28K84j79J86no2
$$ 200 -41 73 190 -99 177 1 -24 251 168 -24 -92 180 -115 187 125 -16 -144 140 -39 147 142 80
5653H0r2P5K66n28L00j76K22j71j01J83j36O9L29k70J27k92j18M55n02L65k13
$$ 80 -12 63 329 -199 101 -75 147 -24 -125 58 -78 -9 320 50 177 -115 -233 222 -280 85 -128
5674a28K25L4l65K40M5j26O2R1k43M08l43J70p9K83j17r0j81q3O0l2J96r8L59
$$ -128 97 131 -234 6 51 -75 -13 78 -165 243 -100 70 -9 274 157 67 -114 -197 -137 -169 27 -71 288
5697B88l31QK35J9j61K00j25l3j95L38k96J40j38P8J24J60j98j4j18q7j91K52
$$ 288 -43 -35 200 219 58 258 133 100 -95 243 -53 87 -51 27 151 311 113 99 -19 -106 -297 -45
5719d5J41r4m4l4K4J51o1K1J9r0k27L29O9k32J33J02j65o5J40R9k06J96o3L8R5
$$ -45 96 2 -42 -76 -52 99 38 59 78 -12 -239 90 159 -73 60 162 -3 -68 72 171 -35 161 98 136 231
5744B31k2l10J12l48K46k33J97L04k61P2j15O3pK74n8p0N2l72K87nk56L58j51
$$ 231 209 -101 11 -337 -91 -324 -127 177 -84 -12 -127 -64 -71 203 145 75 127 -245 42 37 -219 139 -12
5767a2r9L29k70j1R1o6j60M93j27k98L86l02J1MK17m34K42r2Q7K10q6j18q6L2
$$ -12 -111 218 -52 -63 28 -38 -198 295 168 -130 256 -46 -35 -31 186 -248 -6 -98 -11 199 113 -5 -91 -59
5791e9q9L27k80j9J22P0n1k6j79K64J84j66%j22K43q2j42K43l51J35j32p5M11
$$ -59 -148 179 -101 -120 2 72 21 -5 -184 80 264 98 98 -24 219 137 -5 238 -113 22 -110 -185 226
5814B26l29J50o1l6K6r2J36k11L25l04L03J85m59M48o68N76l02N0K38j67q1R6
$$ 226 -103 47 -14 -50 -24 -116 20 -191 134 -170 133 318 -141 307 -361 215 -87 -37 201 34 -47 49
5836D9k66J07R2m8J89j3q8p0N8j08N8l17K78J88j76J38J39l80K49j97L2J04p9
$$ 49 -217 -110 -18 -66 123 110 22 -48 10 -98 -40 -357 -79 109 -67 71 210 -170 79 -118 -86 18 -61
5859f1K34k77j58L23J2j1o5l6L5Q0%p3J57j0j73k26l0L11Q1J13k09j20K49k06
$$ -61 173 -104 -262 61 73 62 -3 -39 -4 76 76 3 160 150 -23 -249 -279 32 113 226 17 -103 146 -60
5883f0r8K72j02K58n35J52J48o6P6O5L2k14n5J64j14J07J57k25R3J7J8j22J8J12
$$ -60 -158 114 12 270 -265 -113 35 -31 45 110 142 -72 -127 37 -77 30 187 -38 55 72 90 -32 -14 98
5907I8Q2m3j30j89J59j17J86j09K76k95N7l7J26J63l38K98k05%J7O5M1k17O1Q
$$ 98 180 137 7 -182 -23 -140 46 -63 213 -82 -25 -62 64 227 -111 187 -18 -18 -1 64 105 -112 -51 -43
5931d3P0j98J72J4J04j3M3k64NK51Ok9ok24n0J2J00K9M1Rm0L1p4L9J06l31K41
$$ -43 27 -171 1 15 119 106 149 -115 -110 141 147 118 112 -112 -162 -150 -50 -21 20 29 -11 20 -54 -15 91 -240 1
$$ [...]
8191b8
##END NTUPLES=NMR FID
##END=
