##TITLE=1H_LR-758-R6-C1M-PE
 CDCl3
 8 sc, 
 29.9.2023
##JCAMPDX= 6.0         $$ Bruker NMR JCAMP-DX V2.0
##DATA TYPE= NMR FID
##DATA CLASS= NTUPLES
##ORIGIN= UXNMR, Bruker Analytische Messtechnik GmbH
##OWNER= root
$$ XWIN-NMR		Version 3.5
$$ Fri Sep 29 14:48:21 2023 Russian Standard Time (UT+4h)  she@DPX200
##.OBSERVE FREQUENCY= 200.13135
##.OBSERVE NUCLEUS= ^1H
##.DELAY= (6, 6)
##.ACQUISITION MODE= SIMULTANEOUS
##.ACQUISITION SCHEME= undefined
##.AVERAGES= 8
##.DIGITISER RES= 18
##SPECTROMETER/DATA SYSTEM= spect
##.PULSE SEQUENCE= zg30
##.SOLVENT NAME= CDCl3
##.SHIFT REFERENCE= (INTERNAL, CDCl3, 0, 15.7039)
##AUDIT TRAIL= $$ (NUMBER, WHEN, WHO, WHERE, WHAT)
$$ ##TITLE= Audit trail, XWIN-NMR		Version 3.5
$$ ##JCAMPDX= 5.01
$$ ##ORIGIN= Bruker BioSpin GmbH
$$ ##OWNER= she
$$ F:/spectra/data/she/nmr/H-F/1/audita.txt
$$ ##AUDIT TRAIL=  $$ (NUMBER, WHEN, WHO, WHERE, WHAT)
(   1,<2023-09-29 14:46:50.64 +0400>,<she>,<DPX200>,
      <created by zg, POWCHK disabled, PULCHK disabled
       configuration hash MD5:
       00 E9 B6 7A A2 85 ED C7 34 08 36 98 17 FE 4E 26
       data hash MD5: 16K
       9B AC 3A 2C FE 57 0D 62 6E D4 A6 87 5F 2E B3 33>)
$$ ##END=
$$ 
$$ hash MD5
$$ 0D E2 1D 8E 4A 9E 47 9D 92 B8 79 8A 67 51 8A 4D
##$RELAX= 
##$RELAX= 
##$RELAX= 
##$RELAX= 
##$RELAX= 
##$RELAX= 
$$ Bruker specific parameters
$$ --------------------------
##$DU= <F:/spectra>
##$EXPNO= 1
##$NAME= <H-F>
##$PROCNO= 1
##$TYPE= <nmr>
##$USER= <she>
##$AMP= (0..31)
100 100 100 100 100 100 100 100 100 100 100 100 100 100 100 100 100 100 
100 100 100 100 100 100 100 100 100 100 100 100 100 100 
##$AQSEQ= 0
##$AQ_mod= 1
##$AUNM= <au_zg>
##$AUTOPOS= <>
##$BF1= 200.13
##$BF2= 200.13
##$BF3= 200.13
##$BF4= 200.13
##$BF5= 200.13
##$BF6= 200.13
##$BF7= 200.13
##$BF8= 200.13
##$BYTORDA= 1
##$CFDGTYP= 0
##$CFRGTYP= 5
##$CHEMSTR= <none>
##$CNST= (0..31)
1 1 145 1 1 1 1 1 1 1 1 1 1 1 1 1 1 1 1 1 1 1 1 1 1 1 1 1 1 1 1 1 
##$CPDPRG= <>
##$CPDPRG1= <>
##$CPDPRG2= <>
##$CPDPRG3= <>
##$CPDPRG4= <mlev>
##$CPDPRG5= <mlev>
##$CPDPRG6= <mlev>
##$CPDPRG7= <mlev>
##$CPDPRG8= <mlev>
##$CPDPRGB= <>
##$CPDPRGT= <>
##$D= (0..31)
0 1.2 0 0 0 0 0 0 0 0.06 0 0.03 0 0 0 0 0.0002 0 0 0 0 0 0 0 0 0 0 0 0 
0 0 0 
##$DATE= 1695984410
##$DBL= (0..7)
120 120 120 120 120 120 120 120 
##$DBP= (0..7)
150 150 150 150 150 150 150 150 
##$DBP07= 0
##$DBPNAM0= <>
##$DBPNAM1= <>
##$DBPNAM2= <>
##$DBPNAM3= <>
##$DBPNAM4= <>
##$DBPNAM5= <>
##$DBPNAM6= <>
##$DBPNAM7= <>
##$DBPOAL= (0..7)
0.5 0.5 0.5 0.5 0.5 0.5 0.5 0.5 
##$DBPOFFS= (0..7)
0 0 0 0 0 0 0 0 
##$DE= 6
##$DECBNUC= <off>
##$DECIM= 32
##$DECNUC= <off>
##$DECSTAT= 4
##$DIGMOD= 1
##$DIGTYP= 9
##$DL= (0..7)
0 120 120 120 120 120 120 120 
##$DP= (0..7)
150 150 150 150 150 150 150 150 
##$DP07= 0
##$DPNAME0= <>
##$DPNAME1= <>
##$DPNAME2= <>
##$DPNAME3= <>
##$DPNAME4= <>
##$DPNAME5= <>
##$DPNAME6= <>
##$DPNAME7= <>
##$DPOAL= (0..7)
0.5 0.5 0.5 0.5 0.5 0.5 0.5 0.5 
##$DPOFFS= (0..7)
0 0 0 0 0 0 0 0 
##$DQDMODE= 0
##$DR= 18
##$DS= 0
##$DSLIST= <SSSSSSSSSSSSSSS>
$$ [...]
##$SUBNAM2= <"">
##$SUBNAM3= <"">
##$SUBNAM4= <"">
##$SUBNAM5= <"">
##$SUBNAM6= <"">
##$SUBNAM7= <"">
##$SUBNAM8= <"">
##$SUBNAM9= <"">
##$SW= 18.05172834244
##$SWIBOX= (0..15)
0 0 2 0 0 0 0 0 0 0 0 0 0 0 0 0 
##$SW_h= 3612.71676300578
##$TD= 16384
##$TD0= 1
##$TE= 0
##$TE2= 300
##$TE3= 300
##$TEG= 300
##$TL= (0..7)
0 120 120 120 120 120 120 120 
##$TP= (0..7)
150 150 150 150 150 150 150 150 
##$TP07= 0
##$TPNAME0= <>
##$TPNAME1= <>
##$TPNAME2= <>
##$TPNAME3= <>
##$TPNAME4= <>
##$TPNAME5= <>
##$TPNAME6= <>
##$TPNAME7= <>
##$TPOAL= (0..7)
0.5 0.5 0.5 0.5 0.5 0.5 0.5 0.5 
##$TPOFFS= (0..7)
0 0 0 0 0 0 0 0 
##$TUNHIN= 0
##$TUNHOUT= 0
##$TUNXOUT= 0
##$USERA1= <user>
##$USERA2= <user>
##$USERA3= <user>
##$USERA4= <user>
##$USERA5= <user>
##$V9= 5
##$VALIST= <valist>
##$VCLIST= <CCCCCCCCCCCCCCC>
##$VD= 0
##$VDLIST= <DDDDDDDDDDDDDDD>
##$VPLIST= <PPPPPPPPPPPPPPP>
##$VTLIST= <TTTTTTTTTTTTTTT>
##$WBST= 1024
##$WBSW= 4
##$XGAIN= (0..3)
0 0 0 0 
##$XL= 0
##$YL= 0
##$YMAX_a= 333114
##$YMIN_a= -563527
##$ZGOPTNS= <>
##$ZL1= 120
##$ZL2= 120
##$ZL3= 120
##$ZL4= 120
##$ABSF1= 10
##$ABSF2= 0
##$ABSG= 5
##$ABSL= 3
##$ALPHA= 0
##$AQORDER= 0
##$ASSFAC= 0
##$ASSFACI= 0
##$ASSFACX= 0
##$ASSWID= 0
##$AUNMP= <proc_1d>
##$AZFE= 0.1
##$AZFW= 0.1
##$BCFW= 1
##$BC_mod= 2
##$BYTORDP= 1
##$COROFFS= 0
##$CY= 11.3945322036743
##$DATMOD= 1
##$DC= 2
##$DFILT= <>
##$DTYPP= 0
##$F1P= 15.7292609196834
##$F2P= 12.9074282941183
##$FCOR= 0.5
##$FTSIZE= 0
##$FT_mod= 4
##$GAMMA= 1
##$GB= 0.15
##$INTBC= 1
##$INTSCL= 1
##$ISEN= 128
##$LB= 0.24
##$LEV0= 0
##$LPBIN= 0
##$MAXI= 10000
##$MC2= 0
##$MEAN= 0
##$ME_mod= 0
##$MI= 1.114404
##$NCOEF= 0
##$NC_proc= 0
##$NLEV= 6
##$NOISF1= 3.799351
##$NOISF2= 2.8
##$NSP= 1
##$NTH_PI= 0
##$NZP= 0
##$OFFSET= 15.70392
##$PC= 1
##$PHC0= -21708.76
##$PHC1= 9.65271
##$PH_mod= 1
##$PKNL= yes
##$PPARMOD= 0
##$PSCAL= 0
##$PSIGN= 0
##$REVERSE= no
##$SF= 200.130013532006
##$SI= 16384
##$SIGF1= 3
##$SIGF2= 2
##$SINO= 400
##$SIOLD= 16384
##$SREGLST= <1H.CDCl3>
##$SSB= 0
##$STSI= 0
##$STSR= 0
##$SW_p= 3612.71676300578
##$SYMM= 0
##$S_DEV= 0
##$TDeff= 0
##$TDoff= 0
##$TI= <>
##$TILT= no
##$TM1= 0
##$TM2= 0
##$TOPLEV= 0
##$USERP1= <user>
##$USERP2= <user>
##$USERP3= <user>
##$USERP4= <user>
##$USERP5= <user>
##$WDW= 1
##$XDIM= 8192
##$YMAX_p= 0
##$YMIN_p= 0
$$ End of Bruker specific parameters
$$ ---------------------------------
##NTUPLES= NMR FID
##VAR_NAME=  TIME,          FID/REAL,        FID/IMAG
##SYMBOL=    X,             R,               I
##VAR_TYPE=  INDEPENDENT,   DEPENDENT,       DEPENDENT
##VAR_FORM=  AFFN,          ASDF,            ASDF
##VAR_DIM=   8192,          8192,            8192
##UNITS=     SECONDS,       ARBITRARY UNITS, ARBITRARY UNITS
##FACTOR=    0.0002768,     1,               1
##FIRST=     0,             0,               0
##LAST=      2.2672688,     0,               0
##MIN=       0,             -563527,         0
##MAX=       2.2672688,     333114,          0
$$ Real data points
##PAGE= N=1
##DATA TABLE= (X++(R..R)), XYDATA
$$ [...]
1872h07j31j08K62O8M35l18K65N4M64j36J17L32K06p9K57P3j77j4kk46P1Q2l48
1895C20j40N4j29k54j15k70j03J60k66R4K3Q8Q5o8J10pM87j6k9K64L66k24L71
1918H01j26k46J32K63o23L28l5k75Q4m6j78n11J65m9O8m7j51j54J01q0nJ04j04
1941e84N5O04jJ3L09L8J56M02l19K27j98K99j75p5r1J2k42k03P3o52N05k91j68
1964c06J30m20n6J43j99o0n2L06j81M84j09m4K32M4L20R7K2N5L30L83l81rj4j30
1988E85q5J91k25q8m01K38l83N8l8l80J88j15J13l36LM77m0j38N5Q9J61n1M54
2011C32j37J63L55K5m0j00j7J66q9j40j30j1l17J07l12K90k51k94J73l66k17K75
2033e35j29o3K80J10N3j21L50r0n2K79J99r1N25J2k17J48J79k90K96j72l71J61
$$ plain form
1872 -807 -938 -1046 -784 -716 -281 -599 -334 -280 184 48 165 497 703 624 881 954 777 763 761 515 586 668 320
1895 320 180 234 105 -149 -264 -534 -637 -477 -743 -649 -626 -538 -453 -521 -411 -418 69 53 24 288 654 430 801
1918 801 675 429 561 824 201 529 494 219 303 257 79 -432 -267 -316 -248 -295 -446 -600 -499 -579 -584 -480 -584
1941 -584 -529 75 74 87 396 434 590 992 673 900 702 1001 826 751 660 672 430 227 300 -352 153 -138 -306
1964 -306 -176 -596 -652 -509 -708 -768 -820 -514 -695 -211 -320 -364 -132 -88 232 329 351 406 736 1119 738 729 715 585
1988 585 500 691 466 378 -23 215 -168 -110 -148 -528 -340 -455 -342 -678 -675 -198 -238 -376 -321 -232 -71 -122 332
2011 332 195 358 713 738 698 598 581 747 658 518 388 377 60 167 -145 145 -106 -400 -227 -593 -810 -535
2033 -535 -664 -727 -447 -337 -284 -405 -55 -145 -197 82 281 190 715 727 510 658 837 547 843 671 300 461
2055D61Q8L1q59N2k08J11K4j87j24l9R6j52L31j87Q9P6K11k20K20k7K57K45J37
2078D26j12K71J0O2p2O2m5j59R4j56j95J69m10n7m1k68R2m17J00j49K66j19L8
2101f10J73K33m6J20J4K55j03J72J21k1J28N4J62k34J77P9N5m86j46K24j02j89
2123C0j39k86PPP4j14J17j51k61R0L03j76qK19L83k77J02P7M32L51k47k25K19
2146E27M4m2m6j7k2k3n5k86r6o1L76m30J06k78k19L0pK26j23l60K92K45j32J25
2170b26J01J80K05M18j31q2p2K63k50l1N2J83k89l1l2j27J93l50j07q2l77J24
2192d68Nj80K79l23O2J55L45n2k27M41QM1l7L29k25Q7L54k40K69j04k32J36P6
2215D99j53n9K7l07P7P6l63k01O7l4l20J49j60m7L59M3o7L09k96L19K18J80j16
$$ plain form
2055 461 549 580 -279 -227 -435 -324 -300 -487 -611 -650 -554 -706 -375 -562 -473 -397 -186 -406 -186 -213 44 289 426
2078 426 314 585 595 657 585 647 602 443 537 381 186 355 -55 -112 -153 -421 -329 -746 -646 -795 -529 -648 -610
2101 -610 -437 -204 -250 -130 -116 139 36 208 329 308 436 490 652 418 595 674 729 243 97 321 219 30
2123 30 -109 -395 -388 -381 -307 -421 -304 -455 -716 -626 -323 -499 -507 -288 95 -182 -80 -3 429 780 533 308 527
2146 527 571 529 483 466 444 421 366 80 -16 -77 299 -131 -25 -303 -522 -492 -499 -273 -396 -756 -464 -219 -351 -226
2170 -226 -125 55 260 678 547 465 393 656 406 375 427 610 321 290 258 131 324 -26 -133 -215 -592 -468
2192 -468 -463 -643 -364 -687 -625 -470 -125 -177 -404 37 45 86 49 378 153 240 594 354 623 519 287 423 499
2215 499 346 287 314 7 84 160 -203 -404 -337 -371 -691 -542 -702 -749 -390 -347 -414 -105 -401 -82 136 316 200
2238B00J46j6J75j35L17l25J36N9j22j90J78j23k8j31k58l96N72m85J03P8l61
2259f06O3K55j24K2q3L39l38N31j50j45M46j09K43q5J77K7n8J54j49QQ2j73J92
2282E19n26J88l65j5Q7j45j35j20R1k00R3J77m8j36M0O6R2O4M28j09P7K70j80
2305B13K5R7K7K07j40O1k61J18m5j92k29j9M5p5Jk37J82k66R5Lk58J24R5J4K47
2330a68k14L42J18kJ46j19K23J16o1L05k67Kj01n1l7JL1k94J33k51mk30J18K78
2354A4m12j98J42N2j04k8J00L57R5N0r1J52j59J69M68o0N6j05M3j65j06J21J3
2377D04j18k46Q5r1j86o5Oj32J14J03r7n1o2j64Q1K95Jj75N1K14p8K03P3K4o9
2402A20L10J34j90Q7M93n70m1Qk00L4j45j1km9j10m1l10L9N2nJ2o8K4J91L9J40
$$ plain form
2238 200 346 330 505 370 687 362 498 557 435 245 423 300 272 141 -117 -513 59 -426 -323 -245 -606
2259 -606 -543 -288 -412 -390 -473 -134 -472 59 -91 -236 210 101 344 259 436 463 405 559 410 418 500 327 519
2282 519 -7 181 -184 -199 -112 -257 -392 -512 -421 -621 -528 -351 -399 -535 -495 -429 -337 -273 155 46 123 393 213
2305 213 238 335 362 569 429 490 229 347 302 110 -119 -138 -93 -168 -167 -404 -222 -488 -393 -390 -648 -524 -429 -415 -168
2330 -168 -382 -40 78 76 222 103 326 442 381 686 419 421 320 269 232 233 264 -30 103 -148 -152 -382 -264 14
2354 14 -398 -596 -454 -402 -506 -534 -434 -77 18 68 -23 129 -30 139 607 547 603 498 541 376 270 391 404
2377 404 286 40 125 34 -152 -217 -211 -343 -229 -126 -223 -274 -336 -500 -419 -124 -123 -298 -247 -33 -111 92 165 189 120
2402 120 430 564 374 461 954 384 343 351 151 185 40 29 27 -22 -132 -173 -483 -444 -392 -397 -385 -453 -429 -238 -199 -59
2428e9l63L99j95L21P9L1Q5K52l90J24R9j6k05r1oL2J14J11l68j27j53n2K11j82
2452c49p1m4J31j80J38P5O0K9N9rK78R8L24q8J69m09J34m2Q6P2j5Q1j25k02j09
2477I1L1k98J42J1j59n0j99K05l03N7p2QJ77j5P5K84j08Q2o1L98R5l06M18q8R8
2502E13k28J02M0r1k15N6M6n9j14nk66J52k71O2J32l21j24J34J55kr4J64J15J20
2526AJ73J88k07j14K64n6J19KQ4k12M9j16N1K4o0j86J49j27r1K01n67K96n1j94
2550c80k34K01J79k08K42k75L16k05N59j73L0J81J81k47N8O4l7n0J05J9j35L18
2572E09l78J15j67o0l2j49j8k50j76L05j47O1m9pN06l26J27m5J47j61J87J42K88
2595D22k79j37M37J33k27r6J72r9R2j64K3l70L03k84r5r5O7k1l3Q0j52J28o8k7
$$ plain form
2428 -59 -422 -23 -218 103 182 213 298 550 160 284 383 367 162 71 65 97 211 322 -46 -173 -326 -378 -167 -349
2452 -349 -420 -464 -333 -513 -375 -300 -240 -211 -152 -161 117 215 539 451 620 211 345 303 389 461 446 527 402 200 91
2477 91 122 -176 -34 -23 -182 -232 -431 -226 -529 -472 -544 -536 -359 -374 -299 -15 -123 -41 -102 296 391 85 503 415 513
2502 513 285 387 427 336 121 177 223 164 50 45 -221 -69 -340 -278 -146 -467 -591 -457 -302 -304 -398 -234 -119 1
2526 1 174 362 155 41 305 249 368 370 454 242 291 175 226 250 190 4 153 26 -65 136 -431 -135 -186 -380
2550 -380 -614 -413 -234 -442 -200 -475 -159 -364 195 22 52 233 414 167 225 289 252 202 307 326 191 509
2572 509 131 246 79 19 -13 -162 -180 -430 -606 -301 -448 -387 -436 -443 63 -263 -136 -181 -34 -195 -8 134 422
2595 422 143 6 443 576 349 253 425 326 418 254 277 -93 210 -74 -169 -264 -197 -218 -251 -171 -323 -195 -263 -290
2619b90J9n1J17L55j40n4J41J69K6J27J50n15K25J84j71j82L15k92K15q9k65n8
2641f4J45j90q2j72k14J77n9P7K9K14n4r6K1M13k6N5N7K24j50j0J15l21L89P9
2665E57m92K32J77k89r5Q8j36j05J47k40K59l93k8K30K19o42J03L00j49k08K53
2686b12K90k23J70Q6j78K77J03l00M72j87m5J79J9l0j49J23l52J74l97K15j98
2707a63J42k16j30J11O2J20l15K02k7j10J96P8k62L06J38N6o4j39J84K90l49J87
2729B97MK3q4M6m11K47K73l13j93l8P7r3N2l46K07R5k57J17J6K09j17q4L42J27
2753A96j03J3j48K00K60j89j73J3L04j60J62l19J98j63K14j04l82J20n8N2m8k55
2775c70Q0J09j26J28Q5l61J77K76j91K64j46N5K31J92j80n0J47qN3j20%k34L7
$$ plain form
2619 -290 -271 -322 -205 150 10 -44 97 266 292 419 569 54 279 463 292 110 425 133 348 259 -6 -64
2641 -64 81 -109 -191 -363 -577 -400 -459 -382 -353 -139 -193 -289 -268 145 119 174 231 455 305 295 410 89 478 557
2665 557 65 297 474 185 90 178 42 -63 84 -156 103 -290 -318 -88 131 -511 -408 -108 -257 -465 -212
2686 -212 78 -145 25 111 -67 210 313 13 485 298 253 432 451 421 272 395 43 217 -180 35 -163
2707 -163 -21 -237 -367 -256 -194 -74 -389 -187 -214 -324 -128 -50 -312 -6 132 188 124 -15 169 459 110 297
2729 297 301 324 240 286 -125 122 395 82 -111 -149 -72 -165 -113 -459 -252 -157 -414 -297 -281 -72 -189 -273 69 196
2753 196 93 106 -42 158 418 229 56 69 373 213 375 56 254 91 305 201 -181 -61 -119 -67 -115 -370
2775 -370 -290 -181 -307 -179 -94 -455 -278 -2 -193 71 -75 -20 211 403 223 173 320 312 365 245 245 11 48
2798D8J36n3p9j17R7l07N50l16j13J40m37oL9J01J33K04j29k67K28q7L31M9k2
2821A23J55PJ6j74J48r3J51p5n4j07J99p5k87kR5M1J3k00m7m8N5n1j2j85R9L34
2847B6kj85K58j24km6J36K79j53K85m29J89j13J81J64l1j64j81j27M0k06J63k48
2870b90nM9J51m49K92Q0k22O8J38O6l19O24j01J81j01M5L1j9j79R7J93L9k86K26
2894C09n54L22k21K22j08j74p2M6J64j91n6J17qj9l06K90K4o3K63J17k48J14K43
2917B11j47l4J96K50k93J83j29k26K33l7Q6j13p1o6M0j90j50M7p8n0o7J67K21
2940a7m98K84J02n9J40R4j95K65j64J52J5P5j5k20K58K05k34n8j74L41l33L07
2962B71j60k35Rj07J80j77n1p5J14j82L25k13r2K69j23K14J64j63p9L41j56J97
$$ plain form
2798 48 184 131 52 -65 32 -275 275 -41 -154 -14 -451 -457 -418 -317 -184 20 -109 -376 -148 -235 96 145 123
2821 123 278 285 301 127 275 182 333 258 204 97 296 221 -66 -68 27 68 81 -119 -166 -214 -159 -210 -222 -407 -308 26
2847 26 24 -161 97 -27 -29 -75 61 340 187 472 43 232 119 300 464 433 269 88 -39 1 -205 -42 -290
2870 -290 -295 -246 -95 -544 -252 -172 -394 -326 -188 -122 -441 183 82 263 162 207 238 219 40 137 330 369 83 309
2894 309 -245 77 -144 78 -30 -204 -276 -230 -66 -257 -313 -196 -204 -223 -529 -239 -215 -278 -15 102 -146 -32 211
2917 211 64 30 226 476 183 366 237 11 244 207 293 180 109 43 83 -107 -257 -210 -288 -338 -405 -238 -17
2940 -17 -515 -231 -129 -188 -48 46 -149 116 -48 104 119 194 179 -41 217 422 188 130 -44 297 -36 271
2962 271 111 -124 -115 -222 -42 -219 -270 -345 -231 -413 -88 -301 -393 -124 -247 -33 131 -32 -111 230 74 271
2984B71k19K61r2P2r8Q7j3o8L0j89J16l23K7J18m4j2j86r7J07j55R1J42M1J62
3008B9k80K66l30K84K19j73N2nJ98m3m8J0P0J24K0l86J45j82J39M9k37mOln5j52
3034b87M0N4j96Q2K40j30r7K33p3P5k06L53p9J23J27L0r7N0j68L01j67J09k59
3057E8q1J3P2j04l23K42L1K8j61m2K68k95L93j63Jk12K18M9O2Q3j43J85l0J06
3081B55l5j29k44N78L9k57Q1Ll44RJ16K9j74o4q9l9n8K55n9J94k74N0l2j87J68
3106b08R6k12K20J34kN0n3J61j52K05qJ12p5k27R2Q2o4m0j86l5K87k15J66k57
3130a29jk15J84J60j24k7M9j8q2M0K18J29j11M2J55j03j69J28J63O1p6j60o8K91
3154C37j22j51q6jM2r6j5lk3k50J65N6j78J02R5J71J0j17p5K22K4j13m6o4J09
$$ plain form
2984 271 52 313 221 293 195 282 269 201 231 42 158 -165 -138 -20 -64 -76 -262 -359 -252 -407 -316 -174 -133 29
3008 29 -251 15 -315 -31 188 15 67 62 260 217 169 179 249 373 393 7 152 -30 109 158 -79 -83 -77 -80 -135 -287
3034 -287 -247 -193 -389 -307 -67 -197 -294 -61 -134 -59 -265 88 9 132 259 289 192 242 74 375 208 317 58
3057 58 -23 -10 62 -42 -365 -123 -92 -64 -225 -267 1 -294 99 -64 -63 -275 -57 -8 54 137 -6 179 149 255
3081 255 220 91 -153 425 464 207 288 291 -53 -44 72 101 -73 -137 -226 -265 -323 -68 -127 67 -207 -157 -189 -376 -208
3106 -208 -112 -324 -104 30 28 78 25 186 34 239 231 343 268 41 133 215 151 111 -75 -110 177 -38 128 -129
3130 -129 -130 -345 -161 -1 -125 -152 -103 -121 -203 -163 55 184 73 115 270 167 -2 126 289 350 274 114 46 337
3154 337 215 64 -22 -23 19 -77 -92 -95 -118 -368 -203 -147 -325 -223 -128 43 53 -64 -139 83 107 -6 -52 -116 -7
3179gL18k88J39P1j09K87j43j22M8j68j51p0K4J3J36q6j40J20k91P3mJ58J18P3
3203aj09q2K57J05m50O63j77j70K40k27K78l5n7oj38LK70k57j75N0j08k6j81k4
3227c57L08j29k9Jr3k3K75q4R8K47q5m24K35L28l01L1L41k56K17j47J41o2P2j54
3251A50J16m2N6k46m5J23l76l9N7K67k24j06L13j89R9%L5j07M72j31k09L3J27
3274A34J63n3qP0j21k83J23J78j77n1P8J64l09J68j16j28K9k69L23j67J26j29
3296b55N0j19J67J06m2o1J58k6J61j3j76K78J06l09K69j85J3m7j19oK6J46n2O8
3320A38j85N7p8j93J8k0M7J00j07j9K18j14K22j68j26J56K83k96M07j53k17J49
3342A19J25r5Q8O3l38J76N9j9k92l1L27k22k02K52j30kj46j2J79K1j01M7j48K83
$$ plain form
3179 -7 311 23 162 233 124 411 268 146 194 26 -125 -195 -171 -158 -22 -108 -248 -128 -419 -346 -350 -192 -74 -1
3203 -1 -110 -192 65 170 -280 383 206 36 276 49 327 292 235 229 91 94 364 107 -68 -18 -126 -152 -333 -357
3227 -357 -49 -178 -207 -206 -299 -322 -47 -131 -33 214 129 -295 -60 268 -33 -2 339 83 300 153 294 232 304 150
3251 150 266 224 280 34 -11 112 -264 -303 -246 21 -203 -309 4 -185 -86 -86 -51 -158 314 183 -26 7 134
3274 134 297 244 236 306 185 -98 25 203 26 -25 53 217 -92 76 -40 -168 -139 -408 -85 -252 -126 -255
3296 -255 -205 -324 -157 -51 -93 -154 4 -22 139 126 -50 228 334 25 294 109 122 75 -44 -50 -24 122 70 138
3320 138 -47 10 -68 -261 -243 -263 -216 -116 -223 -242 -24 -138 84 -84 -210 -54 229 -67 340 187 -30 119
3342 119 244 149 237 300 -38 138 197 178 -114 -145 182 -40 -242 10 -120 -122 -268 -280 -101 -80 -181 -134 -282 1
3366An4Q6k1o8K96j42j07K09R0l6L4k57Q7R1k37n7J01l09M08k79P0J57l12%P8
3391a71J62k14O5j61J83j72L09J82m8R2J77l26jJ88j02j50J09J18j75M8k87J38
3413c6J33J1j43R5p6p1j13J87j14J84l32K2N2k33L66P2j11J6r6M11j02J19j29
3436A12n7R3J03k00j28J66M2L0q8K52k23l76M52m20K27J38l40n3K1K27M9j53K42
3459A16m28lK31j30K15j87K89J2k44K70J23j40p8o6o8K63O3j83m6j82K27%J31
3482A85m31j03K35K5M0j07J89K17p00K57J82r8PJ33J7j50L63k91M3J03K34j52
3504A98k0j0j17l2J98m7j19J14k70L74l55l11L51J3j07jk18J40p2M3L19j16N3
3527Ho1K15Pj18n2K5J21q0L66q0l95R0K37j22n5J21o9r5j62P4M4k58J15j65K03
$$ plain form
3366 1 -53 33 12 -56 240 98 -9 200 290 254 288 31 118 209 -28 -85 16 -293 115 -164 -94 63 -249 -249 -171
3391 -171 -9 -223 -158 -319 -136 -308 1 183 135 227 404 78 77 265 163 13 122 240 65 113 -174 -36
3413 -36 97 108 -35 60 -16 -87 -200 -13 -127 57 -275 -253 -201 -434 -68 4 -107 -91 -187 224 122 241 112
3436 112 55 148 251 51 -77 89 131 161 73 325 102 -274 178 -242 -15 123 -217 -270 -249 -22 27 -126 116
3459 116 -312 -315 -84 -214 1 -186 103 115 -129 141 264 124 46 -20 -88 175 238 55 9 -173 54 54 185
3482 185 -246 -349 -114 -89 -49 -156 33 250 -450 -193 -11 -109 -102 31 48 -102 261 -30 13 116 350 198
3504 198 178 168 51 19 217 170 51 165 -105 269 -86 -397 -46 -33 -140 -141 -359 -219 -291 -248 71 -45 8
3527 8 -53 162 169 51 -1 24 145 65 431 351 -44 46 283 161 106 227 158 63 -99 -25 19 -239 -124 -289 -86
3552h6N6P1j41j99J23J18k0P0K4o5j6O2p1p4L29JQ7j12j01M1J6j24J36j74J17
3577F8J5Ok87k0Q1j89O6J13J03N3j97J91j11j02M46l79r6K68J08K08l69J16o1
3600C1N5j00L63l90J99j92K12o2l4n2l07L15k33K07K7k24L3n9k62L20R6K7j33
3623a63M1J06N7q7J56m0j51J04R7N9j43r5pL81j88k9k16J07qQ2m9k36K59r2L12
3648B57l61J56j35k92K98j34K18r9o2J56L2J23n0J8j10O1j16L30l14J35j22%J36
3671A25R4k22k7J62j60K34j56j18k28K19L0k07M8J8L00j84K52j12K9k00J11l2
3693b4J19k07J58j4J81j54JP2l6q0k3q6K53k42m1J70j62K2K2r9M2R3J86j06j61
3718a16l7M45l45l8ML31j61L4j51K1P4J24j16j23M7j74J71Q7K4kM1m4q2%j41J68
$$ plain form
3552 -86 -30 41 -100 -299 -176 -58 -78 -8 16 -49 -65 -3 -74 -148 181 182 269 157 56 97 113 -11 125 -49 68
3577 68 83 89 -198 -218 -137 -326 -260 -147 -44 9 -188 3 -108 -210 236 -143 -239 29 137 345 -24 92 31
3600 31 86 -14 349 -41 158 -34 178 116 82 30 -277 38 -195 12 39 -185 -152 -211 -473 -153 -57 -30 -163
3623 -163 -122 -16 41 -46 110 70 -81 23 120 179 36 -59 -66 315 127 98 -118 -11 -19 63 14 -222 37 -55 257
3648 257 -104 52 -83 -375 -77 -211 7 -92 -154 2 34 157 107 125 15 76 -40 290 -24 111 -11 -11 125
3671 125 219 -3 -30 132 -28 206 50 -68 -296 -77 -47 -254 -206 -188 112 -72 180 68 97 -103 8 -24
3693 -24 95 -112 46 32 213 59 60 132 96 16 -7 -93 160 -82 -123 47 -115 -93 -71 -170 -128 -35 151 45 -116
3718 -116 -153 292 -53 -91 -87 244 83 117 -34 -13 61 185 69 -54 -7 -181 -10 77 101 99 140 96 14 14 -127 41
3744D1ok16r6K26j93M8k8j20J29J07M9K7q8J76M4l1J69k34J54J1M8j92J56l23
3768a42M36j61l46J39K08J6J7j08j08j6k41K33J67l23K8k03M86P7j78j39l5M31
3790B38l04n2K16Q8k2J85l44J77Rm8j00ko0j30J25J9k43M09k70L04m91J81N3j06
3814a68J46q1J55N1K7k31J38P4K76j88M4l3k04j34QL36M3k00j22J36j96r9j73
3837c95K62J37k3l32M05q8J5Q1j28j92o4M86l48J5J8M2J38j9N1pk35K25M4l0J71
3862B29k17k25J96j13K97j94M7j21j91L61j90j65L04j44K15q4P4k05M3J0J51l81
3884c03J93L22j99J28q7O7j96N5K55o0k00J37l57L91m8j90L51m62O3J18m7J64
3906I5m64K42M9L4M0k35jJ26J81j9k55L15N0q7n0K73nm06L40n8j87j71L43J13
$$ plain form
3744 41 35 -181 -277 -51 -244 -196 -224 -344 -215 -108 -59 -32 -120 56 100 69 238 4 158 169 217 25 181 -142
3768 -142 294 133 -213 -74 134 150 167 59 -49 -65 -306 -73 94 -229 -201 -404 82 159 -19 -158 -193 238
3790 238 -66 -118 98 186 164 349 5 182 191 143 43 41 -19 -149 -24 -5 -248 161 -109 195 -296 -115 -62 -168
3814 -168 -22 -103 52 103 130 -101 37 111 387 199 243 210 6 -128 -120 216 259 59 -63 73 -123 -222 -395
3837 -395 -133 4 -19 -351 54 -34 -19 62 -66 -258 -322 164 -184 -169 -151 -109 29 10 61 54 -181 44 88 58 229
3862 229 12 -213 -17 -130 167 -27 20 -101 -292 69 -121 -286 18 -126 89 5 79 -126 -83 -73 78 -303
3884 -303 -110 212 13 141 54 121 -75 -20 235 175 -25 112 -245 146 98 -92 259 -203 -140 -22 -69 95
3906 95 -369 -127 -78 -44 -4 -239 -240 -114 67 48 -207 108 158 71 21 294 289 -117 223 165 -22 -193 150 263
3930B63p0L8l29J21l75J76O3j2j57K77j36P2J02n2j06O5j1j7K18l2J17k91L70
3953B94j60l9n4J29j26o8J25J70k97Qn7K6R6qp9m2R8Q4j89q2J28j35R4Q3q2J64
3979H1j17j11J37R1J08Kn3q2J39j06j75J61Q1k8l55L12Oq5J29k23N0L3j55J07
4003e3j57N4Q0L8j94O2j9O3J57J16j74j1j66J10J97R4R8j08Pj02j2KR1k17J11
4028F7J70m98K01n7J85j68j96L61j32J3j28r3L05N0k72J96k08m1K84j9r0J84M5
4051A59j54J04p1J69k69L18n1j49n6J00l8K4L5j4j88Mp3N0J36k80L42l89J86Q6
4075a9M4J41j10o8R4j7Q3J75j39k44J54P5k17Q7j23L8r3K05k36M0J78k80K6K41
4099C5j62J47q2L1r6J43k6q7P7P3R2j05j79K6L95j58j61k60M72j22j34l3Q3j70
$$ plain form
3930 263 193 231 -98 23 -352 -176 -113 -125 -282 -5 -141 -69 33 -19 -125 -60 -71 -88 130 98 215 -76 294
3953 294 134 95 41 170 44 -24 101 271 -26 -18 -75 -49 47 39 -40 -82 16 100 -89 -171 -43 -178 -84 -1 -83 81
3979 81 -36 -147 -10 81 189 191 138 56 195 89 -86 75 156 128 -227 85 91 6 135 -88 -38 -5 -160 -53
4003 -53 -210 -156 -76 -38 -232 -170 -189 -126 31 147 -27 -38 -204 -94 103 197 295 187 194 92 80 82 173 -44 67
4028 67 237 -261 -60 -117 68 -100 -296 65 -67 -54 -182 -275 30 80 -192 4 -204 -245 39 20 -70 114 159
4051 159 5 109 38 207 -62 256 205 56 0 100 62 86 121 107 -81 -77 -150 -100 36 -244 98 -291 -105 -19
4075 -19 25 166 56 -12 82 65 148 323 184 -60 94 169 -48 39 -84 -46 -139 66 -170 -130 48 -232 -206 35
4099 35 -127 20 -62 -31 -127 16 -10 -97 -20 53 145 40 -139 -113 282 124 -37 -297 175 53 -81 -114 -31 -201
4123b01K22J09l14L77l66J80J64k63R2k9K8m0j81K63l83N72k91r6J22N7N3k63
4145a88L41j85n5J51k43J96N0J17j33j44J60K4k61P6J14mj70j21N5O2O7n6L5J3
4169i9P0K92k90j72J72J44o6lm4J21j12J08j93K4N2J51r1j01J62r7o6Q2j02J28
4193G0J37j42m24Q3K35J20k23k6K11R6J09j83j11j79L35r4J24q5k07J15p1J34
4215B4k38K24J01j19j3J90j2o0l0k31JJ44j45K35j79K9J32J19l30r6K40q6J86
4238H6l31K09O7m4J03j48N1R3J9n1j43j27K98N2m0j30Q0j62j72M20k69k4J62J04
4262A03l10n3J25q7M5RJ60k01J87K37l24j03J58NQ4k21L6K58K79l19P4m3j15m5
4286f1p0L12J47l68M15n29K10k09r6N7j3j9%N6j88L54K1j80P3R3N2p2j40L10k83
$$ plain form
4123 -201 21 130 -184 193 -173 7 171 -92 0 -29 -1 -41 -222 41 -342 230 -61 -157 -35 22 75 -188
4145 -188 153 -32 -87 64 -179 17 67 184 51 -93 67 91 -170 -94 20 16 -154 -275 -220 -158 -91 -147 -112 -99
4169 -99 -29 263 -27 -199 -27 117 51 48 4 125 13 121 -72 -48 4 155 64 -37 125 28 -38 44 -58 70
4193 70 207 65 -359 -276 -41 79 -144 -170 41 137 246 63 -48 -227 108 14 138 53 -154 -39 -110 24
4215 24 -214 10 111 -8 -21 169 157 97 67 -164 -163 -19 -164 71 -108 -79 53 172 -158 -254 -14 -100 86
4238 86 -245 -36 31 -13 90 -58 -7 86 105 54 -89 -216 82 134 94 -36 44 -118 -290 130 -139 -163 -1 103
4262 103 -207 -260 -135 -222 -177 -168 -8 -209 -22 215 -109 -212 -54 -49 35 -186 -150 108 387 68 142 99 -16 -61
4286 -61 -131 181 328 -40 375 -154 56 -153 -249 -192 -205 -224 -224 -168 -356 -2 19 -161 -88 5 57 -15 -155 155 -128
4311a28j51K05K9K95j20l02K69J6p0j57J91p6N3j42M3R3j99P3j15j91L10K28k1
4334A33j80j90M11l00J34J02mOj88j4j05K82k36M89j84J4Rk8n2j09l6p4M09k58
4358C1k07Q5o9Rj73M28j57KL1N9j68o9L79J06l70K00k64K16p0J5K50l67RJ36k29
4383a87K89k78J94J59r1j62k02K32O4l00J39j37K32R1O3J02j72k43NN5M0K70l21
4406a58J74k02J89l0O4m3J08k2n2R6Q2r1J08k88J94k21L04j49Q9k70j90J37Q7
4429h4j9J32m4kN8k76L11N2l40K98j4o2K31j70K19l14j30K25j03Q4J87l08Q7q3
4453f5L1N2k13J24P5j39j06O5RL71l81J48l9L8k21J95K85j41J04k71J76k7J44
4476B14j20N7j17m7n1J08J25j42K6J13m47K19R8%L0k03rk25K34j11K49p3O0K2
$$ plain form
4311 -128 -279 -74 -45 250 130 -172 97 113 43 -114 77 1 54 -88 -45 48 -151 -78 -193 -384 -74 154 133
4334 133 -47 -237 174 -126 8 110 106 112 -76 -90 -195 87 -149 340 156 170 179 151 99 -10 -46 -120 289 31
4358 31 -176 -91 -160 -151 -324 104 -53 -51 -20 39 -129 -198 181 287 -83 117 -147 69 -1 14 264 -103 -94 42 -187
4383 -187 102 -176 18 177 86 -76 -278 -46 18 -282 -143 -280 -48 43 106 208 36 -207 -202 -147 -107 163 -158
4406 -158 16 -186 3 -27 37 -6 102 80 28 124 206 115 223 -65 129 -92 212 63 152 -118 -308 -171 -84
4429 -84 -103 29 -15 -17 41 -235 76 128 -212 86 72 10 241 71 290 -24 -154 71 -32 52 239 -69 18 -65
4453 -65 -34 18 -195 -71 4 -135 -241 -176 -167 204 -177 -29 -68 -30 -251 -56 229 88 192 -79 97 70 214
4476 214 94 151 34 -13 -64 44 169 27 53 166 -281 -62 36 36 66 -137 -146 -371 -137 -248 1 -72 -12 10
4500A0M6K52l91K9p8L9L47p8j52K4j20J83j74J38j30Q2L8R6P2j72k6q8J79k96
4524a70J72l5O9L8j0O7m18L47J41k16O8n0RJ11j05J39k99L12l46j4J25L1r8K79
4548A47j86j5pL1J59k42j1J28J0k65L33l57K5K69k00K18o3N9O3K5j00O1M1j23
4572@o6m1K27n8j77L5K49j97J00k90J54J84j40M2k06p4L33q1J21l67M18k47J11
4595C0r9K4J34n8p7J61k76K23q6K6j38J28K45j75r4j35L0J92p9NN5l2o9k30K50
4620d5K04q1j6on1pl1O9k72L78k20J23j20jJ98O5l03J76J03k36k2m6J04J49k37
4645a25J75l0K37q7j02q0l0K01j59k04J52M6J1m4j07J66K26j50r0k49J35J90M9
4668A31j00L2P3j76O9R1K06l67m7qJ02j93J7J62Rm6j02K14m0j17P0K40j91j77
$$ plain form
4500 10 56 308 -83 -54 -132 -93 254 176 24 48 -72 111 -63 75 -55 27 65 161 233 61 35 -53 126 -170
4524 -170 2 -33 36 74 64 131 -287 60 201 -15 53 3 12 123 18 157 -142 170 -176 -190 -65 -34 -132 147
4548 147 -39 -54 -61 -30 129 -113 -124 4 14 -251 82 -275 -250 19 -181 37 -26 33 96 121 21 82 123 0
4572 0 -66 -107 120 62 -115 -80 169 -28 72 -218 -64 120 -20 22 -184 -258 75 -6 115 -252 166 -81 30
4595 30 -69 -45 89 31 -46 115 -161 62 -24 2 -136 -8 237 62 -32 -167 -137 55 -24 -19 36 4 -65 -295 -45
4620 -45 159 78 62 56 5 -2 -33 36 -236 142 -78 45 -75 -76 122 187 -116 60 163 -73 -95 -141 -37 112 -125
4645 -125 50 20 257 170 68 -12 -42 159 0 -204 -52 -6 5 -39 -146 20 246 96 6 -243 -108 82 131
4668 131 31 63 136 -40 29 120 326 -41 -88 -96 6 -187 -170 -8 1 -45 -147 67 27 -90 -20 220 29 -148
4692a48K98j57pJ52r9k0j4q3K8K73j30k31L66k17Q4M6j52J34r6LJ2N2p7R0p2j90
4718a55K35k81J77R6k93N2K51J16l24K11j76K7j69k0K43J28rp4q6l0K69p1M4k84
4742a23Q2K83o9M0j21kLj0j68J02r8P4N1l10J35J4K55j90J76j77K91j61p6k4J55
4767A32j92l0J97NO9l95K08O0N2r4j15Q0n9j80K99j07L15m32K25k32K42L25l36
4790C7j84Q2M4o3J76K5r2k57K45K5lR6jN9j33k0l5P4k57M19j50k0K5k69O1R5m4
4817f5j9J29p3k26P1J70q4j45J32l1MK42r1q0K72k10K69J1k25j93J17kK64j38
4841I9N1k53r7K97j04P0j16p4P4j29M7J45J54k26o4L74k00J33k61J86r0r5k6l7
4865a42R5N5j42J81K45j91p8M5N7j67M4k86N03l40%PJ99J9J8p0N5j4o2K33l96
$$ plain form
4692 -148 150 -7 -14 138 39 19 5 -78 -50 223 93 -138 228 11 95 141 -11 123 27 30 42 94 17 107 35 -155
4718 -155 80 -201 -24 72 -221 -169 82 198 -126 85 -91 -64 -233 -253 -10 118 109 35 -51 -81 188 117 161 -123
4742 -123 -41 242 173 213 92 90 93 83 -85 17 -81 -7 44 -266 -131 -117 138 -52 124 -53 238 77 1 -23 132
4767 132 -60 -90 107 112 181 -214 -6 54 106 12 -103 -23 -82 -262 37 -70 245 -187 38 -194 48 373 37
4790 37 -147 -65 -21 -84 92 117 25 -232 13 38 35 131 130 189 56 36 1 75 -182 237 87 67 92 -177 -116 -21 -65
4817 -65 -84 45 -28 -254 -183 -13 -97 -242 -110 -141 -137 105 14 -66 206 -4 265 276 51 -142 -25 -27 237 99
4841 99 150 -103 -200 97 -7 63 -53 -127 -53 -182 -135 10 164 -62 -126 248 48 181 -80 106 16 -79 -105 -142
4865 -142 -47 8 -134 47 292 101 23 68 125 -42 2 -284 219 -121 -121 -114 85 104 122 52 107 93 31 264 -132
4890a32K30J03j37m8OR3j06k63J61n9K55j52J53j40m7J14L7k13K18j46J35k99
4912b37J94j9J43j76P6n3O2K70j68p3n0L20l28K87m78j9J24LJ09J02j00K05j88
4935FQ8Kj54J6oj03j0J11m0o7j1M9j48L6J55j53K81O2n8l34K34J03j74L55k33
4960Gn6l6J95q8J00m0K5p9Pj0J75l20P7p5P6l5j08K2K39k32j1K61j59J87j71j84
4986b33Q4K13p3l0J02j57J89k7p9N6j04j08K51l0J04r5m11K48j88L82j83J91R1
5009A93m04M76q3j49m0K9J05j24j58J92k85L22m2R9q0j23O5j36J11J12L9j48O5
5032C6k40K51N8j86L15m99K6J76l4J52j7k7J80L4l16K51K8m00K0K02k0m1n5J73
5056F7mK2k62J89J35r1j50k55N10j41m3pJ36j00J84l66J63j45R1K82m50K30n7
$$ plain form
4890 -132 98 201 64 16 22 115 9 -254 -93 -152 103 -49 104 -36 -83 31 68 -145 73 -73 62 -237
4912 -237 -43 -62 81 -95 -19 -72 -10 260 92 19 -31 289 -39 248 -230 -249 -125 -122 -13 89 -11 194 6
4935 6 94 96 -58 -42 -48 -151 -161 -50 -90 -157 -168 -119 -267 -231 -76 -229 52 114 56 -278 -44 59 -115 240 7
4960 7 -49 -85 110 22 122 82 107 28 35 25 200 -120 -43 -118 -42 -77 -185 -163 76 -156 -167 94 -65 122 -49 -233
4986 -233 -149 64 -9 -39 63 -94 95 68 -11 45 -59 -167 84 54 158 63 -348 -100 -288 94 -89 102 193
5009 193 -211 265 182 33 -7 22 127 3 -155 37 -248 74 32 131 51 -72 -7 -143 -32 80 119 -29 36
5032 36 -204 47 105 -81 234 -265 -239 -63 -97 55 38 11 191 225 -91 160 188 -212 -192 10 -10 -51 -106 67
5056 67 63 85 -177 12 147 56 -94 -349 161 20 -23 -30 106 6 190 -176 -13 -158 -67 215 -235 -5 -62
5079f2j35L68l09n5L21k88K80j50J06q3J96p9k83J90J18P2k50K73j44m34K75J92
5101A19L3k43J64j03j00J40l6Q8k20P5JK35j36q1j24J31n0K62j50n7K64l81R3
5124g6J38%j16K67k87j4RJ11l0K55k05k34K58j02j61J41n4OP9J79q2k34K28l09
5148b33J71K60j77J47l57L87j33m48N30k44J29N0Oj40N6R7l06K65k7j57O2J74
5170A12k82l07M05J05l10N70l01q5O6J71j49J28k41K26n2j16R6K8l15J70K81p9
5192A21l37J90R4j45J71J15k73k37L78k34k11M51j5k56J95l1L0j20J53j04K47
5213A82k72K67k55J33J99l81P9L4J42j98j24K82J70r5k56JR9j02j55K30Q3n5L7
5236D5j72J70Mj59K07j49J22k8o1J33Q9o0Q6q2o7j20J08m1j60r5J27N6j01K10
$$ plain form
5079 -62 -197 171 -138 -193 128 -160 120 -30 76 -7 189 110 -173 17 135 207 -43 230 86 -348 -73 119
5101 119 152 -91 73 -30 -130 10 -26 62 -158 -83 -82 153 17 -64 -188 -57 -107 155 5 -52 212 -169 -76
5124 -76 62 62 -54 213 -74 -88 -79 32 2 257 52 -182 76 -26 -187 -46 -100 -94 -15 164 82 -152 76 -233
5148 -233 -62 198 21 168 -189 198 65 -383 147 -97 32 82 88 -52 4 101 -205 60 33 -124 -62 112
5170 112 -170 -477 -72 33 -277 293 -8 -93 -27 144 -5 123 -118 108 56 -60 36 64 -251 -81 200 121
5192 121 -216 -26 68 -77 94 209 -64 -301 77 -157 -368 83 68 -188 7 -24 6 -114 39 -65 182
5213 182 -90 177 -78 55 254 -127 -48 -14 128 -70 -194 88 258 163 -93 -92 7 -95 -250 -20 63 8 45
5236 45 -127 43 47 -112 95 -54 68 40 -21 112 201 141 227 145 78 -42 66 25 -135 -230 -103 -47 -148 62
5260F2K1k37J47R0j12J68k13K17L4Q8l96K78K0k9k14J81j71j43M28k16K2J33k24
5283f6j43J33O3L77k10k1J66k76L1ll0Q4K1q2j60p7L04k15j62N38k99R9j1j25
5307f4M81m09k16L40J61l12R6P7j63Q3k76J31K83j12j52L5R8j63L4N2k1J55m57
5330c19M81r6J68l11J65j47m5J7J43K8j76J44r6j4K64j32k09j0J36R0M6n8k08
5353a39J76Q2k14M32l97j93K92j00j26L47K9k08k3m1Q5l05K54mk58L23J47l38
5375a79K86J00p6L6k39j72K4K29J5J66l80J83k4o5L4O7K90l54j79K48N0l07J67
5398h0k75M90ll0Q6n3k58J60q3L4J46Q9k15J70j20l04K35p1M4K5p4K72k83N2J45
5423I9m11L53j60J17o8l4J19J16j50j49J33j37jN9J47j5k35K14J75j05j25r0P9
$$ plain form
5260 62 83 -154 -7 83 -29 139 -74 143 177 265 -131 147 167 138 -76 105 -66 -209 219 3 25 158 -66
5283 -66 -209 -76 -13 364 154 133 299 23 54 51 21 105 126 44 -116 -193 111 -104 -266 272 -27 72 61 -64
5307 -64 417 8 -208 132 293 -19 77 154 -9 74 -202 -71 212 100 -52 -17 81 -82 -48 4 -17 138 -319
5330 -319 162 66 234 -77 88 -59 -104 -87 56 84 -92 52 -44 -58 206 74 -135 -145 -9 81 127 69 -139
5353 -139 37 119 -95 337 -60 -253 39 -61 -187 160 189 -19 -42 -83 2 -303 -49 -53 -311 12 159 -179
5375 -179 107 207 131 167 -72 -244 -220 9 24 190 -190 -7 -31 -96 -62 5 295 -59 -238 10 60 -247 -80
5398 -80 -355 135 132 102 188 135 -123 37 -46 -12 134 223 8 178 58 -246 -11 -82 -38 -13 -87 185 -98 -46 99
5423 99 -312 41 -119 -2 -70 -104 15 131 -19 -168 -35 -172 -173 -114 33 18 -217 -3 172 67 -58 -148 -69
5446f9K02l04J89Q3K1p0j25R0j43R7N7K7j34K73j46l57L40m6m8p4j5J88J5L1l55
5471b73L22j31K59j7k90K28j13P7p0O7O3O2k08K2Oj2l8j84J02Q3P6l47K14j06
5495b08K25n0O6N1j66J21j20q3J27J19j8k13J5K83J61j31k86J38J62M3J8j38N5
5518A71k29J78L2j40j05K20Qj92j1J69p0K65k18k4j99k9O30m99K9Q4m4k5q5J32
5542D8j87K83j35NJ24j6m0j27L49n0j49p0j94J40j85L0K40m5m2r9M1K45j82p7
5566i3j85L55r1j79K85K7L8k69P4m7J6J84M6j20j04O3j57J69j4k5Q4k10K12j82
5590a23K10j7q6j20L2L00l25K76l94K25J9qK4j68M0j68L52q4l7K34k4k47J91n1
5614E1O1j98M4J41k49K15j08l3m0J46o7k0J9k0l9K17k75N5J66l4k1q1J71j33P7
$$ plain form
5446 -69 133 -171 18 101 122 52 -73 17 -126 -29 28 55 -79 194 48 -309 31 -15 -63 -137 -152 36 51 82 -273
5471 -273 49 -82 177 160 -130 98 -15 62 -8 59 122 184 -24 -2 4 -8 -46 -230 -128 -45 31 -316 -102 -208
5495 -208 17 -33 33 84 -82 39 -81 -164 -37 82 64 -149 -134 149 310 179 -107 31 193 236 254 116 171
5518 171 -58 120 152 12 -93 127 135 -57 -68 101 31 296 78 54 -145 -174 456 -43 -14 70 26 1 -84 48
5542 48 -139 144 9 14 138 122 82 -45 304 254 105 35 -159 -19 -204 -174 66 21 -21 -120 -79 166 -16 -93
5566 -93 -278 77 -14 -193 92 119 157 -112 -38 -85 -69 115 161 41 -63 0 -157 12 -2 -27 57 -153 59 -123
5590 -123 87 70 -16 -136 -104 196 -129 147 -247 -22 -3 -11 13 -155 -115 -283 69 -15 -52 182 158 -89 102 51
5614 51 112 -86 -42 99 -150 65 -43 -76 -116 30 -37 -57 -38 -58 -97 120 -155 -100 66 32 11 -70 101 -32 45
5639D5%Jl9m4J29n8J13r2k7j09n4j64K29L63k02j89J63K46l36m5K41k22M6J6Q7
5664I8j01Q3j35m3K27k38m9N38m96K09k08K32k79J03L68k98N8j13K90m70M62m42
5686b04J49M2P4k5nl4Lqj25J79J26j26k00L20j95K27j24J24o1k26J86l61M83j55
5710F4k45K62Q5j13j39M3O4j84J36K37l48J13K22j20l2k18K06J93k97J28R1k7
5732A21j20L0J33o2n6k36L66k05J82R1j77J9j45n5l3N7R9K8O2J98p05M11j85J30
5756e2j32J94J7j26R8m6o1L07l54J44r1M3J22Q8m25M63k54r9P8J01K31k85K95
5779B56j32K2j71J87j13J78j37l1j36M8l8L36l90QJ34ML9n67L55p6KK72Q6k10
5803g4OJ32Q3j03M6l6k5R7j58n7K15m85M87k82N8J10k27K15N5j02O0Q3n2k66L12
$$ plain form
5639 45 45 46 7 -37 92 34 147 55 28 -81 -135 -299 -70 293 91 -98 65 311 -25 -70 171 -51 -5 11 98
5664 98 -3 80 -55 -98 129 -109 -158 380 -116 93 -115 117 -162 -59 309 11 69 -44 246 -224 238 -204
5686 -204 -55 -13 61 36 31 -3 0 -8 -133 46 172 46 -154 166 -29 198 74 198 137 -89 97 -264 219 64
5710 64 -181 81 166 53 -86 -43 21 -163 -27 210 -138 -25 197 77 45 -173 33 226 -71 57 148 121
5732 121 1 31 164 102 46 -190 176 -29 153 244 67 86 -59 -114 -147 -90 9 37 99 297 -408 3 -182 -52
5756 -52 -184 10 27 -99 -1 -47 -108 199 -155 -11 -102 -59 63 151 -274 189 -65 -164 -86 15 246 -39 256
5779 256 124 146 -25 162 49 227 90 59 -77 -29 -67 269 -121 -113 21 25 64 -503 -148 -224 -222 50 136 -74
5803 -74 -68 64 147 44 90 54 29 126 -32 -89 126 -359 128 -154 -96 14 -213 2 57 -45 15 98 46 -220 92
5828I2j08j72K22k22J54p7K57J83l09J12j42Pj92L42j04Kj06J10K9n4J76k37K00
5851A63j5L9j88j46K11N7j90j45J83J70k64K67k18K94l63Q2K52p9k17O7J31j55
5873f4J5L06k71%j85K06j69K04J63l50M2r0M67m37J88n4J17q5J22m7Pk28K3J86
5897F6j74j8J66j82R3k99M33j38n4J0J82J65k38J65k57J74R6j79J94N5m36J25
5919e1q8R9R2J7j86N8M1P2k52J67R4j2lJ61k01j18Q3j00L92k08r8J76l6k91K06
5944A4J64l01J77j03nn5J63l7j08R7j04K0L24l45Q0J84j98N0m8J07m2K60l76j24
5968b06J09o4K37m0J05l1o3J08j97J57p6K3j90N15m41j63J4L91j72mK6j7k0K98
5992B99j76l8q9J17j46K76l50j17R9K75l47J08P5J05p9M9Q4o5j51m8L10o0k64
$$ plain form
5828 92 -16 -188 34 -188 -34 -111 146 329 20 132 -10 -3 -195 147 43 45 -61 49 78 24 200 -37 163
5851 163 148 187 -1 -147 64 121 -69 -214 -31 139 -125 142 -76 218 -145 -63 189 110 -107 -40 91 -64
5873 -64 -49 257 -14 -14 -199 7 -162 42 205 -145 -103 -193 274 -163 25 -29 88 3 125 78 85 -143 -120 66
5897 66 -108 -126 40 -142 -49 -348 85 -53 -107 -97 85 250 12 177 -80 94 190 11 205 260 -176 -51
5919 -51 -139 -40 52 69 -117 -59 -18 54 -198 -31 63 51 48 209 8 -110 -27 -127 265 57 -41 135 99 -192 14
5944 14 178 -123 54 -49 -54 -109 54 17 -91 6 -98 -78 246 -99 -19 165 -33 17 -31 76 34 294 -82 -206
5968 -206 -97 -161 76 36 141 110 47 155 -42 115 39 62 -128 387 -54 -217 -203 188 16 12 38 21 1 299
5992 299 123 85 -4 113 -33 243 -107 -224 -125 150 -197 -89 -14 91 12 61 145 80 -71 -119 191 131 -133
6015a33k00K54O2O9K33j38j66p1J65Q2k43qO8J14j11k2J01q0k17M03j78R4k87
6038b09J34l00K74K10O9m68K01P1j20J46o7Q7j21P3Q7j61j18J66j34L16l1L1k83
6061a47P5or2K98j40J17j55J65k57N9K11j6Q5j30J29p4j17K42j50n6K2M3r6L2
6085D2k81J04K05j20K34j72J3J28l6j48J33j76L2n9K27m15J75L08q8k1j66L17
6107B36l10p9K59j28p3j9J89j48K11k03J12p7j03L55m48Q6O8L8K98l40j27L44
6129A41k36P1K45j52k54K67R7k5j71N8o9J32k2O6n3P9j20j26Q5j36K7q4K32R1
6153A43j73qqJ84j95L7k16K75j12K68l81J76j61k3K74M1j00R6J22k13Q7j76P6
6176A3K1Q6j81l14L60J66k40J7K02L7l72N55j66j77n9J24k42K67l56Q1J09K33
$$ plain form
6015 -133 -333 -79 -17 52 285 147 -19 -90 75 157 -86 -94 -26 88 -23 -45 56 -24 -241 162 -16 78 -209
6038 -209 -75 -375 -101 109 178 -290 -89 -18 -138 8 -59 28 -93 -20 67 -94 -212 -46 -180 136 105 136 -147
6061 -147 -72 -78 -170 128 -12 105 -50 115 -142 -83 128 112 197 67 196 122 5 247 97 41 63 106 10 42
6085 42 -239 -135 70 -50 184 12 25 153 117 -31 102 -74 -42 -101 126 -289 -114 194 106 85 -81 236
6107 236 -74 -153 106 -22 -95 -114 75 -73 138 -65 47 -30 -133 222 -226 -140 -72 -34 264 -76 -203 141
6129 141 -95 -24 221 69 -185 82 179 154 -17 41 -28 104 82 148 95 174 54 -72 13 -123 -96 -180 52 143
6153 143 -30 -38 -46 138 -57 -20 -236 39 -73 195 -186 -10 -171 -194 80 121 21 117 239 26 113 -63 13
6176 13 34 120 -61 -375 -15 151 -89 -72 130 167 -205 350 184 7 -52 72 -170 97 -259 -178 -69 164
6198A64j61J00J0k56N7n8J70J1Q1n8m7P4P5l37P4o3K95k79L08j80j13Q8K66k63
6222d2k64M46j52J8J00K8j82j09K10opR2j85q5K30J74k86J5k31K12M5n0O6j7k37
6247b17K15j86K36k42o6M23j69K43l17K15r6j31K32l2j97l3K08n1n1K46k53L10
6269B87m03J37n3m61O33Q5k54K0n8K64k52L31j58j89J58j68J05P2o6j19K51j85
6291b3N6O0j19j4J04m30L25P9p5P5LK91j93j86R6q6O3J33j8o1R2j06kp4J03j80
6317h7o1K8J66k08N5K15l0k4k8K68m2k97O7q5O5r0R1pQ1jj85J34K1k53O8k8J42
6344b5K76k85J43q8K10j67Pj13j05jj66J54K63j76O3J06L34l81N4r4J05l22L49
6367A41Nk01l8L48k21k83K73p8m1R6r9P5M4m6j41M0P5K02j85r5Nj89N20k43K42
$$ plain form
6198 164 3 103 113 -143 -86 -144 26 37 118 60 13 87 162 -175 -101 -164 131 -148 160 -20 -133 -45 221 -42
6222 -42 -306 140 -12 6 106 134 -48 -157 53 47 40 132 -53 -138 92 266 -20 -5 -236 -24 21 -29 37 20 -217
6247 -217 -2 -188 48 -194 -260 163 -6 237 -80 135 39 -92 140 108 -89 -122 86 35 -16 230 -23 287
6269 287 -116 21 -32 -493 140 225 -29 -9 -67 197 -55 276 118 -71 87 -81 24 96 30 -89 162 -23
6291 -23 33 93 -26 -40 64 -366 -41 38 -37 38 41 332 139 -47 49 -37 26 159 141 80 172 66 64 -10 93 -87
6317 -87 -148 -120 46 -162 -107 108 78 54 26 294 252 -45 22 -63 2 -88 3 -4 77 76 -109 25 46 -207 -139 -167 -25
6344 -25 251 -34 109 21 231 64 71 -42 -147 -148 -314 -160 103 -73 -10 96 430 49 103 9 114 -208 141
6367 141 146 -55 -93 255 34 -249 24 -54 -95 1 -98 -23 21 -25 -166 -126 -51 151 -34 -129 -124 -313 207 -36 206
6392B06j53k31L0L20l05J34m6J41j77J66j0k10p1K25K47m76J22r5N1K1J12K23
6414B24k63rL1K67l22J8P2M6j4N8j9q2Q4p9K58l91l0L21k65J87k50K14k20J02
6438f2Q1l9q4L7J26k34K66ok82J88J9m8K95l0j91O8L9l2J4j13j55J18J54k79M13
6463B63j55k52L02k61L88m79J77O1J10ok59K46r2l8R7j18J18j84K14j9j76P7j11
6486i7J46M3M1l6j20J7p0J46J14j93K60j72k79K56k30L56O0k12j69n0K74N0k06
6509g1J80l64K94m4R2J58k68J1Ok13L12K04l70M0j6J97n75O83k6k24K0K46l89
6532a17J14J78j65J39N5m04K90J12n29J88N5J6J11J9J5k13k14M47j48L80m74J45
6554@K6k05K29j66J70q8K2J53j72p1M5mO7J8p8q7o4J87l7K54l71J12j2P0k40L08
$$ plain form
6392 206 53 -178 -148 172 -133 1 -45 96 -81 85 75 -135 -206 19 266 -210 -88 -183 -132 -111 1 224
6414 224 -39 -48 -17 250 -72 -54 18 64 50 108 89 7 91 12 270 -121 -151 170 -95 92 -158 56 -164 -62
6438 -62 19 -20 -104 -67 59 -175 91 85 -197 -9 10 -38 257 227 36 104 143 111 125 12 -143 -25 129 -150 263
6463 263 108 -144 158 -103 285 -194 -17 44 154 148 -111 135 43 5 102 -16 102 -82 132 113 -63 14 -97
6486 -97 49 92 133 97 -23 -6 -76 70 184 -9 251 79 -200 56 -174 182 242 30 -139 -189 85 135 -71
6509 -71 109 -255 39 -5 87 245 -23 -12 -6 -219 93 297 -73 -33 -49 148 -427 256 230 6 26 272 -117
6532 -117 -3 175 10 149 204 -200 90 202 -327 -139 -84 -68 43 62 77 -136 -350 97 -51 329 -145 0
6554 0 26 -179 50 -116 54 -34 -12 141 -31 -102 -57 -61 6 24 -54 -141 -205 -18 -55 199 -172 -60 -72 -2 -242 66
6580F6M5k20p6J50r3J33n2L1R9J16m08L96k73K14j25R5n9R2m41M39Qj18k66J37
6604a10J96j71k5k8k0L06K3l17K20k79K80m3K00k30J7k0R9j81O0K6P7j30J24k7
6628D7P1p1j37J97j46L1J71j13j32k4k6M7J86j47L1p2J57p3J4r8n2J24R6j01j2
6653c2KR6r5o8K59l27P7J20NQ3N4J4K1k78L73l64j40K34K04k86K6q8l0O4j3K16
6679A27k74K28q6k10L21J7n0K7L1K4j23J8l1n0M8J16j07M1n8%QQ9N5j14j23J51
6705G5j2l47L47k28K56J2j89K02k4L0j0j17l5L10l44J03P9o5N5j34O0q0J8J58
6729A20j16j83K95k16Q8k9R9o5j4J97k00N9l12O03l72K8O5p4J37k64K55j53L27
6752B75l82J63r5j16J86l4J24K8k55J76N9j76k8P8L6j70K92j7k12j49R1K16k7
$$ plain form
6580 66 111 -109 -185 -35 -128 5 -47 -16 83 199 -209 187 -86 128 3 98 39 131 -310 129 137 19 -247 -110
6604 -110 86 -85 -110 -138 -158 148 171 -146 74 -205 75 32 232 2 19 -1 98 -83 -23 3 80 -50 74 47
6628 47 118 47 -90 107 -39 -8 163 50 -82 -106 -132 -85 101 -46 -15 -87 70 -3 11 -87 -139 -15 81 -20 -32
6653 -32 -30 66 -29 -97 162 -165 -88 32 37 120 174 188 209 -69 304 -60 -200 34 238 -48 -22 -110 -140 -76 -89 127
6679 127 -147 81 -5 -215 106 123 73 100 131 155 32 50 19 -31 17 133 26 67 9 9 17 106 161 47 -76 75
6705 75 63 -284 63 -165 91 103 -86 116 92 122 112 -5 -40 270 -74 29 108 43 98 -36 24 -56 -38 120
6729 120 4 -179 116 -100 -12 -41 58 -7 -21 176 -24 35 -277 326 -46 -18 47 -27 110 -154 101 -52 275
6752 275 -107 56 -39 -155 31 -3 121 149 -106 70 129 -47 -75 3 39 -131 161 144 -68 -217 -126 90 63
6775F3l01L67oq9k26L67k94K30j32J5J50kk65k5L10j95K85m21L93j62j08j23R1
6798g8j1K58j38KM5o9m8J09k6J21l8j18n4J51n4l04j04M42j77J71J18j65n5j78
6822b00L23j38K26k31m5M4J18M2L8m5l3j79L01l80J14J18j8j32k0P0N0j72J49
6845@j59M9K26k0K5q3L9l8L1q4Q7j35J0J30k8j07l0l3L56j57J09l38O1nj6O0p3
6872a23R0N5l3j77K38jk14J33j5M2K9J29nk76P0q5J86n4k4J03M7o3K0N3j53K04
6898A76Ml20L3%L50k02K07k22k78M94k97K57o8k52jJ13m6J10J06k80K47k32j08
6921b09r2M33rq7j11JJ51R2m57K09J7J15lk4N1k44J72R9l85M68J08k31j35O0M21
6946D10k83j81J58j48J02NJ53k95J23L3j9r9R1K31l02J68O2l13Q8O8Nj77L23j53
$$ plain form
6775 63 -238 129 123 34 -192 175 -119 111 -21 -6 144 142 -123 -148 162 -33 252 -169 224 62 -46 -169 -78
6798 -78 -89 169 31 33 78 9 -39 70 44 165 127 9 -45 106 52 -252 -356 86 -91 80 198 33 -22 -200
6822 -200 123 -15 211 -20 -65 -21 97 139 177 132 99 -80 221 -159 -45 73 55 -77 -97 -27 23 -149 0
6845 0 -159 -110 116 96 121 38 77 39 70 -14 73 -62 -52 78 50 -57 -87 -120 236 79 188 -150 -89 -94 -110 -50 -123
6872 -123 -33 22 -11 -188 50 49 -165 -32 -47 -5 24 153 148 -128 -58 -143 43 -11 -35 68 115 52 72 125 -28 176
6898 176 180 -140 -107 -107 243 41 248 26 -252 242 -55 202 134 -118 -119 -6 -52 58 164 -116 131 -101 -209
6921 -209 -301 132 123 36 -75 -74 77 169 -288 -79 -62 53 50 26 77 -167 5 104 -281 187 295 64 -71 -11 410
6946 410 127 -54 104 -44 58 63 216 -79 44 77 58 -41 50 281 -21 147 209 -104 -16 52 57 -120 203 50
6970E0N6j27Q7j37R9L6k28L46k02j18J61L39l77o9m1K7J73k19J63J55l08R8Q0
6993D4J01l79M32k86k9N4o0M67m87N0J4j44K10R5k8J9J90l75Q3r8K16q8R9J27
7017B27k7j88k4j05k9Q1J74m9P1m67N00k59K47l2k61K90l38L87j87L6o2Ql4J26
7041H5K0k82J51J50j83N0J16Q9j59P2j46M1J31j02l7Q0J41k78QJ86q5J8n5p5J1
7066e3P2K33j07j34M0L6L37m95o4P6J88r3P8k65K19R4K57m30K3k93J02M4K16k34
7090a53K56o7k0k21K99k19O2J11k90K71l0K06j23j89L58j32j89N0M46m18K97k77
7112B8O5o1j7J36l38J71R8O4k51K35l9k78J86O9q8J53n3N3j48J78j43oj67J61
7136Hr5L42j21k07R9j4r0qJ54l9j16J4K5M8j9%J13k01K12m55L12O3j76J60m9k10
$$ plain form
6970 50 106 -21 66 -71 28 64 -164 182 -20 -138 23 362 -15 -84 -125 -98 75 -144 19 174 -134 -36 44
6993 44 145 -234 198 -88 -117 -63 -123 344 -143 -93 -79 -223 -13 82 54 73 263 -112 -29 -127 89 1 100 227
7017 227 200 12 -12 -117 -146 -65 109 60 131 -336 164 -95 152 120 -141 149 -189 198 11 47 -15 -7 -41 85
7041 85 105 -177 -26 124 -59 -9 107 196 37 109 -37 4 135 33 -4 76 217 -61 -53 133 48 66 11 -64 -53
7066 -53 19 252 145 11 51 87 424 -71 -135 -59 129 36 114 -151 68 162 419 -11 12 -281 -179 -135 81 -153
7090 -153 103 36 16 -205 94 -125 -63 48 -242 29 -1 205 82 -107 251 119 -70 -20 426 8 305 28
7112 28 93 32 15 151 -187 -16 82 146 -105 130 91 -187 -1 68 -20 133 80 133 -15 163 20 14 -153 8
7136 8 -87 255 134 -73 26 12 -78 -86 68 29 -87 -73 -48 0 -19 -19 94 -107 105 -350 -38 25 -151 9 -40 -250
7162b50N49m30L50m15J93J62j46M0L0j7j44r2K10j4j37O1J37j08Q7J93l35L3J04
7185F1L1r1j45K55k9j64J03j56J52r9J28J50k49P0o6J30p6j62L28j95n2K30j64
7208a0J3M7m4L3n3q0L8r3M8J12M8J64k47q7K71k06K22k86N0J23K07j78L0l3P6
7233A65l47J28Q8k3o5J44m9J9M3o0q2J03j83J34k6m6k7j93J15M7J70J26k11l9
7257f9J97j10P0j02J08p9k20L37j15J71Q6m46j3L05j25l3L5J37J00k0j40k99L69
7280A44k35L89j49j76K0K21j73Nj27M1o3J42l17L8K89J08l7j53K24k93J72L59
7302D29l97k4J19j50q1jJ77l1J16j23J47n38K59M1nm2O4Q3j16J89j54M7PJ06L
7327A25j65K3j81K74k7k39K61k64Q8J82j28R9k4j41J28j11K03j74Q2m7k15M39
$$ plain form
7162 -250 299 -131 219 -196 -3 159 13 53 83 66 -78 -170 40 26 -111 -50 87 -21 66 259 -76 -43 61
7185 61 92 1 -144 111 82 -82 21 -135 17 -82 46 196 -53 17 -49 81 5 -157 171 -24 -76 154 -10
7208 -10 3 50 6 39 -14 -94 -56 -149 -101 11 59 223 -24 -111 160 -46 176 -110 -60 63 270 92 122 89 165
7233 165 -182 -54 34 11 -54 90 41 60 103 43 -39 64 -119 15 -11 -57 -84 -277 -162 -115 55 181 -30 -69
7257 -69 128 18 88 -14 94 15 -205 132 17 188 274 -172 -185 120 -5 -38 -3 134 234 214 74 -225 144
7280 144 -91 298 149 -27 -7 214 41 46 -81 -40 -103 39 -278 -240 49 157 120 -33 191 -102 70 429
7302 429 32 8 127 -23 -104 -105 72 41 157 34 181 -357 -98 -57 -62 -104 -40 43 -73 116 -38 9 16 122 125
7327 125 -40 -17 -198 76 49 -190 71 -193 -105 77 -51 48 24 -117 11 -100 103 -71 11 -36 -251 188
7349A88l93M56p9k11K10p6J4k35J11J83l8k12N48m90o6R2K03q2j14j33J4K10m69
7372c69L41J95j65Q7l64K28R1j19P2J61n5o1k29J86j16p7K06j90K89O4J29l29
7394b5J52k23J11J7n5k14J29K44p6K71m31Q4o3J07j36n1J61J34j22P1k59J2L00
7417A38k02J74k08K33k1k01K16k06L7Q1Q1qj23R6Kj14o4P0j40L47j60l2q3LJ17
7442C3r7pK63j49j27J28J84k19J03P8l65K60J9k0o0O2Q2j53J29k1j41P4j56n1
7466a51oK9m2J34J78r1j6j03L4l6J28J21j05k42p8M24j46p5Q6J21k23lJ50j07
7490a9L1k02J72J94l01J45j14J12m8J24m7n0j30KL33l94J37K32j26n7l6l3r1p
7514a73K08J11j96rJ83l26K32R9m37K75PJ5M7M2lJ10j84j36K75j12k1J12o3O7
$$ plain form
7349 188 -205 251 172 -39 171 95 109 -126 -15 168 130 -82 466 -24 -90 2 205 123 9 -124 -110 100 -369
7372 -369 -28 167 2 89 -275 -47 44 -75 -3 158 103 42 -187 -1 -117 -194 12 -178 111 175 304 -25
7394 -25 127 -96 15 32 -23 -237 -108 136 60 331 -100 -16 -79 28 -108 -159 2 136 14 85 -174 -162 138
7417 138 -64 110 -98 135 114 -87 129 -77 -40 41 122 114 -9 87 89 -25 -89 -19 -159 188 28 -4 -87 -84 33
7442 33 -64 -71 192 43 -84 44 228 9 112 190 -175 85 104 84 24 86 168 15 144 123 -18 56 -100 -151
7466 -151 -157 -128 -170 -36 142 51 35 -68 -34 -70 58 179 74 -168 -246 178 32 -43 43 164 -59 -62 88 -19
7490 -19 12 -190 -18 176 -125 20 -94 18 -30 94 47 -3 -133 -131 202 -192 -55 177 51 -6 -42 -75 -166 -173
7514 -173 35 146 -50 -59 124 -202 30 129 -308 -33 -26 -11 36 78 75 185 1 -135 140 28 7 119 56 123
7538A23j38j48L13j07P6k01K00Rn6j3l7J30q8r6L2R1j08J33j83K90NL2j50j36
7562b7r6j8Q5m3l0rJ84m6K07q1J2k06p0J41O9j05j43J02J34j23OK0p1j31J42L2
7588f5O3N8j18K53k93k38M23p7j44J81M2j96M25l20J54k81J08k0Q4L4J6q0N1p7
7612a7r5Q8l9K1N0J46K9l03K61l41L88k19k84L07rJ81m00N5L79l60L0J23j56k0
7636a85RM22R5l02o6M7O1M9j43j56J67l3L10j37o5j21j03K75k24K12O2k54J74
7659I4j70M5n8J37n4K1k4j05R0N1k3K42k54j24K20j67L9N6j2k20J57J93q3o4m1
7684e4J99J0l72J38K58j16k52j57K39L1j03K44J42k86K17Kj58j27j3K93k99J94
7706C0N8k87L26k62R1L20m16K0j49M39j23j51J68J1m6M8j27n9p1N8O7j05K75J8
$$ plain form
7538 123 -15 -163 150 43 119 -82 118 127 71 58 21 151 63 -33 -1 90 -18 115 -68 222 227 259 109 -27
7562 -27 -123 -141 -56 -99 -129 -138 46 0 207 126 138 -68 -138 3 72 -33 -176 -74 60 -63 -57 -37 -108 -239 -97 -65
7588 -65 -2 56 -62 191 -102 -340 83 6 -138 43 85 -111 314 -6 148 -133 -25 -45 39 73 89 9 60 -17
7612 -17 -112 -24 -63 -42 8 154 183 -120 141 -200 188 -31 -315 -8 -17 164 -236 -181 198 -162 -132 -9 -165 -185
7636 -185 -176 246 341 39 -27 20 81 130 -13 -169 -2 -35 275 138 73 -48 -151 124 -100 112 174 -80 94
7659 94 -76 -31 -89 48 -6 15 -9 -114 -24 27 4 246 -8 -132 88 -79 -40 16 4 -216 -59 134 51 -13 -54
7684 -54 145 155 -217 -79 179 63 -189 -346 -107 -76 -179 65 207 -79 138 140 -18 -145 -158 135 -164 30
7706 30 88 -199 127 -135 -44 276 -140 -120 -269 170 47 -104 64 75 29 77 -50 -109 -180 -122 -55 -160 115 133
7730A33j50lO0Jk68J67j40K12m5K17j09N9l31R1K22l5p8J71k51L10k28J52k45
7753h8J10J0P2L24m09K7j13R2j20J93P3l03J30J00j52K49k29j9n6j09J74J07P8
7776A41o0l61J60J49j57J73p6J66j92l6M7L3n2R7J60j34M3l00K6K26j64N2j15
7799a74N1q5j8J22J81L9j19ok74L02J49j35J74l28O66n20Q4r7P2k24K92k70J61
7822D3p5r2K59l93L48k19J56K21j99j16N0J50j08j31J27L8m6K21m42p9L86k07
7844a08J1L85l89J65K9l5n2N1k45j0K46q3O8l44K96K3l43M68Q1k42Q9K65k78l
7868D5k10K35p5K9J00l81K51P3k15J32n6J55n6K9J35l81om2J56Q3j08J9J23k13
7892a78M05l61K83k04j0J37j81p0L74k2J4M6O3m60N9J81j12j38J20J34q1M9R9
$$ plain form
7730 133 -17 -20 40 41 -227 -60 -200 12 -33 184 75 134 -197 -106 116 81 3 174 -77 233 5 157 -88
7753 -88 22 32 104 428 19 46 -67 25 -95 98 171 -132 -2 98 -54 195 -34 -53 -109 -218 -44 63 141
7776 141 81 -280 -120 29 -128 45 -31 135 -57 -93 -46 -13 -65 32 192 58 101 -199 -173 53 -111 -59 -174
7799 -174 -123 -208 -226 -104 77 116 -3 -9 -283 19 168 33 207 -121 545 25 109 12 84 -140 152 -118 43
7822 43 -32 -124 135 -258 90 -129 27 248 49 -67 -17 133 25 -106 21 59 13 234 -208 -287 99 -108
7844 -108 -97 288 -101 64 93 58 6 57 -188 -198 48 -35 33 -311 -15 8 -335 133 214 -28 61 326 48 45
7868 45 -165 70 -5 24 124 -257 -6 67 -148 -16 -72 83 27 56 191 -190 -196 -238 -82 1 -107 -88 35 -178
7892 -178 227 -134 149 -55 -65 72 -109 -179 195 173 187 233 296 -164 -105 76 -36 -174 -54 80 -1 48 147
7915A47l14J99j5k5l9l02L01kJ77k89K02m8r0L70j89j7p4Q0Q6j72k24K7J79m3
7939g5O8qk1J6K9m6O3O3l36O25m31Q8k17J16M3k7J31j65J76m2J31j97r5K17j52
7964d6J44J39j58n6J40k06J12K09m04Qj68K83k65M02k15l5k39M96o5m4m1j40r2
7987b41J90j11L64j34L4P2j1j24k63K82Rj21qr2Q8N9J34mom7j38j03qJ8L32k96
8013a25j85L06P0j13q2J77p5Q4j11K12j91J99j82J06j18m23M23m8K97n3pk55j04
8036a98L24j35k90J25J63O7p0K08l11K13k22K74j56M2l4O3p4Q3p6K03n7k75l6
8059a69K26k06J06J01k20J17j42J72j18J98oL9R0j91N0Ql1j7P2j40j74J76lj36
8083a98L59J30m93K00m1J69j44p3K96k72J19m6J84k13J71l18J02J98k66j66M30
$$ plain form
7915 147 -167 32 17 -8 -47 -349 -48 -50 127 -162 40 -8 -98 272 83 66 -8 72 158 -14 -238 -211 -32 -75
7939 -75 -7 -15 -36 -20 9 -37 26 89 -247 378 -53 35 -182 -66 -23 -50 81 -84 92 50 181 -16 -111 106 -46
7964 -46 98 237 79 23 163 -43 69 278 -126 -118 -286 -3 -268 134 -81 -116 -355 141 76 32 -9 -149 -241
7987 -241 -51 -162 202 68 102 174 163 39 -224 58 67 -54 -62 -154 -66 -7 127 123 117 70 -68 -171 -179 -161 171 -125
8013 -125 -310 -4 66 -47 -129 48 -27 57 -54 158 -33 166 -16 90 -28 -451 -28 -76 221 168 161 -94 -198
8036 -198 126 -9 -299 -174 -11 56 -14 194 -117 96 -126 148 -8 34 0 63 -11 72 -4 199 142 -133 -169
8059 -169 57 -149 -43 58 -162 -45 -187 -15 -133 65 59 98 188 -3 47 55 24 7 79 -61 -235 -59 -62 -198
8083 -198 161 291 -202 -2 -43 126 -18 -91 205 -67 52 6 190 -23 148 -170 -68 130 -136 -302 128
8104A28Q3j88L1j60J93j91M4L1n3M6mj8Q0k40J29%J71k95K50K24l11k8J14j2K85
8129C09k87j76J49o6J7K14j52j37J81M2k22Q4J63j92J4J0Q8j27L08k37J70l33
8151a80M0l8J24o8J91j16L28j21l88L47j59K3K29k90K2J00j10J05M7Rj39J37M7
8174A40j41M01l41R2j42J16J8j48M8j15L7L8J23k86M13k06n3
$$ plain form
8104 128 211 23 54 -106 87 -104 -60 -29 -82 -36 -40 -58 22 -218 -89 -89 82 -213 37 261 -50 -78 36 24 309
8129 309 22 -154 -5 -71 -54 160 8 -129 52 94 -128 -44 119 -73 -59 -49 39 -88 220 -17 153 -180
8151 -180 -140 -178 -54 -122 69 -47 281 160 -228 119 -40 -17 212 -78 -56 44 -66 39 86 95 -44 93 140
8174 140 -1 400 59 151 9 125 143 -5 43 -72 -35 3 126 -160 253 47 -6
8191f
$$ Imaginary data points
##PAGE= N=2
##DATA TABLE= (X++(I..I)), XYDATA
0@%%%%%%%qJ6j6J6j6K4m0M8n6P2q8J12j37J61j95K35k80L28l84M48n20O01o90
30c69P93r07J032j170J322j491J676j882K106k349K620k917L239l588L969m387
46b303M846n348N895o493P150p877Q682r574J0570j1688J2954j4400J6070j8024
60i540K0343k3152K6641l1104L7038m5366N7988p9578J26273m02717K91398L64188
72C32412q04814M27727K67662o62758J25826O16770m19693j06785L65249k32212
82i0616j40635L64674j30425j28774K23713q3498j13528J98380r3024p0209J74648
93A10706j08627r3478K00849j11300r3690K29530j11720j82211K57796l6827k23346
104a62318K38187K8076k88819J95004J28205k94959J09142K04804k55930K1015
$$ plain form
0 0 0 0 0 0 0 0 0 -8 8 -8 8 -8 16 -24 24 -32 40 -48 64 -73 88 -107 128 -152 176 -208 240 -280 321 -369
30 -369 424 -483 549 -621 701 -790 886 -996 1110 -1239 1381 -1536 1703 -1885 2084 -2303
46 -2303 2543 -2805 3090 -3403 3747 -4130 4552 -5022 5548 -6140 6814 -7586 8484 -9540
60 -9540 10803 -12349 14292 -16812 20226 -25140 32848 -46730 79543 -323174 -31776 332412
72 332412 -472402 -44675 222987 -439771 -313945 302825 -116868 -223653 141596 -90616
82 -90616 -231251 133423 2998 -125776 97937 14439 -99089 99291 6267 -63942 110706
93 110706 2079 -91399 109450 -1850 -95540 133990 22270 -159941 97855 61028 -162318
104 -162318 75869 103945 -184874 10130 138335 -156624 -47482 157322 -98608 -77593
114g7593K22696k15542o0429K34426j25117q9947J95123r8654j22866J82550m1356
125C291j28661J54037j5741j42220J31572J9994j46207J03480N2780j30214Q3678
136a4211O5452j37874N2553Q9143j17812L9562J07367j19323p800J14150r0060
147a8853k2268J29704p0899p1255J07835l8294p2962J11372j3235j10120P6341
158G366K4949r0235O4447L7917j06935K4558O5304o5909J4609N7880p2235j1165
170d9449P0466l5605j1532O0225m0963l3275O0130j3532k7545N4670j6170m7224
182b9804M4371K315l6550M5530J481n6991L0552K0410m5630K7807K7664n7067
194b5912M939M2219l7487j587M4386l4756k1663M2770j5031j9521M0829j0658
$$ plain form
114 -77593 145103 -70439 -130868 103558 -21559 -111506 83617 -15037 -137903 44647 3291
125 3291 -125370 28667 12926 -129294 2278 22272 -123935 -20455 32325 -97889 -14211
136 -14211 51241 -86633 -34080 55063 -62749 -23187 84180 -35143 -42943 71207 -18853
147 -18853 -41121 88583 17684 -53571 54264 15970 -56992 54380 41145 -68975 7366
158 7366 32315 -57920 6527 44444 -62491 -37933 27371 -38538 -23929 33951 -38284 -49449
170 -49449 21017 -14588 -26120 34105 -6858 -40133 19997 6465 -21080 33590 17420 -29804
182 -29804 14567 16882 -19668 25862 27343 -29648 904 21314 -24316 3491 31155 -25912
194 -25912 -20973 21246 -16241 -17828 26558 -8198 -29861 12909 -2122 -21643 19186 8528
206H528l2814L0283K918k4933K8470M433l4493J6286J3526k5198J4700J4342l1259
219a5211M078K0791k3610J324K3055k1836p471K2409j6208q717K6844p724j4410
232a6686J7431p863j2586K4681L948j6327R571j979j3755K0787J0254j8582M744
245C638K775j7819J5001J6204j9905j647Q706j8722K963K2037j2556r620J0630
258A685j2624q488K0265J829j2079O450m215j1232J4104Q379q036K642O88p950
272h582Q558O336o724L180L607o599M003M160q204K993O434p857k472O206m787
287B52j280O418p701p516Q599L391m377J317o073o383R934P686l952k935l367
302e987l071R439P653m513l556k16j787N238P007m512l972L216j992j842M656
$$ plain form
206 8528 -24286 5997 8915 -16018 12452 16885 -17608 -1322 12204 -12994 1706 16048 -15211
219 -15211 -11133 9658 -13952 -12628 10427 -11409 -18880 3529 -12679 -21396 5448 -2276 -16686
232 -16686 745 -7118 -19704 4977 8925 -7402 2169 190 -13565 7222 17476 -1106 3638
245 3638 6413 -11406 3595 19799 -106 -1753 6953 -11769 -8806 13231 675 -8945 1685
258 1685 -10939 -19427 838 2667 -9412 -2962 -7177 -18409 -4305 4074 -3962 -1320 -632 -8582
272 -8582 -24 6312 -412 2768 6375 -224 3779 7939 -265 2728 9162 1305 -1167 5039 252
287 252 -1028 5390 -2311 -9827 -1228 2163 -2214 -897 -6970 -13353 -3419 4267 315 -2620 -5987
302 -5987 -9058 381 8034 3521 -35 -251 -2038 3200 10207 5695 1723 4939 2947 1105 5761
317E761j958l734L657j024o516J31K296p2K647r96o800k530M194M203K431j078
333F12o982j367O095L599L059l26p049k52O670J179r43J754l204j974M623q13
349D681n380J650L768k267j417j205m926L92N572J09l110j002n19J305J600p70
365a519m72J034K897K916k193l686M48M042K637J571r84m645j829K943N32j197
381B495Q63j109l004n53j295k362J637J928j388j690j904k86K740K207j169j186
397d076J315J527L299K783k815j986K870K229K232L446j851m193O02J228j20J691
413H181M28k794k756j572j301j59J338K17k438k606j599M23M64q78p3K27r30J837
431c991L25k709L98K885N82O00P28k020j028K043J191p09k65J68q7j46o27j181
$$ plain form
317 5761 3803 69 3726 2702 -3814 -3683 -1387 -1459 1188 192 -6608 -9138 -4944 -741 1690 612
333 612 -6370 -7737 -1642 1957 5016 4690 -2359 -2611 4059 5238 4295 6049 2845 871 5494 4681
349 4681 -699 951 4719 2452 1035 -170 -5096 -4704 868 977 -2133 -3135 -3654 -2349 -749 -1519
365 -1519 -1991 -957 1940 4856 2663 -1023 -575 3467 6104 7675 6691 2046 217 3160 3692 2495
381 2495 3358 2249 -755 -1308 -2603 -4965 -3328 -1400 -2788 -4478 -6382 -6668 -3928 -1721 -2890 -4076
397 -4076 -2761 -1234 2065 4848 2033 47 2917 5146 7378 10824 8973 4780 5382 6610 6490 8181
413 8181 8609 5815 3059 1487 186 27 1365 1582 -856 -3462 -5061 -4638 -4174 -5052 -5125 -4898 -5828 -3991
431 -3991 -3666 -6375 -5977 -3092 -2510 -1910 -1182 -3202 -4230 -2187 -996 -1705 -1970 -1802 -1889 -2035 -2662 -3843
449c843J19N84J593j65k564o38K813Q17J45K284j740j246M082J519j945K006J513
466E334j650J467J850k056K77J935k443j915Q41j051k36K92l904k870J468j558
482d219m06N59m664k148L297r58j823K759j524k229L828J679k609L151K557k850
498e600K134K683j384K647L751l184n18K655j675K165L294m078j941J983j718
513A214K29K645l625l152L243j073k921K946j412l370L449M25m281K801J162l490
529e210K987J782m192J830K297l327J594K498l622O77K493l558Q25L880l844j353
545d243L242l000l66N860l549m304M663K02k203M719n14m749L405K942j868P40
561I77R51j890K898K100k455n08N29j024K444J274m106k8R72k655Q53J450m126
$$ plain form
449 -3843 -3724 -3140 -1547 -1712 -4276 -4914 -2101 -1284 -1139 1145 -595 -1841 2241 3760 1815 3821 5334
466 5334 3684 5151 7001 4945 5222 7157 4714 2799 3640 2589 2353 2645 -1259 -4129 -2661 -4219
482 -4219 -4625 -4066 -8730 -10878 -7581 -8539 -10362 -7603 -9127 -11356 -7528 -5849 -8458 -5307 -2750 -5600
498 -5600 -3466 -783 -2167 480 4231 1047 529 3184 1509 3674 6968 2890 949 2932 1214
513 1214 1443 4088 463 -2689 554 -519 -3440 -494 -1906 -5276 -1827 -1402 -5683 -2882 -1720 -5210
529 -5210 -2223 -441 -4633 -2803 -506 -3833 -2239 259 -3363 -2686 -193 -3751 -2926 954 -2890 -4243
545 -4243 -1001 -4001 -4367 1493 -2056 -6360 -1697 -1495 -3698 1021 507 -4242 -837 2105 237 977
561 977 1928 38 2936 5036 2581 2073 2602 1578 4022 5296 1190 1162 2134 -521 332 1782 -2344
578b344N97K612m209j240K330j879J21K961l332k487L600M78r58K622j551k558
594e237M315J579j797K015j59j972K990J354k167J750P95k657J773M24l158K111
610A959K024l532l12J509k953L8L521k689j726J983j245j780L532p72k487K693
626b37N07k037J876M46j822J302J652j334K89P55j710N69K002j478n25R53j180
643B8L4O86q69l33N35m12L26N72j406k41J555m09L65P19j188K7K450J51r48N13
663B155p9j617K503J479k398n16L90j788J090J511k049j586k84n17j1L90o58j167
681c152j79j70k20K42L21J51K16l77J83J869k79P35J527r47L13J900N7J00J209
700C499p41p67J189O0r67M92J35j372l92K44r95j17L72j108p02J13l05K40r4q23
$$ plain form
578 -2344 -1747 865 -3344 -4584 -2254 -4133 -4012 -1051 -4383 -6870 -3270 -2792 -3750 -1128 -2679 -5237
594 -5237 -922 657 -1140 875 716 -1256 1734 3088 921 2671 3466 809 2582 3006 -152 1959
610 1959 3983 451 139 1648 -1305 -1267 2254 -435 -2161 -178 -1423 -3203 329 -443 -2930 -237
626 -237 270 -1767 109 555 -1267 35 1687 353 642 1397 -313 256 2258 780 255 1208 28
643 28 62 748 -121 -454 81 -331 -5 567 -839 -1080 475 66 431 1150 -38 -11 2439 2590 1642 2155
663 2155 2076 459 2962 4441 2043 1527 1917 129 1219 2730 681 -905 -1189 -1706 -1717 -1327 -1985 -3152
681 -3152 -3331 -3501 -3721 -3479 -3158 -3007 -2791 -3168 -2985 -1116 -1395 -660 867 -80 233 2133 2190 2290 3499
700 3499 2758 1991 3180 3240 2273 2765 2900 1528 1136 1380 385 268 640 -468 -1170 -1057 -1362 -1122 -1216 -2039
720b039J80P26K92O35l66j83P80O81O3M17M61p08O28P77r25j158J081m66o19P22
740I79j188j891J534l3j287M0j74q22P48J019j288m55J351O12q2R66j22m01J334
759H40R69m06P90K9Q3J69J09J4l59j19m91l64q82m9N48p63q44q18n80l2O10J39
781a407j056j46N26r4O85J164p90J52J106k5j50R11M66j00Q40l8p70L91P37p59
801A643o09k5n01m45L20o34j208k82L42Q8k20o73j56K83O43J94Qk1P42N50L64
822D03m8L85P11O23M65n14m14O88L10o97J14j33j055N11j43j273r98O56k19o56
842a284J66j70j243M25L92m96M31P68n04J2M61J83O94Q82M18j4q76K34J243J95
862A917k35qk01j75K02m31j185N4N20n11m19j24j080K53J203r25n63OO76K58Q30
$$ plain form
720 -2039 -1859 -1133 -841 -206 -572 -755 25 706 769 1186 1647 939 1567 2344 1419 261 1342 876 257 979
740 979 -209 -2100 -566 -599 -1886 -1846 -2020 -2842 -2094 -1075 -2363 -2818 -1467 -855 -937 29 -93 -494 840
759 840 1809 1403 2193 2222 2305 2474 2583 2597 2238 2119 1628 1264 382 333 881 118 -726 -1544 -2124 -2156 -1546 -1407
781 -1407 -2463 -2609 -2083 -2177 -1492 -328 -1118 -966 140 115 -35 876 1342 1242 2082 2044 1274 1665 2402 1643
801 1643 1034 1009 508 63 383 -251 -1459 -1741 -1399 -1311 -1531 -2204 -2360 -2077 -1434 -1240 -1232 -1253 -511 39 403
822 403 355 740 1451 2074 2539 2025 1611 2299 2609 1912 2026 1893 838 1349 1206 -67 -1065 -409 -628 -1284
842 -1284 -1118 -1288 -2531 -2106 -1714 -2210 -1779 -1011 -1515 -1503 -1042 -859 -165 717 1135 1121 245 479 1722 1917
862 1917 1682 1674 1473 1298 1500 1069 -116 -62 458 -53 -472 -596 -1676 -1423 -220 -1145 -1708 -1702 -1026 -768 62
883F2m35q53Q01J264N07j1n23n93Q94R79j20l50n78o35P11M7j054l23l29k49J67
904f21l13j142k4M65n32K13k70m56O38M11j52n6L23P57N85M26j41j48R88K60j21
925A090M85L9J30N55p82n18K8K08j91p10n71m63k71K38j93r73j85J81L74o18j12
946b259J70J76J78J149m17n89O60J171j58J68J04k35O63O45l51n20jK37l68J53
966E76o43m46q6j39k30q47k9L74k25j86K20n82j18R10M82m20K79O41m5M22N28
987D36j8l3O70k5l06N0K96m8k30m59n09j64L15o03j74n24n66L10l04j01k0n57
1009b564J37P87m08N2Q79n1L39O76J08N8O31O37m46K98J53q3O85Mr71m56N39n40
1031D64m49J73p26o24K47q9j141J54Kk55K24j94jo0Q07K47L23O5M4O53M28K01
$$ plain form
883 62 -373 -1226 -425 839 1346 1335 812 219 1113 2092 1972 1622 1044 409 1120 1167 113 -210 -539 -788 -621
904 -621 -934 -2076 -2100 -1635 -2167 -1954 -2224 -2680 -2042 -1631 -1783 -1839 -1516 -759 -174 252 111 -37 951 1211 1090
925 1090 1575 1614 1744 2299 1517 999 1027 1235 1044 334 -237 -700 -971 -733 -926 -1899 -2084 -1903 -1529 -2147 -2259
946 -2259 -2089 -1913 -1735 -586 -1003 -1592 -932 239 81 249 353 118 781 1426 1075 555 554 791 423 576
966 576 -67 -513 -599 -738 -968 -1815 -1844 -1470 -1695 -1881 -1661 -2243 -2361 -1451 -969 -1389 -1110 -469 -514 -92 436
987 436 418 385 1055 1030 724 774 1070 1022 792 333 -176 -340 -25 -628 -802 -1326 -1892 -1582 -1886 -1987 -2007 -2564
1009 -2564 -2427 -1640 -2048 -1996 -1117 -1168 -829 -153 -45 13 644 1281 835 1133 1286 1203 1888 1892 921 465 1004 464
1031 464 15 188 -538 -1162 -915 -1004 -2145 -1991 -1989 -2244 -2020 -2214 -2215 -2275 -1468 -1221 -898 -833 -789 -136 292 493
1053D93K25J66m95P95K30j013N64l7m72J79k82q57K46N6n50q03L60j80l03P46
1073i32k61p26Q56M42l25P12l5J44O48K00J01K95k14L14L28k33l97K85k27j07
1093H68l05p48m52O7K15j070k16j00o80M92K63q14k18Q70j40M48P01m64M88P81
1113a4L56L73K6M47O0N89J90k42M8p2J49l62j75n07L07n74m73k94p58p7J96l79
1135a186m31L59l75j33K90L5j84P99M06k83N5Q13j05L02J182m39m65N33K77j88
1155A262K9n02l95P51n37l88n49j61k60j98L02q34o2N40l61P3K18j31J56J060
1175A3k89K07O23m10Q06L46j37j46P03J59n09K88j28n23J68N1r83k22K45j027
1195g65%L4j023L3J86l30Q7M25m16J26Q17m23o6R99K83l36J004K28p75J153M75
$$ plain form
1053 493 718 884 389 1184 1414 401 965 928 456 635 353 -504 -258 -202 -752 -1555 -1195 -1375 -1678 -932
1073 -932 -1193 -1919 -1063 -621 -946 -234 -269 -125 523 723 824 1119 905 1219 1547 1314 917 1202 975 868
1093 868 563 -185 -637 -570 -355 -1425 -1641 -1741 -2421 -1929 -1666 -2480 -2698 -1828 -1968 -1520 -819 -1283 -795 -14
1113 -14 342 715 741 1188 1248 1837 2027 1785 1833 1761 1910 1548 1373 866 1173 599 126 -168 -926 -1003 -807 -1186
1135 -1186 -1617 -1258 -1633 -1766 -1476 -1441 -1625 -826 -420 -703 -648 165 60 362 1544 1105 640 1173 1450 1262
1155 1262 1291 789 394 1145 608 220 -329 -490 -750 -948 -646 -1480 -1542 -1002 -1363 -1290 -1072 -1203 -1047 13
1175 13 -276 -69 554 144 950 1296 1159 1013 1716 1875 1366 1654 1526 1003 1171 1222 239 17 262 -765
1195 -765 -765 -731 -1754 -1721 -1535 -1865 -1778 -1353 -1769 -1643 -826 -1249 -1315 -316 -33 -369 635 863 88 1241 1716
1216A716p71O57K00j169Q90J15j030k16M53r75n1N07j193l87P11n39l89M46j57
1235a182l08O89Nn99P72L86j93P65mk4M98M78m37M93O3m01O07N9j109O3N98j104
1257A15k89K44p06m52Q00n80q78N97J48p93P85o6m37N06P80m13L77M53k08K93
1277B76R99m83N0R51m17m4N38p27k84P05o60o90J41k30n13L89k26r79J11K10l44
1298a227K88k54o27P22Q34q24K67P24l48K45J243o50K0R91k85k21O15n13l33P67
1318A434m54p03K09k34o29J54J64r63q4L67o21O8M26p07M52M53l30m4N68L20L32
1339A78J17P9nP81J6r5M21k98o9K86O3p71K06n29m7k5l85q06N5M27r23P8J31n21
1363a636J84P72n80k01L72M45p7N75j9j8N80M12k9P3J09O8J74m7m6j28o6r2k54
$$ plain form
1216 1716 945 1602 1802 633 1523 1638 608 392 845 -130 -181 326 -867 -1254 -543 -1082 -1471 -1025 -1182
1235 -1182 -1490 -801 -796 -1395 -623 -237 -430 335 331 307 805 1283 846 1339 1402 1001 1608 1667 558 621 1219 115
1257 115 -174 70 -636 -1088 -288 -868 -1746 -1149 -1001 -1794 -1009 -1075 -1512 -1006 -226 -639 -262 191 -17 276
1277 276 1275 792 842 1793 1376 1332 1870 1143 859 1564 904 214 355 125 -388 1 -225 -1204 -1093 -883 -1227
1298 -1227 -939 -1193 -1820 -1098 -264 -1088 -821 -97 -445 -200 1043 393 413 1404 1119 898 1513 1000 667 1434
1318 1434 980 277 486 252 -377 -223 -59 -1022 -1106 -739 -1360 -1292 -866 -1573 -1121 -668 -998 -1042 -474 -154 178
1339 178 295 374 369 1150 1166 1071 1492 1194 1125 1411 1474 703 909 380 333 308 -77 -883 -828 -401 -1324 -1246 -1115 -1636
1363 -1636 -1452 -680 -1260 -1461 -1089 -644 -721 -146 -165 -183 397 809 780 853 962 1030 1204 1157 1111 983 917 825 571
1386E71j95l08l80J29m23l22J88k35k20L10n88J80L83R2K58K7k0L60P00P8n42
1407D3N00K29j0J54L67k96n83P98n25j94J9q31K8L2j31m60k15J91j97K32j87l60
1429a396j14N45q7L50J26K56M41M04j74J94K57L3O36j19m50J76L69l20k12k96
1449F19q1m88M84o13k47j27k26l08o0k76k17K38O9k22K19L48m2K19M15m9K35M84
1471C74n6K77K38q7MN91m76k49J78m2j99l7j49m85k26L8q1k05l55j93K72k6RM6
1495h39J34j55P80Q3LO9L92J88J85K10l48L89K61m63k87L25k08o6n7m04l17J4
1517a11m78J98k37m72n8M24l64j6L7o5L26K6L37j87M30L89J1N43j88J30M80R1
1539A246q6K66m24J68N0Ol74k12m66L93n20k42m05n0J57n42j49r2Q5J46L69m8
$$ plain form
1386 571 376 68 -312 -183 -606 -928 -740 -975 -1195 -885 -1473 -1293 -910 -818 -560 -533 -553 -193 507 585 43
1407 43 543 772 762 916 1283 987 404 1202 677 483 502 -329 -301 -269 -400 -860 -1075 -884 -1081 -849 -1036 -1396
1429 -1396 -1510 -965 -1052 -702 -576 -320 121 525 351 545 802 835 1471 1352 902 1078 1447 1127 915 619
1449 619 538 50 534 -79 -326 -453 -679 -987 -1047 -1323 -1540 -1302 -1233 -1455 -1236 -888 -930 -711 -296 -345 -110 374
1471 374 318 595 833 746 750 1341 865 616 794 752 553 516 367 -118 -344 -306 -387 -592 -947 -1140 -868 -894 -885 -839
1495 -839 -705 -860 -80 3 6 75 467 655 840 1050 702 1091 1352 889 602 927 719 653 596 192 -125 -111
1517 -111 -589 -391 -628 -1100 -1158 -734 -1098 -1114 -1077 -1142 -816 -790 -453 -640 -210 179 190 733 545 675 1155 1246
1539 1246 1160 1426 1002 1170 1220 1226 852 640 174 567 47 -195 -600 -650 -493 -1035 -1184 -1276 -1191 -1045 -676 -724
1561g24k9N27O1K02L38k02P3M51N4Q0K6K3O8O2P0o93J01q1l01L01l13o99M49k72
1585d28J6m89o7K67R0r2l5p5K26K95K21N6P1L24L77R4k34N52j28k39M54m4p03
1608E09K48j9j38J02n86j74r3k41j98n9p8j18P5j97j14K55K11K8QL90j52j09P27
1631B77J24J21NN8J42L63k44o2J05j61on1m95J94p4m67j30l15J56k45J29l7o13
1654a226L59j45o2L63K58j80M99K17M4j26N83k28L45O4Lp8R5K79m92J66l22j91
1676B25M2m42j52J74l66J17k30nm54J76J64j23J59j3R1K70lo1O39n8L56K34J6
1699G56m40J54M78p8j78M29m81m26M23k45l34j10j95j89j69k18q1q4mq5P8J25
1721h74K0K69J92n6P4L37K05L35j75L6L86K09q4J29n5k11j67L94n77j38M4k41
$$ plain form
1561 -724 -753 -226 -165 37 375 173 246 697 751 831 857 880 948 1010 1080 387 488 407 106 407 94 -605 -156 -428
1585 -428 -412 -901 -968 -701 -611 -703 -738 -813 -587 -292 -71 -15 56 380 757 851 617 1169 1041 802 1256 1212 509
1608 509 757 738 600 702 116 -58 -151 -392 -590 -649 -727 -845 -770 -967 -1081 -826 -615 -587 -579 -189 -341 -450 277
1631 277 401 522 527 585 727 1090 846 784 889 728 722 671 176 370 296 -171 -301 -616 -460 -705 -576 -613 -1226
1654 -1226 -867 -1012 -1074 -711 -453 -633 -134 83 127 1 584 356 701 765 768 690 785 1064 572 738 416 225
1676 225 267 -175 -327 -153 -519 -402 -632 -637 -1091 -915 -751 -874 -715 -728 -637 -367 -370 -431 208 150 506 740 756
1699 756 316 470 948 870 692 1121 640 214 637 392 58 -52 -247 -436 -605 -823 -904 -988 -992 -1077 -999 -874
1721 -874 -854 -585 -393 -449 -375 -38 167 502 327 363 749 958 874 1003 948 737 570 964 387 249 293 52
1743E2k84N9k90l21J84j1l72J40J84k07K58L04k62J48J69J88L49J96j15J26J78
1764F73R6M8K5P5k84L68m85j03j45k93m9J37m42l38M62n56J35j04j56k13M39J14
1786e96K12j68L6J32L55r1K69J09J63oJ83K08m4R9J8p2l42K80l10J80m40k53m42
1809e20M57j41k57j17k8k25K60j78m3L25L14k08O2R7J15K75R4JN05p4N8M1J71
1832I84k34j78P2Rl01o4k93l9j33N5m36J68n7k45J85k4k95J1L67l3m8K11J97J40
1856A9M8N16q9L33k15J52M3j75K77P7Nl14k3k34n8l84r1l14l38L25j63j16L4j71
1880h56m4J65l3K20j24R4L27J82l8lJ37J99J31L21k05N99l48m3j9k77L5K66m00
1903B86o3j38om84K62j23l85j9K08k43M4J99j38j54M91O2J56M4l5P08l45J36l9
$$ plain form
1743 52 -232 -173 -463 -784 -600 -611 -983 -843 -659 -866 -608 -304 -566 -418 -249 -61 288 484 369 495 673
1764 673 769 817 842 917 633 1001 516 413 268 -25 -74 63 -379 -717 -255 -811 -676 -780 -936 -1149 -710 -596
1786 -596 -384 -552 -516 -384 -29 -120 149 258 421 415 598 806 762 861 879 807 465 745 435 615 175 -78 -520
1809 -520 -63 -204 -461 -578 -606 -831 -571 -749 -792 -467 -153 -361 -299 -202 -87 188 282 283 788 714 772 813 984
1832 984 750 572 644 653 352 288 -5 -44 -177 -122 -558 -390 -447 -692 -507 -531 -826 -815 -448 -481 -529 -318 -121 19
1856 19 67 583 494 827 612 764 807 632 909 986 991 677 654 420 362 -22 -113 -427 -765 -440 -603 -719 -685 -856
1880 -856 -900 -735 -768 -548 -672 -578 -251 -69 -107 -110 27 226 357 678 473 1072 724 681 662 385 420 686 286
1903 286 223 85 79 -405 -143 -266 -651 -670 -462 -705 -661 -462 -600 -754 -263 -201 -45 -1 -36 672 327 463 424
1926D24O8K10p6r2J41k08J28j24j93m03l6Mq8Q6n38J7R3j53K5j11K08j27K97K38
1950b10j75J10K24K81P7R6L12l70N41j9L3j44j8K5l14Q2j8l40k2l0Q1o82J83k53
1974e50j3j41o6l9M76m00M4J46r1N75j56K61L44j44K38J25j13J95q8J51j78M8
1996F24j51o1K20m58r3n7j34j08j35O1Pj88j49j17K81j41M6J61K9J25K74J3J70
2019B19jL14QJ83j09j99K28K16j69k46j37M4k08K72o19P8L14o32j28J63J36l44
2041f17k42K18r2K39K14q6qM11L66k24J69J49l52M35J15K06j29k08J82Jk72j50
2063C25j04q5j42j33o7J48j07j90l21M36m54k6J59j8K41k06K21K04j12N04l8J16
2085C51M8j45N57k82K80l71L29j13l12J30j40k6j39j18k10l1m05K78J29j80Q1
$$ plain form
1926 424 492 702 626 534 675 467 595 471 278 -125 -161 -157 -245 -159 -697 -680 -587 -740 -715 -826 -618 -745 -448 -210
1950 -210 -385 -275 -51 230 307 403 715 345 886 867 900 756 738 763 449 531 513 173 151 121 202 -480 -297 -550
1974 -550 -563 -704 -770 -809 -333 -733 -689 -543 -634 -59 -215 46 390 246 484 609 496 691 603 754 576 624
1996 624 473 412 632 174 81 24 -110 -218 -353 -292 -285 -473 -622 -739 -458 -599 -553 -392 -363 -238 36 49 219
2019 219 218 532 540 723 614 415 643 859 690 444 307 351 143 415 -204 -126 188 -444 -572 -409 -273 -617
2041 -617 -859 -641 -733 -494 -280 -366 -374 37 403 179 348 497 145 580 695 901 772 564 746 747 475 325
2063 325 221 136 -6 -139 -206 -58 -165 -355 -676 -240 -694 -720 -561 -579 -338 -544 -323 -119 -231 273 235 351
2085 351 399 254 811 529 809 438 767 654 342 472 332 306 167 49 -161 -192 -597 -319 -190 -370 -289
2106b89n87M82J56l87J37K45n8L48M5m8K87o9nM15j83j64M54r0l8k70L5l2k62
2129A22K92m08j96k13j06K3l29J91j0K53o7N2j33m6J66K27q2K92m1L28O0J13j88
2152C00O4L93R0l20Qj78j31L45l15r3k63M31n31j18j06p9j94M24k78p2R1K06k03
2175e29J11L57l53L10K85KN2K15j28K67M1o6k29L65k58m1J47j62l20K88l63J3
2197Dj91l19R4J11j20k87J45K48l59K07J33k2N3L38j68K85J71pK58K27m95N1L73
2220G30o8r8k4pm0n46L41l41LJ95l43J13n06J29j18J08J82j29J0J31P9o2K9K66
2244C4R4k48M87lk99K82K09j60J00j12J40k72J59n1j23j43j73j56J19k23k00J92
2266c47M1r6n5J39q7R2K23j06P2QJ75M4K57om4J62p8J51P6rj88j9j39j03j01K9
$$ plain form
2106 -289 -876 -394 -238 -625 -488 -243 -301 47 92 44 331 262 257 672 489 325 779 689 651 381 416 384 122
2129 122 414 6 -190 -403 -509 -486 -815 -624 -634 -381 -448 -396 -529 -575 -409 -182 -264 28 -13 315 375 488 300
2152 300 364 757 847 527 535 357 226 571 256 163 -100 331 -200 -318 -424 -503 -697 -273 -551 -623 -532 -326 -529
2175 -529 -418 -61 -414 -104 181 183 235 450 322 589 630 564 335 700 442 401 548 386 66 354 -9 4
2197 4 -187 -506 -412 -301 -421 -708 -563 -315 -674 -467 -334 -356 -303 35 -133 152 323 316 574 801 306 357 730
2220 730 662 564 540 533 493 -53 288 -53 -50 145 -198 -85 -591 -462 -580 -472 -290 -419 -409 -278 -199 -261 -232 34
2244 34 128 -120 367 364 65 347 556 396 496 384 524 252 411 360 237 94 -79 -235 -116 -339 -539 -347
2266 -347 -306 -402 -457 -318 -405 -313 -90 -196 -124 -116 59 103 360 354 310 472 394 545 621 612 424 405 266 163 62 91
2292I1J3k62j18Jj2j85O5j48p3K85J4j64K26O6J61q8o5J76J6J49K22n8L42l12
2316C42n5J00J88k07j7J93q2k87J82k77j40k67L28k47l12L55k70P8L15n25K02
2337d03Q5K33K1j18J29J10M6k5J34K05J85k0j80P5O0k61j37J34l73RJ77l47M7
2360b14j07R9l58O3q8Q3p0o5L48K46K8k40L76j41L81l5k0L4KL09l38J94r8M7q2
2385C54J22j78j07j96j58M8k7q5P7l22J14o7k92m3L49j12K1K48j17L80R9j34J13
2408H7L87k69K5L6j61M50r8j11Q2N2k72k5n7o9o5M4m66K34l1j68mp0m6J03J43
2433b69L5K5J49p3R6n1M51JQ5j60j06K15J38P1k61Kk21J34j01j29k07l48L72j61
2457c13q7J61l79K18j28m2K59k02L53j92K59J5j6K13O9N27l88j45N3M67j27j25
$$ plain form
2292 91 104 -158 -276 -275 -287 -472 -407 -555 -628 -343 -329 -493 -267 -201 -40 -128 -193 -17 -1 148 370 312 654 342
2316 342 287 387 575 368 351 544 462 175 357 80 -60 -327 1 -246 -558 -203 -473 -395 -80 -605 -403
2337 -403 -318 -85 -64 -182 -53 57 103 78 212 417 602 582 402 477 537 276 139 273 -100 -91 86 -261 -214
2360 -214 -321 -222 -580 -517 -605 -522 -592 -657 -309 -63 -35 -275 101 -40 341 306 286 320 322 631 293 487 389 436 354
2385 354 476 298 191 -5 -163 -115 -142 -227 -150 -472 -358 -425 -717 -760 -411 -523 -502 -254 -371 9 108 -26 87
2408 87 474 205 230 266 105 555 457 346 428 480 208 183 126 57 -8 36 -430 -196 -227 -395 -399 -469 -515 -412 -269
2433 -269 -234 -209 -60 -133 -37 -88 363 364 449 289 183 398 536 607 346 348 127 261 160 31 -176 -524 -152 -313
2457 -313 -400 -239 -618 -400 -528 -570 -311 -513 -160 -352 -93 -78 -94 119 188 715 327 182 235 702 575 450
2479D50M0k11K07l71L64m89M47n08OK00l58j38J34L0k11l6P6o9K73j28J95m4M0
2502a01M10l91M93l76L09oQ6j0K5L6J5l47L36j29k59k14K77l00j94J38k28l2%
2525d62J16Loo6K58q3n3K2J67J0L74j4J23j3J23K7l6k21J02mJ19r3m34K61j27
2550I3l06J36P8r2r2k67k4J58q2n9P0J08Q3jJ80k02L15J07M8Q0K6k27L13L5J29
2575F07j94J21l14J89J17m19m4j48L65n77J63K3k95M7j70L50j41q4L0l4Q7M49
2597A28K7j45k2J70J96j73p1J98J63m60N81k89p9L91l59l47K43J33k13j52J11
2618C1k12J74q5k61L01j47k89J60o8m1L94l9J1J75M2k20N15j03j02K62m4j79j60
2641A15M88l87n4J06k56q3l6N8j59L5j18j89K41m4J16q5K38j22j27J39J57n08
$$ plain form
2479 450 490 279 486 115 479 -10 437 -71 -65 135 -223 -361 -227 -197 -408 -444 -368 -437 -164 -292 -97 -141 -101
2502 -101 309 -82 411 35 344 338 424 414 439 475 490 143 479 350 91 -123 154 -146 -340 -202 -430 -462 -462
2525 -462 -346 -343 -349 -415 -157 -240 -293 -271 -104 -94 280 266 389 376 499 526 490 269 371 367 486 393 -41 220 93
2550 93 -213 -77 1 -91 -183 -450 -474 -316 -398 -457 -387 -279 -196 -197 -17 -219 96 203 251 331 357 130 443 478 607
2575 607 413 534 220 409 526 107 63 -85 280 -297 -134 -111 -406 -359 -529 -179 -320 -404 -374 -408 -321 128
2597 128 155 10 -12 158 354 181 110 308 471 11 592 303 224 615 256 -91 152 285 72 -80 31
2618 31 -181 -7 -92 -353 -52 -199 -488 -328 -396 -437 -43 -82 -71 104 146 -74 441 338 236 498 454 275 115
2641 115 603 216 162 268 12 -71 -107 -49 -208 -173 -291 -480 -239 -283 -167 -252 -14 -136 -263 -124 33 -475
2663d75N98l7J74J21q7J28j72J73m24P78m42j98J52j9j26j46o3RJ95j47m24L57
2685g5j55j72L10j7q8j0J67m81O00k54J94M1pK16j96K07Kk3qoJ08K03l97J51j96
2710A14n7L7J1p5l40J27rk1J69k51O2k21J72m8J00J80l6N7j17L61q8L46Q7l22
2734B38J75j12K51l9k06P0j83o1K34l01k45K7m0J49j15n6J57l40k4J07L9n2k1
2757c48l5K97J54k53K62J10l6j20M17j38N9o9R3M2Q3j98l37J73L69n18j19j29
2779b41K77k67J80m5j82l8O2q4j72M52J62j11J4j74K75P9p3K64j60j56K42N7o5
2802B96j67K79l08M01l78j72J45k47k5J66J17k26j34j40m6J27j13L13j15J54q0
2823a53oL1L05l54K78J01j43J41K32m9j06j04L31l39J23J0k19K27l18Lk24K82
$$ plain form
2663 -475 123 86 260 381 294 422 250 423 -1 777 335 137 289 270 144 -2 -65 -56 139 -8 -432 -75
2685 -75 -230 -402 -92 -109 -197 -207 -40 -521 79 -175 19 60 53 269 73 280 282 259 251 245 353 556 159 310 114
2710 114 57 94 105 30 -310 -183 -192 -213 -44 -295 -233 -454 -282 -330 -230 -50 -86 -29 -146 215 127 473 560 238
2734 238 413 301 552 513 307 377 194 133 367 66 -179 -152 -192 -43 -158 -214 -57 -397 -421 -314 -275 -327 -348
2757 -348 -383 -86 68 -185 77 187 151 31 448 310 369 300 393 435 518 320 -17 156 525 7 -112 -241
2779 -241 36 -231 -51 -96 -278 -316 -254 -338 -510 -58 104 -7 7 -167 108 187 114 378 218 62 304 361 296
2802 296 129 408 100 501 123 -49 96 -151 -176 -10 107 -119 -253 -393 -439 -312 -425 -112 -227 -73 -153
2823 -153 -159 -128 177 -177 101 202 59 200 432 383 277 173 504 165 288 298 79 306 -12 -9 -233 49
2845D9l70J85k45j59K91M2j52O6m4J72r6j3L26j3m8J21Q6l9k29K41N4j80K77k04
2869A18l16L19K3O2o4j44l08k5L09l20M2p4R6k7J69K32m11K91k24K07L8qL5J81
2893B01j61K19l7J67j65K80rm88K15R5j68J21l03r5K7J13j26l82J40J91j46j38
2915d49J19N1J67J18j57J25k14M17k87K23j4J07k94K80k5k3J50j16M39o23k2L2
2937DK26j08j43L7L1k29l46J10J2K02k61K97K9q9j86J33J28K6J63J4J2J49J46
2960C57n0j87J24mp4K00l16M3oo5J17j04j06l8r8R8q3J2R3l88L61l35M18l4j05
2985a70m1N3K55J01k0M3n8J16l14L30J51m36J27k03J44lj71j1j2K01k97R9J52
3008C6j79j04J76j72j2L2j2LR9j41J98P4K1m0J01J67k5J90k56J39Lk88K65k9p0
$$ plain form
2845 49 -321 -136 -381 -540 -249 -207 -359 -293 -337 -165 -261 -274 52 39 -9 112 198 159 -70 171 225 45 322 118
2869 118 -198 121 144 206 142 -2 -310 -335 -26 -346 -304 -378 -282 -309 -140 92 -319 -28 -252 -45 -7 -15 20 201
2893 201 40 259 222 389 224 504 495 7 222 317 149 270 -33 -128 -101 12 -114 -496 -356 -165 -311 -449
2915 -449 -330 -279 -112 6 -151 -26 -240 177 -110 113 99 206 -88 192 167 144 294 178 617 -6 -28 4
2937 4 230 122 -21 16 47 -182 -528 -418 -406 -204 -465 -168 -139 -228 -414 -281 -153 -127 36 50 62 211 357
2960 357 307 120 244 240 166 366 50 93 87 22 139 35 -71 -109 -207 -109 -192 -180 -87 -475 -114 -449 -31 -65 -170
2985 -170 -211 -158 97 198 178 221 163 279 -35 295 446 10 137 -66 78 75 -96 -107 -119 82 -215 -116 36
3008 36 -143 -247 -71 -243 -255 -223 -235 -232 -133 -274 -76 -2 19 -21 80 247 222 412 156 295 298 10 275 246 176
3033A76k62J27N7k16Q2j55k54J55J48k3k5Q7l3O4L6q5k7L26j61j23J89J35J59
3056C77p07N87l2l3J13j28k45N05k71k60J41j22N8k47J35j70j66K97l4Q7j51l
3078b69n7K57j89L28P5N3l21K81j27N3m4j50L49M7p0N9j41pQ9l7N2j18J69n03
3102b21m2L30k42J51l60J94K5j30J18R1j30J65p3N3M1J54j06k26K18J24K45l8
3124C41J04l50O8P8m4o5j17Po6R5o2k66J48l9l6J25P3j53n4K78l42J38N7r5K02
3149B5j32J73J43k20M1j35L34n0L00l20m1K27m9k59K32k01Q3k47K7n7j17Q5J95
3172C7j72j37j03K23o6J40j7J14Nl59M33Nj00P4J79mm3M8LJ5p4p1J55j89j72P5
3198aJ67n39K44j41L0P7Qk82L30r2J48l75M80k33J73j33J83J7J30k41K46L3j09
$$ plain form
3033 176 -86 41 98 -118 -36 -191 -445 -290 -142 -165 -190 -103 -136 -72 -36 -121 -148 178 17 -106 83 218 377
3056 377 -330 257 225 192 305 177 -68 437 166 -94 47 -75 -17 -264 -129 -299 -465 -168 -202 -115 -266 -269
3078 -269 -326 -69 -258 70 145 198 -123 158 31 84 40 -110 239 286 216 275 134 127 216 179 231 113 282 -221
3102 -221 -263 67 -175 -24 -384 -190 -165 -295 -177 -86 -216 -51 -124 -71 -30 124 18 -208 10 134 379 341
3124 341 445 95 163 241 197 132 15 22 -44 51 -11 -277 -129 -168 -204 -79 -6 -159 -213 65 -277 -139 -82 -177 25
3149 25 -107 66 209 -11 30 -105 229 179 479 159 118 345 296 37 269 68 151 -96 -69 -126 -243 -158 37
3172 37 -135 -272 -375 -152 -218 -78 -95 19 24 -335 98 103 3 77 256 252 209 257 260 275 201 130 285 96 -76 -1
3198 -1 166 -373 -129 -270 -240 -163 -155 -437 -107 -199 -51 -426 54 -179 -6 -139 44 61 191 -50 196 229 120
3221A20j60K48j70J07J26m24K58M8k16J20j5k73q4J87j32k29L60q2J18k27j5K37
3243i8j28J62J08l9q9J67OJ52q3K7J83lJ08n20K58n0R8j15R9l67K18k08j74NJ36
3268a47j16J30qm4k0Po4J00K81k05J83m0J14p2J3L56l80K0RO9J88l75M0K29k43
3293B5k7m6P8k01k2J01j69J58p6l4oM3N4j50k4P0K83k1n1J25J09J4k33K71k6j72
3319G3J18Q8k24K6n5j22Q0K40l48K56j89k12O5N6j7Q7q6J4j31J58L6N8K7N8J59
3344B15k41k20L40o8p4K71k02q6L34l25L15p5L0o7j60N4j24j15k05K38K05j51
3366a11j81J38LJ70k38M45j91l74K30K70k21J6L1J11j29L7J05j20J17r0K23r3
3388A48n5j4j58L20k04J23j47j25NN8K4l19J46Q5j62K01K9k32Q4m2M69j41J66
$$ plain form
3221 120 -40 208 38 145 271 -153 105 153 -63 57 42 -231 -315 -128 -260 -489 -129 -211 -93 -320 -335 -98
3243 -98 -226 -64 44 5 -84 83 89 241 158 185 368 365 473 -47 211 161 259 144 243 -124 94 -114 -288 -283 -147
3268 -147 -263 -133 -141 -185 -205 -198 -262 -162 119 -86 97 57 171 99 112 468 88 108 117 186 374 -1 39 268 25
3293 25 -2 -48 30 -171 -193 -92 -261 -103 -179 -213 -219 -176 -122 -272 -296 -226 57 36 -15 110 219 233 0 271 245 73
3319 73 191 279 55 81 26 -96 -16 224 -124 132 -57 -269 -204 -148 -165 -78 -164 -150 -281 -123 -87 -29 -2 56 215
3344 215 -26 -246 94 26 -48 223 21 -65 269 -56 259 184 214 147 -13 41 -83 -198 -403 -165 40 -111
3366 -111 -292 -154 -151 19 -219 226 35 -339 -109 161 -60 -44 -13 98 -31 6 111 -9 108 18 241 148
3388 148 93 79 -79 241 37 160 13 -112 -107 -49 -25 -344 -198 -113 -275 -74 -45 -277 -193 -235 234 93 259
3411B59k25L34k96k0K00Q5k57J13k3j61J24k17J39j28K29l34M4J22j12l09L48
3432h5k2j78k07R0N9KK51K48k52m4K64K17l51K89N9k96Q8N5Q6j25k48j18K67J46
3456A95j98J77j42j67m9O3R3o7J11j45n0J6m0l7J08O2J25N9j12J8K3mQ2k51K98
3481A68O5k42P7L1nk44K4J94k31j1l6k6J64j46r4M88l98j40K64K2r3Q2K3L7q6
3506a13M55l54O8Q5k46J43K50o1L0k41r4m1K36L5j92K17m7j78k05K3J75j4k6J61
3530F6j53p7m3J81J6l5O1Q3O9J17l84R1J18l0O4r1j48K81R8j93J0PJ07k34m3Q4
3556B2m6N8l04O3J41N9j06l3R0Q4m8p1K09N5k07J42J9L4j1j96J95k4l0q3O8oJ26
3583B00r9k1k03J45k51K34K3k75J36L5j39O4J03j46J41r7L30l32O2J83k07j4J44
$$ plain form
3411 259 34 368 72 52 252 337 80 193 170 9 133 -84 55 -73 156 -178 -134 -12 -124 -433 -85
3432 -85 -107 -285 -492 -402 -343 -341 -90 158 -94 -138 126 343 -8 281 340 44 132 187 273 148 -100 -218 49 195
3456 195 -3 174 32 -135 -184 -121 -28 -95 16 -129 -179 -163 -203 -240 -132 -70 55 114 2 20 43 39 121 -130 168
3481 168 233 -9 68 99 94 -150 -126 68 -163 -174 -210 -236 -72 -218 -312 176 -222 -362 -98 -76 -169 -87 -64 -27 -113
3506 -113 342 -12 56 141 -105 38 288 227 257 16 -78 -119 117 152 -40 177 130 -48 -253 -230 -55 -69 -95 66
3530 66 -87 -164 -207 -26 -10 -45 16 99 168 285 -99 -8 110 80 144 53 -95 186 284 91 101 108 215 -19 -62 22
3556 22 -24 34 -270 -207 -66 -7 -113 -146 -56 28 -20 -91 118 173 -34 108 127 161 150 -46 149 125 95 12 80 74 200
3583 200 101 80 -123 22 -229 5 28 -247 -111 -76 -215 -151 -48 -194 -53 -150 180 -152 -90 93 -114 -128 16
3606A6P6k44L79l34K58J33l87J58O0J05k52N7j10K15k38m6M19n95M59l87j2L88
3628A18l74O8M7k35N74j3k50n4L04j71N4jj63K15J80j04k86K37n9j91n2K03R1
3651A38j43q9O3N8k67J38n5J05J40n6N6k22L9k09M63j01l3k8J60k51M15l90M16
3674C47k53k09J16L5J95k98O0J15l51K34j8j66R6k54K80q4K34R3k14k12P5k37
3696d16K22J05J81n1l6r4J60Q1l3m3j57K31j40O0N4J0Q8k65K08j30J09J02j87
3719E9j90L94l20j33J3M9k7K13j77J69j2Mj43OR2N8K50j93j5j94J12K49n3j47
3743F4o5J9K56l55R7r8l28N14k54K02nk94N9K64j91L8j42L40j46k19M43j46m1
3766A2J13j34J19j75L55j79j56L8l70M81RN4j08k39p6J71j0R0Q3Lk03NJ42Jj13
$$ plain form
3606 16 92 -152 227 -107 151 284 -103 55 115 220 -32 25 -85 130 -108 -154 265 -330 129 -258 -270 118
3628 118 -256 -188 -141 -376 198 185 -65 -119 185 14 68 67 -96 119 299 195 -91 146 87 -104 -156 47 138
3651 138 -5 -94 -31 27 -240 -102 -157 -52 88 32 88 -134 -95 -304 159 58 25 -3 157 -94 321 -69 347
3674 347 94 -115 1 36 231 -67 -7 108 -243 -9 -27 -193 -97 -351 -71 -155 79 172 -42 -254 -179 -416
3696 -416 -194 -89 92 41 5 -89 71 152 119 76 -81 150 10 70 124 134 222 -43 165 35 144 246 59
3719 59 -131 263 -57 -190 -177 -128 -155 58 -119 50 38 42 -101 -95 -3 55 305 112 97 -97 15 264 211 64
3743 64 -1 18 274 -81 16 -82 -410 104 -150 52 47 -247 -188 76 -115 -77 -219 121 -25 -244 199 53 12
3766 12 125 -9 110 -65 290 111 -45 -7 -377 104 113 167 59 -180 -256 -85 -95 -5 78 81 -122 -117 25 26 -87
3791h7j41J43M24k86j8k85L04K12l07R3l8J24m4n0j92L00j63k80M85l8j58K44
3813B42j57k13K57l90J36K9p9L12k49J00N1k95L43k71j5L11n2K26k19k17K28J1
3835H9J47l38M62j00j22p2k29J76M9J10p2j51n0K73k99Q4j26K62k27m5J39R7o8
3858a1K4j4j47K6K32k0J50l35J09M9k4n4J14j22J83l86P7L84m4k75Q5ok4k60L14
3883B5k0J29j41j38M34l29R5p0J43k41K59j8J0k11o1j5J22K88j26j52j01rK3n8
3907a62J84J44j14OL1k85L23k03j29J31M1j58K56o6l07K39PJ37J21k3j96m6J01
3930C2l09L17N4j96P7K5J93k00J35%Q0j57J82J3k38P9pl59K90k3j95r3K79J49
3954A28l18J12m6K80j06j13k7J39Okk14K43J38j47q9J66N2k86O7k48L74q6q3k55
$$ plain form
3791 -87 -228 -85 339 53 35 -250 54 266 -41 52 14 138 94 44 -148 152 -11 -291 194 156 -2 242
3813 242 85 -128 129 -261 -125 -96 -175 137 -112 -12 39 -256 87 -184 -199 112 60 286 67 -150 78 89
3835 89 236 -102 360 260 138 66 -163 13 62 172 100 -51 -101 172 -127 -43 -169 93 -134 -179 -40 57 -11
3858 -11 13 -1 -148 -122 110 90 240 -95 14 63 39 -15 99 -23 160 -226 -149 235 191 -84 1 -5 -29 -289 25
3883 25 5 134 -7 -145 289 -40 55 -15 128 -113 146 128 138 -73 -134 -149 -27 261 135 -17 -118 -127 -104 -162
3907 -162 22 166 52 58 89 -196 127 -76 -205 -74 -33 -191 65 -1 -308 -69 -62 75 196 173 -23 -69 32
3930 32 -277 40 94 -102 -25 0 193 -7 128 128 208 51 233 246 8 87 80 -279 11 -12 -207 -300 -21 128
3954 128 -190 -78 -124 156 50 -63 -90 49 55 53 -161 82 220 73 -16 150 202 -84 -17 -265 109 23 -60 -315
3978c15L15M9j92P2J97j67j03K46k06j59J82k7M6L4n0P5Q3l4n5j23J73j46K04
4001I9J25o2J44P5m95J45j16j73K02N6q0r4K54J43n12K84K21k01O9J05j16L7k54
4024a44K8N9Q4p7N2l3J59O1j24R9l01j8K33J30k68O0j1j73K68l9n3J65k80K49
4048A26l20Q3K40j09Rk40L13onj36K21o2m2Q8j19O5m06M31l3j45o0J83K3o3j46
4073a10J94J31r4l76r1J81N34n99R5j8j70K00J73j39L3p1J45j14Q5L9P4R2j53
4096D1k85L30j00K0j15J9J32K8k04j3p8K11o2J97j7l58J98l8j5j99K30j18J68
4119b8K02j35j41K24l67L31J5k37R9J16K76l34j21N29k91j38N7l4N0N1j23N9j4
4142D6k49K04lj17k9M4K08j50j62M1J91j30J29J04O5n3j34K19l33K7K21N1J55
$$ plain form
3978 -315 0 49 -143 -71 126 -41 -144 102 -104 -263 -81 -108 -62 -28 -78 -3 80 46 -9 -132 41 -105 99
4001 99 224 162 306 381 -114 31 -85 -258 -56 0 -80 -174 80 223 -289 -5 216 15 84 189 73 110 -144
4024 -144 -116 -57 27 -50 2 -31 128 189 65 164 -137 -155 78 208 -60 0 -11 -184 84 45 -8 157 -123 126
4048 126 -194 -111 129 20 29 -211 102 96 91 -45 176 114 72 160 41 106 -300 131 98 -47 -107 76 99 36 -110
4073 -110 84 215 121 -255 -346 -165 369 -230 -135 -153 -323 -123 50 -89 -56 -127 18 -96 -11 28 102 194 41
4096 41 -244 86 -14 6 -109 -90 42 70 -134 -147 -225 -14 -76 121 104 -254 -56 -94 -109 -308 -78 -196 -28
4119 -28 174 39 -102 122 -245 86 101 -136 -37 79 355 21 -100 429 138 0 57 23 73 124 1 60 46
4142 46 -203 1 -2 -119 -148 -104 104 -46 -208 -167 24 -106 23 127 192 139 5 224 -109 -82 139 190 345
4165C45k60j99J42j02jo4J44j39L62k46m2J04J44l73K61j50J32n6J62j81o1J06
4187B8k87J61L10j41k74L08K7j05J4O3j19j66J20K80j61l1r9L59k32j20Ok05L22
4210E8k0k54J06J02R9l45M79m05O4L01j55L0k74L03l03J00L28l04RJ49J7j64K66
4233A87l47J98L4j09PJ02p5L7j57m5Jk8P6kJ55j97K13m4j10L00k4l8l13J28j3
4258f4K48R2k75R6p3j47L61k28k25K61k54J54p5O4l05K49R3j05J05K86k85N7j3
4281A7m0N6N3n4K6P7k12j75L03L3L03m50J58j97L63n12K34R9r9j79K62k71J98
4304gk13O2J46Q3k65K58l39J07J36K6L11m08N2M9J9J14P9k07P8K88n34O7N8M5
4328EO0k00N3k4J3j99K81m4o3J37L6k98J46K23j35k2k26J80R9j62O2l8K82k59
$$ plain form
4165 345 85 -114 28 -74 -75 -139 5 -134 228 -18 -60 44 188 -185 76 -74 58 2 164 -17 -78 28
4187 28 -259 -98 212 71 -203 105 132 27 41 104 -15 -181 -61 219 58 27 -72 287 55 -65 -59 -264 58
4210 58 38 -216 -110 -8 91 -254 225 -180 -116 185 30 60 -214 89 -214 -114 214 -90 -81 68 85 -79 187
4233 187 -160 38 72 -37 -30 72 -3 34 -123 -168 -167 -195 -119 -121 34 -163 50 6 -104 196 172 134 -179 -51 -64
4258 -64 184 276 1 97 24 -123 238 10 -215 46 -208 -54 -129 -65 -370 -121 -28 -133 -28 258 -27 30 17
4281 17 -23 33 86 32 58 135 -77 -252 51 84 387 -63 95 -102 261 -251 -17 82 -17 -196 66 -205 -7
4304 -7 -220 -158 -12 71 -194 64 -275 -168 -32 -6 305 -103 -51 -2 17 131 210 3 81 369 -165 -98 -40 5
4328 5 65 -135 -82 -106 -93 -292 -11 -55 -118 19 55 -243 -97 126 -9 -31 -257 -77 22 -140 -78 -116 166 -93
4352i3M6K67k3Q1l83J31j07p7K02o8l0J36r1K70l46j60J19L61n77L06R1o7J85
4375A73k61p0K80p2j61P1J59k22J5L72j72J07k51J08J70k34Q2j98N0o0K69j0l04
4398a59j44K67J21l40K07L2j12o3L42j42k83K00p6R3P9P8q1R0k78K38J15R8k92
4421a0j32l0L47j32J00j79K7q4J84k99N7Q6j00K22p2R7j64J77l33J88J91q7j74
4444a20K50r1j22K6J18m3N7J03j83q8J73M3l5j09O8k48J92J35P7j78J10k27k23
4467c15K30J57j87J73l50L20j88L2K7O9N8K22j55j16Kj61J43o3K35m83L94R5k40
4490a01K32k34K55J03k60O4j64k18J40K09j97K22j66N1K14j50j71K16J51j63O9
4511A02j33Q6l7n3Q3Nj53j60K95j5l42Q0J15K00k53J41P5j11M1J94l65o4J88J22
$$ plain form
4352 -93 -47 220 197 278 -105 26 -81 -158 44 -24 -54 82 -9 261 -85 -245 -126 235 -342 -36 55 -12 173
4375 173 -88 -158 122 50 -111 -40 119 -103 -88 284 112 219 -32 76 246 12 94 -104 -54 -114 155 145 -159
4398 -159 -303 -36 85 -255 -48 -16 -128 -191 151 9 -274 -74 -150 -57 22 100 19 109 -169 69 184 282 -10
4421 -10 -142 -172 175 43 143 -36 -9 -93 91 -208 -151 -65 -165 57 -15 82 -82 95 -238 -50 141 54 -120
4444 -120 130 39 -83 -57 61 18 75 178 -5 -93 80 123 88 -21 47 -201 -9 126 203 25 135 -92 -315
4467 -315 -85 72 -115 58 -292 28 -160 -128 -101 -32 26 248 93 -23 -21 -182 -39 -102 133 -350 44 139 -101
4490 -101 131 -103 152 255 -5 59 -105 -323 -183 26 -171 51 -115 -64 150 0 -171 45 196 33 102
4511 102 -31 55 18 -35 48 53 -100 -260 35 20 -322 -242 -127 73 -180 -39 36 -75 -34 160 -205 -269 -81 41
4535D1j88P1KP1lJ7k8L6K11l69K50j10l7m0J71P5k52j17J18J13j40J54q2r0K90
4560A64k36J08k67L41Mk55R7q6k5J11j22n8R9K58Pk95L21k56P6o1K39j13N2M0
4584A43P2k49L9j77K59J33m92M89m13K50L8j28Q2k40j11L70o6r8J05J95j85q1
4606f5j9J55N5j17q5k00J53J29N4k35J82P4Q4l02J02K80j04j77J3J4J60k20q5
4629a54J24K5J73k0r5jP6q5j03N8j8l4J76j14J42R2r6k8N8j39o0N0K7J69k84J65
4655A04n5L8j18p7J32N8J31l73l2P2RL15k44O1P7m01L60J48k14J95j87j7q2K60
4679A60k30N9j64KJ45j46L12l07J40j35O6l6L99m31PJ8j03J66K57k46J24l08J48
4702a03J23J68j92j37J24J35j94P8J66n09K66J08KK77k12K11m95L61j62l0K3j7
$$ plain form
4535 41 -147 -76 -74 -3 -6 11 -17 19 230 -139 111 1 -36 -76 95 170 -82 -199 -81 32 -108 46 -36 -126 164
4560 164 -72 36 -231 110 114 -141 -44 -130 -155 -44 -166 -224 -125 133 140 -155 166 -90 -14 -75 164 51 103 143
4584 143 215 -34 5 -172 87 220 -272 217 -196 54 92 -36 46 -194 -305 65 -1 -99 6 201 16 -65
4606 -65 -84 71 126 9 -76 -276 -123 6 60 -175 7 81 165 -137 -35 245 141 -36 -23 -9 151 -69 -154
4629 -154 -30 -5 168 148 53 52 128 43 -60 -2 -20 -54 122 8 150 242 146 118 176 37 -23 27 54 223 -61 104
4655 104 49 87 -31 -108 24 82 213 -160 -192 -120 -111 204 -40 21 98 -303 57 205 -9 186 -1 -18 -100 160
4679 160 -70 -11 -175 -173 -28 -174 138 -169 -29 -164 -98 -134 265 -166 -159 -141 -244 -78 179 -67 57 -251 -103
4702 -103 20 188 -4 -141 -17 118 -76 2 168 -341 -75 33 35 312 100 311 -184 177 15 -15 8 -9
4724ik22L05j81J96l67L68k55N1J22o3J53k66K23o7j45J07J98j40J10j3J75l04
4746b4K36j48k3j70L0J87m77L36K3j30J73r2rj38o6J16K99o7Q2j86r4n3J37k5
4770h3J61q8R7r5J34N3m05L39j93J18r0p4K86l48K13o7p1K98j91j37mL3j54K93
4794B5p5J74k50J52J36p4j97K30J1R3k04M3Jj31J68o7k2k62L20k51K21J3J55k47
4818c8J45m9k34L6p1K84k14O7O6K04k84O4m8j54K19L6j9Q7k19K46q4O2j88K23
4842A37j47L9k35L9j1J56J32k48K55m2K07j97O8j81K23n69M30k82K08r5J45K52
4864B84l38J62k52m6J53K08j52j60Q2mJ95j5M4r0k29J49j10O8M2m2K66q6l10K25
4888D4l3R3m90L31K51k26j89J80J06r3j18J52K9J67L1l03o4K95J43k23M1l01J22
$$ plain form
4724 -9 -231 74 -107 89 -278 90 -165 -114 8 -55 98 -168 55 -12 -157 -50 148 8 118 105 280 -24
4746 -24 212 64 41 -129 -99 88 -389 -53 -30 -160 13 -79 -88 -226 -292 -176 123 56 138 -48 -142 -195 -58 -83
4770 -83 78 -10 87 -8 126 179 -226 113 -80 38 -52 -126 160 -188 25 -42 -113 185 -6 -143 -147 -114 -268 25
4794 25 -50 124 -126 26 162 88 -109 121 132 225 21 64 65 -66 102 35 13 -249 71 -180 41 54 209 -38
4818 -38 107 58 -176 -140 -211 73 -141 -74 -8 196 -88 -24 -72 -226 -7 29 10 97 -122 124 40 102 -86 137
4842 137 -10 29 -206 -167 -178 -22 110 -138 117 75 282 85 153 -28 195 -374 56 -226 -18 -113 32 284
4864 284 -54 108 -144 -190 -37 171 19 -141 -59 -63 132 117 161 71 -158 -9 -119 -51 -9 -51 215 129 -181 44
4888 44 11 104 -386 -55 196 -30 -219 -39 67 -26 -144 8 37 204 235 -68 -132 163 306 83 124 -177 -55
4911e5Q2J64j26P0k24L4r5J61J31l51J97J4O8l12J00L5kN8K29l13J81O6j95J82
4935I9K0k08K94j71j47J47K8J39k74K16l12M98j65l8j18k53K33q2J95m8k54K31
4957C0j95K81k48J92m1K1j31QJ49j2M8J72k96J72k0l03L22j32k02M27k25q3K4
4980d2M3rL7r1J50j08N0pp9j60J38j43K77k0j60K04K03m02K8J89k04L82j95lJ69
5005B47l03J03J66k29K3l8K62k83J64j03r8l2K59k26j26J78r7L97n4p4j83Q9k45
5028b03L51n15K89J12K73l29k24L26J05l26j3J02J1N9r0J66j16r7K01j74N2N7
5050A7M4o3p6P8R8l65J49K7j09L20k55J00k7J55m5J5j25J87j36Q5k18J28K53j72
5074F5j5j58L09k31M3L05j85k16J46r7K04k86J47k25L55k04K55n6l20M6M6J66
$$ plain form
4911 -55 27 191 65 135 -89 -55 -150 11 142 -209 -12 2 70 -242 -142 -107 -109 -51 178 -135 46 112 -83 99
4935 99 119 -89 205 34 -113 34 62 201 -73 143 -169 329 164 126 8 -245 -12 -94 101 53 -201 30
4957 30 -165 116 -132 60 19 40 -91 -83 66 54 102 274 -22 150 130 -173 149 17 -185 242 17 -66 -42
4980 -42 1 -8 29 -62 88 -20 30 23 -56 -216 -78 -221 56 36 -124 80 283 -119 -91 98 -106 276 81 78 247
5005 247 -56 47 213 -16 7 -31 231 -52 112 9 -89 -121 138 -88 -214 -36 -133 264 210 136 -47 42 -203
5028 -203 148 -367 -78 34 307 -22 -246 80 185 -141 -154 -52 -41 18 -72 94 -22 -119 82 -92 -40 17
5050 17 61 -2 -78 0 98 -267 -118 -91 -200 120 -135 -35 -62 93 48 63 -62 125 -11 74 -144 -16 237 65
5074 65 50 -108 201 -30 13 318 133 -83 63 -34 170 -116 31 -194 161 -43 212 156 -164 -118 -72 94
5096I4l68L39j15n1o5L73n2k74J16j6k45O1K69K7k06K24j65o6L3O5p3J99j49j17
5120a62P4J0J47P2r6q8J94n9l4l28J53J3J30J3P1o6q3J55j44j00M60k66o7J67
5144A66k78K91j07j54n1P8O1J82j38R0j40j12K2K38j47l89M91r2l7J25L8K9q7
5167G9l7M0o7J56j23j90R1J36nJ6l6m3j51J37j43j85O01k75J18j44j8LL3q7j24
5192b18o4L32J82N0j90j52J00L9k1mj8P0j96O9M0n8J72Mk28J5o8O4Q9R3k01K30
5218A31r4Q5j06o6j21L62l91L29l43L87j08L0J67p0N9m58N4K63L5l19L59j24k93
5241b32J89J41l2k80J03K64J6k57N8O3p7j3J84k12K13k69K79k03O1j93K23K6Q6
5264A38o0j46K22k3m2J00k3j43J08r6k15J24j06R9J61R8k12k05O2j96L27M9j58
$$ plain form
5096 94 -274 65 -50 -101 -166 207 155 -119 -3 -19 -264 -203 66 93 -113 111 -54 -120 -87 -22 -95 104 -45 -162
5120 -162 -88 -78 69 141 45 -43 151 92 58 -270 -117 -104 26 39 110 44 -39 116 -28 -128 332 66 -1 166
5144 166 -112 179 72 -82 -133 -55 6 188 50 140 0 -112 -90 148 1 -388 103 11 -26 99 137 166 79
5167 79 42 82 15 171 48 -142 -51 85 80 96 60 17 -134 3 -140 -325 276 1 119 -25 -43 -40 -7 -94 -218
5192 -218 -282 50 232 282 92 -60 40 79 58 54 36 106 -90 -21 19 -39 133 137 -91 -76 -144 -80 9 102 -99 131
5218 131 37 122 16 -50 -171 191 -200 129 -214 173 65 95 262 192 251 -207 -153 110 145 -174 185 61 -232
5241 -232 -43 98 66 -214 -111 153 169 -88 -30 33 -44 -57 127 -85 128 -141 138 -65 -4 -197 26 52 138
5264 138 78 -68 154 131 89 189 166 23 131 35 -180 -56 -162 -63 98 196 -16 -221 -159 -355 -28 21 -137
5287a37J08J80j27L3k3P8j93j8K16j56J79L9l59J49q7n4J22J4n1K23j56K56k26
5310A0k20K24K2r0R0j35r6K21j94M64k82l1J33j15j68K30J6Ll7L18m53Q4K85j48
5334A31r9l0N2k27K78l6J29j1k92K55j68J41l40L71j6j31j2Q3j67J21k15N5J55
5357B7l7K15J1k88r9J05m4K18l08J78j45L01J30m06J66q1K08j29j65K44l4lP8
5380A42k24O0M5M2j02J35p8j11L99l08j64L60m26K07J9j51K29p5J18l2j62L31
5402B54m13M16k80J08j23J02n2k55P2L94r9k86J68R6k79L46l8j54J88n2n0k1j64
5425a22K17Qj78L62l53k1j19K45j07J23j15K69k47K34Kk01j65J72k02R6r1N8K28
5448I3l35K38l0J05K3J45l14J53j60J22L3k03J56j76K60R5l0j90j36J21p9J80
$$ plain form
5287 -137 -29 151 24 57 34 112 -81 -99 117 -39 140 179 -180 -31 -118 -172 -50 -36 -87 136 -20 236 10
5310 10 -210 14 36 -54 36 -99 -195 26 -168 296 14 -17 116 1 -167 63 79 82 45 363 -90 -6 279 131
5334 131 32 2 54 -173 105 69 198 187 -105 150 -18 123 -217 154 138 7 -5 78 -89 32 -183 -128 27
5357 27 -10 205 216 -72 -171 -66 -110 108 -200 -22 -167 134 264 -142 24 -57 151 22 -143 101 67 64 142
5380 142 -82 -22 23 65 -37 98 20 -91 308 0 -164 196 -230 -23 -4 -155 74 -1 117 85 -77 254
5402 254 -159 257 -23 85 -38 64 12 -243 -171 223 124 -162 6 102 -177 169 131 -23 165 113 63 42 -122
5425 -122 95 103 -75 287 -66 -87 -206 39 -68 55 -60 209 -38 196 198 -3 -168 4 -198 -102 -193 -135 93
5448 93 -242 -4 -34 71 94 239 -75 78 -82 40 73 -130 26 -150 110 205 175 -15 -151 -30 -109 71
5470G1j31m8n2K6M0N9N5p8k11M67l27Q3M1Q8k86N8K8J30l2J15r1j40L66j33K3
5495A21l61J33K2L43l32q5J72j1l1J12p2J2J25k03j54j9K21j43K88L7Lk00p3p3
5519a68J43oK10k24kL7qn4o4m2M32J8l4l10J10k00K68J08j34L2k32J43l0N7l2
5544A8J57k02k44K54k36K91j73J69j07K0J87N8r4J8k02K17J40j37m25J93J5pJ64
5567G4q3K67l23J7o2L40k13k96J39L08k19j37M3K50j59m2P0p6R8J50q6M5k15J42
5591C2mQ3q4j86K48m25J88K81q0K76k38k82K78J80n3k62L0M9o6j08m6L39k77J33
5615Fr5J58k46J68R2j12m9J61M1N3o3k23J5J02Jn2n2k8K03k88J82Q8l17L72j47
5640c0M5j1p6q2J14j36P3K73Q5j89N2r8J16j21j13P3n5N9j12P7J16j01K52p0M8
$$ plain form
5470 71 -60 -108 -160 -134 -94 -35 20 -58 -269 198 -129 -46 -5 83 -203 -145 -117 13 -19 96 5 -135 231 98 121
5495 121 -240 -107 -85 258 -74 -159 13 2 -29 83 11 23 148 -55 -209 -228 -7 -150 138 175 178 -22 -95 -168
5519 -168 -25 -31 179 -45 -47 -10 -18 -72 -136 -178 254 272 238 -72 38 -162 106 214 80 112 -120 23 -7 50 18
5544 18 175 -27 -271 -17 -253 38 -135 34 -73 -53 134 192 98 116 -86 131 271 134 -291 -98 -83 -90 74
5567 74 -9 258 -65 -48 -110 230 17 -279 -140 168 -51 -188 -145 105 -54 -96 -26 -102 -4 146 60 105 -110 32
5591 32 28 111 27 -159 89 -336 -148 133 53 329 91 -191 87 267 214 -48 -18 31 -35 -143 -189 150 -127 6
5615 6 -89 69 -177 -9 83 -29 -78 83 124 177 114 -109 -94 8 9 -43 -95 -123 80 -208 -26 62 -255 117 -30
5640 -30 15 4 -72 -154 -40 -176 -103 170 255 66 118 20 136 15 -98 -25 -80 -21 -133 -56 60 -41 211 141 189
5665A89k26j89L10k37L15k57J59J47r1l28M93m01P8j93K39Q6r1K36l9p9j07L6
5687E0J46N3j11l9k35J58l2J70l95L28j12O8j18K39j89P3L0m1r1Q5k16J17M5j29
5711a46K38K01m53J63J46L0l18J01Q0n3r3N9Q1J77l28L10j78L61m51O2no1K09
5734A32l29J23p5R4j66K46j31kJ90P5k48L45l73k0j9J51K12j39J88l70K35J2o3
5757F8p4j11K37j58O3O7j81J82k06M8l9Q7J4P4%m32M48l26K52P2j98Q9j9n5P6
5782b2J80j81O8j47J23P6J6l27J59K14kM5o3j19m9K46l44L0J00L8k23J90J32m04
5806b64L43J02k15l1OL7r7K27r2N3K2J4M7m46K85lol1j5M7R0j98K21J8j98K7J30
5833G3l7j03j13J02j73L74j51l0J57j05P3p7k73K48J50r5j13j96K51K9R8j27k7
$$ plain form
5665 189 -37 -226 84 -153 162 -95 64 211 120 -208 285 -116 -38 -231 8 94 3 239 200 121 14 50
5687 50 196 249 138 99 -136 22 -10 160 -235 93 -19 49 -69 170 -19 54 84 43 -48 37 -179 -62 -17 -146
5711 -146 92 293 -160 3 149 179 -139 -38 42 -11 -104 -45 36 213 -115 195 17 378 -73 -11 -16 -77 132
5734 132 -197 -74 -149 -55 -221 25 -106 -108 82 157 -91 254 -119 -139 -158 -7 205 66 254 -116 119 131 68
5757 68 -6 -117 120 -38 25 92 -89 93 -113 -65 -104 -17 -3 71 71 -361 87 -239 13 85 -113 -24 -43 -98 -22
5782 -22 158 -23 45 -102 21 97 113 -214 -55 159 157 202 139 20 -29 217 -127 -97 3 41 -182 8 140 -264
5806 -264 79 181 -34 -65 -59 -22 -119 108 16 69 91 105 152 -294 -9 -12 -18 -49 -64 -17 73 -125 96 114 -84 -57 73
5833 73 36 -67 -180 -78 -251 123 -28 -58 99 -6 67 -10 -283 -35 115 20 -93 -289 -38 -9 89 -38 -65
5856f5o4p0J47J6j4K40j75K0j76L15l17j27J51K68j83Q2LK2k8j43q8J51m5J58
5880G8l36J53K79k72J22J51m47M36l91J98m7K3K6KR7j33j1lJJ02q6JJ2j49K66
5905G2k18j6K5M4R1rO3J61k11L2l5J21l12RM86k67k39J12Q1j5N6r1K93k42m2r3
5931a44O9j50L01j01R9r9o0%K53k39Q8M4l6J34j83j5O5Pl7j56J3J08M1L1P7K5
5957A35k12K32k36j21N7K75o6k29J20p4L08k00K48j61j37j04J24L53k89j39R0
5978b6J67j65P7j45L48k37Mj90J55K25l08M8K7L6N0k1j83K24j3r6n7k6N8m6K15
6003A21q0J27j76J8J22j22q0p1K44K4j20P6j1l5j03J31n9Q3p6o3J10n3m01L46
6027d8J26j79P3K42j59J18k06J29j24M7o3K56j0m14K10K30j0l37pJ70j34K44k10
$$ plain form
5856 -65 -129 -199 -52 -36 -50 190 15 35 -141 174 -143 -270 -119 149 -34 48 51 73 45 -98 -186 -35 -80 78
5880 78 -258 -105 174 -98 24 175 -272 164 -227 -29 -76 -53 -27 -25 72 -61 -72 -75 -74 28 -58 -57 -45 -194 72
5905 72 -146 -162 -137 -93 -2 -11 52 213 2 34 -1 120 -192 -183 303 36 -203 -91 -10 -25 31 -60 233 -9 -51 -144
5931 -144 -75 -225 76 -25 74 -25 -85 -85 168 -71 17 61 25 159 -24 -39 26 33 -4 -160 -147 -39 2 33 110 135
5957 135 -77 155 -81 -202 -145 130 64 -165 -45 -119 189 -11 237 76 -61 -165 -41 312 23 -116 -26
5978 -26 141 -24 53 -92 256 19 23 -167 -12 213 -95 -47 -20 16 66 45 -138 86 73 -23 -80 -106 -48 -94 121
6003 121 41 168 -8 10 132 10 -70 -141 103 127 7 83 72 37 -66 65 6 89 13 -50 60 7 -394 -48
6027 -48 78 -101 -28 214 55 173 -33 96 -28 19 -44 212 202 -212 -2 228 218 -119 -126 44 -90 154 -56
6050e6R7o0j85L29j30J17j4k36n2L5J25J95l80O8Q4P2%J46k51J50Ql1j32L01l
$$ plain form
6050 -56 41 -19 -204 125 -5 112 98 -138 -190 -155 -30 165 -215 -147 -63 9 9 155 -96 54 62 31 -101 200 197
$$ [...]
8191B21
##END NTUPLES=NMR FID
##END=
