##TITLE=1H_LR-758-R6-3CR24
 CDCl3
 8 sc, 
 26.10.2023
##JCAMPDX= 6.0         $$ Bruker NMR JCAMP-DX V2.0
##DATA TYPE= NMR FID
##DATA CLASS= NTUPLES
##ORIGIN= UXNMR, Bruker Analytische Messtechnik GmbH
##OWNER= root
$$ XWIN-NMR		Version 3.5
$$ Thu Oct 26 14:49:09 2023 Russian Standard Time (UT+4h)  she@DPX200
##.OBSERVE FREQUENCY= 200.13135
##.OBSERVE NUCLEUS= ^1H
##.DELAY= (6, 6)
##.ACQUISITION MODE= SIMULTANEOUS
##.ACQUISITION SCHEME= undefined
##.AVERAGES= 8
##.DIGITISER RES= 18
##SPECTROMETER/DATA SYSTEM= spect
##.PULSE SEQUENCE= zg30
##.SOLVENT NAME= CDCl3
##.SHIFT REFERENCE= (INTERNAL, CDCl3, 0, 15.7039)
##AUDIT TRAIL= $$ (NUMBER, WHEN, WHO, WHERE, WHAT)
$$ ##TITLE= Audit trail, XWIN-NMR		Version 3.5
$$ ##JCAMPDX= 5.01
$$ ##ORIGIN= Bruker BioSpin GmbH
$$ ##OWNER= she
$$ F:/spectra/data/she/nmr/H-F/1/audita.txt
$$ ##AUDIT TRAIL=  $$ (NUMBER, WHEN, WHO, WHERE, WHAT)
(   1,<2023-10-26 14:48:15.18 +0400>,<she>,<DPX200>,
      <created by zg, POWCHK disabled, PULCHK disabled
       configuration hash MD5:
       00 E9 B6 7A A2 85 ED C7 34 08 36 98 17 FE 4E 26
       data hash MD5: 16K
       A6 39 D8 2A CD E5 24 7A 85 98 2E BD 09 20 0D 17>)
$$ ##END=
$$ 
$$ hash MD5
$$ 15 DB B8 44 A9 68 64 21 61 60 2D 51 39 D9 7B 4E
##$RELAX= 
##$RELAX= 
##$RELAX= 
##$RELAX= 
##$RELAX= 
##$RELAX= 
$$ Bruker specific parameters
$$ --------------------------
##$DU= <F:/spectra>
##$EXPNO= 1
##$NAME= <H-F>
##$PROCNO= 1
##$TYPE= <nmr>
##$USER= <she>
##$AMP= (0..31)
100 100 100 100 100 100 100 100 100 100 100 100 100 100 100 100 100 100 
100 100 100 100 100 100 100 100 100 100 100 100 100 100 
##$AQSEQ= 0
##$AQ_mod= 1
##$AUNM= <au_zg>
##$AUTOPOS= <>
##$BF1= 200.13
##$BF2= 200.13
##$BF3= 200.13
##$BF4= 200.13
##$BF5= 200.13
##$BF6= 200.13
##$BF7= 200.13
##$BF8= 200.13
##$BYTORDA= 1
##$CFDGTYP= 0
##$CFRGTYP= 5
##$CHEMSTR= <none>
##$CNST= (0..31)
1 1 145 1 1 1 1 1 1 1 1 1 1 1 1 1 1 1 1 1 1 1 1 1 1 1 1 1 1 1 1 1 
##$CPDPRG= <>
##$CPDPRG1= <>
##$CPDPRG2= <>
##$CPDPRG3= <>
##$CPDPRG4= <mlev>
##$CPDPRG5= <mlev>
##$CPDPRG6= <mlev>
##$CPDPRG7= <mlev>
##$CPDPRG8= <mlev>
##$CPDPRGB= <>
##$CPDPRGT= <>
##$D= (0..31)
0 1.2 0 0 0 0 0 0 0 0.06 0 0.03 0 0 0 0 0.0002 0 0 0 0 0 0 0 0 0 0 0 0 
0 0 0 
##$DATE= 1698317294
##$DBL= (0..7)
120 120 120 120 120 120 120 120 
##$DBP= (0..7)
150 150 150 150 150 150 150 150 
##$DBP07= 0
##$DBPNAM0= <>
##$DBPNAM1= <>
##$DBPNAM2= <>
##$DBPNAM3= <>
##$DBPNAM4= <>
##$DBPNAM5= <>
##$DBPNAM6= <>
##$DBPNAM7= <>
##$DBPOAL= (0..7)
0.5 0.5 0.5 0.5 0.5 0.5 0.5 0.5 
##$DBPOFFS= (0..7)
0 0 0 0 0 0 0 0 
##$DE= 6
##$DECBNUC= <off>
##$DECIM= 32
##$DECNUC= <off>
##$DECSTAT= 4
##$DIGMOD= 1
##$DIGTYP= 9
##$DL= (0..7)
0 120 120 120 120 120 120 120 
##$DP= (0..7)
150 150 150 150 150 150 150 150 
##$DP07= 0
##$DPNAME0= <>
##$DPNAME1= <>
##$DPNAME2= <>
##$DPNAME3= <>
##$DPNAME4= <>
##$DPNAME5= <>
##$DPNAME6= <>
##$DPNAME7= <>
##$DPOAL= (0..7)
0.5 0.5 0.5 0.5 0.5 0.5 0.5 0.5 
##$DPOFFS= (0..7)
0 0 0 0 0 0 0 0 
##$DQDMODE= 0
##$DR= 18
##$DS= 0
##$DSLIST= <SSSSSSSSSSSSSSS>
$$ [...]
##$SUBNAM2= <"">
##$SUBNAM3= <"">
##$SUBNAM4= <"">
##$SUBNAM5= <"">
##$SUBNAM6= <"">
##$SUBNAM7= <"">
##$SUBNAM8= <"">
##$SUBNAM9= <"">
##$SW= 18.05172834244
##$SWIBOX= (0..15)
0 0 2 0 0 0 0 0 0 0 0 0 0 0 0 0 
##$SW_h= 3612.71676300578
##$TD= 16384
##$TD0= 1
##$TE= 0
##$TE2= 300
##$TE3= 300
##$TEG= 300
##$TL= (0..7)
0 120 120 120 120 120 120 120 
##$TP= (0..7)
150 150 150 150 150 150 150 150 
##$TP07= 0
##$TPNAME0= <>
##$TPNAME1= <>
##$TPNAME2= <>
##$TPNAME3= <>
##$TPNAME4= <>
##$TPNAME5= <>
##$TPNAME6= <>
##$TPNAME7= <>
##$TPOAL= (0..7)
0.5 0.5 0.5 0.5 0.5 0.5 0.5 0.5 
##$TPOFFS= (0..7)
0 0 0 0 0 0 0 0 
##$TUNHIN= 0
##$TUNHOUT= 0
##$TUNXOUT= 0
##$USERA1= <user>
##$USERA2= <user>
##$USERA3= <user>
##$USERA4= <user>
##$USERA5= <user>
##$V9= 5
##$VALIST= <valist>
##$VCLIST= <CCCCCCCCCCCCCCC>
##$VD= 0
##$VDLIST= <DDDDDDDDDDDDDDD>
##$VPLIST= <PPPPPPPPPPPPPPP>
##$VTLIST= <TTTTTTTTTTTTTTT>
##$WBST= 1024
##$WBSW= 4
##$XGAIN= (0..3)
0 0 0 0 
##$XL= 0
##$YL= 0
##$YMAX_a= 158007
##$YMIN_a= -191104
##$ZGOPTNS= <>
##$ZL1= 120
##$ZL2= 120
##$ZL3= 120
##$ZL4= 120
##$ABSF1= 10
##$ABSF2= 0
##$ABSG= 5
##$ABSL= 3
##$ALPHA= 0
##$AQORDER= 0
##$ASSFAC= 0
##$ASSFACI= 0
##$ASSFACX= 0
##$ASSWID= 0
##$AUNMP= <proc_1d>
##$AZFE= 0.1
##$AZFW= 0.1
##$BCFW= 1
##$BC_mod= 2
##$BYTORDP= 1
##$COROFFS= 0
##$CY= 11.3945322036743
##$DATMOD= 1
##$DC= 2
##$DFILT= <>
##$DTYPP= 0
##$F1P= 15.7292609196834
##$F2P= 12.9074282941183
##$FCOR= 0.5
##$FTSIZE= 0
##$FT_mod= 4
##$GAMMA= 1
##$GB= 0.15
##$INTBC= 1
##$INTSCL= 1
##$ISEN= 128
##$LB= 0.24
##$LEV0= 0
##$LPBIN= 0
##$MAXI= 10000
##$MC2= 0
##$MEAN= 0
##$ME_mod= 0
##$MI= 1.114404
##$NCOEF= 0
##$NC_proc= 0
##$NLEV= 6
##$NOISF1= 3.799351
##$NOISF2= 2.8
##$NSP= 1
##$NTH_PI= 0
##$NZP= 0
##$OFFSET= 15.70392
##$PC= 1
##$PHC0= -23506.96
##$PHC1= 8.052721
##$PH_mod= 1
##$PKNL= yes
##$PPARMOD= 0
##$PSCAL= 0
##$PSIGN= 0
##$REVERSE= no
##$SF= 200.130013532006
##$SI= 16384
##$SIGF1= 3
##$SIGF2= 2
##$SINO= 400
##$SIOLD= 16384
##$SREGLST= <1H.CDCl3>
##$SSB= 0
##$STSI= 0
##$STSR= 0
##$SW_p= 3612.71676300578
##$SYMM= 0
##$S_DEV= 0
##$TDeff= 0
##$TDoff= 0
##$TI= <>
##$TILT= no
##$TM1= 0
##$TM2= 0
##$TOPLEV= 0
##$USERP1= <user>
##$USERP2= <user>
##$USERP3= <user>
##$USERP4= <user>
##$USERP5= <user>
##$WDW= 1
##$XDIM= 8192
##$YMAX_p= 0
##$YMIN_p= 0
$$ End of Bruker specific parameters
$$ ---------------------------------
##NTUPLES= NMR FID
##VAR_NAME=  TIME,          FID/REAL,        FID/IMAG
##SYMBOL=    X,             R,               I
##VAR_TYPE=  INDEPENDENT,   DEPENDENT,       DEPENDENT
##VAR_FORM=  AFFN,          ASDF,            ASDF
##VAR_DIM=   8192,          8192,            8192
##UNITS=     SECONDS,       ARBITRARY UNITS, ARBITRARY UNITS
##FACTOR=    0.0002768,     1,               1
##FIRST=     0,             0,               0
##LAST=      2.2672688,     0,               0
##MIN=       0,             -191104,         0
##MAX=       2.2672688,     158007,          0
$$ Real data points
##PAGE= N=1
##DATA TABLE= (X++(R..R)), XYDATA
$$ [...]
$$ plain form
1781 -536 -109 668 30 -504 846 725 -124 423 1007 -142 -13 691 120 -571 247 211 -793 135 337
1800 337 -750 -867 129 -393 -1087 111 63 -854 -384 271 -525 -435 498 103 -582 42 680 -1 -41 847
1820 847 162 -592 520 613 -47 487 717 -293 -51 901 328 -658 540 457 -569 -13 635 -219 -650
1839 -650 257 86 -669 37 354 -442 -159 304 193 -350 462 410 -656 70 598 -413 -265 416 -4 -915
1859 -915 131 319 -736 -216 411 -423 -822 371 -192 -609 -360 222 -687 -320 198 -32 -425 329 364
1878 364 -485 661 964 -24 -66 1043 506 -58 819 810 108 263 634 55 -132 541 125 -441 -129 300
1898 300 -398 -298 280 -497 -639 -7 101 -723 -246 183 -743 -400 568 -18 -747 342 300 -466 226 561
1918 561 -41 -194 629 33 -426 248 294 -354 -278 315 -219 -430 109 78 -821 -225 156 -691 -617 356 -137
$$ packed form
1781e36M27P77o38n34J350j21q49N47N84j149J29P04n71o91Q18l6j004R28K02
1800C37j087j17R96n22o94J198m8r17M70O55p96R0R33l95o85O24O38o81m0Q88
1820H47o85p54J112R3o60N34K30j010K42R52n73r86J198q3j026N56O48q54m31
1839f50R07j71p55P06L17p96K83M63j11n43Q12n2j066P26N28j011J48O81m20r11
1859i15J046J88j055N20O27q34l99J193n63m17K49N82r09L67N18k30l93P54L5
1878C64q49J146L03r88m2J109n37n64Q77rp02J55L71n79j87O73m16n66L12M29
1898C00o98J00N78p77j42O32J08q24M77M29r26L43R68n86p29J089m2p66O92L35
1918E61o02j53Q23n96m59O74M6o48P6N93n34k11N39l1q99N96L81q47P4R73m93
$$ plain form
1939 -137 -600 319 354 -391 133 746 -131 6 455 454 -15 647 599 -68 28 846 35 -264 359 508 -455 -172
1961 -172 405 -365 -578 143 -200 -848 92 -99 -997 -395 99 -462 -614 302 210 -405 317 491 -347 -92
1981 -92 474 201 -373 535 539 -456 189 565 -309 -360 623 -95 -867 350 140 -653 -165 115 -416 -414 307 4
2003 4 -599 1 494 -484 -37 467 248 -34 539 372 74 464 932 42 83 877 430 -450 346 334 -481
2024 -481 179 395 -550 -495 228 -487 -655 -204 -21 -690 -653 20 -633 -510 328 147 -510 139 460 -86 53
2045 53 746 348 -87 388 743 -115 392 769 168 -100 713 281 -347 291 572 -305 -169 321 -399 -521
2065 -521 142 -218 -518 -36 321 -394 -161 389 -225 -439 600 371 -256 133 611 2 -320 819 270
2084 270 -43 466 472 -535 -61 235 -353 -630 291 -140 -379 -524 284 -558 -358 194 -538 -237 144 27
$$ packed form
1939a37m63R19L5p45N24O13q77J37M49jm69O62m8o67R6Q18q11k99O23J49r63K83
1961a72N77p70k13P21l43o48R40j91q98O02M94n61j52R16r2o15P22J74q38K55
1981i2N66k73n74R08Mr95O45L76q74n1R83p18p72J217k10p93M88K80n31KP21l03
2003Do03O00M93r78M47N04k19k82N73j67k98L90M68q90M1P94m47q80P96j2q15
2024d81O60K16r45N5P23p15j68M51J83o69L7O73o53J23Q38j81o57O49L21n46J39
2045E3O93l98m35M75L55q58N07L77o01k68Q13m32o28O38K81q77J36M90p20j22
2065e21O63l60l00M82L57p15K33N50o14k14J039k29o27L89M78o09l22J139n49
2084B70l13N09Oj007M74K96n88k77R21m31k39j45Q08q42K00N52p32L01L81j17
$$ plain form
2104 27 -245 235 361 99 -153 630 344 43 476 513 37 448 570 169 -42 441 34 -261 -302 442 -662
2125 -662 -379 144 -410 -447 -135 99 -538 -110 192 -541 -589 319 70 -396 273 344 -201 -85 569 -85 9
2146 9 651 594 -217 185 565 -261 51 203 -52 -446 220 -92 -424 -208 233 -480 -631 -32 -110 -700 50
2167 50 192 -519 169 346 -266 -426 193 372 104 462 236 249 195 727 360 -152 406 417 -40 205 409
2188 409 -147 -163 235 32 -345 -146 24 -386 -315 120 -323 -480 4 -115 -336 -81 276 -425 -10 402 150
2209 150 -312 153 481 -284 324 654 -252 28 591 143 -393 172 125 -365 -173 383 -343 -197 -72 -190
2229 -190 -596 -203 82 -393 -230 303 138 -180 364 246 -222 71 739 269 -204 759 172 -367 398 182
2249 182 -190 -289 708 -134 -196 320 -149 -545 -191 111 -506 -435 210 -473 -419 77 -13 -355 -67 171 -137 104
$$ packed form
2104B7k72M80J26k62k52P83k86l01M33L7m76M11J22m01k11M83m07k95m1P44j104
2125f62K83N23n54l7L12K34o37M28L02p33m8R08k49m66O69P1n45J16O54o54R4
2146IO42n7q11M02L80q26L12J52k55l94O66l12l32K16M41p13j51N99p8n90P50
2167E0J42p11O88J77o12j60O19J79k68L58k26J3n4N32l67n12N58J1m57K45K04
2188D09n56j6L98k03l77J99J70m10P1M35m43j57M84j19k21K55L57p01M15M12k52
2209A50m62M65L28p65O08L30r06K80N63m48n36N65m7m90J92N56p26J46J25j18
2229a90m06L93K85m75J63N33j65l18N44j18m68K93O68m70m73R63n87n39P65k16
2249A82l72r9R97q42o2N16m69l96L54L02o17P1O45o83N4M96r0l42K88K38l08K41
$$ plain form
2271 104 393 92 -35 -94 377 -64 22 685 -11 -97 351 128 -324 153 417 -261 -274 525 -196 -241 126 -4
2293 -4 -176 53 199 -311 -84 292 -67 -215 -112 178 -162 145 275 -123 -181 186 54 -49 441 252 -349
2314 -349 -323 145 -194 -441 44 119 -463 -65 69 -432 -132 36 -58 -216 65 130 -252 233 402 -71 -132 471
2336 471 263 -61 219 357 -52 203 545 233 -50 200 94 -365 2 126 -39 -414 200 70 -679 61
2356 61 79 -508 -106 111 -265 -145 241 183 -261 55 178 -387 201 218 -48 -172 250 7 20 32 260 17
2378 17 -235 248 -59 -230 27 150 -78 -23 228 -8 -156 258 50 -220 145 111 21 -172 232 -202 -83
2399 -83 442 -14 -68 188 99 -71 -142 357 2 -220 297 -3 -107 3 241 -65 -270 93 10 -303 36 -151
2421 -151 -476 -265 232 -50 -388 235 161 -231 -168 428 -99 168 339 -201 -103 134 264 -164 -82 187 -148
$$ packed form
2271A04K89l01j27n9M71m41Q6O63o96q6M48k23m52M77K64o78j3P99p21m5L67j30
2293dj72K29J46n10K27L76l59j48J03K90l40L07J30l98n8L67j32j03M90j89o01
2314c49K6M68l39k47M85P5n82L98J34n01L00J68r4j58K81O5l82M85J69m73o1O03
2336D71k08l24K80J38m09K55L42l12k83K50j06m59L67J24j65l75O14j30p49P40
2356F1J8n87M02K17l76J20L86n8m44L16J23n65N88J7k66j24M22k43J3J2K28k43
2378A7k52M83l07j71K57J23k28N5K51k36j48M14k08k70L65l4r0j93M04m34J19
2399h3N25m56n4K56q9j70p1M99l55k22N17l00j04J10K38l06k05L63q3l13L39j87
2421a51l25K11M97k82l38O23p4l92O3N96n27K67J71n40R8K37J30m28Q2K69l35
$$ plain form
2442 -148 -39 174 -101 -293 22 464 -454 -96 409 -60 -169 -76 -4 -214 126 317 -149 -368 123 59 40
2463 40 285 289 168 138 309 41 -16 261 172 20 49 308 -466 -22 55 -208 -389 -68 -30 -429 -124 -357 -522
2486 -522 -157 190 74 -218 167 47 -175 -204 97 -32 -171 242 288 -28 282 138 -103 333 329 23 -196
2507 -196 391 68 -229 72 87 -295 -77 53 -169 -268 -52 -2 -265 -208 -22 -160 -100 62 48 -21 102 210
2529 210 -306 133 97 190 164 218 73 -165 56 18 -97 -66 -31 -191 -165 167 38 -403 -274 173 -315 -229 24
2552 24 -27 -432 135 111 -118 12 346 -103 52 409 366 29 289 237 -220 63 199 -79 17 -110 -127 -492
2574 -492 154 414 -389 44 181 -103 -437 -336 164 -157 -276 267 -149 -61 103 214 -165 -132 -12 -263 -231
2595 -231 223 113 -142 177 179 -49 -25 444 -65 -66 174 -201 122 261 -112 -573 136 55 -267 -421 -87 37
$$ packed form
2442a48J09K13k75j92L15M42r18L58N05m69j09R3P2k10L40J91m66k19M91o4j9
2463D0K45Mj21l0J71k68n7K77q9j52K9K59p74M44P7k63j81L21L8l99L05k33j65
2486e22L65L47j16k92L85j20k22k9L01j29j39M13M6l16L10j44k41M36ml06k19
2507a96N87l23k97L01J5l82K18J30k22r9K16N0k63N7J86j38O0J62j4o9J23J08
2529B10n16M39l6R3k6N4j45k38K21l8j15L1L5j60K6L32j29m41J29M47m88Q6K53
2552B4n1m05N67k4k29J30L34m49J55L57m3l37K60n2m57K83J36k78R6j27j7l65
2574d92O46K60q03M33J37k84l34J01N00l21j19N43m16Q8J64J11l79L3J20k51L2
2595b31M54j10k55L19Kk28K4M69n09jK40l75L23J39l73m61P09q1l22j54L34J24
$$ plain form
2617 37 -278 -153 3 -249 -239 149 117 -95 184 118 -196 259 496 83 10 582 -82 -195 315 254 -309 307
2639 307 311 -132 -63 204 -47 -464 -383 162 -567 -269 -11 -370 -169 -20 71 -40 -49 -130 -197 -108 361 88 -58
2662 -58 279 279 -79 2 181 35 36 145 -80 -126 -3 117 -442 -237 29 -306 -325 12 -104 -171 129 42 -233
2685 -233 -85 202 38 -41 78 227 38 -43 253 38 64 227 178 79 222 214 -80 -148 141 -118 -166 275 -129
2708 -129 -218 -177 -90 -330 -218 107 -267 -280 141 97 44 157 286 90 104 419 164 133 18 30 -14 44 274 5
2732 5 -285 243 -19 -24 388 286 -340 -218 55 -188 -313 -25 240 -367 101 95 -280 -367 119 146 -213 96 157
2755 157 -53 34 397 257 -275 276 216 156 137 255 -36 11 66 -118 -296 108 -23 -248 -208 29 -193 -142 132
2778 132 -9 -421 83 154 -274 -273 308 -110 155 77 -61 -53 -52 2 -74 226 203 -17 193 120 -247 -197 76 175 -154
$$ packed form
2617C7l15J25J56k52J0L88l2k12K79o6l14M55K37m13p3N72o64j13N10o1n63O16
2639C07Mm43O9K67k51m17Q1N45p29K98K58l59K01J49R1j11rq1o7Q9M69k73j46
2662e8L37%l58Q1J79j46JJ09k25m6J23J20n59K05K66l35j9L37j16o7L00q7k75
2685b33J48K87j64p9J19J49j89q1K96k15K6J63m9r9J43qk94o8K89k59m8M41m04
2708a29q9M1Q7k40J12L25l74j3M21m4n3J13J29j96J4L15k55l1j15J2m4N8K30k69
2732Ek90N28k62nM12j02o26J22K73k43j25K88K65o07M68ol75q7M86K7l59L09O1
2755A57k10Q7L63j40n32N51o0o0j9J18k91M7N5j84j78M04j31k25M0K37k22N1K74
2778A32j41m12N04P1m28JN81m18K65p8j38QJN4p6L00k3k20K10p3l67N0K73R9l29
$$ plain form
2803 -154 62 95 19 -235 12 -41 -54 -88 62 0 -315 253 224 -289 105 171 -150 172 103 -17 -263 161 154 280
2827 280 91 8 -38 -54 -52 30 -340 113 215 -198 -35 -16 -383 -207 -48 11 -220 52 207 -205 -16 -58 124
2850 124 -169 91 15 198 161 261 398 -136 194 30 41 203 279 -3 -92 113 -157 -427 75 -97 -195 -35
2872 -35 106 -244 -138 138 35 -260 170 -27 -271 -130 -174 20 -11 223 179 115 -3 384 45 130 158 183 44
2895 44 0 153 -51 87 -15 -217 -102 -59 -107 -208 122 46 -179 30 74 -252 157 36 -74 -3 123 282
2917 282 -86 -80 196 240 -41 262 114 -347 -121 313 -1 -2 105 3 -157 125 199 -111 106 -56 73 -16
2939 -16 -56 77 -56 124 46 -160 -89 161 -246 -15 380 388 -113 166 272 22 120 184 -144 -85 -50 -76 -74 -100 -39
2964 -39 -316 -78 289 -182 -130 -155 -151 -168 -372 -138 -195 -240 90 -80 25 50 172 -107 57 289 16 123 150
$$ packed form
2803a54K16L3p6k54K47n3j3l4J50o2l15N68k9n13L94O6l21L22o9j20k46M24pJ26
2827B80j89q3m6j6KQ2l70M53J02m13J63J9l67J76J59N9k31K72J55m12J89m2J82
2850A24k93K60p6J83l7J00J37n34L30j64J1J62P6k82q9K05k70k70N02j72r8J60
2872c5J41l50J06K76j03k95M30j97k44J41m4J94l1K34m4o4j18L87l39Q5K8K5j39
2895D4m4J53k04J38j02k02J15M3m8j01L30p6k25K09M4l26M09j21j10P1J26J59
2917B82l68OK76M4k81L03j48m61K26M34l14jJ07j02j60K82P4l10K17j62J29q9
2939a6m0J33j33J80p8k06P1K50m07K31L95Qn01K79J06k50R8O4l28N9L5k6Kk6O1
2964c9k77K38L67m71N2k5Mj7k04K34n7m5L30j70J05K5J22k79J64K32k73J07K7
$$ plain form
2987 150 236 42 153 -133 271 118 136 -95 -2 237 -3 40 -237 72 -121 -216 104 -15 -142 -54 60 94
3009 94 -46 122 -181 -176 34 252 -102 65 30 92 114 457 130 -125 166 67 -11 145 192 -362 89 108 -86
3032 -86 -201 -265 -107 17 37 171 -291 48 43 -33 -252 27 218 -5 0 230 -41 -127 186 125 -160 181 -37
3055 -37 -240 111 136 -26 -371 58 86 -91 122 62 137 -85 -178 124 -68 -83 201 -338 -107 181 -3 -209
3077 -209 4 161 22 162 159 -59 -126 164 144 -65 433 233 151 -28 27 -123 -181 -171 -31 -81 -184 -130 41
3100 41 -119 -77 105 -10 -73 -35 -104 29 -53 -143 51 403 186 -27 272 96 142 238 69 127 34 -33 194 -161
3124 -161 120 -106 -60 -129 -3 -120 -253 -8 27 2 68 177 -158 -285 -97 -223 18 84 282 -116 -107 331 45
3147 45 1 101 -81 -12 144 340 -33 -84 72 -49 32 -15 124 13 -28 209 24 -123 -105 -56 -143 -18 -52 11
$$ packed form
2987A50Q6j94J11k86M04j53J8k31R3K39k40M3k77L09j93r5L20j19j27Q8J14L4
3009I4j40J68l03NK10K18l54J67l5O2K2L43l27k55K91r9p8J56M7n54M51J9j94
3032h6j15o4J58J24K0J34m62L39np6k19K79J91k23NK30k71q6L13o1k85L41k18
3055c7k03L51K5j62l45M29K8j77K13o0P5k22r3L02j92j5K84n39K31K88j84k06
3077b09K13J57j39J40lk18o7K90k0k09M98k00q2j79N5j50n8J0J40n0j03N4J71
3100D1j60M2J82j15o3L8o9J33q2r0J94L52k17k13K99j76M6R6j69N8r3o7K27l55
3124a61K81k26M6o9J26j17j33K45L5k5O6J09l35j27J88j26K41O6J98l98RM38k86
3147D5m4J00j82O9J56J96l73n1J56j21Q1m7J39j11m1K37j85j47J8M9q7J25l4O3
$$ plain form
3171 11 -14 137 105 -109 161 47 79 465 238 188 -64 142 -73 -21 243 286 65 282 -78 -363 -84 21
3193 21 -92 -58 -68 -97 0 -145 -9 57 103 -1 65 -26 -115 269 73 128 226 97 114 -13 183 -195 41 227
3217 227 -2 34 -96 -146 -163 -87 -76 -266 -207 -85 -12 -125 -288 36 -8 246 182 -23 3 130 32 194 169 -94
3241 -94 -13 314 259 270 69 206 76 21 63 92 -67 73 -48 -234 -147 -4 -114 -119 -42 56 -21 -100 224 -63 -279
3266 -279 12 -193 -239 -43 -46 -131 49 121 -13 109 -15 242 104 90 -155 -121 -189 210 -165 -28 -145 -3 -74
3289 -74 -153 47 -111 -2 124 118 -207 -29 196 117 -118 92 -85 -122 -54 165 -52 108 285 140 107 -153 129
3312 129 -116 -174 53 -175 -137 172 -79 -254 -173 -158 39 -48 173 -62 -169 60 -159 -68 181 180 -149 108 296
3335 296 -96 -17 38 160 103 -118 124 92 210 68 225 -96 -194 -61 -264 -74 -28 -53 -158 -383 77 -342
$$ packed form
3171A1k5J51l2k14K70j14L2L86k27n0k52K06k15N2K64M3k21K17l60k85K79J05
3193B1j13L4j0k9R7j45J36O6M6j04O6r1q9L84j96N5R8j29J7j27J96l78K36J86
3217B27k29L6j30n0j7P6J1j90N9J22P3j13j63L24m4K54o4k05K6J27r8J62k5k63
3241i4Q1L27n5J1k01J37j30n5M2K9j59J40j21j86Q7J43j10nP7R8p7p9L24k87k16
3266b79K91k05m6J96lq5J80P2j34J22j24K57j38j4k45L4o8L99l75J37j17J42p1
3289g4p9K00j58J09J26ol25J78K25p9k35K10j77l7O8K19k17J60J77j45l3k60K82
3312A29k45n8K27k28L8L09k51j75Q1J5J97q7K21k35j07K29k19R1K49jl29K57J88
3335B96l92P9N5J22n7k21K42l2J18j42J57l21r8J33k03J90M6k5j05k25M60m19
$$ plain form
3357 -342 -152 43 -95 -75 27 -97 -391 -297 -65 -125 134 71 3 -35 53 121 -80 35 44 121 -26 384 -283 -302
3381 -302 108 -72 -221 23 12 -243 -37 291 -90 89 -87 4 -161 -7 0 -17 -10 44 139 -232 -10 -26 144
3404 144 137 214 -23 -43 105 -64 168 105 8 -37 17 37 25 -68 -33 -175 -242 -166 -145 -263 -74 201 -37 -71 -114 177
3430 177 61 -94 -9 -182 25 -145 -71 138 17 112 1 -126 203 -132 56 -39 141 -150 123 -12 -33 -80
3452 -80 -251 -53 -10 -141 115 -69 -46 -54 -67 159 156 2 232 286 280 231 95 13 -95 -43 16 -91 -271 163 121
3477 121 115 194 -144 45 -187 -57 -243 -136 -65 -66 -101 -79 -17 -192 -102 96 -179 337 -217 191 68 260 133
3500 133 99 -142 350 217 17 110 118 97 59 144 48 -2 -114 43 23 67 -119 -25 66 27 -77 -31 -253 43 -169
3525 -169 -173 -78 -25 -12 155 -58 -68 -277 121 218 -129 108 113 113 -90 -24 133 -3 82 46 -162 -67 -99 -171 -145 -69
$$ packed form
3357c42J90J95j38K0J02j24k94R4K32o0K59o3o8l8Q8O8k01J15RP7j47M10o67j9
3381c02M10j80j49K44j1k55K06L28l81J79j76R1j65J54Pj7PN4R5l71K22j6J70
3404A44pP7k37k0J48j69K32o3r7m5N4K0j2r3L5j42o7P6K1j18J89K75k38l4m3K91
3430A77j16j55Q5j73K07j70P4K09j21R5j11j27L29l35J88r5J80k91K73j35k1m7
3452h0j71J98M3j31K56j84K3qj3K26lj54K30N4om9j36q2j08N2N9j07j80M34m2
3477A21oP9l38J89k32J30j86J07P1jl5K2O2j75R0J98k75N16n54M08j23J92j27
3500A33l4k41M92j33k00R3Qk1l8Q5r6n0j12J57k0M4j86R4R1l9j04M6k22K96k12
3525a69mR5N3J3J67k13j0k09L98R7l47K37N%k03O6J57j36Q5l6k08R5l2p2K6P6
$$ plain form
3551 -69 36 -212 80 -24 0 109 42 -124 -32 151 -15 -165 169 155 151 39 181 77 -48 142 -38 -14 173
3574 173 12 42 -19 13 -325 -21 86 170 -74 113 -57 239 29 -158 -98 -88 -61 -44 -37 -258 -89 -210 -47
3597 -47 -94 44 186 169 11 274 224 23 -172 128 107 -87 -317 -55 -114 -80 -177 -12 29 -80 -20 -35 -103 -10
3621 -10 233 39 -121 -18 -90 -347 -18 196 -43 -14 159 143 -22 204 403 54 42 206 -69 -4 -40 -190
3643 -190 -297 61 151 -147 -30 24 -144 62 -13 -105 -62 82 166 -98 91 -47 55 113 -16 33 83 145 21
3666 21 29 11 163 44 -15 55 -82 283 128 5 227 -32 -94 -41 -202 51 -76 -135 10 171 -77 151 -99
3689 -99 211 -17 62 -7 203 105 -69 222 170 -150 -54 -29 -200 189 37 -132 -10 -93 -131 32 -127 -185 -211 125
3713 125 -156 -240 196 -150 -225 134 -39 117 164 203 -5 -47 321 -29 14 85 -41 85 98 93 -57 -124 22 -62
$$ packed form
3551f9J05k48K92j04K4J09o7j66R2J83j66j50L34j4mj12J42j04j25J90j80K4J87
3574A73j61L0o1L2l38L04J07Q4k44J87j70K96k10j87O0J0K7J7Pk21J69j21J63
3597d7m7J38J42j7j58K63n0k01j95L00k1j94k30K62n9L4r7J65M1j09O0j5o8R3
3621a0K43j94j60J03p2k57L29K14k39K9J73j6j65K26J99l49j2J64k75O5l6j50
3643a90j07L58R0k98J17N4j68K06p5r2M3J44Q4k64J89j38J02N8j29M9N0O2j24
3666B1Qj8J52j19n9P0j37L65j55j23K22k59o2N3j61K53j27n9J45J61k48K28k50
3689i9L10k28P9o9K10r8j74K91n2l20R6K5j71L89j52j69J22q3l8J63j59n8k6L36
3713A25k81q4M36l46p5L59j73J56M7L9k08m2L68l50M3P1j26J26J3nj50o7J46q4
$$ plain form
3737 -62 -21 -66 9 23 -68 141 -113 -73 88 59 -107 -10 6 162 4 77 88 -45 246 139 -124 18 35 189
3761 189 -5 -26 -18 87 17 188 -14 54 168 21 -40 -29 69 -310 -62 52 -111 -85 -22 127 -198 185 96 -215
3785 -215 153 33 -46 167 244 -104 -203 -45 343 12 28 180 1 -177 -204 -19 -157 -49 -18 -114 -145 92 -160
3808 -160 24 -53 -18 -107 9 -124 101 183 173 -91 -81 156 20 -142 -6 35 13 -16 -112 18 97 35 108 -284
3832 -284 12 26 -33 19 79 -116 -7 -106 56 -28 135 -74 -138 -315 -219 17 -18 174 214 -176 -96 78 32 16
3856 16 -217 21 76 81 18 111 -129 -4 -120 63 -91 99 140 -87 93 -199 -54 -173 44 -66 -38 -85 -17
3879 -17 -4 101 -9 84 -55 171 5 6 30 -77 33 86 144 -136 -309 -62 13 86 4 -139 -282 -26 -153 37
3903 37 -179 200 -31 -265 108 -41 -250 -36 154 -156 180 91 171 245 32 161 72 91 244 190 11 89 -19
$$ packed form
3737f2M1m5P5J4r1K09k54M0J61k9j66R7J6J56j58P3J1j33K91j07k63J42J7J54
3761A89j94k1QJ05p0J71k02O8J14j47o1J1R8l79K48J14j63K6O3J49l25L83q9l11
3785b15L68j20p9K13P7l48r9J58L88l31J6J52j79j78k7J85j38J08L1r6l1K37k52
3808a60J84p7L5q9J16j33K25Q2j0k64J0K37j36j62J36M1k2k9r6J30P9o2P3l92
3832b84K96J4n9N2O0j95J09r9J62q4J63k09o4j77R6K36l5J92M0l90Q0J74m6j6
3856A6k33K38N5No3R3k40J25j16J83j54J90M1k27J80k92J45j19K17j10K8m7O8
3879a7J3J05j10R3j39K26j66JK4j07J10N3N8k80j73K47P5P3q2j43j43K56j27J90
3903C7k16L79k31k34L73j49k09K14J90l10L36q9Q0P4k13J29q9J9J53n4j79P8j08
$$ plain form
3926 -19 97 23 9 14 88 10 -452 -106 23 41 -23 -79 -246 -12 -142 155 -181 45 57 257 -78 -78 13 -46 -16
3951 -16 77 218 -92 92 112 -172 -134 70 -54 -231 -32 14 -77 -210 -146 -113 -69 -157 -124 -25 407 117 120 169 -25
3976 -25 17 -35 362 -73 -85 -167 211 -22 105 -21 108 131 -43 -46 8 -23 -33 14 -140 18 54 -71 13 -132 37
4001 37 -31 72 31 -201 278 124 -71 -73 -221 -134 -94 -4 37 -160 24 -108 16 70 221 -208 -77 -231 -29
4024 -29 -100 433 33 -50 36 84 -187 -41 -106 49 56 -1 278 86 -253 -128 -21 -27 9 122 43 -43 250 -26 -2
4049 -2 245 54 100 323 133 50 -92 19 -67 37 -38 -15 -123 159 -128 -57 -77 67 -121 -23 -125 70 61 17
4073 17 -87 -45 61 -41 -130 161 76 169 110 -153 -6 -140 -34 -83 104 -284 -181 33 -225 91 203 -51
4095 -51 -92 -135 -239 -33 36 -134 -57 -2 -82 45 -96 104 6 82 -139 -107 12 182 -68 75 -113 49 -5 -9
$$ packed form
3926a9J16p4j4NP4p8m62L46J29J8o4n6j67K34j30K97l36K26J2K00l35%R1n9L0
3951a6R3J41l10J84K0k84L8K04j24j77J99M6r1j33O4L3M4q8L3R9M32k90LM9j94
3976b5M2n2L97m35j2q2L78k33J27j26J29K3j74lN4l1j0M7j54J58L6j25Q4j45J69
4001C7o8J03m1k32M79j54j95kj48Q7M0R0M1j97J84j32J24N4J51m29J31j54K02
4024b9p1N33m00q3Q6M8k71J46o5J55Pn7K79j92l39J25J07oL6J13p9q6K93k76K4
4049bK47j91M6K23j90q3j42J11q6J04p5K3j08K82k87P1k0J44j88R8j02J95rm4
4073A7j04M2J06j02q9K91q5R3n9k63J47j34J06m9J87l88J03K14k58L16J12k54
4095e1m1m3j04K06O9j70P7N5q0J27j41K00r8P6k21L2J19J70k50J43j88J62n4m
$$ plain form
4119 -9 -63 -173 21 -168 -30 -123 -110 160 117 8 -67 252 112 -97 198 -87 82 111 206 -128 -63 -62 -22 41 78
4144 78 205 -97 -71 36 -67 -15 37 63 94 40 194 65 -239 11 -164 -275 -166 -185 -119 75 94 89 12 -24 3
4169 3 -172 -87 104 -143 -146 65 25 244 -145 -26 60 271 -43 90 291 70 187 -65 -30 136 201 86 -87
4192 -87 -43 -259 -93 -168 -162 -93 54 -2 -70 92 -64 -272 -106 6 -181 86 -123 -61 131 112 110 113 -90 -51 175
4217 175 -162 187 104 -34 -105 -2 106 -16 -9 -14 -10 -125 -116 -160 -2 -113 -109 -133 -134 36 225 -69 98 84 -84 29
4243 29 -142 -254 -156 -49 60 73 -50 3 179 135 -125 -38 9 -100 -69 65 192 81 25 79 -21 38 80 112
4267 112 108 124 142 -351 188 46 -80 -81 59 -142 41 62 -26 82 -57 -2 -89 -257 4 35 -306 36 -18 -81
4291 -81 -236 -24 -132 -143 20 -33 -202 -67 16 119 -227 -16 35 103 142 -10 265 174 -91 108 154 196 -153
$$ packed form
4119in4j10J94j89J38r3J3K70m3j09p5L19j40k09K95k85J69K9R5l34O5JM0O3L7
4144G8J27l02K6J07j03N2N2K6L1n4J54j29l04K50j75j11J09j9O6J94J9np7l6K7
4169Cj75Q5J91k47lK11m0K19l89J19Q6K11l14J33K01k21J17k52L5J66O5j15j73
4192h7M4k16J66p5OO9J47n6o8J62j56k08J66J12j87K67k09O2J92j9kLk03L9K26
4217A75l37L49q3j38p1J03J08j22PnMj15Rm4J58j11Mk4jJ70J89k94J67j4j68J13
4243B9j71j12R8J07J09J3j23N3J76m4k60Q7M7j09L1J34J27j11n6N4j00N9M2L2
4267A12mJ6J8m93N39j42j26jJ40k01J83K1q8J08j39N5q7j68K61L1l41L42n4o3
4291h1j55K12j08j1J63n3j69J35Q3J03l46K11N1O8L9j52K75r1k65J99M6M2l49
$$ plain form
4314 -153 -207 157 -242 132 71 -4 69 -174 -114 28 -5 -173 79 178 -240 -122 24 51 -238 62 201 -44 -15
4337 -15 153 -45 41 226 -28 -68 5 24 -57 -35 -15 107 -67 170 -167 -35 -157 -130 38 -31 169 -197 64
4360 64 -98 88 -109 -156 9 198 158 130 101 0 -58 48 239 -191 -253 14 111 287 -11 45 -124 160 -36
4383 -36 22 261 32 46 42 38 -175 -109 -71 167 -57 -97 121 181 -35 105 -195 -15 -88 105 -71 -105 -149 -63 113
4408 113 112 324 85 150 -57 -160 -128 -237 -49 97 -243 76 24 -51 -255 -255 -211 -71 -33 312 36 -348 -62
4431 -62 -4 -42 105 -84 129 271 18 226 24 -174 14 13 -4 -8 11 -153 11 69 -12 -314 -80 -11 -90 183
4455 183 -133 -98 -310 -269 36 49 -90 148 -119 -136 220 -43 -139 -166 159 -61 95 -209 -194 165 3 188
4477 188 -52 -18 142 12 10 30 31 -86 -164 36 -219 -101 -246 62 -48 246 24 15 -169 -225 -189 -278 223 -155
$$ packed form
4314a53n4L64l99L74o1p5P3k43O0J42l3j68K52R9m18J18J46K7k89L00J39k45K9
4337a5J68j98Q6J85k54m0P3J9q1K2K0J22j74K37l37J32j22K7J68o9K00l66K61
4360F4j62J86j97m7J65J89m0k8k9j01n8J06J91m30o2K67R7J76k98N6j69K84j96
4383c6N8K39k29J4mmk13O6L8K38k24m0K18O0k16J40l00J80p3J93j76l4m4Q6J76
4408A13jK12k39O5k07j03L2j09J88J46l40L19n2p5k04%M4J40L8L45k76l84K86
4431f2N8l8J47j89K13J42k53K08k02j98J88jj7mJ9j64J64N8q1l02K34O9p9K73
4455A83l16L5k12M1L05J3j39K38k67j7L56k63r6k7L25k20J56l04J5L59j62J85
4477A88k40L4J60j30kK0Jj17p8K00k55J18j45L08j10K94k22rj84n6L6q9N01l78
$$ plain form
4501 -155 62 113 120 59 157 137 -194 141 130 -114 79 -42 -144 165 11 -75 -59 16 36 127 26 56 -160 -35
4525 -35 -25 -132 11 -25 -68 31 -80 -181 -245 237 19 150 60 107 152 262 21 -42 -113 46 37 -39 -52 222 -109
4550 -109 180 -128 209 9 110 307 -265 -122 -205 32 -219 4 100 41 -35 19 129 -169 3 112 66 11
4572 11 -185 -6 64 79 7 -244 -91 207 358 -92 -17 11 127 154 225 4 21 -125 -302 92 13 -70 16 -42
4596 -42 -4 47 203 -104 16 146 -58 -164 -163 2 82 148 210 82 -102 81 21 -312 83 -225 -28 64 -42
4619 -42 27 -168 -113 151 -24 14 85 -131 -159 219 197 -119 -93 196 -128 -111 -116 -138 -20 -20 228 -32 29 13 29 11
4645 11 -143 252 -44 -115 84 -202 -2 -264 66 -50 164 -233 -30 -11 189 -104 -113 266 -203 -194 -67 61
4667 61 269 -37 201 -37 33 -127 -246 102 -103 118 -237 253 38 -200 198 -129 64 71 26 -2 135 175
$$ packed form
4501a55K17N1Po1R8k0l31L35j1k44J93j21j02L09j54q6J6P5K0R1j01L0k16J25
4525c5J0j07J43l6m3R9j11j01o4M82k18J31r0M7M5J10k41o3p1J59rp6j3K74l31
4550a09K89l08L37k00J01J97n72J43q3K37k51K23R6n9p6N4J10k98J72J09m6n5
4572A1j96J79P0J5p2k51J53K98J51m50P5K8J16K7P1k21J7j46j77L94p9q3Q6n8
4596d2L8N1J56l07J20J30k04j06JJ65Q0O6O2j28j84J83o0l33L95l08J97R2j06
4619d2O9j95N5K64j75L8P1k16k8L78k2l16K6K89l24J7nk2J18%K48k60O1j6J6j8
4645A1j54L95k96p1J99k86K00k62L30j16K14l97K03J9K00k93rL79m69RJ27J28
4667F1K08l06K38k38P0j60j19L48k05K21l55M90k15k38L98l27J93Pm5k8J37M0
$$ plain form
4689 175 91 175 151 137 319 -99 -174 10 -100 77 -204 -76 -170 70 190 120 -4 7 -164 41 132 -2 -137
4712 -137 -126 -43 -59 96 -189 189 114 281 41 107 -114 -120 77 -72 107 -26 107 -17 -148 22 126 238
4734 238 219 -80 -126 78 -61 -119 9 24 -2 -172 -44 61 -60 51 27 98 -39 -268 -23 -137 20 73 150
4757 150 20 -10 -107 -31 -44 -83 -137 39 11 -219 -84 80 242 -147 -101 100 47 48 219 53 -169 31 -16 -140
4781 -140 -21 105 167 10 -163 -30 -45 -5 -305 85 182 -58 -47 -163 199 -165 154 -35 -119 128 167 -3
4803 -3 107 -182 -170 -20 6 42 -117 -69 92 -52 79 128 -75 210 -189 -163 28 -72 272 36 -184 -138 198
4826 198 44 -120 -75 90 16 61 -61 197 126 -193 125 -14 -187 -62 121 -14 -61 185 44 -153 -154 -17
4848 -17 -25 -38 67 20 158 65 -170 -70 5 -151 47 -18 -167 221 193 -200 213 139 -304 -71 -20 -18 10 23 -125
$$ packed form
4689A75q4Q4k4j4J82m18p5J84j10J77k81J28r4K40J20p0j24J1j71K05R1j34j35
4712a37J1Q3j6J55k85L78p5J67k40O6k21oJ97j49J79j33J33j24j31J70J04J12
4734B38j9k99m6K04j39n8J28J5k6j70J28J05j21J11k4P1j37k29K45j14J57N3P7
4757A50j30l0r7P6j3l9n4J76k8k30J35J64J62l89M6K01n3JJ71j66k22K00m7j24
4781a40J19J26O2j57j73J33j5M0l00L90R7k40J1j16L62l64L19j89q4K47L9j70
4803cJ10k89J2J50K6L6j59M8J61j44J31M9k03K85l99K6J91j00L44k36k20M6L36
4826A98j54j64M5J65p4M5j22K58p1l19L18j39j73J25J83j35m7K46j41j97jJ37
4848a7qj3J05m7J38r3k35J00P5j56J98o5j49L88k8l93M13p4m43K33N1KK8J3j48
$$ plain form
4873 -125 180 -183 161 102 -20 134 78 -40 57 -42 -102 3 -26 68 -218 -393 -73 -11 -305 205 -93 -14 -297
4896 -297 -111 -113 186 -144 -122 233 -24 145 -206 40 -151 5 -183 -153 246 -94 -158 70 27 48 89 163 -18
4919 -18 96 55 179 102 -2 -218 -99 208 -108 -31 -171 6 299 -78 -78 27 -97 21 -168 -55 -74 -102 -216
4942 -216 -49 -142 54 -5 85 77 110 158 -110 -125 100 -97 -96 280 -93 -165 -86 -91 -17 -73 14 12 143 -136 233 70
4968 70 -123 180 119 98 57 -269 -17 91 -72 189 55 179 -74 -181 179 -33 278 -77 108 -1 48 86
4990 86 -8 68 -121 -17 -66 75 73 -30 -125 -148 131 -42 -272 -60 269 -140 -282 -124 -46 111 37 47 -110 -88
5014 -88 -65 35 -52 -34 -199 268 -1 262 70 111 -146 -37 28 -42 -12 -52 -69 46 22 -189 -105 -18 -106 -232 -40
5039 -40 -125 60 51 -20 92 69 122 -40 -64 93 89 -74 31 -74 -361 -60 36 -156 15 92 -71 105 123 -236
$$ packed form
4873a25L05l63L44n9j22J54n6j18R7r9o0J05k9R4k86j75L20O2k94N10k98P9k83
4896b97J86kK99l30K2L55k57J69l51K46j91J56j88L0L99l40o4K28m3K1M1P4j81
4919a8J14m1J24p7j04k16J19L07l16P7j40J77K93l77%J05j24J18j89J13j9k8j14
4942b16J67r3J96n9R0qL3M8k68j5K25j97JL76l73p2P9nP4n6Q7kJ31k79L69j63
4968G0j93L03o1k1m1l26K52J08j63K61j34J24k53j07L60k12L11l55J85j09M9L8
4990H6r4P6j89J04m9J41kj03r5k3K79j73k30K12L29m09j42J58P8J57p4J0j57K2
5014h8K3J00q7J8j65M67k69K63j92M1k57J09O5p0L0m0j7J15k4k11Q4Q7q8j26J92
5039d0q5J85rp1J12k3N3j62k4J57mj63J05j05k87L01R6j92J71P7j63J76J8l59
$$ plain form
5063 -236 -35 47 -19 21 186 -1 -21 -165 -31 148 145 99 -78 43 12 7 -23 64 -36 13 85 248 75 195 224
5088 224 81 -34 -49 -24 -51 -86 39 -29 56 -121 -60 71 -7 48 -1 -99 16 -25 -42 -36 84 83 -175 -14 41 66
5114 66 -117 -3 113 -98 -178 -58 -80 -116 233 -74 -15 146 -29 56 103 -18 81 -82 -131 -142 111 74 -120 172
5138 172 -70 -56 -25 31 -120 58 -88 -134 34 -37 181 133 94 -217 -56 24 -133 19 -109 -183 18 -78 -60 67
5162 67 -174 31 191 18 -171 -91 -115 -28 -183 -144 -172 115 -153 -253 18 89 143 180 114 83 -120 12 54 -117
5186 -117 2 -100 6 -5 97 -141 40 2 -17 203 -140 120 131 -37 17 -302 -108 91 161 13 -29 -102 11
5209 11 41 97 -51 -13 208 104 -60 -56 121 29 -26 -60 88 -44 -5 -141 -259 70 89 7 51 -229 20 -148
5233 -148 -20 -99 -51 228 123 60 99 -165 -102 2 86 -4 -81 1 153 57 -67 -54 161 -47 -69 104 41 -22 -104
$$ packed form
5063b36K01Q2o6M0J65j87k0j44J34J79lm6j77J21l1nl0Q7j00M9P2J63j73J20K9
5088B24j43j15j5K5k7l5J25o8Q5j77O1J31p8N5m9r8J15m1j7OJ20jk58J61N5K5
5114F6j83J14J16k11q0J20k2l6L49l07N9J61j75Q5M7j21R9j63m9j1K53l7j94K92
5138A72k42J4L1N6j51J78j46m6J68p1K18m8l9l11J61Q0j57J52j28p4K01r6J8J27
5162F7k41K05J60j73j89Q0k4Q7j55L9k8K87k68j00K71P1N4L7o6l1k03J32M2j71
5186a17J19j02J06j1J02k38J81l8j9K20l43K60J1j68N4l19J94J99P0j48m2p3J13
5209A1L0N6j48L8K21j04j64MJ77r2n5l4J48j32L9j36j18L29J9q2M4k80K49j68
5233a48J28p9M8K79j05o3L9k64O3J04Q4r0p7Q2J52r6j24J3K15k08k2J73o3o3q2
$$ plain form
5258 -104 -360 -94 -166 -193 62 -27 286 95 -174 205 -48 162 -70 -101 104 -258 -87 85 67 -10 -198 166
5280 166 118 72 -300 -297 -17 92 138 -287 194 192 -87 -160 153 -175 48 18 -100 -146 -73 -276 -178 -107 68 62 58 -50
5306 -50 52 -36 -174 124 32 159 114 35 -8 20 -107 52 80 151 48 -8 52 171 16 202 56 -107 41 78
5330 78 -58 177 -124 -59 -33 -50 63 -5 -242 27 -24 0 67 139 54 -125 -128 201 113 264 -147 67 305 -51
5354 -51 -25 -48 155 -109 4 -62 -7 -18 -186 88 -281 22 127 -8 -5 -69 107 159 -123 65 146 -242 35 -155
5378 -155 85 -32 129 90 -61 -161 215 38 241 -301 -123 -158 -161 -88 -57 42 -19 -60 68 267 146 152 320 77
5402 77 234 -122 96 39 93 164 275 5 -95 -102 247 75 23 -72 -121 127 73 85 -183 -247 37 -143 -23 73
5426 73 48 -281 67 40 -62 170 195 260 24 -102 89 114 17 -154 -249 31 -208 -306 -19 29 22 106 -59 -161
$$ packed form
5258a04k56K66p2k7K55q9L13j91k69L79k53K10k32l1K05l62J71J72j8p7j88L64
5280A66m8m6l72LK80J09M6m25M81kk79p3L13l28K23l0j18m6P3k03R8P1J75omj08
5306e0J02q8j38K98r2J27m5p9m3K8j27J59K8P1j03n6O0J19j55J86j46j63J48L7
5330G8j36K35l01O5K6j7J13o8k37K69n1K4O7P2q5j79lL29q8J51m11K14K38l56
5354e1K6k3K03k64J13o6N5j1j68K74l69L03J05j35Lo4J76N2k82J88Q1l88K77j90
5378a55K40j17J61l9j51j00L76j77K03n42J78l5lP3L1R9o1m1J28J99j21OJ68k43
5402G7J57l56K18n7N4P1J11k70j00pL49j72n2r5m9K48n4J2k68o4K84j80J20R6
5426G3k5l29L48k7j02K32K5O5k36j26J91K5r7j71r5K80k39r8K87M8pQ4j65j02
$$ plain form
5450 -161 69 109 7 -56 -174 153 143 20 -121 -71 -191 152 62 86 -274 68 -21 -31 -21 -73 70 48 -94 -89
5474 -89 -30 -189 -90 19 -192 -197 -72 -56 -322 138 -69 100 -269 -70 -25 -37 219 8 85 -80 -58 -51 -45 -195 -20
5499 -20 -222 84 131 -89 -137 194 2 315 12 -129 -297 200 -125 -191 -26 222 0 -125 -96 -236 82 -38
5521 -38 -24 -92 138 -16 -50 31 32 116 -228 48 77 -128 119 212 -17 -116 -70 -70 10 0 119 174 -78 -30 -220 -89
5547 -89 29 -292 -169 150 -213 -218 205 85 71 206 -21 235 64 192 173 -165 109 -38 91 12 -125 93
5569 93 86 117 164 -202 18 146 -69 34 -209 87 -250 275 -58 -160 -79 -63 134 103 -6 -64 -109 -50 124 -166
5593 -166 42 -50 -21 57 215 -280 -240 -179 -56 46 -71 -23 -23 203 -66 71 -123 -23 14 -64 -66 153 -144 51
5617 51 40 27 -258 14 -130 56 -52 86 192 36 -6 -37 -21 -212 210 128 108 197 -67 -22 -60 61 45 -63
$$ packed form
5450a61K30M0j02o3j18L27j0j23j41N0j20L43r0K4l60L42q9j0J0n2J43k2j42N
5474h9N9j59R9J09k11nJ25J6k66M60k07J69l69J99M5j2K56k11P7j65K2POj50J75
5499b0k02L06M7k20m8L31j92L13l03j41j68M97l25o6J65K48k22j25K9j40L18j20
5521c8J4o8K30j54l4Q1JQ4l44K76K9k05K47R3k29r9M6%Q0j0J19N5k52M8j90J31
5547h9J18l21J23L19l63nM23j20j4J35k27K56j71J28j9l38K74j47J29p9j37K18
5569I3pL1M7l66K20J28k15J03k43K96l37N25l33j02Q1J6J97l1j09n8m5N9J74k90
5593a66K08r2K9P8J58m95M0O1J23J02j17M8%K26k69J37j94J00L7p8kK19k97J95
5617E1j1j3k85K72j44J86j08J38J06j56m2l1J6j91M22q2k0Q9k64M5l8J21j6j08
$$ plain form
5641 -63 67 142 -156 155 110 57 -59 -220 122 -48 194 17 209 -146 220 121 -134 74 -127 59 254 -124
5663 -124 51 -7 -111 76 110 282 114 19 -77 -107 -110 -61 -61 -154 -224 173 -119 65 -4 162 -36 46 146 6 11
5688 11 -80 208 -78 277 -101 39 -20 110 -57 -38 -173 1 26 -64 31 68 41 -158 -95 -52 75 129 127 -274 64
5713 64 -87 259 -29 -51 113 -117 1 33 109 176 17 24 12 -127 -7 240 128 -96 -66 128 49 -165 -49
5736 -49 -113 -204 181 -57 -74 -77 69 -99 -11 69 55 -26 -103 143 -189 -69 -68 -214 -75 -82 80 -155 5 19 -57 -31
5762 -31 11 -29 69 -141 -63 -153 178 136 -87 -53 -62 -312 156 -62 -135 409 -182 9 -99 -40 -56 81 -226 -64
5786 -64 -27 69 -98 44 55 5 -47 2 -55 120 216 97 -27 -25 -33 100 27 -109 21 160 -11 6 -115 39 -97
5811 -97 -204 -130 -180 374 -51 -27 6 -162 -109 -290 21 -44 90 8 39 -172 -23 -34 -199 303 71 93 -64 -162
$$ packed form
5641f3J30P5k98L11m5n3j16j61L42j70K42j77J92l55L66r9k55K08k01J86J95l78
5663a24J75n8j04J87L4J72j68r5r6l0lM9%r3p0L97k92J84o9J66j98Q2J00j40N
5688A1r1K88k86L55l78J40n9J30j67J9j35J74K5r0R5L7k7j99O3M3J27N4km01L38
5713F4j51L46k88k2J64k30J18L2P6O7j59Pj2j39J20K47j12k24L0J94p9k14J16
5736d9o4r1L85k38j7lJ46j68Q8Q0j4q1p7K46l32J20Jj46J39pJ62k35J60J4p6K6
5762c1M2m0R8k10P8r0L31m2k23L4rk50M68k18p3N44n91J91j08N9j6J37l07J62
5786f4L7R6j67J42J1n0n2M9n7J75R6j19j24KqJ33p3j36J30J39j71J7j21J54j36
5811i7j07P4n0N54m25K4L3j68N3j81L11o5J34q2L1k11J49j1j65N02k32K2j57r8
$$ plain form
5835 -162 61 -181 75 -112 -10 198 79 45 -46 121 -30 122 -122 -46 27 -179 135 78 169 -40 118 263
5857 263 25 -74 19 303 -84 -84 110 93 -17 201 -50 136 -74 -194 13 258 -147 -23 -118 -140 329 -134
5879 -134 99 1 -191 106 -127 -138 84 325 -120 82 94 -140 -63 54 118 65 -40 65 -32 132 -46 2 31
5902 31 -35 335 -35 -20 -260 89 -127 -88 -152 -173 -151 -145 300 -153 28 -87 -70 -57 -128 105 -88 22 75 -86
5926 -86 -7 237 -63 40 -110 56 109 17 -15 -122 -68 -37 80 58 -47 0 35 -178 276 -65 -39 96 52 -145
5950 -145 -31 -44 19 207 109 96 49 -27 -93 -119 -1 -36 96 118 133 54 113 8 -57 -184 -55 -26 -184 78 207
5975 207 17 0 129 24 -36 -85 91 30 162 69 22 17 -40 -31 -16 -109 38 132 -220 -76 72 86 -81 -115 -86 187
6001 187 54 251 4 76 -31 -208 -68 38 0 -40 172 37 64 -71 69 -1 -35 -67 -90 129 -155 55 2
$$ packed form
5835a62K23k42K56j87J02K08j19l4r1J67j51J52k44P6P3k06L14n7R1k09J58J45
5857B63k38r9R3K84l87%J94j7j10K18k51J86k10j20K07K45m05J24r5k2M69m63
5879a34K33r8j92K97k33j1K22K41m45K02J2k34P7J17O4n3j05J05r7J64j78M8K9
5902C1o6L70l70J5k40L49k16L9o4k1K2OM45m53J81j15J7J3p1K33j93J10N3j61
5926h6P9K44l00J03j50J66N3r2l2j07N4L1J17k2j05M7L5k13M54l41K6J35m4j97
5950a45J14j3O3J88r8j3m7p6o6k6J18l5J32K2J5p9N9j05o5j27J29K9j58K62J29
5975B07j90j7J29j05o0m9J76o1J32r3m7nn7RJ5r3J47R4l52J44J48J4j67l4K9K73
6001A87j33J97k47P2j07j77J40J06l8m0K12j35K7j35J40p0l4l2k3K19k84K10n3
$$ plain form
6024 2 -63 70 240 119 -87 -38 87 39 147 91 423 -315 -89 -3 173 21 -42 -88 -90 -31 179 69 -327 110
6048 110 -64 -6 -16 196 -91 33 39 28 -213 -47 -48 -57 -66 -86 205 183 -164 12 -14 -122 89 52 -3 132 97 -120
6074 -120 -109 34 148 36 120 -251 -77 -294 80 -106 -135 75 -98 38 51 -15 291 -63 -51 -44 -98 -42 40 79
6098 79 -22 173 -154 193 -9 -68 52 152 131 95 -44 15 69 -38 8 133 186 193 -13 24 -52 -42 36 -131 9
6123 9 -57 89 106 21 -58 -195 146 157 254 -128 10 -31 -130 -36 -13 36 25 58 -76 114 -105 82 -66 57 -102
6148 -102 -81 -34 169 -169 -78 -237 67 -39 -26 -70 -42 -147 -106 -319 128 -30 121 18 137 45 36 -36 -179 -94
6172 -94 195 140 18 -123 40 -91 67 -40 148 -149 166 -41 56 190 167 14 102 -345 83 158 -94 199
6194 199 -209 -57 -19 13 -50 78 -172 -67 -11 56 -72 133 6 119 -22 -63 8 -38 75 151 -154 -97 -149 4
$$ packed form
6024Bo5J33J70j21k06M9J25m8J08n6L32p38K26Q6J76j52o3m6kN9K10j10l96M37
6048A10j74N8j0K12k87J24Oj1k41J66jrrk0K91k2l47J76k6j08K11l7n5J35l5k17
6074a20J1J43J14j12Q4l71J74k17L74j86k9K10j73J36J3o6L06l54J2Pn4N6Q2L9
6098G9j01J95l27L47k02n9J20J00k1l6j39N9N4j07M6J25N3Pk06L7p6J0P8j67J40
6123Io6J46J7q5p9j37L41J1R7l82J38m1r9R4K3M9j1L3j34J90k19J87j48J23j59
6148a02K1M7K03l38R1j59L04j06J3m4K8j05M1k13M47j58J51j03J19r2rp2j43Q5
6172i4K89n5j22j41J63j31J58j07J88k97L15k07R7J34k3j53Q8m47M28P5k52K93
6194A99m08J52L8L2o3J28k50J05N6O7j28K05j27J13j41m1P1m6J13P6l05N7n2J53
$$ plain form
6218 4 -28 -11 -33 -66 100 127 -284 73 -68 -67 -41 -99 -200 -145 3 -90 -23 59 -171 11 59 21 103 -35 -43 -66 51
6245 51 -8 152 -59 49 248 32 373 115 -102 150 240 -23 -191 -323 89 -50 -178 32 58 69 73 -92
6267 -92 -74 86 81 18 -88 -114 -97 0 75 215 -107 -40 198 -49 55 -154 -20 135 122 0 38 18 -163 -113 -86
6292 -86 125 -77 62 -56 -24 -41 -84 -108 -61 48 -126 104 -207 -50 61 128 -178 90 202 -182 -37 186
6314 186 10 -75 187 -48 112 63 -47 -179 -132 -67 -106 218 -81 65 -32 -70 87 -85 160 53 231 -34
6336 -34 177 29 146 48 -212 171 103 -81 -22 41 215 96 72 47 -116 -15 -242 -86 -107 -13 13 25 -141 42
6360 42 -44 -78 116 -7 -38 5 33 1 -76 -115 -179 164 168 -113 47 91 68 66 217 -176 -144 -26 -115 -142 -33 -7 266
6387 266 -50 228 25 -83 11 -11 -166 118 -48 -74 166 -96 52 -23 114 135 168 201 7 36 146 -124 -16
$$ packed form
6218Dl2J7k2l3J66K7m11L57j41JK6n8j01N5J48r3O7Q2k30J82M8l8Q2j38qk3J17
6245E1n9J60k11J08J99k16L41k58k17K52R0k63j68j32M12j39j28K10K6J1Mj65
6267i2J8J60no3j06k6J7R7P5J40l22O7K38k47J04k09J34J55j3j22L8k0j81N0K7
6292h6K11k02J39j18L2j7m3k4M7J09j74K30l11J57J11O7l06K68J12l84J45K23
6314A86j76q5K62k35J60m9j10j32M7O5l9L24k99J46r7l8J57j72K45j07J78k65
6336c4K11j48J17r8k60L83o8j84N9O3J74j19k4k5j63J01k27J56k1R4K6J2j66J83
6360D2q6l4J94j23l1M3K8l2p7l9o4L43Mk81J60M4k3kJ51l93L2J18q9k7J09K6K73
6387B66l16K78k03j08R4k2j55K84j66k6K40k62J48p5J37K1L3L3j94K9J10k70J08
$$ plain form
6410 -16 -47 -99 81 -236 14 173 -25 93 237 7 -141 -48 -335 -232 -190 8 -305 -92 -120 -130 -16 10 -11
6433 -11 135 -48 -28 24 -7 -77 0 -247 -161 -258 -97 142 -223 -60 -60 -22 -100 206 -11 67 -207 46 -61 105
6457 105 -49 -39 -214 -58 21 -199 112 -61 -47 49 -151 -136 108 87 118 -73 157 -112 259 120 101 312 -117
6480 -117 -6 96 6 -23 46 125 -7 -47 -80 296 81 35 -76 -68 -94 116 -317 127 39 211 -51 106 191 -193
6504 -193 -245 181 -117 -129 197 -88 -62 40 -123 -54 -107 -52 24 183 -51 178 -9 152 95 72 -201 -260 -177 95
6528 95 70 -139 -128 -49 -117 31 -18 18 2 93 -33 36 -265 70 -58 63 45 276 41 -132 -118 -120 -130 -132 -64 -300
6554 -300 -215 -207 -128 -23 106 -67 -35 193 -131 -78 -35 -209 -154 207 -194 138 -164 -147 -82 -15 123 127 -70 -78 -196
6579 -196 -74 8 103 -20 21 -29 86 -282 -81 84 -112 28 -71 -80 8 162 83 49 95 -202 181 -41 -71 2
$$ packed form
6410a6l1n2J80l17K50J59j98J18J44k30j48R3k87J03M2J98l13K13k8j0J14K6k1
6433a1J46j83K0N2l1p0P7k47Q6r7J61K39l65J63%L8p8L06k17P8k74K53j07J66
6457A05j54J0j75J56P9k20L11j73J4R6k00J5K44k1L1j91K30k69L71j39j9K11m29
6480a17J11J02r0k9O9P9j32m0l3L76k15m6j11Qk6K10m33M44q8J72k62J57Q5l84
6504a93n2M26k98j2L26k85K6J02j63O9n3N5P6J59k34K29j87J61n7k3k73n9Q3K72
6528I5k5k09J1P9o8J48m9L6j6R1j26O9l01L35j28J21j8K31k35j73J4kj0kO8k36
6554c00Q5QP9J05J29j73L2K28l24N3M3j74N5L61m01L32l02J7O5O7J38Mj97qj18
6579a96J22Q2R5j23M1n0J15l68K01J65j96J40r9rQ8J54p9l4M6k97L83k22l0P3
$$ plain form
6603 2 146 -27 -122 212 6 -105 2 -66 -68 22 30 72 51 25 50 -29 63 -155 180 -1 -177 -26 265 -124 -13
6628 -13 47 53 92 145 -104 179 75 -53 -71 -67 90 -24 -110 -7 -77 -95 -86 -142 -40 155 -44 -163 107 -6 -186
6653 -186 -2 -71 44 261 65 82 -9 76 230 43 211 108 -13 62 55 -17 93 -140 39 169 117 -6 0 -43
6677 -43 87 -109 -54 -203 -128 -18 24 -43 -104 3 68 -127 98 75 24 -31 13 2 -48 287 -209 13 -29 104 145
6702 145 86 80 -132 185 -69 -124 192 206 4 -209 179 -81 26 -108 -121 -248 17 -81 124 -39 184 135 -137
6725 -137 -2 118 171 -78 1 235 -156 -57 -170 -99 -95 225 150 -33 -77 -152 150 -290 -78 -164 -160 122 -149 14
6749 14 106 -156 51 49 -54 -62 -44 -73 64 96 -98 3 62 49 166 119 -192 117 88 -57 -92 144 74 -56 -273
6774 -273 114 78 87 -241 -107 -64 22 307 -107 153 103 -294 -74 38 68 -176 -205 4 125 -111 75 36 -132
$$ packed form
6603BJ44j73r5L34k06j11J07o8kR0QM2k1k6K5p9R2k18L35j81j76J51K91l89J11
6628a3O0OL9N3k49K83j04j28j8MJ57j14q6J03p0j8Rn6J02J95j99j19K70j13j80
6653a86J84o9J15K17j96J7r1Q5J54j87J68j03j21P5pp2J10k33J79J30n2j23Om3
6677d3J30j96N5j49P5J10M2o7o1J07O5j95K25k3n1n5M4j1n0L35m96K22m2J33M1
6702A45n9ok12L17k54n5L16J4k02k13L88k60J07j34j3j27K65r8K05j63K23m9k72
6725a37J35J20N3k49P9K34l91R9j13P1ML20p5j83m4p5L02m40K12q6MK82k71J63
6749A4R2k62K07kj03qJ8k9J37L2j94J01N9j3J17m7l11L09k9j45l5K36p0j30k17
6774b73L87l6Rl28J34M3Q6K85m14K60n0l97K20J12L0k44k9K09J21k36J86l9j68
$$ plain form
6797 -132 34 -85 -119 13 -40 122 -28 -202 69 -138 -86 -78 -150 -29 -15 -122 17 119 -49 -112 59 7 -173
6820 -173 -20 32 71 18 -4 200 -157 -82 42 89 -47 122 22 8 255 -98 -250 -28 -407 26 97 -241 37
6843 37 -159 277 -96 -82 -76 56 -17 -41 -63 8 216 -7 219 242 -176 -175 117 -92 203 -188 -10 -58 67 75 -178
6868 -178 54 79 122 -125 25 -180 -58 -141 126 13 25 15 -103 -91 -30 -1 90 -84 -37 60 194 104 170 74 71
6893 71 -253 22 -86 73 -104 -13 -165 165 173 -66 -276 -11 118 89 88 -210 62 121 -44 205 108 37 180
6916 180 223 -156 46 87 167 155 -44 101 135 -219 -154 255 171 -13 59 -65 111 39 229 113 -312 35 39 -99
6940 -99 41 219 -83 16 43 -135 -130 0 87 0 -293 164 -157 -90 -100 27 -46 -138 -47 -84 184 91 90 -197 46
6965 46 65 12 134 56 103 16 -84 -183 13 37 -32 17 57 -20 29 -171 -12 -122 106 181 159 -11 -79 205 -98
$$ packed form
6797a32J66j19l4J32n3J62j50j74K71k07N2Qp2J21J4j07J39J02j68o3J71n2j80
6820a73J53N2L9n3k2K04l57P5J24M7j36J69j00j4K47l53j52K22l79M33P1l38K78
6843C7j96M36l73J4OJ32p3k4k2P1K08k23K26K3m18JK92k09K95l91J78m8J25Qk53
6868a78K32K5M3k47J50k05J22q3K67j13J2j0j18J2O1K9R1j74M7R7J34r0O6r6l
6893G1l24K75j08J59j77R1j52L30Qk39k10K65J29k9jk98K72N9j65K49r7p1J43
6916A80M3l79K02M1Q0j2j99J45L4l54O5M09q4j84P2j24J76p2J90j16m25L47Mj38
6940i9J40J78l02R9K7j78NJ30Q7q7k93M57l21O7j0J27p3r2R1l7K68r3jk87K43
6965D6J9n3J22p8M7q7j00r9J96K4o9M9M0p7M9k00J59j10K28P5k2j70o8K84l03
$$ plain form
6990 -98 -15 40 237 -221 152 131 43 149 42 17 -45 -196 -91 -162 3 -138 -142 54 121 -31 57 103 7 -93 86
7015 86 23 19 -102 32 65 7 195 70 88 22 -74 -26 3 -72 -91 218 127 8 125 25 -56 106 91 16 108 115 162
7042 162 78 -55 106 186 195 5 -218 99 180 247 -121 -19 -131 124 155 30 71 -82 21 -36 -81 398 -238
7065 -238 -88 -119 -133 148 -135 100 -204 199 83 56 -138 -160 -135 32 -3 -175 -62 224 143 -66 120 121 16
7088 16 218 -50 14 -164 -135 -197 160 117 74 40 124 -30 300 -24 -39 156 -295 63 -102 89 -154 86 -40
7111 -40 262 116 80 13 33 278 -39 229 107 59 220 -86 -9 -42 -39 -65 -26 18 108 -106 111 91 -307 -73 -47
7136 -47 -64 -165 170 -198 -151 96 97 200 38 -32 -20 -108 -199 -165 -161 26 46 -43 120 271 -108 -70 20 126 284
7161 284 -217 13 -74 12 116 -82 13 128 -25 -419 12 -94 -39 276 53 -32 7 157 97 145 -2 90 -84
$$ packed form
6990i8Q3N5J97m58L73k1q8J06j07k5o2j51J05p1J65j41mJ96O7j52Q8M6r6j00J79
7015H6o3mj21J34L3n8J88j25J8o6r6M8K9p5j9L09r1j19J17j00q1J62j5p5R2PM7
7042A62q4j33J61Q0Rj90k23L17Q1O7l68J02j12K55L1j25M1j53J03n7m5M79o36
7065b38J50l1j4K81k83K35l04M03j16k7j94k2K5J67l5j72J13K86q1k09J86Jj05
7088A6K02k68O4j78K9o2L57m3m3l4Q4j54L30l24j5J95m51L58j65J91k43K40j26
7111d0L02j46l6o7K0K45l17K68j22m8J61l06P7l3Lk6L9M4R0k14K17k0l98K34K6
7136d7j7j01L35l68M7K47JJ03j62p0J2q8r1L4MJ87K0q9J63J51l79L8R0J06J58
7161B84n01K30q7Q6J04j98R5J15j53l94M31j06N5L15k23q5L9J50o0M8j47R2j74
$$ plain form
7184 -84 4 0 -159 159 20 60 20 -57 -55 51 -50 -177 105 -119 81 6 -75 -115 184 7 -201 231 82 -71
7208 -71 -126 30 26 94 -48 141 -123 -27 191 -109 -51 25 58 -29 -78 -237 60 27 -45 -221 105 -82 -36 -88 151
7233 151 -43 -26 22 -240 -112 -379 134 188 -22 -166 117 95 82 70 -104 -111 -50 41 126 53 149 124 -149 -44 174
7258 174 -119 26 -157 -187 51 72 -45 -67 21 171 95 21 -22 -79 -68 137 34 46 -100 110 36 113 -56 61
7282 61 252 331 -76 111 -90 150 -10 16 85 26 -61 -130 -179 -167 7 -2 -239 -113 -28 -60 -85 1 54 213 -106
7307 -106 -33 -24 15 166 -78 -202 230 37 133 -65 -74 163 30 55 -108 7 284 237 -41 -108 -161 32 -74 -31
7331 -31 145 43 -61 3 -120 -76 -162 -9 43 96 -97 145 -8 -12 364 -29 149 -226 -387 164 33 13 -33
7354 -33 117 -64 -41 14 -26 50 32 10 -88 -268 -165 -155 -106 -225 -98 -124 16 142 1 293 115 -95 59 -141
$$ packed form
7184h4Q8mj59L18j39M0m0p7KJ06j01j27K82k24K00p5q1m0K99j77k08M32j49j53
7208g1n5J56mO8j42J89k64R6K18l00N8P6L3q7m9j59K97l3p2j76L26j87M6n2K39
7233A51j94J7M8k62J28k67N13N4k10j44K83k2j3j2j74pO1R1Q5p3R6k5k73J05K18
7258A74k93J45j83l0K38K1j17k2Q8J50p6p4m3n7J1K05j03J2j46K10p4P7j69J17
7282F1J91P9m07J87k01K40j60K6O9n9q7o9m9J2J74rk37J26Q5l2k5Q6N3J59l19
7307a06P3RL9J51k44j24M32j93R6j98rK37j33K5j63J15K77m7k78o7n3J93j06M3
7331c1J76j02j04O4j23M4q6J53N2N3j93K42j53mL76l93J78l75j61N51j31k0m6
7354c3J50j81K3N5m0P6j8k2r8j80J03J0M9j19J27k6J40J26j41K92j78k10J54k00
$$ plain form
7378 -141 122 223 46 86 -1 -259 105 -128 -75 -64 98 67 89 -168 -40 263 319 38 86 -65 57 -108 -193
7401 -193 265 291 41 9 125 -163 -83 140 107 80 -45 -128 117 -62 118 177 -178 -192 -22 -317 -85 29 48
7424 48 239 -275 -177 -257 -7 123 304 -43 158 11 158 -115 -132 244 176 205 84 5 42 -106 142 296 307
7447 307 -112 149 75 66 -97 -273 -43 -127 -1 -190 16 -61 34 -68 48 -167 0 85 -147 52 14 140 -12
7470 -12 156 218 -77 -100 11 -64 226 105 -127 -39 -22 -139 -54 -212 244 -5 112 -113 -43 -93 -199 78 4
7493 4 251 -9 121 -124 23 137 90 56 52 -73 236 81 178 7 108 109 44 230 -93 63 -87 30 173
7516 173 318 115 65 68 -147 -57 -39 30 -84 158 232 57 145 -54 297 -2 107 39 -14 150 -95 146 -51
7539 -51 -3 55 -12 -38 192 -37 -155 318 -35 143 19 93 258 183 -122 -62 14 -19 139 142 -1 -197 294 -103
$$ packed form
7378a41K63J01j77M0q7k58L64k33N3J1J62l1K2k57J28L03N6k81M8j51J22j65q5
7401a93M58K6k50l2J16k88Q0K23l3k7j25q3K45j79J80N9l55j4J70k95K32J14J9
7424D8J91n14R8q0K50J30J81l47K01j47J47k73j7L76o8K9j21p9L7j48K48J54J1
7447C07m19K61p4rj63j76K30q4J26j89K06p7R5j02J16k15J67Q5k32J99l8J26j52
7470a2J68O2k95k3J11p5K90j21k32Q8J7j17Q5j58M56k49J17k25P0n0j06K77p4
7493DK47k60J30k45J47J14m7l4mj25L09j55R7j71J01Jo5J86l23J56j50J17J43
7516A73J45k03n0Lk15R0J8O9j14K42P4j75Q8j99L51k99J09o8n3J64k45K41j97
7539e1M8N8o7k6K30k29j18M73l53J78j24P4J65p5l05O0P6l3J58Lj43j96M91l97
$$ plain form
7563 -103 126 121 56 140 123 -307 129 -95 -83 100 250 53 -129 -134 -434 -2 -77 -63 -30 -91 -58 -90 -21 230 123
7588 123 -81 -97 -208 26 -132 74 -153 -2 -40 61 300 -57 150 270 -133 -182 -33 -156 35 -31 -244
7609 -244 -29 183 85 -236 137 74 -40 -20 165 35 271 95 162 -23 141 -73 -12 -150 -136 175 85 -68
7631 -68 -260 -31 106 72 -56 172 26 -37 -47 -27 129 -59 21 38 57 -70 -101 -137 -151 -20 14 -84 -57 -134 -43
7656 -43 112 155 85 33 -259 -19 -165 -30 98 -59 41 357 -100 -17 -101 236 -147 -71 -207 13 20 -106 149
7679 149 132 144 56 99 -285 -253 141 52 -132 85 -243 -97 90 -40 104 6 -23 160 21 -38 -106 27 -183
7702 -183 105 -151 -100 186 -118 -62 178 34 -44 -208 -141 21 -249 -4 58 -85 -93 76 11 -102 55 -79 11
7725 11 34 -188 -401 -38 -45 -43 -127 248 58 -23 260 325 -64 -6 231 191 -106 156 -212 -107 85 12 -74 36
$$ packed form
7563a03K29no5Q4j7m30M36k24J2J83J50j97j82nl00M32p5J4L3o1L3l2O9K51j07
7588A23k04j6j11K34j58K06k27J51l8J01K39l57K07J20m03m9J49j23J91o6k13
7609b44K15K12r8l21L73o3j14K0J85j30K36j76O7j85J64k14O1j38J4L11r0j53
7631f8j92K29J37l4j28K28j46o3j0K0J56j88Q0J7J9j27l1l6j4J31L4r8K7p7R1
7656d3J55M3p0n2k92K40j46J35J28j57J00L16m57Q3q4L37l83P6j36K20Pj26K55
7679A49j7J2q8M3l84L2L94q9j84K17l28J46J87j30J44r8k9J83j39n9o8J33k10
7702a83K88k56N1K86l04N6K40j44p8j64O7J62k70K45O2j43qJ69o5j13J57j34R0
7725A1K3k22k13L63pKq4L75j90q1K83O5l89N8K37m0k97K62l68J05J92p3q6J10
$$ plain form
7749 36 21 -26 0 -107 15 -129 -140 -52 213 -16 -31 125 72 -152 67 -134 235 -39 171 -37 -31 -125 180 -9
7773 -9 22 276 166 -5 -47 -80 -57 -154 -44 -146 -26 -54 -281 -88 -7 -26 -117 56 49 -50 -60 111 -112 -117 151 2
7799 2 -103 119 -146 100 147 44 -139 -35 -43 -106 -283 -185 -80 -70 -91 126 -70 -122 -40 70 64 -11 -11 -36 -89 -75
7825 -75 80 196 -65 138 187 6 -123 217 1 -57 -54 82 13 -111 1 -133 -65 89 267 -380 -222 -14
7847 -14 3 15 70 -8 -31 37 -21 -1 -150 -78 17 224 -61 66 4 -89 -191 -160 85 -47 -113 -1 20 66 -47 37
7873 37 -4 -289 3 30 33 -37 192 40 -205 -143 -200 248 -203 -138 62 -40 -106 -88 -100 46 25 59 -58 -88 128
7898 128 -59 -161 93 51 -40 222 50 -59 166 57 106 -198 130 122 -101 -21 -33 -47 -87 -28 28 -136 99 228
7922 228 154 -22 96 -74 41 151 363 -158 53 -52 -113 -136 -152 214 -9 200 248 -29 -9 74 -6 -28 142
$$ packed form
7749C6j5m7K6j07J22j44j1Q8K65k29j5J56n3k24K19k01L69k74K10k08Or4L05j89
7773iL1K54j10j71m2l3K3r7J10j02J20k8k27J93Q1j9r1J73pr9j0J71k23nK68j49
7799Bj05K22k65K46M7j03j83J04qo3j77R8J05J0k1K17j96n2Q2J10op5%k5n3J4
7825g5J55J16k61K03M9j81j29L40k16n8LJ36o9j24J12j34O8J54J78o47J58K08
7847a4J7J2N5p8k3O8n8K0j49P2R5K07k85J27o2r3j02L1K45j32o6J12K1M6j13Q4
7873C7m1k85K92K7Lp0K29j52k45O2n7M48m51O5K00j02o6J8j2J46k1L4j17l0K16
7898A28j87j02K54m2r1K62j72j09K25j09M9l04L28qk23Q0j2j4m0N9N6j64K35J29
7922B28p4j76J18j70J15J10K12n21K11j05o1k3j6L66k23K09M8k77K0Q3q0k2J70
$$ plain form
7945 142 -178 99 -120 -77 24 -130 17 44 -141 -45 19 -127 114 102 -162 209 93 55 45 -60 -140 38 14
7968 14 -236 -44 77 -129 63 144 -30 -118 -73 98 -33 -64 289 -143 -50 3 132 -144 -2 -61 -217 178 -43
7991 -43 -105 -192 -179 10 274 -111 46 -17 65 -25 -106 91 222 -15 48 3 -105 143 31 -30 -191 -40 195 -39
8015 -39 93 66 99 -185 184 -131 20 -34 87 251 -7 99 -312 -244 117 39 -193 -27 -5 26 -75 104 159
8038 159 -331 -50 -195 -120 6 1 26 -18 -67 -67 -37 -146 -68 1 13 268 165 -84 -37 135 82 119 71 130 -99 -103
8064 -103 -9 -85 36 -164 29 -123 43 141 174 24 -223 -206 -66 -26 -197 -190 -64 26 64 136 -12 118 -107 -121
8088 -121 42 -212 21 -212 75 89 4 85 -182 -61 -144 -94 16 -158 55 -76 166 31 -16 -166 187 10
8110 10 3 -117 38 -147 -187 162 -78 16 150 -110 63 -94 55 -123 -105 -281 107 -20 6 186 156 111 124
$$ packed form
7945A42l20K77k19M3J01j54J47K7j85R6O4j46K41j2k64L71j16l8j0j05q0J78k4
7968A4k50J92J21k06J92Q1j74q8M5J71j31l1L53m32R3N3J29k76J42n9j56L95k21
7991d3o2q7J3J89K64l85J57o3Q2r0q1J97J31k37O3m5j08K48j12o1j61J51K35k34
8015c9J32k7L3k84L69l15J51n4J21J64k58J06m11O8L61p8k32J66K2L1j01J79N5
8038A59m90K81j45P5J26nK5m4m9%L0j09P8O9J2K55j03k49M7J72n3L7m8N9k29m
8064a03R4p6J21k00J93j52J66R8L3j50k47J7J40M0j71PJ26R0L8P2j48J30k25j4
8088a21J63k54K33k33K87J4q5Q1k67J21q3N0J10j74K13j31K42j35m7j50L53j77
8110A0pj20J55j85m0L49k40R4J34k60J73j57J49j78J8j76L88j27K6J80l0m5J3
$$ plain form
8133 124 6 -193 -101 168 -232 124 -82 -4 -293 -11 -42 37 -12 -44 211 124 -171 39 37 81 58 -65 188 314
8157 314 -196 126 69 34 209 -22 -262 -56 143 103 -7 -214 44 105 26 -264 92 76 -280 241 196 6
8179 6 42 -19 -156 -47 -169 -66 -71 -201 -14 108 -99 -90
$$ packed form
8133A24j18j99R2K69m00L56k06P8k89K82l1P9m9l2K55q7k95K10kM4k3j23K53J26
8157C14n10L22n7l5J75k31k40K06J99m0j10k07K58O1p9k90L56j6l56N21m5j90
8179FL6o1j37J09j22J03nj30J87J22k07R
8191i0
$$ Imaginary data points
##PAGE= N=2
##DATA TABLE= (X++(I..I)), XYDATA
$$ plain form
0 0 0 0 0 0 0 0 0 0 0 0 0 -8 8 -8 8 -16 16 -16 24 -32 32 -40 48 -56 64 -80 90 -104 120 -140 160 -183 207
33 207 -236 263 -300 335 -375 421 -469 523 -579 643 -713 789 -872 961 -1060 1168 -1288 1418
51 1418 -1561 1722 -1900 2098 -2322 2578 -2871 3210 -3611 4090 -4679 5417 -6378 7682 -9568
66 -9568 12543 -17961 31047 -134137 -75159 64885 -165217 -10966 49606 -179413 -143324
77 -143324 55821 -51192 -40101 81303 -7818 -72076 34172 28499 19533 70271 52497 28979
89 28979 49561 33112 64903 82906 27897 37151 61891 -753 26497 82693 12160 -7824
101 -7824 40797 -21266 -38740 30852 -3774 -38669 11910 -21369 -62621 -12330 -21715 -54353
113 -54353 -4062 -4187 -44783 -15567 -15031 -49225 -13592 5658 -20068 -1001 6708 -22445 -5643
$$ packed form
0@%%%%%%%%%%%qJ6j6J6k4L2l2M0n6O4p2Q8j04J20j44J70j94K24k60L00l43L90
33B07m43M99n63O35p10P96q90R92j102J222j356J502j661J833k021K228k456K706
51A418k979L283l622L998m420M900n449O081o821P701q769J0096j1795J4060j7250
66i568K2111l0504M9008j65184N8978J40044k30102J54251O0572k29019L6089
77a43324J99145j07013J1091J21404q9121o4258J06248n673q966N0738j7774k3518
89B8979K0582j6449L1791J8003n5009R254K4740o2644K7250N6196p0533j9984
101g824M8621o2063j7474O9592l4626l4895N0579l3279m1252N0291r385l2638
113e4353N0291j25m0596K9216N36l4194L5633J9250k5726J9067P709k9153J6802
$$ plain form
126 -5643 11656 -7797 3235 14082 -6354 5501 21423 -20 2091 12849 -9424 -2821 27515
139 27515 13068 85 15227 -3063 -20386 10572 23237 3903 9287 11289 -14833 -12407 14315
152 14315 12482 1751 7359 -365 -15571 -5269 10876 5929 -4002 -3886 -5163 -10611 -4603 9830
166 9830 2728 -14831 -7075 1258 -11336 -2629 14917 -4193 -16174 5582 2754 -11571 9719
179 9719 14461 -11279 -4755 11636 -3940 -4470 13694 3022 -9573 2575 2490 -8598 -2419 3934
193 3934 -2484 -4680 -2581 -5217 -10271 -9253 -872 1812 -2855 -1431 -1432 -11692 -8972 6727 6673 2648
209 2648 10925 4633 -8806 3578 14690 6357 12132 19467 3195 -1016 13622 9546 2664 14396
223 14396 9996 -4442 3750 9530 -2228 -1195 3679 -7863 -11460 -1619 -1956 -7866 -5833 -6333 -14966
$$ packed form
126e643J7299j9453J1032J0847k0436J1855J5922k1443K111J0758k2273O603L0336
139B7515j4447j2983J5142j8290j7323L0958J2665j9334N384K002k6122K426K6722
152A4315j833j0731N608p724j5206J0302J6145m947r931J16j277n448O008J4433
166I830p102j7559P756Q333j2594Q707J7546j9110j1981K1756k828j4325K1290
179I719M742k5740O524J6391j5576n30J8164j0672j2595J2148q5j1088O179O353
193C934o418k196K099k636n054J018Q381K684m667J424jj0260K720J5699n4m025
209B648Q277o292j3439J2384J1112q333N775P335j6272m211J4638m076o882J1732
223A4396m400j4438Q192N780j1758J033M874j1542l597R841l37n910K033n00q633
$$ plain form
238 -14966 -17246 -9595 -5559 -8548 -4186 -176 -12921 -18733 -5125 -3780 -7711 9100 12388 -8353
252 -8353 -6096 4838 -6713 -1243 22778 15277 565 10774 6838 -7899 6111 21405 11068
265 11068 7829 15218 4593 -5988 5490 12404 4105 3430 9641 1177 -7423 1431 3817 -8374
279 -8374 -6728 2693 -6884 -12006 812 -3303 -17619 -9874 -4697 -16276 -10634 3658 -5470 -13368
293 -13368 -4541 -8135 -16273 -3047 7653 -517 -279 5496 -3187 -6747 6093 10572 5688 10916
307 10916 14314 4519 2730 10798 8546 5058 13035 14211 4810 5352 8550 484 -2286 5929 3533
322 3533 -3018 2725 2632 -9886 -9932 -3289 -9268 -8871 1802 -3109 -14220 -9169 -6621 -13284 -6877 3477
338 3477 -3997 -8883 -566 -2589 -8949 641 6950 -955 -663 7329 2485 -2180 7463 9087 31
$$ packed form
238a4966k280P651M036k989M362M010j2745n812J3608J345l931J6811L288k0741
252h353K257J0934j1551N470K4021p501j4712J0209l936j4737J4010J5294j0337
265A1068l239P389j0625j0581J1478O914q299o75O211q464q600Q854K386j2191
279h374J646R421r577n122J2818m115j4316P745N177j1579N642J4292r128p898
293a3368Q827l594q138J3226J0700q170K38N775q683l560J2840M479m884N228
307A0916L398r795j789Q068k252l488P977J176r401N42L198q066k770Q215k396
322C533o551N743r3j2518m6O643n979L97J0673m911j1111N051K548o663O407J0354
338C477p474m886Q317k023o360R590O309p905K92P992m844m665R643J624r056
$$ plain form
353 31 2904 9875 2608 348 10133 6766 -3528 2144 6395 -2135 -340 8090 533 -7588 470
368 470 1140 -7125 -1856 4183 -4685 -7491 644 -2487 -8626 -1285 2765 -5162 -4575 2453 -2766 -6611
384 -6611 2549 3809 -3437 542 4895 -2022 -2117 6221 3916 -1027 4694 5258 -2112 566 6522 2378
400 2378 834 5544 2514 -3510 -28 3225 -979 -385 3330 -2001 -6512 -932 115 -4538 -1750
415 -1750 691 -6044 -6363 320 -1417 -4447 1057 -346 -6835 -2418 3785 9 1205 5227 -622
430 -622 -5174 1740 5674 3508 6687 7872 -622 -4499 2707 5241 3142 7641 7629 -3950 -6631 1310
446 1310 261 -1627 5651 3075 -9055 -6548 -208 -5619 -4727 3009 -3110 -10722 -3362 264 -5709
461 -5709 -2774 2016 -5367 -8613 1305 3698 -2052 1524 3815 -5258 -5171 6357 6431 1508 6727 5821
$$ packed form
353C1K873O971p267k260R785l367j0294N672M251q530J795Q430p557q121Q058
368D70O70q265N269O039q868k806Q135l131o139P341M050p927N87P028n219l845
384f611R160J260p246L979M353o917r5Q338k305m943N721N64p370K678N956m144
400B378j544M710l030o024L482L253m204N94L715n331m511N580J047m653K788
415a750K441o735l19O683j737l030N504j403o489M417O203l776J196M022n849
430f22m552O914L934k166L179J185q494l877P206K534k099M499j2j1579k681P941
446A310j049j888P278k576j2130K507O340n411Q92P736o119p612P360L626n973
461e709K935M790p383l246R918K393n750L576K291r073Q7J1528P4m923N219r06
$$ plain form
477 5821 -4735 -1414 8344 4583 2491 8957 4602 -4443 1361 6601 418 1238 7150 688 -4355
492 -4355 2572 2853 -4518 -1459 2020 -4817 -5145 2064 -1171 -7057 -3457 -3971 -10367 -5043 1673 -3265
508 -3265 -5784 -2772 -7280 -10586 -2668 2086 -1275 -243 1245 -4615 -5343 2919 5601 2547 6470
523 6470 7334 85 1825 9910 7791 4899 10801 8064 571 6181 11040 3707 2868 6668 -471 -3869
539 -3869 4091 3918 -4154 -2764 -2373 -10348 -9390 -1895 -4731 -9697 -6441 -7438 -13970 -10355 -2767 -6072
555 -6072 -8036 -2551 -3649 -8948 -3040 3121 -1074 -270 6311 3527 -641 6412 9435 3290 6313
570 6313 11698 5543 3459 10215 7970 2111 6892 8266 945 1634 5740 804 -2064 1974 281
585 281 -5693 -3253 -955 -4851 -5575 -2539 -4133 -7941 -4843 -2087 -5494 -5072 -865 -3914 -6386 -779
$$ packed form
477E821j0556L321R758l761k092O466m355r045N804N240o183Q20N912o462n043
492d355O927K81p371L059L479o837l28P209l235n886L600n14o396N324O716m938
508c265k519L012m508l306P918M754l361J032J488n860p28Q262K682l054L923
523F470Q64p249J740Q085k119k892N902k737p493N610M859p333q39L800p139l398
539c869P960j73q072J390L91p975R58P495k836m966L256r97o532L615P588l305
555f072j964N485j098n299N908O161m195Q04O581k784m168P053L023o145L023
570F313N385o155k084O756k245n859M781J374p321O89M106m936k868M038j693
585B81n974K440K298l896p24L036j594l808L098K756l407M22M207l049k472N607
$$ plain form
601 -779 191 -4248 -101 2476 -3088 -1708 3927 422 -1084 4739 2642 -1663 2286 3377 -417 1966
617 1966 4586 1351 224 2162 1492 -226 853 2862 1693 -695 1661 1353 -2924 -239 3710 -857
633 -857 -1590 3208 -1006 -4947 1933 1891 -4549 526 3065 -4709 -2616 3130 -1975 -3973 2012 227
649 227 -3692 545 2258 -1343 -1521 1835 760 -2202 1123 3751 220 -740 3254 960 -3074 2589
665 2589 5009 -1753 164 4352 -2863 -3859 3555 381 -3895 1665 1661 -5014 -2165 1606 -2928 -3500
681 -3500 1153 -429 -3370 -219 1214 -2518 -2321 1283 901 -735 2778 3918 -918 -467 3308 1222
697 1222 612 6112 4531 -1168 1340 2801 -1748 808 5463 687 -2140 1239 -1145 -4532 190
712 190 1084 -3376 -2462 -190 -3495 -3944 191 -798 -4376 -1544 -292 -2874 -1279 2678 -88 -2848
$$ packed form
601g79R70m439M147K577n564J380N635l505j506N823k097m305L949J091l794K383
617A966K620l235j127J938o70j718J079K009j169k388K356l08m277K685L949m567
633h57p33M798m214l941O880m2o440N075K539p774K093N746n105j998N985j785
649B27l919M237J713l601j78L356j075k962L325K628l531r60L994k294m034N663
665B589K420o762J917M188p215r96P414l174m276N560mo675K849L771m534n72
681c500M653j582k941L151J433l732J97L604l82j636L513J140m836M51L775k086
697A222o10N500j581n699K508J461m549K556M655m776k827L379k384l387M722
712A90Q94m460R14K272l305m49M135r89l578K832J252k582J595L957k766k760
$$ plain form
728 -2848 753 1519 -1197 1566 5230 737 -913 2933 1021 -1708 3657 5084 -422 227 3369 -1602
744 -1602 -2592 3633 2440 -2647 596 1693 -3790 -1965 2916 -376 -2916 1288 597 -3740 -544 2540
760 2540 -1738 -2591 1806 -33 -3305 884 2625 -2722 -2035 1947 -1208 -3059 2092 1532 -3236 -786
776 -786 1544 -2443 -1821 2731 341 -2630 1103 1577 -2112 349 3586 244 -633 3218 1825 -948
792 -948 2105 3458 92 977 3837 879 -420 2625 1449 -1288 978 1870 -1581 -1833 758 -1195
808 -1195 -2928 -102 -388 -3757 -2389 -403 -2955 -3105 -210 -1476 -4207 -1027 111 -2939 -926 1852
824 1852 -1311 -1815 1766 1214 -1300 1923 2750 -736 292 3157 1067 -110 3531 2227 -1091 1282
840 1282 3096 162 356 2947 885 -2331 1039 2163 -1317 -46 3126 -586 -2679 1578 756 -2380
$$ packed form
728b848L601P66k716K763L664m493j650L846j912k729N365J427n506O49L142m971
744a602r90O225j193n087L243J097n483J825M881l292k540M204o91m337L196L084
760B540m278q53M397j839l272M189J741n347O87L982l155j851N151n60m768K450
776g86K330l987O22M552k390k971L733M74l689K461L237l342q77L851j393k773
792i48L053J353l366Q85K860k958j299L045j176k737K266Q92l451k52K591j953
808a195j733K826k86l369J368J986k552j50K895j266k731L180J138l050K013K778
824A852l163n04L581n52k514L223Q27l486J028K865k090j177L641j304l318K373
840A282J814k934J94K591k062l216L370J124l480J271L172l712k093M257q22l136
$$ plain form
856 -2380 626 1994 -2284 -1888 1609 -929 -2745 775 185 -3440 -1452 1426 -1599 -2711 398 -998
872 -998 -3860 -902 1403 -1573 -1563 928 -1678 -3315 1052 2062 -1392 490 2368 -1502 -1275 2853
888 2853 1968 66 2745 2509 -999 401 3406 961 707 3009 1238 -1476 1135 2093 -136 188
904 188 1590 -884 -2372 873 863 -1629 -158 556 -2629 -1885 1600 -90 -1440 948 -24 -2976 -615
921 -615 1669 -717 -317 2240 -655 -2638 601 1077 -1385 212 1768 -1468 -2350 1061 294 -2298
937 -2298 212 1310 -2041 -1430 1933 -365 -2259 1537 1100 -2320 462 2942 -576 -364 3096 888
953 888 -1656 2741 3292 -424 1263 3190 -665 -833 2735 1768 -810 1289 1892 -1567 -1383 1774 -78
970 -78 -2469 637 500 -3140 -1355 1271 -2007 -2925 824 -803 -3355 166 786 -2446 -1616 1195 -1325
$$ packed form
856b380L006J368m278L96L497k538j816L520n90l625J988K878l025j112L109j396
872i98k862K958K305k976J0K491k606j637M367J010l454J882J878l870K27M128
888B853q85j902K679k36l508J400L005k445k54K302j771k714K611R58k229L24
904A88J402k474j488L245j0k492J471P14l185P44L485j690j350K388r72k952K361
921f15K284k386M00K557k895j983L239M76k462J597J556l236q82L411p67k592
937b298K510J098l351O11L363k298j894L796m37l420K782K480l518K12L460k208
953H88k544M397N51l716J687J927l855j68L568r67k578K099O03l459J84L157j852
970g8k391L106j37l640J785K626l278r18L749j627k552L521O20l232Q30K811k520
$$ plain form
987 -1325 -1854 1422 383 -1732 417 1222 -1306 -373 1612 435 -809 1414 1250 -1187 442 2199
1003 2199 -218 -441 2220 693 -1079 1420 1874 -515 901 2536 -9 -277 2282 987 -508 1734
1019 1734 1462 -1007 -326 1868 -397 -1705 970 -110 -2590 -817 526 -2508 -1915 59 -1675 -3116
1035 -3116 -367 -475 -3169 -1324 604 -2087 -1815 1154 -94 -1740 1025 1648 -988 388 2781 785
1051 785 -228 2762 2364 -116 1694 3454 579 265 3392 1287 -981 1612 1882 -1297 92 2135
1067 2135 -688 -1623 553 -733 -2410 -394 629 -1734 -1796 42 -1200 -2358 90 208 -1903 -1102
1083 -1102 561 -1387 -1822 971 202 -2137 -37 855 -1520 -334 1714 -492 -1347 1246 245 -1326
1099 -1326 828 1723 -854 -125 1736 -109 -506 1480 1446 -375 1051 1855 -158 -78 2030 710 -100
$$ packed form
987a325n29L276j039k115K149Q05k528R33J985j177j244K223j64k437J629J757
1003B199k417k23K661j527j772K499M54k389J416J635k545k68K559j295j495K242
1019A734k72k469O81K194k265j308K675j080k480J773J343l034N93J974j734j441
1035c116K749j08k694J845J928k691K72K969j248j646K765O23k636J376K393j996
1051G85j013K990l98k480J810J760k875l14L127k105k268K593K70l179J389K043
1067B135k823r35K176j286j677K016J023k363o2J838j242j158K448J18k111Q01
1083a102J663j948m35K793p69k339K100Q92k375J186K048k206q55K593j001j571
1099a326K154Q95k577P29J861j845l97J986l4j821J426Q04k013Q0K108j320q10
$$ plain form
1116 -100 1576 1175 -921 -35 1604 -390 -849 948 -434 -2391 -530 271 -2064 -1362 481 -1702
1132 -1702 -2505 273 -143 -2528 -640 861 -2081 -1278 1852 -129 -1396 1354 1120 -1205 1044 2716
1148 2716 54 142 2202 810 -522 1678 1872 -604 -154 1292 -298 -1214 716 546 -2150 -877
1164 -877 764 -1711 -2041 792 -678 -2896 339 616 -2039 -247 1301 -1082 -1233 1582 777 -808
1180 -808 1728 1751 -218 450 1914 709 255 1797 1426 -420 489 1290 -463 -1023 847 45 -1729
1197 -1729 -283 141 -2190 -1318 656 -1126 -1976 504 -388 -2144 391 915 -1688 -152 1282 -919
1213 -919 -569 1672 368 -628 1171 1097 -706 363 1637 125 -535 727 269 -1198 159 975 -912
1230 -912 -815 887 -386 -1743 532 875 -1596 -435 1584 -759 -1068 1450 375 -1340 921 1173
$$ packed form
1116a00J676m01k096Q86J639j994m59J797j382j957J861Q01k335P02J843k183
1132a702q03K778m16k385J888J501k942Q03L130j981j267K750k34k325K249J672
1148B716k662Q8K060j392j332K200J94k476M50J446j590r16J930j70k696J273
1164h77J641k475l30K833j470k218L235K77k655J792J548k383j51K815q05j585
1180h08K536K3j969O68J464j205m54J542l71j846R09Q01j753n60J870q02j774
1197a729J446M24k331Q72J974j782q50K480q92j756K535N24k603J536J434k201
1213i19L50K241j304r96J799p4j803J069J274j512o60J262m58j467J357Q16j887
1230i12R7J702j273j357K275L43k471J161K019k343l09K518j075j715K261K52
$$ plain form
1246 1173 -1154 -40 1771 -26 -732 1269 563 -1175 292 943 -812 -704 689 -333 -1639 -149
1262 -149 474 -1175 -394 827 -898 -1759 633 519 -1247 449 1404 -779 -467 1937 568 -465 1781
1279 1781 1753 -798 882 2095 132 -15 1635 353 -846 518 811 -1024 -311 450 -877 -1735 -211
1296 -211 -301 -1768 -866 83 -1635 -1567 286 -492 -1621 71 588 -1312 10 1130 -611 -443 1697
1313 1697 409 -524 1294 1633 -433 930 1455 70 44 1592 790 -585 637 925 -975 -410 1051
1330 1051 -340 -1168 701 264 -1666 -307 926 -993 -929 940 -240 -1261 549 722 -1139 -206
1346 -206 1068 -604 -1015 1248 195 -1417 336 987 -974 -489 1319 -256 -1331 421 181 -1327
1362 -1327 -205 963 -692 -780 1165 111 -1277 712 1010 -533 126 1595 127 -210 1239 569
$$ packed form
1246A173k327J114J811j797p06K001p06j738J467O51j755J08J393j022j306J490
1262a49O23j649P81J221j725q61K392j14j766J696R55k183L12K404j369j033K246
1279A781k8k551J680J213j963j47J650j282j199J364K93j835P13P61j327q58J524
1296b11r0j467R02R49j718O8J853p78j129J692N17j900J322J120j741J68K140
1313A697j288r33J818L39k066J363N25j385k6J548q02j375J222K88j900N65J461
1330A051j391q28J869m37j930J359J233j919O4J869j180j021J810J73j861R33
1346b06J274j672m11K263j053j612J753O51j961M85J808j575j075J752k40j508
1362a327J122J168j655q8J945j054j388J989K98j543O59J469j468l37J449o70
$$ plain form
1378 569 -580 803 1423 -226 -390 1287 57 -939 611 450 -1231 -180 740 -811 -1197 679 -490
1395 -490 -1945 -45 256 -1154 -378 772 -723 -714 864 213 -947 560 684 -642 74 1175 265
1412 265 -692 856 905 -726 336 838 -610 -690 643 -207 -1132 251 262 -1325 -399 558 -1009 -895
1430 -895 844 -216 -1132 428 415 -947 -207 1150 -310 -503 1308 552 -661 806 1294 -322 208
1447 208 1533 401 -571 999 917 -901 78 866 -559 -1012 673 -356 -1549 92 919 -1447 -760
1464 -760 913 -783 -1311 457 180 -1206 249 783 -809 -726 748 126 -458 509 479 -575 -137 1063
1482 1063 -214 -320 804 186 -735 234 735 -630 -232 880 -224 -824 605 338 -592 128 1156
1499 1156 -408 59 1148 215 -404 892 773 -486 512 833 -309 -314 832 -117 -768 88 319 -937
$$ packed form
1378E69j149J383O20j649j64J677j230r96J550j61j681J051R20j551l86J876j169
1395d90j455J900L01j410P76J150j495RJ578o51j160J507J24j326P16J101r10
1412B65r57J548M9j631J062N02j448q0J333q50r25J383J1j587R26R57j567J14
1430h95J739j060r16J560j3j362P40J357j460j93J811p56j213J467M88j616N30
1447B08J325j132r72J570q2j818R79P88j425m53J685j029j193J641Q27k366O87
1464g60J673j696n28J768k77j386J455N34j592Q3J474o22n84R67l0j054M38J200
1482A063j277j06J124o18r21R69N01j365L98J112j104o00J429k67r30P20J028
1499A156j564M67J089r33o19J296j19j259R98L21j142nJ146r49o51Q56K31j256
$$ plain form
1517 -937 -659 125 -844 -1226 158 -232 -1595 -589 222 -1170 -857 632 -369 -1172 660 612 -945 564
1535 564 1377 131 -251 1408 447 -151 1023 1133 -281 374 1368 102 -392 1051 519 -1040 57
1552 57 598 -1024 -819 585 -321 -1385 150 262 -1199 -499 720 -591 -1044 930 128 -1053 336
1569 336 991 -486 176 1206 -395 -500 739 648 -532 274 922 -433 -155 715 105 -827 217 388
1587 388 -852 -140 610 -712 -749 460 93 -954 330 198 -693 -386 498 -267 -777 554 126 -526
1605 -526 188 533 -645 -242 735 -127 -864 579 519 -695 -52 511 -520 -508 569 -114 -698 184 473
1624 473 -660 70 952 55 -207 1093 347 -451 643 954 -434 -132 824 228 -676 796 240 -947
1642 -947 -44 402 -750 -916 467 -455 -1683 -73 -253 -1520 -562 120 -962 -930 172 16 -770 53
$$ packed form
1517i37K78P84r69l82J384l90j363J006Q11j392L13J489j001q03J832m8j557J509
1535E64Q13j246l82J659r61n98J174J10j414O55R94j266m94J443n32j559J097
1552E7N41j622K05J404r06j064J535J12j461P00J219j311m53J974q02j181J389
1569C36O55j477O62J030j601j05J239r1j180Q06O48j355K78Q70o10r32J044J71
1587C88j240P12P50j322l7J209l67j047J284j32q91L07Q84p65n10J331m28o52
1605e26P14L45j178M03R77q62p37J443o0j214O43N63j031J2J077o83n84Q82K89
1624D73j133P30Q82q97k62J300p46p98J094L11j388L02R56n96r04J472n56j187
1642i47R03M46j152j66J383r22j228J610j80j267R58O82j082L2J102j56p86Q23
$$ plain form
1660 53 644 -356 235 1156 324 -388 1136 781 -19 588 1425 131 130 1506 747 -264 826 776 -673
1679 -673 -7 588 -639 -543 115 -113 -1183 -196 134 -859 -764 -85 -575 -751 301 -47 -1100 70 589
1698 589 -252 -23 884 -84 -609 550 625 -313 392 536 -527 -307 600 -75 -822 -15 401 -874 -489
1717 -489 531 -309 -743 174 181 -893 266 571 -325 -282 836 46 -501 998 879 -225 297 974 49
1736 49 -377 1071 339 -568 436 735 -600 -259 566 -662 -699 220 72 -1058 -352 11 -998 -822 390
1755 390 -343 -870 317 101 -724 40 840 -21 -257 637 678 -277 457 795 -398 -253 849 52 -721
1774 -721 380 309 -771 44 545 -679 -584 391 -432 -678 -38 199 -302 -334 526 -294 -323 883 341 -314
1794 -314 481 718 182 147 1199 122 -177 642 417 -418 188 550 -447 -264 408 -88 -701 -7 -146 -1236
$$ packed form
1660E3N91j000N91R21q32p12J524l55q00O07Q37j294jJ376p59j011J090n0j449
1679f73O66N95j227R6O58k28j070R87L30r93R5O79m90j76J052l48j053J170N19
1698E89q41K29R07r68n25J159P5r38P05J44j063K20R07o75p47Q07M16j275L85
1717d89J020q40m34R17Pj074J159L05q96M3J118p90n47J499j19j104N22O77r25
1736D9m26J448p32r07J004K99j335L41Q25j228l7R19j48j130P06L63j009J76J212
1755C90p33n27J187k16q25P64Q00q61k36Q94M1r55P34L38j193J45J102p97p73
1774g21J101p1j080Q15N01j224R5R75q23k46O40K37n01l2Q60q20k9J206n42o55
1794c14P95K37n36l5J052j077k99Q19k25q35O06L62r97J83O72m96o13O94j39j090
$$ plain form
1814 -1236 -571 77 -726 -960 19 -272 -981 -227 7 -964 -158 861 -385 -349 546 371 -337 467 753
1833 753 -399 201 985 35 -215 817 585 -305 443 530 -204 -251 561 -200 -684 260 330 -741 -741 639
1853 639 -75 -574 702 187 -641 282 539 -291 -232 406 -22 -367 87 497 -698 -2 359 -438 -589 272
1873 272 -269 -935 -180 -61 -981 -614 463 -449 -885 143 47 -639 29 193 -410 -134 516 71 -101 685
1893 685 592 -249 351 657 85 -105 704 602 -146 397 509 -119 -42 509 -187 -381 724 -187 -789 150
1913 150 56 -461 -338 207 -308 -298 185 304 -510 102 344 -349 -353 517 51 -376 463 144 -536 -10 438
1934 438 -177 -270 509 95 -620 131 257 -721 -318 433 -243 -694 229 88 -531 -93 550 -431 -409 583 130
1955 130 -398 426 582 -219 256 582 279 -249 619 476 -270 336 660 -304 -123 500 55 -163 136 415
$$ packed form
1814a236O65O48q03k34R79k91p09P54K34r71Q06J019j246L6Q95j75p08Q04K86
1833G53j152O00P84r50k50J032k32q90P48Q7p34m7Q12p61m84R44P0j071%J380
1853F39p14m99J276n15q28R23K57q30N9O38m28l45M54M10j195O96L61p97j51Q61
1873B72n41o66P55J19r20L67J077r12m36J028r6o86O68J64o03K76O50m45j72P86
1893F85r3q41O00L06n72j90Q09j02p48N43J12o28P7N51o96j94J105r11o02R39
1913A50r4n17J23N45n15J0M83J19q14O12K42o93mQ70m66m27Q39l19o80N26M48
1934D38o15r3P79m14p15P51J26r78M03P51o76m51R23j41o19M38O43r81K2R92m53
1955A30n28Q24J56q01M75L26l03n28Q68j43p46O06L24r64J81O23m45k18K99K79
$$ plain form
1975 415 -546 -163 379 -438 -515 430 -88 -624 144 436 -461 -112 443 -182 -116 426 170 -512 232 526 -232
1996 -232 -23 338 -70 -148 171 32 -553 115 302 -403 -241 139 -85 -527 277 218 -595 198 299 16 -185
2017 -185 601 259 -601 398 505 -191 336 835 49 -163 521 222 -412 241 361 -167 -316 545 -158 -589
2037 -589 42 154 -736 -276 150 -188 -465 -7 -178 -489 -181 394 -586 -322 454 1 -372 403 546 -206
2057 -206 196 648 -54 2 573 3 -241 282 422 -385 99 353 -413 -372 305 150 -379 65 312 -236 -119
2078 -119 647 98 -376 255 353 -146 276 440 57 -176 435 -123 -330 224 322 -482 -43 413 -325 -453 233
2099 233 -125 -676 -107 40 -562 -513 395 -247 -167 107 -68 -290 44 439 -295 -122 443 -65 -321 504 658
2120 658 -400 189 547 -150 -37 412 208 -219 148 188 -411 -122 473 -378 -519 117 86 -505 41 226
$$ packed form
1975D15r61L83N42q17p7R45n18n36P68K92q97L49N55o25O6N42k56o82P44K94p58
1996b32K09L61m08p8L19j39n85O68J87p05J62L80k24m42Q04n9q13P93J01k83k01
2017a85P86l42q60R99J07o96N27M99p86k12O84k99o34O53J20n28j49Q61p03m31
2037e89O31J12q90M60M26l38k77M58j71l11L08N75r80K64P76m53l73P75J43p52
2057b06M02M52p02N6N71n70k44N23J40q07M84K54p66M1O77j55n29M44K47n48J17
2078a19P66n49m74O31R8m99M22J64l83k33O11n58k07N54R8q04M39M56p38j28O86
2099B33l58n51N69J47o02M9R08o42Q0K74j75k22L34L95p34J73N65n08k56Q25J54
2120F58j058N89L58o97J13M49k04m27L67M0n99K89N95q51j41O36l1n91N46J85
$$ plain form
2140 226 -476 -51 216 17 -269 325 247 -370 8 808 -8 -216 535 243 -610 315 487 -95 -80 411 -29
2161 -29 -349 335 -89 -384 93 150 -230 -553 124 -251 -432 60 48 -453 -239 204 -183 55 336 309 -300
2182 -300 263 476 -253 260 542 69 -381 409 175 -139 192 461 -386 -318 257 -215 -531 255 -55 -303
2202 -303 -257 245 -37 -196 288 72 -305 96 303 -165 -57 331 -128 -219 441 302 -378 35 447 -78 -197
2223 -197 517 -65 -418 241 -243 -564 6 11 -321 -248 78 -75 -425 109 356 -277 231 414 244 -252 562
2244 562 419 -60 306 677 163 312 575 222 -185 575 252 -206 211 161 -234 -138 260 -15 -366 -91 -84
2265 -84 -572 -314 58 -352 -407 -47 -121 -246 41 269 -417 -476 114 -22 -362 246 341 -32 210 382 39 23
2287 23 444 190 -190 483 227 44 -122 437 -192 -158 -138 -76 -384 91 2 -332 -33 378 -8 -291 352 113
$$ packed form
2140B26p02M25K67j99k86N94p8o17L78Q00q16k08P51k92q53R25J72n82J5M91m40
2161b9l20O84m24k95M77N7l80l23O77l75j81M92j2n01K14M43l87K38K81k7o09
2182c00N63K13p29N13K82m73m50P90k34l14L31K69q47O8N75m72l16P86l10k48
2202c03M6N02k82j59M84k16l77M01K07m68J08L88m59r1O60j39o80M13M12n25j19
2223a97P14n82l53O59m84l21N70Nl32P3L26j53l50N34K47o33N08J83j70m96Q14
2244E62j43m79L66L71n14J49K63l53m07P60l23m58M17n0l95R6L98k75l51K75P
2265h4m88K58L72m10n5L60p4j25K87K28o86n9N90j36l40O08R5l73K42J72l43j6
2287B3M21k54l80O73k56j83j66N59o29L4K0O2l08M75q9l34K99M11l86k83O43k39
$$ plain form
2309 113 -49 162 532 232 -174 634 233 20 337 608 -198 34 172 -250 -116 96 -91 -805 -347 -126
2329 -126 -453 -349 3 -326 -360 -37 233 -172 55 294 -186 30 328 407 -252 369 642 -40 330 443 169
2350 169 36 588 183 -161 261 400 -399 -172 220 -188 -381 136 -49 -443 -243 -36 -652 -299 247 -83
2370 -83 -336 -122 118 -315 61 170 -121 -219 396 406 -231 201 309 38 -86 378 166 -153 103 -190 -384
2391 -384 -27 23 -252 -532 60 -27 -197 204 60 -322 -76 194 -120 -154 335 56 -128 512 310 -259 240
2412 240 430 174 -5 467 358 -101 315 306 -5 -217 232 33 -169 89 -173 -545 -372 -13 -506 -366 24
2433 24 -146 -134 -42 340 -21 -72 150 21 -240 206 263 -306 239 504 -141 -139 563 106 -113 151 -63 -319
2455 -319 -87 -128 -229 -414 115 -28 -248 -190 256 -375 -42 123 23 -53 358 249 -311 319 173 -31 86
$$ packed form
2309A13j62K11L70l00m06Q08m01k13L17K71q06K32J38m22J34K12j87p14M58K21
2329a26l27J04L52l29l4L23K70m05K27K39m80K16K98P9o59O21K73o82L70J13k74
2350A69j33N52m05l44M22J39p99K27L92m08j93N17j85l94K00K07o16L53N46l30
2370h3k53K14K40m33L76J09k91r8O15J0o37M32J08k71j24M64k12l19K56k93j94
2391c84L57N0k75k80N92q7j70M01j44l82K46K70l14l4M89k79j84O40k02n69M99
2412B40J90k56j79M72j09m59M16rl11k12M49j99k02K58k62l72J73L59m93J40L90
2433B4j70J2R2L82l61n1K22j29k61M46N7n69N45K65o45KP02m57k19K64k14k56
2455c19K32m1j01j85N29j43k20N8M46o31L33J65j00p6M11j09n60O30j46k04J17
$$ plain form
2476 86 140 -5 82 211 76 -80 172 330 -229 -84 -71 15 -641 -87 -153 -439 -413 -160 -297 -461 -15 -120
2498 -120 -413 6 151 -103 -158 277 12 -283 269 236 99 213 311 -190 135 478 130 -85 430 277 -185
2519 -185 190 268 99 -198 194 -156 -271 -91 4 -144 -156 172 -136 -366 248 -93 -37 103 130 -132 -20 156
2541 156 171 -39 393 268 -101 -31 390 -270 -229 12 -143 -210 -153 24 -393 -385 128 -108 -440 -76 -38 -288 -13
2564 -13 59 6 -129 131 -248 -43 317 241 124 95 275 95 -9 31 161 133 87 192 -24 -55 205 97 95 17
2588 17 -4 -382 -118 -206 -354 -330 -5 -97 -228 196 75 -199 -76 28 -83 -124 205 134 -99 112 274 -173
2610 -173 -14 112 72 -204 96 170 -395 -90 193 -436 -143 -102 -81 -316 -57 129 -453 -53 335 -92 -289
2631 -289 144 149 -185 83 298 -113 353 229 140 232 515 105 -187 -42 302 -212 165 397 20 -245 7
$$ packed form
2476H6N4j45Q7J29j35j56K52J58n59J45J3Q6o56N54o6k86K6K53j37j64M46j05
2498a20k93M19J45k54n5M35k65k95N52l3j37J14R8n01L25L43l48k15N15j53m62
2519a85L75P8j69k97L92l50j15J80R5j48j2L28l08k30O14l41N6J40K7k62J12J76
2541A56J5k10M32j25l69P0M21o60M1K41j55o7N7J77m17QN13k36l32L64L8k50K75
2564a3P2n3j35K60l79K05L60p6j17k9J80j80j04M0J30k8m6J05k16l1K60j08kp8
2588A7k1l78K64q8j48K4L25r2j31M24j21k74J23J04j11m1L29p1k33K11J62m47
2610a73J59J26m0k76L00P4n65L05K83o29K93M1K1k35K59J86n82M00L88m27j97
2631b89M33Nl34K68K15m11M66j24q9R2K83m10k92J45L44n14L77K32l77k65K52
$$ plain form
2652 7 7 -582 -195 -58 13 65 259 68 -360 -295 43 -100 -257 172 241 -268 173 32 -90 218 174 79 -26
2675 -26 214 30 3 -60 63 -123 -103 -40 116 38 187 98 -158 -70 97 -179 -319 343 -22 -120 99 168 30
2698 30 235 25 103 -38 77 130 -104 130 36 -69 -37 214 -154 -220 20 -175 -75 -370 41 -337 -111 -32
2720 -32 -222 -376 7 -25 -173 234 155 -82 -3 173 62 -73 -7 -5 28 198 311 6 41 154 161 78 27 192
2744 192 -322 87 62 -102 -371 35 58 -145 -118 -114 -158 -147 -151 -26 -213 181 8 -160 205 103 -5 58 32 18
2768 18 -28 142 121 59 80 222 219 -169 313 159 -329 -29 -116 -246 -161 -127 -80 -398 209 -197 -430 -26 88 -231
2792 -231 -98 -30 70 -154 68 276 -182 -36 197 128 -6 43 142 -62 168 -209 -48 -190 181 -91 -366
2813 -366 -55 -17 -320 13 -135 -160 -266 377 12 -542 129 -33 -159 -48 411 12 61 368 -6 86 -72
$$ packed form
2652G%n89L87J37P1N2J94j91m28O5L38j43j57M29O9n09M41j41j22L08m4r5j05
2675b6K40j84k7o3J23j86K0O3J56p8J49q9k56Q8J67k76j40O62l65r8K19O9j38
2698C0K05k10P8j41J15N3k34K34r4j05L2K51l68o6K40j95J00k95M11l78K26P9
2720c2j90j54L83l2j48M07p9k37P9J76j11j35O6KL3J70J13l05L5J13Pq3n1J65
2744A92n14M09k5j64k69M06K3k03K7Mm4J1mJ25j87L94j73j68L65j02j08O3k6j4
2768A8m6J70k1o2K1J42ll88M82j54m88L00q7j30Q5L4M7l18O07m06k33M04J14l19
2792b31J33O8J00k24K22K08m58J46K33o9j34M9R9k04K30l77J61j42L71k72k75
2813c66L11L8l03L33j48k5j06O43l65n54O71j62j26J11M59l99M9L07l74R2j58
$$ plain form
2834 -72 25 -136 18 139 57 -110 -120 70 -101 -96 -60 -249 -236 166 -20 -169 -32 -258 -154 -245 69 -159 137
2857 137 139 5 -244 -53 266 -119 -130 562 24 25 304 -6 -102 -34 59 -98 -24 224 -112 -83 12 15 -273 201
2881 201 -6 -5 -143 -38 -60 -165 52 38 -34 30 35 32 -99 280 313 190 235 244 91 39 140 2 -128 63 26
2906 26 -153 -203 84 -168 44 -15 -116 -4 -58 177 42 204 237 -92 -84 208 276 -169 50 256 -182 -128 222
2929 222 246 -55 -22 267 18 23 337 -45 -147 43 -66 -334 -49 -92 -68 59 -244 -39 -162 -23 -101 -379
2951 -379 65 153 -84 -47 33 -150 -99 148 81 -76 -93 88 -40 92 241 107 -137 -143 -57 -165 -40 162 97
2974 97 -223 -122 -1 -46 -100 -27 -123 178 30 -172 -73 37 -145 -136 88 138 146 -246 83 311 160 201 163 -55
2998 -55 -83 119 171 -27 31 344 -161 38 -222 -154 35 -351 77 -158 -97 -219 -255 65 206 -203 110 -110
$$ packed form
2834g2R7j61J54J21q2j67j0J90j71NL6j89J3M02j86j49J37k26J04r1L14k28K96
2857A37Kj34k49J91L19l85j1O92n38JK79l10r6O8R3j57P4K48l36K9R5Lk88M74
2881B01k07Jj38J05k2j05K17j4p2O4Nlj31L79L3j23M5Rj53n2J01j38j30J91l7
2906B6j79n0K87k52K12n9j01J12n4K35j35J62L3l29QK92O8m45K19K06m38N4L50
2929B22K4l01L3K89k49NL14l82j02J90j09k68K85m3K4J27l03K05j23J39p8k78
2951c79M44Q8k37L7Q0j83N1K47o7j57j7J81j28J32J49j34k44oQ6j08J25K02o5
2974I7l20J01J21m5n4P3r6L01j48k02R9J10j82RK24N0Ql92L29K28j51M1l8k18
2998e5k8K02N2j98N8L13n05J99k60O8J89l86M28k35O1j22l6L20J41m09L13k20
$$ plain form
3020 -110 349 249 198 252 73 75 144 54 17 322 144 -153 112 61 -40 -107 188 109 -158 155 -2 -298 6
3043 6 -108 102 -78 230 30 -142 54 67 229 247 91 -5 -206 179 57 -152 357 326 24 -251 142 -66
3065 -66 72 123 -64 -167 -153 -91 -280 -164 33 -22 -124 -108 109 -150 -229 391 25 -93 409 310 -66 171 299
3088 299 -228 -253 112 182 -171 216 88 162 106 59 -53 -70 -34 -116 -156 -87 34 -97 -154 267 -152 -396 50 -2
3112 -2 -106 -196 -80 30 18 132 -25 -191 211 140 98 26 125 56 225 227 324 -68 -135 257 -223 118 -237 70
3136 70 -166 -83 -9 -209 -96 54 73 -33 288 -29 -114 180 -56 5 174 321 -113 10 302 1 -90 23
3158 23 47 88 -158 184 19 -184 -22 115 -369 -24 213 -40 -148 166 -196 -284 150 -4 -162 -109 120 295
3180 295 41 167 172 122 33 121 3 -71 36 5 30 167 109 -93 -253 85 -1 -235 42 6 82 -82 22 -40
$$ packed form
3020a10M59j00n1N4j79KO9r0l7L05j78k97K65n1j01o7K95p9k67L13j57k96L04
3043Fj14K10j80L08k00j72J96J3J62J8j56r6k01L85j22k09N09l1l02k75L93k08
3065f6J38N1j87j03J4O2j89J16J97n5j02J6K17k59p9O20l66j18N02r9l76K37J28
3088B99n27k5L65P0l53L87j28P4n6m7j12j7L6q2m0O9J21j31n7M21m19k44M46n2
3112bj04r0J16J10j2J14j57j66M02p1m2p2R9o9J69KR7l92o7L92m80L41l55L07
3136G0k36Q3P4k00J13J50J9j06L21l17q5K94k36O1J69J47m34J23K92l01r1J13
3158B3K4M1k46L42j65k03J62J37m84L45K37k53j08L14l62q8M34j54j58N3K29J75
3180B95k54J26Nn0q9Q8j18p4J07l1K5J37n8k02j60L38q6k34K77l6P6j64J04o2
$$ plain form
3204 -40 136 169 -11 -18 269 -146 29 -17 309 -76 -114 192 114 70 86 -161 -166 165 78 40 173 348 173 129 132
3229 132 213 -70 -195 53 -259 -20 -16 88 145 149 125 -188 80 265 127 2 33 -123 -76 211 207 -120 -9 126
3253 126 140 -86 4 0 -17 59 217 54 -45 210 -165 -103 -55 -49 118 17 -135 -309 -236 69 -16 -32 135 -149 -76
3278 -76 75 77 -158 55 217 -17 -62 20 325 50 -31 140 -87 -145 -135 62 -138 -22 104 -41 -139 79 -125
3301 -125 -229 103 86 -140 -86 26 -85 -46 99 -1 -44 -195 269 40 120 230 201 -279 166 -64 2 -84 75
3324 75 -87 -79 140 8 -253 -120 -164 -302 51 113 -37 142 193 -215 -135 0 -18 107 -149 330 130 -270 25
3347 25 296 236 -217 210 25 -10 48 75 51 -251 -53 -186 -81 -75 -200 70 22 -46 -313 5 -26 -17 251 169 -54
3372 -54 116 35 118 99 -137 49 70 -147 121 -130 90 74 -18 114 29 -104 119 124 55 54 17 -164 52 54 -17 92
$$ packed form
3204d0J76L3j80pK87m15J75m6L26l85l8L06p8m4J6k47nL31q7l8J33J75j75m4L
3229A32Q1k83j25K48l12K39MJ04N7Mk4l13K68J85j38j25L1j56M7K87ml27J11J35
3253A26J4k26R0mj7P6J58j63r9K55l75O2M8OJ67j01j52j74P3L05q5j6J67k84P3
3278g6J51Kk35K13J62k34m5Q2L05k75q1J71k27n8J0J97k00J16J26j45r8K18k04
3301a25j04L32j7k26N4J12j11L9J45j00m3j51M64k29Q0J10k9m80M45k30O6q6J59
3324G5j62QK19j32k61J33m4j38L53O2j50J79N1m08Q0J35j8J25k56M79k00m00K95
3347B5K71o0m53M27j85l5N8K7k4l02J98j33J05Oj25K70m8o8k67L18l1RK68q2k23
3372e4J70q1Q3j9k36J86K1k17K68k51K20j6r2J32q5j33K23No9jl7j81K16Kp1J09
$$ plain form
3398 92 -44 -140 0 -116 -94 -36 32 189 -266 -102 -70 189 397 63 -69 77 -96 -59 23 37 249 -10 -104
3421 -104 38 -24 -183 155 154 -326 -167 98 -3 -332 -40 -118 -233 321 -6 -303 45 31 -207 -10 202 114
3443 114 42 -11 463 -269 -73 196 -79 85 152 -141 65 -68 47 -68 -42 -25 -297 85 -189 -41 -46 -40 89
3466 89 116 -194 -81 9 -86 -34 1 -85 96 173 -8 -33 -162 -86 -86 30 -84 -212 70 91 71 -438 -60 -22 82
3491 82 38 82 -186 -124 -46 35 32 158 -298 -80 8 221 60 33 77 -103 -46 128 129 -115 87 428 -12 145 166
3516 166 73 28 -102 95 -107 -126 126 84 85 -59 147 -300 -136 -369 -55 -111 104 285 26 77 204 15 51
3539 51 100 104 153 -18 79 9 123 -115 161 -174 44 5 -93 -69 -149 -20 -10 -26 -11 14 -34 90 -264 -3 27 -82
3565 -82 167 258 -189 132 179 159 63 -48 -7 -16 -21 77 99 14 -68 -135 -76 46 135 59 4 8 -38 -99 -3 41 -95 -312
$$ packed form
3398I2j36r6J40j16K2N8O8J57m55J64L2K59K08l34j32J46j73L7Q2J4K12k59r4
3421a04J42o2j59L38jm80J59K65j01l29K92p8j15N54l27k97L48j4k38J97K12q8
3443A14p2n3M74p32J96K69k75J64O7k93K06j33J15j15K6J7k72L82k74J48nOJ29
3466H9K7l10J13R0r5N2L5q6J81P7j81k5j29P6%J16j14j28K82K1k0n09L78L8J04
3491H2m4M4k68O2P8Q1lJ26m56K18Q8K13j61k7M4j80N7J74Jk44K02L41m40J57K1
3516A66r3m5j30J97k02j9K52m2Jj44K06m47J64k33L14n6K15J81k59N1J27j89L6
3539E1M9MM9j71R7p0J14k38K76l35K18l9r8K4q0J29J0j6J5K5m8J24l54K61L0j09
3565h2K49R1m47L21M7k0r6j11M1rnR8K2q5q2o7N9J22Q9p6n5Mm6o1R6M4j36k17
$$ plain form
3593 -312 67 179 83 -75 -65 -213 51 53 -112 53 40 29 268 122 183 104 192 28 83 267 78 -14 -192 72
3617 72 -266 -191 -95 -26 3 -106 -27 -9 -85 -100 56 -205 -88 21 -53 154 108 -2 119 147 95 -109 179 33
3641 33 -110 51 -10 42 -31 -4 18 75 -83 -215 -66 17 -74 -175 -136 -13 -55 169 -151 -148 102 -18 -131 118
3665 118 -24 126 83 -59 -102 34 -46 121 175 126 -171 -41 48 -61 84 -205 -160 74 0 100 -120 17 128
3688 128 88 -230 -127 47 -57 91 -19 -70 107 192 200 -181 85 -103 137 214 134 104 -197 48 -89 -25 86
3711 86 140 87 -62 -26 -60 47 -94 -94 -256 114 70 144 -109 91 19 -45 -138 19 86 -140 184 212 98 130 38
3736 38 -77 -79 46 -168 22 65 129 -76 -116 -27 44 86 222 -171 56 118 -85 -131 262 -164 -156 87 113 -244 -122
3761 -122 42 37 -147 180 302 66 244 18 -106 -216 150 209 67 172 -7 90 7 -208 -203 -172 -8 91 -74
$$ packed form
3593c12L79J12r6j58J0j48K64Kj65J65j3j1K39j46O1p9Q8j64N5J84j89r2j78K64
3617G2l38P5R6O9K9j09P9J8p6j5J56k61J17J09p4K07m6j10J21K8n2k04K88j46
3641C3j43J61o1N2p3K7K2N7j58j32J49Q3r1j01L9J23m2K24l20LK50j20j13K49
3665A18j42J50m3j42m3J36q0J67N4m9k97J30Q9j09J45k89M5K34p4J00k20J37J11
3688A28m0l18J03J74j04J48j10n1J77Q5Ql81K66j88K40P7q0l0l01K45j37O4J11
3711H6N4n3j49L6l4J07j41%j62L70m4P4k53K00p2o4r3J57O7k26L24K8j14L2r2
3736C8j15kJ25k14J90M3O4k05m0Q9P1M2J36l93K27O2k03m6L93m26QK43K6l57J22
3761a22J64nj84L27J22k36J78k26j24j10L66N9j42J05j79R7q3k15NL1J64R9j65
$$ plain form
3784 -74 -53 27 8 -90 201 -142 -68 67 -123 -219 -37 -134 -195 29 206 83 -109 171 313 -90 34 114 -136
3807 -136 37 83 39 -28 -194 -169 -131 -44 -114 120 -48 105 18 125 -180 48 92 -47 88 -233 63 88 232
3830 232 83 -16 234 204 97 189 6 141 22 222 -133 -215 -3 -92 -43 49 -95 -237 -87 32 315 58
3852 58 -151 -110 -3 -424 3 -125 -12 -49 240 137 -297 197 48 202 -72 136 62 265 -201 -52 29 207
3874 207 -74 -305 91 77 -108 31 -18 -177 -88 120 -99 61 -4 30 12 60 137 -115 -98 66 -32 39 221 -157
3898 -157 -32 17 -7 39 149 88 57 -59 -5 57 -127 102 -153 -50 88 -136 -291 -52 13 -167 -167 -170 14 180
3922 180 112 254 58 -172 287 135 50 62 150 1 -143 101 337 -30 67 12 14 31 25 -27 -143 -98 4 -232
3946 -232 -5 -26 86 -54 60 120 -13 -79 -53 -90 -83 1 274 99 -143 40 71 -36 138 49 -121 95 219
$$ packed form
3784g4K1Q0j9r8K91l43P4J35j90r6J82r7o1K24J77j23j92K80J42m03J24Q0k50
3807a36J73M6m4o7j66K5L8Q7p0K34j68J53q7J07l05K28M4j39J35l21K96K5J44
3830B32j49r9K50l0j07R2j83J35j19K00l55q2K12q9M9R2j44j42J50J19K83k57
3852E8k09M1J07m21M27j28J13l7K89j03m34M94j49J54k74K08p4K03m66J49Q1J78
3874B07k81k31L96j4j85J39m9j59Q9K08k19J60o5L4j8M8P7k52J7J64r8P1J82l78
3898a57J25M9k4M6J10o1l1j16N4O2j84K29k55J03J38k24j55K39O5j80%lJ84J66
3922A80o8J42j96k30M59j52q5J2Q8j49j44K44K36l67R7n5KJ7on2j16M5J02k36
3946b32K27k1J12j40J14O0j33o6K6l7PQ4K73j75k42J83L1j07J74q9j70K16J24
$$ plain form
3969 219 -133 -30 16 -51 -92 176 156 45 36 66 -4 -35 80 -84 -1 137 -35 19 280 41 -69 -18 -142 207
3993 207 -21 51 -118 -4 -2 -225 -108 78 -108 36 -29 -159 -126 -88 -87 -25 -109 -126 36 192 -145 153 -17 219
4017 219 60 -171 11 4 -61 -7 75 -105 265 161 50 213 -90 -122 28 2 123 -323 335 -171 49 -31 180
4040 180 37 -138 162 -35 -128 214 197 -164 51 -158 -49 -122 -31 55 -81 316 76 150 -2 29 252 -26
4062 -26 116 180 50 101 -141 -82 -59 5 -1 23 -63 29 -139 -7 -191 -30 4 178 -96 106 164 -267 4 -59 -11
4087 -11 -176 -146 229 137 -72 16 2 246 8 84 152 18 173 -30 -172 -7 217 -16 -128 115 -139 70
4109 70 -3 -14 -134 269 -204 -34 -45 235 101 180 -89 -23 142 105 -182 -5 -293 -77 -206 -105 -59 -65 -80 -130
4133 -130 245 -137 123 -91 0 -1 279 -101 -197 23 -102 73 -122 173 -56 -21 -205 58 -83 25 -71 -61
$$ packed form
3969B19l52J03M6o7m1K68k0j11rL0p0l1J15j64Q3J38j72N4K61k39j10N1j24L49
3993B07k28P2j69J14Kk23J17J86j86J44o5j30L3L8JO2q4j7J62J56l37K98j70K36
4017B19j59k31J82po5N4Q2j80L70j04j11J63l03l2J50k6J21m46O58n06K20q0K11
4040A80j43j75L00j97r3L42j7l61K15k09J09p3R1Q6j36L97k40P4j52L1K23k78
4062b6J42O4j30N1k42N9K3O4oK4q6R2j68J32j84J61L4J74k74K02N8m31K71o3M8
4087a1j65L0L75r2k09Q8j4K44k38P6O8j34J55k03j42J65K24k33j12K43k54K09
4109G0p3j1j20M03m73J70j1K80j34P9k69O6J65l7k87J77k88K16j29J01M6oj5n0
4133a30L75l82K60k14R1jK80l80r6K20j25J75j95K95k29L5j84K63j41J08r6J0
$$ plain form
4155 -61 -58 41 -7 -79 -127 -56 200 -46 -21 -150 -20 -110 58 -136 -254 -110 262 319 -144 174 54 43 89 190
4179 190 47 160 124 -230 -266 107 19 -177 156 183 -84 32 -259 21 -84 -61 192 75 96 -41 44 251
4201 251 -41 -195 -58 112 -1 -108 -108 -135 -70 -88 62 153 241 97 54 27 -95 -14 82 -65 -271 70 95 144
4225 144 -87 185 -92 159 -52 -8 -89 -87 -308 19 150 -216 -74 191 -155 67 229 189 142 98 83 -20 140
4248 140 -222 23 79 -124 68 -34 -71 129 -144 26 97 238 -10 37 237 62 -49 -146 -50 48 -256 -114
4270 -114 84 -113 -124 -28 46 -87 -323 107 -33 -10 -287 99 58 -135 -93 233 97 -40 -207 -55 -184 28
4292 28 -10 117 39 -21 126 -66 -34 -26 -24 -93 -73 16 -226 -27 169 -91 81 -51 128 41 71 79 -41 -61 -44 -7
4318 -7 181 67 -42 -10 -6 21 72 98 53 71 94 -139 -143 -305 128 3 89 -176 214 106 -110 17 -8 128 253
$$ packed form
4155f1LR9m8p2m8P1K56k46K5j29J30r0J68j94j18J44L72N7m63L18j20j1M6J01
4179A90j43J13l6l54l6L73q8j96L33K7k67J16k91K80j05K3K53j17K1j37Q5K07
4201B51k92j54J37J70j13j07%k7O5j8J50R1Q8j44m3k7j22Q1R6j47k06L41K5M9
4225A44k31K72k77K51k11M4q1Kk21L27J31l66J42K65l46K22J62m0m7m4j5j03J60
4248A40l62K45N6k03J92j02l7K00k73J70P1J41k48M7K00j75j11r7R6R8l04J42
4270a14J98j97j1R6P4j33k36M30j40K3k77L86m1j93M2L26j36j37j67J52j29K12
4292B8l8J27p8o0J47j92L2QKo9K0Q9k42J99J96k60J72j32J79q7L0Qj20k0J7L7
4318gJ88j14j09L2MK7N1K6m5J8K3k33mj62M33j25Q6k65L90j08k16J27k5J36J25
$$ plain form
4343 253 67 -119 8 94 20 -71 105 73 -176 -169 -242 180 282 90 52 46 58 -28 139 106 43 -121 -141 -105 -62 -149
4369 -149 -82 -145 85 -100 -118 -18 -201 210 -133 -98 182 182 -133 -115 211 -2 71 212 -269 -38 -136 -12 85
4392 85 -268 126 -56 90 86 -178 52 43 -158 48 46 -89 22 150 172 -152 36 118 9 58 47 -5 -10 11 80
4417 80 -24 -84 -284 103 14 129 9 57 -87 31 -139 33 -187 -94 80 -40 41 -172 -177 -93 -55 54 218
4440 218 3 -78 243 95 84 168 -115 197 327 108 -331 120 -8 92 59 -27 88 59 -96 -173 -223 -182 -222
4463 -222 -216 95 73 23 -22 29 289 274 23 -300 -105 144 -141 -36 2 169 -236 185 33 127 148 -19 271
4486 271 -33 179 -114 55 -53 -185 47 -69 66 9 -23 -28 -167 -196 190 142 -86 47 58 -14 144 37 9
4509 9 -10 -69 -30 -36 24 -18 143 -135 -190 105 100 -60 109 157 -350 -113 -169 30 -54 -10 74 175 58 190 -196 -119
$$ packed form
4343B53j86j86J27Q6p4r1J76l2k49Pp3M22J02j92l8oJ2q6J67l3o3j64k0L6M3q7
4369a49O7o3K30j85j8J00j83M11l43L5K80%l15J8L26k13P3J41m81K31r8J24R7
4392H5l53L94j82J46mk64K30rk01K06kj35J11J28K2l24J88Q2j09M9j1n2nK1O9
4417H0j04o0k00L87q9J15j20M8j44J18j70J72k20R3J74j20Q1k13nQ4L8J09J64
4440B18k15q1L21j48j1Q4k83L12J30k19m39M51j28J00l3q6J15k9j55p7n0M1m0
4463b22OL11k2n0m5N1K60j5k51l23J95K49k85J05L8J67m05M21j52R4K1j67K90
4486B71l04K12k93J69j08j32K32j16J35n7l2nj39k9L86m8k28J33J1p2J58j07k8
4509Ij9n9L9oO0m2J61k78n5K95nj60J69M8n07K37n6J99q4M4Q4J01j17J32l86P7
$$ plain form
4535 -119 50 -89 153 46 81 51 -69 -65 128 -113 -103 -187 97 256 -109 -152 5 -210 163 -93 -119 96 29
4558 29 23 269 -180 -266 84 33 132 -43 118 124 -111 -17 -43 -24 316 -30 -84 118 180 -233 288 -12 -79 -39 83
4583 83 31 96 68 -184 18 256 122 -43 45 87 -284 -194 173 -52 100 20 345 32 -170 197 144 270 24
4606 24 138 30 -48 -7 159 63 24 -109 201 9 -7 -106 15 -48 -159 24 -45 -92 187 -102 -244 142 -238
4629 -238 -21 -133 -116 -103 70 162 -152 -25 93 -86 91 -80 -56 30 85 22 -25 -24 -20 148 -216 -209 104 141 34
4654 34 -375 66 -210 -57 -111 -241 -220 19 126 8 -42 -87 -132 -169 -170 -30 197 14 -27 9 4 65 25 15 -111
4679 -111 -136 174 167 114 23 8 -254 -8 -299 -78 9 -300 -101 147 -319 177 -124 236 146 241 -27 -82 50
4702 50 125 135 -164 31 2 34 -27 106 -134 69 -59 -37 -143 60 -72 29 -89 -60 -153 -123 14 79 -26 -172
$$ packed form
4535a19J69j39K42j07L5l0j20MJ93k41J0q4K84J59l65m3J57k15L73k56k6K15o7
4558B9oK46m49q6L50n1R9j75J61Ok35R4k6J9L40l46n4K02O2m13N21l00o7M0J22
4583H3n2O5k8k52K02K38j34j65Q8M2l71R0L67k25J52q0L25l13k02L67n3J26k46
4606B4J14j08p8M1J66r6l9j33L10j92j6r9J21o3j11J83o9m7K79k89j42L86l80
4629b38K17j12J7J3J73R2l14J27J18j79J77j71K4Q6N5o3m7JMJ68l64PL13L7j07
4654C4m09M41k76J53n4j30K1K39J07j18n0m5m5l7jJ40K27j83m1L6nO1m0j0j26
4679a11k5L10pn3r1j5k62K46k91K21Q7l09J99K48m66M96l01L60r0R5k68n5J32
4702E0P5J0k99J95k9L2o1J33k40K03j28K2j06K03j32J01j18K9r3L0J37O5j05j46
$$ plain form
4726 -172 -130 -11 141 -115 -87 100 -69 179 305 -94 74 -222 -96 -214 -133 -85 -1 246 -85 82 63 4
4748 4 -127 161 149 133 -165 62 163 -249 -140 -114 15 -21 -232 -1 86 -59 140 3 -138 82 126 286 176
4771 176 298 203 -45 -6 -44 16 12 67 -126 -127 89 31 48 -150 -25 21 73 219 61 -87 -142 59 -44 -136 241
4796 241 138 37 153 -103 50 -92 25 -142 159 -112 115 -92 -158 85 -110 -68 -210 -81 -91 81 -4
4817 -4 97 175 3 -192 -7 -346 244 197 -70 -267 69 32 128 62 -45 -65 279 -29 73 -14 -114 -11 31
4840 31 -191 167 228 -19 98 141 40 -87 -62 20 -147 -188 -224 -79 15 -127 79 41 120 154 74 13 -212 -34
4864 -34 -41 129 -52 -89 82 -10 51 121 -65 31 4 118 -5 150 275 -93 -92 -184 156 -8 -27 -134 -156 53 -20
4889 -20 -17 -35 -176 170 -86 -117 -51 -45 -4 108 19 47 -179 24 -65 30 -69 -70 -94 -48 172 -2 -217 -192 -29 -91 38
$$ packed form
4726a72M2J19J52k56K8J87j69K48J26l99J68k96J26j18Q1M8Q4K47l31J67j9n9
4748Dj31K88j2j6k98K27J01m12J09K6J29l6k11K31Q7j45J99j37j41K20M4J60j10
4771A76J22r5k48L9l8O0mN5j93jK16n8J7j98J25M6N2J46j58j48n5K01j03r2L77
4796B41j03j01J16k56J53j42J17j67L01k71K27k07o6K43j95M2j42J29j0J72q5
4817dJ01P8j72j95J85l39N90m7k67j97L36l7R6o6j07k0L44l08J02q7j00J03M2
4840C1k22L58O1k47J17M3j01j27K5Q2j67m1l6J45R4j42K06l8P9L4q0o1k25J78
4864c4pJ70j81l7J71r2O1P0j86R6k7J14j23J55J25l68Jr2L40j64j9j07k2K09p3
4889b0Lj8j41L46k56l1O6OM1J12q9K8k26K03q9R5r9jk4M6K20j74k15K5J63o2J29
$$ plain form
4916 38 88 75 -72 -13 80 -175 -94 38 175 43 114 -69 -18 190 -29 194 -152 55 78 -52 -22 -154 -182 -89
4940 -89 -156 -117 -138 113 6 -47 -7 67 -32 1 -110 -91 0 -69 -33 24 36 -175 8 -202 -55 64 -85 -66 44
4965 44 81 165 13 -102 -74 -126 148 -14 -107 -84 -222 211 69 -144 -19 -88 -84 33 209 307 33 -103 67 -123
4989 -123 27 288 -285 27 -29 47 90 10 172 36 -82 21 -231 -16 -15 96 -250 25 88 -135 -174 -336 -36
5012 -36 97 17 -73 -337 44 24 -98 91 -148 245 -229 296 -3 119 213 26 66 -77 -214 86 87 47 -34
5035 -34 -86 127 -103 188 69 52 -137 25 -398 -1 105 -205 -120 -34 185 -18 110 40 90 129 337 -147 63
5058 63 -142 -59 -51 79 14 -114 104 -25 26 -166 190 -215 195 -65 -152 -10 0 -29 212 -98 207 38 111
5081 111 -10 -96 26 17 6 47 255 242 -52 -112 115 51 171 27 4 234 -38 71 -74 -400 92 -211 133
$$ packed form
4916C8N0j3j47N9R3k55Q1J32J37j32P1j83N1K08k19K23l46K07K3j30L0j32k8R3
4940h9o7L9k1K51j07n3M0P4r9L3j11J9R1o9L6N7J2k11J83k10J47J19j49J9J10
4965D4L7Q4j52j15K8n2K74j62r3K3j38M33j42k13J25o9MJ17J76R8k74j36J70j90
4989a23J50K61n73L12n6P6M3q0J62j36j18J03k52K15JJ11l46K75O3k23l9j62L00
5012c6J33q0r0k64L81k0j22J89k39L93m74N25k99J22R4j87M0j43j37L00Jm0q1
5035c4n2K13k30K91j19j7j89J62m23L97J06l10Q5Q6K19k03J28p0N0L9K08m84K10
5058F3k05Q3QJ30o5j28K18j29N1j92L56m05M10k60q7J42J0k9K41l10L05j69P3
5081A11j21q6J22rj1M1K08j3k94o0K27o4J20j44k3K30k72J09j45l26M92l03L44
$$ plain form
5104 133 57 -116 86 3 -121 -75 89 -55 -181 45 -50 -135 -327 92 12 -11 -14 19 -27 -16 43 22 38 56 95 156
5130 156 71 -175 228 246 -180 57 -83 -140 -179 23 89 34 -166 173 12 133 -236 -100 -113 -92 -100 -132 -120 -135
5154 -135 7 4 73 -182 -6 222 -71 82 26 -203 146 97 -124 -245 120 -60 -8 97 -34 1 -49 9 -64
5177 -64 34 126 -119 17 85 165 47 32 -35 59 92 130 -10 84 152 40 -23 -62 -15 80 128 -433 15 80 -81 3
5203 3 21 -406 4 19 8 20 -119 -16 -109 0 64 -302 181 63 85 -265 43 99 -157 183 -310 -136 -19
5226 -19 57 -97 169 -181 -89 -74 -93 107 -2 -135 -151 70 -161 1 -69 18 5 4 -76 90 -21 10 37 163 55
5251 55 56 -2 131 -156 -179 52 82 -129 119 191 202 118 -105 53 96 -46 -122 -88 -175 67 -156 43 152 97 40
5276 40 -69 -84 122 -57 51 -137 61 120 92 -40 83 -80 -31 -210 -27 -158 -74 -136 156 -75 -21 -166 -38
$$ packed form
5104A33p6j73K02q3j24M6J64j44j26K26r5q5j92M19q0k3lL3m6J1N9k1J6J8L9O1
5130A56q5k46M03J8m26K37j40n7l9K02O6n5k00L39j61J21l69J36j3K1ql2J2j5
5154a35J42lO9k55J76K28k93J53n6k29L49m9k21j21L65j80N2J05j31L5n0N8p3
5177f4R8R2k45J36O8Q0j18j5o7R4L3L8j40R4O8j12o3l9M7R5M8n61M48O5j61Q4
5203CJ8m27M10J5j1J2j39J03r3J09O4l66M83j18K2l50L08N6k56L40m93J74J17
5226a9P6j54K66l50R2J5j9K00j09j33j6K21k31J62p0Q7j3jq0J66j11L1K7J26j08
5251E5Jn8J33k87k3K31L0k11K48P2J1q4k23J58M3j42p6L4q7K42k23J99J09n5n7
5276D0j09j5K06j79J08j88J98N9k8j32J23j63M9j79J83j31Q4o2K92k31N4j45J28
$$ plain form
5299 -38 4 3 0 -20 123 -39 -242 -207 -206 263 -159 43 1 -384 -191 135 -186 154 -18 -84 70 189 -140 163
5323 163 225 32 -25 3 124 69 -209 -127 -47 -247 215 -20 94 57 56 148 72 -12 51 -110 213 21 36 -96 -13
5348 -13 -304 125 25 -56 180 -149 -134 -146 -33 91 -44 -15 -204 -121 58 -304 156 -181 -248 38 -166 -93 -79
5371 -79 -80 -65 -91 -254 -75 108 -152 75 -7 57 57 -109 89 59 -191 63 -226 132 -214 -60 -7 87 -78 -121
5395 -121 50 145 -86 -26 232 81 115 -4 -152 -100 169 -86 54 -21 165 199 116 96 -140 146 137 3 53 -70
5419 -70 207 87 -140 84 187 246 61 30 -82 -41 -178 121 33 143 -67 -31 116 -85 30 316 40 61
5441 61 74 64 468 -87 -179 53 82 -92 62 89 233 144 -229 -27 60 -151 74 -267 -100 -72 -66 31 -44 -206
5465 -206 8 95 -44 -190 145 -31 76 33 75 147 -73 -170 53 58 127 -231 -43 -218 151 254 -44 -50 -56 22
$$ packed form
5299c8M2jlk0J43j62k03L5JM69m22K02m2l85J93L26l21L40j72o6J54J19l29L03
5323A63O2j93n7K8J21n5k78Q2Q0k00M62k35J14l7jR2p6q4O3j61L23j92J5j32Q3
5348a3k91M29j00q1K36l29J5j2J13J24j35K9j89Q3J79l62M60l37o7K86k04P3J4
5371g9jJ5k6j63J79J83k60K27q2O4%j66J98l0k50K54k89L58l46J54N3R4j65m3
5395a21J71R5k31O0K58j51L4j19j48N2K69k55J40p5J86L4q3k0k36K86rj34N0j23
5419g0K77j20k27K24J03N9j85l1j12M1j37K99q8J10k10L6J47k01J15K86k76K1
5441F1J3j0M04n55r2K32K9j74J54K7J44q9l73K02Q7k11K25l41J67K8OR7p5j62
5465b06K14Q7j39j46L35j76J07m3M2P2k20r7K23NO9l58J88j75L69J03k98ooP8
$$ plain form
5489 22 -163 -248 -100 -97 -84 100 -1 4 53 -60 7 -177 45 31 30 88 -86 45 -216 -226 -38 106 -191 191 88
5514 88 -36 -30 -87 97 -127 -110 181 119 -331 39 62 -59 -125 282 71 16 201 -187 55 -213 15 166 -1
5537 -1 -63 129 69 56 117 86 44 0 143 277 134 -147 146 -146 78 87 36 98 -134 -46 -100 -80 -232 69 -50
5562 -50 -43 -86 268 -237 -16 120 -123 187 153 75 121 165 108 197 39 -51 -262 168 -32 290 173 4 146 -94
5586 -94 -177 -213 -20 61 51 94 -160 -134 20 -141 -77 -167 57 113 -68 100 60 37 12 129 -212 -96 -114 -41 173
5611 173 17 -97 126 -31 126 -127 -106 -1 -107 78 39 -40 -320 -147 75 -301 13 127 107 -136 -8
5632 -8 105 56 -26 -76 -3 -213 180 94 42 -63 68 13 53 181 -55 -15 178 146 12 -86 -376 -48 -51 -135 -130 -5
5658 -5 164 -145 50 -181 -13 5 -43 58 -41 55 -122 -77 35 302 75 165 -205 148 113 92 122 -118 -218 79
$$ packed form
5489B2j85q5J48LJ3J84j01NM9j13O7j84K22j4jN8j74J31k61j0J88J44k97L82j03
5514H8j24On7J84k24J7K91o2m50L70K3j21o6M07k11n5J85l88K42k68K28J51j67
5537ao2J92o0j3O1l1m2m4J43J34j43k81K93k92K24Rn1O2k32Q8n4K0j52L01j19
5562e0Pm3L54n05K21J36k43L10l4p8M6M4n7Q9j58r0k11M30k00L22j17j69J42k40
5586i4q3l6J93Q1j0M3k54K6J54j61O4r0K24N6j81J68m0k3k5J17l41J16j8P3K14
5611A73j56j14K23j57J57k53K1J05j06J85l9p9k80J73K22l76L14J14k0k43J28
5632hJ13m9q2n0P3k10L93q6n2j05J31n5M0J28k36M0J93l2j34r8k90L28lq4NJ25
5658eJ69l09J95k31J68J8m8J01r9R6j77M5J12K67k27R0l70L53l5k1L0k40j00K97
$$ plain form
5682 79 -96 106 -75 -120 -271 100 -38 -4 68 24 -164 2 253 144 11 -282 3 -52 -167 123 44 13 89
5705 89 20 -26 85 -83 68 -6 -42 -38 -36 -75 -90 -92 41 -170 75 53 120 -162 96 91 54 88 121 18 64 -126 -89
5732 -89 -30 210 89 -64 4 24 51 90 99 -43 -71 -19 104 -38 -179 -128 -158 -128 -197 137 -211 -147 -17 -5 -79 70
5758 70 -18 -136 -193 118 -93 104 229 -99 -122 93 21 -23 50 -104 -110 -76 8 -32 -124 29 23 -198 47 67 93 -127
5784 -127 162 73 -22 209 131 46 -58 60 76 -200 -353 194 -124 -168 -281 -19 104 -52 -191 194 -23 -109
5806 -109 43 25 190 -156 53 119 38 -143 -38 21 -22 -43 66 -111 -65 -145 -150 124 58 -3 10 58 46 85 6 -104
5832 -104 -131 -40 -66 -115 6 69 -55 13 -21 186 202 -179 -43 64 98 6 -3 -88 49 -258 277 12 168 15
5856 15 141 186 172 -32 170 244 105 201 -54 128 -58 30 227 -19 55 -11 69 64 28 40 44 -83 -11 -134 3
$$ packed form
5682G9j75K02j81m5j51L71j38L4P2m4j88J66K51j09j33k93K85n5j15K90p9l1P6
5705H9o9m6J11j68J51p4l6MKl9j5kJ33k11K45k2O7k82K58nl7L4L3j03M6j90L7
5732h9N9K40j21j53O8K0K7L9Rj42k8N2J23j42j41N1l0L0o9L34l48O4J30J2p4J49
5758G0q8j18n7L11k11J97J25l28k3K15p2m4P3j54oL4Q4m0r2J53ok21K45K0K6k20
5784a27K89q9r5K31p8q5j04J18J6k76j53N47l18m4j13K62J23j56j39L85k17q6
5806a09J52j8J65l46K09O6q1j81J05N9m3k1J09j77M6q0nK74o6o1J3M8j2L9p9j10
5832a04k7R1k6m9J21O3j24O8l4K07J6l81J36J07L4r2rq5J37l07N35k65J56j53
5856A5J26M5j4k04K02P4j39R6k55J82j86Q8J97k46P4o6Q0nl6J2Mj27P2j23J37
$$ [...]
8191A14
##END NTUPLES=NMR FID
##END=
