##TITLE=1H_LR-758-R6-3CR21
 CDCl3
 8 sc, 
 25.10.2023
##JCAMPDX= 6.0         $$ Bruker NMR JCAMP-DX V2.0
##DATA TYPE= NMR FID
##DATA CLASS= NTUPLES
##ORIGIN= UXNMR, Bruker Analytische Messtechnik GmbH
##OWNER= root
$$ XWIN-NMR		Version 3.5
$$ Wed Oct 25 15:31:51 2023 Russian Standard Time (UT+4h)  she@DPX200
##.OBSERVE FREQUENCY= 200.13135
##.OBSERVE NUCLEUS= ^1H
##.DELAY= (6, 6)
##.ACQUISITION MODE= SIMULTANEOUS
##.ACQUISITION SCHEME= undefined
##.AVERAGES= 8
##.DIGITISER RES= 18
##SPECTROMETER/DATA SYSTEM= spect
##.PULSE SEQUENCE= zg30
##.SOLVENT NAME= D2O
##.SHIFT REFERENCE= (INTERNAL, D2O, 0, 15.7039)
##AUDIT TRAIL= $$ (NUMBER, WHEN, WHO, WHERE, WHAT)
$$ ##TITLE= Audit trail, XWIN-NMR		Version 3.5
$$ ##JCAMPDX= 5.01
$$ ##ORIGIN= Bruker BioSpin GmbH
$$ ##OWNER= she
$$ F:/spectra/data/she/nmr/H-F/1/audita.txt
$$ ##AUDIT TRAIL=  $$ (NUMBER, WHEN, WHO, WHERE, WHAT)
(   1,<2023-10-25 15:08:22.89 +0400>,<she>,<DPX200>,
      <created by zg, POWCHK disabled, PULCHK disabled
       configuration hash MD5:
       00 E9 B6 7A A2 85 ED C7 34 08 36 98 17 FE 4E 26
       data hash MD5: 16K
       26 AD 9C F4 10 B1 7D DD 22 A2 F7 93 DF 2F 56 99>)
$$ ##END=
$$ 
$$ hash MD5
$$ A7 DE 80 D7 69 73 B4 22 5C 08 51 6F 08 CF 6F 03
##$RELAX= 
##$RELAX= 
##$RELAX= 
##$RELAX= 
##$RELAX= 
##$RELAX= 
$$ Bruker specific parameters
$$ --------------------------
##$DU= <F:/spectra>
##$EXPNO= 1
##$NAME= <H-F>
##$PROCNO= 1
##$TYPE= <nmr>
##$USER= <she>
##$AMP= (0..31)
100 100 100 100 100 100 100 100 100 100 100 100 100 100 100 100 100 100 
100 100 100 100 100 100 100 100 100 100 100 100 100 100 
##$AQSEQ= 0
##$AQ_mod= 1
##$AUNM= <au_zg>
##$AUTOPOS= <>
##$BF1= 200.13
##$BF2= 200.13
##$BF3= 200.13
##$BF4= 200.13
##$BF5= 200.13
##$BF6= 200.13
##$BF7= 200.13
##$BF8= 200.13
##$BYTORDA= 1
##$CFDGTYP= 0
##$CFRGTYP= 5
##$CHEMSTR= <none>
##$CNST= (0..31)
1 1 145 1 1 1 1 1 1 1 1 1 1 1 1 1 1 1 1 1 1 1 1 1 1 1 1 1 1 1 1 1 
##$CPDPRG= <>
##$CPDPRG1= <>
##$CPDPRG2= <>
##$CPDPRG3= <>
##$CPDPRG4= <mlev>
##$CPDPRG5= <mlev>
##$CPDPRG6= <mlev>
##$CPDPRG7= <mlev>
##$CPDPRG8= <mlev>
##$CPDPRGB= <>
##$CPDPRGT= <>
##$D= (0..31)
0 1.2 0 0 0 0 0 0 0 0.06 0 0.03 0 0 0 0 0.0002 0 0 0 0 0 0 0 0 0 0 0 0 
0 0 0 
##$DATE= 1698232102
##$DBL= (0..7)
120 120 120 120 120 120 120 120 
##$DBP= (0..7)
150 150 150 150 150 150 150 150 
##$DBP07= 0
##$DBPNAM0= <>
##$DBPNAM1= <>
##$DBPNAM2= <>
##$DBPNAM3= <>
##$DBPNAM4= <>
##$DBPNAM5= <>
##$DBPNAM6= <>
##$DBPNAM7= <>
##$DBPOAL= (0..7)
0.5 0.5 0.5 0.5 0.5 0.5 0.5 0.5 
##$DBPOFFS= (0..7)
0 0 0 0 0 0 0 0 
##$DE= 6
##$DECBNUC= <off>
##$DECIM= 32
##$DECNUC= <off>
##$DECSTAT= 4
##$DIGMOD= 1
##$DIGTYP= 9
##$DL= (0..7)
0 120 120 120 120 120 120 120 
##$DP= (0..7)
150 150 150 150 150 150 150 150 
##$DP07= 0
##$DPNAME0= <>
##$DPNAME1= <>
##$DPNAME2= <>
##$DPNAME3= <>
##$DPNAME4= <>
##$DPNAME5= <>
##$DPNAME6= <>
##$DPNAME7= <>
##$DPOAL= (0..7)
0.5 0.5 0.5 0.5 0.5 0.5 0.5 0.5 
##$DPOFFS= (0..7)
0 0 0 0 0 0 0 0 
##$DQDMODE= 0
##$DR= 18
##$DS= 0
##$DSLIST= <SSSSSSSSSSSSSSS>
$$ [...]
##$SUBNAM2= <"">
##$SUBNAM3= <"">
##$SUBNAM4= <"">
##$SUBNAM5= <"">
##$SUBNAM6= <"">
##$SUBNAM7= <"">
##$SUBNAM8= <"">
##$SUBNAM9= <"">
##$SW= 18.05172834244
##$SWIBOX= (0..15)
0 0 2 0 0 0 0 0 0 0 0 0 0 0 0 0 
##$SW_h= 3612.71676300578
##$TD= 16384
##$TD0= 1
##$TE= 0
##$TE2= 300
##$TE3= 300
##$TEG= 300
##$TL= (0..7)
0 120 120 120 120 120 120 120 
##$TP= (0..7)
150 150 150 150 150 150 150 150 
##$TP07= 0
##$TPNAME0= <>
##$TPNAME1= <>
##$TPNAME2= <>
##$TPNAME3= <>
##$TPNAME4= <>
##$TPNAME5= <>
##$TPNAME6= <>
##$TPNAME7= <>
##$TPOAL= (0..7)
0.5 0.5 0.5 0.5 0.5 0.5 0.5 0.5 
##$TPOFFS= (0..7)
0 0 0 0 0 0 0 0 
##$TUNHIN= 0
##$TUNHOUT= 0
##$TUNXOUT= 0
##$USERA1= <user>
##$USERA2= <user>
##$USERA3= <user>
##$USERA4= <user>
##$USERA5= <user>
##$V9= 5
##$VALIST= <valist>
##$VCLIST= <CCCCCCCCCCCCCCC>
##$VD= 0
##$VDLIST= <DDDDDDDDDDDDDDD>
##$VPLIST= <PPPPPPPPPPPPPPP>
##$VTLIST= <TTTTTTTTTTTTTTT>
##$WBST= 1024
##$WBSW= 4
##$XGAIN= (0..3)
0 0 0 0 
##$XL= 0
##$YL= 0
##$YMAX_a= 97750
##$YMIN_a= -152197
##$ZGOPTNS= <>
##$ZL1= 120
##$ZL2= 120
##$ZL3= 120
##$ZL4= 120
##$ABSF1= 10
##$ABSF2= 0
##$ABSG= 5
##$ABSL= 3
##$ALPHA= 0
##$AQORDER= 0
##$ASSFAC= 0
##$ASSFACI= 0
##$ASSFACX= 0
##$ASSWID= 0
##$AUNMP= <proc_1d>
##$AZFE= 0.1
##$AZFW= 0.1
##$BCFW= 1
##$BC_mod= 2
##$BYTORDP= 1
##$COROFFS= 0
##$CY= 11.3945322036743
##$DATMOD= 1
##$DC= 2
##$DFILT= <>
##$DTYPP= 0
##$F1P= 15.7292609196834
##$F2P= 12.9074282941183
##$FCOR= 0.5
##$FTSIZE= 0
##$FT_mod= 4
##$GAMMA= 1
##$GB= 0.15
##$INTBC= 1
##$INTSCL= 1
##$ISEN= 128
##$LB= 0.24
##$LEV0= 0
##$LPBIN= 0
##$MAXI= 10000
##$MC2= 0
##$MEAN= 0
##$ME_mod= 0
##$MI= 1.114404
##$NCOEF= 0
##$NC_proc= 0
##$NLEV= 6
##$NOISF1= 3.799351
##$NOISF2= 2.8
##$NSP= 1
##$NTH_PI= 0
##$NZP= 0
##$OFFSET= 15.70392
##$PC= 1
##$PHC0= -23509.34
##$PHC1= 10.85272
##$PH_mod= 1
##$PKNL= yes
##$PPARMOD= 0
##$PSCAL= 0
##$PSIGN= 0
##$REVERSE= no
##$SF= 200.130013532006
##$SI= 16384
##$SIGF1= 3
##$SIGF2= 2
##$SINO= 400
##$SIOLD= 16384
##$SREGLST= <1H.CDCl3>
##$SSB= 0
##$STSI= 0
##$STSR= 0
##$SW_p= 3612.71676300578
##$SYMM= 0
##$S_DEV= 0
##$TDeff= 0
##$TDoff= 0
##$TI= <>
##$TILT= no
##$TM1= 0
##$TM2= 0
##$TOPLEV= 0
##$USERP1= <user>
##$USERP2= <user>
##$USERP3= <user>
##$USERP4= <user>
##$USERP5= <user>
##$WDW= 1
##$XDIM= 8192
##$YMAX_p= 0
##$YMIN_p= 0
$$ End of Bruker specific parameters
$$ ---------------------------------
##NTUPLES= NMR FID
##VAR_NAME=  TIME,          FID/REAL,        FID/IMAG
##SYMBOL=    X,             R,               I
##VAR_TYPE=  INDEPENDENT,   DEPENDENT,       DEPENDENT
##VAR_FORM=  AFFN,          ASDF,            ASDF
##VAR_DIM=   8192,          8192,            8192
##UNITS=     SECONDS,       ARBITRARY UNITS, ARBITRARY UNITS
##FACTOR=    0.0002768,     1,               1
##FIRST=     0,             0,               0
##LAST=      2.2672688,     0,               0
##MIN=       0,             -152197,         0
##MAX=       2.2672688,     97750,           0
$$ Real data points
##PAGE= N=1
##DATA TABLE= (X++(R..R)), XYDATA
0@%%%%%%%%%%%%%%%%%%Lj1J6j6J6j6J6k0K8l2L2l6M4m9N4o1O9p9Q7r7J10j20J32
41G0j48J64j81K00k19K40k65K92l20L51l88M29m74N26n83O51p32Q24r36J076j253
62f76J484j796K243k929M089o382J2385n2852j07763K07402M283j32394J34616
75F1710L6040j65944M5984Q2872q1805K3526O3903o3051J3318M6219o6882n422
87i532N3886k8033L561K1218n6744J835M0506l6403K1604M3282p7678q744Q6982
100E5740m4770n0589N8069k6539m2659P3311N174n3486L0844r207m0197O0701
112A6392J0570o4725L7503K3503o9024J9716M3610m5737J7547N3294m5489k2655
124b5495K6057l1417J0178O0123k8925l5560K7640j6112j4042M9182j25l0675
$$ plain form
0 0 0 0 0 0 0 0 0 0 0 0 0 0 0 0 0 0 0 0 3 -8 8 -8 8 -8 8 -12 16 -16 16 -20 24 -25 29 -32 37 -42 45 -52 58 -62 70
41 70 -78 86 -95 105 -114 126 -139 153 -167 184 -204 225 -249 277 -306 345 -387 437 -499 577 -676
62 -676 808 -988 1255 -1674 2415 -3967 8418 -44434 -152197 55205 59488 -72906 61710
75 61710 97750 -68194 -22210 60662 -21143 2383 66286 3235 16553 62772 -4110 -9532
87 -9532 44354 16321 19882 41100 -15644 -13809 26697 -9706 11898 55180 -22498 -31242 55740
100 55740 10970 -39619 18450 -8089 -50748 22563 27737 -25749 5095 -4112 -44309 16392
112 16392 26962 -37763 -260 23243 -45781 -26065 17545 -28192 -10645 42649 -2840 -25495
124 -25495 562 -30855 -20677 39446 10521 -25039 2601 -13511 -27553 21629 21504 -9171
136i171J6477o685j9865K4858n602k1117L2300K758l3548J7426N692k9281K2081
149c677J9220l3137R46J4876k1584J0757K1707k9335m334K8551j1696m828K1391
162H857j8312j6030K3361L526m219J4837j0099j1388J9132l545r595K2864r24
175A8465j9936J6371K156k3410J4925J6972j5902M327O803k2531J567J8785r538
188I054k123R993j5646o489J5019m303m720R677q760p800J1019n158o419J3254
202F598m611j2826J1592R11j3116J0220O564j4713K148P667r870J141R277o062
216e080k262N407o017j038P041k414M0M525o480j303Q097l024r55P922n615m873
232f029J1524j141q417O554P60o729Q051N034j0044q74L643m334L150M488o377
$$ plain form
136 -9171 7306 621 -19244 5614 12 -21105 11195 13953 -19595 -2169 3523 -25758 -3677
149 -3677 15543 -17594 -16648 -1772 -23356 -12599 9108 -20227 -24561 3990 -7706 -12534 8857
162 8857 -9455 -25485 -2124 1402 -2817 12020 1921 -9467 9665 6120 -3475 19389 18465
175 18465 -1471 14900 17056 -6354 8571 25543 9641 13968 20771 -1760 -193 18592 9054
188 9054 6931 16924 1278 -5211 9808 5505 785 10462 1702 -6098 4921 -237 -6656 6598
202 6598 1987 -10839 753 1664 -11452 -1232 5332 -9381 -7233 434 -9436 -8295 982 -5080
216 -5080 -7342 -1935 -7952 -8990 -1949 -4363 -4323 202 -6278 -7581 516 -2508 -3463 4459 -1156 -6029
232 -6029 5495 4354 -4063 2491 3251 -3478 4573 9607 -437 -1311 2332 -2002 1148 5636 -741
247g41r71L041m500P52K268n971K903Q453o010n148L452n305O2J4017n80j0418
263d696K790P42m583Q152M883p764O72N589l431j530O93k755L630O790j973m316
279B893m030m311N414P773l495l380J045m396n1O632l412n739P508L495m802j85
295I59l270n620O941R641j581n178l232l063K953N481p56k145k28j015J673k92
311A268n745j169O878K888j170k100p591m789P780P220j853k278k034l187J602
326d280M274j309k795K288M102N54m063m147k49L690O217L618n473p797l03M454
342a219J530J067M04l556p93M517j600n218O26M363K837J211k265p273k255N954
358a670O399J143k648l309j129K094J478J09j327k77L397J692m276m757P90K734
$$ plain form
247 -741 -1712 1329 -3171 -2419 -151 -6122 -3219 5234 -776 -5924 -2472 -7777 -7715 6302 5722 -4696
263 -4696 -1906 -1164 -5747 2405 7288 -476 196 5785 2354 824 1517 -1238 2392 9182 7209 2893
279 2893 -1137 -5448 -34 7739 4244 864 1909 -2487 -2538 4094 682 -5057 2451 5946 1144 959
295 959 -2311 -7931 -990 8651 7070 1892 -1340 -4403 -1450 4031 3275 1130 902 -113 1560 1268
311 1268 -4477 -5646 1232 4120 2950 850 -6741 -11530 -3750 3470 1617 -661 -2695 -5882 -4280
326 -4280 -6 -1315 -4110 -1822 2280 2834 -1229 -5376 -5625 -1935 4282 7900 2427 -5370 -5673 -1219
342 -1219 311 1378 1782 -1774 -2567 1950 350 -4868 -4242 121 2958 4169 1904 -5369 -7624 -1670
358 -1670 4729 5872 3224 -85 -1214 880 2358 2467 1140 863 4260 5952 1676 -3081 -2291 443
374D43L665K894l830q039q64L973K228K91J58k266j069K211L66k778j113L145
390e85L832Q10k922k798j415K525N992K805l941k890J562N7j39J821r24k064L466
407E192K256m516l435P55M97K411K440l041n856j253K147J998P12r52j318r78
423b941k34M13j174j848J206L231n93k564j013q68M54M071J224l438k175N58K00
440e491J152P26m10m80N85J447O23j707j230K544J565o35J082K87k534J955L601
457C080j253j208K749p10j396K119p54k202J337K207j204q16m70j526j79M76J00
474C50o48j888j380O16l27q96J624p7k822Q82J277j828J37K152r99j071J748J13
492c037k74J796P73n82J99J9P2M91J35N19Q31j517n80J008k78n9J572j356l009
$$ plain form
374 443 4108 7002 3172 -4867 -5731 -1758 470 761 919 -1347 -2416 -205 161 -2617 -3730 -585
390 -585 3247 4057 1135 -1663 -3078 -553 5439 8244 4303 1413 2975 3032 2893 4714 3790 1726 5192
407 5192 7448 2932 -503 252 749 3160 5600 2559 -3297 -4550 -2403 -405 307 -645 -1963 -2941
423 -2941 -3175 -2762 -3936 -5784 -4578 -1347 -1940 -4504 -5517 -6385 -5931 -1860 -636 -4074 -6249 -5691 -5491
440 -5491 -4339 -3613 -4023 -4503 -3918 -2471 -1848 -3555 -4785 -2241 -676 -1311 -229 58 -2476 -521 3080
457 3080 1827 619 3368 2658 1262 3381 2627 425 1762 3969 2765 1949 1479 -47 -226 250 350
474 350 -298 -2186 -3566 -2950 -3277 -4173 -2549 -2626 -5448 -4566 -3289 -5117 -4980 -2828 -3827 -4898 -3150 -3037
492 -3037 -3311 -1515 -742 -1324 -1125 -1106 -1034 -543 -408 111 942 -575 -1155 -147 -425 -484 1088 -268 -3277
511c277P22J345j258J24Q31j923q26J669l99j462j86J11N68L52j112r41j03mJ577
530d192N26j912o78J097m67k71J173j040j212K659J476k060p53J269l28J331L105
547b77o51k572O40J993N70J624Q59r67M92J394j62m11j05K36J833J447j926j921
565B096m03k25J909J914l007l142R93k39j319J341l92l358J711J999l180j823
581e125R57n49J512K667k262j964K12M25K038K410k242j265K287j77j21K096k209
598a310j346M889P46l699R85J66k760M052L367m822j347K454j799Q84K497k810
614A47j236L429k40j577R08k652m45M411J45k318O24k075j611L975Q40l476J137
631a4M87k258J183P77l352Q78L387r19q70q74j807J261K711O63j51j003k004K156
$$ plain form
511 -3277 -2555 -1210 -2468 -2344 -1513 -3436 -4262 -2593 -2992 -4454 -4640 -4529 -3961 -3609 -4721 -5662 -5765 -5769 -4192
530 -4192 -3666 -5578 -6256 -5159 -5626 -5897 -4724 -5764 -6976 -4317 -2841 -4901 -5654 -4385 -4713 -3382 -277
547 -277 -928 -3500 -2860 -867 -297 1327 2186 1219 1711 3105 2943 2532 2427 2663 4496 5943 4017 2096
565 2096 1693 1468 3377 5291 2284 -858 135 -104 -1423 -82 -474 -3832 -2121 -122 -3302 -5125
581 -5125 -4168 -4717 -3205 -538 -2800 -4764 -4552 -4127 -2089 321 -1921 -3186 -899 -1076 -1197 899 -1310
598 -1310 -2656 2233 2979 -720 265 431 -2329 1723 5090 268 -1079 1375 -424 460 2957 147
614 147 -1089 2340 2100 523 1431 -1221 -1666 2745 2890 572 1196 -879 -2490 1485 2325 -1151 -14
631 -14 473 -1785 -602 175 -3177 -2299 1088 169 -701 -1575 -3382 -2121 590 1253 1102 99 -1905 251
649B51K841j485K11J815j983Q67K992k498j448K908N98j017J391j697k541K149
665C354J428j908j80r53j212J446k39j601k5j073k02K779p78l492R09N51j300
682b496K525J076l490L45K522j611J41J714j678J52K452j723p62Q72n95R19K198
699B561j809j702J146m46m23L115j414k676K237N84k042K060P79k870J693J873
715B666k243J54J334j560Q22J330j536m86R76j107R22J045k832M2K038j361p81
732e77J861k292j348K889n08j914J598k78k479K246J213k142J178O19j477R75
748d36J087j165P95J498j733O38J115j712O17J763j631m41J518j427p90K046p85
765I57j586J330k60j892J444N76j701N86K18j101N58O44p12O21M91j392R54Q29
$$ plain form
649 251 3092 1607 1818 3633 1650 2517 5509 3011 1563 4471 5069 4052 5443 3746 1205 3354
665 3354 4782 2874 2694 1741 529 1975 1736 135 110 -963 -1165 1614 836 -2656 -1747 -1196 -2496
682 -2496 29 1105 -2385 -2040 482 -1129 -988 726 -952 -800 1652 -71 -833 39 -556 363 2561
699 2561 752 -950 196 -250 -673 2442 1028 -1648 589 1173 -869 1191 1970 -900 793 2666
715 2666 423 577 1911 351 1173 2503 967 481 1457 350 1272 2317 -515 -473 1565 204 -577
732 -577 1284 -1008 -2356 533 25 -1889 -291 -569 -3048 -802 411 -1731 -553 66 -1411 -436
748 -436 651 -514 281 1779 46 684 1799 87 704 2467 836 395 1913 486 -304 1742 957
765 957 -629 701 441 -1451 -7 569 -1132 -546 -328 -1429 -871 -227 -939 -318 173 -1219 -265 564
783E64j171O96R16j270K65J594j380r10K064q09j391J735o51j623Q78R69j368
800h92M1N33j223L44N41m93k04K31o0Q29P1r26M72O70m47Q11P63r80n75J621m38
821F89n43Q68l75o64J113J7q82m24K97P0O34k11r09k95K12o7R78n24q63N36L89
842D6k11K12J21r97P12J597q86j256Q02L8P0N79q5r31q5M58J98j37p99m10K66
863f98j42K74j0q28m18J420P6n74L22j36o93J328P35o94k25M82J17O92L30m07
883I51l50P72M19k0n48q14L32M79K7j45r14p28M27O13m72p07l7j16j48L70l05
904i14p87P6M04N66r5p12J8N32K53Q99q5j028J52J001N36n96J85n5l52M38N76
925A012n12n84M26J62K78J03j95m74j77J107j67o27l45R21k54M9L00m18n1O96
$$ plain form
783 564 -607 89 1005 -265 0 1594 214 -696 1368 559 -832 903 252 -1371 -493 476 -892
800 -892 -851 -318 -1541 -1197 -656 -1149 -1353 -1122 -1182 -353 -282 -1208 -736 -66 -513 298 1061 81 -494 1127 689
821 689 146 1014 639 -25 1088 1105 223 -201 96 166 800 589 -320 -615 -403 -470 508 -16 -879 -343 46
842 46 -165 47 168 -829 -117 1480 594 -662 140 178 248 827 742 -189 -274 184 382 245 -554 -964 -698
863 -698 -840 -566 -576 -1404 -1822 -402 -326 -900 -578 -714 -1407 -79 656 -38 -263 219 336 1028 1358 951
883 951 601 1373 1792 1772 1224 410 742 1221 1248 1103 189 -539 -112 501 29 -678 -715 -831 -979 -609 -914
904 -914 -1701 -1625 -1221 -655 -750 -1462 -1444 -912 -659 240 155 -873 -721 280 816 220 405 350 -2 436 1012
925 1012 500 -84 342 504 782 885 690 216 39 1146 979 352 7 928 674 723 1023 605 554 1250
945A250O31j084l16K21l15L56N50n73r89j26M41n7Km44n52mj64Lj64k57J58N47
967h86N0j66p2K96lM73J80k43J07N35P46J00L8K33k76J61Q79q8m48j2L8k88k8
990A326j9M0o02o1J0l16m40M32l39l53n2l9m77Q4J034n46n38K96r2ML77M91j64
1013E6n59L19J62J93j3K23k54R6j80L18j0k73L11j31n7L1L26kk36M73k93l60K70
1036D10N13j46K59K54l27l43O67K51nj65j56l11l84rL31j78n39J38k61n52r8L42
1058c09k55o10K79o10j67P55q5k29n7K65j5J10L97K01J85L8J31J66K57L63L43
1079A153j40o6j3K87j64M94r0o50j46J40k48Q6J07l74k40m73M72l08O2Q4j97j17
1101c41j90k17M34K92j43J09l59l73O41J83l2M9k69o41L93N93n3o71K76l08j30
$$ plain form
945 1250 1881 797 481 702 387 743 1293 720 -269 -395 46 -11 -9 -453 -1005 -1009 -1173 -1170 -1334 -1591 -1433 -886
967 -886 -836 -1002 -1074 -778 -781 -308 -128 -371 -264 271 1017 1117 1155 1388 1112 1273 2152 2064 1616 1604 1642 1354 1326
990 1326 1307 1347 745 684 694 378 -62 370 31 -322 -374 -413 -890 -806 228 -318 -856 -560 -652 -648 -271 220 56
1013 56 -503 -184 -22 171 158 381 127 223 43 361 351 78 389 258 201 232 558 556 320 793 500 140 410
1036 410 923 777 1036 1290 963 620 1287 1538 1533 1368 1212 901 517 508 839 661 122 260 -1 -553 -651 -309
1058 -309 -564 -1174 -895 -1505 -1672 -917 -1002 -1231 -1288 -1023 -1038 -928 -531 -330 -145 -107 24 190 447 810 1153
1079 1153 1013 947 934 1221 1057 1551 1461 811 665 805 557 643 750 376 136 -337 135 -173 -111 -27 -224 -341
1101 -341 -531 -748 -314 -22 -165 -56 -415 -788 -147 36 4 53 -216 -857 -464 129 76 -595 -319 -627 -757
1122g57K41J8m0J18N3j36l9r7J85M15r5L75j4o3j67Q77J4m28M37j9l95N86J12
1145A181m66k81J31n06L10M01n61k97j09l15j31K8l73M52k48k41j84J30n0K07
1165i22P21m83m58M84M4K44O13j0l31k3K52K84L3O7k62J19J28j39J46J24o96K58
1187A93K78n77k1L09m78K91K56j031Q8P85R5n27O81l76n03M97K87K3O1Pk82K01
1209B57q4K82j02k16l99M66j17n82J81L38k89K8l5o14M24J35r2kj3k75N3N44j63
1232b75L43j16M4L13J04P0j96N61m78P3J75K7k02L11l3m73qp1j53j24J26k02o00
1255g84K38J12l22M15J18k94k63K10M05o8J09j54K89r1L66n1J0JK50j2l77J97
1277C04M1Pk55L2l6m10L74n8k57l47o2L1Q3q7L53l04L05K35j99j44J43J34J83
$$ plain form
1122 -757 -516 -498 -538 -420 -367 -503 -542 -639 -454 -39 -134 241 227 164 -3 874 888 460 897 878 483 1069 1181
1145 1181 715 434 565 59 369 770 209 -88 -197 -512 -643 -615 -988 -536 -784 -1025 -1209 -1079 -1129 -922
1165 -922 -201 -684 -1142 -658 -614 -370 243 233 -98 -121 131 415 448 515 253 372 500 361 507 631 -65 193
1187 193 471 -106 -127 182 -296 -5 251 -780 -692 93 188 -339 342 -34 -537 -40 247 270 331 338 56 257
1209 257 173 455 353 137 -262 204 87 -495 -314 24 -265 -237 -272 -886 -462 -327 -419 -421 -434 -709 -656 -112 -275
1232 -275 68 -48 -4 309 413 483 287 848 370 443 618 645 443 754 721 248 240 169 16 -108 18 -184 -784
1255 -784 -546 -434 -756 -341 -223 -517 -780 -570 -165 -233 -124 -278 11 -80 286 235 245 246 496 484 107 304
1277 304 345 352 97 129 93 -317 57 -1 -258 -605 -667 -636 -553 -640 -287 -591 -286 -51 -250 -394 -251 -117 66
1300F6j69M66J19l10K75q2K61l50L57l81j97K71J87m98N8k80K45k26J64l14m3
1321c81J6Q7k86pK93k96J85k5L24j90L34M6J02j77p3K49Q8L5r3K67n62J16K14
1344B66k21jj16R1j83o8JPk31J60L7k15N2K43J3k60L93J20p0R7J90K1P6k7K53
1369F28j51p7N5N8j03oj5l79L34k68O1l20j91J09j17N1j47P7k81J82P4l20M29
1392c17j47j02L35P6K9J56N6L44q1LN4j95L16N3j17j05J20r9k25J38p7r6Q7n25
1416c19M47j09j69O2k36l6j24K16J45l54M95J02k6J33P0j75o1L36k09q9m5L2r3
1439gJ92k53J3k53J31QJ08m71K47j44m3n6M6J25j41K71m8n5J47P8J24J89J0K32
1463D50q2k53J62M51Q6m10J13m04M72k41J90m59j32n3r2L7l1k97%J99l43p0K3
$$ plain form
1300 66 -103 363 482 172 447 365 626 276 633 252 55 326 513 15 73 -207 38 -188 -24 -338 -381
1321 -381 -365 -278 -564 -571 -278 -574 -389 -414 -90 -280 54 100 202 25 -48 201 289 324 231 498 -64 52 266
1344 266 45 44 -72 19 -164 -232 -231 -224 -455 -295 -258 -473 -421 -178 -165 -425 -32 88 18 115 305 326 402 375 628
1369 628 477 400 455 513 410 404 389 10 344 76 137 -183 -374 -265 -382 -331 -478 -401 -682 -500 -426 -746 -317
1392 -317 -464 -566 -231 -155 -126 30 86 430 349 352 406 211 527 580 463 358 478 379 154 292 215 119 206 -319
1416 -319 128 19 -150 -88 -324 -360 -484 -268 -123 -477 18 120 94 227 297 122 61 397 188 99 54 86 -7
1439 -7 185 -68 -55 -308 -177 -169 -61 -532 -285 -429 -472 -528 -482 -357 -498 -227 -275 -330 -183 -105 19 208 218 450
1463 450 368 115 277 728 814 404 517 113 585 344 534 75 -57 -110 -202 -165 -196 -493 -493 -294 -637 -707 -684
1486f84l5o2M77m02L80K1J6p5L74l80L20M12l71mL29l0l38K92K42l15J44j75m7
1509H9l26J81j0j6l3j96K17k06p8K90j80m4J71K50k68J08J61k81J84K00k06J0
1531A7L64k40J3n8J3k22P1j24q9L2nm00M91l62j42K13n5k53N64j71l45L80K49
1554e9k74P9M78j05N4J60q8P8J83k20K64N6j94J59J01l32l39N13m11k88K72L6
1576A23n64L29k33k10K89j86j10k78O44j11K34l48O8l8L85L02m87J86K03k2R2
1597B68ol42M67K3l12J52o6m22L48Q4m22j96M87n80L75J95k90J04r8O8j73M16
1619H0j08Q9J89l88J49K63J12j87K55j04j63J96j82j3Q6p6k51J75l4m72L15L2
1641c7k08j55K41k58j20M52k47J19O1Q3k4J10p6K39r4Q7p7J99Q6oK9j43K09k61
$$ plain form
1486 -684 -719 -781 -304 -706 -326 -305 -289 -364 10 -370 -50 362 -9 -13 316 286 -52 240 482 167 311 136 89
1509 89 -237 -56 -66 -82 -115 -311 -94 -300 -378 -88 -268 -312 -141 109 -159 -51 110 -171 13 213 7 17
1531 17 381 141 154 96 109 -113 -42 -166 -255 -223 -228 -628 -137 -499 -641 -428 -483 -736 -172 -343 -688 -308 -59
1554 -59 -333 -254 224 119 173 333 245 323 506 286 550 606 412 571 672 340 1 514 103 -185 87 123
1576 123 -441 -112 -345 -555 -266 -452 -562 -840 -196 -307 -73 -421 -353 -391 -6 296 -191 -5 198 176 268
1597 268 262 -80 387 410 98 250 184 -238 110 194 -228 -424 63 -517 -142 53 -237 -133 -231 -163 -336 80
1619 80 -28 61 250 -138 11 274 386 199 454 350 187 383 201 188 274 198 -53 122 88 -384 -69 -37
1641 -37 -245 -400 -159 -417 -537 -85 -332 -213 -152 -69 -93 17 -59 180 86 173 96 295 381 375 404 261 470 209
1665B09L91k64K0R9o31K06L4k46M9p7j74K02m8j26j9M2R0r2M05k67k01M15j18
1688a01R6J21K3K6K35j8k65K06k52P8O1J60j48l26k06K31k69K30k30K33j48j45
1710d08O6K90k64j39J45M21m48K63P7j05L09M4k61L85K5l31K24J19k9l26L49l11
1732I5q1K02l14J74J19k04j40J89l66j32K07k10L7J86lP7J39L0l65K73K86j80
1754A9o5L61j79o4K75k13n2O1J32k18J40k16L22l21L7J33p9l87k8O6J26k32M0
1777c42J34N9j62J06j84M01j89K20R0O3O3j80N24k91k22J08Kj31K10k16m7J50
1799A66k30m8J15l49J93j64J20k45K03q1J2J25K3j01K54K2l70L99j45J02J17j13
1821EM95j24N5m01j29O17l70O7j11n8k6J72m9l82L76m18J26p5K00j44j10K33j34
$$ plain form
1665 209 600 336 356 455 -176 30 64 -182 -133 -210 -384 -182 -230 -356 -375 -333 -243 -335 70 -197 -398 17 -101
1688 -101 -5 116 139 165 400 382 117 323 71 149 210 370 222 -104 -310 -79 -348 -118 -348 -115 -263 -408
1710 -408 -342 -52 -316 -455 -310 111 -337 -74 3 -102 207 251 -10 375 400 69 293 412 383 57 406 95
1732 95 14 216 -98 76 195 -9 -149 40 -326 -458 -251 -461 -424 -238 -241 -164 -25 5 -360 -87 199 19
1754 19 -46 315 136 72 347 134 82 143 275 57 197 -19 303 -18 19 152 73 -314 -342 -276 -150 -382 -342
1777 -342 -208 -149 -311 -205 -389 12 -177 43 133 196 259 79 603 312 90 198 200 69 279 63 16 166
1799 166 -64 -112 3 -346 -153 -317 -197 -442 -239 -320 -308 -183 -160 -261 -7 15 -355 44 -101 1 118 5
1821 5 500 376 431 30 -99 518 148 215 104 46 20 192 143 -239 137 -281 -155 -230 -30 -174 -284 -51 -185
1844a85K48k08oK35kj16K04J98l03L15k20R1J15kl37J77L0J23n21P1Q9j74j74
1867c52M33m88J60P7j22Nj1k26K82N5M4J15j43K88l86M79k39rN45j57J88o8k73
1890A97L6J20k8k29J95j39k81L15l14J06o4Qo7j84m3o1J38J86k68J93J85k12J97
1913a4J22o9J02o1O9j36L00q2j51M46l50QJ3j41O6p1r5j1p7k7N6K83l79m18N07
1938a10j89J24Q5k4r4J22O6J66o1K67n6j16J95l68L75P4k32m8J62j56j55J07l18
1961a84K04n9k75J50j44O6l9J63q6k51n8k8N41K9j09j09K10k9O2J38o2k6l5R4
1985A63r8J99R6J00j94j56q4J38j69J47m76K26rj44J45N5l26K20L6K7k70M57j43
2008f0K0K3K31n7K6j02qJ18M5o8M7j6k02J36j13J14n0n9j07j86L95j4k67N2J7
$$ plain form
1844 -185 63 -145 -151 84 82 -34 170 368 65 380 160 251 366 364 27 204 234 357 -164 -93 -4 -178 -352
1867 -352 81 -407 -247 -170 -292 -287 -298 -524 -242 -187 -143 -28 -171 117 -269 210 -29 -38 507 350 538 470 197
1890 197 233 353 325 96 291 152 -129 186 -128 -22 -86 -78 -145 -329 -372 -433 -295 -109 -377 -184 1 -211 -14
1913 -14 108 39 141 80 149 13 313 231 80 526 176 184 197 56 122 51 -44 -55 -132 -159 -103 180 -199 -617 -110
1938 -110 -299 -175 -90 -114 -208 -86 -20 146 85 352 296 180 375 7 382 456 224 176 338 182 27 134 -184
1961 -184 20 -39 -314 -164 -308 -242 -281 -118 -204 -455 -513 -541 0 29 -80 -189 21 -8 54 192 130 104 69 163
1985 163 65 264 360 460 266 110 26 164 -5 142 -334 -108 -117 -261 -116 -61 -387 -167 -131 -104 -374 83 -60
2008 -60 -40 -17 214 157 183 81 73 191 236 168 215 199 -3 133 20 134 84 25 -82 -268 127 113 -154 -102 -85
2033h5k07K84m3j67J47J1k7J64q9q2M79k83K35j54K7k8L1J98k21Q6r3j0j19M14
2057D68m77P1q6k9o1q4j61M3K70j78j38K70l2O9mj60MJ94P8k32J73K18j36K40
2081C20P5k30j3q3K21j17J44j5l44P4J3p6p5k1kP2j36k97J69K21j31o6J72J01
2105b4P0K35j40j69K35J22n7j17J90j33j70Q8P8r5J37k01j19J26O2k06k34K09
2127a13M2O8n55J94J92J7RN1j67R0J02n9K25j97l4J93J12M8j35K8J74Q1j96j45
2151B5J13n9k49L63j26j34j05J15k22Q1O4q1k58J35J92M2N1j6L0Q2o5K3j02K15
2175A14o5J78r1J85j62J57j94J80k67j6j65L98j08k51jn3J12j66N6J86r8J80o
2198A03k08L1r6O5J82p3j3J20J53k64J64o8J52j73m2RJ74P1N8j09l28J21j54l2
$$ plain form
2033 -85 -292 -8 -51 -218 -71 -60 -87 77 -12 -94 385 102 337 183 210 182 213 411 190 276 183 173 54 468
2057 468 -9 62 -24 -53 -114 -198 -359 -316 -46 -224 -362 -92 -124 -55 -59 -219 -215 -21 57 -175 -2 216 80 320
2081 320 395 165 152 69 290 173 317 302 -42 32 45 -31 -106 -127 -129 -57 -193 -490 -321 -100 -231 -297 -125 -24
2105 -24 46 281 141 -28 207 329 272 155 345 212 42 130 208 113 250 49 -70 56 118 -88 -322 -113
2127 -113 -71 -3 -558 -364 -172 -155 -146 -95 -262 -172 -70 -129 96 -101 -135 58 170 218 83 111 285 366 170 25
2151 25 138 79 -170 193 67 -67 -172 -57 -279 -198 -134 -215 -473 -338 -146 -104 -53 -69 -39 43 -22 1 -101 114
2175 114 49 227 136 321 159 316 122 302 35 19 -146 252 144 -107 -108 -161 -49 -215 -159 27 -71 109 103
2198 103 -105 -74 -170 -105 77 4 -9 111 264 0 164 96 248 75 33 42 216 287 345 236 -92 29 -125 -157
2222a57L04k95P7j04k2j25J63k09L55j14J7n2J97j7l1j94L39QJ63k60J10J22j76
2245I9j34J67o3j97J34K5O2j93j2K34l84j9R7L8l27K59M8o8R8J34m5j06M50k84
2269A3P7j41QO2m5L04k13q2L47m17J35J00j77J75j63Jr8J19l53K90P4q2r0P7N6
2294b3j03N4p2Q9j25p3L36j08Q7J16J52k19O6J36k19P9r3J58q8j55r0k1l3J16
2318c3o1J56M5p6j72k49N6J84J52jj35n0K6K35l1j2J97j78mj01J63Nj16J55R5
2343B50%O1m19K88j52n2m7K26k00J6j30R0n8J0r2R5r0R1P8J22k53J48j08J83J86
2368B43j5k83K33l4J37k58n1j5K07O3j31j36r8J72j28l9k7Q6J15j60k13M2l2P6
2392b46L18k91J7J54N7o3K22k83K90J21j5j89J8K8N7M7j07l0j72K12j71l5J31
$$ plain form
2222 -157 147 -148 -71 -175 -197 -322 -159 -368 -13 -127 -110 -162 35 18 -13 -207 132 140 303 43 153 275 99
2245 99 -35 132 69 -128 6 31 93 -100 -112 122 -262 -281 -184 -146 -473 -214 -166 -234 -136 -2 -47 -153 297 13
2269 13 90 -51 -43 19 -26 278 65 -17 330 -87 48 148 -29 146 -17 -16 -114 5 -348 -58 16 -66 -156 -79 -23
2294 -23 -126 -72 -144 -55 -180 -253 83 -25 62 178 330 111 177 313 94 173 80 238 150 -5 -95 -116 -149 -33
2318 -33 -94 62 107 31 -141 -390 -334 -150 2 1 -134 -184 -158 77 46 34 231 53 49 -52 111 116 0 155 250
2343 250 250 311 -108 180 28 -24 -71 155 -45 -29 -159 -69 -127 -117 -209 -114 -204 -113 -35 87 -166 -18 -126 57 243
2368 243 228 -55 178 144 281 23 -28 -43 164 227 96 -40 -138 34 -94 -133 -160 -74 41 -119 -332 -290 -322 -246
2392 -246 72 -219 -202 -48 9 -54 168 -115 175 296 281 92 110 138 195 242 135 105 -67 145 -26 -61 70
2415G0n9k03m3L13m25J22L1P5o1J3p6J27L11l71J46Q3J21M0k38M6J02k6J20k97
2439g9L36qk56mK5n4o5L77j15k46J45k27k17K25j46K92k30R9j82K38N2j56K3o5
2463b38K23M8N6K25k52J55K31j80k16n9K6Q4j01l0l0k0L2q0jK17k98ON1l5M4p1
2489b13J08rJ8k0K04K10m46J12K60j58O0M8j13P6kRp6K25m69J86K21k68Ko9j23
2514b27J94M1J8j69k84K74P8L5k79N24l81J52J38R9j22J19j19J77j78j55O6J32
2536A33nj18M4P7M5j67r2K8k3K5o8k86L09K18l34K4j6J64k30J19J31j2O1j15Q6
2561bj23L71j57kp1J2K68j45L8q6jj91JK81l73q2K28r0N5ro5j14J90r7M3j02K93
2588G0l16K07K00j92n3N7K77n6R6r7p0J9J18j93o0Q6l7l0k50L81r3j10p1j21%
$$ plain form
2415 70 11 -192 -235 78 -347 -225 -194 -119 -180 -167 -243 -116 195 -176 -30 53 174 214 -24 22 124 98 218 -79
2439 -79 257 249 -7 -11 14 -40 -105 272 157 -89 56 -171 -388 -163 -309 -17 -247 -148 -330 -92 -40 -196 -173 -238
2463 -238 -15 33 89 314 62 217 448 268 52 -7 19 103 2 -28 -58 -78 -46 -126 -127 90 -208 -202 -151 -186 -142 -213
2489 -213 -105 -114 -96 -116 88 298 -148 -36 224 66 126 174 61 137 135 144 68 293 -176 10 231 -37 -35 -104 -227
2514 -227 -33 8 26 -143 -427 -153 -75 -40 -319 205 -176 -24 114 213 91 210 91 268 90 -65 1 133
2536 133 128 10 54 131 176 9 -83 -55 -78 -53 -121 -407 -98 120 -214 -190 -206 -42 -272 -153 -22 -34 27 -88 -2
2561 -2 -125 246 89 87 16 28 296 151 189 103 102 -89 -88 193 -180 -262 -34 -124 -69 -78 -143 -257 -67 -164 -121 -223 70
2588 70 -246 -39 161 -31 -84 -27 250 194 290 193 123 142 260 67 7 93 56 26 -224 157 64 -46 -117 -238 -238
2613b38l4J44n1N9n5K7pJ77j63On9K26Q8o7K07j9n6q9j73O8O3J59P3k85R8M2k50
2640a09K08k1k32K85j06k94K5L39k08J09j56J48j44N7J75L2j91N9R8Kj45p9K29
2663H1P9N9R4k87J27N6J9j5k75M8j01k0K91k84M3qj56J37j70J25p7q0K88J62k89
2688a53J92J21k17J72QJ47l38L98k7j38J90l25j31R2J00k37m3K70j96Q7n6l0K9
2711h5j17M18k25q3j64Q8J40m7K78k83J02J7j75K02J2p1J63l11Q48q87Q9J51P2
2734A32k09K18k25k9J7N0Q1j25m0k90M03o0Q8j58J94r7K40j67k03J59o3L61k98
2757b1K11j05O6J1l01J33R1k16K95J9m19J70J25j21J24k86J40j60L95j46j88O7
2779a16j5Q6n2J34o0r9K5l1n7K29j99K98j06J08J13J58l21m5J92m7k69K65j15
$$ plain form
2613 -238 -272 -128 -179 -120 -175 -148 -155 22 -141 -135 -194 32 120 53 260 241 185 96 -77 -9 54 213 286 1 99 141 -109
2640 -109 99 78 -154 131 25 -269 -244 95 -113 -4 -160 -12 -156 -99 76 108 -83 -24 74 76 -69 -148 81
2663 81 160 219 313 26 153 209 228 213 -62 -14 -115 -135 156 -128 -85 -93 -249 -112 -282 -157 -234 -314 -26 136 -153
2688 -153 39 160 -57 115 123 270 -68 330 303 165 355 30 -101 -9 91 -146 -189 81 -115 -28 -84 -114 -85
2711 -85 -202 216 -9 -92 -256 -168 -28 -75 203 -80 22 39 -136 66 78 7 170 -141 707 -180 -91 60 132
2734 132 -77 141 -84 -113 -96 -46 35 -90 -130 -420 -17 -77 11 -147 47 -50 190 23 -180 -21 -84 277 -21
2757 -21 190 85 151 162 -139 -6 85 -131 164 183 -236 -66 59 -62 62 -224 -84 -244 151 5 -183 -116
2779 -116 -131 -45 -97 37 -23 -122 -97 -128 -185 44 -155 143 37 145 258 416 95 50 242 195 -74 191 76
2802G6J9n0k19J08j26J2J76M6k87L28j52j30O3n3K90P4k50R2O2k12L50k01J83
2825A99L1j87L14j81k20n6K26k72K59j31p5j14o4J70K2j74J94k00L84J53m69O9
2847a22K66k01j49M47n5M9j50k12RK26r6j11K18m4J0n6j4m9N9r4J60p1N4j93j02
2872b21J23J26k30L9K94k09j0R0OQ6O2R7k42M62k81j58R9M2k86J63j5j38J23J47
2896A69k70JK93k6k15j3k93K97J05n5Oj03J07q1k65K26J55j99P4K5K04n0K90l5
2920C47p7k96M03k23j32p1k2P4q4J30k44K22l5j2o6K3m2nj15l2M07k36K09r6j3
2945A4p5P5RM4n5N3K09l2k16L59k60n0J88k41n6j2r2K05J8Q7j74j43J77j57J1
2970a14J15j24j73L00k01M0j68N23l86J85R9J13k18K02m2k15J13J50n4k35K37
$$ plain form
2802 76 95 45 -174 -66 -192 -180 -4 42 -245 83 -69 -199 -136 -189 101 175 -75 17 79 -133 217 16 199
2825 199 230 43 357 176 -44 -100 126 -146 113 -18 -93 -207 -271 -101 -79 -253 -59 -259 125 278 -191 -122
2847 -122 144 -57 -206 241 186 235 85 -127 -118 108 12 -99 119 75 85 29 15 -34 25 -69 91 20 74 -119 -221
2872 -221 -98 28 -202 -163 131 -78 -88 2 8 94 156 253 11 473 192 34 133 175 -111 52 37 -101 22 169
2896 169 -101 -100 193 167 -48 -61 -354 -57 48 -7 -1 -104 3 -78 -343 -117 38 -161 -87 -62 142 92 382 347
2920 347 270 -26 377 154 22 -49 -71 3 -81 49 -195 27 -8 -20 -86 -63 -105 -110 -225 -257 150 -86 123 27 14
2945 14 -61 14 23 67 12 65 274 242 26 385 125 75 263 22 -34 -46 -138 67 85 172 -2 -145 32 -125 -114
2970 -114 1 -123 -296 4 -197 -157 -325 198 -188 -3 96 209 -9 193 151 -64 49 199 145 -90 147
2991A47r1N4j24J17J21q6J5j81j9j5k72n6J59J98j41kJ81J02j5N6j33j69K75r
3015A12j09Q9R6L1m6k26R3ML7J8L2q4k55K64j62J46m22J57J40o8J18k02J66K6
3039d5o9j21J45O1J23m9j4k09L01q7q7K12r6J11J19m0k32K3J8O7k6k99J92p5o4
3064a41J67Rj03m4P4k6o3J22k04Q3Q6R0O0l7O0KQj07j54J65J82L9k60O2q7nl4
3091e6j57L43r5j34J33r0m4J40j65J24QJ3L6mj85M3M5K62q9r4Q1j08j38J78J53
3116B00k46J09j47L1j97Q7p1J98o5P3J22l92K51j83J32J24l2p3j00J97J30j00
3138D8j32K20q6P8k08J12r5K78m2J33k28r5M28m10k31L27m6q1Q5n3j45k3j9J54
3162c1r2k3L6K06l31P1J63l0J41p7N9j41J16j43K45n4p4J7O3K1k9R8k01J03j5
$$ plain form
2991 147 56 110 -14 103 224 138 153 -28 -47 -62 -334 -390 -231 -33 -174 -176 5 107 92 148 15 -154 121 112
3015 112 3 92 188 219 173 -53 40 44 81 99 131 47 -208 56 -106 40 -382 -225 -85 -153 -35 -237 -71 -45
3039 -45 -114 -235 -90 -29 94 45 31 -178 123 36 -51 161 65 176 295 255 23 46 64 131 105 -194 -2 -77 -141
3064 -141 26 35 -68 -112 -38 -64 -127 -5 -209 -126 -40 50 110 73 133 135 143 36 -118 47 229 268 8 70 -17 -22 -56
3091 -56 -213 130 35 -99 34 -56 -100 40 -125 -1 7 20 56 52 -133 -90 -45 217 128 34 115 7 -131 47 200
3116 200 -46 63 -84 -53 -250 -163 -234 -36 -101 -28 94 -298 -47 -230 -98 26 -6 -79 -179 18 148 48
3138 48 -84 136 50 128 -80 32 -63 215 173 306 78 -17 411 1 -230 97 51 -30 55 2 -143 -166 -185 -31
3162 -31 -123 -146 -110 96 -235 -164 -1 -31 110 33 92 -49 67 -76 169 115 41 58 121 142 113 211 10 113 98
3187I8q5p4L31k82j21q4K25l27K14j40K07j93K50k30L43j07J17k06J33j07J3J50
3209A25L7J22k79K14j25J7J87m65L3J15l3J11j21O0j52J53j43Qj16J16j10N04
3231B58k1l03J62j48Q0j98L36N0j97qj9J56k33K19N0j05J0q3N8l7J19n17M42J37
3255B08k18j37kQ4q6k5O9J07l8o2O2j18L05m6k17P1P4j94L79k03K5J08q2J7J31
3280B12j13m5j4K4l1l7N7l74K5J86J35l26K46j38K19k24J75J59l45RJ11o1R5O2
3304Gm5P3J41k7q4PRm1O7nN0j96J30J03k87m1j14Q0L5J98K7l14K72j4j91N8J1
3331i1j00j04L51ok28L7L08k79K96j78k8R4j6J38q9j73l2J98k29J27J52k83J58
3354B3l5J82j58m6J6J9J5N3j94k54N69j24q3J32k95L58l7j54l5p8K94j96K0N9
$$ plain form
3187 98 13 -61 270 -12 -133 -217 8 -319 -105 -245 -38 -231 19 -211 132 25 142 -64 69 -38 -25 125
3209 125 162 284 5 219 94 111 298 -167 -134 -19 -52 59 -62 -2 -154 -1 -144 -136 -252 -136 -246 258
3231 258 237 -66 96 -52 28 -170 166 216 19 11 -8 148 -85 134 184 79 89 6 64 27 146 -371 71 208
3255 208 -10 -147 -149 -65 -151 -176 -107 0 -38 -100 -38 -156 149 103 -114 -43 31 -163 216 13 38 146 64 81 212
3280 212 99 54 40 64 33 -4 53 -321 -296 -110 25 -301 -55 -193 26 -198 -23 136 -209 -200 -89 -150 -55 7
3304 7 -38 35 176 149 65 72 81 40 107 102 152 -44 86 189 -98 -139 -253 -173 -138 60 87 -227 45 31 -160 -102 -91
3331 -91 -191 -295 56 50 -178 -141 167 -112 184 6 -22 72 56 194 105 -68 -100 98 -131 -4 148 -135 23
3354 23 -12 170 12 -34 -18 1 16 69 -125 -379 190 66 -17 115 -180 178 141 -13 -48 -126 168 -28 -8 51
3378E1k8J46k24K53l14K11k39L45j96L1N1o9m4r2j70J72o8K35RR1j78J6n5N03
3402D37j97j08J3j32J35%j66K83l79K32j66L1Nm1K25l13qN5J07j56J77j50J0J45
3426C9j09K53k70j75L46R3j24J22j61o3J09o2j6r6K61m5l8Q6r4j7j15K14q5j86
3450a33J9Q0R3l52L39P9k86K56N5k43L01k34j8J52j9j03K9p9J00J02k69K97K69
3473D35l81k75O7R1o7Q5J01j16o8J59J17P9j56j16r7J30mj87J54O8j43J98Qk8
3497E4O6o4p8K08l09P6j02K34l39J47J90j35KJJ19j41J43q9j3j54K09j03K36l41
3521a83K15l28K87R8Rj30J21q6J80kk08K70m6m11J52J0Q0l8Rk9J86k18q2O5j15
3546a94J22k00K48J8j89P0O8k06K56J83j15l86J55p6L06j17L9R2O7k98R6j9N8
$$ plain form
3378 51 23 169 -55 198 -116 95 -144 201 5 36 87 18 -26 -118 -288 -116 -184 51 60 151 -27 -11 -66 437
3402 437 240 132 145 13 148 148 -18 265 -114 118 -48 -17 -12 -53 172 -141 -149 -94 13 -143 34 -116 -106 39
3426 39 -70 183 -87 -262 84 177 53 175 14 -49 60 -2 -18 -114 147 102 64 150 56 39 -76 138 53 -133
3450 -133 -114 -34 59 -293 46 125 -161 95 150 -93 208 -26 -44 108 89 -14 15 -64 36 138 -131 166 435
3473 435 54 -221 -154 -63 -130 -45 56 -60 -128 31 148 227 71 -45 -142 -12 -16 -203 -49 19 -124 74 82 54
3497 54 120 56 -22 186 -123 -47 -149 85 -254 -107 83 -52 -50 -49 70 -71 72 -17 -30 -184 25 -78 158 -183
3521 -183 32 -296 -9 89 98 -32 89 3 183 181 -27 243 197 -214 -62 -52 28 -10 -1 -30 156 -62 -144 -79 -194
3546 -194 -72 -272 -24 -6 -195 -125 -57 -263 -7 176 61 -325 -170 -246 60 -57 -18 74 141 -157 -61 -80 -22
3569b2L42m22L03l12P1k43M51j34l5l51M32j81J15n0o0j65P0K64j66pK74k37J95
3592A32k49j03K87j50Q5J55j53L29J8k83p5j27K80j86k5j7J89j53j53O2o8K90
3614H5k16J24Q1j28Q5p9Q0j37k0J23J17m1L37m79O2L2L0k7Q3q8p7j9J94p8J0J9
3640G3l18L76j60Kmq6K48j78J07j37j52M3J19j04J55J10J00r1J00j12j27J46o6
3663D4J42p5J36j81j42J34j00K1o9j27N8O3J61j23O4qj39K81m40J09M2R3o9K46
3687A21o5m20N21j73K41n9l07K47j23J43l9l2L0j8J39k96L87k35j30q5K0J96j54
3710i1r0rj2K17o1r7J94k78J45j5j25K82p1J3O3M2j37J73j90O9k4%k88M92j92
3735A0k4R9P3j49k98L85qj37o2M9n1J19KJ30o4j88p9L90k37K12r1M0j02K8R5j89
$$ plain form
3569 -22 320 -102 201 -111 -40 -283 168 34 -1 -352 80 -101 14 -36 -96 -261 -191 73 -93 -100 174 -63 132
3592 132 -117 -220 67 -83 2 157 4 333 351 68 -7 -134 146 -40 -65 -82 107 -46 -199 -137 -205 85
3614 85 -131 -7 74 -54 31 -48 32 -105 -125 -2 115 74 411 -68 -6 26 56 29 112 24 -53 -72 122 44 54 73
3640 73 -245 131 -29 -27 -31 -117 131 -47 60 -77 -229 -186 -67 -171 -16 94 194 103 203 91 -36 110 44
3663 44 186 111 247 66 -76 58 -42 -21 -90 -217 -159 -96 65 -58 6 -2 -141 140 -300 -191 -149 -56 -125 121
3687 121 56 -364 157 -16 225 166 -141 106 -17 126 87 55 85 67 206 -90 297 62 -68 -153 -133 63 -91
3710 -91 -181 -190 -202 15 -46 -143 51 -227 -82 -97 -222 60 -11 2 65 107 -30 143 -47 22 -2 -2 -290 202 10
3735 10 -14 85 158 9 -289 96 88 -49 -111 -62 -113 6 8 138 74 -114 -193 197 -40 172 81 121 19 47 142 -47
3761d7K3K09o9j08j12M9M0n7j05K07ko3j08J54j21L11r3jl5k89J62j44OR7N2J03
3787E9j13O0l4J2Q4q0L8J99j42k30J50k44R8K48m3l18K41j32P0l7K26n5k22j38
3811c03N09l63K65k07j09L79j93l4K06p7j42M0O0r5J90l05K11k37L55k44J30J30
3833A66k64Q4MK83l84J94j9j47L20l95j8J72j22K69o7n9M1P4l1m72K81P9J51j16
3857B4M7j37K61j17r8OJ56j63j68L48N2n54M92j36j76J93J59j88O5j55M8O5n0
3880b6m1K62k60J59q9R7r1J03K3j30J78K3o9r3l9l5P2l29J31N7j91L74k14J83
3904E5j02R4J2l23J59J17jRk82M45j1k25J27j51K27j11K29k1k14J36n9q1J04q1
3928E2mrr1M0J24j5k00J06O8p0q4J51p2J7R3j86M39m98J45M7K36l93M69k99n6
$$ plain form
3761 -47 -24 185 116 8 -104 -55 -15 -72 -177 30 28 -35 -143 11 -110 201 108 107 72 -217 -55 -199 -193 -96 -44 59
3787 59 -54 6 -28 -16 68 -12 26 225 83 -147 3 -241 -143 105 62 -256 -15 -147 -77 -114 112 57 -165 -303
3811 -303 206 -157 108 -99 -208 171 -22 -56 150 73 -69 -29 31 -64 126 -179 32 -205 150 -94 36 166
3833 166 -98 -14 -10 273 -111 83 64 -83 237 -158 -176 -4 -126 143 76 17 58 132 101 -371 -90 -11 140 24
3857 24 71 -66 195 78 -20 -14 142 -21 -189 159 211 -343 149 13 -163 30 189 1 66 -89 -41 24 -26
3880 -26 -67 195 -65 94 5 102 11 114 137 7 185 208 139 46 7 -28 44 -285 -154 -97 -288 86 -128 55
3904 55 -47 47 59 -264 -105 12 11 20 -262 183 172 -53 74 -77 150 39 268 247 33 169 110 29 133 52
3928 52 48 39 -52 -12 112 97 -103 3 71 1 -83 68 -4 13 106 -80 359 -139 6 53 289 -104 365 66 10
3953A0J94j47J85l26Q1o0j54L42j2J7J3k44J66j80q2J33l7RJ6J9K8o6J9r4J91
3978B1P5j4J17J7j27J83k81k66J29J62O2j4k19L47k42M7L4l8J07j41R9n2J1O4
4002H1j21r6N1L8q2J89J53k17l8J90j44j30K51O0j44j91K22p2QJ22k04K33j47
4025A2J34j29q1K76k90j34K28j32N9J20j61J21j2M5M1k31M9j0M3K28k55J26M1
4048H8j65Q1p7j42J16J54J09l83K15K69l07m4j07K35j97J13O1j91j60J14K47J05
4070A34l5K1j79j35K67r2n9K45L0l14K08J98k49j28K68p9J8k15J46r5j7J28r8
4093c2k3j49K12j17p1P3L40n7l21j3K62Q0q4J51l63j04k6J12J01K17K7k24j64
4116a73J46K25k25m4J95k0R8l17J45J5j5J63l49p3J85k31K50J9l7J29j83J34m7
$$ plain form
3953 10 204 57 242 -84 -3 -63 -217 125 113 130 143 -101 65 -115 -197 -64 -101 -92 -76 -57 -29 -95 -76 -170 21
3978 21 96 82 199 216 89 272 -9 -275 -146 16 78 64 -155 192 -50 -3 31 -7 100 -41 58 6 17 81
4002 81 -40 -136 -85 -47 -129 60 213 -4 -42 148 4 -126 125 185 41 -150 72 0 8 130 -74 159 12
4025 12 146 17 -64 212 -78 -212 16 -116 -57 63 -98 23 11 56 97 -134 -85 -95 -52 176 -79 47 88
4048 88 -77 4 -73 -215 -99 55 164 -219 -4 265 -42 -86 -193 42 -155 -42 19 -172 -332 -218 29 134
4070 134 99 120 -59 -194 73 -19 -78 167 197 -117 91 289 40 -88 180 101 119 -96 50 -45 -62 66 -32
4093 -32 -55 -204 8 -109 -180 -107 233 176 -145 -158 104 184 100 251 -112 -216 -242 -130 -29 188 215 -9 -173
4116 -173 -27 198 -27 -71 124 104 202 -115 30 45 30 193 -156 -229 -44 -275 -25 -6 -43 86 -97 37 -10
4139a0K1j87J07J20N3R0k25J01K65m70L0K44j53J8J16j16L63k44j29j0k38J09
4161a45J57j01j00L85n3k03k0K3m3J49J08o4j3J10j71j25L73r6k22J79k5p6j49
4184a22J86k06K01l22J95J2K30j41K8k77J94L6P0j28K2L01j05k45q5K01k43K79
4206H1o7j00n0O2K88j27Ko2l8J63j3k74K25j33k61L91kj05j49o4K29k6k17q1M24
4231I6k43M14l43j19J4J02J98k61K12j70J98k49L1J53o7O5K63l57j03L93k28R0
4253H9k73J65K23k92J31O1j26J96k56K57r9mR4k34MJ55o3k41J61J49Q3o0k16J12
4277A6kJ1J14K04l45J9M9M6j9l51K90r9l4o4Kj5M89m74R2P8j33N7N2R1j39R9j07
4304g3rp6J72K7o5O9lJ75l18K2J16K27k43Mo4J43q2j5J20j41P6K4k42K08k41L45
$$ plain form
4139 -10 11 -176 -69 51 104 194 -31 70 335 -135 -105 139 -14 4 120 4 367 123 -6 -16 -254 -145
4161 -145 12 -89 -189 196 143 -60 -80 -57 -100 49 157 93 80 190 19 -106 267 171 -51 128 103 27 -122
4184 -122 64 -142 59 -263 -68 -56 174 33 61 -216 -22 14 84 -44 -22 279 174 -71 -156 45 -198 81
4206 81 14 -86 -136 -74 214 87 89 27 -11 152 139 -135 90 -43 -304 87 85 -20 -169 -233 -4 -30 -247 -328 96
4231 96 -147 267 -76 -195 -181 -79 119 -142 70 -100 98 -151 -120 33 -34 31 294 -63 -166 227 -1 89
4253 89 -184 -19 204 -88 43 104 -22 174 -82 175 76 72 166 -68 -64 91 28 -213 -52 97 180 120 -96 16
4277 16 14 25 139 343 -2 17 66 112 93 -258 32 -67 -101 -165 -163 -178 311 -163 -71 7 -126 -69 -17 74 -65 34 -73
4304 -73 -82 -158 14 41 -24 45 42 217 -101 -79 37 264 21 25 -39 104 22 7 127 -14 62 86 -156 52 -189 156
4330A56j66j39k8J15j67K03K10p1l2m6j2j11M8L17j96L4q6O2J8M6Lj21M2j31p4
4355a26J02j33K35p5k24J55LO5m6j9j4K8J83j28R3r6k63K22Rn3J59J33j49r0K53
4380B24m75K86K31l99L6K35N6m65K85M9r2k8o5J26J70O9l73L13k76K29J13j21
4402A28O4j68NJ05j08k4l5pl6m3L44l75J98k22K69j93l67N82J8j87K43k20O3J1
4426D5j25K91l4k91K78l37J8K57r5J23j97j8K07p7q4j51J43J51k04K1K7k17K34
4449c5j38J70j25m2M3P6j14K21j41K57j00j50r8Q4J07R6N8o0j31j85L77P5j6k83
4473e4K77j75M2j97M5m1N2J56R7k09Q7j3j15J09k9K1%k0N3j63J28o5k6J11j01
4498c0k7j0K00o8k9j67R2P1j26J69j2n5o9%J6n0J34r1o6RK61L1j31k04j51M81
$$ plain form
4330 156 -10 -149 -177 -62 -229 -26 184 113 81 35 23 -88 -40 277 81 115 29 91 109 155 158 37 79 -52 -126
4355 -126 -24 -157 78 3 -221 -66 -63 2 -44 -63 -77 -49 134 6 99 3 -260 -38 -29 -82 77 210 61 -29 224
4380 224 -251 35 266 -133 -97 138 194 -271 14 63 -29 -57 -122 4 174 243 -130 183 -93 136 249 128
4402 128 192 24 29 134 26 2 -33 -40 -76 -119 225 -150 48 -174 95 -98 -465 117 135 -52 191 -29 34 45
4426 45 -80 211 177 -114 164 -173 -155 102 7 130 -67 -85 122 45 -39 -190 -47 104 -100 -79 -52 -269 -35
4449 -35 -173 -3 -128 -170 -127 -51 -165 56 -85 172 72 -78 -176 -92 15 111 169 109 -22 -207 170 245 229 -54
4473 -54 223 48 90 -107 -62 -103 -51 105 202 -7 80 67 -48 61 32 53 53 33 86 -77 51 -14 -40 71 -30
4498 -30 -57 -67 133 65 36 -131 -39 32 -94 75 63 8 -61 -61 -45 -95 39 -52 -118 -109 152 183 52 -152 -303 178
4524A78j09J02o0k5n4k38L93k09O2j21J94j09J14L1j11J27j56M1k11J10k12K71
4546Hn3J90j76k3qJ08q5JJ99l5J04k72P3j18K7J67J69j99j13L25l74m6J99j73
4570a05J58rj96R1J82q0J01r4Lj09j52n7J61J80l04j1K56L6n6J03j35J93j30J22
4594A48j97K44j52j43J79J73l28m8k4K14k0J89r4p9j33N7j5r2M2L5R3m8k9o7M
4619i1J50J47j97m0k35K83j96Q9J52l53K42o3K35l37J88k0M1RP1j37p2l3n0N13
4643B96l40L6j44J82q1o2J65j6j07J02n9K48K1m71J41K81K1o7j68L1J64j3Q3m44
4667b01K14j57K08O4k76J53J2R8K2l37J52j51J56K05k72J71Q3J03m40K02k1L4
4689B2k52N6J03K36k72J28J78k25K2J3L0J7r5j12J22j6J61p6M2p2%oj14q3K71
$$ plain form
4524 178 69 171 111 86 32 -206 187 -22 40 -81 113 4 118 149 38 165 9 50 -161 -51 -263 8
4546 8 -45 145 -31 -54 -62 46 -39 -38 161 126 230 -42 31 -87 -60 107 276 77 -36 289 -85 -131 68 -105
4570 -105 53 44 -152 -61 121 41 142 48 51 -58 -210 -267 -106 74 -230 -241 15 51 -5 98 -37 156 26 148
4594 148 -49 195 43 -100 79 252 -76 -124 -148 66 46 235 141 62 -71 -14 -29 -121 -79 -44 49 1 -28 -95 -91
4619 -91 59 206 9 -31 -266 17 -179 -90 62 -291 -49 -112 123 -214 -26 -46 -5 4 75 -62 -134 -167 -217 296
4643 296 -44 -8 -152 30 -51 -113 52 36 -71 31 -28 220 241 -230 -89 192 213 146 -22 9 173 160 243 -201
4667 -201 13 -144 64 128 -148 5 17 115 137 -200 -48 -199 -43 162 -110 61 144 247 -193 9 -12 22
4689 22 -230 -174 -71 165 -107 21 199 -26 -4 9 39 56 -39 -151 -29 -45 116 40 82 10 10 4 -110 -193 78
4714G8p0j12l5k3J89K28k97O9k11L45O3j60J7j95J56J89j83j51K7M3J53L9p1k22
4738a34L5N1j84J23N1j20K88j76k7p6nL88j30L9j49n1J3P6m3j14K33N4j39O4j14
4763d7Q9M3o3o6M0N0n5j88N5J61q6j01K27J8n6L00m29J23j36K08j34jL5K49j58
4788G8J13q1j55J40k2N8o0k49R0J01o7K6P9o3J34k48K30k69J68Pj28J97k49N9
4812a11l1K90k09J11O4k21l3Pk8K37r8N1j81J42J56j73oJ48j30NP9k07K87k66
4836a17J23j65J07o4J0L72k92k37J64NK19k84K9PL7J72J46m26R5R5j3m0K36j37
4860D2J5L8k09J99j47K18j09j23k16M9J68P8j24Q9j04K35j33R1K4j95LK34j86
4883f3K48j62L1j69O1p8K21L9k72L59k49K35j01j46j43K02j5k0j48K07J30j33
$$ plain form
4714 78 8 -104 -139 -162 27 255 -42 27 -184 161 224 64 81 -114 42 231 48 -103 -76 -33 120 159 88 -134
4738 -134 -99 -48 -232 -109 -58 -178 110 -66 -93 -169 -174 214 84 123 -26 -77 -64 12 -31 -145 88 142 3 67 -47
4763 -47 42 85 22 -44 -4 46 -9 -197 -142 19 -67 -168 59 77 21 321 -108 15 -121 87 -47 -48 -13 236 78
4788 78 191 110 -45 95 73 131 71 -178 -88 13 -54 -28 51 -12 122 -126 104 -165 3 10 -118 79 -170 -111
4812 -111 -142 148 -61 50 114 -107 -140 -133 -161 76 -22 29 -152 -10 146 -27 -33 115 -15 -10 69 -138 149 -117
4836 -117 6 -159 -52 -116 -106 266 -26 -263 -99 -94 125 -159 -130 -123 -86 86 232 -194 -99 -4 -17 -57 179 42
4860 42 57 95 -114 85 -62 156 47 -76 -292 -243 -75 3 -121 -32 -136 99 -34 57 81 -114 -111 123 -63
4883 -63 185 23 54 -115 -54 -132 89 128 -144 215 -34 201 100 -46 -189 13 -2 -22 -170 37 167 34
4905C4K49k13k8r8J01j07K9J98k54J31R6pj2K0Qk65lln1J67J44k89J36J1K1J1
4931B6j17J98j95J99l2o1J4n0J02j58j32j60L05k5J87k59K49N5n4M9j71J37P2
4954A79M7n04K19O4R7j36J99j47J32qj46n0R6k00J56L0k25K53j27L7K0n6J02m1
4978ij6k7J74j88K31j21j05J16j1p4K04j66O0l73K64J38k46L48k34P1MM3J44k16
5002A1j1r0J51j96J27J64k90K23k48J84K4J26q8j76Q1j17M9K30k08J87j75L6k0
5025b6j6K07l35M4N3p8J26Q4R8q6o9J01m9J0K51l34p9K04L9Rj05j26L1R5p8K12
5051A83n2ok08j2J28L1j85P0Ol92M12K52l21j4P2lj57p7K80Mn3J53p3K8J33k12
5077a3J70n9J06o1J14l67K36Q2l65K27K3n2m2j9RQ4k1j26N0J09l5L9q0L7n5q4
$$ plain form
4905 34 283 70 42 -56 45 -62 -33 165 -89 42 138 131 119 139 147 -118 -121 -124 -175 -8 136 -153 -17 -6 15 26
4931 26 -91 107 -88 111 79 18 32 -18 84 -74 -206 -366 -61 -86 101 -158 91 146 92 141 -30 107 179
4954 179 226 -278 -59 5 102 -34 165 18 150 142 -4 -54 42 -158 -2 28 -197 56 -71 -34 -14 -70 32 -9
4978 -9 -25 -52 122 -66 165 44 -61 55 44 -30 174 8 68 -305 -41 97 -149 199 -35 36 40 83 227 11
5002 11 0 -90 61 -135 -8 156 -134 89 -159 25 49 175 87 -89 -8 -125 -76 154 -54 133 -42 -6 -26
5025 -26 -42 165 -170 -126 -73 -151 -25 59 157 71 2 103 54 64 315 -19 -98 106 145 154 49 -77 -46 49 -29 183
5051 183 131 125 -83 -95 33 64 -121 -51 -45 -437 -25 227 -94 -108 -36 -39 -196 -273 7 11 -42 111 38 66 199 -13
5077 -13 157 98 204 143 257 -110 126 208 -157 70 93 41 -1 -20 -11 73 52 -74 -24 85 50 89 9 46 -9 -93
5103i3K2j89K66Rj72J4K66j90K49j88m5L66l9j21j06J50j00j46J56m3j07o3J46
5126D2l5j25J16J06k0j00j4k88K94o8O4J18J9J04j54j53K7K6J92k02J10J2j39
5149f8J37P9k77Q7J95j39J42k43k5n3J9j0L36k85j7K56j96R2r9p0R1R5L8j3Qm2
5175C8J12q2m2k01M69m00K41q8k10K09j0q4l0Nr9Q7m1J76p7J57r5q3k6Q8M0p1
5201a7K27j63j70J05j0j06J25K27l93K03j66L11j53P3J8m8j47J67p3J94k11J43
5223A36k65J07o5M5M1O1k81J90J58m39K79J97j08l7r0p5P5J67J8k11J25k0k7K0
5247An7J59k13K19J41k06P9j64K10j66K3J9n6k61L88j54j64OL47k03Prj13J47
5271b0n6j44M42j78J2q1Lo8k0P5j8J51P4k51l7J81j15K39p6j81Q0P6k5j12m5J3
$$ plain form
5103 -93 -71 -260 6 15 -157 -143 123 -67 182 -6 -51 315 276 155 49 199 99 -47 109 66 -41 -104 42
5126 42 7 -118 -2 104 84 -16 -30 -318 -24 -92 -28 90 109 213 59 -94 -67 -41 151 -51 59 71 -68
5149 -68 69 148 -129 -42 153 14 156 -87 -112 -165 -146 -156 180 -105 -122 134 -62 30 -69 -139 -48 47 85 72 80 38
5175 38 150 68 26 -175 294 -106 135 47 -163 46 36 -48 -78 -73 -172 -85 -126 50 -27 130 35 -48 -74 14 54 -17
5201 -17 210 47 -123 -18 -28 -134 -9 218 -175 28 -138 173 20 93 111 63 -84 83 10 204 -7 136
5223 136 -129 -22 -87 -42 -1 60 -221 -31 127 -312 -33 164 56 19 -71 -146 -71 96 114 -97 28 8 -19 1
5247 1 -56 103 -110 109 250 44 123 -41 169 3 26 45 -11 -272 116 -38 -202 -196 151 -52 -45 -54 -167 -20
5271 -20 -76 -220 222 44 56 -25 -22 -90 -110 -35 -53 98 172 -79 -116 65 -50 189 113 -68 12 88 63 -49 -94 -81
5297h1%m9L3J72j82L35l43L64l22L2J79o3j0K26k66k06K34J0k60J67j1J62k79
5320a58K2J97o1k42K56K7r8O4j07J09j5k9P9P6j6j32J6J12j78K10J00j83L27l53
5344B3J45k50J05n1L9K9j82K1J65K0j05J92N4k83Q2n3K1R5J00j18j47K37j66N3
5368B6K6j22O5K73j80l9j22R8J09M7j96Mm7l3R0p6p5J39J98m76L58M4j03K18l85
5393a59J07K4r3J17P9j4J20k64K42k91J42L80k66K1J22j03n2k45p8K41j36J79
5415G3P7k81P2J00q6K46k72J92rj58J44l1R3k43K77k18Q7j6Q2k90M15l59K30q3
5439D2j20o0K14j4J02k09K30l97K44k6j24K7j3j5RK76j51k38J76K33j46j62J64
5462D2J03m45L26J61p4K8k14J55j4o0O0j36Q3j23o2K01n2l15J94j64J26O0k68
$$ plain form
5297 -81 -81 -130 -97 75 -107 228 -115 249 -73 -41 138 75 65 291 25 -181 53 63 -197 -30 -41 121 -158
5320 -158 -136 61 0 -242 14 41 -57 7 -100 9 -6 -35 44 120 104 -28 -12 100 -78 132 232 49 376 23
5344 23 168 -82 23 -28 11 40 -142 -121 44 64 -41 151 205 -78 4 -49 -28 67 167 49 -98 139 -27 26
5368 26 52 -70 -5 268 88 49 -73 25 134 181 -15 -11 -58 -91 -1 -77 -152 -13 185 -291 67 111 8 226 -159
5393 -159 -52 -28 -121 -4 75 61 181 -83 159 -132 10 390 124 145 267 164 112 -133 -211 30 -106 73
5415 73 150 -131 -59 41 -45 201 -71 121 112 -46 98 67 160 -83 194 -24 63 47 129 -161 254 -105 125 42
5439 42 -78 -138 76 62 164 -45 185 -212 32 6 -118 -91 -104 -119 -110 166 15 -223 -47 186 40 -122 42
5462 42 145 -300 26 187 113 141 -73 82 68 8 68 -68 15 -108 -170 31 -21 -336 -142 -306 -180 -120 -388
5485c88K99L15Nj23j88J8O0k79L33j69J5J46J07j13p2M5O5k4j56J41j44J52J24
5508A69o8j01J33pn7j10J26r1l0k77L01k54K90o2K33k04JK08j10m9qj25J38R9
5532A45j68k0n2J12n0J01j50K86j59J75j97J15k34M0pK09j50J69o2k12R0k8K10
5555A63k43j21N9J10J83k23m7J08J11j21L79k92j16P0r0m0K2J61j80J90M5l03
5577a75J51j81M54m52J45k10PJ67J93j33K97j90J1q1J78K6j92J25l3j84K62j16
5599F9Q6k13J70k18j98O30j21k06j09J04K1j50p7J46m86P64p1o3j28K8O9J59j79
5622B7J73o5k41m3K92l07J90j38J23K53k40K74j53r9j56O6L9J23j57O1q8K45j97
5645a8j05K6n1J18J66K2m70L71N9k16j31M36k01K49k36m5r6RL3J81q3M8j33k5
$$ plain form
5485 -388 -89 226 231 108 -80 -62 -2 -281 52 -117 -102 44 151 38 -34 11 76 52 -104 37 -107 45 169
5508 169 101 0 133 126 69 -41 85 -6 -36 -313 -12 -266 24 -38 195 -9 -8 200 90 41 33 -92 46 145
5532 145 -23 -43 -95 17 -33 68 -82 204 45 220 23 138 -96 -56 -63 146 -4 165 103 -109 -19 -47 163
5555 163 -80 -201 -142 -32 151 -72 -119 -11 100 -21 358 66 -50 20 -70 -110 -88 73 -107 83 128 -175
5577 -175 -24 -205 249 -203 -58 -268 -261 -94 99 -34 263 73 84 3 181 207 15 140 107 -77 185 69
5599 69 155 -58 112 -106 -304 326 205 -1 -110 -6 15 -135 -212 -66 -552 212 141 78 -50 -22 47 206 27
5622 27 200 135 -106 -149 143 -164 26 -112 11 264 24 298 145 46 -110 -44 -5 118 -39 22 -66 179 -18
5645 -18 -123 -97 -148 -30 136 158 -312 59 118 -98 -229 207 6 255 19 -26 -122 -113 -80 101 18 66 -67 -92
5669i2L65k40j46L6J0J57N3L2k57K59m0j07lj42jK33j58P5O7j85k2k7M19k45j03
5694f2K28j58p8K61j02k0j38K09k75o0J73kj78O5l1M6j46J6K37j31J45PQ9K6M3
5719A64N4l30J22M7K6Q4q3O1j23K4M1j6p0J39O3k38M3p2J7m4m4K03L2l00K21N3
5745G4J2N2M1l40n7J19K61k68N6M1N3J78l82K17p4J8L33l35J46j76J56j68M0k4
5769b7J68N6k37L2k67J09J32j86K08K04l50L14k37K00l69L75k57K89j53m9J27
5790H2J43p6n9l3j46J71Q0p5j96K64k68K83k39JK6q0m7K01j80L91j63j38J18J10
5814A70q4m51K80J12l14M70k71J33J88J3j93n0K63l12M9k48M9R4J05j82Q8k4j07
5837b22L46p3Q1j85J78j37q4J02k6M4j1j73K31lj4k04P7J83J07L4k01J09N1j74
$$ plain form
5669 -92 273 33 -113 -77 -67 90 143 175 -82 177 137 30 27 -115 -116 117 -41 34 101 -84 -106 -133 286 41 -62
5694 -62 166 8 -70 191 89 69 -69 140 -135 -195 -22 -24 -202 -137 -168 -122 -268 -252 -15 -146 -1 6 95 121 164
5719 164 218 -112 10 57 83 167 84 145 22 46 87 71 1 140 203 -35 8 -64 -47 -91 -135 68 100 -200 21 74
5745 74 86 138 179 -161 -218 -99 162 -106 -50 -9 44 222 -160 57 -17 1 334 -1 145 -31 125 -43 -3 -27
5769 -27 141 197 -40 -8 -275 -166 -34 -220 -12 192 -158 156 -81 119 -250 125 -132 157 4 -45 82
5790 82 225 149 90 57 -89 82 162 87 -109 155 -113 170 -69 -68 -42 -122 -169 32 -148 243 80 -58 60 170
5814 170 86 -365 -85 27 -287 183 -88 45 233 246 53 3 266 -46 3 -245 -196 -102 3 -179 -91 -115 -222
5837 -222 124 51 132 -53 125 -12 -96 6 -20 24 13 -160 71 68 54 -150 -73 110 217 251 50 159 210 36
5861C6m7J94j23J35j86J03Pk00q5K72j38J3P0k26K41J02j79j75J37J22J15k94
5883a06M7J44M1j66r9L6j01K65O6j85o8J85m1L25m25P1k03J94M3M8J2j55L2m8
5907h8O8j57M00j86p6q4o3K27P7k7P9k72K85j51k3r2J63j15j5J47j37J6J93k44
5931g5J21n7O2k0k5L7p1r4r7K53n5k6M6p1J24J35j13l5J25l4j98j67J38P5k0o8
5957a10J69j54R0M9K3k56L16k23j6L14j84P3l9q8j5J27n6L5O1j66o8K15k16K40
5981A21r4J47j34J34k24K45j92l4o3J87p9j41J07j41K17j20J7J26l12L53o7K3
6003G6j51P0k76N13r6j80m6L59k85k1J41o6J70j04k8j5l04L50N7pJ9Q0k91L9J0
6028A4R0k11R1p5j8kL30j05l81K23J1J78j67O9K2j15J43N8J08k38j92J62J75j
$$ plain form
5861 36 -11 183 60 195 9 112 119 -81 -166 106 -32 -19 51 -175 66 168 -11 -186 -49 73 188 -106
5883 -106 -59 85 126 -40 -139 -103 -204 61 127 -58 -126 59 18 343 -82 -11 -214 -20 23 71 83 -72 -40 -88
5907 -88 -20 -177 223 37 -39 -123 -186 41 118 91 170 -102 183 32 9 -83 80 -35 -50 97 -40 -24 169 -75
5931 -75 46 -11 51 31 6 43 -28 -122 -219 34 -21 -47 -1 -72 52 187 74 39 164 130 -68 -235 -97 -22 -42 -110
5957 -110 59 -95 -5 44 67 -189 127 -96 -112 202 18 91 52 -36 -51 76 20 55 116 -50 -118 97 -119 121
5981 121 27 174 40 174 -50 195 3 -31 -94 93 14 -127 -20 -161 56 -64 -47 79 -233 120 53 76
6003 76 -75 -5 -281 232 136 -44 -90 269 -16 -37 104 38 208 104 76 61 -243 107 164 157 176 256 -35 4 14
6028 14 104 -107 -16 -91 -109 -111 219 114 -267 -44 -33 145 -22 47 69 -46 97 155 263 25 -167 -5 170 169
6052A69N9j5K9m25jK30L8J1j17l1LN3j58K43k65J90j0J83J0l40L29k7k94K46m1
6077F9k64o4K32O8j15J97l7j54J6P0n0L68m09L23m46L11J23l38J78j14nq8J03
6100b6j28R0J26j31k0J44k92K83J43k58j83M39j16J74m00N2K21p1k34j21K66k9
6122g1L2K1p6n9J00J01P8j14Q8r7o7l7N4q6J25O0qj65L27j52J07o1O0j81L16k32
6148F3k03K01n0P6J6P9j81o1K5M6j45K30j56J09k17J61k45J24lJ58o9j27J48P4
6172E3p2K6K75k31j38J8J86J98j85l2N1k92J59jK57k54j37rJ68O9k18j5L47j91
6196C2oP1r4N0r6k44L52O9j32R3j05K14j85j52l9L88j40k59K76k35J85n8M4j5
6220A4o1J5j28J83k53L05j23J30k35k81J74J87J15l74K38o4K43j39o5K68J64k32
$$ plain form
6052 169 228 213 242 -183 -184 46 84 95 -22 -53 -50 3 -155 88 -177 13 3 186 196 -144 185 158 -136 110 69
6077 69 -195 -259 -27 41 -74 123 86 -68 -52 18 -32 336 -73 250 -196 115 238 -100 78 -36 -41 -129 -26
6100 -26 -154 -64 62 -69 -89 55 -237 46 189 -69 -252 187 71 245 -155 -103 118 47 -187 -308 -42 -71
6122 -71 -39 -18 -94 -153 -53 48 126 12 100 3 -64 -101 -47 -133 -8 52 44 -121 206 54 161 100 160 -21 295 63
6148 63 -140 61 11 87 103 182 1 -60 -35 11 -134 96 -60 49 -168 -7 -252 -128 -131 27 -42 -169 -21 53
6172 53 -19 7 282 51 -87 -69 117 315 130 98 149 -143 16 15 272 18 -119 -128 40 109 -109 -124 223 32
6196 32 26 97 3 53 -43 -287 65 134 2 95 -10 204 19 -133 -172 216 76 -183 93 -142 43 -15 29 14
6220 14 -47 -32 -160 23 -230 75 -48 82 -153 -434 -260 -73 42 -332 -94 -158 85 -54 -119 149 313 81
6242H1j76k8R1l0LJ83O4p3n8j31J4K73k69J21r0J35k04M9J14p8J8j99J83J50j63
6267b0M2k02M53k10j20R1m2j32K87k49K6J17q8J21j51K87j11j51k26J34J55k98
6289b87J63K65j16k38K75j73K17J1j81L37k56J60O2l01P9L13l24J39Lj13l1o6
6311f2r2L16Q0k17n9K99j22j19k30J21k0Q7j24J46j58L46l16L0M96m62n8K49k9
6334A02Q4l14J22L4j01m6N7J19o7J56j85L9o7K80l25J5J24p2O3j5jJ37n0j61J76
6359A04r4q4J27j5k5J02l84K98j12J99j91K57j71J11j91K33j04r0K79k57J43j60
6381b5M4j5p6j1J13o8LK21l43l0J78J07j89Q0p1J28j89K24M1j61K42j13j19n0
6405g9J76k90J66M8r2l9J50Q7j29J8K0r0n8K6K2k2j12L4K8J82M0J27j56k60K26
$$ plain form
6242 81 -95 -123 -32 -62 -59 124 188 115 57 -74 -60 213 -56 65 -25 110 -94 -45 69 -9 9 -190 -7 143 -20
6267 -20 22 -180 273 63 -57 34 -8 -140 147 -102 -76 41 -47 74 -77 210 99 -52 -278 -144 11 -287
6289 -287 -124 141 25 -213 62 -111 106 117 -64 273 17 177 239 -62 17 330 6 145 148 35 4 -62
6311 -62 -154 162 242 25 -34 265 143 24 -206 -85 -105 -18 -142 4 -154 192 -124 -94 402 -60 -118 131 102
6334 102 186 -128 -6 28 -73 -119 -62 57 -10 146 -39 0 -67 213 -112 -97 27 -45 18 3 2 139 89 -72 104
6359 104 10 -74 53 38 13 115 -269 29 -83 116 -75 182 11 122 -69 164 60 -30 249 -8 135 -25
6381 -25 19 4 -72 -83 30 -38 -35 186 -157 -187 -9 98 -91 -11 -82 46 -143 81 122 -39 203 90 -29 -79
6405 -79 97 -193 -27 21 -71 -110 40 127 -2 16 36 -54 -112 -86 -64 -86 -198 -164 -136 46 86 213 57 -203 23
6430B3J39m8j52J14j22J17J36n27L45P0L4j19K3M9L1k41K37k0j62MQ9J41j64O1
6454E8M8l11J80l04N65l17oq7K06l5n5J15k39K43L9J17j34j44J03j56P4J72j84
6477e2n3K00k12PM9L4J73l27K96j19n9j09K55r2J81k25J14o6j38mJ07K3K77m00
6501a40Q6%lm6L01m20K25Q6k55L31l20L4m5L9J82Q5q2l17K76k4J69k88K86k54
6525i4J54Q2o0N1q5p1o1Q8JK15m1j85Q4m6N2j15L1O7Q7j55k14L13m6k27K31k32
6551a76K28k1j2k29K87Lj35Q0K9l89L51J63j29k1j51K22j6j60Q1pJ90l24L43k88
6575h1J25p4J67l39L25L5r7j63L41m14J74J06j50j58J89j28P0k2J62l03K85R8
6597A48Nj01k63NL89j0k46K06m2oj99j03K58p8RJ83j83J74l31K58j06J72o7j86
$$ plain form
6430 23 162 114 -38 76 -46 71 207 -320 25 95 129 10 33 82 113 -128 109 89 -73 -69 20 161 -3 58
6454 58 106 -205 -25 -329 236 -81 -87 -174 32 -3 -58 57 -182 61 100 217 83 -61 42 -114 -40 132 -52
6477 -52 -105 95 -117 -110 -61 -27 146 -181 115 -4 -63 -172 83 -9 172 -53 61 -5 -143 -147 -40 -17 260 -140
6501 -140 -54 -54 -57 -103 198 -222 3 89 -166 165 -155 -121 -166 -127 55 140 58 -259 17 -7 162 -126 160 -94
6525 -94 60 142 82 133 48 -23 -84 4 5 220 179 -6 78 32 84 -31 0 67 154 -1 -215 98 52 -175 56 -176
6551 -176 52 31 19 -210 77 80 -55 25 54 -335 16 179 50 29 -122 100 84 -76 5 -2 188 -136 207 -81
6575 -81 44 -30 137 -202 123 158 61 -102 239 -175 -1 105 -45 -203 -14 -142 -72 -94 68 -235 50 148
6597 148 153 52 -211 -206 183 173 -73 133 91 85 -114 -217 41 -37 -28 155 -28 146 -185 73 -33 139 72 -114
6621a14j14N4N7J07j65L63j85m3j58K93M6j39K34j67L3r9n1J74j08j00J47p0j3
6644a8O9lN2j86Q8j20j34K0P2K5k9R9J68j93l6J93l13K32Rj01K73J29p0k89k09
6669b72K74J95m91J15L3M1J18Lp3K08j37K92k33k9r1j07L22k9k45K67r7k42K2
6692a56O5K06r6j87L44o2k05JP8N9O5k06K0J8R4J14m28NK82j24j66K09R3P4j94
6717i7J75j66J58o1j96J06J96j4j94J28j19m2JR4j0j02R2K25k49P8K12j76q3N4
6741A0k10K83k49j5J29O3n9O5j1P6K14m12N8pR0j03K75l39L41j35J31p3MR0k02
6766A4j31j14K04J95k28Q1mk03R8l5J93k3K29l79O5M0J49m06K56R5j18J10l6r0
6790c8j02L29J66l93M1M6R6l0m2m0j94NN7K73j69M7p9j58J22N2K20k11q6j12m8
$$ plain form
6621 -114 -228 -174 -117 -10 -175 188 3 -40 -198 95 141 2 236 69 102 3 -48 126 18 -82 65 -5 -18
6644 -18 51 48 100 -86 2 -118 -252 -232 -160 -135 -164 -65 103 -90 -126 67 -246 -14 -5 -106 167 296 226 -63 -272
6669 -272 2 197 -294 -179 -146 -105 13 16 -57 151 14 306 73 44 -47 -154 168 139 -106 161 64 -178 -156
6692 -156 -91 115 19 -168 176 114 -91 -90 -12 47 112 -94 -74 -56 38 152 -276 -271 11 -113 -279 -70 23 97 -97
6717 -97 78 -88 70 9 -187 -81 115 101 -93 35 -84 -126 -125 -31 -41 -143 -51 174 -75 3 215 39 -44 10
6741 10 -200 83 -166 -181 -52 11 -48 17 6 82 296 -116 -58 -65 25 -78 197 -142 199 64 195 122 126 216 14
6766 14 -117 -231 -27 168 -60 21 17 -186 -88 -123 70 47 276 -103 -38 2 151 -255 1 96 -22 88 52 -38
6790 -38 -140 189 355 -38 3 49 145 115 73 33 -161 -156 -99 174 5 52 -27 -185 -63 -11 209 -2 -88 -200 -248
6815b48L65p5j51J26N7n2O9p8K48l61PJ48j28N1j86J79J70N0n08L33J28N3k35
6838c8K20m12L46l68M06j75k6J71j51o9J69nK4j92J40Rj62K24j40J63r4mm4j62
6862a70Q3QR1M6j74J28M2J94k52L6L0j96nko1K40J97j58j35j2r7J26O2p2Q5j77
6888a43K82l69L50o7q1K01j24m2r9J28j16R1R6j8j2j04r8J40M0O2k2j92j9L5l0
6913a11J9k7NJ31J92k63K25k03L3P3r6J25j1j31k7P7N5J46jl36q8P5J6K65m30
6938b87L47l40J06J55K18l45L19j85j54K04o9J97j2n7k9o5J46j11Q3Jj53k2l3
6961h6L16j33k14K58J25m27K34J21l34K13l27K32j95K50j48K17j62J04j39j07
6981b02L14j75P5qj0ML1l6N9K20M1j32l95J37P7m7K78j23j12P1j39Q5o6Q9J2O5
$$ plain form
6815 -248 117 42 -109 17 74 22 91 13 261 -100 -93 55 -73 -22 -208 -29 141 191 -317 16 144 197 -38
6838 -38 182 -230 116 -252 154 -21 -47 124 -27 -96 73 68 92 -100 40 49 -113 111 -29 134 40 36 -8 -170
6862 -170 -87 -79 12 58 -116 12 54 248 -4 32 62 -134 -139 -141 -202 38 235 77 -58 -70 -167 -41 21 -51 34 -143
6888 -143 139 -230 120 53 -28 173 49 7 -92 36 -80 11 107 89 77 -27 -125 15 55 117 95 -97 -116 -81 -111
6913 -111 -92 -119 -114 17 209 -54 171 -32 1 74 -22 103 92 -39 -66 11 66 212 211 -125 -213 -138 -122 143 -287
6938 -287 60 -280 -174 -19 199 -146 173 -12 -166 38 -31 166 154 97 68 3 149 38 121 122 -31 -53 -86
6961 -86 230 97 -117 141 266 -161 73 194 -140 73 -254 -22 -217 33 -115 102 -60 44 -95 -202
6981 -202 112 -63 12 4 -6 -2 29 -7 52 272 313 181 -214 -77 0 -47 231 108 -4 67 -72 13 -53 36 48 113
7007A13l27L01q5mJ57q5j47K7k1J09J81k58M5O4j09k3O6J02k32K44j89K22k28
7030g7j5mJ93K2l8j73O8J64n85K59J47j48L25R4l41K26k37K91j19j00J18j29P8
7053A9j11J68j24K7m9P4n2k51J67K32r3q0j0k10K42J00r1m6K57k06r7L18l54K20
7077E0j0qo3j11J96R4J4k13j03P3KR9O5n3N2k4p4K38j53j83K81l34J67K8j13R5
7103A2lk49M50m00K28l29L28J05q1J13J4M5j78n0J9qJ35J2l36O5J59j80K5m8K14
7128F2j14o0R1k2Kj26K03L1j13P6K0j57J05J05j93M5J17L5j84r4N8L60k95Q0m6
7153a4j38K32O2l0p5J18j62l8K26m0j64J92r7L0j19J78l90M20l16n9L01k52K94
7176A59l07K47m6L8k80J18J07p0o1K61k28j17J85j1J67j37M9J58l31L79k93o5
$$ plain form
7007 113 -214 87 2 -2 155 70 -77 -50 -71 38 219 -39 6 70 -39 -62 4 106 -126 118 -71 151 -77
7030 -77 -92 -96 97 119 81 -92 -24 140 -445 -186 -39 -187 138 232 -109 117 -120 171 52 -48 70 -59 19
7053 19 -92 76 -48 -21 -70 4 -48 -299 -132 100 7 -73 -83 -293 -51 49 -42 -88 169 -37 -134 184 -170 50
7077 50 40 32 -31 -142 54 148 162 -51 -154 -81 -79 20 85 32 84 60 -14 224 71 -112 169 -165 2 30 -83 12
7103 12 9 -240 210 -190 38 -291 37 142 61 174 188 233 55 5 24 16 151 163 -173 -108 51 -129 -104 -152 62
7128 62 -52 -112 -21 -43 -41 -167 36 67 -46 30 50 -107 -2 103 -90 -45 72 107 -77 -171 -113 247 -48 32 -14
7153 -14 -152 80 142 112 37 155 -7 -45 181 141 -23 169 72 102 -17 161 -229 191 -125 -184 117 -135 159
7176 159 -148 99 53 91 -189 -71 36 -34 -95 166 -62 -179 6 -5 162 25 74 232 -99 280 -13 -78
7198g8J25J14j34J20j49j29J48P7P7l55K17k51L36q4K24k62K1j96K10k3M1j41
7220i2q0m8J43J92j63K35l41J81J1J27k27l2J09j71Q3j29J85M21m83j3J25j00
7242f7R0O7j72M8j09L51m3k50J86k0Kj6J21j78J3q0L10m51M20j19Oj83k3R3J47
7267A43k67K04j1j10n4L64j12k74j25L79l05K34l9P0k03J40j39J67R8k05K62l77
7289a60O3J61j07j64K29k40K94r2p6n2K92k36J34J69r0O0j23P2n9n9Pr1pR2k51
7314b34L50O8Kl51R6J71j08p4J42j77K09k47J37j51K39m6O8j29n8J02P4Q7p6R7
7338A91j43m1J22k35N5J81j67K17j60j86J81j32N0R3l07L13J32k97K16j82J87
7359H8k60P7p4J90M1k33O1O5p3K15N8J6l23o1K88o7J18j21o4j14K28m6j5k0o2
$$ plain form
7198 -78 47 161 27 147 -2 -131 17 94 171 -184 33 -218 118 34 258 -4 17 -179 31 8 49 -92
7220 -92 -172 -220 -77 115 -48 187 -154 27 38 165 -62 -94 15 -156 -73 -202 -17 404 -79 -92 33 -67
7242 -67 23 90 -82 -34 -143 208 165 -85 101 81 83 67 188 10 23 -57 253 -198 222 103 109 -74 -97 -4 143
7267 143 -124 80 69 -41 -95 269 157 -117 -242 137 -168 66 27 97 -106 34 -105 62 160 -45 217 -160
7289 -160 -97 64 -43 -207 22 -218 76 -16 -92 -144 148 -88 46 215 125 185 62 134 75 16 23 -68 -75 17 -234
7314 -234 116 184 186 -165 -69 102 -6 -80 62 -115 94 -153 -16 -167 72 26 94 -35 -93 9 83 170 94 191
7338 191 48 7 129 -106 -51 130 -37 180 20 -166 15 -117 -67 26 -281 32 164 -133 83 -99 88
7359 88 -172 -95 -169 21 62 -171 -110 -45 -118 97 155 171 -152 -213 75 8 126 5 -59 -173 55 9 -6 -26 -88
7384h8jJ69J46k00j98K97k43r0J46Q6o8r0J72J13k21K73j76q2k2pj2K2N1m0K36
7409A73j49P7J16k12K18k18j14j7m0J43j60J83jK6q1J27k01q5J34K43l07L7J12
7432DJ39l53j29L76p1J38j09r9J18J23P2o4j37Jq1K26l35L55K6k27k28O0R8Q1
7456a6J55l32J55J0K2n1K9M6jJ02oj43J16p4J08J1l34OJ9K81j63N0O0J51j33L
7482G1L5j83J42j16k37J94j25J3L69k26J60N9j30P1k13J27J14j38j56l0J82j85
7504b02L07j13K27j42m4o4n4L30j75q9L0q6J33q7O9n5L4o3J70j82J6J04j12N0
7528BK03k73R8P9r7K0j75P9j33o5K50j15J82l9j03Q0o5J36j25j26L39j05j12J3
7552e2k1L29k13q4J84q1j86K50j31r3J73j91l7J23K44k14k65M98k98J37j73n4
$$ plain form
7384 -88 -89 80 226 26 -172 125 -118 -208 -62 24 -44 -134 38 151 -70 203 27 -55 -77 -84 -96 -74 -23 -63 173
7409 173 24 101 217 5 223 5 -109 -126 -166 -23 -183 0 -1 25 -56 71 -130 -215 -81 162 -145 -108 4
7432 4 143 -210 -339 37 -34 104 -5 -104 14 137 209 145 8 9 -72 154 -181 174 200 -27 -255 -195 -97 -16
7456 -16 139 -193 -38 -28 -6 -57 -28 18 17 119 113 -30 86 12 120 131 -203 -197 -178 103 -60 -10 50 201 68 71
7482 71 106 -77 65 -51 -288 -94 -219 -206 163 -63 97 156 26 97 -116 11 125 -13 -169 -199 -17 -202
7504 -202 105 -8 219 77 33 -31 -85 245 70 -19 11 -75 58 -29 40 -15 19 -44 126 -56 -40 64 -48 2
7528 2 205 -68 30 109 12 32 -143 -64 -197 -262 -12 -127 55 16 -87 -7 -72 64 -61 -187 152 47 -65 -52
7552 -52 -73 256 43 -41 143 62 -124 126 -5 -98 75 -116 -153 -30 214 0 -265 233 -65 72 -101 -155
7574a55o2J63k0j3j07j2J14K18J12j14j80M2Q1m25M95k61P8pj82L42k34J87L0
7597I0k8r2N5M7M5k39P0J82j39j72L4j42J97j26J88M1K28P8l46R5k8K10m01r2
7621b45J84Q7M9k33J02J73k78P8J48Q8M0j61Nj55J9L7J02Q7K19m19J10J4K24l26
7645e1o5J96K3j48rJ1k11L65K1O0l12J52n5J69j61J19j26K54k54l01K78K72o2
7668A65k79J3L31m24O9R7J11O2k38k5O4J56n9n9J3J68P6k66J81l73K20J03j53
7691d7R6o7J4L0k13J88O1J73k68kK2N2o4K56l40N1lK7n2N8j18O4O0k44K39K31
7717B04l09M1M0j30J29J02j81K48j54K79l12J0o1k78N26r0j12K3Q6k17K46l4k1
7740C5J20l66J56J19j65J47k74J08J00j50J39K1l3R7p7o2O3PK92k98o1p0J72K41
$$ plain form
7574 -155 -217 -54 -74 -87 -194 -206 -92 126 238 124 -56 -14 67 -358 137 -124 -46 -53 -235 107 -127 60 90
7597 90 62 -30 25 72 117 -122 -52 130 -9 -181 -147 -289 -92 -218 -30 11 239 317 -29 66 38 248 -153 -245
7621 -245 -61 26 75 -158 -56 117 -161 -83 65 153 193 32 37 -118 -99 -62 40 127 346 -73 37 51 275 -51
7645 -51 -116 80 103 -45 -54 -43 -254 111 132 192 -120 32 -23 146 -15 104 -22 232 -22 -323 -45 227 165
7668 165 -114 -101 230 -194 -125 -28 83 145 -93 -118 -54 102 43 -16 -3 165 241 -25 156 -217 3 106 -47
7691 -47 49 -18 -4 26 -187 1 62 235 -33 -35 -13 39 -25 231 -109 -58 -61 -34 -86 -28 -146 -82 -22 -266 -27 204
7717 204 -105 -64 -24 -154 -25 77 -104 144 -10 269 -43 -33 -94 -372 154 64 -48 -25 61 -156 90 56 35
7740 35 155 -211 -55 64 -101 46 -228 -120 -20 -170 -31 -10 -43 54 -23 -85 -22 -15 277 -21 -82 -152 20 261
7764B61k21L2O0j82m1J50J23l0j86j27J24j18K00n4J47On2R6l79K77J35j66j49
7787i4j48L68m9QJ48l22k9K7L84k49q1p4K81k48m3J54k07K87k39J02O6kJ84k53
7811b9L79k62j07j56K45J81j93k69J68J8N8L8l32K66Mp5jm9J56j42j9K07Q8l07
7835a33K14j55j43K08k20M44l02k4j9l9m4K60N1j60J13Mj80L7J84N9k5j75J32
7858H7j63J56j84O4J50K34m49K43P8k35L0L7j85L14k77M75k70k78K62j23POl5
7881e6J18j39k2L4n9K05p1J30j46K2J15j20RJ67j12l7j63O2R8r9J6r2K52R4k99
7906i3K18k03j5j3Rj05K24j12K29k01K0j00K29q3J57j90k3K31j53j9r1K15k65
7929a34j14K73k5p1J04l0M3K3L7n0K9L0k42j3q2R6J60J1n6K9K10j37J25k07n6
$$ plain form
7764 261 40 72 132 -50 -91 59 182 152 -34 -161 -37 -155 45 -9 138 144 92 188 -191 86 221 55 -94
7787 -94 -242 126 77 85 233 -89 -118 -91 293 44 -37 -111 170 -78 -121 33 -174 113 -126 -24 42 40 224 -29
7811 -29 350 88 -19 -175 70 251 58 -211 -43 -25 33 71 -261 5 9 -66 -67 -116 40 -102 -121 86 174 -133
7835 -133 81 -74 -217 -9 -229 215 -87 -111 -130 -169 -213 47 98 -62 51 55 -125 -88 96 155 130 -45 87
7858 87 -76 80 -104 -40 110 344 -105 138 216 -19 11 48 -137 177 -100 375 105 -173 89 -34 -27 -21 -56
7881 -56 62 -77 -99 -65 -124 81 10 140 -6 16 131 11 20 187 75 38 -125 -63 35 -64 -48 -140 112 206 -93
7906 -93 125 -78 -93 -106 -97 -202 22 -90 139 -62 -42 -142 87 4 161 -29 -52 179 26 7 -84 131 -134
7929 -134 -248 25 0 -71 33 3 46 69 106 56 85 115 -127 -140 -222 -126 34 45 -11 18 228 91 216 9 -47
7954d7R4r7L02m47J56n8J17j82N9J48j38k2K51k60J95m7o8J63o9j1k13K41j37
7977g0M3j5r1P5J10J19l38n7L00J12j39P8o3k55L03p6j83L19k55L84l35M5L3j3
8001C1j9J64m2k01J7j40Q9J31M4j13P2J2J39J27m56J7J15M0j79L27j39j31J43
8024D8o0j59J45j04J28l9O6j0k4q1J25J23j21J3M7k67N9k2j33M08n0n2L4J8J03
8049A95l51K20p3m2j07Nj8j09L11P2n1j90K44l2r5Mk18J77L2o2L25k88Q0M8k49
8074a72j3K49J93j53N4k09K41j5j64j2K1o4J29o0o6m2J9jJ24n2n7J32Oj42m4L0
8100f8oJ11j52K61k44K79k97j1L13l72L42Lj07j36K86j56j9L07m54m9K18J9j31
8123f3K27j98J1J96l12J34m4j11J07K0J16o3P4K9k33NJ3K86j83J66l56K06P9k47
$$ plain form
7954 -47 47 -50 252 -195 -39 -97 20 -162 -103 45 -93 -115 136 -124 71 24 -44 119 50 39 -174 67 -70
7977 -70 -27 -42 -133 -58 52 171 -167 -224 76 188 49 127 64 -191 112 36 -147 172 -83 301 -34 11 44 31
8001 31 12 176 134 -67 -50 -190 -101 30 74 -39 33 45 184 311 -145 -128 -13 27 -152 175 36 -95 48
8024 48 -12 -171 -26 -130 -2 -41 25 15 -9 -90 35 158 37 50 97 -170 -111 -133 -266 142 92 40 74 92 195
8049 195 -156 64 -9 -51 -158 -153 -171 -280 31 103 52 -138 106 74 -21 -17 -235 -58 -26 -88 237 -51 29 77 -172
8074 -172 -185 64 257 104 158 -51 190 175 11 -1 20 -44 85 25 -41 -83 -64 -65 59 7 -50 82 88 -54 -98 -68
8100 -68 -74 37 -115 146 -98 181 -116 -127 186 -186 156 159 52 -84 202 46 27 334 -120 -169 49 68 -63
8123 -63 164 -34 -23 173 -139 -5 -49 -160 -53 -33 83 20 94 123 -110 -105 -92 194 11 177 -179 27 106 -141
8147a41J9l9j11J38Q0Q0NJ43k12J03l52L01K08k51j81M55p8j02r4O2N6q9k6Kq8
8172a12J30L8l30K73K43k26j70K90k98J70P4N9j37K2l04K59N8n0J39
$$ plain form
8147 -141 -122 -161 -272 -134 -54 26 31 174 -38 65 -287 14 222 -29 -210 245 167 65 -29 33 89 0 -26 -24 -112
8172 -112 18 56 -274 -1 242 16 -154 136 -162 8 82 141 4 26 -278 -19 39 -11 128
8191A28
$$ Imaginary data points
##PAGE= N=2
##DATA TABLE= (X++(I..I)), XYDATA
0@%%%%%%%%%%%%Qj6J6j6J7k5L2m0M8n6P2q1Q9j05J29j52J74j98K24k57K96l36
34a77L77m26M81n40O04o75P52q36R28j029J139j259J391j535J691j863K052k261
52a186K492k747L034l354L717m134M612n174N843o651P656q942J0656j3069J6735
67I488k3053L6926j24354O4100J15017j98480R6138P5939j51909K157J42019p8583
79c4595k1452P5036m7887l0176O8702m3833j5919P4014o701k7332L1360l9375
91a8158j3461N2370k1095j3453M8057n1237k5279R1638j6183p5181N6337R865
103B4220n6948N2274K2290p4506J4520K5415l7257M2667L2288o8694J2724M4499
115C3492o2491m016O0503l6682j3751N4223l6161m0375M2422k779p290N0794k4105
$$ plain form
0 0 0 0 0 0 0 0 0 0 0 0 0 0 8 -8 8 -8 9 -16 16 -24 24 -32 40 -41 48 -57 72 -80 94 -104 120 -137 159 -177
34 -177 200 -226 255 -285 319 -356 396 -440 488 -541 598 -661 730 -805 886 -977 1075 -1186
52 -1186 1306 -1441 1593 -1761 1956 -2178 2434 -2740 3103 -3548 4108 -4834 5822 -7247 9488
67 9488 -13565 23361 -100993 -36893 78124 -120356 -24218 51721 -100188 -98031 43988 -34595
79 -34595 -56047 18989 -28898 -59074 9628 -34205 -50124 23890 17189 -10143 21217 -18158
91 -18158 -31619 20751 -344 -13797 34260 -16977 -42256 49382 33199 -41982 14355 24220
103 24220 -32728 19546 41836 -32670 -18150 7265 -29992 12675 44963 -23731 -11007 33492
115 33492 -28999 -33015 27488 -9194 -22945 31278 -4883 -45258 -2836 -5615 -12905 37889 13784
128A3784n6715K8360R513k1565L9425R184m2209J1375J3719k0022J9168R207k6270
141a3046J9641J2356l6692Q657K2864k4103J0790K7126l1032j0698K4976j4713
153c874m538K2144k3647j5719L1372m584j8845J7545q868k1721K2800R366j6335
166a4904O016m393j5442J7200O553j4225J5929O177k2953R983J2971k0251R158
179h181K3408j5781n871J3737j3185j105K4873n021j1084J0425p705q510J7468
192A3468J890j0412P554j959j0239J1231J832j0056R956P34j5330Q430P607j3629
206A077M844J0575j3950k633J1608p231m228J0148m892o814O025l274m221P258
220D292j353m686L753m663m071P878j192m959N644k421o840R386K512j0435M351
$$ plain form
128 13784 -42931 -14571 -5058 -26623 12802 21986 -20223 -8848 4871 -15151 4017 13224 -13046
141 -13046 6595 18951 -17741 -9084 13780 -10323 467 27593 -3439 -14137 10839 -3874
153 -3874 -8412 13732 -9915 -25634 5738 1154 -17691 -146 -9014 -30735 -7935 1431 -14904
166 -14904 -8888 -13281 -28723 -11523 -4970 -19195 -3266 2911 -20042 -10059 2912 -17339 -8181
179 -8181 15227 -554 -6425 7312 -5873 -6978 17895 12874 1790 12215 4510 -4000 13468
192 13468 15358 4946 12500 10541 302 11533 13365 3309 13265 13999 -1331 7099 14706 1077
206 1077 5921 16496 2546 -87 11521 4290 62 10210 5318 -1496 4529 1255 -2966 4292
220 4292 2939 -1747 2006 -2657 -6728 1150 -42 -5001 643 -1778 -8618 768 3280 -7155 -2804
235b804N578p146M703P119r774k622Q180j588O01N310n563l023N435k754j649
250CM215l533l78P426n552q459M718j70j788R732j162j3792J106N796l831M657
266a012N404q507k122O780k514l351L209r3K519N623l545n912l84N27N495P197
282I314m523o522J597o82j110O697j842o215N714M674p464k717J195k758N640
297I98Q712m737q262j227J316L996N732j266m322p7L98L95P34l285J64P419K252
314H940n115l164m297j543Q591O498n547o089p74q10J476M148j111l521J963L312
330B957k336m887k448K555M893M240k75o355o583K971P320J604j589r07l155j177
346c172L671o19m876K226N537Q30k341l616n202k85P114N007k344n105k859Q41
$$ plain form
235 -2804 2774 -4372 331 7450 -2324 -4946 3234 1646 2247 7557 1994 -1029 4406 1652 3
250 3 4218 685 307 7733 2181 -6278 -1560 -1730 -3518 6214 5052 -8740 -7634 -1838 -5669 -1012
266 -1012 4392 -4115 -6237 543 -1971 -5322 -2113 -2206 313 5936 2391 -3521 -3905 -3378 2117 9314
282 9314 4791 -1731 -134 -816 -1926 4771 2929 -3286 2428 7102 -362 -3079 -1884 -4642 998
297 998 9710 4973 -3289 -4516 -3200 796 6528 5262 940 863 1261 1656 2390 -895 -731 6688 8940
314 8940 3825 661 -3636 -5179 3412 9910 4363 -1726 -2500 -3310 -1834 2314 1203 -2318 -355 2957
330 2957 621 -4266 -6714 -4159 734 4974 4699 -1656 -8239 -5268 2052 3656 2067 1160 -1995 -3172
346 -3172 499 -120 -4996 -2770 2767 3597 1256 -2360 -7562 -7847 -733 4274 1930 -3175 -6034 -5193
362e193L548K006M0j382M25J925P50m220l375L504N359J992P0m041o109J115O446
379B860J885k391j816k177j040J731O65k803l30L124K333j973m437k501Q67L004
395b999M194P17m921k935L417K377j20J986k52j811K391K507m015k211L524L103
411D952J511J166k762n104Q40L947J859j027j792j273J55r8N85p9j371J057J911
428D477j826l671o28N99J085K867K4m223j575J594P70j06o9j615r01K57N52m49
446b838j534q88K274J259k033p69L86k126R10L571j385j800K526P64j577J931
462a329J283j809J715K695r47j333J140N8R32J855M06m40j205j007J608N9j161
479B520O45Q3k807N9K015j645j029J529j272k361J065O05j761J120O24j328K64
$$ plain form
362 -5193 -1645 361 401 -981 -556 1369 2119 -2101 -5476 -1972 3387 5379 5449 1408 -4701 -3586 2860
379 2860 4745 2354 538 -1639 -2679 -948 -283 -3086 -3416 -292 2041 68 -4369 -6870 -6003 -2999
395 -2999 1195 1912 -3009 -5944 -2527 -150 -270 1716 1464 -347 2044 4551 536 -1675 1849 4952
411 4952 6463 7629 4867 -237 603 4550 6409 5382 3590 2317 2472 2374 2959 2880 1509 2566 4477
428 4477 2651 -1020 -1648 -1049 36 2903 2927 -1296 -2871 -1277 -507 -613 -682 -2297 -3198 -2941 -2389 -2838
446 -2838 -4372 -5260 -2986 -1727 -3760 -4529 -4143 -6269 -5359 -1788 -3173 -4973 -2447 -1683 -3260 -1329
462 -1329 -46 -1855 -140 2555 1608 275 1415 1473 2405 4260 4666 4226 3021 2014 3622 3681 2520
479 2520 3165 3248 441 500 2515 870 -159 1370 98 -2263 -1198 -593 -2354 -1234 -610 -1938 -1674
496a674N26J92O62M47J09L63q09j67K070P66m08J233Q7k271J165K748j307n57
514C175Q17j120p86J811J01j303J96L99K01l19j016r40kQ20O65J5j840j093J337
533A118r7j090Q61j178j886J697J169l250j609J530o0K34J204j258l463O79K392
550c007j92K06Jr21L43J503j52k39P71J287J731Q63j627j131J435K093K086J545
568F595j929k984K486J730j315J178K90k956J032K264k997k618K265J2p1J165
584D147k683l551J322R59L41J017j989k525K019O21j566J285m29j997L686J437
600B094m968M30K365j647K257L660m948k514L846J42j004K406j656k128L505L68
616B208k502N29o78m80L904M35l894M0M70r28L528J572m399L61J880k123K31J753
$$ plain form
496 -1674 -1148 -956 -294 153 262 625 -184 -351 1719 2485 2077 3310 3397 1126 2291 5039 3732 3175
514 3175 3992 2872 2086 3897 3998 2695 2891 3290 3491 3172 2156 1216 1214 2034 2699 2714 874 -219 1118
533 1118 1021 -69 792 -386 -2272 -575 594 -2656 -4265 -2735 -2795 -2561 -1357 -2615 -6078 -5399 -3007
550 -3007 -3199 -2993 -2992 -3913 -3570 -2067 -2219 -2458 -1687 -400 1331 2194 567 -564 871 2964 5050 6595
568 6595 4666 1682 4168 5898 4583 5761 6051 3095 4127 6391 3394 776 3041 3053 2982 4147
584 4147 1464 -2087 -765 194 535 1552 -437 -2962 -943 -322 -1888 -603 -1032 -3029 657 2094
600 2094 -2874 -2444 -79 -1726 531 4191 -757 -3271 575 717 -287 2119 463 -1665 1840 2208
616 2208 -294 235 -443 -923 2981 3416 -478 -438 32 -896 2632 4204 -195 166 2046 -77 154 1907
634A907k656J17K938j522k422k46q58Q16K373q99k089j141j276J817K610k000
650b531j292J870j023l04K539j126k251L600J699k283J126L13j780K706K497j508
666B252o66P14n93J280P32j904J54N17n24J768o56l784P76K005j422P28P80l533
684a376p07K731r99j055J820j232r97K024q05j904J639J18J90J790j977k252K328
701f64M72q16K470j107l259J929J514k253J403J173l130Q75K536k307n97J855
717I4q79K1J862j331p89K019o18L8J515j775j55K174o63j357J941j134j757K558
735A764P21l082R73R10k799J280J387k409J0J348j711l5J311j221%J689j669M6
753a487J504j252JK399j308r84K152k94j255K211J76j980J076P46j608R54J035
$$ plain form
634 1907 -749 -632 2306 784 -1638 -1884 -2742 -1926 447 -452 -2541 -3682 -4958 -3141 -531 -2531
650 -2531 -3823 -1953 -2976 -3280 -741 -1867 -4118 -518 1181 -1102 24 337 -1443 1263 3760 2252
666 2252 1586 2300 1707 2987 3719 1815 1969 2486 1962 3730 3074 -710 66 2071 649 1377 2157 -1376
684 -1376 -2083 648 -351 -1406 414 -818 -1815 209 -596 -2500 -861 -743 -553 1237 -740 -2992 -664
701 -664 -192 -1008 1462 355 -2904 -975 539 -1714 -311 862 -2268 -1393 1143 -1164 -1761 94
717 94 -785 -764 1098 -233 -1022 997 379 417 1932 157 2 2176 1513 156 2097 963 -794 1764
735 1764 2485 -597 376 1286 -1513 -233 1154 -1255 -1245 103 -1608 -1643 -332 -1553 -1553 136 -1533 -1487
753 -1487 17 -1235 -1234 1165 -143 -1127 1025 731 -524 1687 1863 -117 959 1705 97 1051 2086
770B086j553j31P87j168J48Q11j150J02M60j288M76O52r20l8J350j057l26J696
788I37p28j321K096K60j664J413O23j730P56J724j716o62J051q08l1O94o40o91
806d37K7L1L41M5j246J87M40k22j31Q03j257l92J470q0o78O84M05o15N37P44j122
827d66N2J120j64L92k36q90o2N57J10L04l71r80N26M39n42R0No57J63J209m22
848A77j221O38P46%M37j73o92J22N64O33k33n80j60L18P4o5J68j090j90J118J16
869G07j521K03q2m79M86N50p35j214J029K87l07N48m81K8N63O74J29o66J55O51
889E25R18O6j95l68N4K38Q99q4m96l84K54r3j56k49p12J31M82j08p31l70l68O64
911h3j22O3q8q26k03P86M76o00l04K26p8P14M86o26o06P49M72J0j76j78m43R7
$$ plain form
770 2086 533 402 1189 21 169 980 -170 -68 392 -896 -420 232 -688 -726 624 -433 -759 937
788 937 209 -1112 984 1244 -420 993 1616 -114 642 2366 650 -12 1039 231 200 894 254 -437
806 -437 -410 -379 -38 7 -1239 -1052 -612 -834 -965 -162 -1419 -1811 -341 -421 -1099 -415 -10 -625 -88 656 -466
827 -466 -414 706 542 934 698 -192 -254 303 413 717 346 -634 -108 331 -211 -121 -116 -773 -610 599 177
848 177 -1044 -406 340 340 777 604 -88 34 598 1231 998 418 258 576 650 585 753 -337 -527 591 707
869 707 -814 -611 -693 -1172 -686 -136 -871 -2085 -1056 -769 -1076 -528 -1009 -981 -418 256 385 -281 -126 525
889 525 1443 1509 1314 946 1000 1238 2137 2053 1557 1173 1427 1334 1178 929 217 348 830 722 -9 -379 -747 -83
911 -83 -205 -142 -230 -1056 -1259 -473 3 -597 -901 -675 -753 -39 447 -179 -785 -36 436 446 270 92 -351 -254
933b54P71j6m46k69P68l9o64N19j49k60P35P83o35n15M69K91J81M59j50n24L11
954A366M78j05P0j85m21K57k69M1p3p08j27M17l27n74l63r7m1k6L3n62k97L00
976a213N48l08k78J95j85N41R19ql30K58M04L09K3M45m3l26R2N25m7m77O58Q1
998A783o61j3m7o71K06N14l24q73j86M38k74J04R4k43o44J07O02k66L49k81l23
1019f09m3Q8L39q3j18J9K48k97k8K06l70J03M50l67o12N31K67k46j56J77j92k8
1041g21M08M09j03J9M09j46m6M37N08j80k34Q1K77n00M60M39r21l66M62m74l56
1062a38K49M5p70l46q7j44l68M80l01k60m2m7j5p7M91L32l44l84N72M29j7O18
1084a24Lk94L0M10N25o08N68k56j85K2M77k1j85O8k03l69k91k6K40P5m9J1j33
$$ plain form
933 -254 517 501 55 -214 554 515 -149 370 221 -39 696 1479 844 329 798 1089 1270 1729 1579 1055 1366
954 1366 1844 1739 1809 1624 1203 1460 1191 1232 1159 451 324 741 414 -160 -523 -620 -661 -687 -654 -1216 -1513 -1213
976 -1213 -665 -973 -1251 -1056 -1241 -700 219 211 -119 139 543 852 875 1320 1277 951 1043 1568 1521 1044 1702 1783
998 1783 1122 1109 1062 391 597 1111 787 -86 -272 166 -108 -4 90 -153 -797 -690 -88 -354 -5 -286 -609
1019 -609 -652 -564 -225 -308 -426 -407 -159 -456 -484 -278 -648 -545 -95 -462 -1074 -543 -276 -522 -678 -501 -693 -721
1041 -721 -313 96 -7 12 421 275 229 666 1174 994 760 841 1118 618 1078 1517 596 230 692 218 -138
1062 -138 111 156 -614 -960 -1047 -1191 -1559 -1079 -1380 -1640 -1682 -1729 -1744 -1821 -1330 -998 -1342 -1726 -1154 -725 -742 -124
1084 -124 -121 -415 -385 25 550 -58 510 254 69 91 568 547 362 430 227 -142 -433 -459 -219 -144 -193 -182 -315
1107c15o69R16K88n09q1J34m87N9Q99k57k11m8Jj75M25j09k64k44R6J00o7l04
1129h22L14J22n11l82K51J34K4O62l33o40M28K1M1Q67M7k15j06M47M1K41M10j95
1151H46j07K5k31J87R4j11R5j07n47l73L17m51K13M59n19q94K72L29n50M68J40
1172d45j044N00M79O4m2L7J80p8M25k4J22Q5m28O45J42p11K27O90l77j89L27m50
1194A35m87O56R4m78N5j67m70N00K65j88l5k41K89j19L90m6r6L04l83M91mj33
1216C32J50L30k21l58J07n21J62O44m31l90M1l24p9M34q6o21J91K9O3PK26k41
1238e56P0K18j05O30l38j52M41K85o9k93O37jn63M94n3k90l0P7k8k09J8m01m2
1261b60OJ03j36k8l22M4k7K15N6k29K79L6K17P2J26J58j06k9K91k72K28L0j46
$$ plain form
1107 -315 -984 -68 220 -289 -370 -236 -723 -664 235 -22 -233 -281 -280 -455 -30 -139 -403 -647 -551 -451 -518 -822
1129 -822 -508 -386 -897 -1279 -1028 -894 -870 -208 -541 -1181 -753 -732 -691 176 223 8 -98 349 390 631 1041 846
1151 846 739 764 533 720 814 703 798 691 144 -229 88 -363 -150 309 -210 -1104 -832 -503 -1053 -585 -445
1172 -445 -1489 -989 -510 -446 -488 -451 -271 -349 76 52 174 259 -169 476 618 -93 134 824 447 258 585 135
1194 135 -352 304 398 -80 -25 -192 -662 -162 103 -85 -120 -361 -72 -191 199 153 57 361 -22 469 465 332
1216 332 482 812 591 233 340 -181 -19 625 194 -196 -155 -479 -558 -124 -210 -831 -640 -611 -548 -541 -315 -556
1238 -556 -486 -268 -373 257 -81 -233 208 493 424 131 768 767 204 698 645 355 325 402 374 165 183 -218 -260
1261 -260 -254 -151 -287 -315 -637 -593 -620 -405 -349 -578 -299 -263 -46 26 152 310 204 175 466 194 422 452 306
1284C06J46k39K09k84o8o4k7k56k3R3L13n17J58j61j66K00k40M21j68lJ09q2O2
1307b81J45L61J95k01K43p3j11J64Q8l49p1N18k03k66J19j22k06J14k16j36J63
1328a25r8q4j11L27j32m1n4jn4K87p0J24K85j94K04J11m25L96j13j36j6K9L03
1351D12m49K10k63o1l17K98k09j20J25l4m5L7J09k75J66J3K96K64l14K48QJ15
1373B14J56K33R0l34P9J54j59J33lj17k10P7J02l11l21M94n37j0o7k99p8K14J27
1396c73k55q8J37j71L01k04N73j25m6K57R0k43J12L04j68J85K5K03L1l34J35M4
1418C90l14J19k28L7J45k49j80J64o6j88J51J22P9k55K42j5k4L06k95L72o5j64
1440H4l3J04K11j55K75l92k80M89l39l5j6j29k20j29M44n72J07m0o2J77l61L18
$$ plain form
1284 306 452 213 422 138 70 6 -21 -277 -300 -207 106 -411 -253 -414 -580 -380 -620 -199 -367 -370 -261 -343 -281
1307 -281 -136 225 420 219 462 389 278 442 530 181 110 628 425 159 278 156 -50 64 -152 -288 -125
1328 -125 -223 -307 -418 -91 -223 -264 -318 -319 -373 -86 -156 -32 253 59 263 374 -51 345 232 96 80 109 412
1351 412 -37 173 -90 -151 -468 -170 -379 -499 -374 -408 -453 -416 -307 -582 -416 -403 -107 157 -157 91 99 214
1373 214 370 603 693 359 438 592 433 566 563 446 236 313 415 104 -217 277 -260 -270 -337 -636 -714 -500 -373
1396 -373 -628 -716 -579 -750 -449 -653 -80 -205 -251 6 96 -147 -35 269 101 286 311 514 545 211 346 390
1418 390 76 195 -33 4 149 -100 -280 -116 -182 -370 -219 -97 -18 -273 -31 -46 -70 236 -59 313 248 84
1440 84 51 155 366 211 486 94 -186 303 -36 -71 -87 -216 -436 -565 -121 -693 -586 -626 -688 -511 -872 -554
1462e54J76j36L13m2R5k75K22M67k51N81L4j36r9K37n3k16K71j42M7k04Rk82J69
1485B31m15%J31j89k32K16k53q0L82J7o77N78M7j17K12J43n45K68L07j11J4K15
1507A42n3J6L94m55L15k11r6K1K6j42P3K29l02j84M18m62J83K0k9l16L22R2p3
1530g2K63J09l36K95j07J71J81j65k6K12J06m09L5J64p9l70K87l60M2J84n11L80
1552fj32r7k48J92j02l36L20k67r3L65Q8J31K12o0j04J71M40k72L98M2k42K31
1574F31k46K00q8K80l64j97M01m48p8j0j75J24j28P7j33j92k0j39J98J8J26K23
1596F0o2j28K74k54j14N80n9j52o7L74k85J14Qj85O5J65j8n63N96n53o3J56j86
1619b97J07L9k17N3J9K56l38J26L74k13K47M0KM1o0J90k16L85k28m5J21J56k70
$$ plain form
1462 -554 -378 -514 -201 -243 -148 -423 -201 266 15 596 630 494 395 632 579 363 634 492 539 335 344 62 231
1485 231 -184 -184 -53 -242 -474 -258 -511 -591 -209 -192 -869 -291 -244 -361 -149 -6 -551 -283 24 -87 -73 142
1507 142 89 105 499 44 359 148 52 73 99 -43 30 259 -43 -227 191 -271 -88 -68 -97 -413 -91 1 -72
1530 -72 191 300 -36 259 152 323 504 339 313 525 631 222 257 421 342 -28 259 -101 -59 125 -386 -6
1552 -6 -138 -235 -483 -291 -393 -729 -409 -676 -769 -404 -316 -185 27 -33 -137 34 474 202 600 642 400 631
1574 631 385 585 497 777 413 216 617 169 91 81 -94 30 -98 -21 -154 -346 -366 -505 -307 -289 -163 60
1596 60 -2 -130 144 -110 -224 356 297 145 78 452 167 281 289 104 169 334 316 -247 349 -204 -267 -111 -297
1619 -297 -190 -151 -368 -315 -296 -40 -378 -252 122 -91 156 196 198 239 179 369 153 538 310 265 386 542 272
1642B72j00p5n6mk34R6o3k11L03k55j69KM08n9m65L08J63k8r4K21p5K96N8r9o6
1667G4L55l30pN33l24N2m1o0j1L5m5m17M41l27J08O4k92q4L13k08r9j3o2j99L63
1692a81K49k62M7L04l33L48J14N2k20L07k24J81k06rq9L36no25L39l91J93k10
1714b85L3k08J29K4j74J24L63l63Q7J30J41k32M41j70j30m5M04l95L50P9Q9j01
1736B91J29j42J85l62P5l0j18r5k27J02N6l1J95l58M9J72j68n0K24J14l61N62
1758B12k59K7J95j13J07P6j07r2M37k18J52l57R2L1k76J46p7K8J69m93J60Nr2
1781b47k95N35m61K45j58J53J00j1M7J38j58J36J59j14K02k57P33m19P0L5qj66
1803B59J6j86n0J11O9k91Oj25j2K9j44J65k31R5l7jJ93j65K52J04l54L00P3l4
$$ plain form
1642 272 172 97 41 37 -197 -101 -164 -375 -72 -327 -496 -494 -86 -145 -610 -302 -139 -167 -261 -40 -115 181 239 140 74
1667 74 429 99 92 625 301 353 312 252 241 276 231 -186 255 -72 36 100 -192 -276 37 -171 -270 -283 -345 -544 -181
1692 -181 68 -194 -147 157 -176 172 286 338 118 425 201 382 176 167 78 414 409 -216 123 -268 -75 -285
1714 -285 -252 -460 -331 -307 -481 -357 6 -357 -270 -140 1 -231 210 40 -90 -135 269 -126 224 303 392 291
1736 291 420 278 463 101 176 146 28 -67 -294 -192 -136 -167 28 -330 -281 -109 -277 -327 -103 11 -350 212
1758 212 -47 -20 175 62 169 245 138 46 483 265 417 60 152 183 -93 53 -24 4 173 -320 -160 -155 -247
1781 -247 -542 -7 -468 -223 -381 -228 -128 -139 -92 46 -112 24 183 69 271 14 747 328 398 433 425 259
1803 259 275 89 39 150 219 -72 -66 -191 -203 -174 -318 -153 -384 -289 -326 -327 -134 -299 -47 57 -297 3 76 42
1827D2J1L84m10j44L14j8k0R8j9l00J37j42J28M0k84j70K87k10J17K9J43k93l4
1850c14K12k3J10k08K85k30J34J88j42M61l85K22K16jo97L47J98j33r9J86m08
1871h1Q1O0j91L3M4K3m39J68O5k0L8j92pK55k75J52K20K28j77K33J45k48K88j01
1895C02n9j53K50k4N7l5l47J63N0l23J46j02L7j1j19j0j8J92k04k5K21M0k26L11
1919A13j89J53l38J52K49N4Qj73jNJ77n8j3k69K24K6K2k21r7L2K02n9k86j02j28
1944e17K64N6Q3k12N5J67Lm9K77Jr5m2Q8K27K5N4j27L7M2o1j1K59m93j25j1K07
1970A02k54j53K30j46K30l79O7J44j03j3L81j60l69L66qj44M67l72K59m6j86K40
1992A53J92r8n9j4J30k04j25K26j90J48j08J9l00mJ72k78L62k29j07J02o4mJ36
$$ plain form
1827 42 53 437 27 -117 197 179 159 257 238 -62 75 -67 61 101 -183 -353 -66 -276 -159 -130 13 -280 -314
1850 -314 -102 -125 -15 -223 62 -168 -34 154 12 473 88 310 526 525 -172 175 373 240 141 327 -81
1871 -81 0 60 -131 -98 -54 -31 -470 -302 -237 -257 -219 -411 -418 -163 -438 -286 -66 162 -15 218 363 115 403 302
1895 302 243 90 340 316 373 338 -9 154 204 -119 27 -75 -38 -49 -168 -178 -196 -4 -208 -233 -12 28 -198 113
1919 113 -76 77 -261 -109 140 194 202 29 28 33 210 152 139 -130 94 120 142 -79 -176 -144 58 -1 -287 -389 -517
1944 -517 -253 -197 -114 -326 -271 -104 -101 -150 127 128 33 -9 79 306 331 385 258 295 337 276 265 524 31 -94 -105 102
1970 102 -152 -305 -75 -221 9 -370 -303 -159 -262 -275 106 -54 -423 -57 -65 -209 258 -114 145 99 -87 153
1992 153 345 247 188 174 304 100 -25 201 11 159 51 70 -230 -234 -62 -340 22 -207 -314 -212 -276 -280 -144
2015a44J22j21L82j86K13j81jo7N5L17l29P1Q7L8j42r4k0q0m8L08k91Nmj36q6
2040c32N1R5j98l4J18P4j17K19P0r8l5J24J36J93r8m3K57k73K87j35J35j20l2
2063B44j80N3j73J18k74M8J28N9l7j12M8K9j84J0K03q8k16R7K83k74OL29j27J21
2087A11p6N4M7L91l47N6n1Q2j67k2j16J8k10J45K95k18P2o8r8j94j2L2lJ96O8
2112a5j02O2O1J75M5l26J14pJ57r0J14Pk5P7k71L65k32j6pm2n4J53k45j73j2N9
2138b28J79N9l69R2K12n2j6J57k6J08R5R9N8R1l96J63%J02J01q4l4R7k34K7k65
2163f4M4P5m22J58J69k48P2J1J14k40L24j52j02K28n3R8o8M35k27q8N7k0L6j22
2187A5K12j09J32n5j96K15j22k66L98j85k47K07o4m22K58J12j31K92k07K35j95
$$ plain form
2015 -144 -22 -143 239 53 266 85 84 17 72 389 60 131 218 256 114 20 0 -80 -128 180 -111 -106 -110 -246 -332
2040 -332 -281 -186 -384 -418 -300 -226 -343 -124 -54 -152 -187 -63 73 266 168 125 382 109 396 261 396 276 244
2063 244 64 117 -56 62 -212 -164 -36 23 -14 -126 -78 -49 -233 -223 -20 -108 -324 -227 56 -218 -212 117 -10 111
2087 111 35 89 136 527 180 236 185 267 100 78 -38 -20 -230 -85 210 -8 64 -4 -102 -296 -308 -276 -279 -83 -15
2112 -15 -117 -55 6 181 226 -100 14 7 164 74 188 195 170 247 -24 341 109 93 86 44 -10 143 -102 -275 -287 -228
2138 -228 -49 10 -359 -267 -55 -107 -123 34 8 116 211 310 368 459 63 226 226 328 429 345 311 408 174 201 -64
2163 -64 -20 55 -367 -209 -40 -288 -216 -205 -91 -331 -7 -159 -261 -33 -86 12 -56 379 152 64 121 101 137 15
2187 15 227 118 250 195 -1 214 92 -174 224 39 -208 -1 -65 -487 -229 -117 -248 44 -163 72 -123
2208a23J12k1J37Q0k35j41L03j44L70j56M3j15J16k35L04K5k39P1j38o8J30m0
2230C6j58K29l25J35J29j64j3OJ26O3r8l81M09p8j0J48M2J18Q1j99L3J69m0j98
2254F0K53k42o7O2Q2r0q7Mk19J95r5M6J1k51J64K80l34n5K00J94j90K48k66K31
2278A34j8P0l1Lk40K63j19K40l61K32j18JK16k95K51j88j09n1q5l2JK08J0r6p0
2303a84j16K79k03K20j48L84n1j79K05j28j20N0J03J98j20L06n27J67P0l4J14
2324B86k26j86j97K97j19L05j87k98K61k09K54n8k39L59l19M06k30N0N3J29k00
2345f8K81L6n8k37J15K7R6M2J05k60j14J06j22J70k53Q7o4J81k08Kj67P6J39l8
2369a26K0J91j33j16J67l1O8l7J81j17m6J1J75K2R2l31J91%R7L5j61k76k6OKl
$$ plain form
2208 -123 -11 -32 105 185 -50 -191 112 -32 338 182 225 110 226 -9 295 320 81 152 14 -54 76 36
2230 36 -122 107 -218 -83 46 -118 -131 -125 1 64 -34 -415 -6 -84 -94 54 96 214 295 96 129 298 258 60
2254 60 313 71 4 66 148 58 -29 -25 -244 -49 -144 -98 -87 -338 -174 106 -228 -283 -83 111 -79 169 -97 134
2278 134 116 186 155 158 -82 181 62 302 -59 173 55 56 272 -23 228 40 -69 -120 -205 -237 -236 -28 -18 -114 -184
2303 -184 -300 -21 -224 -4 -152 232 181 2 207 79 -41 9 112 310 190 496 -31 136 206 172 286
2324 286 60 -126 -323 -26 -145 160 -27 -325 -64 -273 -19 -77 -316 43 -276 130 -100 -50 3 132 -68
2345 -68 213 249 191 -46 69 96 192 234 339 79 -35 71 -51 119 -134 -47 -111 70 -138 -136 -303 -227 -88 -126
2369 -126 -106 85 -48 -164 3 -28 40 3 184 67 21 32 207 229 321 -10 181 181 278 313 152 -124 -150 -144 -142 -145
2395a45j19K37k94L73l20J37n8j05J58M03l73p4J68J79j18K04j36j1J65M0J09
2416D20l16L7j78J57j15J87l77J54L6l06R5Q1j34j22L69l50L69q9k11J22O4O5
2438d2RQ5n5p4J13J86q7Pj43L28j8k84J4o6M3K20j86p1N5L9k83K19j91J4O1k5
2464a32j36J05K0R7j41J12KJ81q3J18j85l7k2K65R5l72j60L08K33k38k9k0Q1j67
2488a05qJ8P0r8j18K33J73m61J83N4Q0j55J55j51J63qJ5R6j35K70j5k59K5O3J13
2513A98O6o0j89J0l8M1j20M7N2j91rn9J32k20J2J83K03j75J4L1P8j02J44MQ4K3
2539A59J42n1k3r1j30J47J34j07n7M0j07J0K9l49Q4J31P9j96j70K24k7j84J44
2562a69P9O6j33J58Q1j82J67k25L16K64j17l1N3k53K19p0j3k71J5kK57j77n1M19
$$ plain form
2395 -145 -264 -27 -321 52 -268 -131 -189 -294 -136 267 -106 -180 -12 167 49 253 117 106 271 311 420
2416 420 104 141 -37 120 5 192 -185 -31 5 -301 -206 -125 -259 -381 -12 -362 7 -82 -293 -171 -107 -42
2438 -42 -33 52 -3 -77 36 222 135 142 -1 327 309 25 39 -27 16 236 50 -21 34 73 -210 9 -182 -168 -107 -132
2464 -132 -268 -163 -143 -46 -187 -75 -73 108 25 143 -42 -79 -101 164 259 -113 -273 35 268 30 1 -19 62 -105
2488 -105 -113 -95 -25 -123 -241 -8 165 -296 -113 -59 21 -134 21 -130 33 25 40 136 1 271 256 -3 22 85 198
2513 198 264 204 15 25 -13 28 -92 -45 7 -184 -193 -252 -120 -340 -328 -145 58 -117 -103 -72 6 -96 48 52 136 159
2539 159 301 250 227 136 6 153 287 180 123 163 56 66 95 -254 -170 -39 40 -156 -326 -102 -129 -313 -169
2562 -169 -90 -24 -157 1 82 -100 67 -158 158 422 305 274 327 74 293 223 210 -61 -46 -48 209 32 -19 400
2586D00m84P7k14NJ85J2j18K33m49M32j73M4J78k14J62k92J98m0j21K32N8N6J19
2609B86j22j07j0M0J4R5k38k2O3j04o6L99j32k86K45k30J66k41q5J87r5L28k59
2632a74JJ73k8K57r1j95K03l6k1J53j36N4n0jn7j50M4p6q1K52rJ50l53J12Q0r1
2658g0P5k51Q2O8O1r0N5M9J12J3K56k54J03j15J40o2k40O8J89j24M3j05j19K14
2682I8k11Q1mk66M09m03j44K60l4K82P3m23M0J89q7L81q3j91M6M7L27l9k04L5
2706A79k45K17j49J31j93J09j42K49l07L02l01K71l93K6j38L25j13j41J04K02
2726gP4p6j7l4R2m3j2J28J50l25K38po5q9J66n3j36o4j0j36J63O2j12K12k42%
2752a43k64J88J14N8k45J54R7L1j53K60l7K65m04J39J02j1J48l05J36j88Ql8K25
$$ plain form
2586 400 -84 -7 -221 -216 -31 -19 -137 96 -353 79 -94 -50 128 -86 76 -216 -18 -58 -179 53 111 167 286
2609 286 164 57 47 87 101 196 -42 -64 -1 -105 -171 228 96 -190 55 -175 -9 -250 -335 -148 -243 85 -174
2632 -174 -173 0 -28 229 138 -57 146 110 89 242 106 160 110 109 52 -98 -54 -130 -211 41 32 182 -171 -59 21 -70
2658 -70 5 -246 -164 -96 -35 -125 -70 -21 91 104 360 106 209 94 234 172 -68 0 189 65 108 3 -116 98
2682 98 -113 -32 -36 -302 107 -296 -440 -180 -214 68 141 -282 -242 -53 -140 241 158 -33 13 60 387 348 144 179
2706 179 -66 151 2 133 -60 49 -93 156 -151 151 -150 121 -272 -246 -384 -59 -172 -313 -209 -7
2726 -7 67 -9 -26 -60 32 -11 -23 105 255 -70 168 161 96 7 173 120 -16 -80 -90 -226 -63 -1 -113 99 -143 -143
2752 -143 -407 -219 -105 -47 -292 -138 -41 -10 -163 97 60 325 -79 60 162 151 299 -6 130 -58 -50 -88 137
2775A37k20L2k94J74l8K78k16j19K72l0O6l02L46m09K46M4p6R7J14L8j49j24R2
2798d1j3J55J44L7K7k08J17o2k01j8J13l23L64j57j46J33L5p1j4n4%%N9L02k08
2823c0O0j34J8K3J37q0J21k4k8O9j36O8q4J98K83l72J4k10O6P7k33K68o0r4J68
2848H5k7j03J10N8j67K1J31k21l0k7J91r8L30j45K39J2l04L11k78l8k16L84p6
2871A42l8j42J83k28j28K55o5k8Q6j50j12J5K19j78o2K67J70k19p2J02N5j53O2
2894a9j30N03k91j04J06R7k21L29k86J92l40K13j60K3m0J74n3j37Q9j09J07j54
2916b11K85k20J7Q9J48k76Q6L5K01Q3j88J88j77J58j06K89l75j5J12J57k44J17
2938A53j30J15k54K35j30q1J43P6m25K25J89l80K34k61K33L0J54M5j77qJ71j97
$$ plain form
2775 137 -83 -51 -345 -171 -209 69 -147 -266 6 -24 42 -260 86 -323 -77 -33 -109 -12 102 140 -9 -133 -41
2798 -41 -54 101 245 282 309 101 218 156 -45 -63 50 -273 91 -66 -212 -79 -44 -115 -129 -183 -183 -183 -124 178 -30
2823 -30 30 -104 -86 -63 74 -6 115 91 63 132 -4 64 -20 178 461 89 103 -107 -41 36 -197 71 11 -83 85
2848 85 58 -45 65 123 -44 -23 108 -113 -143 -170 21 -77 253 108 347 359 55 366 88 50 -166 218 142
2871 142 104 -38 145 -83 -211 44 -21 -49 37 -113 -225 -210 9 -169 -231 36 206 -13 -85 17 72 -81 -19
2894 -19 -149 354 63 -41 65 162 -59 270 -16 176 -164 49 -111 -88 -128 46 -7 -144 -55 -164 -57 -211
2916 -211 74 -146 -129 -40 108 -168 -82 -47 154 237 49 237 60 218 112 401 26 11 123 280 36 153
2938 153 23 138 -116 119 -11 -92 51 127 -298 -73 116 -264 -30 -291 -58 -28 126 171 -6 -14 157 -40
2960d0j9J17P3j18K11n7M26m99J37j14l43K63R9P0m17K70k13j18K96j93j4J64
2982a9lM4j04o6J71n6j03J82L8Qj19J24N4k17J49O2j43l2j6J7L2J5j11J64n8p1
3008e8j4Q2m5j50K04J49k55o9J53P4k04J34K55j26K06l33J64L6O2O0k15J0j55
3031c5K11j14J36r3j11l8j82J79j68LN9J66J00M2k62P6K0J88k16o2L01Oj9j76
3055A1K15o4k02r6L09j02p4j93K19J28j91Lj00n4K79k37J02N8j80K35ql22K09
3078e5m9n7K59R0k67kL22j36lJ00l48K09om7O6Q4J34n6q2k80k1J12J56k17j12
3103b06J23J55J8l38M90m41o1J34J03M5J9j02r3J03M5%L3n8p0M16m18J0J66J59
3127B32j91o8J12k62J43K9NJ31k39J26l08J87l3L2l2l4L88k58J27N0n9l13J04
$$ plain form
2960 -40 -59 58 131 13 224 167 593 94 231 117 -226 37 136 206 -211 59 -154 -272 24 -169 -183 -19
2982 -19 -22 22 -82 -148 23 -33 -136 46 84 92 -27 97 151 -66 83 145 2 -30 -46 -29 3 18 -93 71 13 -58
3008 -58 -72 10 -35 -185 19 168 -87 -156 -3 71 -133 1 256 130 336 3 167 203 265 325 110 120 -35
3031 -35 176 62 198 105 -6 -44 -226 -47 -215 -212 -153 13 113 155 -107 -31 -11 177 -39 -101 200 206 187 11
3055 11 226 162 -40 -136 173 71 -3 -196 23 151 -40 -37 -137 -191 88 -149 -47 11 -169 66 58 -264 -55
3078 -55 -104 -161 98 188 -79 -81 241 105 102 202 -146 63 57 10 76 160 294 238 156 -124 -145 -33 123 -94 -206
3103 -206 -83 72 90 -248 242 -199 -260 -126 -23 22 41 -61 -154 -51 -6 -6 27 -31 -101 315 -103 -93 73 232
3127 232 41 -27 85 -177 -34 -5 0 131 -108 18 -290 -103 -136 -104 -136 -170 218 -40 87 137 78 -235 -131
3150a31N6Q5L82l83j25K42j65K65m18K20J1j6k13L21j43K93k6k00P9j64J48l32
3172b14K83rm02L34L6k04%j88L74j11L4o0J49l5J36j03r2L31k38J59k45L20q0
3195A75j61j48j21K46oJ63m3lk06kn0O9q3J27j66J18j3L9L09p3j44J34jj37K32
3220B55j49o4o9M6N7j24Q0l7j15l8K52J19o6j86J16q0o9K7k8J66k08Nl5J66k28
3245b07K78k49K90o8J89q7k7r9K22p3J1p4k23J87j94L04j74j18J32k33K90k42
3267a65K71k05L5N6j50J69j53O7j02J33k8j26M07k39K4K53l37J87J8j02O7M7m3
3290H4J4j40K13M0j96J04k39K16n5j94p4K5o7L29j42j01K44k58J26L24j34k02
3312h3J90j22O6L2l3q4M8J74l02J00J88k07J77l0m2j12M9J4j2k08K54k42l8K5
$$ plain form
3150 -131 -75 10 392 9 -116 126 -39 226 -192 28 39 23 -190 131 -12 281 255 55 134 -30 118 -214
3172 -214 69 60 -342 -8 28 -176 -176 -364 10 -101 -67 -127 22 -13 123 20 -72 259 21 180 -65 255 175
3195 175 14 -134 -255 -9 -15 148 105 102 -104 -106 -156 -87 -170 -43 -209 -91 -104 -65 244 171 27 161 160 23 255
3220 255 106 42 -27 19 76 -48 32 -5 -120 -158 94 213 147 -39 77 -3 -72 -45 -73 93 -115 -110 -145 21 -207
3245 -207 71 -178 112 44 233 146 119 20 242 169 180 106 -117 70 -124 180 6 -112 20 -213 77 -165
3267 -165 106 -99 -64 -8 -158 11 -142 -75 -177 -44 -72 -198 209 -30 -6 247 -90 97 115 13 80 127 84
3290 84 98 -42 171 211 15 119 -120 96 41 -153 -227 -202 -269 60 -82 -183 61 -197 -71 253 119 -83
3312 -83 107 -15 51 83 50 -34 14 188 -114 -14 174 -33 144 114 72 -40 9 23 11 -197 57 -185 -223 -198
3336a98K67k00R1K17j45j08K27k60J8L0L36k77K01j17Mk08K89j10j22R5j24m2
3358a36Q2m0J91k35J0K15j36K83m30K68K27k37j49k1J53K36p2l8j79j61K98l61
3380b32M4K39k67M2K15K00m5l34J06P4O4j55O6p9K24m21K62j1q9J71j8j23p6M69
3404C26l92J36m5Q5m8m6RL4J52l9m6m0n8j62K17m7j21L2J48j22qp6M8L0l3J72
3430A06k4m7k43L63j38llN1j45J09j21P5K07N8j5k99m3J93o0J30j16l3j48l8L4
3455a50K34j27J08k8j69J12p5OK15k24k63M73l44J29K31p8R4j94j47J55K37k16
3477b1q8K81%Rq6J68k19k12J68J10k86J71j62Q2Q6q9o7n7K89j18J62l4P1k19q
3502f9j59K18J68j14j12j04K54L3j06J01j57K72r2q8J21j14j01N3J4k2M9Jk82
$$ plain form
3336 -198 69 -131 -40 177 32 -76 151 -109 -91 -61 275 -2 199 82 86 -122 167 57 -65 30 -94 -136
3358 -136 -54 -94 97 -138 -128 87 -49 234 -196 72 299 62 -87 -108 45 281 209 171 -8 -169 129 -232
3380 -232 -188 51 -216 -174 41 241 196 -138 -32 42 106 -49 17 -62 162 -259 3 -8 -97 74 56 -67 -143 326
3404 326 -66 70 25 110 62 16 25 59 211 172 126 86 28 -134 83 36 -85 -53 95 -27 -35 -111 -63 -33 -66 106
3430 106 82 35 -208 155 17 14 11 62 -83 26 -95 -20 187 245 230 -69 -112 81 21 151 35 2 -146 -184 -150
3455 -150 84 -43 65 37 -132 -20 -95 -89 126 -98 -361 112 -232 -103 128 50 144 -50 -197 -42 195 -21
3477 -21 -109 172 172 181 95 263 44 -168 0 110 -176 -5 -167 -85 1 -88 -155 -212 77 -41 121 87 158 -61 -69
3502 -69 -228 -10 158 44 -68 -172 82 115 9 110 -47 225 133 45 166 52 -49 4 18 -4 45 46 -236
3525b36K53J02k32k28L20J70k96J96j6l6k6J08m1m5R8k2m7p1M4K0J19R1k52O2
3549C5q0J14k38J62J34l8k11L37k26p0J45k57L48j25j31J47p4n6K7J79l33L9K7
3572a45K08m7k0j54J59N7p1K80l76pJ76m8J34k04J49k01J2j44M49k15n8MK25k12
3596d9j4j81L45l7L2j94J41n4m6K99k05N4r5J83N2l02o8J04P4q7Q5Q9k1j03M2
3621D4J92k06J44k21K70k84R8N3o5j65J04J83k41R5J51l03L30k25J5R6MJ27l34
3644a38K27r5L33k53j74K92l21L30j45q4O0j82n1K02k6K08k52N2O4j08N5Q7m7
3667C4O5J1K0p6j74J00p0J00K30k00K30k93KJ64l13l2K45J5k26J85j43R9J5J77
3691A65j23jj00m3RK91k26J22J27q3k23J35l9l3j08L10k63q8J88j7M3l2R8k24
$$ plain form
3525 -236 17 119 -113 -341 -21 149 -147 49 33 -3 -29 79 38 -7 91 69 22 -49 -5 15 134 225 -27 35
3549 35 -45 69 -169 -7 127 89 -122 215 -11 -81 64 -193 155 30 -101 46 -28 -84 -57 122 -211 -172 -145
3572 -145 63 16 -4 -158 1 58 -13 267 -109 -116 60 12 146 -58 91 -110 -98 -242 207 -8 -66 -62 163 -49
3596 -49 -63 -244 101 64 96 -98 43 -11 -57 242 37 91 -4 179 231 -71 -139 -35 39 -48 37 126 105 2 44
3621 44 236 30 174 -47 223 -61 37 90 25 -140 -36 147 -94 1 152 -151 179 -46 -31 65 69 196 -138
3644 -138 89 -6 327 74 -100 192 -129 201 56 -28 32 -150 -201 1 -25 183 -69 -17 47 -61 -6 81 34
3667 34 99 110 130 54 -120 -20 -90 10 240 40 270 -23 -21 143 -170 -202 43 58 -168 17 -126 -27 -12 165
3691 165 42 41 -59 -102 -93 198 -28 94 221 138 -85 50 11 -22 -130 180 -83 -171 17 0 43 11 109 -115
3715a15K21j66O8j24N3K6j1j99K28K1p6K74j70j02J54O1l07J47L06k25l0J6k96
3738b46M03l79M00j55j4oM1l87L67j16J05k2q2k3L31l50L24l10J70J3QJ9l8Q1
3762A34r6N5k20j9K18q6P1l0Pq6Q7j12J23p3oN8j29Q5M2l5j95K01Oj5j85L35j03
3789C2j41j18K49j97Q4K8K17k85J70j26L6J93r0j49nK99j55K8r5Q5j46L3j09N4
3813a08O5J8l8J67R0j2l19K28n0p4J1K21P1j91k2o8J34p6J03j06j82j29M33j1
3837A55l12K45n5Q4q5Q2o3j5j62O2j25K95Ol36K23Pk01L25m98L29K8N6q3j47J28
3862e7J6K06j16O9j31On9J35n7j08J17J78l83K98j87O6L4j85j37K83k75L27k24
3885a84m7L82k71P0N2k48J24K71k3k19l6K69L8l51O8J99r3k41L38q1k62R9k9J54
$$ plain form
3715 -115 106 -60 8 -116 -63 -37 -48 -247 -19 2 -74 200 30 -72 82 143 -164 -17 289 64 34 50 -246
3738 -246 157 -222 178 23 9 3 44 -343 24 -92 13 -9 -91 -114 217 -133 191 -119 51 64 72 91 53 134
3762 134 38 93 -127 -146 72 -14 57 27 34 -52 35 -77 46 -27 -33 25 -104 -19 23 -12 -207 -6 0 -15 -200 135 32
3789 32 -109 -227 22 -175 -91 -63 154 -131 39 -87 -51 142 52 -97 -102 197 42 70 -25 60 -86 -53 -162 -108
3813 -108 -43 -25 -63 104 194 182 -137 91 41 -33 -22 199 270 79 57 -11 123 47 150 44 -138 -267 166 155
3837 155 -157 88 33 117 32 114 51 36 -126 -64 -189 106 112 -224 -1 6 -195 130 -368 -39 -11 45 -38 -185 -57
3862 -57 -41 165 49 118 -13 -7 -66 69 12 -96 21 199 -184 114 -73 -7 27 -158 -295 -12 -287 40 -184
3885 -184 -231 151 -120 -50 2 -246 -122 149 126 -93 -129 140 178 -173 -105 94 1 -240 98 17 -245 -146 -175 -21
3909b1R2J8l02K97l24K88O9k16NO8j69K20j45K64m44K88n4n1M42M1k11J95k41
3932A09P5j46L2K10j98m8j77j5K21l40K85o0J57j52M1jm0M9j20l3J33j90K97m7
3956D2l0J23k46OQ0R1j14J66j70j68J26Q2k28M69l26K72j83o9L4j7J9K47j10n00
3980d04L91j00K67O2m29R5Q5P3K41j20j71j6J59p9J72k10j17K4nJ93m6j1k10K47
4004I1j16N8Q7j68J7J10l33K20p6K6O8j62K50j34L22k37M4Q2o0M0n2l9J22l23
4028a63L07j25R4R1l26J15N4J27k4r9k4j13m4J50J09n2j10m2K26k67J99j28K49
4051B04n7j56j1j32K87j55O1K44r2j35lp4K40k30o4l0J85j60m2J39l08M70m25
4074b44J74J62o5p4P5l1j89J18K28k00k3Q2j02K05j49K67j60R2j19J75l14K2K57
$$ plain form
3909 -21 71 89 -213 84 -240 48 117 -99 -94 -26 -195 25 -120 144 -300 -12 -66 -117 325 366 155 350 109
3932 109 184 38 70 280 82 34 -143 -158 63 -277 8 -52 105 -47 -6 -7 -47 2 -118 -151 -18 -208 89 42
3956 42 12 135 -111 -105 -25 66 -48 118 -52 -220 -94 -12 -240 229 -97 175 -8 -77 -43 -60 -41 206 96 -404
3980 -404 -13 -113 154 216 -213 -118 -33 40 281 161 -10 -26 133 54 226 16 -101 -77 -82 111 65 54 -156 91
4004 91 -25 33 120 -48 -31 79 -254 -34 -110 -84 -16 -178 72 -62 260 23 67 149 89 129 77 38 160 -163
4028 -163 144 19 113 204 -122 -7 47 174 150 51 27 -86 -130 20 129 77 -33 -75 151 -116 83 -45 204
4051 204 147 -9 -20 -152 135 -20 41 285 193 58 55 -19 221 -9 -73 -103 82 -78 -120 19 -289 181 -244
4074 -244 -70 92 27 -47 28 -3 -192 -74 154 -46 -69 13 -89 116 -33 234 74 166 47 222 -92 -70 187
4097A87l9m2o0J60k86KM7k6k19q0J78K54k99J70J53j08M9K18l40J82m0J29j87
$$ plain form
4097 187 148 106 46 206 -80 -78 -31 -57 -276 -356 -178 76 -223 -53 100 -8 41 259 -81 101 61 190 3
$$ [...]
8191i0
##END NTUPLES=NMR FID
##END=
