##TITLE=1H_LR-758-R6-3CR19
 CDCl3
 8 sc, 
 25.10.2023
##JCAMPDX= 6.0         $$ Bruker NMR JCAMP-DX V2.0
##DATA TYPE= NMR FID
##DATA CLASS= NTUPLES
##ORIGIN= UXNMR, Bruker Analytische Messtechnik GmbH
##OWNER= root
$$ XWIN-NMR		Version 3.5
$$ Wed Oct 25 14:07:01 2023 Russian Standard Time (UT+4h)  she@DPX200
##.OBSERVE FREQUENCY= 200.13135
##.OBSERVE NUCLEUS= ^1H
##.DELAY= (6, 6)
##.ACQUISITION MODE= SIMULTANEOUS
##.ACQUISITION SCHEME= undefined
##.AVERAGES= 8
##.DIGITISER RES= 18
##SPECTROMETER/DATA SYSTEM= spect
##.PULSE SEQUENCE= zg30
##.SOLVENT NAME= D2O
##.SHIFT REFERENCE= (INTERNAL, D2O, 0, 15.7039)
##AUDIT TRAIL= $$ (NUMBER, WHEN, WHO, WHERE, WHAT)
$$ ##TITLE= Audit trail, XWIN-NMR		Version 3.5
$$ ##JCAMPDX= 5.01
$$ ##ORIGIN= Bruker BioSpin GmbH
$$ ##OWNER= she
$$ F:/spectra/data/she/nmr/H-F/1/audita.txt
$$ ##AUDIT TRAIL=  $$ (NUMBER, WHEN, WHO, WHERE, WHAT)
(   1,<2023-10-25 14:06:05.42 +0400>,<she>,<DPX200>,
      <created by zg, POWCHK disabled, PULCHK disabled
       configuration hash MD5:
       00 E9 B6 7A A2 85 ED C7 34 08 36 98 17 FE 4E 26
       data hash MD5: 16K
       F7 1A 90 CC 13 3D 3D 8D 16 3C F3 5E 23 2C 1E 98>)
$$ ##END=
$$ 
$$ hash MD5
$$ 83 0D DD 24 88 DB A9 A2 8D 17 F8 8D 48 AB AA 19
##$RELAX= 
##$RELAX= 
##$RELAX= 
##$RELAX= 
##$RELAX= 
##$RELAX= 
$$ Bruker specific parameters
$$ --------------------------
##$DU= <F:/spectra>
##$EXPNO= 1
##$NAME= <H-F>
##$PROCNO= 1
##$TYPE= <nmr>
##$USER= <she>
##$AMP= (0..31)
100 100 100 100 100 100 100 100 100 100 100 100 100 100 100 100 100 100 
100 100 100 100 100 100 100 100 100 100 100 100 100 100 
##$AQSEQ= 0
##$AQ_mod= 1
##$AUNM= <au_zg>
##$AUTOPOS= <>
##$BF1= 200.13
##$BF2= 200.13
##$BF3= 200.13
##$BF4= 200.13
##$BF5= 200.13
##$BF6= 200.13
##$BF7= 200.13
##$BF8= 200.13
##$BYTORDA= 1
##$CFDGTYP= 0
##$CFRGTYP= 5
##$CHEMSTR= <none>
##$CNST= (0..31)
1 1 145 1 1 1 1 1 1 1 1 1 1 1 1 1 1 1 1 1 1 1 1 1 1 1 1 1 1 1 1 1 
##$CPDPRG= <>
##$CPDPRG1= <>
##$CPDPRG2= <>
##$CPDPRG3= <>
##$CPDPRG4= <mlev>
##$CPDPRG5= <mlev>
##$CPDPRG6= <mlev>
##$CPDPRG7= <mlev>
##$CPDPRG8= <mlev>
##$CPDPRGB= <>
##$CPDPRGT= <>
##$D= (0..31)
0 1.2 0 0 0 0 0 0 0 0.06 0 0.03 0 0 0 0 0.0002 0 0 0 0 0 0 0 0 0 0 0 0 
0 0 0 
##$DATE= 1698228364
##$DBL= (0..7)
120 120 120 120 120 120 120 120 
##$DBP= (0..7)
150 150 150 150 150 150 150 150 
##$DBP07= 0
##$DBPNAM0= <>
##$DBPNAM1= <>
##$DBPNAM2= <>
##$DBPNAM3= <>
##$DBPNAM4= <>
##$DBPNAM5= <>
##$DBPNAM6= <>
##$DBPNAM7= <>
##$DBPOAL= (0..7)
0.5 0.5 0.5 0.5 0.5 0.5 0.5 0.5 
##$DBPOFFS= (0..7)
0 0 0 0 0 0 0 0 
##$DE= 6
##$DECBNUC= <off>
##$DECIM= 32
##$DECNUC= <off>
##$DECSTAT= 4
##$DIGMOD= 1
##$DIGTYP= 9
##$DL= (0..7)
0 120 120 120 120 120 120 120 
##$DP= (0..7)
150 150 150 150 150 150 150 150 
##$DP07= 0
##$DPNAME0= <>
##$DPNAME1= <>
##$DPNAME2= <>
##$DPNAME3= <>
##$DPNAME4= <>
##$DPNAME5= <>
##$DPNAME6= <>
##$DPNAME7= <>
##$DPOAL= (0..7)
0.5 0.5 0.5 0.5 0.5 0.5 0.5 0.5 
##$DPOFFS= (0..7)
0 0 0 0 0 0 0 0 
##$DQDMODE= 0
##$DR= 18
##$DS= 0
##$DSLIST= <SSSSSSSSSSSSSSS>
$$ [...]
##$SUBNAM2= <"">
##$SUBNAM3= <"">
##$SUBNAM4= <"">
##$SUBNAM5= <"">
##$SUBNAM6= <"">
##$SUBNAM7= <"">
##$SUBNAM8= <"">
##$SUBNAM9= <"">
##$SW= 18.05172834244
##$SWIBOX= (0..15)
0 0 2 0 0 0 0 0 0 0 0 0 0 0 0 0 
##$SW_h= 3612.71676300578
##$TD= 16384
##$TD0= 1
##$TE= 0
##$TE2= 300
##$TE3= 300
##$TEG= 300
##$TL= (0..7)
0 120 120 120 120 120 120 120 
##$TP= (0..7)
150 150 150 150 150 150 150 150 
##$TP07= 0
##$TPNAME0= <>
##$TPNAME1= <>
##$TPNAME2= <>
##$TPNAME3= <>
##$TPNAME4= <>
##$TPNAME5= <>
##$TPNAME6= <>
##$TPNAME7= <>
##$TPOAL= (0..7)
0.5 0.5 0.5 0.5 0.5 0.5 0.5 0.5 
##$TPOFFS= (0..7)
0 0 0 0 0 0 0 0 
##$TUNHIN= 0
##$TUNHOUT= 0
##$TUNXOUT= 0
##$USERA1= <user>
##$USERA2= <user>
##$USERA3= <user>
##$USERA4= <user>
##$USERA5= <user>
##$V9= 5
##$VALIST= <valist>
##$VCLIST= <CCCCCCCCCCCCCCC>
##$VD= 0
##$VDLIST= <DDDDDDDDDDDDDDD>
##$VPLIST= <PPPPPPPPPPPPPPP>
##$VTLIST= <TTTTTTTTTTTTTTT>
##$WBST= 1024
##$WBSW= 4
##$XGAIN= (0..3)
0 0 0 0 
##$XL= 0
##$YL= 0
##$YMAX_a= 89250
##$YMIN_a= -134683
##$ZGOPTNS= <>
##$ZL1= 120
##$ZL2= 120
##$ZL3= 120
##$ZL4= 120
##$ABSF1= 10
##$ABSF2= 0
##$ABSG= 5
##$ABSL= 3
##$ALPHA= 0
##$AQORDER= 0
##$ASSFAC= 0
##$ASSFACI= 0
##$ASSFACX= 0
##$ASSWID= 0
##$AUNMP= <proc_1d>
##$AZFE= 0.1
##$AZFW= 0.1
##$BCFW= 1
##$BC_mod= 2
##$BYTORDP= 1
##$COROFFS= 0
##$CY= 11.3945322036743
##$DATMOD= 1
##$DC= 2
##$DFILT= <>
##$DTYPP= 0
##$F1P= 15.7292609196834
##$F2P= 12.9074282941183
##$FCOR= 0.5
##$FTSIZE= 0
##$FT_mod= 4
##$GAMMA= 1
##$GB= 0.15
##$INTBC= 1
##$INTSCL= 1
##$ISEN= 128
##$LB= 0.24
##$LEV0= 0
##$LPBIN= 0
##$MAXI= 10000
##$MC2= 0
##$MEAN= 0
##$ME_mod= 0
##$MI= 1.114404
##$NCOEF= 0
##$NC_proc= 0
##$NLEV= 6
##$NOISF1= 3.799351
##$NOISF2= 2.8
##$NSP= 1
##$NTH_PI= 0
##$NZP= 0
##$OFFSET= 15.70392
##$PC= 1
##$PHC0= -23508.4
##$PHC1= 10.4527
##$PH_mod= 1
##$PKNL= yes
##$PPARMOD= 0
##$PSCAL= 0
##$PSIGN= 0
##$REVERSE= no
##$SF= 200.130013532006
##$SI= 16384
##$SIGF1= 3
##$SIGF2= 2
##$SINO= 400
##$SIOLD= 16384
##$SREGLST= <1H.CDCl3>
##$SSB= 0
##$STSI= 0
##$STSR= 0
##$SW_p= 3612.71676300578
##$SYMM= 0
##$S_DEV= 0
##$TDeff= 0
##$TDoff= 0
##$TI= <>
##$TILT= no
##$TM1= 0
##$TM2= 0
##$TOPLEV= 0
##$USERP1= <user>
##$USERP2= <user>
##$USERP3= <user>
##$USERP4= <user>
##$USERP5= <user>
##$WDW= 1
##$XDIM= 8192
##$YMAX_p= 0
##$YMIN_p= 0
$$ End of Bruker specific parameters
$$ ---------------------------------
##NTUPLES= NMR FID
##VAR_NAME=  TIME,          FID/REAL,        FID/IMAG
##SYMBOL=    X,             R,               I
##VAR_TYPE=  INDEPENDENT,   DEPENDENT,       DEPENDENT
##VAR_FORM=  AFFN,          ASDF,            ASDF
##VAR_DIM=   8192,          8192,            8192
##UNITS=     SECONDS,       ARBITRARY UNITS, ARBITRARY UNITS
##FACTOR=    0.0002768,     1,               1
##FIRST=     0,             0,               0
##LAST=      2.2672688,     0,               0
##MIN=       0,             -134683,         0
##MAX=       2.2672688,     89250,           0
$$ Real data points
##PAGE= N=1
##DATA TABLE= (X++(R..R)), XYDATA
0@%%%%%%%%%%%%%%%%%%%jRj6J6j6J6j6J7k3L0l2L3l9M6m9N6o4P0p8Q7r8J08j18
42f2J31j46J61j77J94k13K36k59K86l15L45l83M25m72N30n95O71p64Q77j021J212
63F61j474J848k424L403n352J0489m4727r7107J83168O100j19581J19157L5089
76H9250j48507L9267P6370p3826J8707N9414n6301Q433M3969n8461q038M8591
88C8868k3901R48K0125m8289p55L5979l0970J6765L9356o6467j1175P6251l5382
101A1353m6771N0363k0065l9151O2029P684m7166K4725n739l5308N0988J0994
113B3936n6051L0377K1969n8793J4750L8994l8777J2495M7158l8258k0384K2622
125C8k5892O547N2335k2695l2315K3143j1900j1971M0299J572k5539J2797n684
$$ y = [0, 0, 0, 0, 0, 0, 0, 0, 0, 0, 0, 0, 0, 0, 0, 0, 0, 0, 0, 0, -1, 8, -8, 8, -8, 8, -8, 9, -14, 16, -16, 17, -22, 24, -25, 31, -33, 37, -41, 46, -52, 56, -62, 69, -77, 84, -93, 101, -112, 124, -135, 151, -164, 181, -202, 223, -249, 281, -314, 357, -407, 470, -551, 661, -813, 1035, -1389, 2014, -3338, 7151, -37576, -134683, 48485, 54585, -64996, 54161, 89250, -59257, -19990, 56380, -17446, 1261, 60675, 4374, 12807, 56776, -1685, -9723, 38868, 14967, 15915, 36040, -12249, -13004, 22975, -7995, 8770, 48126, -18341, -29516, 46735, 11353, -35418, 14945, -5120, -44271, 17758, 25442, -21724, 3001, -2738, -38046, 12942, 23936, -32115, -1738, 20231, -38562, -23812, 15182, -23595, -11100, 36058, -2200, -22584, 38, -25854, -19307, 33028, 10333, -21982, 1161, -10739, -22710, 17589, 19161, -6378, 6419, 735]
138G35j5563K0521n843j7126K8485J604k8990J5768M157k6593K0604J6505l0149
151a5885J837J4066k0479Q537K0565k6720m297K6381j0712n463J9277j5605j4679
164b3177K1529K796m585J4156r060j1265J7858k722r903K1086m15j8835J4748
177A2211L478k1926J2497J6365j5157K543Q203j9643j85J7317q030k935R449j2912
191A275o607J3285l237m255Q344p280p187J0548m035o840J1975l133j2609J0751
205I95K431j2688P736P533j3045K24Q239p953j102Q295l729l161L742l787r86
220g256M657j276O88K915n744K72O017l382K67O655n202l452J0134j731p117O224
236B669M51n881P393L477q270k30K372l782L617K615n344M00J641n200J692K543
$$ y = [735, -14828, 5693, -150, -17276, 11209, 12813, -16177, -409, 3748, -22845, -2241, 14264, -15885, -14048, 18, -20461, -11924, 8641, -18079, -22376, 4005, -6707, -12170, 7107, -8498, -23177, -1648, 1148, -3437, 10719, 1659, -9606, 8252, 5530, -4373, 16713, 16298, -2537, 12211, 15689, -6237, 6260, 22625, 7468, 10011, 18214, -1429, -1614, 15703, 7673, 4738, 14187, 1275, -5332, 7953, 4716, 461, 8805, 1525, -5662, 4886, 851, -5989, 5986, 2853, -9756, 995, 3426, -9262, -1526, 6007, -7038, -6814, 1425, -6528, -7630, 665, -3064, -6225, -2483, -6270, -7256, -2599, -3875, -3187, -272, -6016, -5744, 273, -3109, -2842, 3813, -1389, -4841, 5293, 3562, -3555, 2669, 3120, -2761, 4632, 8109, -161, -391, 1981, -1801, 1816, 4431, -913, -513, 1128, -4072, -2380, 163]
252A63o396K915Q328o887m194M304m988j84J2584q17r634L477Q08m179O555M067
268E922o238N69M921l027j462K77j801L348N151k671k424k986m749M982P225m356
284B681l136K647m146j147O766l011n930P214L981n455o58m47m916M579Q968j778
300F212n289j517j883J697M454o26j941j19k68J79q3m556q79N728K240j708j629
317A2n221l947N524O561j678l133m70j582K95K897J33k485J386M452l3m388k812
334d489J130K404M233L326m558p151J094L852M71N96N73k971r59L607j097m507
350d446N11M188K029K56k271m661j456M237N810P37l260k468P09P82N52J422j143
367A528j091K999J885m833l313K306J607J871K813l754o714J42L611Q56L51l37
$$ y = [163, -6233, -3318, 5010, -1877, -6071, -1767, -6755, -6939, 5645, 4828, -4806, -1329, -521, -4700, 1855, 5922, -316, 253, 5174, 2147, 685, 962, -839, 2509, 7660, 4989, 2565, -421, -5170, -188, 7037, 2681, -455, 2192, -1954, -3101, 3665, 654, -5276, 1938, 5919, 464, -194, -641, -5557, -978, 7990, 6212, 923, -594, -2477, -780, 3674, 3048, 1107, 988, 720, 899, 816, -3740, -4619, 1109, 3349, 1641, 12, -5209, -9156, -3632, 2929, 1251, -1882, -2352, -3934, -3639, -742, -609, -3094, -1708, 2744, 2711, -1677, -4489, -3359, -955, 3278, 6604, 2046, -5105, -4011, -159, 312, 908, 1481, -1490, -2449, 1158, 61, -4446, -3935, 253, 2282, 2538, 267, -4394, -5850, -1613, 4197, 4934, 1674, -794, -85, 697, 1249, 2671, 1528, 437, 3436, 5321, 488, -2825, -519, 1088, 2959, 5772, 2018, -4696, -4554, -943, -87, 264, -73]
383g3j777m14J698j53j787n82K089L612K00l228j469N42J176M382K813l684k713
400F32K028M15j276J684M34k283K091K504l812l559J179J419O97J799k034m117
416b199j713K379J861k76j024r0n43j040N10k02j642Q79K802r10k445k34k06R0
434d003K614J292l060k198Q93Q16k04L27L95p73l87J626R21k369n39K615O52r67
452b349J626p2k215K381K730j120q01K093j14r69J203m00j267J062J104r7j025
469A770p66o79L30o87K93L73k474j688K054p01j831J456P83k556K80J783j417
486c677o86K464p60j487J580P10k53P16J185n01k20J4O34K27k20J039M25j962
504g72m72J646m38n80J488p62k985O20J547j138k76J132j318j026J169L25j185
$$ y = [-73, -1850, -2264, -566, -719, -2506, -3088, -999, 2613, 2813, -415, -1884, -1342, -166, 4216, 7029, 3345, 632, 2660, 3075, 1799, 3483, 3917, 1634, 3725, 6229, 2417, -1142, 37, 1456, 2153, 3952, 1918, -2199, -3912, -1533, 328, 52, -972, -1062, -1605, -2645, -2135, -2337, -3979, -3100, -298, -1208, -3653, -3887, -4093, -4003, -1389, -97, -3157, -5355, -4462, -3646, -3850, -3523, -3128, -3901, -4288, -2662, -1741, -4110, -4649, -2034, -1382, -2349, -723, -795, -3010, -629, 2101, 981, 180, 2273, 2159, 1190, 2393, 1993, 726, 1788, 2892, 2795, 1770, 1004, 325, 655, -32, 261, 634, -1840, -3528, -1474, -2175, -4006, -2550, -1767, -4323, -4043, -2260, -3677, -4363, -1899, -2659, -4146, -2566, -1856, -2109, -1393, -208, -709, -929, -915, -281, -54, -274, 765, 1190, -772, -1244, 402, -36, -616, 872, 110, -2875, -2255, -708, -1846, -2122, -990, -2308, -3334, -2165, -1840, -3025]
521c025j07M23O08m49j064j22O1k48J243M59j667j003J567m37p61O41k34j344
539e459J854J263j724r07P89O79O12J525Nj757K02J571J715K25j8N16M84L63L03
558B241K90m91K74K297N04k548p48N86r55J416J817k888k428J278j56j611J562
575D40n06k841J474J532k596j294O44j51J286J525j792j240L41OK202J552k476
592a894l20K192r72n0J997k310r07M300L04l560J377Nk434L973J681l928q78J817
610C93q09R48J393k689M05K158r89J03M98k800N79M105q26k048J064j903j548
627a966M152J19l435P28P63k005P98Q58k448M20K485n03j423j026n16J443J447
644a09L79J38j211j562K646K197j883N39J352j328N36K302j760j121K583L54r84
$$ y = [-3025, -3132, -2709, -2101, -2550, -3614, -3736, -3675, -3923, -2680, -2221, -3888, -4891, -3324, -3761, -4522, -3881, -4115, -5459, -3605, -2342, -4066, -4973, -4184, -3505, -2893, -1368, -1363, -3120, -2918, -1347, 368, 593, 575, 1091, 1575, 1938, 2241, 2531, 2040, 2314, 4611, 5115, 2567, 1819, 2405, 1450, 2866, 4683, 1795, -633, 645, 489, -1122, 440, -66, -2907, -1433, 99, -2497, -3791, -3147, -3298, -2012, -487, -2279, -3519, -3178, -3172, -970, 582, -1894, -2214, -22, -994, -1044, 953, -1357, -2264, 2036, 2340, -1220, 157, 162, -2272, 1701, 3382, -546, -1424, 393, -416, 532, 1925, -764, -359, 1799, 810, 913, 1411, -1389, -810, 3295, 2469, 421, 1485, -418, -1966, 2186, 2305, -1130, -402, 361, -1644, -846, 12, -2436, -2016, 469, -34, -1457, -2483, -2999, -1556, -109, 270, 408, -803, -2365, 281, 2478, 595, 1134, 2486, 1158, 1694, 3996, 2236, 1115, 3698, 4052, 3068]
661C068O20r70j141J335N67p73n73j109j91J154r88j390O52n38o92K336o65l044
679b342P13R40j029J666J086k616P0J568o12N31N19j264Q17R82j414n8P44j099
697g98J281K206l096j082J733j220k32L320j886k203K066O37j949J611P90j939
713g61J333J280j478j12Q03p46R89N43j051J84N64j225J211M96k539L24J895j605
731A05o84J663k133p50K255n55j767J436m27j405J584M94j386J189lp36J256L00
749D36r17J295N94j521R81P20j722P81J908j898m22J580j303q97J739n23j409
766e78R04j47j150N06K79n26O18p41j55O10Qn66J215m94p98J517L72j634J077
785C17J273j778K71J469j457o92J951n61j166P63l10r76P51L68q76l93K41l57
$$ y = [3068, 3688, 2718, 1577, 2912, 3479, 2706, 2133, 1024, 833, 1987, 999, -391, 261, -277, -969, 1367, 702, -2342, -1629, -689, -1718, -52, 1034, -1582, -1512, 56, -556, -25, 494, -770, 47, 1029, -385, -443, 301, -798, 483, 2689, -407, -1489, 244, -976, -1208, 2112, 226, -1977, 89, 726, -1223, 388, 1178, -761, 572, 1852, 374, 262, 1065, 319, 1308, 1851, 800, 984, 1548, 323, 1534, 2030, -509, -185, 1710, 105, -579, 1084, -1049, -1799, 456, -99, -1866, -430, -857, -2262, -678, -184, -1570, -381, -384, -1120, 136, 436, -481, 814, 1408, -113, 868, 1588, -134, 647, 2555, 657, 235, 1815, 512, -385, 1354, 831, -578, 326, 179, -971, -465, -186, -712, -94, -835, -990, -380, -372, -938, 277, -217, -1015, 502, 874, -760, 317, 1590, -188, 83, 1552, 95, -597, 1354, 793, -373, 390, 80, -896, -145, 223, -653, -1046, -805, -1162]
803a162L49j50j32J53r4k08Q94k8p97M90Q89p44O28Q75j077L2R04q2n33M46k30
824D23j0N5L2m98J42k68N12N04j109p16N40j77m2J192q37j107R47M90n36L43O59
845E39o84l4J246m26o10j07M63K33J43K8n78p27M82P30n02p30j48N06p25M58L4
866d09j236o5J156J65p10K93j81j57J027M01j82m79N68M10J29J00l32M93M92J7
886A500qn80m11K91Q62m33o18j87m85M5L59j89p43J1J28k11l30K17l05m71O56
907i02O26l03n36M92L75k77N80M13r53J05P80K45m15k04L79l55J70M97m24p66
927d73M94M26q4l21O1l5k30M38O59p58k62Q16J04j92K89j26K1O4R18l35q96M3
949F21N89j05O1k38p09p7J86J56j91n74l17K05n09j48l9k74k9N45L10o07P2N82
$$ y = [-1162, -813, -963, -1095, -942, -1036, -1244, -350, -378, -1175, -685, 204, -540, 88, 963, -114, -82, 822, 740, 207, 653, 423, 413, 468, 500, 2, 144, -124, 388, 892, -217, -933, -393, -570, -612, 580, -257, -1364, -417, 73, -463, -120, 539, -145, -179, 1067, 641, 31, -76, 387, 620, 763, 791, 213, -514, -32, 698, 196, -534, -682, -176, -901, -443, -409, -1645, -1710, -554, -389, -1099, -806, -987, -1144, -117, 284, 102, -377, 191, 601, 730, 830, 498, 991, 1483, 1500, 1492, 912, 501, 792, 1654, 1221, 603, 416, -69, -24, 335, 146, -597, -586, -458, -669, -999, -782, -1087, -1558, -902, -276, -579, -1115, -623, -248, -525, 55, 468, -485, -380, 400, 645, 230, 26, 405, 50, 220, 717, 293, -473, 21, 447, 363, 42, 103, 68, -162, 276, 935, 177, -85, 731, 835, 643, 932, 806, 827, 891, 1809, 1474, 578, 621, 1210, 1105, 1166, 928, 219, 142, 328, 484, 293, -281, -598, -393, -902, -1050, -1089, -1363, -1392, -847, -537, -1144, -1072, -490]
971d90k58M78K95j97q4L74P81J65n05L74M71k32M95J46o40m70O71Mk31q5J68p10
993E20j28M28l77m40J68Q3n93j44L05j1k97N98N0p41Q0K90L24PP1J65l25m9L54
1016C38N3k97J72R1l66j47L54p9j74j34K60k73j06M61pj89L08K52o51L56M37J82
1038H41J04p2n1%K8M04K13m68M1K13m74k69N87l01n87k7J37o90j11L86m50o53
1060a199L93j68k75p8K95j23j74K60K00k11L00O70m8l19M85J39p9L33M82j7m74
1081C92K99Po1L15J28p50l66N26O9k42k6l25J58n13J25J71O4k87J22P1o12K14
1103e21N57J65j87J67m58k37M05N89k62m63M74m16l10N75j7m49j68o5k5j47P9
1124g14L41m77J01L96l52j72O21K6j18J85O0R5m7P71J54o26M04j9k1K35K89j88
$$ y = [-490, -748, -270, 25, -172, -256, 118, 899, 1064, 559, 933, 1404, 1172, 1667, 1813, 1173, 703, 1374, 1378, 1147, 1062, 1230, 520, 392, 820, 443, 3, 171, 254, -339, -483, -178, -189, -486, 112, 162, -579, -499, -209, 115, 122, 193, 358, 33, -16, 338, 391, 94, 266, 357, -9, -156, 198, 119, -55, -189, 71, -202, -308, 153, 146, -43, 265, 517, -134, 222, 659, 841, 945, 873, 822, 822, 850, 1254, 1467, 999, 1040, 1253, 779, 510, 1097, 796, 209, 182, 319, -371, -482, -96, -546, -1199, -806, -974, -1249, -1327, -1032, -1155, -1329, -1069, -869, -1080, -780, -110, -158, -477, 8, 147, 68, 401, 883, 866, 392, 691, 698, 637, 952, 1080, 330, -36, 490, 559, 317, 291, -34, 124, -389, -264, -93, -29, -316, -194, -123, -735, -521, 36, 201, 14, 181, -277, -514, -109, 480, 218, -245, 229, -187, -497, 78, 61, -388, -556, -621, -646, -793, -714, -373, -850, -749, -353, -705, -877, -256, -230, -348, -163, -103, -8, -55, 716, 870, 244, 648, 629, 608, 843, 1132, 944]
1146I44k30r2K6n8m75N7Q9k12n64l1L5l61M73K0p04J74O5j52L37K77l25l62O14
1169d55rJ69K97Oj5o2K34P9O99n83k26L80k49j39K89k21l94M70l35k06K8M57n16
1192c02J6K71n45J26K61l5J14Q9mM7J27J65L17p6m86J79J35rl05P50o47k84M86
1215C90l03o13L71M43o52m2m5j77k7N77n08j72J00n8L60K61k83M75j12j30O72
1236E27j06j50M1J83Lj42L54k74j04J51R4n51L88j91k44n0r5L3l07j69K39n2j10
1259e32Q8q2j5nN57J39n90K92N18m51k5N43J16k64J2J51q1p8m8J84k22k31K77
1282B53o70K60J77j1m78j5K8k48J73J82N0l82L94J27j46l3M51j08r5L56J14j9
1304C60j11K54m1k85J77K47k81p9K60l23o4k38n8j87J85j62k5k47J53M3N6p6Q3
$$ y = [944, 714, 622, 648, 590, 115, 172, 261, 49, -515, -546, -511, -872, -399, -379, -1083, -909, -844, -996, -659, -382, -707, -1069, -455, -464, -295, 2, 8, -7, -69, 165, 244, 943, 360, 134, 514, 265, 126, 415, 194, -200, 270, -65, -271, -243, 214, -302, -286, -15, -560, -434, -173, -208, -94, -5, -9, 38, 165, 330, 647, 571, 85, 264, 399, 390, 85, 835, 188, -96, 390, 87, -526, -155, 288, -364, -406, -451, -628, -655, -78, -586, -758, -658, -716, -356, -95, -378, 97, -15, -145, 527, 421, 271, 312, 495, 498, 356, 710, 436, 332, 483, 577, 26, 414, 223, -21, -71, -166, -133, -440, -609, -370, -422, -532, -444, -526, -541, -546, 11, 150, -440, -148, 370, -81, -106, 437, 553, 289, 301, 452, 371, 293, 245, 429, 207, -24, 253, -417, -157, 20, 9, -469, -484, -456, -704, -531, -349, -299, -681, -287, -160, -306, -339, 112, 4, -91, 265, 379, 360, 249, 503, 462, 177, 354, 601, 320, 241, 501, 178, 114, -124, -182, -369, -184, -346, -371, -618, -465, -422, -366, -442, -359]
1327c59m5K20j79L90p7K72j21j16M11J28p5j89O7m1J8k39L2Nj07j19J80j60l00
1350d04JJ73k94j0K43j29J0J00K63l27j46M41K94J85L3k77K09LM21r8k56K10k5
1373F20J13k07l17J06k89Q6l9l86R3o6K70p75L37q9R3M2o0q8J5O6J57r3Q8L73
1397E0J53k20P8K97j87k16M72j28j79L08J32l46j44K81j98l3l8k5j64l82K85N8
1419a46j70Q6n3K22j18P6K67l98K49L17j70O0M4k33J50J08O3j32j60R6k94m3K61
1442H2j54l95J03m3k14R2K6j74L04j99r7j1L70L1j32L42l43L31P7k6M7K28P2k5
1466B92K39q6j30P4J62K14m70j1p5J5J1m04k6n7j8K04j58k87K95m53N5M04O6j46
1490b90PO2q9K59L0O9j03K1K98m62M40j12l17M50p1J04l12k98L92p6k02r9L09
$$ y = [-359, -404, -184, -363, 27, -50, 222, 101, -15, 396, 524, 449, 260, 327, 286, 304, 65, 97, 102, -5, -124, 56, -104, -404, -403, -230, -524, -534, -291, -420, -410, -310, -47, -374, -520, -79, 215, 400, 433, 156, 365, 368, 789, 691, 435, 645, 620, 733, 526, 209, 315, 26, 112, 73, -313, -220, -286, -16, -791, -454, -543, -450, -408, -468, -556, -541, -475, -318, -411, -323, 50, 203, -17, 61, 358, 171, -45, 427, 299, 120, 428, 560, 214, 70, 351, 153, 120, 82, 57, -107, -489, -204, -146, -316, -230, -283, -61, -179, -103, 164, -234, 15, 332, 162, 222, 266, 33, 183, 291, 354, 222, 62, 158, -136, -179, 82, -72, -467, -364, -407, -621, -529, -503, -677, -373, -572, -669, -680, -310, -279, -411, -69, -412, -81, -4, -30, 17, 245, 317, 292, 531, 445, 315, 389, 551, 765, 295, 284, 209, 224, 235, -169, -195, -252, -270, -66, -224, -511, -216, -669, -614, -210, -144, -290, -283, -221, -310, -51, -21, 48, -55, -34, 264, -198, 242, 130, -187, 263, 192, 296, -16, -314, 78, 2, -200, -299, 10]
1513A0l09j58L61j18K20J7j00j91J54P5kO2K00k31K81J17j36O0R8k15j2K11k32
1536A62m2j42j66J22J82m43j09K84j18k92l6J13j74L21J4r3J55J57l01L26Q7k47
1558b40M98k67L36K38m21K63J5K60l70J33J06J03n17K61j30k63r7P5j02k2o4j92
1580c97m0J78J7k21L14q1K8M8J25J22K04m04K87J57KPj48r2L6J78O2l91K13j16
1604H8L8j9j2l71R3j31Q3jK1J94r9j59J14j75Q0J75J39K97l48K22J41j66Q3K28
1628E15j61J12P0j02l33P6J38j51j20%j50k4Rj96O9r0o5NN3j20M84k42k46L91
1652g8o6O5M3P6j70L16J25k24K1O3R1j44K29O4r8Q0k77k59K14j22k36L50m8k84
1676b69L8J37k94m4K73j66J67l9Q7j6P1J67k15N54o8j60p7J33j29Q9R1l8m4J34
$$ y = [10, -299, -457, -96, -214, 6, 23, -77, -268, -114, -39, -41, 21, 221, -10, 271, 388, 252, 312, 410, 195, 183, 394, 162, 120, -22, -188, -66, 116, -327, -436, -152, -270, -562, -598, -485, -659, -338, -324, -417, -262, -105, -406, -80, 7, -240, 258, -9, 327, 565, 144, 407, 422, 682, 312, 445, 551, 654, 137, 398, 268, 5, -92, -17, -119, -141, -205, -397, -437, -259, -242, -463, -149, -230, -202, -154, -29, 93, 297, -107, 180, 337, 339, 346, 198, 106, 142, 320, 382, -9, 204, 88, 126, 107, 95, -276, -183, -314, -231, -232, -211, -17, -116, -275, -161, -336, -256, -81, 58, 355, 7, 229, 370, 204, 287, 515, 354, 466, 536, 434, 101, 177, 315, 164, 44, 44, -106, -130, -121, -317, -248, -338, -403, -398, -345, -465, 19, -223, -469, -78, -144, -79, -36, 40, -130, 186, 311, 87, 108, 171, 262, 118, 347, 411, 313, 393, 116, -143, 71, -51, -287, 63, 15, -269, -231, -94, -388, -432, -159, -325, -158, -197, -110, -126, -55, 112, -103, 451, 383, 223, 146, 279, 150, 239, 330, 292, 248, 382]
1700C82l55J11l95R6Oj49j48K52o4l02N48k86jn0L76o6k13O5K94k29L10j90P1
1723F3K13o5k1K40J0k56J52j74O3j00k32j12J32M2k32K32J57l96M2j30N2k0K30
1746a10O3o8j42N3K19M3r5K01J49j29L8M2L1M0Ko9l4l7Q5l76L0K19m90J13K58
1771C6o28K36m7J33n2j36L19k84k7L98j3j00M7o6K15l2J88O3K28j34P8j11N7m
1795C64K52o01k04L72l23J8qJ01k09M3L8J50l84j42L99j73J95r3k2J02J08Q3j28
1818f2L64j64J80m6l2Q1L9Kj49j61J24J77n00K30n5j45q2n3K0K0J38j46m6J52
1842a14j27j1K66k9l8O1j40K51K19R3j28J17J48m08L11k06k35J84M7k30J50k7
1864A54o0l39K48j57j01O0M3k75L1l0L5M14j19k69L13j00J33M8j37M37j70R9L6
$$ y = [382, 27, 138, -257, -161, -155, -304, -452, -200, -264, -566, -18, -304, -305, -355, 21, -45, -258, -193, 101, -128, 182, -8, 63, 276, 211, 190, 430, 440, 184, 336, 162, 225, 125, -107, -219, -87, -45, -277, -45, 112, -284, -242, -372, -320, -340, -110, -47, -115, -257, -204, 15, 58, -37, 164, 313, 184, 222, 264, 295, 335, 337, 268, 234, 197, 282, -94, -64, 155, -335, -222, 36, -592, -356, -403, -270, -322, -458, -139, -423, -450, -52, -65, -165, -118, -184, 31, -1, 187, 250, 478, 344, 422, 311, 368, 364, 616, 15, -189, 183, -140, -122, -130, -29, -238, -195, -157, -7, -391, -533, -134, -307, -112, -205, -227, -125, -17, 66, -62, 302, 138, 318, 272, 240, 321, 360, 362, 213, 52, 176, 353, -147, 83, 28, -117, -199, -252, -232, -212, -74, -220, -266, -114, -241, -252, 14, -15, -53, 8, -132, 119, 338, 431, 303, 420, 568, 160, 471, 265, 30, 214, 261, 31, 181, 154, 94, -245, 3, -154, -255, -195, -152, -427, -396, -426, -391, 23, -96, -365, -52, -152, -19, 29, -108, 329, 159, 258, 294]
1887B94o2J1j62K95p0N7k00J44k01M2Kj14N1l37j28J80J0r0N9J04R6l75L87k38
1911b45J24j17L24l31M46J43j71J47j14P8K30n33K68J35k42l97L37l8j89k3J39
1932b9N9k04J01m22M13k88L11k28L1J94K1J23k29J50J82OM7j23J40P1k21P9jP2
1956B55M4k48K46o08L48m0k92J19J34J07k07q0qj22J53J66o8j54j97L24n2K61
1978H1N3O2n1M2j12O4r4OJ29K01k69k32K01j00J41k74L43l00Jk4j00j2j81K93
2002a32l05L34j15o2J48M9l1M53m15J76L28l1k4N1l8l47K03j78J99j02j98L72
2024C35m90J90k70K05k2k50l9o7K20p1j1K6Q5rn0J83j42J05K51j16j39L43r9j91
2048b3K70J41k40N8L64k26n7j96J9k2n8O4k46R8j53R0j1J7j60L07m0o0j32qj78
$$ y = [294, 232, 243, 81, 376, 306, 363, 163, 307, 106, 148, 150, 36, 87, -250, -378, -198, -188, -278, -219, -115, -19, -394, -7, -245, -121, -238, 86, -245, 201, 344, 173, 320, 206, 284, 514, -19, 249, 384, 142, -255, 82, 44, -145, -168, -29, 30, -174, -73, -495, -82, -370, -59, -287, -256, -62, -41, 82, -147, 3, 185, 191, 238, 115, 255, 326, 105, 184, 183, 255, 299, 51, 297, -311, 37, -3, -295, -176, -42, 65, -142, -222, -230, -352, -199, -33, -101, -255, -452, -128, -180, 81, 134, 196, 145, 187, 75, 139, 45, 51, 180, 381, 112, -120, 81, -19, 122, -152, 191, -109, -108, -132, -232, -244, -425, -132, -437, -103, -218, -280, -132, -83, -114, 339, -76, 100, 428, 397, 373, 424, 386, 39, 242, 64, 263, 161, -37, 335, -155, 35, -235, -30, -52, -302, -341, -408, -188, -259, -270, -244, -159, -168, -218, -35, -177, -72, 179, 63, -76, 267, 168, -23, 247, 388, 148, 206, 570, 344, 287, 91, 110, 88, 30, 94, -152, -54, -207, -117, -128, -111, -271, 36, -4, -64, -196, -204, -382]
2073c82K13R7O4J58j14J53o4L6K55j21r7r6J2Q5p0j35o0J62N0K2j58l29o5L20
2097f4k36N9J34J2p2J36k57J7J75J78k03R8L2q6K97o1pK8k09J44J5J23k04Km6
2122Ek4J1n7L6k43K93j16p8q3Q8M4oQ2k30J40Q4m4n1J94K51m04J09K00j1P3j20
2148A43K23j56l06J42N5qk31M13j78l35K26l42J93L2j95l0M9J19j9J50k44K49
2170e0J51l0j12J18j59J80J54K7k22L22j25k44K06J56m61K11j16N5p7Q0l51J62
2192a25Q6j13j16k5K67l29L52P7j67k0m8J91j4R7q6L08j38j85K93j10j52J29O7
2215B39j2j59J11j30k9j69J42j4M0n01M48J04j19k00J95n6j32P4J14K5n8R9j19
2238a07K07m7m5L41j36j30R2J36p9k75R9l2R5j80L9j02J24j06r2J06L1r6J56l14
$$ y = [-382, -169, -72, -8, 150, 36, 189, 125, 161, 416, 295, 198, 102, 114, 199, 129, -6, -66, 96, 146, 168, 10, -319, -384, -64, -300, -241, -107, -95, -167, -31, -288, -271, -96, 82, -121, -23, 9, -77, 220, 159, 152, 180, -29, 115, 130, 253, 49, 51, 5, -19, -8, -65, -29, -272, 21, -95, -173, -256, -168, -124, -130, -48, -278, -138, -54, -98, -149, 45, 296, -108, 1, 201, 190, 263, 143, 366, 210, -96, 46, 101, 93, -138, 275, 97, -238, -12, -354, -161, -129, -324, -354, -305, -186, -205, -55, -299, -50, 101, 71, -41, 77, -82, 98, 252, 279, 57, 379, 254, 10, 216, 372, -89, 122, 6, 61, -16, 64, -287, -125, -39, -152, -268, -293, -26, -355, -3, 74, -93, -113, -161, 30, 16, 113, 27, 335, 197, 12, 305, 195, 43, 172, 239, 227, 68, 179, 49, 20, -149, -7, -21, 19, -482, -34, 70, -49, -249, -54, -110, -242, -168, -54, -29, -87, 12, -107, 100, 53, 8, 349, 213, 83, 175, 311, 232, -43, 56, 24, 119, -61, -22, -124, 0, -106, -198, -92, -61, -157, -1, -315]
2262c15N0L18j96Q9J56o7J6LJ74j94J68nj08J93l16K75l0n6P0r3J09k76J64k46
2286a17P1j11J20m9j20r7l3Q8R4N9r9J12o8K12q7L6q3J90K7R3N6j02k32M85j84
2311B61k6k4j87P3j99L17l12j83K23J78l54O1J07l57J37J02R0k5j5m8J51lJ21
2334H8J9r2K21j13r8J28k3K9Q6k39J01M8N5k17P8J4k68K14k87K4M0o7M86l02L5
2359d0P7j83J83j85j4K23k06N9M7L31k29o8J29O3n7J99l89J27j07L4K65j82l1
2382D6O7j63O7k04k7j84L09k69L70j97M0K02j88J23q3J06K1J35j39K06j77K39
2404C00o4J8j81L53n11K54j00lL0J80l95K9J39k2r7k9j23O5o3J35j64O4Q4N7K0
2429b4J58j49L04l24L53k48p7J90j57R6J47j28j11P1l1l6j27R6J00o4j09L4l00
$$ y = [-315, -265, 53, -143, -54, 102, 35, 51, 54, 228, 34, 202, 197, 89, 282, -34, 241, 211, 155, 225, 132, 241, -35, 129, -117, -46, -157, -37, -86, -206, -303, -336, -248, -154, -95, -194, -82, -150, 62, -25, 11, -72, 118, 145, 238, 294, 192, -40, 445, 261, 235, 211, 24, 97, -102, 215, -97, -280, -57, 121, -233, -172, -65, -422, -285, -183, -93, -118, -133, -181, -30, -33, 88, 107, 15, 236, 123, 25, 153, 130, 159, 245, 6, 107, 155, 210, -7, 71, 85, -183, 31, -256, -232, -192, -259, 227, -75, -40, 37, -146, 37, -148, -162, 61, -145, -86, -39, 292, 63, -5, 124, 187, 130, 329, -60, 67, -40, -6, 259, 77, 46, 113, -50, 17, -187, -214, -398, -89, -358, 12, -185, -145, 57, -131, -8, -91, 15, 36, 171, 32, 238, 61, 300, 236, 254, 73, 426, -85, 169, 69, 66, 96, 276, -119, -90, 49, 27, -70, -99, -222, -157, -220, -85, -249, -185, -101, -44, -24, 134, -15, 289, -35, 318, 70, -7, 183, 26, 122, 269, 141, 30, 101, 70, 34, -93, 3, 103, 39, -70, -36, -336]
2452c36J12K31m1j84k4J99k51N3J34J10L5j27O0j29L15n3o1R4K08l12J24Q9k01
2475D5J74q4k07J71j36J9j84L4q2J64N7k29J38l70J29J87P7J78o7M0j23K20p1
2498H0K4r2L7k5k43M09p8K7r5J60J3k84rJ33L4j56j91M69n03j9L29j24J54k18
2522a68Q5k03L56j26J17m1LN9k8k1m6J24P6j20M3j34p4L42m52L43j01j23j44K30
2546cK9k19K64k28J08p8J37j27r9JJ04K9J56q3M4O4N5mk20L34j33J82r0M1k18
2571D6q0R1J29L3l42J84k15j95K47L5J37l30R3k9j22J74J4jk2K09j27J35L2j16
2595b0K55l0j65J23J0J09J9l0qJ8k16q2J72J04m26p6J07j32P7l6k4J69j38J24
2619i6J84r1j84J08kJ99j60Q3J51K9l3j05J06j69k3R4L04k07j94Q6j05J62l00
$$ y = [-336, -224, 7, -34, -218, -242, -43, -294, -241, -107, 3, 38, -89, -29, -158, 157, 104, 43, 137, 345, 33, 157, 246, 45, 219, 135, -72, 99, -37, -18, -202, -168, -250, -86, -29, -258, -120, -490, -361, -174, -97, 81, 14, 54, -69, 151, 80, 104, 12, 49, 24, -219, 190, 112, 139, 44, 204, 217, -67, -76, 57, 91, -65, -256, 213, -290, -309, 20, -104, 50, -168, -83, -286, 70, -56, 61, 20, 23, 82, 54, 33, -13, 111, 187, 67, 110, -24, -98, 244, -208, 135, 34, -89, -233, -3, 26, -193, 71, -157, -49, -127, 10, -117, -216, -215, -111, -82, 74, -9, 35, 99, 154, 150, -70, 264, 131, 313, 223, 264, 46, -34, 57, 186, 219, -123, 61, -154, -349, -102, -67, 70, -260, -167, -196, -318, -144, -130, -131, -153, 56, -71, 64, 96, -20, 235, 205, 40, 163, 173, 282, 301, 271, 263, 281, 65, -17, 155, 259, -167, -243, -136, -268, -191, -227, -251, -82, -220, -96, 88, -3, -187, -79, -81, 118, -42, 41, 192, 221, 188, 83, 189, 20, -3, 91, 395, 188, -6, 80, -25, 137, -163]
2642a63K0K4R7N0j57J30K7k15l7J39K19r5J08R2l36M9K94j65K9l4K8L2N1j16J78
2667B49k30J00k07J20J47k5o2l93K92L9j01R3n2j67K22k16M3j41K25j11K18J20
2689A63p5o9R9j75Q9K17p8j64m8K49j33J93l42j7M07l25M6Pk89K17j38K43k04
2712a27p9Q4j00J37J44N6k53O1j4j0K3n8K29O6r6J14m5Qjr0o2ll8J46Rl38K34
2739cr2R1j13j08J67j43N8j15M5K34r9R0J55j04k34K61l2p0r8K28K68k57L1L5
2763A95K15m05K68j22j02j2lP0l03n6J46qp7K30Q0lm35J83J8o6O6K61j64K53j41
2788H8R8M3k52K50j17j89K27m1K09m9l63J78j18R4M9l26J66k30K85k46k19J88
2810b75J43j20M0K27j36J75p8K16J88k91J41k06L57j74m3m6r0m2K43j06J18l18
$$ y = [-163, -143, -119, -22, 28, -129, 1, 28, -187, -224, -85, 134, 39, 147, 239, -97, -48, 246, 81, 110, 76, 104, 136, 187, 71, 249, 19, 119, -88, 32, 179, 154, 92, -301, -9, 30, -71, 22, -30, -197, 25, -191, -148, -289, -64, -175, 43, 163, 88, 19, 118, -57, 32, 249, 171, 7, -41, 208, 75, 268, -74, -91, 316, -9, 37, 44, -245, -28, -166, 77, -127, -206, -122, -222, -85, 59, 115, -138, -77, -91, -101, -78, -136, 93, 159, 63, 177, 132, 140, 139, 49, -13, -16, -54, 92, 101, -237, -3, -95, -4, -117, -225, -58, -201, -143, -258, -213, 21, -78, 12, 167, 63, -171, 90, 58, -12, -110, 118, 386, 129, 160, 195, 410, 5, 273, 151, 49, 37, 34, 104, -199, -255, -109, -117, -194, 36, 116, 113, -322, -139, -121, -187, -121, 140, -24, 229, 88, 186, 229, -23, 227, 110, -79, 148, 107, 316, 267, -96, 82, -36, 58, 107, -219, -53, -283, 2, -244, -463, -275, -132, -252, -212, 15, -121, 54, -24, 192, 380, 89, 230, 24, 381, 207, 164, 118, 28, -14, 229, 123, 241, -77]
2832g7J24j15J81k85N0J39N2l39KJ74L01l14j27N3O4M3J19q6r8J48M0m7k17J81
2856c4k1K06r7J12j06L0m5P4Q9j55q6J24j61l9K59P5r9j87J96l7l24K20l0q4K2
2881i8K28q3J18r7n9J66l4k84K96j99L96j10j73j0J46q3k24K23j36nj97J95R2
2904F8k04Q7j55P1j31J28j49j1MK12R2j00K18k7l8K8J1o5J97j88N1l1K08Jl53
2929g6R0q5J57j1Kk88K60J0k79K10J6K9Ml29L01Q6K2J58l67p4L17m9K61l4m01
2954g0K37k37J48j93K17n7m7J70p6j52Pn6O5J9Q7j47K9Mjj08J38k14R9K93k36
2979h1J44r8j08K86l4J59k29lJ32j78J71k04J47n4R1k82K67k57j07J41N1K0J34
3002A08l53L73r9k34J9K31q4M3k2J84j73N6k05L11M3J21k48R4j04PO5J21l12p2
$$ y = [-77, 47, -68, 113, -172, -122, 17, 69, -270, -268, -94, 207, -107, -234, -181, -117, -74, 45, -41, -139, 9, 49, 2, -215, -34, -55, 151, 54, 166, 60, 90, 45, 119, 208, 53, -33, 91, -70, -109, 150, 225, 126, -61, 135, 98, -226, -6, -36, -120, -98, 130, 47, 165, 68, 9, 175, 141, -143, 153, -46, 350, 240, 67, 57, 203, 120, -104, 119, -17, -22, -219, -24, 68, -136, -49, -204, -133, -264, -136, -285, -296, -292, -80, 12, -88, 130, 103, 65, 93, 104, 39, 236, 48, 99, 68, 276, 277, -76, 14, -71, 86, 75, 77, -211, 49, 59, -220, -10, 6, 35, 39, -290, 11, 97, 119, 277, -90, -164, 153, 104, 365, 331, -70, 167, -70, 78, -115, 102, 45, -2, 168, 92, -60, -53, -109, -44, -25, 62, -85, -56, -52, -53, -161, -23, -237, -138, 155, -81, 63, -35, -143, 143, 109, 268, 39, 36, 168, -10, 161, -43, 104, 50, 141, -141, 126, -131, -238, -97, -46, -26, 108, -245, 128, 29, -205, -186, 45, -39, 4, -18, 166, -7, 49, -156, 155, 198, 319, 71, 165, 61, 68, 133, 254, -58, -130]
3026a30L55R9n12L17j77n5m8L4k16M68l5l0p9n3Pl30L03n0L71j72J2m0L06k88
3050E7l9j58k3J41j89J72R3l8p4R5M3J80k57J7o7j97J08n2J65j17J00J00j40K9
3074e1R8j16K35k17n8J20L3k69L17J4rK16j90J39O8m04J40J2J47j07j25p3J65
3097H5j34MPJ96q7k04l9K01l7r1J16l7jj43m4J17K05Q3k8M5j10O9O5r7m2j00k3
3124b4Q7J40k03N0k50K34J14j58J57k16m1J94q8k50L17j05J12JJ24j65K02k82
3146e0Q6j29M6j1q3K81k46K70j25N2k67J73j79J94k28L96l79J68j38Kj28K49j45
3169a91l8K67k95L33o1l3o5N4Q0LJ73j40j15l0K21j89j61K56p6k56K49K69j32
3192A23n1Ql12K27L23j46l94RK14l03J68K34r4j00J92J7q0j25J91J98k27n7K41
$$ y = [-130, 225, 324, -188, 129, -48, -103, -151, -117, -333, 135, 100, 70, -9, -62, -55, -385, -82, -132, 239, 67, 79, 39, 345, 57, 18, -140, -163, -22, -211, -39, 54, 16, -58, 37, 80, 260, 3, 20, -47, -244, -136, -188, -23, -140, -40, 60, -80, -51, 47, -69, 166, -51, -109, 11, 44, -225, 92, 106, 97, 313, 123, 262, 330, -74, 66, 78, 225, 118, -7, -80, 85, -49, -45, -38, 158, 71, -133, -172, 29, -8, -99, 17, -20, -21, -164, -208, -91, 114, 197, 169, 214, 104, 173, 238, 141, 99, -1, -24, 63, 203, 0, 50, -200, 34, 148, -10, 147, -69, -110, 84, -4, -254, 63, -42, 70, 71, 195, 30, 232, -50, 36, -93, -47, -58, -141, 140, -106, 164, 39, 91, -176, -3, -182, 12, -216, 180, -199, -31, -169, -167, -295, -46, -191, -229, 38, -257, 76, 15, -18, -83, -29, 51, 54, 227, 87, -28, -58, 163, -26, -187, 69, -7, -263, -14, 255, 123, 72, 80, -232, -5, 318, 172, -222, -213, 1, -302, -134, 100, 6, -94, 98, 115, 35, -90, 101, 299, 72, 15, 256]
3215B56l04M0KK03k18K5N5K7j67j18o0J74R0M6j79J09M3j92J40l22K64o8j64N7
3239b61L05k52K90j77J86kJ3N4k12R2k86L44j80K9K52k3k11P2k12K63k07J27m9
3262d5J99l24J08k32N14k91L9L42l89J78k2J5r6j15J84Q3j0j7n2J08j94K00o6
3285A17k51Q3j89K68J15k53J20j64J23q7P2J28k80J14K55k71L74j89j39J81j76
3306d9k5RL17k72n7j97K10K07P6j16M8j39r1Q4p7p2J53j87J19m3J26j70J67j3
3330Hk55K20j69J44k1J0P5j5K01j56lK43j80j05R7R2k24r9L18o9l76J54J87m9
3354B8J00k50J0J22M7k73J93l5P6j79j84L66k74M32l47K02j55M57k81J3J9j64
3376g7J0o1K10n6rL2q9J10k1J20j88p5L07k72M1J99j10j91O9K8l28L02k3o8j93
$$ y = [256, -48, -8, -6, 197, -21, 4, 59, 86, -81, -199, -259, -85, 5, 51, -128, -19, 24, -168, -28, -350, -86, -154, -318, -261, 44, -208, 82, -95, 91, 89, 102, 156, -56, 36, -250, 94, -86, -57, 195, 172, -39, 33, -179, 84, -123, 4, -45, 154, -170, -62, -294, 220, -71, -32, 310, -79, 99, 77, 92, -4, -119, 65, 148, 138, 121, 69, 177, -17, 183, 117, -134, -51, -240, 28, 143, -110, 10, -154, -31, -118, -46, 82, -198, -84, 171, -100, 274, 85, -54, 127, -49, -74, -65, 252, -20, -77, -274, -64, 143, 219, 103, 151, 12, -79, 5, -72, -144, 9, -178, -59, -102, 24, -146, 21, 8, -247, -27, -196, -52, -73, -63, 12, -3, 198, 42, 39, 282, 102, -3, 94, 186, -38, -137, 181, 112, -264, -110, 77, 28, 128, -122, -112, 10, 57, -216, -23, -58, 18, -161, -345, 21, -253, 179, -168, 34, -121, 336, 55, 68, 87, -77, -67, -128, 82, 26, 17, 49, -40, 70, 49, 169, -19, -94, 213, -59, -18, 181, 71, -120, -51, -23, -351, -49, -72, -140, -333]
3401c33M31n8j58L13j84L44l64o2r8K67j21nj39M23k41o8P2kj61J42K8j26J75
3424G5j27j77J89J26j24L3M6m0k28P9J16j32K36j0l04K82R1k40K95lj80R7j68
3447f8J28L1r5R1j66mk6OQ7M1p7j7k63K15j12J38J31j03M9N6k02K98r2k08K68
3472A06n3J18j77K0p9K77j14Q4j62k2K14r9J8j73P9l13L22l43J18J82Lj42L7K00
3496A01j81j61K10r3L4pK08k11K44R8k48L53n38M02j67Q0k54k2Q2l8p3K23J4J2
3520F8j16j93O8O1NJ39k51J46J09k14L34l4k47J98k03J8K00p0n5J45j84J8j35
3543a93J82N5l0m5R4j0kl12L99j39j02K55l92K26j04J73N9r2J17j1j26k18J08
3566a08K85j24p0L16l61L06j95O8K25m18l8J4J13j25J17j41N3J59m21L57k2R1
$$ y = [-333, 98, 40, -118, 195, 11, 355, -9, -71, -169, 98, -23, -28, -167, 256, 15, -53, 19, 17, -144, -2, 26, -100, 75, -52, -229, -40, 86, -38, -5, 41, 1, -227, -148, -32, -164, 72, 62, -242, 40, 131, -109, 186, 183, 3, 100, -68, 60, 91, -4, 87, -79, -83, -109, -103, -16, 25, -52, -69, -332, -117, -229, -91, 40, -63, -14, 42, -160, 138, 46, -162, 106, 53, 171, -6, 14, -65, 212, 98, 182, 20, -2, 212, 113, 131, -42, 37, -276, 46, -297, -179, 3, 6, -136, -99, 101, -80, -241, -31, -124, -90, -97, 111, -100, 144, 242, -6, 347, -191, 211, 44, 124, -130, -152, -70, -108, -181, 42, 56, 68, -48, -241, -173, -112, -107, 32, -219, -73, 36, -178, 156, 122, -125, 73, -130, -112, 88, 18, -37, 108, -76, -58, -193, -11, 44, 14, -31, 63, 53, 51, -261, 138, -1, -103, 152, -240, -14, -118, 55, 114, 22, 139, 128, 2, -216, -108, 177, 53, -17, 299, -62, 244, 49, 117, 342, -76, -114, -100, 13, -112, 5, -136, -83, 76, -345, 12, -10, 81]
3588H1j46K32m10pL10K8k67K13Q1p7k5k13K77K0J33J8l37K66j58MJ31k4q2j81
3612a33M47k99r3J68j74K50j84k1n7j30K58m7j60L22k23J33J08p2J07j95M4j89
3634a40O2J5J67p3K02j35l5j06K6J25j69L7k9K0j29k1K09j54NJ33k80J61m6K93
3658A38r1k28J58J72j70J70k57M04j17k38K4J71J03l04K11j84j8N1J77k17L6j66
3680a75K43j11J03j76K03j00k54K49K12l40J18J39n0j41J13k18L46j14l3j41J78
3701E1p3K0K40l31J22M0k58K2L17J02k51J08l3L3r2k9m3r8J85KL2k22K53j59j35
3726a97M38m0j26r1n2K69j93k22L26J02j04%jj48j1N5j8j82K79k90L87l07o7J73
3750b0l6J03k00O8K1J02ljO7Mj69P1j35K99m72L18J56k1l13J89N8J45Nl91L05
$$ y = [81, -65, 167, -243, -250, 60, 88, -179, 34, 115, 38, 13, -200, 77, 97, 230, 248, -89, 177, 19, 23, 154, 130, 48, -133, 314, 15, -78, 90, -84, 166, -18, -39, -96, -226, 32, -15, -175, 147, -76, 57, 165, 93, 200, 5, 49, -140, -78, -63, 104, 31, 233, 98, 63, -43, -17, 108, -61, -24, -53, -33, -162, -183, 26, -128, -123, 10, -270, -109, -155, 138, 47, -181, -23, 149, -21, 149, -108, 296, 179, -59, -35, 136, 239, -65, 146, -38, -56, -5, 172, -45, -9, -175, 68, -43, 60, -116, 87, -13, -267, -18, 194, -146, -28, 111, 61, -80, 33, -185, 161, 47, 14, -127, 51, -22, -2, 238, -93, 29, 69, -189, -167, 150, 252, 1, 109, 76, 109, 17, -12, -55, -153, 32, 34, 66, -156, 97, -62, -197, 241, 201, 75, -16, -68, 201, 8, -214, 112, 214, 110, 110, 109, -39, -50, 5, -13, -195, 84, -206, 181, -126, -193, -20, -56, 47, -153, -85, -64, 38, 35, 34, 101, 105, -64, 7, -128, 171, -301, 17, 173, 152, -161, 28, 86, 231, 236, -155, 150]
3775A50j85J71k50J98j50l2P7n5Rq1J78L2j14J67k20J01J81j76j44L06k55K31
3797A39j42m7L06k01j06M33m46R6j02Q3j55mM27l18J83k97J77k44L08q5O0J28
3819A93j86J42j6j53M6R1k36J58j04n7J89k38J89J83k81J71m4j55J86N6l67J17
3841a16R7O5o1p4K78j50j58p3K23l4j98L17J08j81o9M0j00K00k44M6K5R0O7j87
3865h9K70l58M70j20r2k8L5j60k62N43k62Lj27J3O0K10l62OL59M4k91J96r7j37
3889a76K21k09K78q0j27J20K2n1J73l21K44M5k44O1l3n8K68r6j09j0m9J88j29
3912g2r5K34N4k66j01O7L99k28k45L06Jj9m8O4N1k75OM9L30k45L8R2p4k25J80
3937b2j43K03l90M45kj28m4J10Nn4K36k03j42N3j08L33j55m1K52o0j09J44k26
$$ y = [150, -35, 136, -114, 84, -66, -98, -21, -76, -67, -148, 30, 62, -52, 115, -105, -4, 177, 1, -143, 163, -92, 139, -3, -50, 256, 55, -51, 382, -64, 32, -70, 13, -142, -146, 281, -37, 146, -151, 26, -218, 90, 5, 65, 193, 7, 149, 133, -20, 26, 117, -119, 39, -65, -122, 67, -171, 18, 201, -80, 91, 47, -108, 78, 134, -233, -116, -19, 46, -15, -89, 189, 39, -119, -192, 31, -3, -201, 116, 224, 43, -26, 14, -86, 114, -130, -84, -59, 31, 98, -89, 181, -177, 293, 173, 81, 53, 88, -72, -334, 209, -53, -50, -177, -164, -104, 106, -256, -250, 109, 153, -138, 58, -39, -176, 45, -164, 114, 34, -93, 27, 49, -2, 171, -150, 94, 139, -105, -44, -77, -135, 133, 37, -72, -82, -131, 57, -72, -167, 67, 121, -145, -246, -179, 220, -8, -253, 53, 54, 35, -13, 51, 102, -173, -167, -118, 212, -33, 5, 97, 23, -202, -22, -165, 38, -352, 93, 91, -37, -81, 29, 34, -20, 216, 13, -129, -76, -184, 149, -6, -47, 205, 145, 36, 180, -46]
3960d6J72k53N8L4J23j00%J5L4j6j53j74J86K82l21J91K02j37j19J18p0MM9k30
3984a51K94mo6L2j41K58l26J27O5j50P6p8J04q7j5J00k7J31j71Q1l48L25Qn9P8
4009E6k17ML12q4m09L12m9m5K23l0k27J26L9M3m9j03K33j61M7p3k5J56N4l26J81
4034a2q6J15J82m18K28k14J44K20m62M76j86j78J00J64j9j41K24p3on7Q5J53j99
4057D0j24K56m48L81p3l4P1mj16M7J54j54L8k70L83j20j10J15R1k84J12r3MQ0
4081e8Oj86K42L7L5l70J4L78j55j30K14J98r0k33k10L02P2J12k10j31j3o8J04
4104a40k56N42o3j62J8J72j21P4j91J52K0p7M7j82J34K28m3J4J1q7K08m60M00
4127B38k27P3k19pJ81J27l33J98j69l0K6K65n8j6q2O6K53l93L02k67j04J36Q7
$$ y = [-46, 126, -127, -69, -35, 88, -12, -12, 3, 37, 21, -132, -306, -120, 162, -159, 32, 234, 97, -22, 96, 26, 30, 79, -151, 143, 139, 73, 105, -36, 222, -104, 23, 88, -62, 14, -64, 40, -47, -62, 38, 11, 142, -29, 52, -296, 29, 37, -22, 56, -161, -157, 155, 71, -338, -26, -75, -120, 103, 73, -154, -28, 11, 54, 5, -98, 135, -26, 21, -52, -77, 79, 133, -193, -12, -98, 17, 199, -219, 9, -205, -61, 159, -303, 173, -13, -191, -91, 73, 54, -87, 137, 64, 58, 1, 86, 239, 40, -84, 172, -276, 105, 32, -2, 69, 65, -51, -4, 150, -4, 34, -236, 147, 27, -83, 32, 123, -161, -49, -142, -138, -58, -52, -238, 4, 41, 76, -294, -280, 98, -57, -187, 27, 225, 135, -98, -308, -6, 66, 178, -32, -163, -176, -244, -140, -396, 146, 83, -79, -61, 111, -10, 64, -127, 25, 45, -32, 15, -167, -33, 195, 152, 166, 177, 90, 298, -162, 238, 11, 84, -135, -142, 39, 166, -167, 31, -138, -168, -142, 123, 65, 49, -33, 33, 286, -107, 195, -72, -176, -40, 47]
4150D7j10R8J14K8J2k08q3n6K35k1QJ3j49R9j84l9J95l8k8j15J98r2J49k02J34
4175EQj66K97k28N2j53L96k55O8o6J52k9j13Nm8K09j3j54j11q6j25K65O3j3p1
4200a11K69n3m24M57k20K09q7p4j87L36Q9k81P1Q2l1Mj41O1k29K93J15Lj79J59
4224A31r2k58M38j86J36k92Q5p4K39k46L5ON0K4j66K28j68r1K02r5M8m2L21J02
4248C35l70J1N2M4k9j76K48j66O8j36K19Q4l07p6J70J12l18J11LJ17J53q6L2r3
4272Bn3m6j0J52j57K95j11q8Q3Q3o1k51J00L8K34L1l93L28k24K49k4r8j3J23Q6
4297B75k09Rk81o8K35K4k0K4j30J48k5L71k60j3J5K11m02J61K6l0K06j93Rk08
4321a25J27R6k63K00N6m4j06J32N9n4j43j68J45Q5O9qj9o2J00l63K23J07N1p4
$$ y = [47, -63, 35, 149, 177, 189, -19, -102, -158, 77, 56, 64, 77, -72, 27, -157, -196, -1, -39, -67, -182, 16, -76, 73, -129, 5, 13, -153, 144, -84, -32, -185, 211, -44, 24, -42, 110, 81, -32, -27, -75, 134, 121, -33, -144, -230, -355, -90, -27, -40, -111, 158, 105, -319, 138, -82, 127, 40, -34, -221, 115, 204, -77, -6, 76, 45, 49, -92, -31, -260, 33, 148, 151, -28, 131, 39, -219, 219, 33, 169, -123, -38, -112, 127, -119, -84, -78, -28, -4, -170, 58, -110, -201, 1, -94, -46, -88, 233, 335, -35, -24, 28, 72, 43, -133, 115, -51, 17, -119, 100, 184, -123, -199, -29, 83, -235, -124, -121, -4, 149, 63, 95, 2, -51, -97, -107, 45, -112, 183, 72, -16, 67, 150, 89, -162, -62, -24, 210, 241, -152, 176, -48, 201, 177, 79, 66, 189, 275, 66, 75, -206, -274, -39, -15, -35, -11, -141, 7, -18, 353, 93, 80, 95, 306, -96, 65, 91, 61, 267, 74, 83, -125, 2, 98, -165, 35, 91, 47, -59, 73, 132, 78, -65, -233, -88, -3, 66, 58, 39, -23, 77, -286, -63, 44, 95, 21]
4345B1Mr7O8K72j61l1J05j74j14Q8L3k6j0O3r9J66l65L09J03j82n6K7l0j20K06
4370@M7o0K13l22J73K11k74k8R1k1l8Q0Q3K3q0k7J10r0k22K60j89j71J25N8J16
4395F8k49R9R1N7Q0l45L21q7kK08k86j3o0J32N0p9j27K6K93k08qj08M17o0m59
4420b49L01n7j40K18j56ok26K68J32n4O1J8m13L90j87k87L11J83K6j97J59Lp9
4443A9N8j02J03K3k21J82l9l1O8k19L15j95N5K06l46M22n45M79k57L7j27K1Q5
4466io8j82M12l60J91M6k28K38k5n3J69l29P4K42j36J29J29k09j55J61J18k63
4488a08o4J46J9k03K12O6j86J89j83K86j31J82j3p0k65J68L8j48J24J3L6J11j01
4511A18o7j41R5J8R6k11P8j38K31j43Q1n9P2J24p2j87K9j9K95m13P1oK46J4j50
$$ y = [21, 25, -72, -4, 268, 107, 76, 181, 7, -107, -19, 14, -12, -22, 41, -58, 108, -257, 52, 155, -27, -83, -56, -86, -206, 0, 47, -13, 200, -122, 51, 262, -12, -40, 51, 30, -8, 72, 155, 178, 98, 71, 181, 91, -131, 129, -60, -231, -106, -48, 68, -181, -82, 9, 66, 146, -199, 122, 35, 33, 241, -45, -58, -118, 14, 64, -15, -142, -116, 177, -31, -39, -147, 270, 210, -249, 52, -5, -145, 73, -83, -89, -315, -47, 85, 31, 92, 110, -303, 87, -100, -387, -76, 107, 133, -64, 95, 98, 19, 77, -25, 78, 101, -120, 62, 23, -8, 60, -159, 156, -39, 16, 222, -124, 298, -247, 232, -25, 12, -115, -94, -9, -77, -259, 153, -207, -16, 30, -198, 40, 15, -38, 131, -198, -124, 118, -18, 111, 240, 31, -124, 37, 155, -108, -172, -26, -7, -210, 2, 68, -118, 71, -112, 174, 43, 225, 212, 142, -123, 45, 83, -65, 59, 72, 108, 219, 118, 51, -90, 5, 23, 119, -92, -14, -152, 79, -64, 17, -42, 30, 154, 82, -105, -76, -95, 200, -213, -142, -148, 98, 112, -38]
4536c8j93J89j73L38P3r2j92J28K9j13K05k82J29J6K31k00K3j9j57o2r9P1Q6p7
4560a79J95n2k35K16J87r5j28j98K86R8j95oO9M6Q2N0l4J1J12j53l8q9M9J98o8
4585A29r3j70N6J99l15K06l3n2r1P4L05k58m2q2K36l8q2m3J83j67K32M0j07l3
4609E4j40L36j79K50l86O2L2P8k8j1J7j62o8K01j40J36n7L5J29j31O7j13%P2O2
4634A16r0p3K15k03J43k08j34K95P0pqj89pJ41j18J85l00J60j86J38m4q0j4J87
4658a1J26j07J84j69j29L64k50jk5N1j48N0J97r7J08J5k20P2n4J19j11Q3j59k3
4682a35J65J04j06j17J70k51K96k34J59m2j33r9J49j42K47j5o4o6J07j47L3L54
4704B33k29n2J94o2J56p8k47L49k32K12Ol70K87l35N6J22k47K82j51J65jM6m8
$$ y = [-38, -231, -42, -215, 123, 196, 104, -88, 40, 69, -44, 161, -121, 8, 24, 255, 55, 78, 59, -98, -160, -259, -188, -102, -179, 16, -36, -271, -55, 132, 37, -91, -289, -3, 95, -100, -106, -37, 9, 91, 141, 107, 118, 230, 77, 39, -50, -1, 197, 129, 36, -134, -78, 121, -194, 12, -21, -73, -164, -90, 215, -43, -85, -167, 69, 31, -51, -94, 89, -78, 154, 194, 87, 54, -86, 250, 71, 321, -65, -3, 29, 107, 79, 68, 85, -77, -145, 56, -84, 52, -5, 30, 159, 28, 95, -18, -18, 54, 116, 26, -47, 168, -35, 108, -100, -234, 61, 131, 124, 116, -73, -80, 61, -57, 128, -172, -12, -198, -60, -104, -184, -198, -11, 115, 8, 192, 23, -106, 258, 8, 7, -18, 33, -115, -65, 132, 35, 143, 158, -62, 10, -44, 75, -36, 47, -112, -135, 30, 134, 28, -89, 81, -170, 126, -108, 51, 9, -124, -223, -74, -216, 31, 16, -48, -114, -7, -154, -121, 233, 4, -48, 146, 84, 240, 162, -85, 264, 32, 244, 250, -120, 167, -168, -112, 10, -237, 45, -106, 59, 58, 104, 56]
4727E6j3P2j03j47J26K72k88N9K83j71l43L63J23k67J77l18M2L4OJ98m2m06L86
4750I9k57m4J96j54J35q5J41j48P0j23J89m9j2K00j0j7j04J24j1r9L3j76L0Q9
4774A7R5K1j52j93J52O9R1o9j17Rk30L40q9k42R8J64J13k52J40L1L4O1j24o8R3
4799hK26k79K47o9Q5j69j3j23K47Q5k94P2j25J79j13J71j73O9p6J92k73L2J07
4822cj1R0j62Q1K61m99K72N8rK3j3j00p3J95j91J54p4p2J80j14l3j29n0P9P1j22
4848a91L17k50n2J82N5j81N3j26K27%k0J12j16M7Ol1j56J82k02K34k28qK03MJ71
4873B32j26j4k00K89l50J39j2j24P3nJ30K11k19j44L3J83M0l74K40j93K59l8n7
4896b7r9J59J03%j98J13j00J62j43M9r9nP7k5r7J98l2j48J00M1K5j69J90j99K62
$$ y = [56, 43, 115, 12, -135, -9, 263, -25, 34, 317, 146, -197, 166, 289, 22, 199, -119, -77, -43, -37, 161, 119, -287, 99, -158, -202, -6, -160, -25, -110, 31, -117, -47, -170, 19, -30, -42, 158, 148, 131, 27, 151, 140, 41, 74, -102, -72, 17, 112, 133, -19, -212, -60, 9, 100, 31, -86, -77, -307, 33, -56, -298, -200, -36, 77, -175, -35, -4, 30, 91, -33, -101, -8, 218, -61, 186, 117, 202, 33, 20, -103, 144, 229, -65, 7, -118, 61, -52, 119, -54, 15, -61, 131, -142, -110, -3, -14, 76, -86, -5, 256, -243, 29, 87, 78, 101, 88, -12, -85, 110, -81, 73, -1, -73, 107, -7, -40, -169, -219, -140, -69, -191, 126, -124, -176, 6, 61, -120, -67, -193, 34, 34, 14, 126, 10, 57, 63, 32, -124, 58, -144, 90, -138, -146, 57, 61, 232, 106, 92, -108, 181, -169, -30, -42, -166, -93, -98, 32, 243, 24, -120, -87, 96, 136, -238, 2, -191, 68, 30, -27, -126, 33, 136, 136, -62, 51, -49, 113, -30, 19, -80, -85, -8, -33, -130, 68, 36, -112, -12, 29, 54, -115, 75, -124, 138]
4921A38k26R7J53k19K8p6nO9KK12k53J51q7o2N9q1K55l8P7j33j26Q9j20p1J14
4946e3j11j2J48K61o63L84J12or9PP6l6J95k17P4j61J34R8k62J37P9j54R7j88
4970a60J36J13j94J15j6po0m2P6K16j81R1Jj52K2K50k45M6Q7J16j07P5j25J63
4994B18q3j09lj10N0K79l95J39q3L49n11K06J12N7k16rJ98k76J12r4Q4J74J3k27
5018a25R1q4L02j89m9J99p6k48K20J1j48K13rk45K73k48M10l93J09j26j03J79
5040c6j59L80m7k14k00O5J39L24j61K01k38O2l3N3j31O2M4p9R0p1On4J34q0m4
5065A3k21K43Q8k40K6K92m00R5M4R0Q0j06j59l25O19k69K00k21L18j58P1k78J16
5088h2j75K20J45q3jl11K56J32j38L7J0NJ6o5O6j15NL58k49K87m32K22j66j6L4
$$ y = [138, -88, 9, 162, -57, -29, -105, -110, -41, -39, 173, -80, 71, -16, -78, -19, -100, 155, 117, 194, 61, -65, 24, -96, -167, -53, -164, -176, -28, 233, -430, -46, 66, 60, -39, -32, 44, 8, 203, -14, 60, -101, 33, 131, -131, 6, 85, -69, 28, -160, -24, 89, -105, 10, -6, -13, -73, -115, -39, 177, -4, 87, 88, -64, -42, 208, -37, 9, 96, 212, 105, 180, 55, 218, 135, 26, 23, -87, -37, 242, -153, -14, -97, 252, -259, -53, 59, 116, -100, -109, 89, -187, -75, -169, -85, 89, 102, -125, -34, -118, 184, -5, -54, 145, 69, -179, 41, 52, -96, 117, 108, -137, 136, -112, 298, -95, 14, -112, -215, -36, -195, 185, 138, -76, -276, -211, -72, 252, 91, 292, 54, 116, 83, 136, 5, 67, 111, 32, 122, 51, 57, 3, 137, 57, 13, -208, 35, 123, -117, -91, 201, -199, -104, -60, 30, 110, 4, -155, -480, 139, -130, 70, -151, 167, 9, 80, -198, -82, -257, -37, 108, 25, 24, -287, -31, 101, -37, 0, 10, 15, 31, -34, 32, -83, -78, 280, 31, 318, -114, 108, -58, -74, -40]
5113d0J80n08J03J93J23j61L4K01L6N8k16j44J00Ok1J40l6Jj67K54j2j41j5J29
5137I7P7j51j33K28l38L79k63j80M89k64Q5j0m3j07K14j43N3J0K09j80N9J78k29
5160C7p8o7L7N2k53K85l3j64J70J74k10j05J79k59L98l33J63J30k5k85N20j16
5182B17j99o3m6M68l15J11j72q4J54L7j63Q9k3K7jL7J86l45j29K01M6p2j92J27
5206a04L16l2l06P8R1j56P0k21L22m8l5l1K10l41PJ97J02j8j26L29O2m22N6M5
5230D5k63Q1J70j10J6O3j14Q7K84j94N8k45J30j3j64K40K3l30O1K96j42j89N64
5253C54j54j63M1o2L4J26k36K22j32rJ11j21R4j21J27J37l64J48K5k16n4L09j05
5276im7q3J51J14J14l40J49j12m9L84j74j66K8K61j90j47n7R1K81M7l2l72K06
$$ y = [-40, 140, -368, -265, -72, 51, -110, -76, 125, 161, 219, 3, -141, -41, -35, -56, 84, 48, 49, -118, 136, 124, -17, -32, 97, 174, 23, -110, 118, -220, 159, -104, -284, 205, -59, 26, 16, -27, -134, 80, -63, -10, 0, 209, 29, 88, 266, 37, -41, -108, -71, -19, -272, 13, -20, -184, -14, 160, -50, -155, 24, -235, 163, -170, -7, 123, 98, -187, 333, 217, 18, -45, -91, 377, 62, 173, 1, -83, 71, 108, -55, 34, 11, 38, 37, 74, 260, -85, -214, -13, 33, -39, -231, -104, 212, 180, -126, -48, 43, -113, -43, -264, 58, 10, -25, -56, 154, -187, -180, 17, 119, 101, -25, 304, 366, -56, 0, 45, -218, -137, 33, -77, -61, 2, -112, -25, 259, 65, 123, -122, 8, -5, -169, 71, 94, -236, -175, 121, -21, -210, 354, 200, 37, 78, 16, 50, 176, -60, 162, 30, 21, 132, 11, 105, -16, 111, 248, -116, 32, 57, -159, -213, 96, -9, -56, -139, 12, 126, 240, -100, 49, -63, -112, 272, 98, -68, -40, 221, 31, -116, -173, -82, 199, 246, 214, -158, 48]
5299D8P8r9j91n1L81l68L99l20M2K54j51j49L49j69j7m7K26j05j30K5O2l7P9j15
5323fJ7L0n6j73J44K59k76R7KN5k57J60N1K1r3J17m1R6M1r4K62l10o4j22%p6K93
5350G7o7J04k20K10J74j39j91j43j21M16l0k08K29o7k86M49k12l4k15Q8N42m18
5372f2n4K80k34j37J14p5J0K71N4q4n8R7j10j24KJ95M1j67o3L28l35L08j54LK05
5397B51k17J78j99k01L93k29j9r4J3K74j96K9l2J75l2J83j71r3J4o9J09J32j71
5420B8ol1k00M13j20J41k93Jo8J7j47J66J93R1k79K07P8l45J85K2j30J11k64J80
5444e0k13M4L58k26mL01j28k84L63j62j62J45j22J49k7j64K69k3k8P8k61rP4M5
5468c7j97J23l2J83O7j31L9k54J45N3k7K30k40J85m45K08J64J36o8j57l8R5r2
$$ y = [48, 126, 27, -164, -215, 166, -202, 197, -123, -81, 173, 22, -127, 222, 53, 36, -11, 215, 110, -20, 5, 67, 30, 109, -6, 11, 41, -15, -188, -44, 215, -61, 36, 38, 93, -164, -4, 47, 68, -25, 92, 51, 147, 188, 94, 356, 46, -18, -140, -140, -216, 77, 10, 114, -106, 104, 278, 139, -52, -195, -316, 100, 70, -138, 91, 24, -262, 187, -25, -59, -274, -186, 356, -62, -116, 164, -70, -207, -93, -168, -158, 113, 167, 83, 25, 122, 12, -112, -110, 85, 126, -41, -104, 224, -111, 197, 43, 46, 251, 34, 212, 13, -188, 205, -24, -43, -137, -124, 150, -46, -17, -49, 126, 94, 277, 106, 13, 27, -42, 67, 199, 28, 22, -9, -209, 204, 84, 225, -68, -67, -135, -118, -265, -99, 94, 185, -94, 113, 191, -154, 31, 53, -77, 34, -230, -50, -263, -219, 139, -87, -91, 210, 82, -202, 161, -1, -163, -18, -140, 9, -18, -182, 87, 64, 36, 114, -147, -156, -82, -37, -234, -111, -143, 40, 107, -24, 15, -239, -94, -41, -68, 162, -78, 107, -338, -130, 34, 170, 102, -55, -93, 2, -90]
5491i0J88P3o1Kl24L38j95J58N4j07k31L79j01k98J0M4J42J10k25K7j46K32j25
5514a46J35L3M7J49j85j01O5J8L9J94k96O7j19K61k16j08J11m1J30P0o0p6k03
5537b32J25J16K11l63M5M4K5J55J08j2j16r6R5k08J11j22j7J25l8q7L14L2K8l93
5561a50J56k0o6R1l7j4o0l4Q7j41J11j04K58j21R5M8j15K2J64k1j76J51k06j01
5585a83L0J35J33o8j01O8QK43j99J49k00l09J66J86K4j93K7j17L03j98J74j13
5607c5JK17N6j31k71K81k04j01M35l98J02K03k29KmL38k96j74J32j5l4L01j64
5630A2J38k62J16K17l55J30K0j19k9j83J05L65M7k29J01k1k0l8J52p3R7k15j4
5653e8j34N1L15k31O1j29J78m2L7K46l89k33L99k37L68j33R4k23J48j0r9K21j7
$$ y = [-90, 98, 171, 110, 112, -212, 126, -69, 89, 143, 36, -195, 184, 83, -215, -205, -161, -19, 91, -134, -107, -253, -21, -146, -11, 22, 69, 218, 33, -68, -3, 15, 54, 248, -48, 19, -100, 161, -55, -163, -52, -93, 37, 107, 47, -29, -232, -107, 9, 220, -143, -98, -54, -29, 126, 234, 222, 106, 10, 105, -103, 8, -114, -131, -6, -44, -131, 183, 215, 243, -150, 6, -14, -80, 11, -26, -40, -100, -134, -47, -188, -77, -181, 77, -44, 51, 99, -16, 6, 170, 149, -27, 124, -82, -183, -153, -18, 115, 47, -54, 14, 22, 265, 66, 215, 15, -294, -128, 58, 82, -111, -84, -201, 102, -96, 78, -35, -34, 183, 239, 108, -163, 118, -86, -187, 248, -150, -48, 155, -74, -72, -76, 262, -34, -208, -76, -91, -125, 176, 12, 150, -112, 4, 221, -134, -4, 16, -103, -132, -315, -210, 155, 202, -27, 74, 53, 33, -5, 147, 74, 171, -44, -58, -192, -141, 174, -57, 4, -125, 53, 11, 48, 294, -95, -328, 71, -166, 202, 69, 163, -60, 88, 78, -21, 200, 183]
5676A83j28Q4K94m62J70j68p0J11N5o7m1J37k63r8K60j43J08J7j07J14J28j05
5698IJ53r4k66J88l5K09M6k45m6J34n2L4lQ6J70k14J03k49J14K6q1q7l6L01p6
5723H9o4J77l21M7N3P5J44j65K21M7l35J73l01R0K00J9m7j78J58O6r9N6q6j79
5747a60L28j8j88j06J00o6J4Or4K00p5P9k25K87n4Mj1J95j81l9j6q7J54m7mR1
5773H7j30K13k63M61l24Pn9J9J70q6l9j02J45q6ll0L6l8KP6L0r8j2k9L1P5q0J88
5801A61j13Q9PO5k11n8N8j3R1k34J27j11J21p7K0J19N7n1l22K56kK5J01k33M9
5826g9J81k10K07j35n0K18r9j73L18m1L2j48J4j2k9N8j44J43j87K06K37l99k0
5849a12L42k25J15q5j00K09N2k56J53j5j24N6N9j7k10L09j12r2J16M1m7k54K94
$$ y = [183, 55, 139, 433, -29, 141, -27, -97, 14, 69, 2, -39, 98, -165, -263, -3, -146, -38, -21, -128, -14, 114, 9, 162, 68, -198, -10, -45, 164, 210, -35, -81, 53, 1, 35, 32, 118, 288, 74, 177, -72, 42, 68, -13, -100, -136, 165, 89, 25, 202, -119, -72, -19, 56, 200, 35, 256, 303, -32, 141, -160, -70, 130, 149, 102, -76, 82, 148, 49, 105, 19, -160, 168, 150, -38, -144, -44, -110, -96, -90, -184, 16, -59, 20, -205, 82, 28, 32, 21, 216, 35, -4, -20, -107, 47, 0, -4, 87, -43, 170, -93, 368, 44, 51, -8, 11, 181, 95, 56, -46, 99, 13, 10, -20, 16, -22, -20, 56, 86, -12, -24, -53, -22, 53, -27, 161, 48, 137, 144, 209, -2, -60, -2, -15, 76, -158, -31, -142, -21, -98, -78, 41, 98, 47, -275, -19, -21, 4, 105, -128, -79, 102, -108, 99, -36, -86, 132, 33, -140, 178, 137, 169, 21, 35, 23, -6, 52, -92, 51, -136, 70, 307, -92, -112, 230, 5, 120, 35, -65, 144, 196, -60, 93, 78, -46, 10, 69, 52, -158, 151, 39, -53, 63, 104, 57, -197, 97]
5872I7j49K8K09k49k00J28K59j55J98k75R5M3k01K14m6j66J43j17K22m5j88O2
5894i3K8J19r7j90J97J23K93m22k2n5L88l55J52q9jm8KP2J02k64L28o1m1M3k19
5919a10o9L15j57mj12L19n6k18K63n8J0jn6o5L5l2r1J19r5O4K39k35j18N7m3k64
5945c63L08k5j29J48j02o5J50K60l76J13J34j42J10Q0j45p5j02J68j79J56J62
5966H6j75K72p5j9j71J41k49K87j55J52k18K11j70K5R9j95J29qN0o0J49j78K06
5989A34k10J04LL1l02L46K8m7k9n7Q9j59L4J01J19J39k72J2r5k6R7k43J54l9J95
6014A07J26l28O4OO5m45M73N3k61J19K71q1j05P5j21n0R4p0p3J31P8j90Q5p4J77
6039A26%k59K30M4k3j98J09k40K73m1J8j01M1K16n48M97N8j03r6J03j64j5R1J24
$$ y = [97, -52, -24, 185, -64, -264, -136, 123, -32, 166, -109, -14, 29, -172, 42, -4, -170, -27, -144, 78, 33, -155, -93, -65, 54, -43, -233, -36, 87, 380, -42, -64, -119, 269, -86, 66, -23, -24, -72, -70, 2, 104, -160, 168, 107, 66, 109, -110, -179, 136, -21, -25, -137, 182, 126, -92, 171, 113, 123, 122, 66, 1, 36, 4, -87, 32, -63, 1, 240, 5, -113, -56, -99, -363, -55, -80, -209, -61, -163, -228, -78, 182, -194, -81, 53, -89, 21, 101, -44, -119, -221, -53, -232, -76, 86, -89, 183, 108, 89, -82, 59, -190, 97, -58, 94, -124, 87, -83, -58, 41, -154, -25, -33, 17, -43, 106, -72, 134, -76, 28, 31, 62, -240, 106, 134, 87, 58, 1, 90, -69, -35, 66, 185, 324, 52, 64, -31, -57, 40, -203, -49, -88, 107, 233, -95, -31, -25, 40, -405, 68, 121, -140, -21, 250, 169, 64, 139, 18, -32, 62, -8, -81, 50, 128, -62, 23, -51, 126, 126, -133, 97, 141, 118, -80, 29, -211, 62, 21, 39, -62, -21, 195, -353, 144, 202, 99, 3, 106, -58, -73, 18, 142]
6063A42J24p2k30P9Q5l48K47l5P9N7k91M9j52N76l44R4J22j23k07L12l76J20Q2
6086a0R4l44J77P5N9k9j15k6K52k90K79n9j11J84o8l25L56l71L58L3j67n9J17
6109A0j19K00M1L2k8l12Qj19L13k34R8J02j15R9Jm0j28K05o7l3J89J6q5j43L35
6134B26o4k07K04r6L1k3j27M5L2j14rk41K43K31j18K44l57L3K00m61J5L17J62
6157A66Q1k73K12l7j81R8N5K6o4J6j8O9k06O0JJ0R7L9j63J42p0J4p9L2l8j29J15
6184b5J13r1j61K81M1q2j05Q7j99K24m6j26J16Qo3O0l11N0Q5L68k93l1J66k16
6208a50k1j6L86l23M7O9J09j30l7o4K22j38P8q0p3O4J24k41L21m20N9L52k37m8
6232a47K95l82K20J35J15k35K02k79j18N92n19J68j47j77L94j91o7L36k26J00
$$ y = [142, 266, 194, -36, 43, 128, -220, 27, -8, 71, 128, -163, -114, -266, 310, -34, 60, 182, 59, -148, 164, -212, -92, -10, 84, -260, -83, -8, 51, 22, -93, -119, 133, -157, 122, 63, -48, 136, 68, -257, 99, -272, 86, 119, -48, -107, 10, -109, 91, 132, 164, 136, -176, -168, -287, 26, -208, -110, -8, -123, -24, -23, -63, -191, 14, -53, -86, 103, 119, 34, -109, 226, 162, -45, 159, 63, 94, 71, -56, -11, 21, -93, -102, -343, -100, 131, 13, 257, -100, -67, 133, -328, -313, 4, 166, 247, -26, 186, 149, -32, 66, 121, 147, 83, 99, 81, 150, -56, 4, 5, 15, 112, 151, -12, 130, 60, 74, -5, 27, -11, -140, -25, 88, -3, -164, 117, 158, 76, -29, 58, -141, 83, 37, -89, 27, 35, -28, 32, -279, -229, -144, 224, -69, -100, 66, -150, -171, -187, 199, -124, -77, -8, 101, -29, -66, -130, 92, -46, 32, -48, -121, -57, 67, -174, 147, -273, -214, 138, -99, -147, 148, -234, -14, 121, 236, 1, 203, -76, -194, 398, -121, 47, -100, -277, 117, -74, -141, 195, -31, 69]
6252F9o9j49J57k67J16K85k52J47q9J90J13k13q2P8J01k9j85j2K02l07K48k03
6274a51M9j5L05m02R4O4R3k5n0j7N8RM1Q6j03l6j00J11J47j56k25L47r0l13K67
6299a2J6j20J16j4k32R4N3Q6J23l29L36N0k65L60o27L39J30j37l35M55O2q1o7
6322Ak36J65J85P3k63J50o8J2J5J04l13Q0Q2j29J66j03R7j05J98j06j56M23l27
6345e5K23j41N7K5k63l9P4J57j15j70J43OJ06lP0j31L9qn9j37M50j47j11j00M8
6370h1J09J3o1K00o3l7K9k22L06k48K2K12j11oQ4l8o8k7J42j03j26N9kJ67l08
6395a58K46l5j7k8p0p6j1J99np1k81M69K6N1l02mJ78k57K07L7k81L23j33J7QL15
6421C47k25j73M3n3O7j2jK57M3l06K04j17j18J08r4O2j6j05K0J21k8j86J42J32
$$ y = [69, 0, -149, 8, -259, -143, 142, -110, 37, -52, 138, 251, 38, -44, 34, 135, 106, -79, -91, 111, -196, 52, -151, -102, -117, 188, -214, -120, -56, 37, 12, -38, -55, 3, 12, 53, 139, 36, 0, -100, 11, 158, 2, -223, 124, 34, -279, -12, 4, -116, 0, -14, -246, -152, -99, -13, 110, -219, 117, 167, -98, 262, -365, -26, 104, -33, -368, 87, 149, 68, 1, -235, -70, 115, 188, -75, 75, 7, 19, 34, 138, -175, -95, -13, -142, 24, -79, 18, -87, 111, 5, -151, 272, -55, 168, 27, 84, 109, -154, -193, -119, 38, -77, -247, -104, -98, 8, 5, 75, -56, -17, -25, -84, -221, 229, 82, -29, -129, -81, 28, 41, -20, 180, 117, 80, 109, -113, 193, -55, -33, 179, 68, 62, 146, 108, 40, 13, 155, 52, -74, -15, -17, 150, -158, 88, 53, 36, 8, -62, -138, -149, 50, 45, -26, -307, 162, 188, 239, -63, -67, 111, -146, 61, 98, -183, 140, 7, 24, 32, 347, 122, -51, -8, -61, 6, -6, -7, 250, 293, -13, 191, 74, -44, 64, -30, 32, 16, -89, -69, 52, 24, -162, -20, 112]
6445A12q7j69K49k28M7L8j70L53n0n6j88L16r6N3j14L2M6J8k62R9J34m29K90J97
6469A35l25L37l04J56K12m77M00m3Q4J30m19K97j45j15l5k02J38N2M4N5j11L69
6491B33l10K21j03l17K99k66J48o3K81k57K2O6j18L46m20L12j70J79j1j5J44j23
6513G8Rr4K16l01M6Rj08J27K1o2J64l6k46J37L31l04j30j76M36k18L08j77j74
6536a44J47J51K6K8j79o0J41j69k9J13j50L33J95k22j54K63l35K3m6J37L2j13
6558a2J52j92j74M48k06k00K41m2j85K60o0m9K0r9M67n94K57r5J81j9J13k59L3
6581a4K85k12k94N60l64o8J72l1J00Pl78K40K03k07N0k65J62P4j59K87j40j55
6603a47J33J06K2k36J05J46j75RJ02l3N9j21o9J30J09j48K05k00J8j56n2K50o4
$$ y = [112, 25, -144, 105, -123, -76, -38, -208, 145, 95, 39, -149, 167, 71, 124, 10, 42, 88, 106, -156, -57, 77, -352, -62, 135, -190, 147, -157, -1, 211, -266, 134, 91, 175, 305, -114, 183, 38, -77, -112, -314, -176, -124, -80, -25, -136, 233, -77, 144, 41, -276, 23, -243, -95, -158, 123, -134, -112, -46, -164, 182, -238, 74, -96, 83, 72, 57, 201, 78, 87, -7, 209, -92, -46, -37, -145, -18, 3, -59, 105, 69, -177, -40, 291, -13, -143, -319, 117, -101, 207, 30, -144, 3, 154, 180, 208, 29, -31, 110, -59, -88, 25, -125, 208, 403, 181, 27, 290, -45, -22, -68, 69, 101, -12, 140, -52, -226, 222, 16, -184, 57, 15, -170, 90, 30, -19, 1, -98, 369, -225, 32, -63, 118, 99, 212, -47, -14, 271, 59, -235, 325, -39, -107, 65, 34, 134, 141, -237, 3, 206, -1, 49, -216, -54, 20, -139, 148, 8, -147, -14, 92, 114, -122, -17, 129, -46, -37, 65, 32, 91, -30, -99, 31, 140, -8, 197, -3, 15, -141, -193, 57, -7]
6626gR1l6p0lj79L75k39N3j35N6j5P0o6r1PM17k98p4R9K22l39K15j64RJ55r1R4
6653E6o3K70l18J3J37j16j01J79k56J63j70jJ08K95j91k87K86J3J22j79j9j66
6675b25R3R2j65L72J6k61P8Q8O5O2l99K17J01j59q2P7l27N10j02j8M2o3j04J3
6699g9J41j52M7m6R5J20l08L69Jj33q4r5J88M4R3k34J42j27K57k48j87Q7J63k17
6723a63K21o5j81P3K0N9J47L7l14J64J05k0j26j2K10k65j4J00j05M57k76j09J45
6746H8k07J80k79L03j12j82K9j9K36N1l37J50J25J27l6p8J10j60N5KL7o3K02j83
6770C9l4o5K52K3j60j06L3L6j01j02o8J62J47k9q9J06l19J42J32l8j24L09q7l8
6794B1N2k06P1L0K29k37Q3j59K47j67J26Q1n5j09j5L6M2R3j37r0J79r8J38n6k0
$$ y = [-7, 84, 48, -22, -25, -204, 171, -68, -15, -150, -94, -109, -39, -105, -196, -189, 228, -70, -144, -45, 177, -162, 53, -111, -102, 53, -38, 56, -7, 263, -55, -42, 95, -21, -122, 57, -199, -36, -206, -207, -99, 196, 5, -282, 4, 17, 139, -40, -59, -225, -132, -40, -205, 167, 183, -78, 0, 88, 153, 215, -184, 33, 134, -25, -107, -30, -357, 153, 51, 33, 75, 12, -92, -79, 62, -90, -43, -89, 6, 126, -182, 187, 188, 55, -29, -124, 64, 108, 201, -33, 109, -18, 239, -9, -196, -109, 54, -163, 58, -7, -188, -115, -95, -36, 111, 148, -166, -2, 103, 83, -43, -55, 155, -110, -124, -24, -129, 328, 52, -57, 88, -119, 61, -218, 85, -27, -209, -180, -199, 37, 88, -249, -99, 26, 153, 117, 39, 149, -11, 44, 46, 83, 20, 222, 39, 5, -60, 192, 215, 55, -51, -18, 18, -83, -185, -253, -91, 56, 27, -62, 44, -275, -133, -1, -39, -163, 146, 59, 21, 73, -133, -62, -32, 197, -40, 43, -116, 131, -36, 90, 171, 116, 7, -8, 28, 70, 163, 26, -64, 115, 17, 155, 99, 79]
6819G9K6l17J77l2J90m4k91K83j8j05K28k00r0J67j49J02J63J13j02p9m9j22R
6842f1J83N4j71o7O8n2J17N9k21o1%Q6L35k74J81k07q6J28J27o2j18K61j70j3
6866C6K0k70R8J54j51J26Q0J17k96q1J68o4J62j07J03l11L14k4N3l1j10N3j48
6889a09N2k3J13l6l5L5J34j30q0J3M12k15j65K2P9o3J73j02k47K39J77j79j50
6912h5l01L31j25P8o3R8K20j42n4K70j54p1N4nl12J23K64j21J30O5j60j24J73
6935H9Q7j8p7R1l16L34j56n1j7Q0k5K11l67J11r7J2J38k68L71j69o9R8R5R5r8
6960H4j10k1N3l5K2N8j47k8K14j71j24K71j38J65k04J44jn6Q5O8Jk37J80j19l9
6985h5J94j46j56L06k42P1M17l47m1k21J03N8p9q2J39J01p5P9qn0j53K55O6Q7
$$ y = [79, 105, -212, -35, -67, 123, 79, -212, 71, 53, -52, 176, -24, -114, 53, -96, 6, 169, 282, 180, 101, 52, -70, -61, 122, 176, 5, -62, 6, -46, 71, 130, -91, -152, -152, -66, 269, -5, 176, -31, -117, 11, 138, 76, -42, 219, 49, 36, 56, -214, -116, 38, -113, 13, 93, 210, -86, -167, 1, -63, 99, -8, 95, -216, 98, 74, 127, 96, -14, 39, -109, -57, -80, 33, -3, -38, -3, 131, 1, -79, -66, 346, 131, -34, -12, 67, 4, 177, 75, -172, 67, 244, 65, -85, -386, -55, -180, -102, -165, -67, 153, 11, -43, 227, 73, 2, 56, 51, -261, -138, 126, 5, 135, 200, 40, -84, 89, 176, 158, 81, 172, -144, 190, 34, -17, -34, 46, 21, 232, -135, -24, -121, -109, 29, -239, 132, -37, -106, -8, 87, 182, 84, -26, -47, 6, -29, -7, 51, -96, -124, 90, -81, -205, 66, -72, 93, -111, 33, 32, -24, 61, 129, 130, -107, 73, -46, -85, 109, -37, -193, 113, -129, -58, 359, 12, -29, -250, -147, -89, -168, -250, -111, -10, -85, -6, -14, -64, -217, 38, 104, 191]
7009A91j95j33J81l5J88k86N8k9O7O2j04R1j65o4J44k4L8J37j27L01m65J12j62
7032b19L62k56Q1J21k17kKj00J80N3k1P4N1j94J20J9L7j49L1j35J27%L7Q2j97
7057a13K71k53K96j90J54j11m7K2Q8j21Q8j60L9m6J14j85K99o0p8J0N6j06J99
7080A66m86L71k37Q9L49l42J21L84l03j40n2J38m8K51m04J30rJ47K0J3k90L14
7102A82j97k10K70j04j8q8M8K74k57P0J33j36J42k86J46R5j75K0R5J36k06n4L13
7125A93j94Q8J36l82K91j85p5Q0J37j21J23K30k89J07j60j73o2J46L0n5K32k51
7147a54K35J2j32K98l2l24J12J4J43k94J97j35O5k2L39j39k40%j99L33j4j20K6
7170c1O1Q6k36K03j48j9J44r1J73pj89m6m9K39j1j94pP6O2q5Q3k30L30p3KN5j07
$$ y = [191, -4, -137, 44, 9, 197, -89, -31, -60, 7, 69, -35, 56, -109, -173, -29, -53, -15, 122, -5, 296, -169, -57, -219, 143, -113, -32, 89, -128, -130, -128, -228, -48, 5, -16, 58, 109, -85, 35, 54, 91, -58, -27, -162, -35, -35, 2, 84, -113, 158, -95, 201, 11, 165, 54, 7, 29, 117, -4, 84, -76, -37, -83, 31, -154, 145, 85, 7, 17, 73, -33, 166, -320, 51, -186, -97, 252, -90, 31, 415, 112, -28, -80, 58, 10, 261, -143, -13, -22, 125, 145, 158, -132, 182, -15, -225, 45, -59, -77, -165, -117, 157, -100, -30, 103, -33, 109, -177, -31, 64, -111, -91, 4, 140, -66, -120, 193, -1, 87, 223, -159, 132, -53, -128, -48, 89, -32, 91, 321, 32, 139, -21, -194, -256, -110, -80, -135, 97, -154, 81, 93, -39, 259, 227, -97, 15, 29, 172, -122, 75, -60, 5, -17, 322, 183, -57, -57, -256, 77, 63, -57, -31, 30, 116, -120, 83, -65, -84, 60, -31, 142, 135, -54, -100, -149, 90, 79, -115, -122, -46, 16, -69, 14, -216, 114, 41, 43, 98, -9]
7197iK0Q0q0k80J64L38j28J9j23j23K48n20N55N5k34n1K04k27j23J44k41L16J13
7220A17k1j66J93j23Q1L5j5q5K8k65Q0j6J33j49O1j7M5J23M5K19k62j50k2J00
7244c1l9J79k57M9P2k26L29k8j3LK4rn6q1r7J91O6k08L69n36N39n46K21Q4j39
7269a40J24m6J10J22l0k25J51K44k54r6L5J00Q7k94k38L44r1J29O4k64J50J8M7
7292D7J66j58k42J31L6L3Q0N6j09n5j60K26j56k17J30J96o0J38j58j47K0L07K03
7315C07l21J3k03K39q9q8K25j08M24l07l3P4k62L28k91K07k00o2P1J60L3l6j94
7338a13K22Jk56K15j18MNK05j25p8k81J54K83m8k67R5L0L70m63K90q4p4J43m6
7362F4n4J40j36j40K40j08q2R8j43J19J29j83m4o2K42k00K35Oq4j05K5O0J14J07
$$ y = [-9, 11, 91, 11, -269, -105, 233, 105, 124, 1, -122, 126, -394, 161, 216, -18, -69, 135, -92, -215, -71, -312, 4, 117, 96, -70, 123, 0, 81, 116, 101, 16, 44, -221, -141, -157, -24, -173, -112, -129, -84, 39, 84, 303, 41, -109, -131, -31, -70, 109, -148, -99, -27, -253, 76, 48, 35, 38, 62, 53, -3, -84, -181, 10, 76, -132, 237, -299, 240, -306, -85, -1, -140, -16, -62, 48, 170, 140, -85, 66, 310, 56, -40, -5, 95, 182, -112, -350, -6, -97, 32, 96, -168, -18, 0, 47, 213, 55, -187, -56, -20, 13, 93, 149, 40, -15, -175, 51, -105, -322, -192, 4, -56, 82, -76, -223, -203, 104, 307, -14, -1, -204, 35, -54, -142, 83, -25, 399, 92, 59, 133, -129, 199, -92, 115, -85, -147, -76, 84, 117, 81, -113, 109, 110, -146, 69, -49, -45, -40, 165, 40, -38, -319, -165, 118, 70, -197, -102, -72, 298, -165, 125, 41, -33, 110, 64, 10, 150, 14, -126, 114, 6, -76, 22, -121, -2, 127, -56, -100, -162, 80, -120, 115, 121, 37, -68, -43, 17, 131, 238]
7386B38l01J44q7R2qR1k70R3j60J18P3J09n0k6q1NK71k57l9J18j63K22l51L45
7410A26J61l26q1P2j52K95J80k54q6K5L08j14J27k07pj50J00j69k8O8K61q7k83
7433b21K35p7J71j41N3N7J10l47m3R3p7L30J23l99L4N2K27K84l39j16l6J3J33
7456A19k96PP2nK20q5o9M5m8J71p9M6m1O0n7m1J39k99J38j5p5QN8p6m5O5R7k29
7484b15J10J05p8j41J00j06L76k97K04l3PJ50j69R5k2k82J51k8J00j1j54L01j66
7507crk01P7J53j56M9J1J7j19J59k51J76p5K58j28Oj85K47M7k11L02j49jj43K02
7532G3j38k17K22qK32m8k84Q5J17J0r1l3K34j95K3k27L09N4lk39J91M7M5j68j83
7557a92J62O1m1J18k7k2j97J48J52j24o1N1O3j66J9j3P7N0J10l12J53o4J9o0K65
$$ y = [238, -63, 81, -6, 86, 78, 169, -101, -8, -168, -50, 23, 132, 82, 56, -25, -20, 251, -6, -45, 73, -90, 132, -219, 126, 287, -39, -120, -48, -200, 95, 275, 21, -65, -40, 268, 154, 281, 74, 67, -83, 17, -152, -180, -112, 149, 62, -221, 14, -63, 108, -33, 20, 77, 187, -160, -203, -110, -187, 143, 266, -133, -99, -47, 180, 464, 125, 9, -27, -14, 119, -177, -170, -98, -103, 117, 32, -37, 8, -40, 131, 52, 98, 57, 117, 60, 19, 158, -141, -3, -18, -93, -85, -27, -103, -148, -83, 14, -215, -105, 0, -78, -219, -119, -225, 151, -146, 58, 25, 32, 182, 13, 108, 86, -196, -45, -73, 27, 16, -138, 163, -3, -12, -213, -136, 17, -139, -90, -79, -62, -181, -22, -273, -97, -172, 86, -42, -36, -221, 26, 73, -138, 164, 15, 14, -129, 73, -65, -282, -60, -68, 164, 116, -168, -83, 34, 44, -47, -80, 154, -41, -18, -245, 64, 118, 115, -124, 67, 114, 159, -9, -192, -30, 31, -10, 108, 81, 59, -138, 10, 162, 38, -23, 28, 91, -75, -56, -69, 8, 58, 168, -144, 9, -55, -36, -96, 169]
7582A69j70j3n6K58k14L4mJ39j79K2m4Q5r0m8K9n4K54m66K93J92m2p3O3k61q8
7607b64M44j00J05p1j03J2J7K3j26R7o2K54j39l2R8k52J35j28J4k12M70q1n2o6
7631a9Q0j74K80k16M1k49K67J9j13J15J91k55K22j87L6l1K34k92J62j23M9j8j79
7654a60K14j25K89l49J12j87K73j41N3n6j4PJ8o8J83l83N3J66K4R2K13j62M2j80
7678h6R8L2j17K93j58j57M42l54NJ03p6J4j38K7J3J62l9Q0m0k4P2L7k68J91j42
7703c0r5J63o4O1k4J35k08J11N3j01J0j64J00K79k75J22p5oJ15m3p5RK8j83J12
7728d5m5j08K70L4k01Q8K57m35J51L7m4N6N7r0J78j41o5L9N1N1j58K90j81J4j97
7753a37J82j14K67l25R3NL5n8j4K11R8k42Q8Q0k28j05K1L4J34K92m42K00j38P0
$$ y = [169, -1, -14, -70, 188, -26, 8, 4, 143, -36, -14, -58, 27, -63, -111, -82, -136, 118, -348, -55, 137, 95, 22, 85, -176, -264, 180, 80, 185, 114, 11, 23, 40, 63, -63, 34, -28, 226, 87, 55, 153, -99, 36, -92, -78, -290, 180, 99, 47, -19, 61, -113, 167, -49, -8, -257, 10, 29, -84, 31, 222, -33, 189, 2, 38, 7, 241, -51, 111, -12, 37, 19, -160, 54, -71, 218, -131, -19, -206, 67, -74, -21, -77, -91, -84, -66, -134, 49, -334, -281, -115, -91, 1, 214, 52, 94, -86, 12, 44, -73, 220, 62, -95, 347, -7, -2, 101, 25, 39, -99, -72, -59, 103, 64, 144, 104, 80, 152, 189, -79, 112, -30, -125, 38, -26, 35, 11, 146, -62, 49, 102, 1, 11, -153, -53, 226, -49, 73, -2, -8, 107, 64, -11, -2, 26, -157, -45, -90, -198, 72, 106, -95, -7, 250, -185, -34, 3, -41, 15, 72, -18, 160, 19, -46, -7, 44, 95, -63, 227, 46, 60, -137, 45, -69, 198, -127, -34, -29, 6, -52, -66, 145, 243, 1, 89, 169, -59, -164, -143, -109, 25, 317, -125, 75, -63, 7]
7777GK3M7K3k98K19L8p7J14k69J61o3J6j27j2K21k8N1q6O7k57N67m23o2J70K37
7802B59j72J62k45j10L10j00p3K8O5l55J53P4rQ5k00r3P4J30l4J50j36j14Q6J13
7826D8J32p8k89L77k50O3k47K35J35k69L87l38J92k48K9J00Nq2j55M16k16K69
7848B16l48K47k6j81J9L0J2%j46K1J67l8M5O7R3l55M9k07M38n6J49k20LJ16l5
7873F0j4o4R0j98J49K53j41k2l14L70q7O7p7O2j14K0k78K71k84L58k62K56o2M
7897D3j46k7l6J1K54k96J42p3J72j0j10J08J27j82j2M4l6P9j4k94M19k97J29j9
7921b4j5L21l30rJ88j54P8J7N8j22l9K30j17N7k21O1P3J69j82k3j66R1L5O1r6
7946e9Q1r1j82K02j65L91j66k1K6Kj04J06j27M4L83k22m2j76n9L79k68J72J5J6
$$ y = [7, 30, 77, 100, -198, 21, 59, -18, 96, -173, -12, -75, -59, -186, -198, 23, -5, 46, -40, 27, -230, 337, -86, -148, 22, 259, 87, 249, 4, -106, 204, 104, 31, 59, 124, -231, -78, -4, -13, 72, -128, -221, -147, -17, -51, 99, -37, -151, -65, 48, 180, 102, -187, 190, -60, 3, -244, -9, 126, -143, 244, -94, 98, -150, -121, -21, -16, -98, -253, 163, -53, 216, -132, 115, 89, -92, -73, -43, -31, -31, -177, -156, 11, -27, 18, 85, 178, -177, -128, -335, 103, 47, 196, -24, -21, 95, 60, 46, -18, 72, -126, 23, 276, 135, 113, -201, 169, 82, 149, 72, 134, 20, 40, -238, 33, -251, 107, -155, 101, 39, 43, -103, -130, -166, -155, 99, -197, -55, -128, 44, 34, -76, 32, 159, -23, -35, 9, -27, 52, 38, -256, 163, -134, -5, -24, -39, 282, -48, -57, 131, -23, 55, 72, 130, 8, -31, 199, 82, 139, -82, -21, 52, 221, 39, 16, -150, -59, -24, 37, -59, 22, -69, -251, -49, -214, 177, 11, -10, 16, 18, -86, 20, -107, -63, 320, 98, 56, -120, -179, 200, -68, 104, 119, 135]
7970A35j99J29Mj36Q1rrK4j59J27p1K10j58J29j00J23j34j42K37k02Q2k38J40
7993a36J73p5k5L4j01K23m6J73j66j66L89k87r7J29j5j31L4J18P8j80J64r3n1
8016e4j35K81j71l2M4Lo6J93j69R9P9M4k29LO7M0k2K6j12n2M24k83R6j27N7J07
8042A11j71L3J79J13j10l65K00J21j64j13K22o4j31K15j14j6J67k34J80M7j70
8063f4L9k1J35p4o2K55j91r9R1n4j29J96J3k28K22J07j24NP2j15J0K29l17j0K61
8088A47k19l1N7MK40j52j54J39M7J60j93j43M7J30k30L03j85q1O8O7K5r3j19K22
8112E6J60o2k66m25N65N7j46J19j90l3L43N2k33k63k1K34R7o1l44L61K82n20K98
8135F0k40L95j02r0K8m0J7J11j00m4j12J22j01J82j21J76k79O5J83j89L19j99
$$ y = [135, -64, 65, 69, -67, 14, 5, -4, 20, -139, -12, -83, 127, -31, 98, -2, 121, -13, -155, 82, -120, -38, -276, -136, 37, -38, -63, -29, -130, 93, 47, 220, 54, -112, 277, -10, -107, 22, 7, -124, -90, 28, 106, -74, 90, -3, -54, -189, 92, -79, -111, -67, -64, -130, 63, -106, -7, 72, 116, -113, -110, -43, -3, -25, 1, -111, -163, 261, -22, 74, -53, 4, 111, -60, -27, 152, 265, 155, -210, -10, 111, -53, -166, 56, -8, -139, 76, -38, -54, 113, -121, 59, 106, -64, -25, -46, 89, 15, -47, 208, 17, -82, 9, -45, -174, 22, 35, -193, 29, 136, 12, 17, 89, -26, -16, 213, -104, -114, 147, -72, -103, -46, -42, 198, 46, -108, 31, 78, 238, 45, -98, -51, 79, -151, 152, -33, -114, -46, 21, 46, -47, -166, 56, 216, 154, -112, -537, 28, 85, -61, 58, -132, -165, 178, 230, -3, -266, -287, -53, 44, -17, -361, 0, 282, -238, 60, -180, 215, 113, 23, 51, 11, 28, 139, 39, -5, -117, 5, -96, 86, -35, 141, -138, -73, 110, -79, 240, 41]
8157D1J83m5l5l06J10K60j51j31J51J22j61P4R9k88J50J54k6p1j40j02J71j07
8179d8k31K20l3K12j70M5O7p3j18pK8L18
$$ y = [41, 224, 179, 144, -162, -52, 208, 57, -74, 77, 199, 38, 112, 211, -77, 73, 227, 201, 130, -10, -112, 59, -48, -279, -59, -92, 120, -50, -5, 62, -11, -129, -136, -108, 210]
8191B10
$$ Imaginary data points
##PAGE= N=2
##DATA TABLE= (X++(I..I)), XYDATA
0@%%%%%%%%%%%%Qj6J6j6J6k4L2l2M0m9N7p2Q8j04J20j36J53j77K05k34K66l01
34a60L41l83M30m84N42o04O72p47Q31r22J019j126J245j372J510j665J834k021
52a060K230k459K712k999L326l698M128m632N228n950O849q002R542j1707J5000
67H508k0686L3189j12199N5761J06013j77133Q3963O9613j35152m03J28288o9475
79b9713k1434O9309m0969k9613O2551l7423j7266O5086l309k5631K7600l2939
91a3751j3593M5363j6819j3465M2516m2714k5050P9464j1178o7286M6789J1862
103B2138n0260M3018K2416o4023R579K4043l2148L4653K9535n7864Q583L9171
115B8841n2328n996N2497k9770j3543M6628k9313l5906L5605j381q110M3395j8125
$$ y = [0, 0, 0, 0, 0, 0, 0, 0, 0, 0, 0, 0, 0, 8, -8, 8, -8, 8, -16, 16, -16, 24, -25, 32, -40, 48, -56, 64, -72, 81, -96, 109, -125, 141, -160, 181, -202, 228, -256, 286, -318, 354, -393, 438, -484, 535, -591, 654, -718, 792, -873, 961, -1060, 1170, -1289, 1423, -1576, 1750, -1948, 2180, -2452, 2776, -3174, 3675, -4327, 5215, -6492, 8508, -12178, 21011, -91188, -35427, 70586, -106547, -22584, 47029, -88123, -88526, 39762, -29713, -51147, 18162, -22807, -52420, 10131, -27292, -44558, 20528, 17219, -8412, 19188, -13751, -27344, 18019, 1200, -12265, 30251, -12463, -37513, 41951, 30773, -36513, 10276, 22138, -28122, 14896, 37312, -26711, -17132, 6911, -25237, 9416, 38951, -18913, -10330, 28841, -23487, -29483, 23014, -6756, -20299, 26329, -2984, -38890, -3285, -4666, -12776, 30619, 12494]
128A2494m9352K2855R334j8199L1595R803l5478Q712J1446j5895J6616O273k1972
141a1768J8172J0273l1807Q483J9370k2242J0663K4518k8635q717K3252j4364
153b802m808K1425k1281j4621K8354m329j7434J6088p186j9535K0051Q104j5349
166a3323N692l131j4477J5897O263j3967J4218N918k0910Q527J3368j8912O933
179g904K2010j4004o673J3643j1359k372K1840l433j1407R626n915q434J5376
192A0994J892r862P366j885r555J0193J905r611Q994J952j4022O761Q254j2740
206F36L096J0955j1339m358J0941m971n108Q200k446n942L841j532k878M004o99
221B400k858J849l785k341O018j706m143N356k927n342Q585J461r113L940M473
$$ y = [12494, -36858, -14003, -4669, -22868, 8727, 18530, -16948, -8236, 3210, -12685, 3931, 10204, -11768, 6404, 16677, -15130, -6647, 12723, -9519, 1144, 25662, -2973, -11690, 11562, -2802, -7610, 13815, -7466, -22087, 6267, 1938, -15496, 592, -6594, -26129, -6078, 2026, -13323, -7631, -10762, -25239, -9342, -3079, -17046, -2828, 3090, -17820, -9293, 4075, -14837, -7904, 14106, 102, -6571, 7072, -4287, -6659, 15181, 11748, 341, 9967, 4052, -4382, 10994, 12886, 3024, 10390, 8505, -1050, 9143, 11048, 1437, 10431, 12383, -1639, 5122, 13376, 636, 3732, 14687, 3348, -1010, 9931, 4960, -148, 8052, 5606, -336, 3505, 1973, -905, 3099, 2400, -458, 1391, -2394, -4735, 1283, -423, -4566, 790, -2137, -7479, 1106, 2567, -6546, -2606, 1867]
236A867n721M547N323q273j207O442j583J290L848n138j176M115l387n02M187
251D632m189j12P259o200p400N719n78l067R203j194j2602K069N461m156L484
266a671N025p187j652O104k533k525K727J05K178M326l755l633M38j135M769P024
282H605n129o005L504j393k219O342m56o764M931M845p305k716K575k161L342
297dP897l910p771k44J960K604M604o08l614R4L18N00K90k183J03N825J876m787
315B950k578k592j454O547N156m346n827k99L24M03K672j20k380O52K964j229
331H43m902j686L252L466K506J29n008n398L157O452J11j487n2k299j420L059
347G23l73m085J456M782O75k701l454k815L37M425L979j621m804k168K391J696
$$ y = [1867, -3854, 693, 6016, -2257, -3464, 2978, 1395, 2685, 6533, 1395, 219, 4334, 947, 445, 4632, 443, 331, 7590, 1390, -6010, -291, -869, -3936, 5267, 4073, -8529, -6460, -999, -5155, -1671, 3354, -3833, -5485, 619, -1914, -4439, -1712, -1607, 571, 4897, 1142, -2491, -2053, -3188, 1581, 8605, 3476, -2529, 975, -418, -2637, 3705, 3249, -3515, 1416, 6261, -1044, -3760, -1185, -3346, -4, 7893, 3983, -3788, -4032, -2072, 532, 5136, 4528, 914, 1008, 1326, 1826, 2116, -67, 36, 5861, 7737, 2950, 372, -2220, -3674, 2873, 8029, 3683, -2144, -2443, -2119, -1716, 956, 836, -1544, -892, 2072, 843, -4059, -5745, -2493, 973, 3479, 3608, -1400, -6798, -3641, 2811, 2922, 1435, 1383, -916, -2336, 723, 350, -3735, -2279, 2503, 3178, 477, -2977, -5792, -5455, -1030, 2949, 1328, -3476, -5644, -3253, -1557]
363a557P23J208m71j167J950J657m364k199M385K951O28J019l303n016J498N488
379C430M64k150j015j899q65J469J08j807k49J823J829j352m193j629J764J742
395b530K430J473m166k737L529K437j070J106J164k110J596K535k584l062L383
410A394L191N62r7j650l475N05L107J776j308j982k12L06n14L73O18j193P17J889
428D007j207m272O79J381L51J450M75k746j858J625J163m12o79m89j086n35Q84
445a269J53j948p83K285M94k530K54L40k257J007K808j518j325J929O00j083J448
462a395O61o98J285J505j32n10k55Q30J496O30K5N43j088j504J781Q11k130Q76
480B731Q33k967m73K368j234j747J877r20k121Q46M60j196J81Q33k36n50M73O95
$$ y = [-1557, -834, 374, -97, -1264, 686, 2343, -2021, -4220, 165, 3116, 3744, 4763, 1460, -3556, -2058, 3430, 3894, 1744, 729, -1170, -2035, -566, -458, -2265, -2514, -691, 1138, -214, -4407, -6036, -4272, -2530, -100, 1373, -2793, -5530, -2001, 436, -634, 472, 1636, -474, 1122, 3657, 1073, -1989, 1394, 4585, 5147, 5050, 3400, -75, 430, 3537, 5313, 4005, 2023, 1811, 2117, 1603, 1976, 2594, 1401, 2118, 4007, 2800, -1472, -793, 588, 939, 2389, 2864, 118, -1740, -115, 1048, 636, -43, -532, -1618, -2153, -1269, -1116, -3064, -3847, -1562, -1068, -3598, -3344, -3004, -5261, -4254, -1446, -2964, -4289, -2360, -1760, -2843, -1395, -734, -1432, -147, 1358, 1226, 716, 461, 1291, 2787, 3417, 3442, 3985, 2897, 1393, 3174, 3985, 1855, 2731, 3564, 597, 124, 2492, 1258, -489, 1388, 468, -1653, -807, -347, -1543, -1362, -529, -765, -1315, -842, -147]
498a47N98j25K74P65j193m96K409O24j156J531L1k334J112K658j468q47J147o82
516B701j348J207O89j010k69Q77J45n88q88K74r7KQ81J25j473q01J328j77o52
535I26J74nj766Q34J101k461j691J291N02m15N42j360k069K62J308R25n36q40
553c278m5L19J19L88R16k22N10K681M56k611J47J964P66J183K206k395k393K800
571C511J504j623J117R7j961Q56J325k374j789J569M88l7L70k977j497R96N29
588A04Q88J98k418j035K396n38j069J614r18j667L582M37m033N97K150j411J798
605F75K360m046j560L144l60o78J657j971o55K778o21j309P71j517L94L859r99
622A922l492J591M6j255L525J086l896M15K215j892R8J327j617o36K388p06k093
$$ y = [-147, 451, 326, 600, 1365, 172, -324, 2085, 2709, 1553, 3084, 3115, 781, 1893, 4551, 3083, 2236, 3383, 2701, 1353, 2560, 3249, 2239, 1970, 2847, 2992, 2404, 1516, 1790, 1693, 1695, 2576, 2701, 1228, 427, 1755, 1578, 926, 1100, 1095, -671, 163, 1264, -1197, -2888, -1597, -1095, -1510, -968, -2328, -4397, -4135, -2827, -1902, -2438, -3278, -3323, -3004, -2885, -2497, -1581, -1803, -1293, 1388, 1844, -767, -620, 1344, 2110, 3293, 5499, 3104, 711, 3511, 5015, 3392, 4509, 4606, 2645, 3501, 4826, 2452, 663, 2232, 2720, 2683, 3053, 76, -1421, -425, 104, 992, 1190, -1228, -2263, 133, -405, -1474, 140, -778, -2445, 1137, 1574, -2459, -1862, 288, -1123, 675, 3035, -1011, -2571, 573, 213, -465, 1192, -779, -1434, 1344, 723, -586, 185, -1332, -938, 2921, 1922, -1570, 21, 67, -1188, 2337, 3423, -473, -58, 2157, 265, 363, 1690, 73, -563, 1825, 1119, -974]
639i74p99K0J062J058j193j387q82j681K051K119k483l48J146o53l23K258j157
656b166j665L142R53j342O92R3r33K117J513r94l89j81L37J497Q9j790N19L77
674A869n39J706n99l568J125J649j115L94L64k550m80K295o51o99Q46o46j43J240
692D98j395n41J533n82N82J711k528j855K930p0j262K262r10l010J739J683k387
709a602M06J632j970J40J573j428m27J402n13L27M94j031J94J412o21M22J477
726A887j951J03K348j194r77J794j105j299K213K06k351R10L39j911R95R24j899
743i68q4R43j449M69O66j397R50R21j345lJ380j302L17K095j262q82J913k41j090
762c69J849K79j855J013N39j068N53N90j113J85l8m77J78oo52M70N9j500R23P54
$$ y = [-974, -1773, -1753, -691, 367, -826, -2213, -3095, -4776, -2725, -606, -3089, -3437, -2291, -2944, -3267, -1009, -2166, -3831, -689, 264, -1078, -386, -293, -1226, 891, 2404, 1410, 1021, 840, 1177, 2674, 2763, 973, 1492, 1869, 1330, 3036, 2437, -1131, -6, 1643, 528, 922, 1286, -1264, -1744, 551, -100, -799, 47, -599, -742, 498, -897, -1438, 95, -487, 95, 1806, -722, -2577, 353, 283, -979, 1283, 373, -2637, -898, 785, -1602, -1196, 436, -1534, -1394, 179, -1249, -1676, -274, -787, -460, 34, -997, -803, 609, -12, 410, 1887, -64, 39, 2387, 1193, 216, 2010, 905, -394, 1819, 2025, -326, 584, 923, -988, 7, 931, -968, -1052, -109, -1558, -1089, -423, -1820, -870, 51, -1294, -1297, 83, -1219, -902, 1193, -69, -951, 962, 721, -369, 1480, 1759, -96, 917, 1456, 388, 941, 1531, 418, 603, 565, 88, 266, 260, -392, 78, 137, -1363, -440, 314]
782C14j285J74J407j162m29K089o42j229J815L04j666J072N45j282P55Q49p54
799H75m24L61n03K41J02o64o9J82n94L10j46j092J52Q71l42l94P67q40l95J494
819a08M81j126L79L04n7L87j61k07L19J20M20L40p26p61Q06o5k29N74m26j301
839a037O46R95j023k86O98n32j51J019k24j257O72Q47p2J04M1k6n53Q13N32j66
859A040o10J70M67m71m5L19r01n50J301l14r51k33L01m21L20K66r35j77M36K67
879g21r2k04R9Q8O17J98K57p3l62P18O17P2m66J27K04Q5M84K96j160k20R53l88
901A129j69k84k41j37L6K15m05q41K13P89m46l52J75m07k96J013K14r31L09O44
921B28m02J65N81m29m96N05M89j93p04K32n2k70M34M8l49l01O45K2m75k78N36
$$ y = [314, -971, -797, 610, -552, -981, 1108, 466, -763, 1052, 1356, -310, 762, 1307, 25, 780, 1629, 875, 451, 812, 309, 550, 652, -12, -81, 101, -493, -183, -329, -1421, -1269, -398, -740, -1134, -367, -1207, -1602, -108, 373, -753, -374, -70, -127, 260, 99, -108, 211, 331, 751, 1091, 365, -396, 410, 345, 116, 690, 264, -1037, -391, 604, -419, -705, -7, -539, -690, 329, 105, -1152, -480, 367, 295, 399, 440, 414, -139, 674, 1206, 1040, 430, 600, 1067, 596, 551, 870, -31, -581, 720, 406, -545, -778, -477, -898, -578, -312, -1247, -1424, -988, -721, -813, -1017, -918, -830, -213, -15, 242, 169, -193, 525, 1142, 1214, 748, 875, 1079, 1164, 1648, 1944, 784, 564, 1517, 1129, 960, 676, 435, 298, 334, 549, 144, -697, -484, 305, -141, -493, -318, -725, -1021, -8, 206, -725, -416, 228, -174, -9, 572, 143, -353, 152, 641, 448, -256, -24, -76, -346, 88, 136, -213, -514, 131, 153, -322, -600, -64]
942f4l10N14N66l39k81J49Q82J40r8o7j88L10M70J43j32k51r0J23j55j53r6j22
964I51n74J34K46r26k46J08n4o06L4j8m19J92O51l11m82L33K70J62J81O15k86
985d5l51R23L39l50J09M65k47Q0N62l59k77R5J02m31k0K26n05j88N11k23n85j13
1007b82K33j53L12O9j87l90j16P04O8n40L03j1M0j58n6L76l92M1J54k96j95K70
1029b06o6l09mj07k76j59L60K21m02K58j77J45K72K63J90m70R2P71l7J58M51M8
1051A016m27j7N63k64J89L6j28n02J79J56m87k07M1n00l51P5j71l47R0O0j56n14
1073a666K54L88m74K48L85l95j13L59O17p4k8J89n1j18M72K29R0j85l6l5J63J11
1095C30k70K72m21n1J63k05j44N87l63j99Q2m0k22O54K67l16k20N3M7o4K28n7
$$ y = [-64, -374, 140, 706, 367, 86, 235, 1117, 1257, 1159, 1092, 904, 1214, 1684, 1827, 1695, 1444, 1354, 1477, 1322, 1169, 1073, 951, 377, 511, 757, -169, -415, -307, -361, -967, -933, -951, -1370, -1178, -527, -838, -1320, -987, -717, -555, -374, 241, -45, -396, 527, 866, 516, 625, 1090, 843, 923, 1485, 1126, 849, 944, 1046, 615, 595, 821, 316, 128, 639, 416, -169, -282, -49, -202, 110, 179, -8, -398, -514, 190, 258, -282, 21, 10, 50, -108, -164, 212, -180, -139, 15, -281, -476, -206, -272, -581, -585, -692, -968, -1127, -767, -546, -948, -690, -867, -722, -450, -187, 3, -467, -375, 396, 359, 517, 968, 1016, 589, 572, 1135, 871, 1060, 1096, 968, 466, 645, 801, 314, 107, 148, -352, -703, -628, -799, -1146, -1056, -996, -1152, -1666, -1412, -1024, -1498, -1250, -865, -1260, -1373, -1014, -397, -471, -499, -310, -361, -479, -7, 222, 312, 127, 91, 56, 219, 330, 60, 332, -89, -140, 23, -182, -326, 261, -102, -301, -219, -259, -481, 173, 440, 124, -96, -43, 4, -60, 168, 111]
1117A11M4k11j2J48jj25K02o55lNK0m57L78L11o68k62L09kl88P23j97k54R4M48
1141d42L8N17K64l12k44L03L89K87O3k40K22J0j04J41j49k9j02K51p10k29K19
1162A43n8l86L63m20m15J21J35j62M10l72m32N64q3K86J67j36j69N04J17j32m7
1183bM31l34K87j2l06j55Q19o48j5R1k87k60N18M2m93J54k92K42mL82n00K64j70
1206b48p2Q50n09O1L57O3p10Q85Q7k66J77J08k73k80K78m35Q9J37m4n49j3q1N3
1229c35J93o24M6J20k46K70J07K05k37J90J42r5L73K2j53J29M92l25j15M35o9
1250E25q9M39m76J3K28k71Kl80m4R7jk24k6J35m16l2J91N8j81L74R7m12L91L16
1274C14l89O5L63J5k01K07Q6K3j49K23k45j04p9K57km10M5n7k99PJ09j43j64L38
$$ y = [111, 155, -56, -68, 80, 79, -46, 156, -499, -502, -497, -477, -934, -556, -245, -913, -1175, -866, -868, -1256, -533, -730, -984, -890, -442, -404, 113, 377, 65, -179, 124, 513, 800, 863, 623, 845, 855, 751, 892, 743, 714, 612, 863, 153, -76, 143, 85, -301, 62, -358, -773, -652, -517, -679, -269, -641, -1073, -509, -592, -306, -139, -275, -444, 60, 177, 45, -2, 429, 95, 382, 370, 64, -91, 728, 80, 65, 156, -131, -391, 127, 169, -324, -170, -462, -220, -224, 158, -342, -78, -248, -320, 530, 21, 82, 439, 502, -208, 677, 764, 498, 675, 783, 510, 230, 508, 73, 162, 299, 255, -294, -307, -388, -335, -142, -766, -720, -600, -846, -576, -469, -264, -501, -311, -169, -264, 109, 131, -22, 107, 599, 274, 159, 594, 525, 436, 875, 399, 412, 640, 369, 371, -9, -53, 44, 43, -181, -207, -72, -488, -520, -329, -271, -452, -78, 19, -393, -2, 314, -75, -10, 353, 368, 167, 374, 460, 483, 334, 557, 312, 208, 129, 386, 384, -26, 19, -38, -337, -330, -221, -364, -528, -190]
1298a90l61R0K1j72M47j86J53j15R8L61M1J03k40L46r5o2J54o1n8J30J27k4l79
1321A28J30j19j27L9l43J00p5k10K58j92J10P1J99l92M49j7l4k1J53J59J5n3K07
1344D35o9n8l7J96k93k7J73n5k83r5j05j83N2R6j08k23j26j0K50j55N20m06L0
1367d81J84K7J86K7K25k51J20L69L3K0J86P2M0j30J97n46J52P8j34m07r7L46m37
1390b21j93J60k36J64k02O7M3j72P4J76j87L0L79m6j94K44Q8J69l72P59l56j32
1412D2K12L0l16l5L31l73Kq7J00n1K3l44J5J30k43M72k71N0n5J97J73KJ9J95j41
1437G7L93j53j58L05l13J51J06k27j08k1R6K00l82M0m2Nl02k53K14J30l08j9p0
1460f39O0J73M5q4J68O6l2N6N6K78j14K14jJ76k31L54k41M18j24m7K10l16l30
$$ y = [-190, -551, -461, -440, -612, -165, -351, -198, -313, -215, 146, 187, 290, 50, 396, 301, 239, 393, 332, 274, 404, 531, 507, 128, 258, 139, 12, 51, -292, -192, -267, -477, -219, -411, -301, -230, -31, -423, 26, 9, -25, -46, 107, 266, 281, 228, 435, 366, 308, 271, 467, 174, 147, 320, 265, -18, -113, -218, -401, -349, -253, -361, -584, -710, -720, -470, -625, -105, -511, -481, -297, -270, -84, -57, 168, -83, 37, 406, 439, 459, 645, 717, 757, 627, 824, 278, 430, 508, 374, -33, -130, 216, -221, -414, -254, -490, -326, -528, -461, -418, -590, -516, -340, -527, -497, -118, -164, -358, -114, -26, 143, -229, 530, 174, 42, 254, 284, -32, -67, 264, -109, -107, -194, -94, -145, -122, -466, -451, -321, -564, -92, -363, -313, -368, -171, 2, 4, 23, 218, 77, 470, 317, 159, 464, 151, 302, 408, 181, 73, 52, 148, 348, -34, 6, -36, -31, -333, -586, -372, -242, -550, -569, -639, -579, -406, -361, -445, -277, -211, -243, -187, -131, 147, 33, 247, 246, 422, 191, 545, 304, 722, 598, 551, 761, 445, 115]
1483A15QL10l48qj06j80J62j70l9l40N80p7j69L18l93M6J36L24o7J58j68M1j73
1506d0K27jL34l56P0l6n2j19J50p9rq6M8k68N7L34l68j41L31j39m03N50l87M24
1530D1j0J89k20L79l9p3M09l43j21L25l9j51L18m59PR4K04p28K81K7k88j61L8
1553c20k30P1R3k28P7J15R6o8L07m10L72J53Oj75O19k54l14M90L01m37K70j06
1575D28m8M3J01L1n01J75l88J71J86J7k56k64j29L93j70r4j65L80j09N7J57n0
1597c5k3M48l38j39L33J63l18R3K20m98L74l8o1K6Q3k85k11l6N4Pj26L9K7j80
1621d21J8k00M88k58Q1K32j11M9L09k33K49J35N0J66k54K17j06o7oN6J4j20k7
1644B61o9J40n06K10N2l97J28j40n3J20k8j88J40K05q3P1k64K07K70n4K01k03
$$ y = [115, 123, 433, 85, 77, -29, -209, -47, -217, -256, -596, -16, -93, -262, 56, -337, -291, -155, 169, 102, 260, 92, 133, -40, 187, 186, 520, 164, 234, 198, 146, 27, 177, 98, 89, 3, 51, -217, -160, 174, -194, -335, -4, -143, -546, 4, -383, 41, 31, 220, 0, 379, 340, 267, 676, 333, 212, 537, 498, 347, 665, 206, 213, 307, 511, -217, 64, 91, -197, -358, -320, -550, -479, -386, -614, -537, -422, -326, -394, -87, -497, -125, 28, 34, -141, 478, 224, -90, 400, 701, 264, 534, 428, 380, 423, 524, 555, 54, 229, -159, 12, 198, 215, -41, -305, -434, -41, -211, -305, -470, -90, -199, -142, 15, -35, -58, 390, 52, -87, 246, 409, 91, 184, 404, -94, 280, 242, 181, 207, 290, 5, -206, -242, -188, -181, -307, -268, -241, -421, -403, -603, -115, -373, -292, -60, -171, -122, 187, -46, 203, 338, 388, 554, 300, 517, 411, 344, 338, 394, 408, 288, 261, 192, 332, -174, 36, 88, -309, -181, -321, -374, -254, -282, -470, -330, -125, -208, -137, -401, -194, 76, 22, 223, 20]
1666B0j13J92J35K8jQ9k3L8Mp8l24%r2L01k91j47J92j70j66J24K86o71M31R0q5
1691b31j30L04N3J67j20K98j30j46Q9L04k03q8L22k44j35R9O2k66J06N9n9k79
1713a68r8J04l76K98L0k83M34k15j35K77q3q1J95R6j66L03l2O1K20m24M26l59
1735B4L80k14k5K66q2k73J92l7j64l3k08l9M3j08n18N08J46j69P3j89M01p8p6
1758a80J41J09J04j76J8qQ0K59j09L01n28K90m9K0J49k33j88k75K15r4P8N1m33
1781d58J58L9k2J01j41J3M3M40k99M0J30l06L77Rj64K22J80k29P3J16Q8l07K56
1804C59K7p4l16J87m13L5j9M5k39RL74j40k50k4K08%j76J71J28k5K67l3j72J27
1828E6Q1J04pJ47Kp8o1o7p4NJ3j21o2N3q5j33mj3J25j58M7R4j24J10l1J04k84
$$ y = [20, -93, 99, 234, 262, 261, 350, 327, 365, 369, 291, -33, -33, -125, 176, -115, -262, -70, -240, -406, -282, 4, -667, -236, -146, -231, -361, -57, -4, 163, 43, 341, 211, 65, 154, 458, 255, 167, 489, 245, 110, 209, 271, 5, 111, 170, 111, -168, -266, -162, -538, -240, -210, -493, -59, -274, -409, -132, -215, -296, -101, -5, -171, 132, 100, 161, 381, -43, 383, 24, 404, 190, 165, 431, 349, 76, 268, 231, 67, 34, -174, -213, -170, -278, -796, -288, -142, -311, -238, -427, -26, -104, -180, -39, 70, 174, -2, 16, 8, 88, 347, 238, 539, 11, 301, 252, 272, 421, 188, 0, -275, -60, -154, -76, -25, -458, -300, -261, -283, -182, -323, -310, -267, 173, -126, -86, 44, -262, 115, 124, -40, 182, 362, 133, 206, 322, 410, 103, 359, 386, 312, -4, 183, -230, -195, -214, -169, -408, -399, -25, -165, -415, -439, -231, -231, -407, -236, -108, -133, 134, 101, -71, 56, 137, 241, 234, 381, 383, 305, 244, 177, 103, 108, 121, 0, -62, -9, -94, -227, -231, -244, -119, -277, -230, -136, -260, -150, -181, -77, -361]
1855c61M51j96K21J00k35K82J03O2j37J41O8j42j97J38O7k50J75l55O2K5m2m36
1877d56J87J57l91K09J15o7j18J73r6K32Q8k42L45R2k16R5K4N7L6J81l80J95j63
1900E7K45k08j40J00j19P5J35k53j23M9j08K47k4N5l42K45r0oR5M3K77k77J6K15
1924A64J19k11K67j21J06j59J19j06p6J01k5q5j09q6R0m6k10n3J12j54K16k57
1946d04J21l7J29M3l37M83j07pJ86n4L4J0L06k46J97j39J41p4o0L8l8k69J84k74
1970a74m0l2L74p7k45J61p8N9m33J47J87N4l8p5P4o3K88j56j28N80k19j8pk1N8
1995A78n5n4J98j70Q4k61l5K09l10J60N5k62r0J29qr7M2m9O8p4L03J02o9J68M
2020A66J97k44J17m7m0K38q7qj5j69p0M7M5k2k18k1j53K27Ok6l99J29J44l8Q3
$$ y = [-361, 90, -106, 115, 215, -20, 262, 365, 427, 290, 431, 499, 357, 160, 298, 365, 115, 290, -65, -3, 22, -20, -456, -269, -112, -503, -294, -179, -246, -364, -191, -287, -55, 33, -209, 136, 228, 12, 107, 131, 188, 224, 405, 25, 220, 57, 302, 94, -46, 54, -65, 10, 145, -108, -231, -182, -290, -43, -67, -12, -354, -109, -199, -205, -110, -67, 210, -67, -51, 164, 283, 72, 339, 218, 324, 165, 284, 178, 102, 203, 178, 93, -16, -102, -12, -58, -268, -321, -209, -363, -147, -404, -283, -320, -191, -148, -485, -2, -109, -116, 70, 16, 50, 60, 366, 120, 317, 178, 319, 245, 185, 223, 185, -84, 100, -174, -214, -246, 128, 51, -194, -33, -111, -52, -485, -338, -151, -97, -135, -210, -136, -199, 89, -67, -195, 385, 166, 148, 141, 120, 178, 123, 69, 267, 97, 181, -80, -115, 94, -216, -56, -1, -263, -353, -224, -232, -329, -287, -336, -268, -342, -39, 63, -6, 162, 166, 363, 119, 236, 189, 149, 387, 300, 292, 277, 108, 38, 85, 130, 108, -110, -131, -284, -57, -51, -77, -476, -347, -203, -241, -158]
2045a58pJ26K4l1J37K3k54M36q5m8J55k2k90K25JJ18k39j13QK7j21Q6R5k36R5
2070d8j01j55k48L60O6k9L8J34j14j74R1LJ35Q1p5K40J9Q0j11O9m9j49J22j76
2094IN4l4k9k29K25j22p2LJ30n6Omk47K98j64j95K83M0N8k74N93m58J34J88m2
2119I5L4N0R2j08K89k3K7j68Pp6j43r9%k92Q3K40l28L20Lj57R7k85J28J78k30
2144b66j73L84j61K22J12l8J03l7N0j80J34M7R6j48K08k71p8J13k09M59n92K7
2166a98J49j20q8J27J2j33L33j89j74j53K51O3K90k85nM3K90m9j92L50k81N7J2
2189A10K16j55J64o3m10M2J7J23k50K55k80J43n7l7R1l8K9l39M42j48n6J89r5
2212a07J01R8q3q5K66J7j14K21j53k04K15k9J79n13K29k74r4M42k61N1j68J8j64
$$ y = [-158, -165, -39, -15, -46, 91, 114, -140, 296, 211, 163, 318, 296, 6, 231, 232, 350, 111, -2, 6, 33, -88, -2, 93, -143, -48, -149, -304, -552, -192, -126, -155, -117, 17, -97, -271, -180, -177, -42, 39, -36, 204, 223, 303, 192, 261, 212, 63, 185, 9, 63, 29, 0, -229, -4, -126, -198, -195, -65, -121, -115, -119, -366, -68, -232, -427, -144, -104, -46, -320, 273, -185, -51, 137, 95, 129, 179, 271, 163, 452, 429, 456, 288, 295, 219, 76, -23, -23, -315, -232, 8, -320, 0, 3, -154, -57, -342, -214, -36, -266, -439, -55, -216, 6, 118, 80, 183, 146, 196, 16, 150, 197, 293, 145, 353, 82, 4, 117, -92, 367, -225, -198, -49, -169, -257, -130, -118, -251, 82, -107, -281, -434, -183, -120, 170, -115, -120, -77, 213, 164, -28, 322, 41, 98, 110, 326, 171, 335, 272, -138, -96, -79, 44, -206, 49, -231, -88, -145, -182, -91, -129, -100, -439, 3, -145, -201, -12, -107, -6, 92, 9, -76, 190, 207, 93, 314, 161, -43, 172, 143, 322, -191, 38, -236, -330, 112, -149, -98, -266, -248, -412]
2235d12J97J5j6O6j71K16K61m60L10K11j41J8L7L30j20j30n3J23j73J3j1K25k26
2258A09n2M6Pj05k47K45k40RR7j5Pm2j16L30j25p4K89k87K89r0j93L97l1j36R0
2283A62k3P4M9j9m3k08p2Q0J01j49p8J41Lj99j67J31K0N1Q3j40k9O5R8j38M0R
2309a58O5K87k76l8J17M05k38J47l12P2K02k82N4k2n5K31o7q8q9l14K57k65J59
2332b08L3R4l55M07K50m88J68J70q8J10L0k39K14m2R4P9j11M6J81j89O9j90j93
2355a58K55q4Q9l37K85j91L4M8l5k21k0J74j51L57k15K13q9L49k17R6k91K20p2
2378C9J72j72J32k54M6qK59L8j30r8O2J24j40j1j83Nj29J80j60l3k7K53k20K42
2402a3o4j68M59k11N8P2j40o7J62m1J92j38n1om7K5O0p3J77l64J56j00K36l91
$$ y = [-412, -215, -200, -216, -150, -321, -105, 156, -304, 6, 217, 76, 94, 131, 461, 341, 211, 158, 281, 108, 121, 110, 335, 109, 57, 103, 110, 5, -242, 3, -237, -228, -131, -146, -139, -181, -297, 33, -92, -166, 123, -164, 125, 35, -158, 239, 208, 72, 162, 139, 213, 262, 243, 200, -8, -80, 0, 101, -48, -126, 15, 18, -181, -348, -217, -197, -146, -63, -203, -232, -167, -69, -207, -167, -158, -93, 194, -82, -120, -3, 402, 164, 311, -1, 71, 273, -9, 45, 23, -32, 199, 132, 44, -45, -359, -102, -367, -208, -175, -81, -436, -29, 221, -267, -99, 71, -17, 93, 123, -116, 98, 56, 150, 229, 118, 164, 345, 156, 225, 35, -158, 97, 13, 102, -235, 50, -141, -107, -59, -94, -315, -335, -161, -312, 45, -170, 43, -46, 303, 86, 182, -109, 111, 39, 211, 39, 171, -83, -37, -45, 214, 252, 122, 24, 86, 210, 70, 59, -124, -119, -248, -68, -228, -261, -288, -35, -255, -13, -77, -245, 214, 3, 61, 133, -7, -74, 88, 47, 239, 101, 50, 44, -3, 22, 82, 9, 186, -178, -22, -122, 114, -277]
2426b77K75k29N1K12j64J78o2j23Q9k1j07K75j59KQ2j74N01k64j02K6J32LJ55
2449B99l30N5K20k86K28q5j62j02M5K49l30l3O9L09l43l3K21o5j43J58L16k85
2471b8Q0J81r7j01J51p2j3J59j25k7j2JQ2k23J92j44j73%L4L1Rn4L1k27J11K70
2497C6j98j8J71j11m1K66k18k77N53j25N7J04Jj2J70m7l94K12Q1k82m4J68j69
2520a17J3J00p4J46P2l11K65k66K7j54N52m01J9kJ22J52k39O2K45Q5k73P8k4K49
2544C26m28M20k09j92J61J77q9k89M77l61l0q2p9o9L27l55J70ok7K4J26k4l4N0
2568a6N6J25j90R4l7L67j43j29j38M7K26j15q2Kj68K46j53j02m6KO7J00P2k83
2592a98K3N7j25l9M20j92J13j01R7o6J56j56j61J90K29l35M17q2l6Nl28J80N4
$$ y = [-277, -2, -231, -180, 32, -132, 46, -16, -139, -50, -71, -178, 97, -62, -60, 22, -152, 349, 85, -17, 9, 141, 144, 299, -31, 24, 244, -42, 186, 101, -61, -163, -118, 131, -199, -232, -163, 146, -197, -230, -9, -74, -217, -59, 257, -28, 52, 233, 136, 35, 186, 114, 101, 260, 135, 108, 96, 97, 179, -44, 148, 4, -169, -169, -135, -104, -95, -149, -118, -345, -234, 36, -162, -180, -9, -120, -161, 105, -113, -390, 163, 38, 95, 199, 200, 188, 358, 311, -83, 129, 210, -72, -116, 52, -117, -104, -4, -78, 68, 140, -171, 94, -172, -145, -299, 253, -148, -129, -131, -9, 143, -96, -34, 211, 296, 23, 101, 77, 326, -102, 318, 109, -83, 78, 255, 166, -123, 354, -7, -37, -119, -198, -267, 60, -295, -125, -131, -158, -134, -8, -32, -66, -16, 40, 165, -25, 69, 32, 399, 256, 127, -11, 36, 262, 147, 65, 67, -101, 145, -8, -110, -156, -154, -87, 13, 85, -198, -175, -118, -243, -282, 138, -54, 59, -42, 55, -11, 145, -11, -172, 18, 247, -88, 329, 247, 211, 216, -112, 68, 122]
2615A22K5r9j28Q0J87k37j58L2K7K4o2L7J0K18k43J91J30R8k26O0j01J09N2j02
2639D6K6j4J72j8l93M37k14R4k06Q3J11o5k93J20J64j00k92J89R0J5J2q0lO0M4
2664a5r1J32J50k06J02M3K7j13J36q7r7L11j36n8Ok84P2N7n8j34K4R4j29K16j69
2689b07P6K73k50Q2k82K35n3o0K22j25L36j54n4J74l35M01J04n79L96J17l39K31
2711B09j58nk53K9J47k91J48K7N8k95L29l04R8k0R7K0L37J38m01J00%j31L62j56
2735H5p4K66j19N5o5Q4k15J57r0l0K2j83J06n0J07j22n0J36o9j10J09k00J6R3
2759a41K20k13J86lo6P6j11J18m1MJ27j2J03k57K60l12L25k06O0j78q2J32K9l2
2783a4P0k61J28J3j35J43J27k02K0q0m4K42j1K8k9L63k78o9J5J19j91J02K15j90
$$ y = [122, 147, 48, -80, 0, 187, -50, -208, -176, -149, -125, -187, -150, -140, 78, -165, 26, 156, 254, 28, 88, -13, 96, 148, 46, 72, 58, 230, 212, -181, 256, 42, 136, -70, 13, 124, 59, -234, -114, 50, -50, -342, -153, -63, -48, -36, -116, -119, -59, -15, -106, 26, 176, -30, 72, 115, 142, 29, 165, 78, -19, 292, 156, 98, 104, -180, -108, -51, -109, -243, -219, -125, -254, -38, -207, -131, 142, -108, -26, -308, -73, -126, -186, 36, -89, 247, 93, 39, 213, -122, 279, 383, -196, 200, 317, -22, 209, 51, 46, -207, -178, -31, -322, -174, -147, -89, -384, -55, -359, -261, -281, -184, -164, 173, 311, -90, 10, 10, -121, 241, 85, 11, 277, 158, 213, 148, 232, 17, 174, 84, 54, 76, -107, -1, -51, 56, -66, -116, 20, -49, -159, -50, -250, -234, -141, 79, -134, 52, 49, -17, 59, -52, 66, 25, 29, 156, 144, 247, -10, 250, -62, 263, 57, 117, -61, -143, -11, 18, -14, 56, -205, -77, -64, -199, -56, 71, -131, -111, -191, -235, 7, -4, 24, -5, 358, 80, 11, 26, 145, -46, 56, 271, 81]
2807H1j05J10j6P3k10J86k4k95P2k80K01J10l5l0J59k62J78LK38k06L64l38o9
2830i5j09J68QJ72J77j51j99J10n2N6j15o7K93j21j20J30j58k7j89J41K30l64
2852b82M49m38J56L5N7J63k36m5J54j09J03n7J66K3p9Q8J34P5m23r4J64J04p2
2875C6J25q7n2k4j6N1j77l9P0R6o5m0mJ76k03R0k2K54m4j62K29k71J47j64L65
2900B69l04J44k1oJ49p0j40n9K65n30J65j09K81n5j22O2P7k68J09J96m4J51r9
2923D1l2MO6K8J45k04J97j71K84l25p3K32j43j2k7O8J92k05m1k41K9J42n6J76
2947G4j39R9K5k30N0n2J30k04J1R9J37K58p1m83L24j08m1J67j52J55n8oJ14N9
2971A58r0j02j13R4j43J43q4j3J41k22N3N6j6J22n9k1K48j76M5m9j19J90R1M2
$$ y = [81, -24, 86, 70, 143, -67, 119, 95, -200, -128, -408, -207, -97, -132, -162, -3, -265, -87, -84, 154, -52, 312, -26, -95, -204, -36, -28, 144, 321, 170, -29, 81, 29, 85, -30, -97, 196, 75, -45, 85, -73, -100, -289, -148, 82, -282, 167, -271, -115, -80, -23, 140, -96, -141, 13, -96, 7, -50, 116, 139, 60, 148, 282, 357, -66, -160, 4, 108, 36, 161, 74, 22, -2, -18, 33, -144, -183, -113, -17, -82, -122, -126, 50, -153, -63, -85, 169, 125, -37, 192, -79, 68, -96, 269, -35, 109, 88, 82, 231, 161, 21, -38, 227, -303, -138, -247, 34, -21, -143, -81, -4, -272, -163, 33, -11, 140, 41, 9, 13, 79, 107, 252, 48, 245, 74, 358, 33, -40, 192, 49, 37, 10, 78, 270, 65, 24, -217, -188, -46, -102, 74, -65, 34, 59, -171, -121, -173, -43, -247, -236, -137, 0, 258, 187, -296, 28, -80, -121, 46, -106, 49, -9, -15, 99, 158, 68, -34, -147, -53, -196, -53, -137, -150, -9, -231, -178, -122, -138, -16, -75, -96, 152, -24, 21, -28, -147, 43, 134, 176]
2995A76P2J07j32q8l37L08k73K52K29k69j51j62J90l2j2j92M83l60K34k44J66
3016c5j16J24r7j4K73k18J24K9o4k9N3K58r0J86l19L43l80j05L45k45j81J88r2
3039f2K02j87O7m03K53o8J75K4j83j14J22K79k71N3J34J78Kl50J65J22%k15K74
3062A97j81J40k21K9K72j38n8j01j83J77N1k60K15J49r6J13j81J47l34J38O7J75
3084A17j77L7J23o7J25pj05l2m2J80J51q8r1J62l43K20m3o0L7k81L34l29K21j15
3108g3k05J18mqL7J2j1J08L2k8J62l57K36j30J14j04L14rm1J3pJ74m20K41m0l4
3134I0q6J17Q5p1M9m05P0P9j16J1K37j3k42J47k70N03r8k41M04n9k24O9J29j18
3158D7k6J52j78Q0J54k91o5j6J89j5k02J09J44j32r1J10L2r8k2j20J80J14k40
$$ y = [176, 248, 355, 223, 135, -202, 106, -167, 85, 314, 45, -106, -268, -78, -110, -122, -314, 169, -191, 43, -201, -35, -151, -27, -124, -138, 135, -83, 41, 70, 6, -23, 30, 288, 198, 384, 65, 408, 28, -77, 268, 23, -158, 30, -62, 140, -47, 20, -383, -130, -198, -23, 1, -182, -296, -174, 105, -166, -113, 21, 199, 201, -149, 16, 138, 138, -77, 197, 16, 156, -65, -36, 236, 98, 40, -61, -244, -67, -16, -276, -61, 88, -8, 105, -76, 71, -263, -125, -58, 117, -60, -23, 100, 33, 158, 151, 46, 14, -28, 152, 303, 215, 124, 286, -57, 163, 120, 60, 97, -184, 150, -179, 42, -73, -278, -160, -164, -172, -135, -123, -134, -26, 6, -22, 140, -217, 19, -111, 3, -101, 213, 204, 163, 176, 169, 343, -77, 164, 124, 90, 4, 121, 206, 135, 184, -221, -151, -72, -188, -177, 60, 47, -195, -48, -318, 185, 87, -154, 250, 191, -33, 36, 165, 47, 21, 173, -5, 75, 229, -62, -127, -143, 46, 31, -171, -62, 82, -50, -141, -31, 1, -97, -119, -239, -59, 55, -185]
3181a85L22j20j66J11L12m20J23Q9J3P0q0K12k83J43Kk86K46Jj17j04j0K7q9J21
3205f8J19n7m7n8J47k6M0j18Pn3kn6K05ol2n6M74k66J17n1k15J03J76k62r5L34
3231B54l8j18q2l0Nk02J84J26k23M7p7J29k6m6K51q4J23L2m07M54k17K0j41J20
3255E4J70j05l6P5J09m48K27O5J0j73j58K48k9J03j90O7q6q1q7J93op9M1p2L07
3280A19j32J61k1Q2j46q6p8J74J22j12p8k30K88J79l54N6J64l29K19k80O3J57
3302f2j38M8P0M5j56L7K18j10R8j04r0L91m01M5J52L9j35J80O8l24J93j84j01
3325b21K29j33J4J61j46p3R1J4j70K80q5L5Q9J64n55L01k6k58L01j91K41j35J19
3348D6K74k08o8l0J77l42K80n1l3P7k47J86O3kj81j93R1J08M9k20L4K5M4P9J20
$$ y = [-185, 137, 17, -149, -38, 274, -146, -23, 66, 79, 149, 69, 281, -2, 141, 143, -143, 103, 104, -13, -117, -127, -100, -189, -68, 51, -6, -53, -111, 36, 10, 50, -68, -61, -114, -116, -172, 33, 27, -5, -61, 413, 147, 264, 213, -2, 101, 277, 15, -80, 254, 216, 98, 16, -14, -9, -211, -27, 99, -124, -77, -154, -25, -51, -97, 154, 70, 193, 225, -182, 272, 55, 75, -66, 54, 224, 119, 83, 158, 267, -181, 46, 111, 121, -52, -210, 38, 9, 112, -78, -11, -97, -178, -265, -72, -78, -157, -116, -188, 119, -13, 148, 127, 209, 63, -23, -101, 73, 195, 83, 5, -225, 63, 242, -112, -56, 108, -221, -2, -282, -219, -62, -200, -152, -82, -37, -193, -156, 62, -48, 50, -54, -144, 247, -154, -109, 43, 82, -53, 127, 195, -129, 64, -120, -221, 8, -125, -111, 50, -96, -169, -78, -64, -234, 46, -39, -4, 85, 249, -306, -5, -31, -289, 12, -179, 62, -73, 46, 320, 112, 44, 14, 191, -151, 129, 78, 45, 122, -125, 61, 124, 122, -59, -252, -161, -53, -4, -224, -190, -165, -121, -42, 78]
3373G8j02J20k59K38P3N0Nl0k32J60J98j13j62J95lj53r7k82L51J2j35O0mj4l3
3398g9j13o0J58J6k41O4J76M1L2n6K88j37j74J08J45q7p6j16%R4O8J77k68M06
3422C66j71k68P8j69P7O8N0j67K27k65L9%J00Kj46K55j7J46l18K13J56p8k19R2
3446E1n8j22J83K45j97j41J62j49j71K37J75n5l3j84M54o90K56L99m92p1O5K35
3468I9n8k8j8K8O5l57M98j97q7J49j0N7j90J92q3r5l7J78O3J4m3k5k97K10q9j22
3494a83J37j40N1j46J70j33K67k39K88m2J65k99N3j51K82L7J94j61j70K9N4P8
3516A41N6j04o6N6j73L3L1N9Nj4J50j94q9j19K36j09Q4j01K41k47l1K23OM3k09
3541i2M9n7j8K34lK9J1L0j38J35j21k43K34j37J32j91J05J9n8Lj12J03j14J47
$$ y = [78, -24, 96, -163, 75, 148, 198, 203, 173, -59, 101, 299, 186, 24, 219, 216, 63, -34, -316, 35, 47, -88, -28, -32, -46, -79, -192, -252, -94, -78, -319, -255, -79, -38, -6, -62, 226, 89, -85, 23, 168, 81, 5, -111, -111, -17, 51, 228, -40, 366, 195, -73, 5, -164, -87, -19, 31, -136, 91, -174, -135, -135, -35, -33, -179, 76, 59, 205, -113, 100, 256, 178, -41, 51, -7, -129, 54, 299, 102, -39, 123, -26, -197, 40, 215, 160, 127, -57, 397, -293, -37, 362, -130, -201, -136, 99, 41, 13, -5, 23, 88, -269, 229, 32, -55, 94, 84, 141, -49, 143, 60, -35, -72, 106, 169, 183, 140, 115, -182, 28, -61, -183, -46, -186, -135, -281, -111, -244, 23, -216, 72, 30, 195, -104, -51, -202, 80, 117, 311, 150, -20, 9, 63, 141, 197, 93, 27, 83, -90, -57, -26, 33, 38, 24, 174, -20, -109, -228, 8, -101, -17, -118, 123, -124, -155, 68, 74, 117, -92, -43, -100, -118, 116, 113, 142, 153, 183, 45, 180, 59, -184, 50, -87, 45, -146, -41, -22, -80, -77, -189, -86, -200, -53]
3565e3r8K9k8K5J62l3j97K60j98K23k09J66O0k21K14j4L3k6Q4k95J26J52o5k02
3589a05Q6j73P1q8OK56k76j02L04k97L66P2l62K99l8j95K21L4j55K46l4m6q1R7
3613A06l7K19k22j59Q6r9KOj43L38l3q3K3J27k59J47j60j8J26rJ09L4j89J09k05
3638a84J35J02rk9m1j16L6K03j19j78K70k4%J13Pk03k3J31n3k23J70J28M4k12
3662g5L8j47J66k38J20J63M3j59K07J43k30j63J50j82L16j0Pn7L1J43o1nk45K12
3686A67j74N3q8J58l20K09J23j50q3N3L16j47k02J79k87J77o5K87Kr6j50J32P9
3709A73k77J03J56L4r6mP4l39K17M6j32O4mJ64l12Q3L2J5j59L36k27K9J20k10
3733a14m6M44m2l24P1M8o0jK4R6l8j26R1M5n7n9J97m07K09jJ45j3k70J71l8J0
$$ y = [-53, -151, -122, -150, -125, 37, 4, -193, 67, -131, 92, -117, 49, 109, -112, 102, 88, 121, 95, 179, -116, 10, 162, 97, -105, -19, -192, -121, -209, -203, 53, -223, -325, -21, -318, 48, 120, -242, 57, 19, -176, 45, 79, -76, 170, 136, 90, 9, 106, 69, 288, 66, -93, -7, -106, -104, -98, -241, 97, 64, -19, 4, 131, -128, 19, -141, -159, -33, -42, 67, 101, -88, 21, -184, -49, 53, 44, 15, -26, -142, -106, 97, -22, -200, 70, 46, 46, 159, 166, -37, -60, 71, 18, -205, -35, 93, 137, -75, -37, -184, -18, -256, -136, 27, 70, -89, 118, 261, 31, -132, 18, -164, 152, 142, 149, 92, 123, 266, 205, 200, -45, 167, -7, 46, -42, 116, -204, 5, 128, -22, -105, -52, 264, 117, -85, 94, -193, -16, -81, 206, 208, 112, -38, 94, 173, -104, -1, 155, 189, 93, 89, 163, -176, 41, 87, -45, 19, 15, 179, -133, -50, -18, -3, -162, 174, -53, -24, 96, -114, -160, 284, 242, -82, -11, 37, -23, -24, 0, 96, 58, -68, 23, 68, 11, -48, 149, -258, -49, -50, 95, 82, -188, -17, -55, -45]
3759d5j08J28k3j50P6J04k1J25k92J76k57N27j46j63J15J72j07l33N4L11j37j1
3781eJ44j33p0o3K13k98L29j30p0K33o7j47J79l27q5L18m2J82k36J82k46J55j71
3804a55K07k66K13o5J87N3K7k51J37M2j78pJ25q7j8j09K3K51j98J40k01o2J94
3827Bj43L07M9k25P7J43j51lj74J33P6N7k10k8L10j25J16m15L27j16K0K19l73
3850a27N8L3RK7O1J6j83L34j86j71J77m50K95l4j3J27J3Q4ok59M17q4l94N86l47
3875a7M3j5j51J62P7Pj90k4L0R4j15l4J1L38j26k27K17j5j33J16k3R5k22L9K7
3900c6P6j00J80m1N3j52J43k3l2MK08k34j07K09l09lj79L33k24N3K96j29j51L1
3924a34K57M2k9j11J36l84K29J00j88K03l03K71q9J78j53K72l21J27k58J03J46
$$ y = [-45, -153, -25, -48, -198, -122, -18, -39, 86, -206, -30, -287, 240, 94, -69, 46, 218, 111, -222, -168, 143, 6, -5, 139, 6, -64, -127, 86, -212, 117, -13, -83, 150, 83, -64, 115, -212, -297, 21, -21, 161, -75, 107, -139, 16, -155, 52, -214, -1, -66, 121, 174, 201, -50, 87, 129, -49, -56, 69, -18, -36, -145, -122, 129, -69, 71, -130, -192, 2, -141, 166, 215, -10, 67, 210, 59, 56, -118, 15, 91, 148, -62, -90, 220, 95, 211, -204, 123, 7, 27, 246, -127, -69, -36, -27, 0, 61, 77, -106, 228, 42, -129, 48, -402, -107, -141, -154, -27, -14, 70, 64, -195, 222, 138, -256, 330, -17, 26, 11, -140, 22, 99, 106, -84, -108, -78, 16, -99, -133, -122, 216, 90, -137, 80, 65, -68, 48, 25, 120, -102, -63, -36, 40, -60, 120, 79, 132, -20, 123, 100, 68, 72, 280, 46, -61, 148, -161, -164, -343, -10, -234, -181, 115, -14, -165, -134, 123, 165, 136, 25, 161, -223, 6, 106, -82, 121, -182, 89, 0, 178, 25, 297, -24, 103, -155, -52, 94]
3945I4J2p4Q7j51j89j56N38j04M2O5l03J76j42m33N34P5j58K45j34n1o4K58n7
3968A10q4j56K39L5j10j4Q7J05n4l75P2m3K10j03k2J90j50l7K23l14J01k64M98
3991A44k05J08j04l5N29m48K76j40N1m8j46L0m5Nj52J52r4J52q2l9J50n3j34J13
4015a5KJ04Jj12j31K59j47j19O1j58L48L5r6pk7J2n5K00j41J36Q9o17K53L59k77
4040d3j25M14l91J01m3L30k73j29K72j92j19O3J49o4K8J33mJ47r2K8N2k04jR9
4064A36j30L35l60M3J05O6q9J25k33r3L1j4J13l83L22J01k51k4K30j13Q0R5l7
4087E5l9J00J65j90j56Or0J33K22n5j52M6Q6j81O8P6l02K52l03J90J45Lj80L42
4111B41k03K3j64o3J04Q8Q1M9j88k6r2M15l77k4J94n9r9K88J70j06j05j16j8N3
$$ y = [94, 106, 32, 119, -32, -221, -377, 161, 57, 99, 164, -139, 37, -105, -538, -4, 71, -87, 158, 24, -27, -91, 167, 110, 26, -130, 109, 144, 34, 20, 107, 212, 158, -217, -145, -188, 22, -81, -103, 87, -63, -100, 123, -191, -90, -354, 144, -61, 47, -57, -92, 437, -11, 265, 125, 176, 128, -18, 12, -33, -28, -180, -28, -122, 30, -52, -91, 59, 6, -128, -15, -13, 91, 92, -20, -151, 108, -39, -158, -97, -255, 93, 128, 32, 25, -2, 10, -45, 155, 14, 150, 239, -378, -125, 234, -43, -168, 246, -145, -44, -87, 243, -30, -159, 113, -79, -198, -135, 14, -50, -22, 111, 107, 254, 162, 190, 242, 38, 37, 136, 6, 341, -19, 24, 129, 195, 106, 231, -2, -95, -64, -78, 35, -348, -26, 75, -176, -200, 30, -83, -3, 92, 55, 16, 116, 281, 91, -65, -59, -149, -16, 206, 151, -1, 45, 131, -50, 18, 94, -208, 44, -259, -69, 76, 79, -101, 241, 38, 61, -103, -166, -62, 26, 107, 156, -32, -58, -150, 265, -112, -136, 58, -1, -100, 188, 358, 252, 147, 31, 13, 66]
4135F6J91l78J56j26oj71K71j89J05r3K24j13J90ok85K94l91K58L6j87K44k54
$$ y = [66, 257, -121, 35, -91, -97, -268, 3, -186, -81, -174, 50, -63, 127, 121, -164, 130, -261, -3, 33, -154, 90, -164]
$$ [...]
8191A39
##END NTUPLES=NMR FID
##END=
