##TITLE=1H_LR-758-R6-3CR18
 CDCl3
 8 sc, 
 27.10.2023
##JCAMPDX= 6.0         $$ Bruker NMR JCAMP-DX V2.0
##DATA TYPE= NMR FID
##DATA CLASS= NTUPLES
##ORIGIN= UXNMR, Bruker Analytische Messtechnik GmbH
##OWNER= root
$$ XWIN-NMR		Version 3.5
$$ Fri Oct 27 14:57:01 2023 Russian Standard Time (UT+4h)  she@DPX200
##.OBSERVE FREQUENCY= 200.13135
##.OBSERVE NUCLEUS= ^1H
##.DELAY= (6, 6)
##.ACQUISITION MODE= SIMULTANEOUS
##.ACQUISITION SCHEME= undefined
##.AVERAGES= 8
##.DIGITISER RES= 18
##SPECTROMETER/DATA SYSTEM= spect
##.PULSE SEQUENCE= zg30
##.SOLVENT NAME= D2O
##.SHIFT REFERENCE= (INTERNAL, D2O, 0, 15.7039)
##AUDIT TRAIL= $$ (NUMBER, WHEN, WHO, WHERE, WHAT)
$$ ##TITLE= Audit trail, XWIN-NMR		Version 3.5
$$ ##JCAMPDX= 5.01
$$ ##ORIGIN= Bruker BioSpin GmbH
$$ ##OWNER= she
$$ F:/spectra/data/she/nmr/H-F/1/audita.txt
$$ ##AUDIT TRAIL=  $$ (NUMBER, WHEN, WHO, WHERE, WHAT)
(   1,<2023-10-27 14:55:56.23 +0400>,<she>,<DPX200>,
      <created by zg, POWCHK disabled, PULCHK disabled
       configuration hash MD5:
       00 E9 B6 7A A2 85 ED C7 34 08 36 98 17 FE 4E 26
       data hash MD5: 16K
       F7 9B 9A 65 38 8B F4 A2 78 53 A8 D1 6F D0 12 88>)
$$ ##END=
$$ 
$$ hash MD5
$$ E1 44 64 25 7C 64 D4 09 56 A4 D0 1D 01 1E 9D 6F
##$RELAX= 
##$RELAX= 
##$RELAX= 
##$RELAX= 
##$RELAX= 
##$RELAX= 
$$ Bruker specific parameters
$$ --------------------------
##$DU= <F:/spectra>
##$EXPNO= 1
##$NAME= <H-F>
##$PROCNO= 1
##$TYPE= <nmr>
##$USER= <she>
##$AMP= (0..31)
100 100 100 100 100 100 100 100 100 100 100 100 100 100 100 100 100 100 
100 100 100 100 100 100 100 100 100 100 100 100 100 100 
##$AQSEQ= 0
##$AQ_mod= 1
##$AUNM= <au_zg>
##$AUTOPOS= <>
##$BF1= 200.13
##$BF2= 200.13
##$BF3= 200.13
##$BF4= 200.13
##$BF5= 200.13
##$BF6= 200.13
##$BF7= 200.13
##$BF8= 200.13
##$BYTORDA= 1
##$CFDGTYP= 0
##$CFRGTYP= 5
##$CHEMSTR= <none>
##$CNST= (0..31)
1 1 145 1 1 1 1 1 1 1 1 1 1 1 1 1 1 1 1 1 1 1 1 1 1 1 1 1 1 1 1 1 
##$CPDPRG= <>
##$CPDPRG1= <>
##$CPDPRG2= <>
##$CPDPRG3= <>
##$CPDPRG4= <mlev>
##$CPDPRG5= <mlev>
##$CPDPRG6= <mlev>
##$CPDPRG7= <mlev>
##$CPDPRG8= <mlev>
##$CPDPRGB= <>
##$CPDPRGT= <>
##$D= (0..31)
0 1.2 0 0 0 0 0 0 0 0.06 0 0.03 0 0 0 0 0.0002 0 0 0 0 0 0 0 0 0 0 0 0 
0 0 0 
##$DATE= 1698404155
##$DBL= (0..7)
120 120 120 120 120 120 120 120 
##$DBP= (0..7)
150 150 150 150 150 150 150 150 
##$DBP07= 0
##$DBPNAM0= <>
##$DBPNAM1= <>
##$DBPNAM2= <>
##$DBPNAM3= <>
##$DBPNAM4= <>
##$DBPNAM5= <>
##$DBPNAM6= <>
##$DBPNAM7= <>
##$DBPOAL= (0..7)
0.5 0.5 0.5 0.5 0.5 0.5 0.5 0.5 
##$DBPOFFS= (0..7)
0 0 0 0 0 0 0 0 
##$DE= 6
##$DECBNUC= <off>
##$DECIM= 32
##$DECNUC= <off>
##$DECSTAT= 4
##$DIGMOD= 1
##$DIGTYP= 9
##$DL= (0..7)
0 120 120 120 120 120 120 120 
##$DP= (0..7)
150 150 150 150 150 150 150 150 
##$DP07= 0
##$DPNAME0= <>
##$DPNAME1= <>
##$DPNAME2= <>
##$DPNAME3= <>
##$DPNAME4= <>
##$DPNAME5= <>
##$DPNAME6= <>
##$DPNAME7= <>
##$DPOAL= (0..7)
0.5 0.5 0.5 0.5 0.5 0.5 0.5 0.5 
##$DPOFFS= (0..7)
0 0 0 0 0 0 0 0 
##$DQDMODE= 0
##$DR= 18
##$DS= 0
##$DSLIST= <SSSSSSSSSSSSSSS>
$$ [...]
##$SUBNAM2= <"">
##$SUBNAM3= <"">
##$SUBNAM4= <"">
##$SUBNAM5= <"">
##$SUBNAM6= <"">
##$SUBNAM7= <"">
##$SUBNAM8= <"">
##$SUBNAM9= <"">
##$SW= 18.05172834244
##$SWIBOX= (0..15)
0 0 2 0 0 0 0 0 0 0 0 0 0 0 0 0 
##$SW_h= 3612.71676300578
##$TD= 16384
##$TD0= 1
##$TE= 0
##$TE2= 300
##$TE3= 300
##$TEG= 300
##$TL= (0..7)
0 120 120 120 120 120 120 120 
##$TP= (0..7)
150 150 150 150 150 150 150 150 
##$TP07= 0
##$TPNAME0= <>
##$TPNAME1= <>
##$TPNAME2= <>
##$TPNAME3= <>
##$TPNAME4= <>
##$TPNAME5= <>
##$TPNAME6= <>
##$TPNAME7= <>
##$TPOAL= (0..7)
0.5 0.5 0.5 0.5 0.5 0.5 0.5 0.5 
##$TPOFFS= (0..7)
0 0 0 0 0 0 0 0 
##$TUNHIN= 0
##$TUNHOUT= 0
##$TUNXOUT= 0
##$USERA1= <user>
##$USERA2= <user>
##$USERA3= <user>
##$USERA4= <user>
##$USERA5= <user>
##$V9= 5
##$VALIST= <valist>
##$VCLIST= <CCCCCCCCCCCCCCC>
##$VD= 0
##$VDLIST= <DDDDDDDDDDDDDDD>
##$VPLIST= <PPPPPPPPPPPPPPP>
##$VTLIST= <TTTTTTTTTTTTTTT>
##$WBST= 1024
##$WBSW= 4
##$XGAIN= (0..3)
0 0 0 0 
##$XL= 0
##$YL= 0
##$YMAX_a= 165526
##$YMIN_a= -238830
##$ZGOPTNS= <>
##$ZL1= 120
##$ZL2= 120
##$ZL3= 120
##$ZL4= 120
##$ABSF1= 10
##$ABSF2= 0
##$ABSG= 5
##$ABSL= 3
##$ALPHA= 0
##$AQORDER= 0
##$ASSFAC= 0
##$ASSFACI= 0
##$ASSFACX= 0
##$ASSWID= 0
##$AUNMP= <proc_1d>
##$AZFE= 0.1
##$AZFW= 0.1
##$BCFW= 1
##$BC_mod= 2
##$BYTORDP= 1
##$COROFFS= 0
##$CY= 11.3945322036743
##$DATMOD= 1
##$DC= 2
##$DFILT= <>
##$DTYPP= 0
##$F1P= 15.7292609196834
##$F2P= 12.9074282941183
##$FCOR= 0.5
##$FTSIZE= 0
##$FT_mod= 4
##$GAMMA= 1
##$GB= 0.15
##$INTBC= 1
##$INTSCL= 1
##$ISEN= 128
##$LB= 0.24
##$LEV0= 0
##$LPBIN= 0
##$MAXI= 10000
##$MC2= 0
##$MEAN= 0
##$ME_mod= 0
##$MI= 1.114404
##$NCOEF= 0
##$NC_proc= 0
##$NLEV= 6
##$NOISF1= 3.799351
##$NOISF2= 2.8
##$NSP= 1
##$NTH_PI= 0
##$NZP= 0
##$OFFSET= 15.70392
##$PC= 1
##$PHC0= -23510.15
##$PHC1= 13.05272
##$PH_mod= 1
##$PKNL= yes
##$PPARMOD= 0
##$PSCAL= 0
##$PSIGN= 0
##$REVERSE= no
##$SF= 200.130013532006
##$SI= 16384
##$SIGF1= 3
##$SIGF2= 2
##$SINO= 400
##$SIOLD= 16384
##$SREGLST= <1H.CDCl3>
##$SSB= 0
##$STSI= 0
##$STSR= 0
##$SW_p= 3612.71676300578
##$SYMM= 0
##$S_DEV= 0
##$TDeff= 0
##$TDoff= 0
##$TI= <>
##$TILT= no
##$TM1= 0
##$TM2= 0
##$TOPLEV= 0
##$USERP1= <user>
##$USERP2= <user>
##$USERP3= <user>
##$USERP4= <user>
##$USERP5= <user>
##$WDW= 1
##$XDIM= 8192
##$YMAX_p= 0
##$YMIN_p= 0
$$ End of Bruker specific parameters
$$ ---------------------------------
##NTUPLES= NMR FID
##VAR_NAME=  TIME,          FID/REAL,        FID/IMAG
##SYMBOL=    X,             R,               I
##VAR_TYPE=  INDEPENDENT,   DEPENDENT,       DEPENDENT
##VAR_FORM=  AFFN,          ASDF,            ASDF
##VAR_DIM=   8192,          8192,            8192
##UNITS=     SECONDS,       ARBITRARY UNITS, ARBITRARY UNITS
##FACTOR=    0.0002768,     1,               1
##FIRST=     0,             0,               0
##LAST=      2.2672688,     0,               0
##MIN=       0,             -238830,         0
##MAX=       2.2672688,     165526,          0
$$ Real data points
##PAGE= N=1
##DATA TABLE= (X++(R..R)), XYDATA
$$ [...]
2112E03n3L05R2l76J48j72n4j05J54j08m18J74l27j66K01j19p4j61l32J02L09
2133d77J29m88K10J25J79L84R5j9J18P1K46n0k88L95j02J7j50P4R1l95K53j42
2155B76n9q8J11l70j29k30l21J52K30M4l22Q53k60O7J67o93M62K68j19k72M36
2176B03O8qJ19L3Q6O3L6k37M7k30J16l12m6l0l4k53J24KL0j57k71j42K21J55N88
2201A71p70J86L38n3L80j89J64K33K38k31L16k33o8K2ml9k19J07N8m73j07l18
2223d91L54k08K51o50q7M16o9L01n57p4O61o03O24K76m18L79j33N3lK49j5K50
2245E06N1j92Q7j88OK34J57p84K81m77K94n11J81q2k78M63k08m9J13QM14j02m03
2268d79N18j81p7K86J31j46K40J46k10l6N25n37N22m69J3j41K30m1j39o1p93K50
$$ y = [503, 450, 755, 847, 471, 619, 447, 393, 288, 442, 334, -84, 90, -237, -403, -202, -321, -395, -556, -888, -786, -477, -348, -836, -626, -501, -322, 62, 157, 138, 256, 327, 573, 523, 235, 630, 528, 545, 395, 469, 560, 165, 418, 276, 217, 129, 240, -130, -259, -489, -810, -658, -428, -384, -706, 147, -113, -46, 121, -572, -110, 158, 39, -233, 203, 271, 263, 382, 415, 501, 564, 600, 363, 410, 180, 296, -16, -62, -92, -126, -379, -255, -253, -223, -380, -651, -793, -572, -417, 171, -599, -413, -75, -128, 252, 63, 227, 460, 698, 467, 783, 550, 482, 504, 500, 461, 242, 349, 407, -66, -173, -491, -137, -345, -94, -744, -831, -415, -484, -183, -740, -814, -153, -756, -132, 144, -274, 105, -28, 25, 22, 271, 256, 506, 557, 365, 452, 264, 270, 504, 661, -123, 158, -319, -25, -536, -355, -437, -715, -252, -460, -509, -396, -388, 26, -76, -479, 39, -142, -219, 67, 198, 52, 292, 438, 228, 192, 717, 180, 702, 233, 246, 105, 335, 294, 155, 94, -699, -449]
2290d49L17l94L11q06P45l62O74j71l95K73O34j31k22N53o23M33m52M24j04J89
2310D44J57k37r7K19n93J25M01k09j58k30n20J59L74O1j11p83N59K56j04k27j98
2331g12M90J07J20J76k15K61q2l0L00j58j30O5K90k83k03K15m6m4J16k93k47K68
2353c5l13%k57K81j68J95l47o5K34M2R4P9K75l37J19J57N45J54l02j0L21m3k29
2376C90j19j93K83K24n03K0l8j88Q6P8O9q88K75j87N39j015N59K55J3M22k47q9
2398b54N86m76K64j55J65L03k80J57K71k17J30n50K00m6L12l53m06K38m2k08K72
2419h9R3l11Q2j14k40k10N36Kk62L28L57k68J78K3K24k91K03J64J76l49J07J43
2441D82m10r5Q0j51J51K81o32J65o58M13K8l66M75n64K79K60k33j72K3L27P32
$$ y = [-449, -132, -526, -215, -1021, -276, -638, 36, -135, -530, -257, 377, 246, 24, 577, -46, 387, -65, 359, 255, 444, 601, 364, 267, 486, -107, 18, 419, 210, 52, -178, -698, -539, -165, -104, -215, -998, -439, -183, -287, -514, -712, -222, -115, 5, 181, -34, 227, 145, 115, 415, 257, 127, 192, 482, 199, -4, 211, 165, 121, 237, -56, -303, -35, -348, -348, -605, -324, -492, -297, -644, -709, -475, -433, -339, -260, 15, -322, -203, -46, 499, 653, 351, 341, 662, 619, 390, 271, 78, 361, 585, 82, 102, 64, -124, -38, 40, 109, -779, -504, -691, -152, -1167, -608, -353, -340, 82, -165, -254, 332, -144, 120, -35, 130, 433, 153, 310, 581, 364, 494, -56, 144, 98, 410, 57, -349, -111, -153, -361, -89, 4, -307, -225, -339, -579, -789, -253, -251, -513, -185, 172, -96, 82, 105, 329, 38, 241, 405, 581, 232, 339, 482, 72, -23, 57, -94, 57, 338, -294, -129, -787, -374, -346, -712, -237, -801, -522, -262, -495, -667, -644, -317, 415]
2462D15k25m28O9O49l09j07L81L44m40k52J21P2J87j19k62o8L2m96L35k26j11
2483d38J54pO4Jm32Q11m38q3l33O66j11n10P80j62Q2P5J69k04O3P64o12J69j06
2506C62r4K2K9J44l66l40K33q1k74l88K19M16k60j44O3m28O86J1j07L23J2k06
2528a68O09j04o9Q1k25K67oj03QO7k05M30j65m29L08l31p7J11l06k1J22P6m32
2551e62R6j95j8P05l4k53k65N75K77m58K28K64j26k25L6L92nn2J57k97K95n78
2573d3K27J26j36Q8n67L05l43J35o6l19L13k88O38o83O15j86K85l26M56j07j34
2594a0K07J39l42R3M82L47m81ql28K54l89M00L85n95L4l08j29m2m11J92L73l33
2616d70k68N3Q1Q46k23o27L80nL84l36R31n45k34k2O37j13n53K82l09m9K80j27
$$ y = [415, 190, -238, -169, 480, 171, 64, 445, 789, 349, 97, 218, 290, 477, 358, 96, 28, 60, -436, -101, -327, -438, -284, -291, -227, -226, -658, 153, -285, -368, -701, -35, -146, -656, 124, -38, 44, 119, 288, 84, 147, 911, 299, 468, 362, 268, 290, 319, 463, 97, -243, -10, -91, -365, -753, -534, -118, -378, -522, -459, -887, -201, -190, -297, 26, 38, -168, 441, 337, 268, 349, 124, 391, 385, 282, 290, 357, 152, 582, 417, -12, 296, -35, -112, -1, -307, -328, -206, -130, -562, -466, -661, -679, 26, -8, -261, -526, 49, 326, -132, 96, 360, 234, 9, 45, 437, 432, 380, 537, 240, 535, -43, 184, 310, 174, 262, -305, 0, -343, -208, -274, -593, -280, -568, 70, -613, 2, -184, 101, -225, 231, 124, -10, 197, 336, -6, 87, 569, 916, 435, 427, 99, 353, -36, 364, 749, 154, 188, -120, -249, -291, -702, -510, -137, -470, -738, -685, -604, 242, 19, -608, -228, -233, 151, -185, 746, 201, -33, -55, 582, 469, -84, 198, -111, -160, 120, -7]
2638gJ01k77q6L65l7q4m39l32O0M48j07J85K31j66j85N3K24m58M77m39J57L2R22
2661F38n10k1N75l30L32k1m84J92m53K4j66P07j30r18O19j56K0o26O17o75M36
2682c30M34k82k05M42l13M51R7k51m93R60l87PJ4J16J73N40j104P03j77m58M59
2703C96K50m95M83n67m47Q10p97K52n19Q4J21k35O69m51n8M37J71m23j88O75p5
2724I3j42L46M3N5J94p1n97K60k03L01k26K21l58J36k49p4oM9M96l05J06n57R3
2747c95M6j03K9J90K87j14J31pK29Q0k14m2j56L03P5NK31l00K22o65k76L61K85
2770B02m74Q8o26O00L47k45K30n73J2k34Q18m1k29m5k7J17J24J21J54o54O34m56
2792a57O11o04L97J14k66M5j03L68l94n0J32j35J54l98M64r29L66N74j34k91m04
$$ y = [-7, 94, -183, -269, 96, 59, -25, -464, -796, -736, -288, -395, -210, 21, -145, -330, -277, -53, -511, -34, -473, -316, -284, 638, 128, 107, 682, 352, 684, 663, 179, 371, -82, -58, -224, 483, 353, -565, 54, -102, -82, -708, -91, -766, -330, 104, -178, -383, 59, -254, 197, 294, 43, -450, 510, 123, 130, 144, 260, 433, 973, -131, 572, 395, -63, 396, 646, 151, 634, 67, -380, 430, -367, -115, -634, -550, -429, -664, 5, -446, -504, -67, 104, -319, -507, 168, 93, -49, 297, 340, 395, 589, 518, -79, 181, -22, 279, 53, 274, -84, 52, -197, -271, -277, -228, 268, -37, 69, -488, -395, -349, -452, -423, -233, 54, -60, 71, 64, 293, 373, 159, 117, -39, 264, 339, 344, 575, 275, 497, -168, -444, -83, 202, -272, -184, -810, -210, 137, -108, 122, -451, -439, -673, 145, 104, -125, -170, -197, -80, 44, 165, 319, -335, 299, -157, 454, -150, 247, 361, 95, 140, 37, 405, 11, -39, 93, -42, 112, -286, 178, -751, -385, 189, 55, -236, -640]
2813f40M98j54l9M84m68j16Q16k13n22L36M65l64K5l52N34Q8m94L08k43J10oJ09
2835A62K43p51k60O60J86l15j56k69M52j17J87q1l36K77k34N03M84n53j57K71
2855A96J0m33P23k71M56p71R86p05Q5m50Q0M34m43l6m07P09m54M94j015J328p63
2876b47R8o16M85j30O21l55p7m32P77m17O55o1p40P10l94L50n2M89n75o6l02M51
2898A72K7r63M50L26l08J03N41j35l60r6m92R79k35l84L21L82R6RJ34n74j54K70
2920A09k65K24P3j69K79Nk88j34J57J57j62M4r08J238k87k70n11o0J029m44J19
2941f4p71N59N56j72J87o01N64k75N84j84l26j35K64JM12j96l62MP88o36k00P46
2963G43q67k46Q45k27o62O31j76l82N5j4J3O00q6m79k05J574r86k37L07Jn36N22
$$ y = [-640, -142, -296, -335, 149, -319, -435, 381, 168, -354, -18, 447, 83, 108, -244, 290, 378, -116, 192, -51, 59, 53, 162, 405, -346, -606, 54, 240, -75, -231, -500, -48, -165, 22, -59, -395, -118, -352, 151, 635, 82, -75, 196, 206, -227, 496, 225, 681, -90, 896, 191, 276, -174, -94, 340, -103, -139, -546, 163, -291, 203, -812, 516, -247, -149, -765, -280, -410, 211, -144, -221, -653, 124, -293, 362, 301, -439, 271, -123, 227, 175, 664, 89, 23, -279, 172, 199, -764, -314, 12, -296, -193, 348, 213, -147, -243, -735, 244, 9, -375, -54, 328, 424, 433, 567, -7, -161, 109, -156, 68, 141, -28, 251, 256, -32, -166, -9, 148, -14, 30, -878, 360, 73, -197, -708, -768, 261, -183, -64, -835, -276, 280, 108, 295, -306, 258, -17, 567, 383, 57, -78, 186, 187, 599, 403, 41, 45, 833, 197, -3, 743, -124, -370, 475, 248, -414, 217, 41, -341, -286, -300, -287, 313, 227, -252, -457, 1117, 131, -106, 201, 202, -334, 188]
2985A88n12O55K71j72m58L25j8K8q94M48N09k44m6P6q28N34L16j045M29l11j8
3006g67O18Q0m39r1Q06k65N7K00M16q93O07o05R59J10k54j19k12o8J44L83J93
3027H60m95l02O0k55R00p91l11P40p14M36l76n13J345k76l02L5l45J31pj17O64
3048C67r91R02l57N63j85K6j012P15j04M69j67k3k17J8l76j44O57n23L70o51M03
3069b60J96m81N73j32j4P7l1o4L50m66r3O88l42J75L15N05j112M70J13M4o11M23
3091C23j54j68K52l43o2L22j02l78R97q19r4m5l1K59K75J68j49n42J61k13J56
3112a87O38l79J68M44m30r7j1k10J205o71m07O92l97m17m46L93q4K21N77j301
3132f99J51J62j77N40j71L45p37P33K01m61L64K36j14P3n59k5R55m20J46n92O49
$$ y = [188, -324, 331, 602, 430, -28, 297, 279, 307, -587, -139, 370, 126, 80, 156, -672, -138, 178, -867, -438, -749, -767, -149, -69, -508, -599, 207, -58, -1, 199, 615, -278, 329, -276, 683, 793, 539, 420, 208, 140, 284, 667, 860, 365, 63, 123, -132, 768, -23, -334, 406, -308, 128, -248, -761, 584, 308, 6, 41, -304, -173, -180, -297, 367, -624, 278, -79, 484, 299, 325, -687, 28, -76, 393, 226, 203, -14, 4, -372, -516, 141, -382, -12, -663, -260, -64, -545, 28, -104, -118, -41, -72, -136, 214, -252, -345, 343, 1, 176, 491, 996, -116, 354, 467, 511, -100, 323, 169, 1, 253, -90, -152, 170, 68, -310, 687, -132, -226, -271, -302, -43, 232, 400, 251, -291, -130, -343, -187, 451, 72, 240, 684, 254, 157, 146, -64, 1141, 470, 63, 755, 358, -59, -505, -112, -196, 25, 602, -699, -548, -386, -563, -23, -194, 151, -586, 147, 348, -113, 251, 487, 373, 446, -113, -138, 817, 397, 543, -49, 600]
3153F00o82l36P02j93j72j93M88k94J2L06r3o31P3L22P4J03j00m7m26P69j65J81
3175B98k83N26q25O96o05L02k66p6O51l10N1j61J56m7k65J34l51L54J24J68m35
3196a64L33l84m24N96l59K92k62J02K63n4M0J26m3N3l70L07K61L50j99m15J88
3217B37K77m87j67M58j27K14q1k86j165J003K23n93K03J76o42P05JQ2N49m23Q4
3238B41o14K29K35j36J18K08M79o93L42k94l69M89l97L30m7L7K10J32o45Q5j60
3259b20L30K7n8l70Q7M03j74l56M70m31L92J07J6l50L69J7Q8K24n07P16o11P2
3281B41r5j56j38R2l63M27n6Mm44O86n16qM06j39J62L16m95m13O10k85J18n17
3303e63O91N71m30n53L34o37J251j50j50n70Q15mk32k62q2J32k33N9J48R5K80
$$ y = [600, -82, -418, 284, 91, -81, -274, 214, -80, -68, 238, 145, -486, -413, -91, -17, 86, -14, -61, -487, 282, 117, 298, 15, 541, -284, 412, -193, 109, -157, -233, 418, 108, 159, -2, 154, 107, -158, -24, -375, -21, 103, 271, -164, 169, -215, -639, -43, -402, -110, -372, -270, -7, -61, -21, 105, 62, 115, -255, 52, 313, 663, 464, 49, 237, 514, 27, -140, 318, 191, 405, 324, 38, -1127, -124, 99, -494, -291, -115, -757, -52, -51, 31, 580, 157, 241, -373, -144, 91, -45, 73, 281, 760, 67, 409, 115, -254, 235, -162, 168, 121, 158, 368, 500, -145, -60, -220, 110, 137, 79, -291, -204, 199, 25, -331, 139, -292, 100, 207, 223, -127, 242, 259, 347, 571, 64, 780, 169, 241, 146, -10, -148, -56, -419, 8, -48, -44, -488, 198, -318, -326, 80, -59, 103, 419, -76, -489, 121, -164, -46, -563, 128, 699, 269, -284, 50, -587, 664, 514, 364, -206, 609, 605, 373, 111, 29, 161, -72, -13, 135, 230, 510]
3324E10r23L22N73J1n44J2k8k27J77K79o39J56J80N65l64Q2l88Q13m4Q5l19k44
3346D5N15n23K84l24L59n70J36k24Q0R7m07K24K8J00K87j99K08K18k51P7q8J64
3368B36l85L43m05O76l61n07M29Q14r19M59O1m00J11r2P6J06m33L45n6J54J34
3389C86K39l37k33j43K50m66M71l05k46M19j61J52m36L35L65m48M78n55M70O2
3409B97K26j86k29o81Q26m03J4L81K03m93J83l29m38O89o17L40K1J94j48n9L57
3430A48l33K0J84N3l8K75P5j2k85J71j99O6j83j25J27J03J24m14K42J32K71o44
3452b42q0K55J9l64m8R12l56M62o58J80J88n97N53m83J113j167J99O92n57L13
3472C34l61J93lj69J44j12k33O29K9l06k49q2K19o0l88L75l96N97M11j019O63
$$ y = [510, -413, -91, 482, 493, -51, -39, -67, -294, -117, 162, -477, -321, -141, 424, 60, 142, -246, 567, 523, 608, 289, 45, 560, 37, 321, -3, 356, -214, -78, -302, -222, -125, -532, -308, -280, -180, 107, -92, 116, 334, 83, 160, 72, 236, -149, 194, -211, 465, 104, -403, 26, 840, -79, 380, 441, 41, 152, 60, 136, 242, -191, 154, 98, 252, 386, 625, 288, 55, -88, 162, -304, 167, -138, -384, 35, -126, 26, -410, -75, 290, -158, 320, -235, 235, 297, 523, 337, 108, -573, 253, -150, -136, 245, 448, -45, 138, -191, -629, 60, -557, -217, -196, -2, -150, -209, 148, -185, -165, 19, 72, 34, 309, 384, 372, 87, 258, 59, 125, -58, -183, -56, 47, 171, -243, -1, 131, 402, -242, -322, -67, -48, -412, -460, 452, 96, 558, -100, 80, 268, -329, 224, -259, 854, -313, -114, 578, 21, 334, -27, 166, 163, -6, 138, 26, -207, 422, 451, 145, -104, -186, 33, -27, -415, -40, -436, 161, 572, -447, 216]
3493B16K93j042J095j19j102M24M42M19o92j91O43o99N6O48j7o51o55J423k41
3512B50k78R00l17r79J91J31o19N85Q41p94j61J41l66n33Q71L75q41R05P1l09
3532F4L46j26p00J63o3N7L40k5J159r31l16N14n85K52L89K2p35J40N35p2m69l64
3554d05P43p22k19j01K60O20p3o0o74J060p01N72l62L20l12j50K05n73N33L25
3574B86L3j83m89r6L61l4L13L37j068R30p70K35J87O24p88l83J55J58N92j03J82
3595D79n9j53n67j81N37K46n85Q94k69p10O43m11K5L61l46K2P26r81L18J58L97
3616E44l38l07J36j2n94O01m67m68Q24m10N91J045j055k37j59O74K16j82o50M1
3636b07j37K71K16m96N60n64K53q5N06l31k08O73o04K35j71k79K49k36K07k12
$$ y = [216, 509, -533, 562, 443, -659, -235, 207, 626, -66, -257, 386, -313, -257, 391, 374, -277, -932, 491, 250, -28, 872, 555, -424, -233, -102, -721, -136, 705, -89, -250, -109, -475, -1008, -137, 238, -603, 302, 373, 64, 410, 284, -416, -253, -316, -259, 81, 56, 1215, 284, -32, 482, -103, 149, 538, 560, -175, -35, 500, 428, -41, -405, 338, -384, -603, -704, -444, 176, 103, 43, -631, 429, -272, 300, -62, 258, -54, -204, 1, -572, -39, 286, 319, 136, -353, -449, -88, -122, 191, 528, -540, 390, -380, -145, 42, 666, -122, -505, -350, -192, 400, 297, 479, 420, 267, -300, -481, 56, 302, -283, 611, 342, -368, 275, -136, -111, 250, -96, -74, 652, -329, -11, 147, 544, 206, -101, 35, 23, -571, 30, -437, -905, -81, -491, 100, 1145, 90, -147, -306, 368, 584, 402, -248, -207, -344, -73, 143, -353, 207, -357, -104, -189, 317, -14, -222, 451, -153, 82, -89, -368, -119, -355, -148, -360]
3656c60J0K32J73r5m16M53L95k17J7M59r12L58N6M80o81J42P49j023j85N29l76
3677b12J166r51O94j060M55l03K16L64o08N4k68K91N50n92j53N63j87K99k55j95
3697a32K23m85M65l4L56j076M66O20m84M81j79l97J19m6M37m88N8K02m58K11O52
3718E11m19j40P9o5m3OL65j59l30M82P1m37j09Pq3L01L61n06o59L29M97J28l06
3741a19M59k96n44m3R9J33J4O2M23k90J86j07n48M54k6m09N19l16k62Q03K64o62
3763b06K11QR9J14k20N23k79m26M23l70J06n4P9n7M85q96K17O7l79K91K31k47
3785b80J20k7J17j88N26N3p07J52M00l20K01j10J10j7J60j54L85k96k53L92l79
3806a15r3L67n99J50K19m4K02L5O5O3n69L32k70p2J38K94l3j9j81P44l28k9Jl62
$$ y = [-360, -350, -118, 55, -40, -456, -3, 392, 175, 192, 651, -261, 97, 153, 633, -48, 94, 843, -180, -365, 164, -212, 954, 3, 697, -363, 92, -211, 5, 369, -239, -185, -453, -162, 388, -204, -357, 206, 19, 318, 63, -132, 91, -394, 71, 37, 393, -683, -217, 403, -81, 400, 221, -176, -57, -103, 334, -154, -96, 106, -352, -141, 511, 92, -48, 31, -34, -77, -71, 294, 135, -195, 287, 358, -79, -188, -181, -264, 37, 398, -108, -767, -438, 59, 187, -119, 340, 44, -500, -543, -444, -311, -297, -235, 188, -102, 84, -23, -571, -117, -143, -552, -33, -349, -611, 192, 456, -206, 5, 13, 112, 226, 6, 529, 250, -176, 247, -123, -17, -71, 8, -49, 436, -460, -243, -176, -555, -264, -33, -280, -160, -187, -70, -258, 268, 321, -386, -234, 166, -154, 47, -63, 47, 30, 190, 36, 421, 125, -128, 264, -115, -208, 159, -440, -290, -71, -115, 87, 122, 187, 250, -319, 13, -257, -329, -191, 103, 70, 51, -130, 614, 286, 257, 258, -104]
3830a04J59J22q8M0p9J27j07K11j92J41k65m35L62%M49q59L55M6k8k1k17L40k22
3853b65J87K62o7k08M44n94M04R6J69l68K51J71n03R0p4K00K9j60j91j6J01K40
3875A98k42%j24J30m95K67K21j20k78M86k6K7kK11k96J34o4o8O21o44P6j23J60
3898D9j16M01j59J10O3m68J05j0R3m97N41k81PL05n15L78K13m34p7J48P8Q7K47
3921B68l08J01J68j02O5J31j77k2k34K45j97J7L28m59K93q4r7J35k19J19k48K68
3943ik42P7r7j43M73j22j11J08p9J40R9k19L8K57k11J3J92k71J69j16K56J52j77
3966A77j63K12k91l1P6%j29L2jj7L8K36j30l28J05m2R6J88J2J44J75n3j78p8n2
3991bM10r3l35K36k45J33q7L0j63r5J42o4K14j41Rj71K86J7J7k7j52J24%J21%
$$ y = [-104, 55, 177, 89, 129, 50, 177, 70, 281, 89, 230, -35, -470, -108, -108, 341, -518, -163, -117, -145, -166, -383, -43, -265, -78, 184, 117, -91, 353, -241, 163, 259, 428, 60, 311, 482, -21, 69, -5, 195, 224, 64, -127, -143, -42, 198, -44, -44, -168, -38, -533, -266, -45, -165, -443, 43, 17, 44, 42, 253, -43, 91, 27, -41, 580, -64, 12, -111, 49, -67, 334, 175, 285, 348, -120, -15, -25, 68, -429, 112, -169, -162, 143, -372, 6, 219, -215, -292, -144, -66, 21, 268, -40, 61, 229, 127, 192, 323, 146, 124, -110, 135, -62, -45, 283, -176, 117, 33, -64, 71, -148, -29, -277, -9, -251, -174, -271, -414, 59, -63, -174, -66, -145, -5, 94, -125, -87, 170, -41, -28, 164, -107, 62, -54, 202, 354, 177, 14, 226, -65, -96, -20, -20, -149, -117, -118, -135, -97, 139, 9, -319, -214, -256, -160, 28, 40, 184, 359, 306, 128, 50, -2, 408, 315, -20, 216, -29, 104, 17, 47, -116, -211, -69, -133, 81, -60, -51, -222, 64, 81, 98, 71, -81, 43, 43, 164, 164]
4016A64K2m0l8j85J96j42K02l73L28j0J2P1n2j06n5N1k84J08r4K09k51K34P9j02
4040e6m0J40j16p6j42K38j73M88k24j20M2P5J87j99Q7k43J21K68j23j73o4L93
4062B90k34Mj03r3K42l94J34Q7mK7j05J93j13m0N8J48k5r5K46l64L85l71K8K03
4086A04k8M6j15l7L2J99k21N2j02Q1k7r8J05J37l18R7Pr7o3K67j78P8O1o1J5n
4112f9Jj64L45j24L46n66K67K16q4o7L0p9J31k42L0K3l8J45j02n0J39j27J7k9
4136e1k29J16K34j37k95L13l4q3k8J17J83l0N9%%k63K00j81M63k78n1k36K63K0
4160G2j85J17k40L55J3k89jJ76p9J66l43L6J12k41J79M6J4R1j2K1O1R8j48L3o9
4185a7J91mo0j65J95j67K5j58p2K1K72L5j27Q0p0j97J50m9J35P9j82J39K0m33
$$ y = [164, 186, 146, 108, -77, 119, -23, 179, -194, 134, 124, 136, 207, 155, 49, -6, 45, -239, -131, -225, -16, -267, -33, 46, -56, -96, 44, -72, -148, -290, -52, -225, 263, 39, -81, -39, 36, 223, 24, 111, -132, -11, 257, 134, -39, -103, 290, 56, 60, -43, -136, 106, -288, -154, -67, -71, -44, -149, 44, -69, -109, -51, 97, 72, -23, 223, -141, 244, -127, -99, 104, 76, 122, 7, -30, 2, 201, -20, 32, -70, 11, -16, -114, -9, 128, -190, -93, -86, -183, -246, 21, -157, -79, -18, -79, -64, -69, -68, -232, 113, -11, 335, -231, 36, 252, 168, 101, 131, 52, 183, -59, -29, -6, -44, 101, -1, -51, 88, -39, -22, -51, -280, -164, 70, -67, -362, -49, -83, -166, -194, -77, 106, 76, 135, 135, 135, -128, 72, -109, 354, 76, 25, -211, 52, 72, -113, 4, -236, 119, 132, -157, -158, 18, -61, 105, -238, -202, -90, -331, -152, -106, -92, -1, -13, 8, 69, 167, 19, 52, -17, 174, 170, 110, -55, 140, -27, -2, -160, -232, -211, 61, 96, -31, 49, -21, -218, -68, -117, 18, 97, -85, 54, 74, -359]
4209c59L03m6K58j20k30M94j29j84J44rJ29N8m38M24m54J22o1N5k07N14m35J90
4231A9J58l07N8k0J20k8M7K0K86m28m4J06k9m9J28K91n4j78K34k86J25l94M31
4254B06k52k4L14l12J44l9K9j72j17J47k25j5K38l0K6l02K25K7K37r5N7j35R4
4277B6J3O5m3L5p4N2O6p9K3P4j71Q8o2K06o2k43J7q1K96l65K18k08J28Q3q4kj10
4304a94N8N8L3LK20p5J25j70J2k8M2l3R3q3kj05j15L40j17l05L24j65k14J98K34
4329A34l28O3R9r5j45L97K8j94k5J43r4j57J60M7J46l72L22mJ00M5r3j9n3k60
4353a55K15j02J71l26j53N22R8l30N9m19L83J37j63o9N0m1J74J09j43K03k10J49
4375A59Np6J3Q4J29m55M25j41j77l29L68J40k86K34N8j39J29j99L5J36k02J05
$$ y = [-359, -56, -102, 156, 36, -194, 300, 171, -13, 131, 122, 251, 309, -129, 295, -159, -37, -98, -43, -250, 264, -171, 19, 177, -130, -72, -92, 28, 0, 47, 67, 353, -75, -119, -13, -42, -91, 37, 328, 274, 96, 330, 44, 169, -225, 206, -46, -70, 244, -68, 76, 37, 66, -106, -223, -76, -301, -316, -78, -108, -82, -384, -159, -132, 105, 10, 67, -68, 26, 39, 104, 61, 96, 22, 74, 140, 61, 84, 158, -13, 75, 13, 219, 157, -86, -69, -150, 146, -219, -1, -209, -81, 2, -82, -84, -194, -136, -78, -45, -42, 178, 103, 228, 58, 70, 42, 84, 51, 144, 61, 59, -46, -161, 179, 62, -243, 81, -84, -298, -100, 134, -194, -131, -32, -127, -272, 125, 153, -41, -66, 77, -17, -174, -14, 33, 179, -193, 129, 125, 225, 270, 177, 158, 105, -155, 60, -42, 129, -197, -350, 172, 270, -60, -1, -420, -37, 100, -63, -132, -82, -123, 51, 160, 17, 220, 10, 159, 164, 88, 101, 185, 314, -141, 284, 143, -34, -363, 5, 145, -141, 93, 151, 12, 141, -58, -23, 113, -89, 16]
4397A6p3n9J34j52J70K28q3j59N0j08J26L6k18j3Q4K40j24J75j27l15kJ78K00
4420B04m93N43m54K86j37j31L11j40j70o1J09j12N31m77r0L21k71L44k52J83k14
4441a70L09j73m0j5J08J39p3L64m70O6J2n0q9j7R4m5J13k93j0o4J60K59k25j35
4465b45L17o0j79J5J72j14J37k22R8j1R5N4p5q0l5K30m35K77r8K43r1K0l10J26
4489a71lJ14o9QN7n1J03n9j40K12P1j34J28k52L41j06O0N1l02L38J28l13p8M1
4513b6J32j27N0J51l51J12%j76K32k78K30j44K45k68K26jk59M29l15L65m6j09
4535G2J94k44j53K33K8j30K13m02J67J00j18J22J2J72j79k1j97M2M8rj68J51k
4558f9J28j29L83m59J53m5J88j43j04O3M3j30N7O0j26J75l5O9p6M7k37J83Q4L4
$$ y = [16, -57, -116, 18, -134, 36, 264, 181, 22, 72, -36, 90, 126, -92, -105, -21, 219, 95, 270, 143, -172, -174, 4, 204, -289, 254, -200, 86, -51, -182, 129, -11, -181, -242, -133, -245, 286, -191, -281, 40, -231, 113, -139, 44, -170, 139, -34, -74, -89, 19, 158, 85, 449, -21, 45, 57, 7, -82, -99, -5, -50, 63, -230, -240, -304, -144, 115, -110, -245, 72, 12, -167, -152, 20, -94, 43, -179, -81, -92, 3, 57, -18, -98, -133, 97, -338, -61, -159, 84, -7, 13, -297, -171, -174, -60, -129, -121, -64, -115, -12, -71, -211, 1, 72, -62, 66, -186, 155, 49, 109, 160, -142, 196, 324, 11, -67, -26, 106, -21, 29, 180, -171, -59, -59, -235, -3, -281, -51, -195, 50, -218, 8, 7, -252, 177, -138, 227, 181, 72, 266, 22, -131, 102, 130, 0, 213, -189, -22, 78, -40, 82, 94, 266, 87, 66, -131, -89, -41, -50, -218, -67, -69, 59, -70, 313, -146, 7, -38, 150, 7, -97, -34, 9, -121, -64, -4, -130, 45, 10, 79, 3, 50, -187, -4, 80, 114]
4582A14k71K77k93J12kM3J01q5j85P6J1j4L03l45K46j37J95L7j92J08j40J62r8
4605B3n4J20J27j29o6k19L20n1m7q9K38j09j93k30K52kM7J18j82J84j71o1J40
4628c4L8J52l07K24N0k32P6K28k20j7J65J94k37L0nN8j74R8j77K90k74L1Nn1O4
4653b5N9o9r9n2J47j86K40J88l80J54j55K6K81j55K27n0J61k92j39K12j03J42
4675A32J12l25J54j62L7J97j2k75K50j7l02O1Q2Oo8J66J5j48j58J45m8K24N9k32
4699a07K34n4N7j08R5j19K91k26j39lN6N3J36m34M69k33Q7q4q7L03k82j7N9J59
4723A06j46J09J83j28J05P4k13o1j95L38n8j61r2J61J20L9k28j69L8J81N7k07
4745a47J75J5J52m19PM19m54M20k23r3r1K53j16R6K15j81k55L39k1J69j57J26
$$ y = [114, -157, 120, -173, -61, -63, -20, 81, -4, -189, -113, -102, -116, 187, -158, 88, -49, 146, 183, -9, 99, -41, 121, 23, -31, 89, 216, 87, 21, -198, 122, 71, 24, -65, 173, 64, -129, -359, -107, -109, -62, 56, -126, 58, -113, -174, -34, 4, 156, -151, 73, 123, -109, -33, 195, -25, -42, 123, 317, 80, 110, 105, 163, -11, 87, -90, 200, -74, -43, -38, -89, -25, 34, -35, -134, -186, -39, -225, 15, 203, -177, -23, -178, -152, 129, -26, 201, 151, 312, 20, -119, 93, -10, 132, 244, -81, 73, -89, -52, 145, 133, -142, 108, 91, -211, -150, -68, -62, -130, 36, 51, -97, -255, -110, -158, 66, 125, -107, 127, 73, 130, 22, 117, -2, 289, 63, -76, -79, -23, 30, 166, -268, 201, -32, 55, -29, -116, 187, -95, -112, -53, 106, -40, 69, 252, 124, 229, 303, 90, 29, -166, 172, 114, -47, -139, 22, 142, 181, -47, -216, -178, 3, 60, -147, 28, 43, 195, -224, -217, 202, -252, 168, -55, -148, -239, 14, -102, -6, 209, 28, -227, 112, 91, 260, 103, 229]
4767B29Kp8o1j59J83j51J0m6J07N5o4l4p3l0P6L0M0j17J41k06j20L24j66m9K50
4792I3k82M30j89j68P0J53k17J56N6j03nl6OM1L5j7J75l57K71k61m8O1N0L0J80
4817A24j33j33M3K61m1j90n5J62J42j30J27l72KK42j39O9K8k9J04J23r5j70R0
4840C0J02j51J4o4R6r9R4j23l19K24L47k33ML86k70k18J37k01M4K02J58j04PR5
4864A58r2J4j74L07j76K3M7k22J06j86K7J93M1j32k1K48l04O8k23K16O6j08O7
4887e7K48k75j06K64j4M6k9K9J5k22K28j50K64j97Q2j40O9k12P4R2j05j64K83
4910B3j16P7K03k95L34n77L07j35O8K4k71M77J65l60J33o6q6K97j15J72r9L1j20
4933G1k11M2L19j29J44k61K0K2j7J20R6k36j71M30l66P0lJ31q9j91L93l79J30
$$ y = [229, 231, 153, 92, -67, 116, -35, -25, -71, 36, 91, 27, -7, -80, -110, -34, -4, 36, -81, 60, -146, -266, 58, -108, -157, 93, -189, 241, 52, -116, -46, 107, -110, 46, 102, -1, -6, -42, -36, 5, 40, 23, 198, -159, 112, -149, -197, -136, -86, -56, 124, -9, -142, -99, 162, 121, -69, -124, 38, 180, 50, 177, -195, -193, 49, -90, -21, 7, -22, 82, 205, 110, -60, 30, 132, -19, -5, -69, 27, -72, 22, -101, -420, -196, 151, -82, -78, 308, 38, -180, -43, -244, -200, 2, 160, 56, 63, 158, 66, 80, -94, 213, 37, 60, 107, -115, -9, -195, -168, 25, 66, -66, -87, 161, -143, -75, -298, -82, -16, -124, -57, 191, -84, -190, 74, 60, 106, 77, 106, 121, -101, 127, -23, 241, 44, 126, -14, 55, -157, -83, 9, -96, -260, 23, -93, -16, 187, -108, 226, -351, -44, -179, -111, -87, -358, 119, 284, -76, 57, -9, -95, 202, 87, 259, 160, 191, 71, -140, -98, 221, 92, 236, -25, -5, 17, 0, 120, 216, -20, -191, 239, -127, -57, -60, 71, -18, -209, 184, -195, -65]
4956f5M2R8o0kR8nq6J79k48j02J20J72k27R2k96J19K48J7l22J23p5r2L6J96m1
4981h1J70J97n09M00j20j87K53N8j36m2l0j25N1Q0J10J27l48L0k4K85j94R7J50
5004B12l12K52j10j29m6J36J69k10Q5J5l1K00l75M41o06J58K87R2l00J33j2n8
5026iPJ3K05l96L29l15K45k06L2J84m4K0j66J90m8k8J06k74j31K22K6K22j70K0
5050C4M0k80K46J05J40k45J09j13j45L8M13l70J19l5J9j27l1l09L49K20j50j77
5072a50N7J3r8M73o19j5K06p4K17O6k3j70J94o3j16J56n2q7J33j02R4K39l84K20
5096A15K1j30Nl08M41l64q9Q7J9J58r8J18j19J46j80L84q8l83L58J05m34J72J09
5119D5lj03L8J17l3j61j35K20K5J86k53r3K59j41O2j06J42j13K42k32j71J75O4
$$ y = [-65, -23, 75, 15, 13, 111, 106, 20, 199, -49, -151, -31, 141, -86, 6, -290, -171, 77, 94, -228, -105, -180, -272, -236, -40, -81, 89, 286, -223, 177, 57, -130, 123, 181, 45, 3, -27, -152, -101, -21, 89, 216, -132, -102, -126, 159, -35, 62, 212, -100, 152, 42, -87, -133, 3, 172, -38, 47, 62, 31, 231, -144, 297, -309, -151, 136, 228, -72, 61, 49, -9, -2, 11, 216, -180, 149, -166, 79, -127, -95, 89, 45, 65, -101, 89, 41, 13, 119, -155, -286, -64, -38, 184, 14, 34, 74, -206, 40, 145, 285, 40, 149, 36, -109, -71, 342, -28, 91, 56, 75, -52, -83, -392, -43, 177, 27, -150, -93, -80, -178, 295, -324, -339, -133, -207, 10, 76, 53, -117, 77, 14, -102, 54, 2, -85, 48, -54, 40, 279, -105, 115, 136, 6, 11, -297, 144, -220, -309, -222, -203, -45, -143, -25, -144, 2, -178, 206, 118, -265, 93, 198, -236, -64, 45, 42, -61, -23, 94, 61, -100, -235, -15, 10, 196, -57, -150, 109, -32, 30, -76, 66, -47, 195, -37, -208, -33, 31]
5142C1R4l14J00R2J44k94J38j22L60j13j02L62k51l57P5J33R7j09K43M0m65K43
5164B5m7n4J10j40J37k36R5M3O1j24P0M6Q7J74l52K54j88J3J71j75J47j02k38
5187b23M33m43N09k46m8k13L13p4%j54K19J48O2j22l32J55l7O7k54L00j51j19
5209b10O4K86j75n8J91j5J37j38n2j53L85j79J24K1J1o6n3qj45O1nO6N4q7J7J30
5235B03k10J25k15J06l6j28J25K04m24M40j61n4k0J73j92j30K80k4N7k05j3%L32
5258B33r7n8p2J5J41k57N6Q6Oj34K45m67J91J7K55k72J91M6o1j46J84m6k09L15
5282A62n59M13J21o1q3J56m01J79L01l38K24L4l22K83P2j73J19l12Q9qJ34p0m0
5305h0K16p2K6k11L41k63j10J30MJ01J50j20q4J02n09M80n1l37L72q4j69L62k34
$$ y = [31, 125, -189, -89, 3, 147, -147, -9, -131, 229, 116, 14, 376, 125, -232, -157, -24, 73, -36, 207, 247, -218, 25, -22, -76, 34, -106, 31, -205, -110, -67, -6, -130, -60, -14, 73, 247, -105, 149, -39, -26, 145, -30, 117, 15, -223, 210, -233, 276, 30, -18, -231, 82, 8, 8, -146, 73, 221, 283, 161, -171, -16, -53, 14, -240, 60, -91, -210, -146, 140, -35, -93, 98, 83, 220, 82, 30, -123, 262, 83, 207, 228, 239, 173, 120, 112, -33, 28, 23, 89, 143, 56, 73, 203, -7, 118, -97, 9, -27, -155, -30, 174, -250, 190, 29, -25, -45, 128, -64, -194, 86, 62, 119, -86, -99, -99, 233, 136, 78, 6, 21, 162, -95, -39, 47, 53, -81, 164, -303, -112, -95, 160, -112, 79, 125, 64, -82, 102, 56, -153, 162, -397, 16, 137, 76, -7, 149, -252, -73, 228, -110, 114, 148, -174, 109, 181, 8, 127, -185, -96, -104, 30, -40, -80, 136, 64, 90, -121, 220, -43, -153, -23, -19, 82, 232, 112, 28, 130, -379, 101, 50, -287, 85, 1, -168, 194, -40]
5328d0r4J89k05j6J38M8j4k6K8Qj68jK55k26J15J35k40n0K68k1j55OK21k26K10
5353A39k2J25K7m40J97l7J78j39j61J20M2r1j7J72q1r6J16j26J57q4K12j41k88
5376b38J60K11q7J25q5J06k1k73J47k04L66l13K47r0k66L54j85N1M5m4q1K4N2
5399AJ02j84j54L29j54j19L81l09R9N2k9J13q1P0j1k1J0R9j03j56L41j46k43j59
5423b72J18j42M81k11L30m60J99k19J03j43K97L0k78p5L44r6k7l8M8L4J51K4N4
5446B52j79P8k12J9J79J5O6l11l1P1J36K7n7M0k29K0J46k89M33k05m5j54L5J58
5470c7l6M1j19N6j55K19J39R9j59O7J97j10l39J57J6q0j17J03K52j62J0j52n3
5493a63P4K72l36L25j51J21p2l08L82k30R2p7L0K65o0j19k84J81k0J70j13P2k77
$$ y = [-40, -134, 55, -150, -166, -28, 20, 6, -20, 8, 16, -152, -153, 102, -124, -9, 126, -114, -164, 104, 83, -72, -66, 155, -71, 139, 117, 242, 269, -171, 26, -11, 167, 28, -133, -13, 29, -62, -79, 93, 12, -84, 32, -94, 63, -21, 191, 50, -238, -78, 133, 46, 171, 86, 192, 171, -102, 45, -159, 207, -106, 141, 51, -215, 139, -46, 5, 50, 6, -75, -51, 1, 103, -81, -235, 94, -60, -179, 202, -107, -8, 44, 15, 128, 47, 117, 106, 85, 95, 194, 91, -65, 276, 130, -113, -272, -154, -296, 185, -26, 304, -156, 43, -176, -73, -216, 81, 111, -167, -242, 102, 6, -21, -59, -11, 23, 174, 198, 252, 73, 151, -61, -42, 137, 152, 218, -93, -124, -53, 83, 110, 53, 93, -136, -116, 30, -259, 174, -31, -76, -230, -195, -37, -73, -32, -151, -95, -250, -31, 108, 207, 48, 115, 312, 202, -137, 20, 36, -44, -161, -58, 194, 32, 42, -110, -163, -89, 183, -153, 172, 21, 142, 70, -238, 144, -86, 6, -71, -41, 224, 164, 45, -239, -58, -78, 92, -21, 51, -226]
5516b26Q9L93k58J91j34p7k5k1m1j58J64J14k56J23L6p9J95j5J2k88J93J19j85
5539a34J1L13L9k91K3o3J88o0M8j59oR6J45l52K74J38j83l59J58k18L76m9K60
5562A95l43P3M3P7p8M0p3P7j91L00j56J98o3k42J05K05L9j59k85L28j1j68K75
5585A86k32N5j35l0M24l24J43l18K90j13J26n8K03O5l60L05k46n9J69N9l12K80
5607A18l4j2j84J21J7P6j35M2K41m37J89P7m9k63J08L5n3J28o4Q8K19k73j03j23
5631b71J18l58M97q4j9K34j02k5k51K65J73O7k82J29n6J0N4j36J53r7N1l6j71
5654a37j2L12q6k12K34j42J64j91J05l9j48N9M3n6N07k89k60K50j48K31k15Lj4
5677d1J5O3J70o0j07k60j00J10K60j68k1J05l17O40l59J58j72K81l82K31P5j31
$$ y = [-226, -137, 256, -2, 189, 55, -22, -47, -68, -109, -267, -103, 11, -245, -122, -86, -165, 30, 15, 27, -261, -68, 51, -134, -123, 190, 229, -62, -39, -102, 86, 26, 74, -85, -91, 5, 150, -202, 72, 210, 27, -332, -174, -392, -16, -65, 195, -148, -75, -32, 45, -33, 7, -66, 11, -180, 120, -36, 162, 99, -143, -38, 167, 206, 47, -238, 90, 79, -89, 186, -46, 9, -126, -156, 268, -56, 87, -231, 59, -54, 72, 14, 217, 282, -78, 227, -19, -78, 91, 150, -162, 118, 84, 72, -112, 9, 26, 102, -33, 9, 250, -187, 2, 79, 30, -233, -125, -90, -143, -15, -79, 9, 228, -45, -148, -271, -153, -511, -14, -98, -117, 117, 15, -10, -261, 4, 177, 244, -38, 91, 35, 45, 99, -37, 116, 19, 70, 34, -137, -149, 163, 77, -135, 99, -43, 121, -70, 35, -4, -152, -93, -50, -106, 401, 112, -148, 102, -46, 185, -30, -27, -41, -26, 37, 207, 147, 40, -220, -320, -210, 50, -118, -139, -34, -351, 289, -70, 88, -84, 197, -185, 46, 121, -10]
5699a0J68n6j91J36K16k87J01j28O4L0J53p7L1j10q5J21k17K55Q4k48J4j5k06
5722b57N43j53j11K9j46L20o2M5l30L38k13r5J35r8J85k02M8J10j09K55m50J18
5744a00O5k77L10j14P2j04QM3k10L08P0j67k6J84o5l3o1L85l24r7Q5J39k22J47
5768A6J39k03n4j31K18L4j05KL2O5n0K13l69J12N2j71M4J04J63m58K12L40n43
5791c38L54J87j95j81K18%J99m5j77n2j2M7K93l77P2j78J84q4o8Q3J75m0j16L9
5815a2j0j75m1K79l9K06n74L52R2j37n1M43j40l72J91MK17k43K4j06J16j07J83
5838A00L9j93P2k26K35k83L08J23k00K29k82j11J79R0l78K71k3R3r9J09J13j45
5860B1o0k11L31n2J3K14l25R4J61q0Q0m1j01j03J41l49L30j64Q3j62J94M7p7K05
$$ y = [-10, 158, 102, -89, 47, 263, -24, 77, -51, 13, 43, 196, 119, 150, 40, -45, 76, -141, 114, 198, -50, -36, -51, -257, 286, 133, 22, 51, -95, 225, 163, 208, -122, 216, 3, -92, 43, -55, 130, -72, -24, 86, -23, 232, -218, -100, -35, -312, -2, -116, -44, -148, -140, -97, -307, 1, 71, -96, -122, 62, -3, -36, -97, 288, -36, -133, -48, 91, -131, 16, 155, -48, -102, -233, -15, 19, -86, -84, -52, 13, -37, 176, -193, -81, -29, -200, -156, -52, 111, -347, -135, 205, -338, 16, 203, 8, -173, 45, 45, 244, 199, 22, -30, -42, 5, 298, -79, -7, -185, -1, -85, -153, -70, 105, 65, -51, -12, -22, -197, -238, 41, 2, 208, -366, -14, 78, -59, -110, 333, 193, -179, 12, 16, 233, -10, 14, -92, 24, -83, 100, 139, -54, 18, -208, 27, -256, 52, 175, -25, 204, -78, -189, -10, 80, -298, -27, -50, 43, -56, 53, 166, 21, -39, -250, 81, 29, 42, 256, -69, 25, 186, 106, 186, 145, 44, -59, 82, -267, 63, -101, -18, -180, 14, 61, -16, 189]
5884A89j65k09J89M6J20j49k04PJ75J04m1j53L29j78j19j7j0J31j50J28OJ91j43
5907G7M8m36J96K17p4J58j42k70K39J27j43k82J60K9j27J73j57K68q3O7J97l68
5929a26J01R7j66J54j99J87j79J00O7j7o0K2j62K13r5p4J26k20K36k39J11J53
5951C0k61j62K17J46r7K60q9r1P2Q8j84L36l90K34k02J82j78L51k79K82l27J08
5973D6j67K40j5k66K33l8j36J42p2M8R7j64k26K28N8O9P4J9j10q4K07m5m6k49
5997a57M20l12L2J21n0j4j29r9J7K03K00j0k62%N6j34J80M8J4K37m61J99K25j10
6021B14K83r18K80J98M36n71jJ43M7l69K18k90M55L1k51L38o12M67L5k7r1j83
6043a68K73L3m45M88l4j9m05M53j94Jj69j27N68k55l22m59Q23k26L79k26N43m00
$$ y = [189, 24, -185, 4, 50, 170, 21, -183, -176, -1, 103, 62, -91, 238, 60, -59, -76, -86, 45, -105, 23, 29, 220, 77, 125, -311, -115, 102, 28, 186, 44, -226, 13, 140, -3, -285, -125, -96, -223, -50, -207, 61, -22, 45, 242, -126, -25, 72, -94, 60, -139, 48, -131, -31, 36, 19, -41, -19, -181, 32, -63, -137, -11, -231, 5, -234, -123, 30, -231, -393, -176, -30, -127, 133, 44, -47, 25, 113, -71, 265, -125, 109, -93, 89, -89, 262, -17, 265, -62, 46, -121, 119, 104, -162, 71, 33, -103, 39, -33, 15, 112, -52, -278, -50, 8, 77, 151, 170, 60, -24, 183, 138, 92, -157, 263, -49, -17, 104, 54, 40, -89, -188, -171, 32, 232, 222, -40, -40, 16, -118, 62, 110, 124, 361, -100, 99, 324, 214, 497, -421, -141, 57, 493, -78, -79, 64, 111, -258, -40, -330, 125, 156, -95, 243, -369, 98, 133, 106, 15, -168, 105, 138, -307, 181, 147, 128, -277, 176, -18, -17, -186, -313, 255, 0, -322, -781, 42, -184, 195, -31, 512, 112]
6065A12j23L24M6J67j228R84n3J36k20k66m13M33r0M8l63N65J96p86M17K38K19
6086C43m12J47k97L56m3l46J42L15K12k57o81K2N51q24J034j96o2n3n12O27m11
6107c45J17n4J92M40p8q5o7M87q06L07J45q9L01p28N63n78J94M46j5j25j43n9
6129B0o5O07p08O08n23k37P58o72R6kL38j21P1K00p89O49j21n5p37M15N30o69
6151d07P77k17k77N5N72o53L55j098J097J74p8K75J51J20k87q10L82Kj03J45o24
6172d49N70J68o97M16r16Q1l0Q66n38M09K39j03j11m34Q08j039O50j76N84P60
6192A058j170L50J69m51K08n1L05l65j30j81M08l23k38O17j14k87j89k94Q95n50
6212c33M24L87k80J5m35L90P16o48L25o95J98k78K56L89o25K8J31M57L27j59j048
$$ y = [112, -11, 313, 359, 526, -702, 282, 229, 365, 145, -121, -534, -101, -191, -143, -506, 59, 255, -531, -114, 124, 343, -69, 78, -219, 137, 94, -252, -110, 205, 417, 160, -521, -499, 52, -772, 262, 66, 4, -49, -561, 66, -345, -228, -282, -90, 350, 272, 187, 120, 607, -199, 108, 253, 164, 465, -263, 300, -278, -84, 362, 347, 222, 79, 20, -45, 562, -146, 462, -61, -298, 460, -212, -116, -118, 220, 99, 170, 370, -419, 230, 109, 54, -683, -268, 262, -407, 370, 153, -124, -69, 503, -150, 205, -893, 204, 378, 300, 575, 726, 846, 559, -251, 131, 133, 30, 175, -449, 121, 289, -408, 8, -908, -827, -857, 9, -529, -120, 119, 16, -95, -529, 279, -760, -110, -286, 298, 1058, -112, 238, 407, -44, 164, 113, 418, 53, -77, -258, 150, -173, -411, 206, 92, -195, -384, -678, 217, -333, 91, 478, 198, 213, -222, 168, 884, 236, 561, -134, 64, -214, 42, 431, -194, -166, -35, 422, 749, 590, -458]
6233d58k98P06o48J606n30l05L8O02K50j342P12p04N16j5L05m48r30P38J28N22
6253D45j49n33M65J05p78J095r87O23K93r67R14m1o56J34R0K22M58j195M32O13
6273E83l65N08n80o91J35J199n31m04J85O34o65K18O5j98K41m10J39l00N53j14
6293B02o4m64J34l30P73l22j79N11M10p30N27l15p01P53o30R25p35k54O45m67
6313c11N26k70k19N08K5n1L66p15N23m01J30o8k30L37m22J22p9K20j56K96K1j93
6335d1k01j8L01m51K43J29l35Q04p47Q84o92k6L87J03n74O6M48m37P38j27n78
6356a24L08N30n71j61j92L07j22j60O57p40l2M12m11P48l89J8J4M08q76J246n24
6377C46k94J7r0K63P4p40N58M62q65Q60r47L74k30O34J58q65J87K0Q1m22N75n27
$$ y = [-458, -756, -50, -698, 908, 378, 73, 111, 713, 963, -379, 333, -371, 145, 130, 435, -13, -943, -205, -77, 445, 296, -237, 228, 333, -445, 650, -337, 286, 579, -388, 526, 485, -171, -37, 53, 275, 733, -462, -30, 583, 218, 726, 146, -545, -410, 789, 258, -146, 39, 673, 8, 226, 291, 93, 334, -76, 63, -237, 316, 202, 138, -326, -192, -522, 251, -71, -250, 261, 671, -59, 468, 153, -548, 205, -425, 500, -235, -489, 156, -311, 215, -55, -274, 234, 259, 208, 574, -141, 382, -19, 111, 43, -187, 150, -272, -150, -229, -9, -165, 131, 152, -41, -242, -260, 41, -410, -167, -38, -373, 431, -316, 568, -124, -150, 237, 340, -234, -168, 280, -157, 581, 454, -124, 184, 714, 143, -18, -210, 97, -25, -185, 472, -268, -300, 112, -299, 449, 60, 78, 92, 500, -376, 870, 346, 52, 69, -21, 242, 316, -424, 134, 596, -269, 591, -356, 18, -212, 422, 580, -285, -98, -78, 3, -419, 156, -371]
6399c71Q1K34K01j69K49J93l54n00N69l23L41k22L34K97p09O33j1k20J9k34r4
6420e6l23K97J1LM97n38K77J83l01O0m84l17J490k55o85M36o08L72k58M4O3p0
6442a62L89J43m52J94J52j0j63p86P21K79o1m33N90j06m30N18p33M39j57K96j57
6463G1K8k96P24m43m27P38n37N43o59N13n44O70j57j22o68L99J38O1O1l33K73
6484C3M80l19n0n10j43N23j20r4K16LK15j509J151Q6M04n61J38M2j6j79l30N44
6506DK03k90K1k81O09k99L41K14l44K7l39j34J95K65L39m15Qo9r3o9L7j7l35P15
6530B93n67J47J50K31k17K5jM05j91n83J83J02J81j16k13R7O9J10m7j54O24m41
6552H7l29L17m56K67O64J8m17j94n5K28k06L45q29J329r99l67O27L78j16l24P3
$$ y = [-371, -290, -56, 145, -24, 225, 418, 64, -436, 133, -190, 151, -71, 263, 560, -149, 484, 473, 253, 272, 38, -56, -379, -82, -71, -68, 429, -109, 168, 351, 50, 110, -374, -691, 799, 544, -141, 295, -313, 59, -199, -155, -92, -162, 227, 370, -82, 112, 264, 254, 91, -695, 26, 305, 244, -189, 401, 295, -135, 383, -350, 89, -68, 228, 71, 99, -197, 527, 84, -343, 395, -142, 401, -258, 255, -289, 381, 224, 102, -566, -167, -29, 32, 93, -240, 33, 513, 194, 144, -366, -509, 14, -106, -200, 16, 19, 234, -1275, -124, -38, 366, -195, -57, -15, -31, -210, -540, 4, 207, -83, -62, -343, 266, -33, 308, 522, 178, 205, -134, -268, -73, 192, 531, 116, 124, 55, -38, -107, -70, -87, -422, 293, -274, -127, 23, 254, 37, 62, 61, 466, 275, -308, -125, -23, 158, 42, -171, -74, -5, 105, 58, -96, 528, 87, -242, 75, -381, -114, 550, 568, 151, -43, -98, 130, -76, 269, -560, 769, -230, -597, 30, 408, 292, -32, 41]
6573D1J96l67P7J95m17Q31n51j21Q15n09q2k66J65k28%O96n77K55m62K75J44o4
6595D6k18K32m8O63n32j93L82m68lP76n36J7J03J10j68k58m2l38R03j56k40N6
6617H8j99L15J9l50J3L81L3k53j91N54l32l12r4K63O3k13J67K04l01R5K81n90
6639c59L32K08L88J4Rl48p76j1L30M29l02j41J94J91m85K82o51O67K01K17m74
6660h5L8L61O15o97m9P5o14Q47q54K11l89L02O80p2k10K03n72K32k64J59l58M76
6682C5k43j41L84k13L40k43L02m05L57l42N20k55K92n56K88N6m03J99K80K9j82
6703I9r1j24K45o87K36K13k51J49N7R8J20J83n92N37k92J90j72k03J84k75K60
6724a16mQ8k7K33o19N90K82j27j52K20J81k57r8r60O12K3j09N24n08M49p41L65
$$ y = [41, 237, -130, -53, 142, -275, 556, 5, -116, 699, 190, 108, -158, 7, -221, -221, 475, -102, 153, -309, -34, 110, 46, -172, 60, 12, 675, 143, -50, 332, -136, -139, 637, 101, 118, 221, 331, 163, -95, -137, -475, 428, 272, 32, 88, -111, 204, 223, -127, -114, 267, 300, 47, -144, 410, 78, -234, -328, -65, -2, -215, -48, 156, -145, -50, 231, -359, -27, 181, 569, 583, 592, 244, -532, -543, -213, 216, -86, -227, -33, 158, -327, -45, -696, -29, 172, 389, -85, -47, 314, 929, 232, 183, 258, -356, 491, -363, -152, -541, -239, 441, 369, 159, 362, -210, 22, -242, -83, -441, 35, -208, -349, 35, -178, 162, -81, 221, -184, 173, -169, 351, 96, 388, -168, 120, 176, -227, -28, 252, 281, 99, 8, -116, 129, -558, -322, -109, -360, -211, -154, -56, 64, 247, -345, 192, -100, 90, -82, -285, -101, -376, -116, -120, -32, -59, 174, -445, 145, 427, 300, 148, 368, 549, 292, 194, -766, -154, -131, -240, 284, -224, 225, -516, -151]
6746a51M8J45J4j5l51L38K09m86m57P07j17P76o00o3M53k9k94l94N37m59O40n10
6768e9Q5l48P5L35l8R5l22N55n53L92k80K84k89K06j66l90Q22o66N51K62n56L13
6790C08l10PK62j9m0q33N53P02j046Q24o59N66n5k95N53j77k71n93M83L13k79
6811fp66Q65p8L7O98r05M63k1l81j71M91l46N24k23k97l86O41m43K87j38N62j012
6833f05O59N13l86J79l40J46p4q0J29q3MMK90j99k29L78j52k89j55L68K2J2J24
6856B36k57J74j84k2J44j94J3j45M36k25K69j26K70j45k25R9j8q0l24M11k89K70
6878H8k96R2L76m10J95j59N7l05K81M19m67J79k27J38j94L8M83k03J08l49L02
6899A46o7k52J57j04L02J16j86k68K12K07l23r6R3K0j70J93j62L46l97J79k80
$$ y = [-151, -103, 42, 56, 41, -310, 28, 237, -249, -706, 1, -116, 660, 60, -3, 450, 421, 127, -267, 270, -189, 451, -59, 26, -322, -247, 88, 50, 145, -177, 378, -175, 217, -63, 221, -68, 138, -28, -418, 404, -262, 289, 551, -5, 308, -2, 5, 267, 248, 208, -625, -72, 630, -416, 408, -251, 315, 260, -35, 518, 341, 70, -523, -40, 273, -6, -772, 93, 15, 52, 750, -155, 308, 287, -94, -265, 226, -120, 404, 181, -116, -502, 139, -304, -17, -155, 407, -605, 54, 567, 181, 360, 20, 166, 92, 12, 141, 58, 62, 66, 356, 157, -72, 306, 154, -135, -290, 78, 100, 112, 236, -21, 153, -31, -53, 91, -103, -90, -235, 201, -24, 245, 119, 389, 244, 19, 118, 100, 20, -304, 107, -182, 88, -208, -116, 260, -150, 45, -114, -57, -362, -81, 338, -129, 50, -177, -39, -233, -195, 288, 85, 193, -156, 146, 79, -173, -16, -120, 182, 298, 112, -156, 56, 263, -60, -156, -63, -43, -213, -20, -182, 164, -233, -54, -334]
6920c34K51K99k46M84o3p05J00J08N33k01o07J019m77q17O21K15L62k39K32p65
6940b30K81m98P35k23l67l05M74J40k15N68n40J67p26K34R7R69j100P19l76K15
6960A9J57Q86j157j72O0o6j03J87O27J12p62n3l86J137k26l22m78J71oO66j50
6981A41q61J513m20l36J47n88O2Q19o09k21P58l7L2J33j07l12M53m98l58M89L03
7002E03q98J40J036q56Q12l54Jj20m91j9m5P32m12o0l05N35L70r5r6j0r3o07O31
7025B99l98J70j85J80k33L16n2j39k32o9L77m10J51l57J139j49l17K62q6p95k91
7046h19J000m12PL17p12K86J766j548O89n13j39l08R22k96p73M28l19J068n13
7065A31k44J003k31j072L12n91P81L05Q2o64K68M0l73N99j97r3k92K10l49P97
$$ y = [-334, -83, 216, -30, 454, 391, -314, -214, -106, 427, 226, -381, 638, 161, -656, -35, 180, 542, 303, 535, -230, 51, -447, 288, 65, -302, -607, -133, 7, -208, 360, -180, -13, -739, -505, -408, 561, -539, 180, -196, 19, 176, 1062, -95, -267, -207, -273, -376, -189, 438, 550, -212, -265, -651, 486, 260, -62, -540, -369, -375, 291, 141, -720, 793, 373, 37, 184, -404, -342, 477, -132, -353, 405, 368, 400, 533, 426, 114, 567, 69, -289, 200, 503, -395, -255, 781, -75, 737, 383, 384, 264, -227, -246, -291, 441, 29, -31, -336, 199, 569, 474, 378, 368, 275, -332, 299, -99, 71, -114, 66, -167, 149, 97, -42, -274, -343, 34, -376, -225, -582, 557, 408, 91, 353, 267, -528, -819, 181, -231, -224, 93, -619, -333, 1433, -115, 574, 61, -78, -386, 536, 240, -533, -105, -424, 644, 131, -113, 890, 659, -413, -101, -692, 89, 394, 476, -188, 80, 120, -253, 346, 149, 56, -236, -26, -375, 422]
7085D22l56p16P10K72N6m92K26j08r0j77O87k97j65j12M62j4k76j81o5R43p89
7106f0J9j79j65K78Q91n62m28L33n69N81l6k80k1J44O3J3Ll79J76M72o87K58j32
7129b67N18j16k69K68L49k10o98L55K87k31J64k74M80J84l56n95L68k47J22l5
7149b03O59l10k59M44k2j51m41L35J05m16K59J37J00j89n22O29L00l18m9M07K9
7170E24m03j75k04L63M36p58M14k9M01l42m41K21j62M02m52N48l88lJ44k66R4
7191g6N17m21J76J37K51n63q3J39J72o12L11k06M6L2N91o6k17L15m54R4j61N89
7213E11k38n37N43l7j71k70L93l44P06m36m22J46M6N23l45R0J16o97N16l08J40
7234g5M31k08J06M2n43K36%j38K23J49j92j58K21n9N4K09j00m81Q32n56k62K92
$$ y = [422, 66, -650, 60, 332, 388, -104, 122, 14, -76, -253, 434, 137, -28, -140, 322, 308, 32, -149, -214, 729, -60, -41, -220, -385, -107, 784, 222, -206, 127, -442, 139, 103, -177, -198, -54, 9, 22, 25, -354, -178, 294, -393, -135, -267, 251, 135, -134, 134, 483, 273, -425, -70, 217, -14, 150, -124, 356, 540, 184, -411, -43, -290, -168, -203, 456, 146, -113, 331, 309, 158, -283, 52, 157, -259, 0, 137, 237, 48, -474, 155, 455, 137, 88, 495, 524, 121, -54, -258, 105, 541, -217, 197, 168, 569, 227, -214, 7, -155, 247, -205, 343, -45, -48, 96, -170, -76, 441, 20, 196, 333, 584, 21, -62, 77, 249, -363, -52, -258, -212, -180, 411, 345, 128, 443, -11, 83, -78, 511, 273, -264, 279, 242, 71, -199, 194, -150, 556, 120, -302, -156, -110, 413, 68, 158, 274, -423, 93, -215, -75, 356, 148, 254, 296, -247, -11, -11, -149, 74, 223, 31, -127, 94, 35, 89, 298, 198, -283, 549, -7, -269, 23]
7256B3N9j49L03O3j58J36m43j02O91n01J7J10j1k7R8j84m31L61K63O5l71J36j27
7279a79j49L06l04M83j7J55k67K78k95K5J3J5j77P7p3j15M23m41L38K7j28k65
7301b70J88J01On9q1j74L13K85n22K73k95j35L58Q2L2k91K32k14K99N4j04j83
7323a05J64l13qL00M4r7m2l9O5J66nr6j39J06J5k91J34K12j88L52m68R1L4K91
7347A83l25j18K70J24k82J72J85m10j77J85J93K8J04k69L86j82J8j9Rk84L41m8
7369H4k65k5J49k10J58L63k11l7K00k42M3K03m18j4K97J1l02L22n6K46q1M1j70
7392H6j57K07k84J55pq9r3L34l44K84j69j3O1l9j25K86l04M13k96J13l3N5P9j27
7416gj55j7K60l63L98j62q8N3J09j43r1J45l7J0N7j13n4J04J23j19L4N3o9J83
$$ y = [23, 82, -67, 236, 299, 141, 277, -166, -268, 423, -78, -61, 49, 38, 11, 109, -75, -506, -145, 118, 183, -188, -52, -179, -328, -22, -326, 157, 140, 295, 28, 306, 11, 36, 49, 64, -113, -36, -109, -224, 199, -242, 96, 123, -5, -270, -82, 19, 25, -34, -115, -289, 24, 309, -213, 60, -235, -370, -12, 70, 102, -189, 43, -171, 128, 182, 78, -105, 59, -254, -262, 38, 82, -15, -57, -96, -31, 135, 130, 34, -105, 1, 16, -275, -141, 71, -117, 235, -233, -142, -108, 183, -142, -260, 10, 134, -148, 24, 209, -201, -378, -193, 0, 28, 132, -137, 249, 67, 85, 66, 75, -209, 132, 84, -181, -206, -57, -267, -109, 254, 43, 6, 206, -36, 7, 210, -208, -222, 75, 86, -216, 106, 50, 296, 215, 256, 86, -71, 136, -148, 7, 0, -89, -182, 152, -192, 92, -77, -90, -29, -68, -193, 93, -211, 202, -94, 19, -14, 41, 120, -7, -162, -179, 81, -282, 116, -46, -134, -81, 28, -115, -206, -61, -98, -88, -31, -144, -198, -94, 29, -90, -56, -3, -72, 111]
7440A11M7j40k54M74l04j2J31K31k10j36K97j12k22J85jj07q6J74k37J70J2q7
7462g6j9O3j98J49j90K96R5j55J17k63O3K29K3j46k3K0j67L52r3P0j05pP9o7J32
7487A79N7j86k44K12K10m1k71L59l65J40R9n56L50J53l7j82K50k64M53m65K3K23
7509I7j22Lj15m4N5J68l4m2J12J86k80j27J18J99n5J32j79j73L4N6R2J56o8j97
7533b8J97k89K10r7J66j54P3%KK33m74J38J84o7k29p0Q1K59k3m9J71n53M16N1
7557A48j29l0R5k55L84m9l49K35k59K72l37J88pK45k53Q1L05k74j17K6J37l3m6
7580b2L5M0J56j11j54J84j9j29q8m1J81j16j31p4M8M22k31pL77m18N6o8J16j31
7604a25L30j97R0j99J50j6k4J69o8R2j56j7J29J18l38J57j24L7j60K10j21J10
$$ y = [111, 158, 18, -236, 238, -66, -78, 53, 284, 74, -62, 235, 123, -99, 86, 85, -22, -108, 66, -171, -1, 11, -76, -95, -32, -230, -81, -271, 25, 120, -35, 82, -181, -118, 111, 134, -12, -35, -15, -182, 170, 77, 147, 42, 35, 114, 47, 179, 236, 50, -194, 18, 228, 187, -84, 275, -90, 50, 149, -407, -57, 96, 59, -123, 127, -137, 316, -149, -126, 97, -25, -22, -137, -181, -126, 42, 8, -34, 78, 264, -16, -143, -25, 174, 119, 251, 72, -101, -67, -11, 81, 237, 169, -28, 169, -120, 90, -7, 159, 5, 78, 78, 80, 313, -161, -23, 161, 94, -135, -205, -124, 135, 112, 63, 234, -319, 97, 148, 19, -11, 84, -171, 213, 164, -185, 50, -209, 63, -274, -86, -93, 152, -101, -20, 285, 11, -106, -80, 57, 24, -22, 13, 53, 209, 98, -56, 128, 109, -20, -108, -149, 32, -84, -215, -289, -241, 181, -50, -57, 320, -98, -42, -110, 6, -125, 205, 8, 98, -101, 49, 33, 9, 178, 110, 202, 46, 29, 158, 276, -62, 95, -29, 8, -152, 58, -63, 47]
7626D7r5J59l9L9J8m29M08j97J17p3M9k6P5Q4j17l31L56K0K68k84k12J51j99Q2
7650a29K80j41J00k63K94j17j20J46j09q4K64k41J76j41q6J45k37J91ol1M6K79
7672B16j65o0m5P6j89J19M8M4J85k15m8J29J30m47K42mL4k51J26k16K58j75J45
7695f3K76j19O2j34k19K94r4j02L87j00j49l5K6K19j63n3k2q0J26J46j99l7O8
7718C5J59j45j81P4Kn4K77o8k67M14k69o7J38j36L8J29k1N4j09j7Q1O4j16J43
7742A58j34k13M11j85K3M9k39qK90l3j72o8J32QJ22j45j94L41j33K21kj88j79
7765a38K60p2p3J78l54J45K07Jj19n2j9O0o2J16j13K6P0k74J9J69mj30K4J33k0
7790b2q8%J60k80J96oL7o4K7l7J68k10J80k10J68m0j30K23p0o5j28J20K93m70
$$ y = [47, -48, 111, 72, 111, 129, -300, 108, -89, 28, -45, 4, -22, 53, 137, 20, -311, 45, 65, 333, 49, -163, -12, -211, -129, 151, 10, 110, -153, 141, 24, -96, 50, -59, -143, 121, -120, 56, -85, -171, -26, -263, -72, -78, -109, -63, 216, 51, -9, -54, 22, -167, -48, 0, 44, 229, 14, -34, 95, 225, -222, 20, 16, 50, -201, -75, -291, -33, -208, -63, 213, 94, 156, 22, -197, 97, 3, -99, 288, 188, 39, 4, 30, 249, 86, 33, 11, -69, 57, 203, 4, -33, 35, 194, 49, -132, -58, -56, -110, 167, 99, -168, 246, -23, -90, 48, -88, -50, 79, 58, 112, 3, -14, 67, 131, 15, 158, 24, -189, 222, 37, 60, 109, -130, -138, 152, 119, -53, -121, 11, 19, 141, -4, -198, 143, 10, 231, 229, 41, -138, 122, 50, -23, 155, -199, -54, 153, 154, 35, -17, -36, 24, -38, 78, -35, -9, 61, -213, -194, -25, -29, -159, -135, -2, -22, -110, -110, 50, -230, -34, -40, -3, -67, -40, -77, 91, -119, 61, -149, 19, -21, -151, 72, 2, -63, -191, -71, 222, -248]
7814b48M92k71J35L1m36L64l53L72R6j36k42K87o7P9J25j71j79K05k6j27J02K2
7836E4j83J64O8R3l26J14Q0N2l4r0LM3k79L5O6Q0J03j31Q9J1O6k1j90J15Q8q2
7862a2P6N1l62K72J58R1m44K09j38K73l24N5J20m5j23J36k2K62O4l33J78j09n4
7885b1j24L41j06j67p2N3Q3r5K7o4J35J51k66J38J91k10k89M12o3J9L2M2k6k42
7909a21N1o2J73k57O1J09p4K05l65L26j41K17j01J94k77j47L74k4k04o9K03j9
7931E2j04O3j30j7L0K00Q0k90Q2l6K32pj32j46J99j56J28p4k9k62K92O3p0ok24
7956b62K39k8q7J10K98l61K10l48L67j29k25j7J35K89r3j89J65q3J70r2j00j25
7978a56k6N3K45k22K39l83Q4J97o2j34J35L5k4o4p7L48j32K76j67o7n4J00k25
$$ y = [-248, 244, -27, 108, 139, -297, 67, -286, 86, 182, 46, -196, 91, 24, 103, 228, 57, -122, 83, 57, -70, 32, 54, -129, 35, 103, 196, -130, -16, 64, 116, 82, -8, -5, 38, -241, -206, -140, -60, 43, -88, 1, 12, 78, 57, -133, -18, 70, -12, 64, 115, -247, 25, 183, 274, -170, 39, -99, 174, -150, -95, 25, -20, -143, -7, -29, 233, 297, -36, 142, 33, -21, -145, 196, 90, -77, -149, -96, -13, -108, -81, -145, -10, 141, -125, 13, 204, -6, -295, 117, 54, 73, 105, 147, 121, -121, -70, -132, 41, -216, -155, -46, -120, 85, -280, 46, -95, 122, 21, 215, -62, -209, 165, 141, -63, -132, 71, 52, -52, 11, -119, -136, -106, 94, 174, -116, -34, -70, 162, 155, 23, -123, 76, -80, 48, -26, -55, -317, -25, 38, -32, -38, -262, -23, -51, -138, -28, 270, -91, 119, -229, 138, 9, -216, -233, -98, 191, 98, -91, 74, -9, 161, 69, -31, -156, -182, -129, 116, -106, 133, -250, -166, 31, -31, -165, -30, 5, -19, -83, -160, 188, 56, 332, 165, 98, 44, 144, -81]
8001h1N3J84r5J06R1j66m09L05J05k16K7K0j01j8J35Q6O1m2k81K65lJ7k12M4M8
8026g7J57l22M24k55P8J11k57J27m5l8ln6K54n3l5L13l83Rl1l17M18N4k53J52
8050b8L15k90K18k88J95j88J08j66J60j65O9K31l22K1J67J49k91L6m8J02K11L6
8072B32k89k7J94L2%J37j46j79J8Q7j9j6o7J3L5J80j66o0k5K9J46K02k78k5J01
8097A09j17o8j05K96k5l24L61j5O0k21j45L40l53K00J48n3k50l1j4K60j04J95
8119A44j45l08L12J17J4k45O7oO3K63k47J2O0k2k25K35K7k59J50q5k72M46j64
8142f8j75J90J09L8j5k43J14j02L24k05J69o0nk38L61k42p7K12N2j87n1j44K28
8165a5K3L06j37j44Ko9K23k22J68k98K52j52O3K06k29j63J25K14l24J29q1m5j54
$$ y = [-81, -28, 156, 61, 167, 258, 92, -317, -12, 93, -123, -96, -76, -177, -195, -60, 26, 87, 45, -236, 29, 26, 43, -169, -125, -77, 80, -242, 182, -73, 5, 116, -141, -14, -59, -97, -100, -156, 98, 45, 10, 323, -60, -51, -82, -399, 19, 73, -180, -28, 287, -3, 215, -73, 122, -66, 42, -124, 36, -129, -60, 171, -151, -130, 37, 186, -105, -69, -117, -15, 196, 232, -57, -84, 110, 142, 142, 279, 133, -46, -28, 59, 40, 24, -43, -30, 5, 185, 19, -41, -66, -37, 109, 311, 33, 8, 109, -8, -76, -181, 115, 90, -234, 127, 112, 172, -49, -194, 146, -207, -7, 141, 88, -162, -193, -207, 53, -51, 144, -1, -309, 3, 120, 134, -111, -44, -50, 13, 276, 29, 41, 101, 79, -146, 89, 116, -143, 7, -78, -350, 96, -68, -243, -53, 56, 94, 79, -164, -50, -152, 172, -33, 136, 76, 71, -167, 194, -48, -125, 87, 139, -48, -99, -243, -15, 8, 314, 177, 33, 35, -34, 189, -33, 135, -163, 89, -63, 0, 206, -23, -186, -61, 153, -171, -42, -123, -168, -322]
8188c22L08J97k00
$$ y = [-322, -14, 183, -17]
8191a7
$$ Imaginary data points
##PAGE= N=2
##DATA TABLE= (X++(I..I)), XYDATA
0@%%%%%%%%%%JrJ6j6K3l1L2m0N5o3P2q8J04j27J50j74K06k38K71l10L56m05M61
33B46n24N94o73P54q44R47j058J180j312J455j612J784j973K179k404K649k920
50a532L216l540L903m305M753n257N827o477P228q108R157j0426J2002j4020J6711
65I132k0499K6265l6207N8008j91610R1513J87471l16107J51258J26966k47191
76a61001p9K36751j29299m2015J35221p4394o2880J22525o1820m9171J22550P959
88D4347o0224M7723m3003l5224P1108j4558k6680O4477o3954m3745J27023j4324
100E2966j13760P5427K1926q7278P2721M2561j12988J7227M8309o5260N2861O8249
112G2961j02390o83Q3169q5540l2194J00583l6653m1401Q0165l1125p4763N2707
$$ y = [0, 0, 0, 0, 0, 0, 0, 0, 0, 0, 0, 1, -8, 8, -8, 15, -16, 16, -24, 31, -32, 40, -48, 56, -71, 79, -95, 111, -127, 144, -166, 190, -215, 246, -278, 316, -357, 397, -447, 500, -558, 622, -690, 765, -847, 937, -1036, 1143, -1261, 1388, -1532, 1684, -1856, 2047, -2258, 2495, -2762, 3065, -3412, 3816, -4292, 4865, -5561, 6441, -7579, 9132, -11367, 14898, -21309, 36699, -154911, -63398, 124073, -192034, -40776, 86190, -161001, -161080, 75671, -53628, -95643, 39578, -34816, -97696, 24829, -36991, -86162, 36388, 44347, -15877, 31846, -11157, -46381, 24727, 10169, -16511, 47966, -15988, -59733, 67290, 52966, -60794, 14633, 36559, -50719, 22002, 64563, -48425, -31198, 17111, -48149, 4712, 72961, -29429, -30112, 53057, -32483, -64677, 35906, -747, -42148, 38017, 6892, -67871, -15164]
124a5164J1739k2143O5243j2730q3956K4582K4205l0618M4557K5238n4138N618
136a7567K1130k3263K1500J4877l4177K5361K1584m8160P941L2252l3955J4429
148A952M1247m3402j6250L7018k6358o911M0343l8493l0512N4067o291l7382L3152
161B180q436m7062L6607K4930l6516R621O996l2422J8676K3396k5977J2563K3172
174G728l0306K826K5438k5377L130L8797j6610j4005K2590j8613p644L9669o814
187B0809k2012K1017q091k3340K9223Q041k6151J5401O004k6968J3195J5045k2370
200a97R147J5778k7943Q65K3848j8277m838K4679j4520j6380K2221k835j7420
213e872J6302L682j7767O887N407j4313M074J0578j0054k537L199n723M85N218
$$ y = [-15164, -3425, -25568, 39675, 26945, -57011, -32429, -8224, -38842, 5715, 30953, -23185, -17567, 3563, -19700, 1800, 16677, -17500, 7861, 29445, -18715, -10774, 21478, -12477, 1952, 43199, -203, -16453, 20565, -5793, -12704, 27639, -10854, -41366, 12701, 6410, -30972, 2180, -6256, -53318, -16711, 8219, -28297, -18676, -11680, -44102, -25426, -2030, -28007, -15444, 7728, -22578, -19752, 5686, -19691, -16561, 22236, 5626, -8379, 14211, -4402, -12046, 27623, 20809, -1203, 19814, 11723, -11617, 17606, 25647, -504, 14897, 20901, -6067, 7128, 22173, -197, 8950, 24728, -3215, -2350, 21498, 3221, -1617, 23062, 8542, -7838, 14383, 11548, -5872, 10430, 14112, -3655, 3232, 8639, -5674, -1600, 8978, -1076, -3613, -414, -6137, -5652, -434]
227d34m082k12j050k543P498J854r330M436M412n751Q365P213j2732j249J1400
242G795n527P23J1426q055o700J1339l153r891R085l12p398R134n43j4709J631
257e155L277l708P525L109j3338k597M248k998M572O370p476j423O841l561j453
272e767L438l335M595J0469n051o464K274m078K595J5111m726j0383M824k188
286A314o782J1198P77j4028Q568J0916j5036k586O602j0530K792K0934o609j5130
300g600M999p1m299J4112L789j2710K470P773n065l386L714l600L326J0293k680
315A1065j0161m574r07N265P686j749o884l582j360J813K327k326j976M251J837
330G25k901k142m598j132R127P678k837m283l339k846N052P011j580k938J355
$$ y = [-434, -4516, -4728, -5778, -8321, -823, 1031, -8299, -3863, 549, -5202, 3163, 10376, -2356, -3605, 7795, 2268, 2991, 14417, 6362, -338, 11001, 7848, -2043, 7042, 6730, -668, 8466, 7923, -6786, -5155, -1878, -5586, 1939, 5048, -8290, -10887, -6639, -9637, -5065, 1305, -6171, -7594, -753, -4314, -5767, -2329, -5664, -1069, 9400, 4349, -2115, 159, -3919, -1324, 13787, 9061, -1322, 3502, 1314, -5468, 5730, 6507, -7521, 1047, 11963, -3073, -5659, 943, -9587, -6795, 14139, 7530, -7600, -2601, -2672, -6971, 7141, 10930, -1780, 690, 8463, 3398, 12, 3726, 126, 3452, 13745, 11065, 904, -3670, -4577, 688, 8374, 6625, -259, -3841, -5201, -3388, -1061, -3387, -5363, -1112, 725, -2176, -4318, -8916, -10048, -921, 6757, 3920, -363, -3702, -6548, -1496, 5515, 3935, 997, 2352]
345B352j176j451J638l089k152N930N010l922n383l019l779L761Q420L89o685
360c156j204j70j287L952L501l568q31O539j79o356r0K949K81N657O115p819p831
377c497K799K347r1L818r94p460L57M947m470l703K145k9R30K858l533p313n1
394a0940N632L445K110q91m278o02M341J855j32Q2Q91L638J867l159j835P06K250
411D980M484K282n528l755p4L37J990J851k815k954L246j566k992P62n97j987
427b336M641J011o621j319L059j071J773N139n145l710M277ml112L664K11m948
443d491K413K965l521j839K590j108j093K481j071l310k98J985L2j26J332N04
459b555p97N54K474m54j809L554J286j506K331Q88k755Q32L817j32r90O14j939
$$ y = [2352, 1176, -275, 1363, -1726, -3878, 2052, 7062, 3140, -2243, -5262, -9041, -5280, 3140, 3529, -3156, -4360, -4530, -5817, -1865, 1636, -1932, -2763, 3776, 3597, -2759, -2849, 100, 381, 6038, 12153, 4334, -3497, -698, 1649, 1558, 5376, 4382, -3078, -2721, 2226, -2244, -5947, -3802, -3831, -2901, -43, -3576, -10889, -10940, -5308, -1863, 247, -644, -4922, -5524, -1183, 672, 540, 622, 1513, 5151, 7018, 3859, 2024, 2730, 4980, 9464, 11746, 6218, 2463, 2389, 2726, 4716, 6567, 3752, 798, 4044, 2478, -514, 248, -349, -2336, 2305, 3316, -3305, -4624, -1565, -2636, -863, 4276, -869, -4579, -302, -306, -3418, 246, 457, -4491, -2078, 887, -2634, -4473, -1883, -2991, -4084, -1603, -2674, -5984, -6282, -4297, -4265, -4391, -3059, -2555, -3352, -2798, -324, -778, -2587, 967, 2253, 747, 3078, 3966, 1211, 2043, 5860, 5728, 4738, 5352, 3413]
476C413j557J770L91k298on32j939o64L91j324j339Q63o49j257n06J070R32K00
494c041l45J439o56M18K674O10p27K781r65j091K891J307j652L233J053m885J56
511C200L568k563j184L701k900l647L635p7m352J381J501m505K042K798n078j521
527d001M158j83j247K383j326k933J601K617j862j593P36M14P14j49j425j747
543c843o8J353K211j876k282k46O2N26J961Q2l130J113M022j948j626K696Q05
560a88J05M167j15m238J659L356n15K536K204m998j461L962j442k046L761k102
576D645l669M304j422n993J741J166k532J173J889o305j295L939j148j55K925
591g37l376j390L336J198r58N83M57K21L385j011n56N76j615K194L774k584l794
$$ y = [3413, 1856, 3626, 4017, 1719, 1713, 1181, -758, -1422, -1031, -2355, -3694, -2831, -3480, -4737, -5243, -4173, -3241, -3041, -3386, -1947, -2603, -2185, 489, 1099, 372, 3153, 2188, 1097, 3988, 5295, 3643, 6876, 7929, 3044, 3200, 6768, 4205, 3021, 6722, 3822, 175, 3810, 3733, -619, 762, 2263, -2242, -200, 2598, -2480, -4001, 157, -26, -1273, 1110, -216, -3149, -1548, 1069, -793, -2386, -1650, -1236, -522, -671, -2096, -3843, -3911, -2558, -347, -2223, -4505, -4751, -4689, -4163, -2202, -2120, -5250, -4137, -115, -2063, -3689, -993, -188, -83, 4084, 3969, -269, 1390, 4746, 4231, 6767, 8971, 3973, 2512, 6474, 5032, 2986, 6747, 4645, 976, 5280, 3858, -2135, -394, 772, -1760, -587, 1302, -5003, -6298, -2359, -3507, -3662, -737, -4113, -5503, -2167, -969, -1927, -1344, -887, -666, 2719, 1708, 1152, 1728, 113, 2307, 6081, 3497, -297]
608b97K814k18k007L658r68m819L479K257n299R25K061o484L052O932m197m059
624c170L323k075j42M853j66m854J451K310k095J076l39k108K287J840j857k035
640a701k705M89L354M92k216k97k216j815N359k64l507K442Q57k427K839J484
656A68m858K866M728k755N04L497l359q28O253j209l654L366k19k444K957L20
672E333m531J520M53p39k58J68l092n89P60L4J291j659k023K92O90r25K483n84
690a376k447L055J478l956K829K167k841J972L867m553k124M331j213q26M209
705D572k435m277L145O61k671K097n51k862J699J079k577k20R50q27J604P17j662
722a558K68J440o06J611K27k575J772J934k109J478Q70l182R21L249k866q80K538
$$ y = [-297, 2517, 2299, 292, 3950, 2982, -1837, 1642, 3899, -1400, -475, 1586, -4898, -1846, 5086, 889, -3170, 153, -1922, -2064, 2789, 2623, -2231, -780, 1530, -565, 511, 172, -1936, 351, 2191, 334, -1701, -4406, -3917, -563, -71, -2287, -2584, -4800, -6615, -1256, -1520, -5027, -2585, -1728, -4155, -1316, 168, -4690, -1824, 2904, 149, 653, 4150, 791, -37, 6216, 5007, 1353, 4719, 4500, 2056, 5013, 5333, 802, 2322, 2775, 2036, 1778, 1946, -1146, -1735, -975, -941, 350, -1309, -3332, -3040, -2350, -3275, -792, -1376, -3823, -768, 710, -3246, -417, 1750, -1091, 881, 4748, 195, -1929, 2402, 1189, 363, 4572, 2137, -2140, 1005, 1666, -1005, 1092, 541, -2321, -622, 457, -2120, -2340, -1390, -2217, -613, 104, -1558, -1290, 150, -456, 1155, 1382, -1193, 579, 2513, 404, 1882, 2752, -430, 491, 3740, 874, -6, 2532]
739B532l367j249L426k017k870L376l37m118K460J529l263K557K441l857n9M493
755A677k673p9L584j526j141K843O1j328J452Rk67P71r30p58J69l13J3L74k113
774a75o67Q28R0j642J562j477j666J887J170l277J909K494l038J355K011k320
790i56j40M012j770j208K469l63j911K363P73k737J111J018k397Q86n0q01j922
807a623J372j05j320M3nm09k64Q60J53n22P3J143k23j213K040P04j376J144J571
826B043j635P54J564j923O2K321p66k770J528L63j888J019J115l410P5J878j864
843a534k94L92r50P3J144J044k434M13J412q4K37J170n92p89J321J736j171j088
861FJ399N90j377Q99j29k163j10K298j135j284M94j420m53J832K32k026R0J741
$$ y = [2532, -835, -2084, 1342, -675, -3545, -169, -506, -4624, -2164, -635, -3898, -1341, 1100, -2757, -2816, 1677, -996, -1075, 2509, 983, -158, 2685, 2746, 1418, 2870, 2879, 2612, 3383, 2453, 1695, 1864, 1551, 1564, 1938, -175, -842, -14, 76, -1566, -4, -1481, -3147, -1260, -90, -3367, -1458, 1036, -2002, -647, 1364, -956, -1096, 2916, 1146, -62, 2407, 2044, 133, 2496, 3269, 532, 1643, 2661, 264, 1150, 1100, 299, -1623, -251, -356, -1676, -1633, -1638, -2047, -2311, -1451, -1298, -1820, -1747, -604, -827, -2040, 0, 704, -672, 472, 2043, 408, 1162, 2726, 803, 865, 3186, 2420, -350, 1178, 1541, -347, 672, 1787, -1623, -1548, 330, -1534, -1828, -1436, -2386, -2313, -1169, -125, -2559, -2146, -734, -818, -581, 589, -3, -792, 529, 2265, 1094, 6, 1405, 1995, 618, 1517, 1388, -775, -885, 1413, 278, -1006, -512, -1932, -2385, -553, -321, -2347, -2257, -516]
879e16n49n02J436j790O62J873Q01k022Q59O08j81R95R74r38r03J459j91o13M29
898A891N66k226L46P00j198j810J264q68p52R13p10j171K71J148k23q23J223J66
916a293j195M31J672n71K43J320J83m25J211Q90j822P52J184j147K28Q77j597
933I41o27R84n43j252P10Jq01l60O55r3j276J963J71q52J92k51o59R47J482n24
953H08j260J609J108j165N95M34j939R93J368j177j099Q69j65j445J020L5j514
970i25j65J285r95l59R5j4j73R92R06r98q58K258j33q2J390r8l11R59M36j007
990B203J17J191j101m34P10l85j056K66M30j566p24Q64j053o01Q78Nj188m6J107
1009c83j334M85O11K16J17l39L89j1R89N15mm31J374J28l27K14K00p77j6R93q11
$$ y = [-516, -1065, -1567, -131, -1921, -1259, 614, 1415, -607, 252, 860, 679, 1674, 2648, 1710, 807, 2266, 2075, 1462, 1891, 2457, 231, 577, 1277, 79, -1731, -467, -1335, -2087, -1174, -1884, -3055, -2784, -1636, -1859, -2682, -1459, -1293, -2488, -2057, -385, -956, -713, 607, 790, 365, 1576, 2466, 644, 1396, 2580, 1433, 1661, 2538, 941, 314, 1298, 755, -497, 213, 214, -587, -947, -292, -385, -1661, 302, 473, -379, -187, -438, -1097, -150, 1332, 808, -452, 1157, 2265, 1100, 1695, 2129, 190, 1183, 2551, 1374, 275, 1144, 979, -466, 554, 589, -925, -1090, 195, -800, -1159, -1064, -1078, -1251, -259, 647, -351, -1209, 1049, 916, 834, 2224, 2126, 1815, 2774, 3210, 2203, 2320, 3511, 2410, 1976, 2686, 2301, 1245, 1511, 1941, 375, -349, 515, -538, -1139, -261, -256, -1444, -1490, -383, -1717, -1232, -621, -405, -288, -627, -238, -249, 740, 1255, 1251, 820, 2194, 2322, 1995, 2209, 2409, 1632, 1616, 2609, 1798]
1030A798O32j037P28j752N51k43j161Q81M77q69p11Q12j50k27R88L21q30M82J133
1049A823o66l25J050o17j89R81m26j085N97J145j253q03L68m18L2M73l22j455
1067a090M64k3n11J10R05p68o33P20J62K13p19J725j14j77L62N28m33J374O21
1086B716j228M8O38J97n70Q94q68j063N72k00j472N70p28o26N96n72o14m36Q29
1105a317K34j113RO45J09M20J217q28k76Q28O07O6j71J146p88n39O76P25j009
1124F41M80N85j348l57N65r83K53P98n00j892L56Q01o48L68O98r97J3M89N46l56
1144d88Q15p5o40M01J088r08O30R72p06o06O03l83k92L34n84l00l64m44L85o27
1164a189o4P41p94m49j31k85Q7J397k53m24J79Q13k9P57N23j410O73O52L49R7
$$ y = [1798, 2430, 1393, 2121, 369, 920, 677, -484, 397, 874, 5, -706, 106, -44, -271, 717, 1038, 208, 690, 1823, 1157, 832, 1882, 1265, 1076, 2057, 1631, 546, 1143, 2288, 1035, 232, 600, 182, 214, 687, 365, -1090, -626, -649, -1160, -1050, -145, -913, -1546, -826, -664, -451, -1170, 555, 441, 264, 626, 1154, 721, 2095, 2716, 1488, 1536, 2174, 2371, 1801, 2695, 1827, 764, 1336, 1136, -336, 234, -494, -1120, -524, -1096, -1710, -2146, -1317, -1083, -2196, -2187, -1542, -1433, -1013, 204, -624, -900, -72, 535, 601, 430, 1576, 788, 249, 925, 1650, 641, 1121, 1706, 358, 1, 566, -417, -164, 634, 134, -1758, -1402, -601, -1249, -881, -183, -1180, -1167, -678, -132, -488, 327, 252, -388, 13, 1101, 193, 823, 1795, 1089, 483, 1086, 703, 411, 745, 161, -139, -503, -947, -562, -1189, -1253, -512, -1306, -1755, -1886, -2171, -2084, -687, -940, -1364, -1185, -372, -401, 356, 879, -531, 142, 794, 1143, 1240]
1184A240J03r3r9L98n27m30J54K71n39j75o26k71PQ2n03k32J97l81P03o15N0j27
1206a413J74l07J660l7o78J180m22M19m97Q82p22N10J333j116l97N15o76l10O01
1225F99L09j346K66M06j022n60J120j036m08K18Q63m38J67L79K40j0J59M78k11
1244B73O05L54k87m19O46L56o88M58l07l78L33k72m20k12N29m68j043N30r5n67
1264a072J076p81o95j89J114q01K80N95j03L57L33K98l21j1L19J339j002M65p07
1283D94J79M62k0o60k83R22j111L05K09p47m49LQ3n14l56P93q08N5P21j19J86
1304f55J67N40n36M32O49J43k72R66l72L26n34K99M3l82O9l61p09N59J35j184
1324f77j27K77R1p77J7K70n56N89K75m26J0k06R49l27O65l7J15N47P5j50k3r8
$$ y = [1240, 1343, 1250, 1151, 1549, 1022, 592, 746, 1017, 478, 303, -323, -594, -587, -505, -1008, -1240, -1043, -1424, -721, -1336, -1286, -1413, -1239, -1546, 114, 77, -601, 579, 157, 576, 79, 961, 239, 749, 2082, 966, 569, 1084, 408, 98, 699, 1008, -338, -72, 334, -688, -1248, -128, -1164, -1572, -1354, -491, -929, -762, -383, -143, -153, 6, 484, 273, 878, 1232, 945, 526, 1172, 1528, 840, 1298, 991, 613, 946, 674, 254, 42, 571, 103, -940, -410, -505, -1072, 4, -777, -1472, -1661, -547, -1348, -1068, -473, -576, -219, 114, 412, 91, 80, 399, 1738, 736, 1201, 494, 673, 1135, 1115, 455, 172, 1094, -17, 288, 497, -250, -699, -696, -613, -1127, -1483, -690, -1498, -1443, -722, -841, -655, -488, 52, -484, -52, 597, 740, 468, 1434, 1062, 1388, 854, 1153, 1196, 814, 883, 522, -187, 372, 507, -677, -804, -527, -436, -1213, -1196, -926, -1482, -893, -618, -1044, -1034, -1240, -291, -618, 47, 10, 125, 672, 747, 597, 574, 476]
1346D76J84N3K24K60o28L57P48j040o87N39o91j14J55j203K43Q59m63p69O05j88
1366a080n21O91K98L70n9m6O79m35P76m1L84J3m0l9n45R15j21j046L29K29j188
1387d77O48l67k33p34P20o4m16J86n14L25n78R56L12r01L59R67j07K99J22j39
1407C64M84q6J67n43N35N68q14N50K1m46K62o2n42p06k59J31L8k59P3n76K59k64
1429a105J66n8J13N0K88Q2P53m51o8O03J04J02j9j8K93l5K56l53j99O71p30l92
1451E3M22o91p90K54P07q22L06r3k86k66J218n25l14L10M2J1L16L6l0K46K67N65
1473I36m54M38K31j00n86O71j87m95L0M28q39m74M36Kq77L26M34j175j73Q77q05
1494a356J4Q89j60o2O5L93p95J796r06Q7J133J61l86k46M84q04R79k1k31n31p3
$$ y = [476, 660, 713, 937, 1197, 569, 926, 1674, 634, -53, 486, -205, -319, -164, -1367, -1124, -265, -728, -1497, -892, -1080, -1601, -910, -612, -242, -301, -347, 332, -103, 673, 632, 1016, 1029, 989, 950, 405, 1320, 1199, 153, 482, 711, -477, 171, -196, -429, -1163, -443, -507, -923, -737, -1251, -926, -1504, -548, -236, -1137, -778, 189, 82, 381, 503, 364, 848, 762, 929, 386, 921, 1489, 675, 1225, 1246, 800, 1062, 1000, 458, -248, -507, -376, -338, -597, -524, -1100, -841, -1105, -939, -997, -884, -834, -546, -464, 289, -162, -230, 373, 477, 579, 560, 542, 835, 800, 1056, 703, 504, 1175, 445, 53, 475, -216, -1006, -752, -45, -867, -561, -654, -940, -1206, 12, -513, -827, -517, -475, -464, -148, -112, -142, 104, 371, 936, 482, 920, 1151, 1051, 465, 1136, 949, 454, 484, 912, 73, -401, 35, 37, -840, -514, -80, -1255, -1428, -551, -1356, -1342, -453, -613, -675, -610, -217, -1012, 784, -122, -35, 1098, 1259, 873, 627, 1111, 307, 1286, 1265, 1034, 503, 430]
1515D30M1m47m48q5K94o60P37L65j003n26N03m79J46Q83j44p77J26J455p82k85
1535f56J226N14r40P27Q9n56Q30K13n15k04P24j298Q34m72o01k18M89p44P6j9
1555e01m5p8k74k04m14K11N69J156j304M58P13JL7J84j33l3J051L73q73k97M87
1576A084j60p56Q89M56j506N82r29r8J62j14r24l6O96l19l12J03Q22k99L42j03
1596d20n12N79P03J22k55M78J39j94p4N54n69J35K10n3K09k99O2m24o66p5P58
1617D08j111J77J72p27L73k12J89k51N11l41K34N78k49o48J043K64k53L29K40
1636G26j01L20k72J40k04r5j36k91k09N93j50k86k81l07n04N58k59k66J67M53
1656d04M0p93R05O9K84k09l0K35K21K27L6L22q37Q14m19R60m13m34k19M76j033
$$ y = [430, 471, 24, -424, -509, -215, -875, -138, 227, -776, -1302, -799, -1278, -1132, -249, -393, -1170, -1044, 411, -371, -656, 570, 1084, 144, 871, 960, 404, 1234, 1447, 932, 728, 1452, 154, 988, 516, -85, -303, 186, -558, -482, -501, -546, -624, -898, -1102, -1516, -1305, -736, 420, -884, -426, 287, 288, 325, 509, 376, 343, 1394, 1767, 894, 597, 1084, 924, 168, 1057, 1513, 7, 589, -340, -438, -276, -390, -1314, -1350, -654, -973, -1285, -1182, -360, -659, -317, -420, -932, -353, 350, 472, 217, 695, 834, 640, 566, 1120, 551, 686, 896, 843, 1052, 753, 815, 391, -275, -350, 408, -703, -526, -354, -1081, -708, -920, -731, -982, -471, -812, -578, 0, -249, -897, 146, 410, 157, 486, 726, 625, 945, 673, 813, 609, 514, 378, 87, -122, 471, 321, 35, -246, -553, -1057, -499, -758, -1024, -857, -404, -364, -1157, -252, -183, 101, -108, -138, 97, 318, 545, 581, 903, 66, 880, 461, 1421, 1008, 574, 355, 831, -202]
1677b02K38J63n84o8L1Qn53M46j20k33p3K65j96K67L42k22K17n9N67k02M88m95
1699B5N22K99m68L47j32m74K02N54k62j78j89k26L0O2r07L83M24k54n86J56l38
1720a010J30P49m79k65K77O2n6L40Q25n80P8L05L14L15pk07o5o4j62p8m5k68J45
1743B54p77J22K33l55J85j97Q3p06K82K83J89l28N56n74O7P42K13l58N00L65o71
1764A08K96O49n82j23J062p02J09m7l05k41M45n09m33K17l38Q0k99p8J6r8L69
1785d04l18j85l1P50kj37K56J85j89N44J19N9l06L62J95k49n1J06k81j18M97n29
1807B73p13M52m56j49R7R2k05K73Pl15J56j62j53J51N04j21J19R5K93l8L64j62
1829D02q4O25ll34O1j83J2J70l64j28j18K07nl85N5o10Q8M8j66P8Ok68N25Ll25
$$ y = [-202, 36, 199, -385, -453, -422, -414, -967, -521, -641, -874, -947, -682, -878, -611, -269, -491, -274, -333, 234, 32, 520, 25, 547, 846, 378, 725, 593, 119, 321, 875, 613, 435, 246, 20, 50, 112, -795, -412, 12, -242, -828, -672, -1010, -880, -131, -610, -875, -598, -536, -592, -252, 573, -7, 71, 376, 690, 1005, 998, 791, 726, 662, 500, 422, 377, 109, 254, -523, -401, -168, -523, -338, -535, -452, -1158, -876, -593, -404, -732, -176, -750, -683, 59, 272, -86, 414, 779, 108, 404, 1053, 471, 348, 1410, 708, 817, 770, 465, 224, 669, 160, -273, -56, -394, -314, -613, -691, -675, -773, -404, -722, -907, -938, -188, -190, -327, -71, 114, -75, 469, 588, 647, 341, 703, 898, 649, 598, 704, 423, 305, 802, 273, -440, 12, -444, -593, -496, -404, -609, -336, -329, -644, -488, -650, -803, -652, -148, -269, -150, -55, 238, 200, 564, 402, 318, 943, 940, 606, 667, 484, 496, 666, 302, 174, 56, 263, 258, -127, -72, -682, -594, -546, -712, -634, -628, -896, -371, -368, -693]
1854f93N14q5m4K18N63K9l09N79j18k93M03j03N6O8J54n09K21m98J66j06m68j72
1876d27k78K02J13k80Q0j20M51p49N10L92k44r5N28j66j1L97J28j58j66Q97k26
1897G78o2p6k99o5N35l31n17M08k28o56K50j06P4k84j04%n4J59j0l2K00R4J54
1920a72J06l52N44L01k14L86j92KK57kk6M5J34p95K09K43n31r8K86l76l20j65
1942g30j59n6K13J97K7l01L81j00k7L60j83K60K27J0m9K78K37J85j73k05L00k45
1964D47K80l4l20k33K54k18j45l10L1j77k63J69pq0j52J30J12K0L16l31N39k5
1986CJ9k34L97K70j90K03M79k95k97J68Ml33J80k13R8k22k09j60k81M9K18k29
2008e75j12ro6J06K4J98o0L81j71J63k73O84k66K49K20j29N38J3l70j68L6K02
$$ y = [-693, -179, -264, -308, -90, 473, 502, 193, 772, 654, 361, 764, 661, 717, 785, 939, 430, 651, 153, 319, 213, -255, -427, -705, -503, -390, -670, -590, -710, -259, -1008, -498, -106, -350, -445, 83, -83, -94, 303, 431, 273, 107, 1004, 778, 716, 640, 341, 276, 811, 480, -37, 371, 143, -513, -263, -369, -295, -579, -683, -683, -737, -578, -588, -620, -420, -326, -172, -66, -418, 126, 427, 213, 599, 407, 409, 666, 664, 638, 683, 817, 22, 231, 474, -57, -155, 131, -245, -565, -730, -889, -945, -732, -535, -508, -809, -428, -528, -555, -195, -378, -118, 109, 119, 70, 348, 585, 770, 597, 392, 692, 447, 727, 693, 373, 140, 394, 176, 31, -279, -248, -425, -688, -519, -526, -606, -758, -628, -516, -496, -180, -511, 28, 3, 22, -212, 185, 455, 265, 468, 947, 652, 355, 523, 527, 194, 374, 161, 259, 37, -172, -332, -613, -564, -346, -575, -687, -696, -762, -656, -632, -434, -494, -113, -284, -121, -394, 290, 24, 273, 493, 364, 902, 915, 545, 377, 413, 615]
2030F15k80J38k5m94J53oo85J13M05n41q8K12n2k31K89P3r1r0N43k02K45L45j25
2053B21l1m6L72j8N5j05K49l14L82k38J16m32L4J51j79k96m65N12l86K8Jj68Q5
2076d72J2l02M79j60K89p3R5K47j82N20j47J33K7L59l75K97l87J26o3k04l05J52
2098F6J4l32p2P5K4j23k53l9k54L82K6j77j65O45j30k4L59j0q9L63J97j23M5J49
2122E54Q6j04K49k25j46l6j34r9l45K26q7L2k00n3J33j8m8n84N44k91KJ47j11
2145e08L79r1N18k06K35J82m62L72J8K34l49K67L5k65K08k80j33K26o8j08l18
2166a14j51j88m04N08n98M56lj05R7L28l51J93L44j23J81K23N1l1L4r0L17l39
2188B35L79l49L34l01M04n95J5K14j70J84m72l24K48n15J17J60o1Q5k34M03n01
$$ y = [615, 335, 473, 448, -46, 107, 101, -584, -471, -66, -607, -695, -483, -535, -766, -477, -404, -495, -585, -42, -244, 1, 346, 221, 190, 144, 516, 498, 553, 448, 697, 383, 765, 527, 643, 211, 245, 396, 217, -79, -544, -32, -418, -390, -389, -557, -472, -460, -762, -283, -443, -154, -227, -132, 115, -67, 453, 306, 439, 466, 825, 450, 747, 360, 486, 423, 219, -86, 66, 80, -252, -324, -249, -225, -348, -601, -640, -894, -512, -486, -663, -828, -183, -313, -337, 22, 12, -77, 286, 483, 360, 405, 554, 640, 536, 785, 560, 414, 378, 244, 145, -200, 26, -61, -29, -229, -282, -149, -167, -215, -799, -255, -546, -544, -397, -508, -129, -220, 298, 92, 327, 509, 47, 419, 437, 671, 322, 589, 624, 359, 567, 287, 154, 380, 312, 204, -114, -265, -453, -857, -349, -947, -491, -494, -599, -502, -174, -525, -332, 12, -111, 70, 293, 344, 313, 347, 257, 574, 235, 614, 265, 599, 298, 702, 107, 122, 336, 166, 350, -122, -446, -198, -713, -596, -436, -497, -412, -646, -243, -744]
2209g44N51k56L34j25p0K97K82J14jk55M07K61p3k19o61P41l80O3n65M45l68j75
2231c97O4m0K25k03K61k03o89L99Kp0K29J71M24m96O43L02k68J67p4K1n2L71j8
2254G69q80R33p87lJ99l05rj37Q2l1K5j69N4k36o6O9p2L00m3j12J50K14n0J09
2278DK47n09N02pJ31K57q0o2L24k28n82n0P42o75P8j95m0k81J21K09l47k55p9
2301g75N81lj95J5M42n55M32K76k40k62M31L08NQj41L57j74l4k96J86l67K79l78
2324a00K18L55p10J66o9L7k03j6l86O73j02L7m67M70J4J64K5k6J9j11M25J73j79
2347D07L60r63O35m18P83o6m16m39L01K00j17l93r5k05K70n16J16l0K05q2Q5Q0
2369b98n71N91m4j3L19N80p44K30L38k86J93J60J82p52P14P2m75L25m91l19K54
$$ y = [-744, -193, -449, -115, -240, -310, -13, 269, 383, 382, 127, 534, 795, 722, 503, -158, 583, 203, 266, -299, 146, -222, -397, -333, -373, -148, -351, -90, -293, -982, -583, -581, -651, -422, -251, 173, -323, 320, 622, 354, 521, 447, 468, 416, 787, 769, -111, 822, 35, 32, 231, -74, -83, -220, -138, -169, -144, -313, -259, -495, -561, -492, -564, -264, -307, -419, -269, -55, -105, 4, 251, -258, 244, 237, 368, 625, 545, 483, 807, 579, -3, -53, 689, 14, 92, -103, -143, -424, -303, -94, -441, -696, -775, -194, -197, -392, -377, 65, -490, -58, 218, -22, -284, 147, 455, 460, 468, 327, 684, 510, 476, 180, 366, -1, 278, -100, 118, 473, -237, -71, -140, -103, -306, -322, -708, -35, -137, -100, -567, -97, -83, 81, 106, 80, 99, -12, 413, 586, 407, 767, -196, 439, 21, 804, 738, 322, -117, 184, 384, 267, -126, -221, -426, -156, -672, -556, -586, -381, -463, -378, -298, -869, -278, -322, -335, -16, 564, -180, 50, 388, 102, 295, 455, 637, -115, 599, 671, 196, 521, 30, -289, -35]
2390c5N2j96j44j96J78J83j12k55K75k82N9K91L7k85J77J17J82Q6k26J84n6K79
2412C13j65J44L17k72L30j82J6k56K27j68n42N3L68o76M38k12j9k68L88o53J33
2433f86K95N4L26k92N35m36M70m31P4N51K65j47n83M49N05m15j12l93M80J6j01
2454D24m48K61l38Qj65n3n10O38Mk90j21M29j48J03k15M23K1l99M50L08j45k28
2476IK68j7k5o2L69k62k34M54n04K58l21k98K21p6j61K00K1j14o5O6L28n50R7
2499c98P6K54qk00J15L1o6P56m17N8K39m39K3K68Ql45M22k15K21k87o7p7k49O43
2523C46m38j48l89J65K53m36K93J04j80K30R6q3J88k8J92J96j57K03N0m81M03
2544C79O7J97k96j68J5J42n02j92J23J18Q5l06M75m11j46j14k1R8J22J12j72R3
$$ y = [-35, 17, -179, -323, -519, -341, -158, -270, -525, -250, -532, -473, -182, -145, -430, -253, -136, 46, 132, -94, 90, 34, 313, 148, 292, 609, 337, 667, 485, 501, 245, 472, 304, -238, -185, 183, -493, -55, -267, -286, -554, -166, -819, -686, -391, -337, -11, -303, 232, -204, 266, -165, -91, 460, 725, 578, -5, 444, 949, 534, 422, 29, 509, 525, 424, -24, 237, -101, -93, -258, -311, -821, -183, -179, -469, -590, -161, -309, -206, -421, 2, 23, -376, 74, 382, 237, 9, 277, 260, 235, 173, 542, 280, 46, 500, -4, 254, -67, -365, -144, -220, -381, -181, -160, -274, -339, -273, 55, -495, -398, -322, -68, -76, -276, -161, -130, -196, 560, 143, 201, 440, 1, 24, 292, 300, -45, 377, 162, 383, 96, 29, -48, -297, 346, -92, -240, -629, -464, -211, -647, -354, -250, -430, -200, -104, -187, 1, -27, 165, 361, 204, 407, 457, -24, 379, 446, 643, 347, 179, 194, 336, -166, -358, -235, -117, -32, -338, 137, -274, -420, -534, -555, -457, -335, -223, -395, -302]
2566c02J15R3j76L06J2j76N10m5l51J54l05M65l5j34p6K48n51L05J5r3m9q7r7
2589b54P6j11L9r1Ok46n7M06K9K4N1j06jR2K22L97m21P70j002J037r1j052Q03
2612E20L36p04n20M85J33n21N60n30o7J00j35J46n9l13L37m3L58n45j62L29K20
2633g5O04n54P01p82P72k17Rj71M4l3l02K18l88K50K18r8n60j24M00j88J65O3
2655d8p03K52L86j71K12j65O3J34Lj79K94k12L36M7J64l87O9RO08l32n23L00L68
2678E25k35k23K46M24q00O2J44r36O46l79L80K53r23J72L92lL16m7K41j71j3J34
2700B05R1m63O25k26L99n72K23P2P1m22l9j71K97l16j73P30k83n70j70O58l54
2721c88K80J22l49k11M20n92L69L38k04K91k95L91L89l46J75k94J69j24Q5l00
$$ y = [-302, -187, -94, -270, 36, 48, -128, 382, 337, -14, 140, -165, 300, 265, 131, 55, 303, -248, 57, 72, -21, -70, -157, -254, -178, -289, -250, -341, -335, -581, -638, -232, -203, -179, -128, -234, -235, -143, 79, 476, 55, 825, -177, 860, 769, -283, 520, 856, 152, -368, 117, 250, -271, 289, -241, -308, -208, -343, -197, -256, -569, -232, -275, 83, -462, -624, -295, -75, 529, -25, 676, -106, 666, 449, 458, 287, 331, 298, -4, 214, -174, 76, 294, 196, -364, -488, -88, -276, -111, -48, -751, -499, -113, -284, -72, -237, -174, -40, -37, -216, 78, -134, 202, 249, 413, 26, 95, 104, 712, 380, -143, 157, 525, 290, 67, 313, 737, -63, -1, 143, -793, -147, -526, -146, 107, -816, -644, -252, -255, 61, 14, 255, 84, 71, 205, 296, -167, 458, 232, 631, 59, 282, 354, 425, 3, -36, -207, 90, -226, -399, 331, 48, -522, -692, -34, -388, -108, 14, -335, -546, -126, -718, -349, -11, -215, 76, -219, 172, 561, 215, 390, 96, 265, 141, 226, -74]
2741g4J6M5M95n83L67j56q3L25n75j70N4o6j52M63m4L81k71l15m21Q87o3N49o37
2764b8J60K34k18L88o25L00K64k02j98J82m72L10J76l94l36Q0M26k15L12o11j00
2785e67j44P35k84K97p8k04M10j011O96q1P0N87p8n51N58R7j86K15n07k0M73k99
2807A28J12m69M74J25j98k16K29j52j65M3m71l93J238q22R0K22K24l72M52J14
2827A93k17k46N96k37j2j61M12L33k69K39m92J48J80j33l80O93l71j88k59J88
2847A7l73Nk08p4L11J9l34R90m00q01N75N76K8q5J68J31M89q24M30p93Q13j35
2869E25j62j73j60p8M55o04N89m65M5l01M09p4o51P28n74J58n7j63K26L13K20
2890B06o32M30l5o2m35L85M65j74l61Q60k44J10o52P08p74L78K96j207Q67j64
$$ y = [-74, -58, -13, 482, -101, 266, 110, 27, 352, -223, -393, -339, -405, -557, -94, -138, 243, -28, -343, -764, 123, 60, 609, -28, 132, 366, 148, 536, -89, 211, 475, 273, 75, 257, -215, 95, 271, -123, -459, -379, 47, -168, 144, -467, -567, -711, 24, -260, 37, -41, -245, 165, -846, -150, -231, -161, 426, 348, -203, 355, 452, 266, 481, -26, -46, 427, 128, 240, -229, 245, 370, 172, -44, 185, 33, -132, -89, -560, -953, 285, -537, -447, -225, -1, -373, 79, 193, -24, -270, 326, 89, 77, -84, 328, 661, 392, 631, 139, 287, 467, 334, -46, 647, 276, 88, -171, 17, -356, -351, -559, -633, -322, -303, -637, 353, -47, -848, -273, 303, 331, 246, 414, 545, 1034, 210, 640, -153, 660, 525, 363, 190, 30, -48, 407, -197, 392, -73, -28, -329, 80, 6, -645, 83, -491, -333, -390, -553, -327, -14, 206, -426, 4, -31, -93, -528, -143, 322, 148, -213, 647, 403, 513, -139, 569, -205, 173, 469, -738, 129, -35]
2910c5P28r38j69O24j042Q72l47r61K58N10R95n30m98K79K15M77j03k33J28k26
2930DJ64Q2j75j7R6K57L31r66P42o54j80p8k59k11K92M47q66R09p07N37K45k71
2952b78K53K80J04o10K39M79J42m03O40l53p66N46K79j05j60J3o98O35m89M55
2972B03q84O18P9n28O5K94Lm3m4k2j34k45n07R87l66L46j14N19q8M44j84j40K12
2995D71j30k8J18K27m67j3J01M91r42k50O09j07l76p14L07P76j93l56J095j081
3015d62L56k89L92j52M14k38M3O45k89k21L58l92m41j68M96L94p10Q50j39n62
3035a15K08J68k21m28lL42kj88l36R3m1P17j22m52P77lq35J99K62R74q53l86J017
3058G72n60m28P3L42k59J048j544J119j62l17o7J95K2j17r6N2m67K00J14p94Q61
$$ y = [-35, 693, -245, -414, 210, -832, 40, -307, -1268, -1010, -500, 495, -35, -533, -254, -39, 438, 335, 102, 230, 4, 168, 250, 75, 58, 154, 411, 742, -224, 518, -136, -316, -394, -653, -864, -572, -125, -991, -82, -789, -252, -7, -278, -25, 255, 359, -251, -12, 467, 609, 206, 846, 493, -273, 273, 552, 447, 287, 300, -398, 237, -252, 203, -681, -63, 16, -512, -447, -153, -150, -193, -237, -259, -393, -638, -1145, -158, -524, -178, -292, 227, 139, 583, 399, 259, 471, 341, 313, 431, 658, 191, 178, 279, 770, -172, -422, 187, 80, -296, -1010, -703, 73, -120, -476, 619, -462, -106, -395, -3, -155, 259, 21, 64, 709, 420, 199, 557, 165, -276, -444, 52, 446, -264, 586, 447, -115, 93, 261, 40, -388, -391, -49, -51, -239, -575, -482, -523, 194, 72, -380, 397, 394, -441, -242, 20, 994, 141, -245, 772, 212, -216, -143, 199, -60, 988, -556, 563, 401, 84, 17, 212, 234, 117, 21, 73, -394, -194, -80, -874, -13]
3079a3k91R6N80p96L87L69l90M78o20l93J018O9J10l00M22r24L03K2L75J64O6
3100G32m25k96q6L21j69k74j71M03K9j21K3P1l08j43o5l69M94L30m3L75j08L1
3122B31k12m41M80O3L56k86Q9j95Q4L19j26j13l09K19q57O26n3Q0J42k57R9K10
3144A49m17L86o13n9J08j48P49j11M2k0J66m66P72k81N27k12M04m34o38K16m23
3165c03O89m74L4K11j56k68P79n38r0j98O27k11k32L50q91O30K33j36J30Q3m25
3186a56L70n5J51j65J70j41kk34L8J15J89j68m13M91n90P77%m98n4J83Q6n98P30
3209B26m62L84l18l2m3L87K03l21J56K95l45j41J37K23M7k19J67J33k87j90qj91
3231a99L07l53L66n70J82p2L59q4m40J14J73L26Q8Mk77J02j44J70m43N12k33M52
$$ y = [-13, -304, -208, 372, -424, -37, 332, -58, 420, -200, -593, 425, 494, 604, 304, 726, -198, 105, 127, 502, 666, 732, 307, 11, -75, 246, 77, -197, -368, 35, 64, -57, -34, 37, -271, -414, -479, -848, -354, -24, -67, 308, 200, 231, 19, -422, 58, 121, 477, 191, 280, 85, 169, 488, 362, 249, -60, 159, -698, -72, -125, -45, 97, -160, -61, 149, -268, 118, -495, -554, -446, -594, 155, 44, 86, 66, 232, -234, 538, 257, 784, 572, 976, 542, -96, 120, -303, 386, -88, -54, 157, 1, -267, 512, -26, -116, -314, 313, 102, -130, 220, -671, -41, 192, 56, 186, 269, -156, 214, 159, 310, 145, 315, 174, 172, -62, -24, 91, 280, 112, -301, 190, -400, 377, 377, -121, -175, 8, 94, -504, 226, -236, 148, -170, -202, -245, 142, 345, 24, 180, 475, 130, -11, 126, 349, 396, 177, 344, 477, 190, 0, -8, -199, 108, -245, 121, -449, -267, -339, 20, -64, -504, -390, -217, 109, 197, 201, -76, 26, -118, 52, -391, 121, -112, 340]
3253C40m62R45j45l91K30j18m05n46Q03j9o7o73Q25l22l46L29m05l2J13P9J31
3274a36J9N10l96j98K19N7J83n53o1k62L60O76j12p23M67M00n1l40l2L6j49j09
3296a95KJ91K77k84p7l8k6l72L83l76R75j00n56j55O25m36J53L2J44k89J40J38
3318A56Q0L12n48L4O30k82k81Jk67L74k80k7l34J92N31n56P6j87n0j13j48O07
3340h0j31k90Q89n95L35P0r6l34L63k72J33q5J61j63J6M48j78l72P34m99n11K34
3362b23Jl13M87l56M30K00n39J91o3j06Q02r72L30O74q64K92L06k34k11j07N12
3383B37J47K23l83J75p44N82n90P43m73J47j18j17K1L17k79K59M14j002M70n08
3403d79L42R2R4r5K49p8j7J61k79M22l15K54n13N28p7m88O81o95M8K42pL9j29
$$ y = [340, -122, 823, 678, 287, 517, 399, -6, -552, 251, 232, 165, -508, 317, -5, -351, -22, -427, -459, -346, -267, -136, -117, 393, -3, -201, 18, 75, 258, -295, -356, -618, -258, 418, 306, -417, 50, 450, 399, 59, 27, 63, -86, -195, -193, -2, 275, -9, -86, -124, -150, -522, -139, -515, 460, 360, -196, -351, 274, -162, -9, 23, 167, -122, 18, 156, 236, 548, 0, 34, 664, 382, 101, 102, -165, 209, -71, -98, -432, -240, 291, -265, -189, -376, -426, -539, -687, -80, -211, -501, 388, -207, 128, 198, 102, -232, 131, -141, -8, -93, 68, -95, -79, 369, 191, -181, 553, 54, -457, -223, -222, -535, -48, -404, 26, 226, -313, -122, -185, -291, 511, -461, -131, 543, -321, -29, 277, 43, -168, -275, 237, 384, 607, 224, 399, -345, 237, -353, 390, -83, 64, -54, -171, -150, 167, -112, 147, 561, -441, 29, -479, -137, -45, 49, -46, 203, 125, 108, 269, -10, 412, 97, 351, -162, 366, 289, -199, 482, -213, -165, 77, 70, 109, -20]
3426b0K15n78N41n72k0K49RK09n68J18N1O48j00M0R2l52L16L48p10Q1k16J93K03
3449A77q6P7N09o11K41r9r24O28K30r9n70M25k35L84m77M83k38l32L32J86k73
3470b72m09L91J90o9R4k06P1N42j2m96J56m2Q0N18q43J81R9m33j25L81k63N60
3492I3p2K94m50J7J72o98L66j89k12J314r08K6J111q40r2J57O51q12m23J410j191
3513b76J153j316P16r77M20M52K72j37L63r42q2J30M99O19j975J121k25M20j49
3532H6j3J98j51K8m98P4M95o15j50M48j34k08J139K02j180J142j558J045q4q7
3552A79R0k74m10J001j97l09q0J15l5m05P93k30j22l96J19K22j58J88l15K21L08
3573C05n62O06q2J21n91M45L58k32L27o04J54q17P67q3p9l40O92l28p1N45p59
$$ y = [-20, 195, -383, 158, -414, -434, -185, -176, 33, -535, -417, -366, 282, 182, 222, 314, -38, 278, 626, -84, -3, -219, -26, 177, 91, 168, 677, 66, 307, 208, -716, -88, 142, 43, -527, -102, -337, 47, -430, 53, -185, -517, -185, 1, -272, -681, -290, -100, -169, -75, -281, -210, 332, 320, -176, -20, -62, 18, 536, -307, -126, -27, -460, -585, -204, -467, 93, 21, 315, -135, -118, 54, -644, -278, -467, -679, 635, -273, -247, 864, 24, -68, 89, 740, -72, -495, 915, -276, 877, -439, 277, -700, -280, 172, 444, 307, 670, -272, -354, -224, 275, 894, -1081, 40, -185, 235, 86, 73, 271, 120, 148, -350, -276, 219, -396, -546, -98, -232, -440, 699, 901, -279, 863, -695, 350, 266, 179, 269, -5, -415, 586, 389, 80, 0, 115, 80, -325, 468, 238, 116, -280, -161, 61, -97, 91, -224, -3, 305, -257, 349, 267, 388, -203, 242, 600, 368, 695, 91, 245, -572, 195, 112, 33, -307, 385, 57, -14, 531, -228]
3594b28r0M87k94j64L94r00Q12L59m18j11P42m46k96j84M43k18M69j22k38l66
3614c69k51R82m18j95K94j53n4n3K99j78l75J68L16j74K79m72L58K74k41k68K11
3635b0J76m80M01j32L25J17j34j60O20j146N97M65p12M68m07k76P20n73J28N60
3655E37k79p39l70P97J35k24N63n52q2J05j76R8J25M26m16M7M83k67M65q12L66
3676B30L09m40k50K38L25l03L98n92k37k69N39J87k96r0n5M59l78l78J09J55N45
3697B06O3N41r20M11k19k00L85J62n58J36L21l28N29n29k01P74o13K69j12O08
3717G25o09r6j14q83P86k07P05n52K41n90N71l5l86L55j70M94l2J29k7j20J45
3738C30Jm93L13k59P6L37M2n56L8M56l68OJ47l21L53j35K29l75k24L69M8L2m79
$$ y = [-228, -318, 169, -125, -289, 105, -795, 17, 376, -42, -153, 589, 143, -153, -337, 106, -112, 357, 235, -3, -369, -620, 362, -56, -251, 43, -110, -164, -217, 82, -96, -471, -303, 13, -161, 118, -354, 4, 278, 37, -231, -20, 156, -324, 77, -55, 270, 387, 253, 93, 713, -433, 164, 629, -83, 385, -22, -298, 422, -151, -23, 537, 258, -481, -851, -54, 81, -143, 420, -132, -214, -109, -285, -187, -62, 364, -52, -5, 478, 211, 676, -136, 230, 539, 99, -151, 87, 412, 109, 507, -85, -322, -591, -52, 135, -161, -251, -306, 153, -225, -603, -494, -339, 206, 269, 810, -110, 301, 82, -118, 267, 429, -129, 7, 328, 0, 529, 0, -201, 573, -40, 229, 117, 725, 116, 20, -94, -977, -191, -398, 307, -245, -4, -594, -23, -58, -444, -89, -259, 235, 203, 332, 305, 185, 330, 331, -162, 151, -108, -32, 305, 347, -209, -171, 285, -83, -77, 70, -251, 102, -33, 196, -179, -403, -34, 14, 46, -433]
3761d33O71n9l56L2K34j35l64Q76k15Ql27j8L35j29K37J49K0k33k71J07L0K87
3783D46m42l51P7M19r3j09k87M50j15l61J88J03O9L12J35n78P08r37J35K29L02
3804C00j02j33j43M04k23p3l57L02K04m01J85K7j00J82l8l77J4k24L75K72M2n03
3826c67J59J77k1k10K68J07r4J78M1m08K35L16j79m9j24J55K35j40j13j69j04
3847a07l40M24K89n86q0L68j65J17j54o2J75N5M9l57K92j91N98k77q4q8K09O20
3869G05p17N2J86k43R8l6n8n1J47R6j58L33l66j13J65k19L05k78j02J96j84k3
3891b65M72q9o8r0j54M55j04q8K12j66k62L45P7q5m37O13l20k13M7p4J37K4Np
3915c5J30m33N9J96R5r0O9j92J90r2J23K39p1k19Q5P7J8k13K97k02K04J60l01
$$ y = [-433, 238, 179, -177, -145, 89, -46, -410, 466, 251, 259, -68, -86, 249, 120, 357, 506, 526, 293, 22, 129, 159, 446, 4, -347, -270, 149, 56, -53, -340, 110, -5, -366, -178, -75, -6, 306, 441, -137, 571, -366, -231, -2, 300, 198, 65, -78, 326, 103, 30, -327, -25, 179, -222, -37, -10, -110, 72, 34, -343, -329, -553, -178, 94, 136, -367, -208, -31, -52, -262, 6, 113, 19, 197, 238, -170, 65, 381, 202, 153, 29, 184, 419, 279, 166, -3, -107, -447, -23, 266, -320, -400, -32, -197, -80, -234, -296, -121, -66, -17, -374, -82, -273, 325, 48, -36, -124, 85, 705, -12, 40, 226, -17, 81, 45, -13, -64, 83, 179, 21, 354, -12, -125, 40, -179, 126, -152, -254, -58, -242, -265, 207, 118, 50, -40, -194, 261, 157, 69, 281, 115, -147, 198, 275, 190, -247, 366, 46, -167, -120, -194, -57, -33, -28, -35, 95, -338, -279, -83, 12, -78, -9, -201, -11, -103, 20, 259, 188, -31, 54, 131, 149, -64, 233, 31, 235, 395, 94]
3938I4r4J2j45M46k40K19l59M9r9J22L0j99J67j91K07pp0k34K34R5Oj7l3p1J7
3963f1L07j50L2J15k25J29q6J92l54J40J3r6J0K04r5Qo8j95N2j86J12N3J20j38
3987a67K12j06j2O8M1J03m6L9nN7k1o6j71K42O1l58r4J81J42j76j50NL08j51J27
4012F3o6Mj14K1J84K3j34n1J75j79k00K67j02K56P5p3k06J33K37m45K88j43J67
4035A80k90O8m5J19J48l56J35l43J25L01l52K63qP6p5l44L27K0j10K03J42l9l21
4058a76J59j72K57R5j21p1J98j49rj87k7M27j50j4j12r2K24k68K32k22R7o3Q4
4081f0M4q0K99n05L40j4m1J52j40J16k20O9K35J27j85r9J14k00J14L7K3qq5PJ50
4106A90k81j32L05k89r4J42M12j72j55L4J19l21J61j24J61R9LL4j08K70q0q6O3
$$ y = [94, 0, 12, -133, 313, 73, 292, -67, -18, -117, 5, 35, -164, 3, -188, 19, 12, -58, -292, -58, 37, 43, 26, -7, -78, -61, 246, 96, 128, 243, 18, 147, 61, 253, -101, 39, 52, -44, -34, 170, 75, 83, 15, -180, -128, -314, -202, -149, -29, -167, 45, -61, -73, -5, 36, 139, 93, 132, 127, 184, 163, 97, -74, 168, 229, -129, -223, -42, 100, -76, -226, -221, 87, -64, 63, -3, 1, -113, -92, 92, 115, -19, -70, 105, -74, -274, -7, -109, 147, 222, 149, -57, 76, 313, -132, 156, 13, 180, -110, -42, -87, 32, 180, -176, -41, -384, -259, 42, -310, -47, -55, 21, -54, -398, -71, -51, -161, 42, 184, 145, -176, -17, -189, 68, 163, 42, -29, 169, 20, 11, -176, -203, 224, 74, 60, -52, -144, 80, -188, 44, -178, -81, -144, -60, -16, -96, 203, -302, 38, 24, -17, 135, -5, 111, -109, -40, 195, 322, 137, 38, 152, -48, 66, 103, 126, 118, 33, 40, 190, -91, -223, 82, -207, -301, -159, 253, 81, -74, -40, 79, -242, -81, -205, -44, 55, 58, 92, -16, 254, 174, 88, 151]
4129A51j37JJ80k58K79j67o9o8K00q9p9l5K38l83K53k63J82J12k32M24l55O3N2
4152@n6J52j65m9J16j25K98j18m1p8j69L31m8k17J70J42k23J02l29K72o2K04m
4175A03m2k17l3K53k59N0J2L4oj12P0P6J19J35k00L25m52K81p6J66j54j70n8K4
4199a31J73k61M83o45L41k86K29J34j53J12L1j32M1K3O9k79J88J46k46M18k51
4220DK06k92K93k22K01q3L3k72P9K66j39o8J7K2j57L09l71K27k16J59L4m9l64
4243c83M80k14m2O5Q7J27j22l1O1k12K57J50j97P3j1lm0O8p2k44K08p2m6nJ60
4268D2n7m0lj17J81k13L7J87l1j58j90K88k06K91O8j5r2K02o1N4J91l82r4J02
4292a6K6J57J35j03o6o4j40j01K1J92J33j87J20q8l63M40l56K79k98L53L2Q1k73
$$ y = [151, 14, 15, 195, -63, 216, 49, -20, -88, 112, 23, -56, -91, 147, -236, 17, -246, -64, 48, -184, 240, -115, -52, 0, -56, 96, -69, -118, -2, -127, 171, 53, 12, -66, -235, 96, 48, -169, 1, 143, -80, 22, -307, -35, -97, 107, 103, 61, -156, -189, 64, -195, -145, -133, -99, -105, -217, -147, -71, 48, 183, -17, 308, -144, 137, 61, 227, 73, -97, -155, -131, 42, -219, 264, -381, -40, -326, -97, 37, -116, -4, 27, -105, -64, -41, 28, -251, -63, 83, -163, 255, 4, 210, -82, 211, -11, 190, 107, 140, -132, -53, 213, 74, 6, 23, 45, -112, 197, -174, 53, -163, -4, 30, -19, -383, 97, -117, -159, -94, -7, 120, -2, -33, 28, -184, 73, 223, 26, 99, 88, 85, 45, 113, 41, -203, 5, -67, -113, -118, 42, -15, -55, -58, -175, 6, -207, -170, 17, -14, -172, -362, -74, -280, 11, 79, 64, -28, 174, 113, 167, 358, -24, -118, -16, 10, 167, 302, 199, 133, 69, -71, -172, -151, 41, 174, -13, 107, 19, -344, 96, -260, 19, -279, 74, 106, 187, -86]
4315h6L18p3j71P9j29K87k12J28K8j32J95p1j3l1J82l32J1J57r0j48J43k61K25
4338Dl78K05K45k66K64l3p0o8J27n0L8l0K73j38P2j49r6L14m09K26JQ7j58M3K51
4363C05l01J39k85J48l94L91k78J75p1J52N3l5Lj73J59J52k69J2j3L78l14M4J18
4386I6R7M5j92K00l04L51l48l45M59nn6j68r4J84k3J02l4J0N1j22j41J83o4L23
4410B05k73n0K17K05m38J17M6M7J2j45J54j82K44m39J41J61k4l0L35l36P0j18
4432h1J9J49j13R3m35M08n9jJ24n8k16K42J3j37k9N0Q2j11L75j69L8n6r4n5K2
4457AQ8k39K56j75j33K07M2j55M04l47p5M1J30J70k08J86r1j77P9N1j06N1qOO
4482DN3J84k57J73j94R0J24j86L5J12k19O2J10k59J46n5N7o2J09k05K6M7m6J60
$$ y = [-86, 232, 159, -12, 67, -62, 225, 13, 141, 169, 37, 232, 161, 148, 117, 299, -33, -22, 135, 45, -103, 40, -221, 4, -374, -169, 76, -190, 74, 41, -29, -97, 30, -20, 18, -12, 261, 123, 195, 46, -50, 264, -145, 81, 82, 169, 11, 54, 305, 4, 143, -142, 6, -388, 3, -275, -100, -171, -19, 34, -1, 2, -171, -12, 140, -129, -117, -130, 248, -66, -22, 96, 193, 238, 46, 246, -58, 293, -55, -400, 59, 54, -2, -170, -264, -80, -103, -1, -35, -25, 26, -96, -237, -54, -118, 205, -68, -118, 99, 304, -134, -17, 29, 76, 88, -57, 97, -85, 159, -280, -139, 22, -2, -32, 303, -33, 37, -81, -62, 87, -26, 67, -368, 40, -19, -20, 104, 46, -170, 72, 85, -52, -81, -31, 51, -60, 315, 146, 184, 128, 34, -21, 1, 89, -150, 106, -69, -202, 5, 47, -108, 296, -51, -126, -85, 45, 215, 7, 193, 102, -75, 4, 55, -51, 0, -8, -2, 4, 57, 241, -16, 157, -37, 53, 177, -9, 26, 138, -81, -19, 91, -168, -22, -77, -20, -82, 27, -178, -152, -105, -151, 9]
4506Ir8L2p1R0qK36o0J89l10R1J61j29l6m46L43j79K04l9R1j91K19L9k21K68r
4531A75k11j76l7nK09J49k62O8L11p0N6k63j7P0j9M77m13j92N5P9k14L95k26p2
4555a33J49j25N1l6j23J78J72k36J44q5k03K85j21O5j80j39L48NM2k93r2N79j36
4578A16K0j97n5J41o2K22l25L37j38J27l81K4K56Q3j94L3k23J40j16p4M18k82
4600a30J8J23Q0K8K7k58K13j41M15l55J14l80M13j24R1M4j75Q8L5r3l9p1J33N9
4624A15j24K6k46J58j7J58j82pJ40K21m12J13N6k22K08J04P6l47J75j58j43M02
4646I4l57J65j64K12m1K13p1k24K25J62k13j67K02O9k62J61m5L8j41J65k57M83
4668B47o68J94K30K50r1k49J14L0Q4l57K65j22J29m1jr4pJ19p0K5M2J36p4j80
$$ y = [9, -89, -57, -128, -38, -46, 190, 130, 319, 9, 100, 261, 132, 96, -350, -7, -186, 18, -21, 70, -121, 98, 137, -84, 184, 175, -36, -212, -249, -254, -45, 104, -158, -90, 221, 151, 207, -56, -73, -3, -22, 455, 42, -150, -95, -16, -230, 165, -61, -133, 16, -109, -58, -94, -217, -39, 133, -103, 41, -44, -247, 38, -83, -18, -198, -337, 11, 16, 58, -235, -327, 252, 116, 136, -61, -116, 25, -37, 185, -140, 197, 59, 186, -195, -171, 85, 168, -26, 7, -216, -76, -192, -266, 152, -130, -112, 11, 91, 119, 146, -112, 101, -40, 375, 20, 134, -246, 167, 43, 134, 178, 3, 91, 126, 33, -6, -77, 56, 115, -9, 17, -229, -71, -88, 70, -112, -119, 21, 242, -170, -57, -1, -223, -15, 89, 165, -182, -7, -165, -308, 94, -263, -98, -262, -50, -91, 122, 51, -173, 52, 214, 1, -166, 36, 105, -157, 4, -41, -3, -144, 21, -236, 247, -421, -227, 3, 253, 162, -87, 27, 57, 141, -216, 49, -73, 56, 15, 14, -80, -87, 32, -38, -13, 29, 165, 91, -89]
4692h9k0J50M6j28R5q7K36m03J47lQ7l50O30j15r9J01l9j51O1k9k9j46K95K15
4716C75j58j91J78k57J59j72o4M7oQ9J48p0j65j18L40K5j59K19l52J50r2K74q2
4739A18j50j3L57k00l6J17r4K1j0j00O7Q1mj72l4J34k09J79j54L9K23l47J22O1
4763dm7L86l41r5J03J94k60J21o5J06P5j52J68k60L0J02p4j48K83j69J54l3M3
4786A17j56q4J19Mj75K45j38n8j08O2NJ38j46K91j53J69l63K61J46j81o5P6j7
4809a1R2l0j50L04l42n2Q7J15k68J50L01p3M6k77Q9j97O3K72j01k37L01j56J87
4832A13J28k50O8K8J32k89K46j8kk85K18N0j9k30K59l55J14Q3j80J47k42J47M5
4855i2J38p8l69L06k8k92J96P7J6L49n52M48k29J88p8j99L42k61P1K28r9j13J59
$$ y = [-89, -109, 41, 87, -41, 54, -33, 203, -200, -53, -56, 31, -319, 311, 196, 97, 198, 159, 8, 69, 40, 11, -135, 160, 375, 217, 26, 204, -53, 106, -66, -130, -83, -89, 0, 148, 78, -87, -205, 135, 160, 1, 220, -132, 18, -74, 200, 118, -32, -45, 312, 112, 76, 193, 99, 120, 110, 10, 77, 158, 154, -18, -52, 82, -127, 52, -102, -63, 160, -187, -65, -4, -51, 335, -6, -101, 2, 196, -64, 57, -8, 98, 173, 21, 189, -71, -41, 61, -13, -161, 122, -47, 107, 74, 117, -39, -123, -4, 0, -175, 70, -68, -126, -234, -172, -167, -29, -175, 116, -37, 132, -231, 30, 176, -5, -70, 6, -11, 81, 51, -99, 205, -137, -189, -102, 13, -255, -105, 196, 123, 169, -108, -19, -216, -153, 119, 18, -219, 82, -74, 113, 241, -9, 59, 87, 219, -70, 176, 158, 156, -129, 89, 139, 120, -110, 149, -206, -92, -9, -189, -42, -284, -137, -92, 46, -32, -401, -95, -123, -415, -219, -142, -126, 223, -329, 119, -110, 78, 0, -199, 143, -118, -47, 181, 82, -31, 128]
4878A28J5L4Q4k36K94k13N4j52n3j66K45j50J79k67j1K20p0O1NP2k17L13P6j92
4902E3j18J93q6j01J61k74J84K31J7k02J37j11m22J41j4L01r8j86L36p0K00j76
4924I6j66J59j70J55j24p7P3O4J94k53j45M34j93K75j91q6r0K46k82K6J55j59
4946e9J63l09K49M9p0J04j22Q0j28n7P9J52l49K85r4K19k49K95l35P8J99j50j42
4969a12J0K67j66jL4J77qk08R1M6k22L0l1m4J60M7j78J7l2J25l9J40q6q3J42k74
4995a98L18j35ok80L48q1K26k04k28K68j25PK9M15l12Q7LK2l79K31m09L33NJ21
5019E6JJ08j48p0j4R6n2K21k89J35K8j11j00Q0k2o9J20%j03M5o3K34k23L13l46
5044a73Q4J27k0j28J08m5N9Q3k25J24k26J35J51R6l13K01O3J64l46J34j2j84Q6
$$ y = [128, 143, 177, 261, 25, 319, 106, 160, 8, -45, -211, 34, -116, 63, -204, -215, 5, -65, -4, 1, 73, -144, 169, 245, 53, -65, 128, 42, -59, 102, -172, 12, 243, 260, 58, 195, 84, -338, -197, -211, 90, -8, -194, 142, 72, 272, 96, -70, 89, -81, 74, -50, -127, -54, 10, 204, -49, -194, 240, 47, 322, 131, 45, -45, 201, -81, -55, 100, -59, 104, -205, 44, 93, 23, 127, 5, 85, -43, -100, -21, 131, -218, 67, -27, 192, -57, 238, -97, -19, 180, 30, -112, -102, 165, -1, -2, 32, 209, 201, -7, 84, 130, -92, -62, -93, -137, 23, 70, -108, -91, -123, 2, -37, 103, 17, -66, 76, -198, 120, -15, -21, -301, 47, -34, 192, -12, -240, 28, -97, -90, -61, 354, 42, 129, 132, 154, -225, 6, -403, -70, -65, 56, 57, 165, 17, -53, -67, 29, -23, 198, -91, 44, 72, -39, -139, -59, -81, -150, -30, -30, -133, -88, -151, 83, -140, 173, -173, -89, 38, 18, -110, -2, -47, 12, 95, -130, -6, -232, -97, 54, 150, -163, 38, 101, 265, -81, 53, 41, -143, -57]
5067e7K31o2m2J97m44L51O3j32q1m2m4j29J07J9j18M8K97j64j70J44m7L37m51
5090a89M00j41j75K46m4j8r7J96n11J88J41K21l07K38l39L06k83K27P6k03J0m
5112f2jj02Q5QM1J71j50n1J5qL14k48J01r4k08K87K08k47j25K37j40R1j12M3K34
5137B87j86O2j11J35j94j55J93Q4k73p5J79P6Rp5kk1J14m8N8n5k4r0J37m9M1J42
5163A59k66L7J83j9k11K58k21K07r8MK42j43N3k49m4J04pk42M0J47J82J51l02
5186c5oL86k40j23J22q5J67J61n27L86j33O7r8m7K59J02m71J71o5jJ36j46K9J20
5210A29j02j12j52P1L50j93j31L59n22L42L6j09J20n2K96j08R8j81L3k46J69R0
5232A85K4k6J09l86M6m0KJ63l37N21j43j05l59K24N5r7J20J59Pl2q4q8J6J95j90
$$ y = [-57, 174, 112, 70, 267, -177, 174, 237, 105, 24, -18, -62, -191, -84, -65, -183, -135, 162, -2, -172, -28, -75, 262, -189, 211, 70, -105, 141, 97, 79, -18, 178, -333, -145, -4, 217, -90, 148, -191, 115, -168, 59, 135, -68, -58, -62, -63, -165, -80, -72, -31, 140, -10, -61, -46, -54, 260, 12, 113, 19, -189, 98, 306, 59, -66, 171, 31, 122, 10, 53, 287, 101, 163, 52, 187, -7, -162, 31, 115, -158, -233, -54, 22, 31, -44, -46, -67, 47, -1, 57, 2, -22, -112, 25, -24, 17, 159, -107, -70, 113, 94, -117, 141, -80, 127, 29, 33, 275, 132, 185, -64, -108, -4, -11, -253, -213, -66, 116, 267, -35, -41, 345, 105, -18, 104, 19, 186, 347, -180, 206, 73, 140, 42, -5, 254, 356, -115, 56, -9, -10, 126, -20, 9, 129, 27, -85, -237, -166, 184, -9, -140, 219, -303, 39, 75, -34, 86, 34, 330, 222, 320, 139, 172, -74, 95, 185, 209, 183, 292, -94, -48, -88, -86, 77, -260, 261, 118, 13, -346, -122, -67, -164, -44, 115, 122, 90, 6, -82, -66, 129, -61]
5257f1K35m11K06K93J02l72J35j47J58l17R3n8J12K79k81k4N6N9j20p2K12l1l4
5280A2k2j57k0J65K53l35K41l2P5J28k74K6J13N2k46J07j16L7k6j70K49k95Q4
5303a51K24j14O7O9l39M47r3L1k60Q8J51j47Q0k28pN3N2L6J98k85L91k78N0J63
5327A98q7k9k38M30p0o4R8l75K56m1Q3k43L06j04p1k35J67j13l5K79k62K74n16
5350c92L44p9J23k08K75q9j21K16QJ3j57J30Q1n3j23p6N1J40j33J36j56J8K18
5373A66j31j23r9K31l65M42j37j32K18j74O1J87r2l5J83k9q5M0K04l61M4l1pN8
5397C3J9Q5l59J00L26l09L65m25q4J61J1m8K81j03k62K97l8r0J03QJ13j48j69
5420a33J10K20l10LO7J41o0n4L2J59Nl50Q1K15j36k99K73n8j13N3K04J84k17n1
$$ y = [-61, 174, -237, -31, 262, 364, -8, 127, -20, 138, -179, -86, -144, -32, 247, -34, -58, -2, 57, -63, -135, 77, 46, 12, -10, -167, -187, -22, 231, -104, 137, 105, 180, 308, 34, 60, 173, 225, -21, 86, -30, 7, -19, -189, 60, -235, -151, 73, -41, 26, 95, -244, 203, 110, 141, -119, -31, 120, -27, 53, -175, -182, -129, -77, -41, 157, -128, 263, -15, 35, 198, 111, 82, -156, 274, 204, 140, 238, -137, 119, 78, 161, -82, 224, 120, 49, -186, -19, -132, -167, 112, -150, 124, -392, -48, -127, -4, -212, 63, -26, -147, 69, 77, 90, -67, 63, 144, 91, -32, -108, -57, 83, -50, 86, -70, -52, 166, 35, -88, -187, 44, -321, 121, -16, -148, 70, -104, -43, 144, 52, 17, 200, 171, 86, 126, 330, -31, 13, -18, -25, 33, 52, 137, -222, -122, 204, -105, 260, -165, -249, -88, -77, -125, 156, 53, -209, 88, 50, -40, 63, 71, 184, 36, -133, -23, 197, -113, -110, -43, 98, 38, -16, 16, 175, 180, -170, -89, 126, -10, -309, -36, -94, -207, -154, 50, 234, 17, -34]
5444c4j5n7o8J97Mj26J89j27K24l96J97p1j04K02r1p3j71M28n0Km1J78j40J01
5468A58k97q6J33K74k48N9J62k31K30m20K80JQ2O8L5k53r5K84J30j39j28M1K32
5491B72r7k48M34m76J43K0j40P9J90j65l2j6k44J85K53j68j91N8O3N7J6j03L91
5514B81l15O0J48j90K91q8k58J04k31M4P6q0J85N3O8k5J06j15K1J79k15N4j67
5537a4j66J1J6J1P8J52j85K19k08J10M1L0j37n0j51N32m9m77M67j73J27k67q0
5560a63J96Kn9J16k00J59j36K9M2j99K09M9k2j12K2P5Lk06K47M3j75J07k42K79
5584F4n0j69R0mJ56MkP0j9N6j25j16oq4J09K9j7j94Q5K13Mk47J15r3J14qj01L00
5612A74o7r1K0Q3J82m2k88J18k77K17k76N79l82J25k90J93J91J17n07K88l70L11
$$ y = [-34, -49, -106, -174, 23, 27, -99, 90, -37, 187, -209, -12, -83, -187, 15, -76, -149, -320, 108, 58, 60, 19, 197, 57, 158, -139, -225, -92, 182, -66, -7, 155, -76, 154, -266, 14, 15, 97, 165, 200, -53, -148, 136, 266, 127, -1, 40, 272, 175, -73, 361, -115, 28, 48, -92, -13, 177, 12, -20, -36, -280, -95, 158, -10, -201, -143, -80, -23, -7, -110, 281, -34, 26, 174, -16, 275, 187, -71, 33, -198, -154, -78, -158, 27, 80, 148, 123, 229, 114, 135, 314, 99, 153, -14, -180, -169, -153, -142, -64, 88, -97, 122, -86, 24, 65, 95, -42, -92, -243, 289, 240, -237, 230, 57, 184, -83, -163, 33, 35, -24, 92, -108, 51, -85, -56, -14, -213, -4, 45, 23, -89, -67, 8, 11, -195, 52, 95, -80, 27, -215, 64, 14, -155, -65, -69, 87, 91, 89, 159, 140, 196, 71, -45, -51, -135, -26, 3, -14, -208, -123, 90, 94, -153, -38, -131, -17, -25, -126, 174, 107, 16, 36, 119, 301, 259, -29, 89, -188, 29, -247, 332, -50, 75, -215, -22, 169, 286, -221, 67, -303, 8]
5634Hk24l5J21J15J54j61l7m8J71K1Q9k47J54J94l06J99j31l2J09k8q1j49L43
5657A99j57J01l33K13k04M01n0m0m34L42l1O9j94J40K5J06p0j02j6l8J97N3J0
5680A87j82J7R6j88O8p2J08Q5j00j57k01L18O2R6j79R4j32l4J39j22L89m04Q5
5703b7M6l8J15l07J03RK55j06k36L13K4p3q1J70j02J49m36K24J09l11J06M3N6
5726Ek24L34L9j88L7j02m2Q2J98q1R0O1m38L01J75j69m7j34L34L4m4l19J99R6
5750A97k47J92k47J75j76K45p6p1K3j8j03M6P3J58j31j2J39m39K08k12j4J19O8
5773a03j09J95j20L34j84j96J32K44j79k3K85k06j91q6M04k48o2j60J24K07j50
5794i2K25l24J83l0jk86L25k29J88Q7J4j77J23j65M2J41Qmk42J96p2n4J30K33
$$ y = [8, -216, -251, -130, -15, 139, -22, -59, -107, 64, 85, 174, -73, 81, 275, -31, 168, 37, 5, 114, 86, 5, -144, 199, 42, 143, -190, 23, -181, 220, 170, 130, -304, 38, 7, 76, -118, 22, 47, 153, 83, -19, -35, -73, 124, 177, 187, 5, 22, 118, -70, -2, -74, 34, 119, 19, -138, -339, -21, 41, 137, -42, 52, -80, -114, 25, -97, 292, -112, -27, 19, -19, 96, -211, -108, -99, 156, 50, -186, 127, 151, 78, -3, 167, 65, 214, -222, 2, 111, -200, -94, -51, 5, -219, 115, 154, -34, 3, -99, -141, -59, 139, 58, 148, 209, -229, 72, 247, 78, 31, -103, 231, 265, 221, -98, 101, 197, -50, 142, -105, 70, -106, 139, 63, -8, 15, -3, -106, -60, 13, 171, 40, 28, 167, -272, -64, -276, -290, -171, -103, -212, -17, -137, 197, 13, -183, -51, 193, 14, -9, 276, 70, -121, -207, 197, -51, -113, -273, -149, 58, -92, 133, -191, -8, -38, -39, -325, 0, -229, -41, 46, 60, -117, 6, -159, -117, 24, 32, 28, -214, -18, -90, -144, -14, 219]
5818B19k56J32j15j78K08k74J30Mj41K35n9K93o7j96J64l39J64J72j62q5K94k27
5840h4M16n17J74N0M4Oo8Pn8j50J57k88L40j7j57J93p5J37j57j52K42j15Q9p9
5864f2K23P4l13O0j88M84l81K13p5J42J31m24J65k01L1J49J24nR4q8j50n0Q2P7
5888A12RK40l20mkQ8l90M37j57oj79j14O7L65K4k08J82j38J66k46k6K79j10j11
5912d2J0j7L2K25j35j37J51j41k0j71O3p3K66j48J13o1Q8R9K55k97j54J65k82
5935b11K17j1r3J84k68K55j25P3OK29k15j47J36L06l69K71l3l61K29oL5j78J34
5958E8j66j09K08j90K29k17J63K8j1p1j50K46O6j72J40L9j35l3R0j30J08J69r1
$$ y = [219, -37, 95, -20, -198, 10, -264, -134, -130, -271, -36, -95, 198, 131, -65, 99, -240, -76, 96, -66, -151, 143, -84, 332, -185, -11, 39, 83, 89, 21, 28, -30, -180, -23, -311, 29, 12, -145, 48, -27, 110, -47, -199, 43, -72, 17, -62, 161, 235, -78, -18, -206, 278, -103, 110, 35, 177, 308, -116, 49, -152, -121, 28, 152, 147, 241, 153, 3, -47, 35, 112, 121, 361, 41, 37, 35, 123, -267, 170, 13, 7, -172, -286, -219, 146, 170, -38, 144, 6, 172, -74, -100, 179, 69, -42, -32, -49, -17, 208, 73, -64, 87, -54, -74, -245, -182, -255, 11, -137, -24, -85, 3, 102, 357, 60, -94, 71, -211, 6, -5, -98, 86, -182, 73, -52, 21, 27, 256, 41, -106, 30, 336, -33, 238, 205, -156, 73, 67, 102, -76, 58, -108, -217, -9, -199, 30, -187, -24, 4, -7, -78, -228, 18, 84, -88, 52, 91, -44, -77, 13, -117, -9, 160, 69]
$$ [...]
8191B11
##END NTUPLES=NMR FID
##END=
