##TITLE=1H_LR-758-R6-3CR17
 CDCl3
 8 sc, 
 25.10.2023
##JCAMPDX= 6.0         $$ Bruker NMR JCAMP-DX V2.0
##DATA TYPE= NMR FID
##DATA CLASS= NTUPLES
##ORIGIN= UXNMR, Bruker Analytische Messtechnik GmbH
##OWNER= root
$$ XWIN-NMR		Version 3.5
$$ Wed Oct 25 14:20:47 2023 Russian Standard Time (UT+4h)  she@DPX200
##.OBSERVE FREQUENCY= 200.13135
##.OBSERVE NUCLEUS= ^1H
##.DELAY= (6, 6)
##.ACQUISITION MODE= SIMULTANEOUS
##.ACQUISITION SCHEME= undefined
##.AVERAGES= 8
##.DIGITISER RES= 18
##SPECTROMETER/DATA SYSTEM= spect
##.PULSE SEQUENCE= zg30
##.SOLVENT NAME= D2O
##.SHIFT REFERENCE= (INTERNAL, D2O, 0, 15.7039)
##AUDIT TRAIL= $$ (NUMBER, WHEN, WHO, WHERE, WHAT)
$$ ##TITLE= Audit trail, XWIN-NMR		Version 3.5
$$ ##JCAMPDX= 5.01
$$ ##ORIGIN= Bruker BioSpin GmbH
$$ ##OWNER= she
$$ F:/spectra/data/she/nmr/H-F/1/audita.txt
$$ ##AUDIT TRAIL=  $$ (NUMBER, WHEN, WHO, WHERE, WHAT)
(   1,<2023-10-25 14:19:43.68 +0400>,<she>,<DPX200>,
      <created by zg, POWCHK disabled, PULCHK disabled
       configuration hash MD5:
       00 E9 B6 7A A2 85 ED C7 34 08 36 98 17 FE 4E 26
       data hash MD5: 16K
       7F CB 90 36 FA F4 96 74 E0 C2 7D B7 63 51 CE 9B>)
$$ ##END=
$$ 
$$ hash MD5
$$ 37 1F 56 43 04 18 F7 1A D5 C7 52 72 C0 E2 67 23
##$RELAX= 
##$RELAX= 
##$RELAX= 
##$RELAX= 
##$RELAX= 
##$RELAX= 
$$ Bruker specific parameters
$$ --------------------------
##$DU= <F:/spectra>
##$EXPNO= 1
##$NAME= <H-F>
##$PROCNO= 1
##$TYPE= <nmr>
##$USER= <she>
##$AMP= (0..31)
100 100 100 100 100 100 100 100 100 100 100 100 100 100 100 100 100 100 
100 100 100 100 100 100 100 100 100 100 100 100 100 100 
##$AQSEQ= 0
##$AQ_mod= 1
##$AUNM= <au_zg>
##$AUTOPOS= <>
##$BF1= 200.13
##$BF2= 200.13
##$BF3= 200.13
##$BF4= 200.13
##$BF5= 200.13
##$BF6= 200.13
##$BF7= 200.13
##$BF8= 200.13
##$BYTORDA= 1
##$CFDGTYP= 0
##$CFRGTYP= 5
##$CHEMSTR= <none>
##$CNST= (0..31)
1 1 145 1 1 1 1 1 1 1 1 1 1 1 1 1 1 1 1 1 1 1 1 1 1 1 1 1 1 1 1 1 
##$CPDPRG= <>
##$CPDPRG1= <>
##$CPDPRG2= <>
##$CPDPRG3= <>
##$CPDPRG4= <mlev>
##$CPDPRG5= <mlev>
##$CPDPRG6= <mlev>
##$CPDPRG7= <mlev>
##$CPDPRG8= <mlev>
##$CPDPRGB= <>
##$CPDPRGT= <>
##$D= (0..31)
0 1.2 0 0 0 0 0 0 0 0.06 0 0.03 0 0 0 0 0.0002 0 0 0 0 0 0 0 0 0 0 0 0 
0 0 0 
##$DATE= 1698229183
##$DBL= (0..7)
120 120 120 120 120 120 120 120 
##$DBP= (0..7)
150 150 150 150 150 150 150 150 
##$DBP07= 0
##$DBPNAM0= <>
##$DBPNAM1= <>
##$DBPNAM2= <>
##$DBPNAM3= <>
##$DBPNAM4= <>
##$DBPNAM5= <>
##$DBPNAM6= <>
##$DBPNAM7= <>
##$DBPOAL= (0..7)
0.5 0.5 0.5 0.5 0.5 0.5 0.5 0.5 
##$DBPOFFS= (0..7)
0 0 0 0 0 0 0 0 
##$DE= 6
##$DECBNUC= <off>
##$DECIM= 32
##$DECNUC= <off>
##$DECSTAT= 4
##$DIGMOD= 1
##$DIGTYP= 9
##$DL= (0..7)
0 120 120 120 120 120 120 120 
##$DP= (0..7)
150 150 150 150 150 150 150 150 
##$DP07= 0
##$DPNAME0= <>
##$DPNAME1= <>
##$DPNAME2= <>
##$DPNAME3= <>
##$DPNAME4= <>
##$DPNAME5= <>
##$DPNAME6= <>
##$DPNAME7= <>
##$DPOAL= (0..7)
0.5 0.5 0.5 0.5 0.5 0.5 0.5 0.5 
##$DPOFFS= (0..7)
0 0 0 0 0 0 0 0 
##$DQDMODE= 0
##$DR= 18
##$DS= 0
##$DSLIST= <SSSSSSSSSSSSSSS>
$$ [...]
##$SUBNAM2= <"">
##$SUBNAM3= <"">
##$SUBNAM4= <"">
##$SUBNAM5= <"">
##$SUBNAM6= <"">
##$SUBNAM7= <"">
##$SUBNAM8= <"">
##$SUBNAM9= <"">
##$SW= 18.05172834244
##$SWIBOX= (0..15)
0 0 2 0 0 0 0 0 0 0 0 0 0 0 0 0 
##$SW_h= 3612.71676300578
##$TD= 16384
##$TD0= 1
##$TE= 0
##$TE2= 300
##$TE3= 300
##$TEG= 300
##$TL= (0..7)
0 120 120 120 120 120 120 120 
##$TP= (0..7)
150 150 150 150 150 150 150 150 
##$TP07= 0
##$TPNAME0= <>
##$TPNAME1= <>
##$TPNAME2= <>
##$TPNAME3= <>
##$TPNAME4= <>
##$TPNAME5= <>
##$TPNAME6= <>
##$TPNAME7= <>
##$TPOAL= (0..7)
0.5 0.5 0.5 0.5 0.5 0.5 0.5 0.5 
##$TPOFFS= (0..7)
0 0 0 0 0 0 0 0 
##$TUNHIN= 0
##$TUNHOUT= 0
##$TUNXOUT= 0
##$USERA1= <user>
##$USERA2= <user>
##$USERA3= <user>
##$USERA4= <user>
##$USERA5= <user>
##$V9= 5
##$VALIST= <valist>
##$VCLIST= <CCCCCCCCCCCCCCC>
##$VD= 0
##$VDLIST= <DDDDDDDDDDDDDDD>
##$VPLIST= <PPPPPPPPPPPPPPP>
##$VTLIST= <TTTTTTTTTTTTTTT>
##$WBST= 1024
##$WBSW= 4
##$XGAIN= (0..3)
0 0 0 0 
##$XL= 0
##$YL= 0
##$YMAX_a= 174470
##$YMIN_a= -245281
##$ZGOPTNS= <>
##$ZL1= 120
##$ZL2= 120
##$ZL3= 120
##$ZL4= 120
##$ABSF1= 10
##$ABSF2= 0
##$ABSG= 5
##$ABSL= 3
##$ALPHA= 0
##$AQORDER= 0
##$ASSFAC= 0
##$ASSFACI= 0
##$ASSFACX= 0
##$ASSWID= 0
##$AUNMP= <proc_1d>
##$AZFE= 0.1
##$AZFW= 0.1
##$BCFW= 1
##$BC_mod= 2
##$BYTORDP= 1
##$COROFFS= 0
##$CY= 11.3945322036743
##$DATMOD= 1
##$DC= 2
##$DFILT= <>
##$DTYPP= 0
##$F1P= 15.7292609196834
##$F2P= 12.9074282941183
##$FCOR= 0.5
##$FTSIZE= 0
##$FT_mod= 4
##$GAMMA= 1
##$GB= 0.15
##$INTBC= 1
##$INTSCL= 1
##$ISEN= 128
##$LB= 0.24
##$LEV0= 0
##$LPBIN= 0
##$MAXI= 10000
##$MC2= 0
##$MEAN= 0
##$ME_mod= 0
##$MI= 1.114404
##$NCOEF= 0
##$NC_proc= 0
##$NLEV= 6
##$NOISF1= 3.799351
##$NOISF2= 2.8
##$NSP= 1
##$NTH_PI= 0
##$NZP= 0
##$OFFSET= 15.70392
##$PC= 1
##$PHC0= -23510.54
##$PHC1= 13.6527
##$PH_mod= 1
##$PKNL= yes
##$PPARMOD= 0
##$PSCAL= 0
##$PSIGN= 0
##$REVERSE= no
##$SF= 200.130013532006
##$SI= 16384
##$SIGF1= 3
##$SIGF2= 2
##$SINO= 400
##$SIOLD= 16384
##$SREGLST= <1H.CDCl3>
##$SSB= 0
##$STSI= 0
##$STSR= 0
##$SW_p= 3612.71676300578
##$SYMM= 0
##$S_DEV= 0
##$TDeff= 0
##$TDoff= 0
##$TI= <>
##$TILT= no
##$TM1= 0
##$TM2= 0
##$TOPLEV= 0
##$USERP1= <user>
##$USERP2= <user>
##$USERP3= <user>
##$USERP4= <user>
##$USERP5= <user>
##$WDW= 1
##$XDIM= 8192
##$YMAX_p= 0
##$YMIN_p= 0
$$ End of Bruker specific parameters
$$ ---------------------------------
##NTUPLES= NMR FID
##VAR_NAME=  TIME,          FID/REAL,        FID/IMAG
##SYMBOL=    X,             R,               I
##VAR_TYPE=  INDEPENDENT,   DEPENDENT,       DEPENDENT
##VAR_FORM=  AFFN,          ASDF,            ASDF
##VAR_DIM=   8192,          8192,            8192
##UNITS=     SECONDS,       ARBITRARY UNITS, ARBITRARY UNITS
##FACTOR=    0.0002768,     1,               1
##FIRST=     0,             0,               0
##LAST=      2.2672688,     0,               0
##MIN=       0,             -245281,         0
##MAX=       2.2672688,     174470,          0
$$ Real data points
##PAGE= N=1
##DATA TABLE= (X++(R..R)), XYDATA
$$ [...]
1791C20M13n20P43l19j014O30P58p10n45O14j05l03N70j34j215P43Q35l68p58
1810c65L84k16K46K58J24r86L81J026m45l00k77rJ92N28L8q76QO57o7o66J60R0
1832a15l42O43l6q57m04J028K27q24L94J59o58R53P26j320j70J278j45k26O15
1851I26o68o04J291J67r33j40O29k85n4O17q42l23O76L09j007r1K05k84O5M41
1871I5q54l02O46L08l72k27J08oK21M97m11p15O40N75j71l36M9j62J98N62J7j030
1893f70M02P15l27l68L55l91J69O12k0j025K64M62m3j97M44l65k87Q45m3q95J69
1914a94P69l83P5J46l41l88Q73J67j269Q2L89j99o5L00o28p39J209M6p29j16L31
1935f64q8J53M75o68k15Q60K52n30J13K50l04N86O90j082K44L89J59Q7k27k46
$$ y = [320, 733, 213, 956, 637, -377, 253, 1011, 301, -244, 370, 265, -38, 532, 398, -817, -74, 761, 393, -365, 19, -197, 49, 307, 431, -555, -174, 852, 407, 107, -170, -179, 13, 541, 579, -297, -289, 368, 301, -365, -205, -115, -457, 186, 150, -707, -1111, -83, 144, -680, -286, -127, -785, 168, 894, -426, -596, 682, 537, 311, 926, 258, -346, 945, 1112, 179, 39, 668, 383, 329, 946, 104, -219, 457, 766, -241, -332, -127, -411, -346, 95, -759, -1061, -415, -107, -479, -706, -598, -604, -383, 114, -297, -1012, -372, 203, 32, -304, -255, -417, -219, 343, 360, -670, -268, 447, 120, -248, 107, -284, -115, 497, 477, -548, -284, 178, 135, -62, 382, 17, -270, 575, 532, -363, -194, 575, 192, 267, 413, 72, -316, 557, 724, -545, -463, -74, -273, -338, -38, -666, -1405, -196, -150, -879, -995, -664, -752, -599, -124, -792, -1007, -147, 105, -425, -312, -62, -366, 220, 910, -172, 72, 461, 620, 707, 480, 234]
1955B34J28R3L57l73m77J56L97m22j22r2k74J42O05k59p57J54K98N7m58N78m89
1976e24j51R68j96p46K17O42o43L18K20q96p3J421o26o59L87K18q8K14J61p68
1996f04O0P74L1q30N60J18l24P07q0q34K77Q44j4n01J59K31k80M92p6o31O7N14
2018F60j21m7l38n1r8K26O2m30k82PL77j03l78J40l56K88M83m54k41K55O23m91
2040b69n8K93m18K33O80l86m66O42L19l56L22o1l37K56O43m00r02N87N7k36K15
2061C58J10q06L31P03n65k54j79M20j27M30j84o86N37M48m94j76L54l99N5M63
2081C39r7o87K69L80j02k45L1l57K24K68m1n36n0N93j52K5j05q3P8M30J6m79R9
2104a82L54K20J4p3P2m27O81J3j86o26O21N8j01j80J6o07N52P03q93o17O84k27
$$ y = [234, 362, 455, 812, 439, -38, 118, 515, 93, -29, -121, -395, -253, 352, 93, -664, -510, -212, -155, -613, -35, -524, -675, 293, 97, -649, -432, 210, -433, -115, 105, -791, -864, 557, -69, -728, -341, -123, -211, 3, 164, -604, -544, 230, 261, -569, -9, 109, -215, 492, 412, -422, -145, 699, 685, 184, 343, 574, 294, 786, 710, 79, 146, 660, 539, 492, 154, 103, 5, 231, 293, -137, -419, -412, -35, -138, -516, -376, -732, -444, 39, -415, -656, -401, 222, -269, -327, -34, -452, -219, 461, 75, -391, 251, 570, 214, 536, 475, 138, 394, 1037, 637, -265, 322, 379, 143, 358, 468, -338, -7, 696, 131, -123, -302, 118, -9, 421, 237, -449, 88, 536, 42, -134, 220, -179, -124, 339, 242, -445, -176, 204, 102, -143, -112, -469, -245, 23, -18, -554, -604, -11, -163, -138, -243, -326, -248, 182, 198, -281, -182, 172, 392, 406, 333, 405, -22, 659, 672, 486, -140, 481, 539, 438, 258, 274, -333, 219, 922, 29, -588, 96, -131]
2126a31k6L69l78r32Q96L90m96k78K11j67K35O03m11n64N99M86j54m45M61n24
2146b56L54N61o21l73K55M28k78j34J50n84N46K72Pn35j65M21j06j12Q2k2j14
2167b24L08J86m57R4K42J6K6rj21k06O52j7q68J04J97J82J09r9m81j74L88J91
2189C9m38k43L88j15M3J47m67j18N02N99p23q1K57j06K76L24n15L5N49P5n09K49
2211A68R8o62M78L69n54l23L47J72j15j71K08k78J50M39n30j64L53M9k03P3p9
2232a75k68K17N57n44Q4J12K24n2P6j01l24Q9L66k9k34m54M30K52k80l6m30k38
2254g58R42l0o33p4K11m0P6M02o06J2O06Q6l73j19N78l56M73J15l63j73N44j8
2276E02o40M33p4j31Q5L31o75j61M42j11MR4k17j17J06K76n28J20J45J70k18K66
$$ y = [-131, -157, 212, -166, -1098, -202, 188, -308, -586, -375, -542, -307, 296, -115, -679, -80, 406, 252, -193, 268, -256, 98, 659, 38, -335, -80, 348, 70, -64, 86, -498, 48, 320, 327, -208, -373, 48, -58, -170, -88, -110, -224, 84, 270, -187, -93, 149, 165, 191, 182, 61, -145, 507, 490, -378, -274, -77, 105, 214, 115, -366, -540, -152, 39, -399, -642, -254, -369, -326, -179, -646, -764, -262, 337, -386, -467, -210, -316, -40, 284, -231, -196, 353, 428, -81, 168, 266, -396, 82, 451, -103, -426, -79, 93, -22, -193, 15, -263, -113, 326, -204, -368, -15, 34, -169, -96, -175, -443, -226, 331, -213, -129, -17, 207, 155, 231, 130, -194, -105, 261, 232, -2, -456, -26, 226, -54, -90, -520, -758, 184, 154, -479, -553, -342, -382, -306, 96, -510, -498, 108, 194, -179, -298, 280, -76, 397, 512, 149, -24, 520, 502, -138, 295, 221, 90, 175, 506, -169, -330, 112, 1, 5, 99, -118, -235, -129, 147, -381, -261, -116, 54, -164, 102]
2298A02l42l7K75N93m40k29ML27j77K19l70j73N16N2l05j18n2L02j54J46k47k65
2320c73K18K89j61j71O4k7L4K69p4l14J22P65l58l74J62N9L18k2J99n62M1M32
2342E36k20j33M9l02j29N90l7p56K20P2J08k29J69n76P8O35l27l6j43N69j25j74
2364a61K21j34q1K14L52l16j6Q0K26k40J99l60k60P01k9l50L0k10K07K41j21j66
2386B7m36N31R5k99j0j36K25j04M65k74q9pK57k09M7P1k56K35K49k90l74K09K81
2409B08o3j9k79j71J75K96l50o78N05K26q6K2m8p4o1L59j27K1J14R2Jj02J37m42
2433c44M02K51J59k57%J15k45K04J08o94L36J51L7k79J2k54K5J16L49o62J6M9
2455d05J43J0o0Q5j09K42qq4j21J02M91p1l34J58j91Q3J86j73l16K65L48k77o
$$ y = [102, -240, -277, -2, 591, 151, -78, -74, 253, 76, 295, -75, -248, 268, 320, 15, -103, -155, 147, -7, 139, -108, -373, -155, 134, -27, -198, -134, -161, -127, 142, 68, -246, -124, 641, 283, -91, 71, 130, 448, 426, 625, 63, 104, 536, 316, 183, 232, -70, -199, 391, 354, -402, -182, -110, -2, -231, -62, -638, -560, 75, -252, -288, -431, 138, 13, -161, 60, -74, -155, 59, 411, 95, 79, 159, 385, 145, 344, -16, -276, 425, 396, 46, 76, -134, 73, 314, 193, 27, -409, 122, 217, -82, -92, -228, -3, -107, 358, 84, -5, -12, 245, 36, 83, 154, -102, 133, 382, 92, -282, -73, 208, 145, 126, -153, -324, -149, 147, -203, -881, -376, -150, -236, -214, -262, -336, -397, -38, -165, -144, -30, 62, 63, -39, 98, -344, 58, 309, 468, 211, 211, 326, 81, 285, 393, -301, 35, 186, 223, -56, -44, -298, -273, -157, 192, -470, -454, -405, -262, -252, -312, -227, -336, -94, -102, -186, -307, -205, 286, 215, -119, 39, -152, -69, 117, -56, -372, -107, 241, -36, -42]
2478d2j89kk6L25j71k81M37k67J97j90J42j01J66M41m80j61L12L5k6k5J69l87
2500a24L07K2O6k21k90K71k8J98k59k71J59J09j11j20o6R7J51j69r3j13J78K05
2522a02l8j93K79k23J5M89p1k43Q8L03j89L9j49J40LR6J49k81l38L73J25l48J78
2545A02l22p7L30L29m35j73j9N9L12k24p1J39j74N73m38j55K58j74K62J17o4l28
2567a73L73R9j25l14K21jr7R4k40j41L17R0p2k21n8L4j4L47k93j8k2K87K01L3
2591C07k20PL03J19K5l94l87M12J47L15m12q7J46j01j46L7k96K04K42l47p5J35
2613f6k46L32l65N4M7Q2K14q1J0Q9j55J93N6k33k4L63q2Pk00J25L4k0K07k64j34
2638e7j07J06K47j31l39J41r6J73L1p3r7n3l3M76k63j47L5L91J23l64J84l46L12
$$ y = [-42, -231, -233, -259, 66, -105, -386, 51, -216, -19, -209, -67, -168, -2, 439, -41, -202, 110, 145, 119, 94, 263, -124, 183, 205, 271, 50, -240, 31, 3, 201, -58, -329, -170, -61, -172, -292, -358, -261, -110, -279, -372, -485, -307, -102, -140, -333, -54, -277, -262, 227, 156, -87, 1, 304, 115, 154, 5, 145, 148, 244, 393, 112, -226, 147, 272, -76, 102, -220, -297, 33, 362, -73, -246, -265, -206, 106, -118, -189, -50, -224, 349, -89, -244, 14, -160, 102, 219, 155, -173, 200, 299, 174, -140, 81, 80, -17, 77, -163, -304, 13, 103, 31, -190, -248, -214, -228, 119, -174, -192, -214, 73, 274, 307, 87, 94, 397, 516, 541, 147, -240, 172, 319, 634, 222, 135, 281, 180, 34, 71, -225, -21, 221, -126, -201, -66, -312, 20, -345, -291, -244, -162, 52, -29, -19, 70, -85, 108, 164, -69, -93, 270, 188, 195, -5, 120, 154, 134, 341, 77, -57, -164, -58, 189, 58, -281, -140, -236, -63, -32, -105, -202, -255, -288, 188, -75, -222, -187, 204, 327, -37, 147, -199, 113]
2661A13K09k84l6J01R0R9j39k99L6K40J92m45j16K03q3J13j4k27m2J17o5O3k88
2684d62J4L35J61N2k00pm8K64J9k19L5R5N2J29J24l28l39M60M3k85k86L34K1k3
2708e9n5j52J26J05j43k6%p5L80J11l20jj33L05L2Q3j55j87R6R1K68l18l21K96
2732e2l2M6j38Nk05K58K08j97j59j49K62j73l1j36J58L02l9M3m9j23J88l0K34
2755A91k31p1L73Lo8j25p7k1J76J01l24j35J87J01K7q6k80K08P1k27J89j15p3
2778b06L0j85q9K63J67j58j6J75p6J34J03K0q7K4k43J61J59k09j75j97K29J16
2800f0k56J92j35J74K00k10k50J55J71q8K56q3k04J44o0R7RK0K6J05j1k34j38
2823a80K65K74k43M8j37j35J04L69k71k63q7L40j32O2m05J86J35j8J89k93k64
$$ y = [113, 322, 38, 2, 103, 193, 292, 153, -146, -110, 130, 322, -123, -239, -36, -119, -6, -20, -247, -289, -172, -237, -174, -462, -448, -113, 48, 100, -100, -107, -155, 109, 128, -91, -56, 39, 91, 220, 344, 16, -323, 137, 180, -105, -391, -57, -36, -59, -114, -266, -140, -35, -178, -204, -204, -279, 101, 212, -108, -109, -242, 63, 95, 178, 23, -164, -68, 23, 291, -27, -348, -52, -84, -38, -176, -171, -376, -118, 90, -107, -266, -415, -153, -326, -357, -493, -335, -33, -72, -29, -78, -201, -13, -43, 191, -40, -111, 262, 265, 197, 72, -5, -26, 150, 251, -73, -208, -21, 80, 107, 21, -259, -51, 20, -207, -18, -133, -206, -176, -361, -450, -187, -20, -178, -194, -19, -95, 39, 142, 162, 75, 99, -144, 17, 176, -33, -208, -405, -176, -60, -316, -124, -259, -85, 115, -95, -345, -190, -19, -107, 149, 66, -138, 6, -54, 43, 52, 72, 98, 203, 192, -42, -180, 85, 359, 116, 164, 27, -108, -4, 365, 94, -169, -256, 84, -48, 14, -391, -205, -70, -88, 101, -192, -456]
2844d56R3N63k13J15l28N60k73R6l03J98j25J38l0K37j66K09k6m6o3J69l64J22
2866A07j4k00K21l4l27L41k02M1oj8L37J1l14p2J07K38j98l2O0o2K6L94j13k75
2890A6M1j56L63l67K39k70J28N1j42p5R9K8J26l90J03J14j05K41k3j10KJ35K88
2913C36j37ql93M26k28K60o2q9m4J04J62r0l46K33j26K02j52m16L91p0LP1j61
2936a34k17L38M4q1k89K0L43k57J22K67m54K57L52k40m9rJ37p2l0j79J73q7K98
2959B53j05k73r1L40L2l03J30k7j26L23r3R7j17M7N6L9j44j68J45L09m9n7J79
2982C97n67K33p7J75j22j65K37k1M7m28K25j93K19M6j47N2Q8ojok53j15K66K70
3006A54k91J4M6O7L37n86L99j95K38K00k62P8j74J26J39k77N6j36K17K4j16k47
$$ y = [-456, -363, 200, -13, 102, -226, 334, 61, 157, -146, 52, -73, 65, 35, 272, 106, 315, 289, 243, 180, 349, -15, 107, 93, -107, 114, 80, -247, 94, -108, -67, -73, -91, 246, 257, -57, -129, -22, 216, 18, -14, 46, -16, 10, 404, 291, 16, 57, -99, 264, -103, 136, -134, -6, 45, -97, -172, -73, -45, 81, -309, -206, -92, -197, 44, 21, -89, -87, 48, 336, 199, 191, -202, 224, -4, 256, 194, 105, 61, 165, 327, 237, -109, 124, -2, 200, 48, -368, 23, -47, -44, 27, -134, -351, -13, 31, -50, -339, -319, 24, -233, -111, 156, -298, -41, 311, 71, 22, 13, 150, 78, 48, -131, 42, -45, 253, 148, -125, -216, 124, 156, -147, -17, -44, -170, 153, 60, 157, 40, 87, 143, 182, 38, -130, 15, 324, 275, 218, 397, -170, 63, -14, 161, 39, -126, 111, 90, 137, -291, -66, -259, -40, 6, -141, -89, -1, -7, -8, -14, -267, -382, -116, 154, -137, -123, -77, -10, 327, -259, 140, -55, 183, 383, 121, 199, 25, 151, 290, 13, 69, -67, 150, 174, 58, -189]
3028a89M1O6j36L76l81o6P2K48k29J77q1Q4j42J95p7j24M3K05K3L54n66J30K8
3051E1M4R9k08j57K13L0p8j23M7Q2K38j99k53%R3j75K69k49J92J38k34P6K36j93
3075f1J12O9r5M8K0r3K22K28l49o5q2J27j64K91j92K75l12J74r5MK0k01J6j30
3099b33J51oJ20J40M2q9j38m0K73L0k25J3j7K41Pk68J32r9J27J42j95j16q4J09
3123A7K01l22J65k75OK12j87J13r5OK52p3Kk54J55J82K11j67j53L2k0K38P3k95
3147B4O3J62J37l33L6Q7J38m1k78j17J43J5j45P0J94k75j39K19O7J2l22L40J45
3170B02j45j92J16K11L4n8J23n07K27N9Q4L45l60n7J9J42j89J2j82L22j71K02
3192B37k50k48L40k4k19K20J07k16pJ50j4o9J84k74J74k57P9K44j03K07l32k5
$$ y = [-189, -148, -82, -218, 158, -223, -289, -217, 31, -198, -21, -102, -18, -160, 35, -42, -166, -123, 82, 105, 459, -107, 23, 51, 95, 194, -14, -171, 42, 72, -6, -129, -82, 0, 238, 39, -214, -214, -121, -296, -27, -276, -84, 54, -180, -104, 132, -61, 51, 120, 25, 73, 93, 0, 222, 450, 101, 36, -46, 81, -83, 208, 16, 291, -21, 153, 58, 62, 82, -119, -103, -233, -82, -88, 32, 172, 214, 125, -13, -53, 220, 250, 25, 38, 21, 262, 269, 1, 133, 34, 161, 303, 108, -8, -92, 17, 218, -104, 61, -214, -208, 4, -183, -70, -165, -159, 93, 20, 22, -232, -77, 105, 316, 149, -4, 28, 8, 246, 319, 24, 87, 249, 386, 53, 89, 176, 314, 273, -5, -122, 21, 36, -109, -39, 155, -120, -259, -40, 27, 39, -283, 57, 202, 57, -135, -19, 192, 226, 168, 291, -216, 11, 70, 154, 499, 139, 82, 101, 243, 54, 66, -116, 206, 35, 237, -13, -261, 79, 55, -164, 56, 163, -53, -60, 90, 76, 7, 191, -83, 91, -166, -87, 157, 54, 261, -71, -96]
3214i6j54K62L39k46J5k23J42M4j41Kj07K63O8l98L37l10J79J11m8O9r8J10J67
3237B87p3l71J85K40P6j51p5k57J52K19l49K34P9j64q8J57j77q9j15K45O3j65
3259a37k35L18p1J95o5k28Q5q5K82j02J11k45K55K19j60l7p9Q8K3j40O6Jj03O7
3283B3o2J4m6j15K28n5q6m1J8K89l22m6P3J26K4J05NL2Pl5Kj01N7j8k9J79p8j62
3311a4J90l32J78j49J37J6k92M47k56q7R8jn7K26k7k48J47P0j98J99j12q5N3L4
3335f3K39k94o4K68M6k14K34j6k52J54J46k78L32l83K24k3p5nQJ79m75J46l7J74
3359b9j86L38n8m20P7L14O4k13n0R0J90j18K04j87K3m9J08J03m12K33l4L3K0j30
3383h9j66K67o1j25Q7q2R2L3k0r2K26k66K23N6m5Q2j02J34l8J81j37o6j8k4O1
$$ y = [-96, -250, 12, 351, 105, 120, -103, 39, 83, -58, -56, -163, 100, 168, -230, 107, -203, -24, 87, 39, 108, 10, 120, 287, 214, -157, 28, 268, 344, 193, 118, -139, 13, 232, -117, 117, 196, 32, -56, 101, -76, -165, -280, -35, 28, -137, -372, -54, -125, 70, 5, -223, -138, -223, 59, -43, 68, -177, 78, 297, 137, 100, 21, 109, 132, -8, 58, 59, -44, 23, -39, -25, -71, -186, 42, -13, -99, -140, -122, 167, -155, -201, -128, -2, 22, 127, 132, 164, 171, 136, 138, 37, 94, 76, 47, 226, 148, -14, 176, -156, 22, -127, 10, 26, -266, 181, -75, -162, -64, -65, -122, 104, 77, -171, -24, 46, -152, 47, -65, -150, -97, -63, 176, -118, -182, 86, 132, -82, 152, 136, -116, 38, 184, -94, 238, -145, 79, 56, -19, -24, -16, 163, -312, -166, -203, -29, -215, 123, 65, -355, -278, 36, 100, -113, -163, -73, 117, -1, 203, 16, 39, -10, 98, 201, -211, 22, -12, 21, 41, -89, -255, 12, -49, -174, -87, -169, -77, -44, -64, -156, 70, -196, 27, 83, 38, 120, 18, 152, 114, 295, 158, 92, 74, 50, 111]
3408A11m4k19J35npm8m8K28k06K0J75l32M06j34p4j30J50K2k01J51J26k24j0L48
3432A90j84k7J91k12O5M5K16l4k96KL9o2J33j32jJ04K3%p9O5o9O3k1j89q2L66
3458A14j12L29m00J70q6pJ64k32R1k2j77PJ53jJ43j11q6J72j93Oj12J2R9lR3J45
3484A56j20k38K98n5j28N2n2Q1q0P7K92k53J04q2J63j98J34k31P4M3OJ02k20L02
3508B27k50k9Q4L8k91M80k59j54J00q9r4J95J4p6J90j82J26L5j08lJ53j29J76
3531A54o5m6m2K80K7k13k40j0L04J24l20j5J74k09l9p9n6m1M00k11J03j48k5k8
3555b21K60k10k05L39K1P0O1j51j91N34j49j01K80k94J09k86K32J82l09O0j9j50
3577a38PJ92k36J43q3j1J20p0J23j85J89q6k23K69m4j72M5n9R2J36O4Lj86n7J23
$$ y = [111, 67, -152, -17, -22, -29, -77, -125, 103, -103, -83, 92, -240, 166, 32, -42, -172, -22, 0, -201, -50, 76, -148, -158, 190, 6, -21, 170, -42, 23, 68, 284, 250, -46, -44, -5, -67, 66, -66, -67, 37, 60, 60, -19, 46, -23, 40, 19, -170, -252, 114, 2, 331, -69, 101, 15, 8, 172, -60, 31, 9, -168, -161, -8, -9, 134, 23, -63, 109, -84, -78, -190, -178, -79, -82, 11, 156, 36, -202, 96, 41, -87, -35, -87, -6, -86, -9, 283, 30, 134, 52, 215, 17, 151, -80, -6, 37, 43, 145, -75, 227, -23, -52, 32, 70, -221, 259, 0, -154, -54, -143, -237, -42, -28, -104, 86, -96, 30, 65, -43, -46, 107, -22, 154, 89, 43, 1, 281, 308, 95, -145, -155, 149, 273, -47, -62, 112, -97, -136, -215, -271, -312, 88, -123, -20, -168, -193, -221, 39, -171, -376, -37, -16, 54, 115, -36, -227, 307, 158, 57, 337, 43, 152, -134, 98, 280, -29, 31, 12, -138, -131, 61, -175, -32, -115, -126, -6, -76, 47, -138, 51, -35, -258, 11, -33, -205, -160, -219, -127, 9, 73, 76, -110, -167, -44]
3602d4mR0ok17K85m5l4J12k54K74l30J70k10j50M52n7l1j49ojJ05K47k90l52M09
3627c6j8J85j1j86K29J29l01j03M9R1l3J43j16n3q5J19r2M3J54j57Q0J8j60l1
3651a42j8R3K15j22q0M2j41L02j61J19k8J03O6m3k28M7L3Q7Oj22M7j40L0L9M2
3676D6n3j41KK1Jl2K35L5J95k59j29P4J11k39K67Pm5J81KN0l87j53L01k8K8J31
3702B21j03J8j77j33n1n0M86k23j43L02qR0l08J54k40J29J6O7o0l0K35N5j75l6
3726C6k8j35K04JQ7L0Oj07L0O9k49n6K17k53J59m1k01J48l4K22j89KJ81j11J91
3751A79p3L4k61J85J8L1J4l08J88R5J51l68L15J03k50N6j2j76M4L6m0j73L51j52
3775a3J52k07Q3j44l6mJ22J31J45j87j13J45j1o5j97R7J26PJ19j57p5J05P9pQ
$$ y = [-44, -48, 42, 36, -181, 104, 59, 25, 137, -117, 157, -173, -3, -213, -363, 89, 32, 1, -148, -154, -155, -50, 197, -93, -445, -36, -54, 131, 120, -66, 163, 292, -9, -112, -63, 28, -5, 138, 22, -31, -116, 3, -89, -46, 108, -49, 31, 49, -111, -142, -160, -67, 148, 26, -54, -12, -153, 149, -12, 107, 79, 182, 248, 205, -23, 24, 57, 144, 150, 28, 75, -65, -35, 4, 46, -7, -148, -146, -125, -124, -156, 79, 114, 309, 50, -79, -5, 106, -133, 134, 141, 96, 277, 279, 329, -58, -211, 90, 62, 90, 221, 118, 136, -41, -174, -225, -275, 211, -12, -155, 147, 139, 229, -79, 75, -165, -36, -20, 47, -13, -43, 192, 247, 72, 36, 8, -127, 77, 78, 165, 195, 201, 94, 124, 193, -56, -112, 105, -148, 11, -30, -231, -83, -117, 105, -84, -82, 99, -12, 179, 106, 140, -121, 64, 82, 113, 127, -181, 7, 102, 253, -115, 200, 303, 53, 109, 97, -79, -35, 1, -39, -212, 139, -13, 139, -68, 15, -129, -165, -169, -47, 84, 229, 42, -71, 74, 63, -2, -199, -102, 24, 31, 150, -7, -82, 23, 102, 95, 103]
3800A03j04o6J90j35p6P0J37r5j62KL68l77J56k47K25M5K05k71j43L3K2J49lJ53
3824A79j64J6J2J06k21J98K1p4o8N2N0k57R3J9J25k06P4p6J87n5n8n8k7K07pM3
3850A11j60k4k2M7K58Ll58K18j93L59k82n4M63k4l53m3j97K57J3J11r6k94K39
3873b1J89k82J58q1K9j04lL35k75L1L79l07J08nl59K64k5j81K78k91K48p7n5k6
3897g3J47O1l74M66k97m9k2K17k32J23j14P3M0k9p4oR9L85l63k0J83j18K99m87
3921a65L34k68Q5K6k34K69J88l70J13o2o7O6o3Rp1L89k00N6m4O2L1o1j90N6L9
3946g2j36J76j60R8O1N35k66k93J21M8k21J37j04L07m17K77j82J45p9L8J46j18
3968D1K2J97Ll24o1j87J28J54J27J6m7k27Q7O7L05l97q2M79k27Q1l24L10l15J53
$$ y = [103, -1, -67, 123, -12, -88, -18, 119, 24, -138, -136, 232, -145, 11, -236, -11, 34, 239, -32, -175, -142, -120, 29, 26, 179, 15, 31, 43, 149, -72, 126, 147, 73, 5, 57, 107, -150, -57, -38, 87, -119, -45, -121, 66, 11, -47, -105, -132, 75, 68, 111, -49, -73, -95, -48, 210, 213, -145, 73, -120, 239, -43, -97, 366, 342, -11, -54, -251, 6, 19, 130, 34, -260, -21, 168, -114, 44, -37, -8, -112, -115, 220, -55, -24, 355, 48, 156, 151, -208, 56, 31, -150, 128, -163, 85, 8, -47, -73, 74, 135, -239, 227, -70, -119, -141, 76, -156, -33, -147, -74, -34, -63, -137, -143, -44, 341, -22, -42, 141, 23, 322, -165, 169, -99, -14, 12, -222, 47, 235, -135, -22, -84, -151, -85, -148, -139, -210, 179, -21, 35, -9, 53, 84, 23, -167, -111, -72, -208, -32, -192, -94, -33, 502, 236, -57, 64, 112, -109, 28, -76, 231, -186, 91, -91, 54, -25, 13, 159, 41, 63, 260, 263, -61, -122, -309, -181, -27, 100, 116, 69, -158, -71, -4, 301, -96, -178, 301, 74, 155, -169, 141, -174, -21]
3992b1K53r1m04K35J19q3q0K92k45P8L2r9o0J30o7q3JJ15J5j44J55j52N7J33l49
4017b63M18l18J77J54o6K8q2j53j44L60K5N3k63K4j23l8J50K6M1k37R0J89l7M7
4041E8R3l76L24j0l8l75K18J94J3k03N0J78j89J23r2M5RO6j72q5N5M7L5QM2j0
4067HN2j4j23J33k27J81j8J8rm2L3J63L4k29J00n09L85JKK19r7j08m18N96M4m12
4093b37J60j28P1k50J19L05l9j15K22j7k97jK88j8l9j64Q3Q2J26k18J49l0j32
4116h0J84j38j03J35K61l36L8J01l08L55k22p0L34k79L03k67P8M6j30J0O4J56
4138A32l25K69j36q5P7k7K0K39L6k21K08j58J98m50J94J22lj02M10n68J83j73
4160a60M5J72R3r8j76m1L39n5j97K47k97k8K49k13K07k23J88M7j11J70j18O2J3
$$ y = [-21, 232, 141, -263, -28, 91, 8, -72, 220, -25, 53, 85, -14, -74, 56, -11, -94, -93, 22, 37, -107, 48, -104, -47, 86, -263, 155, -163, 14, 168, 102, 130, 48, -105, -249, 111, 136, 189, -74, -50, -173, -211, -61, -35, 6, -231, -141, 48, 11, 58, 151, -225, 99, 89, 51, -324, -106, 88, 101, -102, -52, 126, -63, 60, -32, 13, 22, 88, -84, -169, -114, -67, -32, -24, 18, 8, 60, 46, -77, 56, -171, 10, -8, 10, 1, -41, -8, 155, 189, -40, 60, -449, -64, -63, -61, 158, 61, -47, -465, 131, 175, -237, -77, -205, -134, -384, -265, 40, 1, -114, 108, 91, -206, -207, 81, 63, 24, -140, -57, 25, 151, -67, 82, 52, -80, 104, -34, -137, -2, 259, -77, -39, 62, -246, 109, -113, -183, 151, -128, 175, -92, -14, 32, -98, -88, -24, 132, -193, 76, -60, -145, -68, -95, -75, 164, 200, -21, 187, 29, 227, -223, -29, 93, 90, -12, 398, -170, 13, -160, -115, 57, 150, 52, -124, -165, 174, 119, -78, 169, -128, -156, 93, -120, 87, -136, 52, 99, -12, 158, 40, 102, 115]
4183A15j35Q7J89O6k06j57n9M3J70j44j41K41j78j1N6J37M9k14J98m72N08j97
4205e5qK37l31M08k89P2j4J55q9m3l9L1p0mJ08P9j72J91j01M4k38q1L31j59j33
4230a70K53k58L7L27m68L5K20R4j63P2j85K09k11L08k27j17K67K42k90J47k49
4251a27N1j19J16J90N6m58K11r7Q8K36r5K00l12P4L4J8l12L42j67j30K87L3j50
4274c1K60r0k84J39o9O1k4j27N68k56j21%m1q9L79l59J46jj34J46j5k00J96k6
4298B8lk23M09o6k00pJ03M8L0r7j22N1L42m17O6j99J12R4L20m22J85L3O4j43R
4323ej40J37J56l12J09k00L92k38L23k57J27K0kj38Q3l7j00L17l10N9J70j63Q5
4346G6j91K39J48l88q7L01J04r8J08k34K85k65q8J64m07L11O9Q7k50K19j92J89
$$ y = [115, -20, 67, 256, 322, 116, -41, -100, -57, 113, -31, -172, 69, -109, -120, -64, 73, 122, -92, 106, -366, 142, -55, -63, 174, -157, 251, -38, 34, 20, 175, 86, 43, 4, 35, -35, -39, 69, 148, -24, 167, 66, 110, -128, -209, 122, -37, -170, 83, -175, -138, 189, -279, -244, -24, 70, -93, -21, -206, 3, -208, 100, -127, -244, 23, 265, -25, 122, -127, -76, -195, -79, 111, 167, -291, -80, -177, -89, 147, 52, 252, -60, 14, 48, 66, -246, 96, -71, -201, 86, 119, -31, 229, 139, -145, -6, -75, -14, -38, -165, 403, 147, 26, 26, -15, -104, 275, -84, 62, 61, -73, 73, 58, -142, 54, 28, 25, -198, 211, 145, -55, -62, 41, 89, 119, 22, -100, -49, 293, -124, -58, -257, -145, -51, 269, -153, 32, 65, 129, -14, -5, -145, -8, 148, -164, -55, -255, 137, -101, 222, -35, 92, 112, 110, -28, 55, 18, -82, 235, -75, -16, 154, -9, 76, -115, 124, 272, -116, -203, 98, 202, 104, 212, -22, 263, -2, -90, 74, -333, -22, 47, 134, -116, 103, -89, 100]
4368A00Q9k0k4k68J78Q9kj45k11J10L09k92J87k53L45k53o6k90L12qq2J95j3j74
4392a87J28m3M54m46k17N94k11K58l52J39k4j93L97o38L36j26J47K06k17L68l12
4413F1j4p2o0L0J7Q4j5j94J8K01nk1j91L8J79j67J68j18N6m1n0K8l1J01J24j0
4439A16k96L70j99m4q1r1L81l0K6k51K5K37l08R4q4K50r7M2R9j49J65l84M03l9
4463A55l6r6k1O8k20J57Q6k11N3K77j66m8J27k34J10p2J00k06K68k63L99m07J24
4486e6M46l23j42J59n3nOj46n8L61k56k2K02L7N1j63K17k28nj85J89J29k9l42
4510b16l0L01j29O5P2R5k70K07j28Qj10K67Rj99K25k15Q5J1l7Mq8L4K82j11j95
4535f3o1J38R1o0NN7j38J23k8j96RJ06p5J79j37Rj04Q7j92L07j63J56n4J47l49
$$ y = [100, 189, 169, 145, -123, 55, 144, 142, -3, -214, -104, 205, -87, 100, -153, 192, -61, -127, -417, -105, -113, -195, 0, -13, -187, -59, -102, 352, -94, -311, 283, 72, 330, -22, 117, 93, -100, 297, -341, -5, -131, 16, 222, 5, 373, 61, 47, -25, -85, -55, -38, 46, 31, -163, -145, 56, 51, 30, -161, -123, 56, -111, 57, -61, -5, -46, -96, -68, -99, 2, 126, 116, -180, 190, -9, -53, -134, -225, 156, 126, 152, -99, -74, 163, -145, -51, -135, 115, 18, 60, 159, 10, 175, -209, 194, 155, 119, 23, 2, 70, -150, 7, 93, -118, -65, 212, 46, -2, 125, -109, 1, -71, 29, -177, 91, -172, 227, -180, -56, 390, 67, -75, 84, 31, 26, 32, -114, -172, 189, -67, -89, 113, 150, 201, 38, 255, 27, 22, -163, 26, 155, 126, -216, -246, 55, -74, -9, 63, 158, -112, 95, -33, -25, -135, 132, 141, -58, 167, -48, 37, 48, 11, 15, -73, -39, 243, 132, -63, -124, 14, 105, 45, 50, 107, -31, 92, 64, -132, -123, -17, -92, 87, -50, -41, -145, -58, -250, 57, -106, 50, -4, 143, -206]
4560b06K29L5j8l5j13K46j24j59J56M1j25J99k47L13j52j48J09j46N2J63k31J24
4582c7J03j08K7p6JJ01j81L00j00j1j68K31k88K72j58K05K9p9n9p6P3j33J67K88
4606C23k90J74k83j9K46k1k10Q2j81o2J27K63Rk43K51k28J44O7%k03J53l06K91
4629H4l3J70J23l68J03J16k09j11R7Rj96Q3K15l0j06K03m46K84j35K35r4m1K4
4652b3o4J47R7j65N4RP8j84J70J44j1m16O6J91j15Q5j29P7J01M0l3k54rL28k18
4677c4K7k06J5J99j51L25p5K3m1p6k42L11J7j52Q1j87L45l05R9j36J4M91k69j47
4701g4M6l4N0o3L47m76J43M8N2q3j27J95o1j4J33k6l24M96k32l4J11o0LJ18j20
4726A4j26J00K8j99J54J13O3j46k5N2j31l4K76J01j95O4L2l20J29k22K00j70J44
$$ y = [-206, 23, 58, 40, 5, -108, 138, 14, -145, 11, 52, -73, 126, -121, 192, 40, -108, 1, -145, -93, 70, -161, -37, 66, -42, -15, -91, -90, 11, -170, 130, 30, 19, -149, 82, -206, 66, -92, 113, 142, 63, 4, -72, 1, -132, 35, 323, 33, 207, -76, -95, 151, 130, -80, 2, -179, -241, -114, 149, 158, -85, 166, -62, 82, 149, 149, -54, 99, -207, 84, 51, 221, 344, -24, 79, 195, -14, -125, -28, -19, -215, -132, 83, 53, -53, 150, -296, -12, -147, 88, -6, -47, -23, -87, 60, 157, -8, 46, 55, 133, -51, 119, 263, 252, -164, -98, 93, -22, 63, -66, 11, 112, 152, 119, -135, -144, 184, -34, -7, -213, -198, 1, -150, 175, 100, 123, 82, 6, -236, 75, 92, -60, 21, -166, 179, -126, -27, -163, -149, 342, 73, -74, -28, -62, -12, -75, 272, -204, -61, -13, 39, -44, -171, 24, -37, -51, 82, 56, -268, 228, -4, -38, 73, 13, 16, 134, 14, -112, -12, 16, -183, -29, 84, 147, 1, -24, 28, -103, -137, 139, 240, 45, 109, 141, -179, -50, -272, -72, -242, -98]
4749i8q6J69j8m0K22R5j14m81L43k2R9k35Q6L21o2l17L8J58j56j76L32j35J69
4772I2j74K64Q7m13K22n8j45K4N3l1O1p1K7lOl6J99m0j83P5O3o9K37j57J14j37
4798GK50l01o2J84p5j21K33j61j7L1q9nK04J3o2p5Q4L7j75L9J6j2k3q2J15J67
4824A20J31k48q4K06j35J33J92j62j00K0j06L03k39j03o0r1K29J58n8k94J1M1
4846a36J7j10J21J86%j48K21M4l61O5J8m3n8K85j33j45L34j29J28k66J24m9K77
4869B42k83R3j08J96k23j1Q0K5M1J54n6j0j38J72l25j9L51r0k43L31o1R7l34K12
4893I3j62R5j38J33Kl8J43k01J35M3k93m0M37k41J05L9n0q9J79m88L98k5j59j95
4917c17J22L20j64K39J89m88K13o0j62L15O3l15J36p0j80Q3J6K9J4J16k68K61
$$ y = [-98, -184, -15, -33, -73, 149, 244, 130, -351, -8, -30, 69, -166, -80, 241, 179, -138, -100, 58, -98, -274, 58, -77, 92, -82, 182, 269, -144, 78, 20, -125, -101, -48, -79, -18, -89, -62, -65, -59, -95, 104, 64, -119, -44, 19, -50, 187, 30, 144, 7, 257, -44, -106, 78, 3, -118, 115, -46, -63, -32, -121, -126, 78, 91, 29, -46, 38, 75, -100, -61, -45, -57, -80, -162, -47, 120, 251, 3, -81, 125, -10, 123, 315, 153, 53, 73, -33, 270, 31, -72, -132, -223, 6, 164, 106, -188, -177, -136, -119, -229, -108, 78, 78, -70, 151, 195, -166, -101, -83, -126, -184, 101, -32, -177, 157, 28, 156, -110, 14, -35, 242, -41, 52, -56, 140, -83, -94, -14, 11, 52, 206, 150, 140, 2, 174, -151, -170, 181, 91, -152, 179, 118, 215, -119, 93, -69, 26, -112, 21, 23, -15, 128, -73, 62, 105, -188, -228, 209, -32, 73, 112, 62, -27, 152, -336, 62, 37, -122, -317, -195, 125, -39, 200, 389, -99, 114, 54, -108, 207, 270, -45, 91, 21, -159, -76, -60, -31, -17, 99, -169, 92]
4939I2N1j50j30J66m7J17l0j09m2K92l03J4K33n9p6j06L25k14j47J90j36K18l63
4962b14p3L61j74J85l49M38j25p6k9M77m10j55K83j58r4Oo1qJ84qJ01k13R1q7
4986a08M33l92j63K72j38J53N8J76l67K96r7M2l9k68K17Qj59P9P9j24l5K56l25
5009a46M9K29k08o1Q5k44K46J20J37l02J88L4l1k58L00j20n4J12j65J12J82k94
5031h9o6K81l62J42l7p3J39O0J6p5j86K42j08K57lj72J8J72k44L18j83j84Q4K47
5055A94k30j58J79O9J03l01K69j44J83k05K30r0k05K65l28K05K8J39m45L18j94
5076a18N1J93j14M7L0O0j17j63J67Nj09nL16k4k22m8J29J9j13q7M2N7j69K45j43
5101g1K08k14j02P8p3K18Q5%K46n29K24j63J50k52J06J9q5K68j44j57J88M4p8
$$ y = [92, 143, -7, -137, 29, -18, 99, 69, -40, -82, 210, -93, -79, 154, 95, 19, -87, 238, 24, -123, 67, -69, 149, -214, -287, 74, -100, 85, -264, 174, 49, -27, -56, 421, 11, -144, 139, -19, -113, -107, -168, -176, 8, 0, 101, -112, -21, -108, 325, -67, -230, 42, -96, 57, 115, 291, -76, 220, 123, 165, 126, -142, 75, 83, -76, 3, 82, -42, -77, 179, -146, -97, 132, -76, -137, -52, -296, -50, 70, 207, -95, 93, 127, 96, -162, 138, 18, -36, 76, -89, 23, 205, -89, -155, 126, -236, -94, -131, -204, -65, -5, 11, -64, -250, -8, -116, 141, 138, -34, -16, 156, -88, 230, 47, -137, -53, 194, -36, -194, -15, 54, 157, -144, 125, -19, 164, -41, 189, 99, -106, 159, -169, 36, 64, 203, -242, 76, -118, -67, 126, 12, 59, 89, 149, 32, -131, 36, 41, -68, -73, 243, 219, -3, -51, 78, 97, -16, -103, -61, -4, -173, 72, -71, 137, -77, -179, -101, -174, 44, 129, 129, 375, -154, 70, -93, 57, -195, -89, -70, -155, 113, -31, -188, 0, 44, -34]
5124c4J45j67J96m22K65K15k84J32L5j07nJ55J59j98j44P6j12K00q7j17J67J27
5146A95n6j91R8p9J11o6j09K11j01l18M04j62J36r8J8K7J53l7j32j34L5J04mJ53
5170A58J14k54k15K42m9m5R1P9L2o9k65J56J53p0j86jK8o0LL56k26R0j17j22L03
5195A26j42l4J1K09k40oJ75Nj58L12j89n1k63J87Qj29j07L26M4P3nR5k56J65k52
5220i6o6K63j56o5L8j25J40J92k18J01l06K44J79j38K47j08r1o8J82o0J99j23
5242A65j18j58J43K05k78l7j09K04j08P3O8o5J6k9J07j28o7KJ34MNk0J5M4r9j71
5268b02P4J33j12j2J55J7j31J30P9j86J07J1j25R4P6j09R8l2J67l85K04j30j25
5291b04j1K41J61Kk54j21J13r4J1K09O0q8K3q2j69K06j49J41o8k7K49j0k22Q6
$$ y = [-34, 111, -56, 140, -282, -17, 198, -86, 46, 81, -26, -31, 124, 283, 85, -59, 17, -95, 105, 18, -99, 68, 195, 139, -52, 46, -33, 78, 12, -97, 114, 13, -305, 99, -63, 73, -25, -7, 20, 173, 136, 4, -130, -95, 9, 5, 158, 272, 18, -197, 45, -4, -49, 42, 121, 153, 84, -181, -25, 128, 58, -128, -129, -101, -161, -158, 198, -28, 62, -55, -177, 126, -16, -50, -39, 170, -70, -76, 99, 104, -54, 258, 69, 18, -245, -58, -50, -179, -286, 40, 84, 157, 152, 247, -9, 156, -96, -162, 101, -55, -120, -82, -207, -67, 125, -93, 8, -298, -54, 125, -13, 234, 126, 35, -33, 149, 89, 288, 165, 47, -111, 32, 237, -41, -78, -187, 17, -91, -18, 50, -15, 1, -28, 79, -49, -116, -114, 20, 24, 29, 9, 24, 68, -31, -202, -128, 5, -107, -119, 36, 53, -78, 52, 131, -55, 52, 63, -62, 32, 108, -1, 97, 65, 232, -153, 51, -79, -204, -215, 26, 187, 189, -65, -186, -73, -167, -156, 53, 113, 25, 48, -34, -203, 3, -146, -5, -73, -100, 149, 139, -83, 3]
5315Cj21J82r7J92K3k61L00l30J26K52m96J70j61K95N0R5k24L6J08k58N8R8J91
5338B31j44j50N3J37M9K36l11j33R7j87lJ32n1J86pj41j26O8jR2j5n6l9rp7J19
5364e0K09j87p4K29k66J81m5N2N2k30L22o4P0k08M0m1J41J32k97j47K4J73j50
5387a34J82j1o1j54L07o3m7j09j74K63O0K9N9k6k96K00Q1L5Lq1L0pr9P9j84J84
5413F6m91M53q9j16Q8N5J03k56L95j80k21K53k95R2j19K00o5L08k18j5Q5j07J7
5436e7k8J27n3J52Pk7q5j01J47j44k1n5m1M9K53K9j61j26M4j6J46J00J18l12m
5461e9J43j6l00K35k7L5n7M0J39r8j76O4l5K82k11N8l10J69J21o0j17K26k03J17
5485d0JJ12%p9M3P1j40q9K02j76K19k66L59q8k69qJ63J44k17o7J92p1j39M44l41
$$ y = [3, -118, 64, -33, 159, 182, -79, 221, -109, 17, 269, -227, -57, -218, 77, 127, 222, -2, 34, 142, -116, -58, 40, 231, 87, -63, -10, 127, 176, 412, 101, -32, 65, -122, -125, 7, -44, 142, 135, -6, -132, -64, -65, 27, 12, -44, -83, -92, -169, -50, 159, -28, -102, 127, -139, 42, -3, 49, 101, -129, 193, 129, 199, -9, 31, -10, 131, 263, -34, -181, -157, 16, -134, 48, 37, -24, -178, 129, 66, 19, -90, -264, -1, 59, 88, 147, 121, -175, 25, 106, 141, 144, 63, 93, 86, -13, 66, -118, 66, -425, 28, -61, -177, -89, -34, 69, -187, 208, 28, -193, 60, -235, -143, -262, -62, -127, 181, -37, -52, 33, -74, -57, -85, 42, -11, 141, 148, 121, 36, -65, 82, -62, -83, -138, -179, -130, 123, 152, -9, -135, -91, -107, 39, 139, 257, -55, -59, 84, 68, -232, 3, -24, 11, -46, -6, 133, 35, -141, -77, -112, 170, -41, 17, -293, -124, -3, -63, -180, 46, -157, -40, -39, 73, 73, -6, 37, 108, -32, -121, 81, -95, 124, -142, 217, 129, -140, -148, 15, 159, -58, -125, 67, -4, -143, 301, -40]
5510d0o0K3J98j0k29J49r5Q1j42L48Nk31j69K05J07k60J69M1j88K35J42o7k18
5533fp5L29m50J80K5J29j90J9j64J19J87k04J3P5k3K6J7P4l4N7K0m2l23K52p4
5558f3M63n16l4J12J35k2j06J06q2L22j67k66l9K95k25L58j72R2j91J16m2j79
5580a05J79m7r9q9K39J4o3n3L5j0K7m0R9J5j12J24P7p0r3j53K70j60K64n39K02
5605h8o3K20P2j61nM8J9J3jk28L67j49p2K89j43j50J08n6J12J06j96N2n2QJ6p1
5631eL09l95K80l94K67j05q1LJ48P6j22L9j23J05j80K15J62m29K99K2j77j24L8
5654a72K69k33K20r5N2Lj69J78J13j12P0l0j99J56R8l2Jj42l8J22l36K46j48K39
5678F1J45q4j53Kp9Q9J38j4l08K48K6m3k76k0J36L24l13J49r8J18r2Q1J56j84
$$ y = [-40, -100, -77, 121, 111, -118, 31, -64, 17, -125, 223, 228, -3, -172, 33, 140, -120, 49, 90, -98, 137, 279, 212, -6, -81, 248, -202, -22, 3, 132, -58, -39, -203, -84, 103, -101, -88, -13, -36, -10, 7, 81, 47, 104, 124, 82, -241, 11, -63, 400, -116, -150, -38, 97, 75, -31, 75, -7, 315, 148, -118, -157, 138, -87, 271, 99, 191, 0, 116, 74, -105, 74, 27, -72, -161, 78, 92, 29, -24, 11, 1, 28, -12, 87, 102, -10, 114, 191, 121, 28, -125, 145, -15, 249, -290, -88, -151, 69, 141, -20, -25, 23, 42, 55, 54, -174, 193, 44, -28, 261, 118, -32, 76, 20, 132, 238, 42, 94, 42, 50, 66, -5, 304, -91, 189, -205, 62, -43, -124, -121, 27, 103, -19, 20, -103, 2, -178, 37, 199, -230, 69, 91, -86, -210, -172, 97, -136, 84, -11, 41, 44, -125, 53, 166, 54, 124, 94, -105, 51, 149, 117, 118, -24, -62, 60, -276, -30, -178, 61, 206, 122, -31, -29, -108, -19, 119, 105, -203, 45, 71, 28, -248, -268, -132, 192, -121, 28, -70, 48, -44, 37, 193, 9]
5702IO0J79n90J12K04j07K65j57R2k24K15j89J28M0q9J19n9m8J20k69K05m4J61
5725A33j50n6M6K7M8k20K37j89J07K02l9j79q7L04j40k05M31l55J73qj23L9J32
5748A28k12m8R0K9k44K97J47j48j12J88j4j78L5j89M10O9k14k5K42j23j09j21
5770a02K27j12J50l89J9K93J39j61Lo5Q5k02K51Q8j17j24J11j61L8K55k98M6n0
5793g6M5P8R0l67L5L25m9j54J64j01oJ54j68N3k41M6N9K35k20J88j14M1J36m60
5817c07N46j15j48QK32j5n02M28K02k18k8j86K97l17J8LK25o9K98n28L67k00K07
5840A98k14q2J42j00M1JR1j90l1K2Q1p3M06l60J64j89J86o6MK4J50k08n0M9j64
5865a68K55Q8J63m05J85K1J98m86L56m73K49P0rk58J37M09k40j20O9J1N5k51K92
$$ y = [9, 69, 248, -342, -230, -26, -133, 132, -25, 67, -157, 58, -131, -3, 37, -52, 67, 8, -40, 80, -189, 16, -28, 133, -17, -73, -27, 0, 48, -172, 65, -124, -17, 185, 146, -33, -120, 184, 44, -161, 270, -85, 88, 80, -43, -4, 128, -84, -132, -42, -13, -257, 40, 187, 39, -73, 115, 101, -77, -42, -231, 179, 248, 34, 9, 251, 128, 19, -102, 125, 13, 163, -226, -207, 86, 225, 64, 67, 2, 87, -115, 136, 224, 107, -17, 94, -67, -29, 226, -72, -26, -76, -31, 47, 137, -230, -195, 130, 81, -73, 91, -10, -16, 138, -30, 23, -218, -172, -113, 122, -98, 90, -24, 17, 153, -307, 239, 124, -24, -16, 216, 201, -301, 127, 329, 111, 83, -103, 194, -123, -105, -102, 123, 54, 352, -176, 191, -9, 198, -16, -98, 44, -56, -15, -14, 77, -113, -144, -122, -41, -114, 292, -68, 96, -93, 93, 27, 31, 55, 205, -3, -53, -4, -168, 87, 175, 338, -67, 118, 139, 337, -149, 207, -266, -17, 53, 44, -214, -77, 332, 92, -28, 41, 52, 107, -144, 148]
5888A48k96J32K23k93k63K33K38J70l99q7K87l96L57k54k0J81m0J36j3P4k55L00
5910A63j93J60k6M7k21R0q5K90j5Ol31K65j16k40L01r2J5J3q4Qp7k4J3K37k32
5935a28J38J8ok10K20J4k65K16K20k87j44j3L01M3J0j31j36O5j8L57m34J16j05
5958a59R5OR5k4RKj79J66n2k01K08m9K27j15J5J79n1j72j1PLO9J37k1o5j83Q7
5985B3lk64K69L9j12m0j29J98J7N9r6K40k79M18k11k42J48k4r3J7K49l60K66k11
6009a21M69k54q3J23j15k15J24j02K22r3J06p7PJ17k70R6l6K43k40P1m1J26j77
6032a20J76m2J9K41j68j02M8j90K9J57m0K7r1j04N7J55k35J88o4J90k72K09q5
6055a7J6j26O2J84Lk79O7L90m65K73j14k3J31p3k7Q2k46J71k1m2O8O5R0L6j15
$$ y = [148, -148, -16, 207, -86, -349, -116, 122, 292, -107, -194, 93, -303, 54, -200, -220, -39, -79, 57, 44, 118, -137, 163, -30, 130, 104, 151, -70, 20, -65, 225, 210, 216, -115, 150, 34, -206, 95, 3, 18, 31, -53, -45, -122, -146, -133, 104, -128, 10, 28, 22, -188, 32, 46, -219, -3, 217, -70, -214, -227, 74, 117, 127, -4, -140, -75, -93, 264, -170, -54, -159, -64, -58, 37, 13, 22, 24, -155, 11, -41, -242, -34, -83, 144, 29, 44, 223, 172, 0, -11, -4, -1, 68, 205, 184, 119, -64, 23, 20, -244, 25, 64, -48, -88, -217, -19, -2, 57, -39, 201, -78, 340, 129, -113, 35, 11, -82, -65, 184, -176, 90, -121, 348, 94, 11, 134, 19, -196, -72, -174, 48, -45, 61, -16, -9, 108, -162, -66, -102, 141, -99, -28, -69, 57, -120, 56, 14, 33, 274, 106, 4, 52, -138, -109, 48, 8, 35, -56, -160, -103, 52, -183, 5, -59, 131, -141, 68, -17, -1, -127, -65, 119, 122, -157, -90, 300, -165, 108, -6, -29, 102, 29, 2, 84, -162, 9, -12, -54, 14, 79, 169, 205, 90]
6080I0k1j61K38l75K96n0j61k9k3M12l17J47K0j75j57K38N4l4N7L3J16l56J07
6103e1k28J24O3J22J10k34Q1K3j33J25n1P1M1n2l0q4L01j82j77J17k05K31jK25
6127B06l67P9L6M8N8j44J02m9J27j73J36jn4j29K95k62P2%J42l74K94N0j31Jl1
6152f9P7P6n7k23K08j6J62j48k18L47k23p1K98j84L5Ok01J63K02k21K31k2nO8
6176B15j93K41l9j57j4j20J64J01k34K13k99j00K32J00K9n05M90k19K39j03k05
6197a64J85OOP4Kq2n7r2m7L12L4k98J99J51n76K89J8L7J99j88q3K82j50j45R5
6222Gk17J80J80j08p7n9KK71j74N4q0J5K5P1j38K28k7O9l59q0K10N6L0Jr5R8k79
6249a96K57qp2Mn4p9L0J82m5P2m57K47MJ64k81K39R1q0j38m2K72m3n8K4K8j67
$$ y = [90, 69, -92, 146, -229, 67, 17, -144, -173, -196, 216, -101, 46, 66, -109, -266, -28, 26, -8, 49, 82, 198, -158, -51, -279, -155, -92, 30, 140, -94, -13, 10, -123, 2, -49, 22, 63, 11, -19, -103, 198, 16, -161, -44, -249, -18, -19, 206, -161, -82, -46, 2, 60, -84, 18, -31, 96, -77, 59, 58, 4, -125, 170, -92, -20, -20, 122, -252, 42, 92, -39, -38, -69, 8, 84, 27, -196, 12, -4, 158, 10, -208, 139, -84, -155, 143, -41, -6, 0, -201, -38, 164, -57, 174, 152, 147, 215, 22, 263, 224, 67, 53, -67, 97, 198, -36, 177, -122, -222, 10, 110, 139, -366, 124, -95, 144, 41, -164, 21, 27, 33, 107, 109, 27, -30, -122, -169, 143, 177, -121, 78, 229, -347, -58, -40, -3, 196, 8, -75, 207, 57, -88, 7, -210, -30, 150, 42, -35, -94, -92, 179, 5, 59, -21, -6, 19, 90, -48, 180, 153, 222, -137, -217, -7, 49, 79, 80, -15, 83, -196, 61, 53, -19, -15, -69, -148, -118, 64, 19, 91, -366, -119, -115, 49, -232, 7, 98, 18, -120, -162, 110, 67, 9, 33, 61, -106]
6275a06K18q0N7q4K57m36L26k31J39k54K13k9m6J09P0j53L2j40J7L74k00j76K1
6298a02K30Oj30j00K38j40j92J55Q3q7Q3R8j81J54q2N9j00m24O06M3k06k05L96
6321B02o3J54j87k07L58k95K23j26J7n2j68K50J14l58J20k4J86r7J05l04M6K41
6343A35L4l28K32j28O7l90K25J39k08J76l8K02l61J99J95n7j85M5M8L5J2m9J5
6366A5R4n7j62K75N4k7j10mm1m4rJ60j26MJ64j9j8Lk65K5J42J7k18L3J20J22l33
6393b05M27k12j83J33p4K7j46O2O0P8m1j75L8J38L53k22j18q5L20k9j97m1L51
6416B59l84K69k94Q2J53l30L46k03o8K4j6Q4j56K19j91J25K89j53ok28K59k34
6438a54J09J02j6J04j57r4K95j77j80J52J22k35j7N34m23j58k4Q0J22Q3j17L2
$$ y = [-106, 112, 32, 89, 5, 262, -174, 152, -79, 60, -194, 19, -10, -56, 53, 123, -30, 2, -138, -121, 253, 53, -123, -102, 128, 134, 4, -96, 142, 2, -190, -35, 48, -39, 44, 142, -39, 115, 33, 92, -8, -432, 174, 217, 11, -194, 202, 139, 293, 106, -101, 257, -38, 185, 59, 76, 24, -144, 106, 220, -138, -18, -42, 144, 47, 152, -152, -106, 135, 169, -159, 73, -55, 12, -378, -153, -14, -222, -46, -84, 118, -243, -44, 151, 94, -91, -46, 2, 37, 49, 0, 15, 109, 52, -110, 165, 219, 192, 82, 78, 37, -7, -16, 144, 18, 22, 186, 167, 149, 152, -113, -88, 54, 71, -147, -114, 6, 128, -205, 222, 10, -173, -40, -114, -87, -233, -171, -111, -33, -74, -249, -211, -73, 280, 58, -60, -145, 175, 146, -51, -92, 259, -125, 144, -150, -68, 85, -245, 101, -102, -170, -146, -162, -78, -234, -15, -206, -81, 208, 55, 49, -179, 80, -154, -45, 57, 41, 145, -12, -106, 189, 12, -168, -16, 106, -129, -146, 388, -35, -193, -217, -137, -15, 68, -49, -17]
6460a7M0p2J44n1o6r9oJ20k2K20k95R5L3j73J02J78l3j46J34r0j44K76j25R0j70
6485g7K37l2j55o3J65n0M6j00k38L17j93K96k92L08j50P2o0J75k5j94O0m1K20
6508B26p8r6j20j03J77L42k54P5j31R7r8o1J59Q0k12J68k27J47jJ02k98K58j05
6531D7n3J05j04r9J20J3Q8k93O0J27p8j05R4p2K74k4j96j03J48K42j82l9P9O0
6555A09k43J51j16j7J03m5J0J7N6L4O6P1j27j57N8j03J34l7o3P9K42m6j92J12
6579I6j46R3r9J42o5RP5K9m30J13K76l2M9k84J30O2j0J79j48k42K03j96L48l44
6603a92L11j83J30O7Q3k22J16l9j8N2j30JJ16Q6mJ31k77J1J8j22K01k70N0n4K67
6628A29J9j32qj55K10j02K00k28J38Kj54L71m5k33r7J5j04K72r3p5J81%j00M3
$$ y = [-17, 23, -49, 95, 44, -22, -121, -127, -7, -29, 191, -104, -9, 24, -149, -47, 131, 98, -48, 86, -4, -148, 128, 3, 93, -77, 160, 128, -27, -90, 75, 25, 71, -29, -267, 50, -143, 153, -139, 169, 19, 91, 31, 206, 181, -13, 47, 6, 226, 148, 52, -68, -171, 6, 348, 94, 169, 38, 135, 37, -24, 135, 215, 3, 171, -56, 91, 90, 192, -106, 152, 47, -6, 99, -5, -104, 16, 29, 117, -176, -116, 11, -67, -172, -78, -150, 124, 100, -96, -199, -51, 191, 9, -30, 49, 109, -134, 17, -99, -116, -13, -58, -48, -31, 25, 59, 125, 196, 69, -88, -30, -133, 1, -36, -99, -20, 222, 176, -16, 96, -50, 43, -56, 86, 21, 30, 105, 134, -296, -183, 93, 61, 110, -174, -44, 18, 8, 187, 39, -203, 0, -196, 152, -192, 119, -64, 66, 133, 216, -6, 110, 71, 53, 105, -25, -24, 92, 178, 174, 305, 28, 39, 57, -65, 136, -134, -84, -138, 129, 148, 16, 8, -147, 63, -39, 161, -67, 71, 73, -81, 290, 245, 12, -85, -70, -174, 98, 5, -70, 111, 111, 11, 54]
6652E4J1J0k30oJ42J22j51J85l33J42qK63l30J54P5m6K7j77J13j01m5J77K2k02
6676a32J2J28j21O9r9J29J23J67k94J89m0j43m3J66k30j7K06j50J28o6J71l70
6698b17N30k79lO1k51L86l56J58m2R5j19l5J38n6j68R5L4O7j21r3N2K06k30J25
6722b3J21p3R8J38j97K20l31j76L4K60o0l5o7J34j94K17r1l3m6Q2k08L60j08M
6746B6m0N0mk3n2K22j91J36L3M1k95K27j91N1R2j40J16l44K51m5J60j19lJ34R2
6771A84Lk53j44N79m10J40J30j67O4K0k37K00Qj5j06K2M1N1Nr9LJ7j55O2N6p5
6797g6Q4J13l24J30L22k57JM5k45L21k12J0K47r5j11mj8J44o3j66J86j80J34m3
6821e7K39j29j13J49k08K34k07PK03l04K84j04K35l23J4j95q1K79K65k62J31j66
$$ y = [54, 65, 75, -155, -161, -19, 103, -48, 137, -196, -54, -62, 201, -129, 25, 100, 54, 81, -96, 17, -84, -129, 48, 70, -132, -120, 8, -113, -44, -143, -14, 109, 276, -18, 171, 131, -12, -55, 111, -119, -136, 70, -80, 48, -18, 153, -217, 313, 34, 31, 92, -159, 227, -129, 29, -13, 82, -37, -72, 66, 10, -158, -63, -29, 38, -83, -176, -124, 82, -148, -23, 98, 25, 123, 261, 64, 284, -47, -223, -189, 71, 11, -24, -91, 43, -151, 66, -25, -58, -104, -22, -230, 130, 22, 26, -14, 36, 32, 9, -43, 179, -12, 124, 157, 198, -97, 130, -61, -10, 82, -58, 58, -286, -35, -80, 80, -39, -42, 92, 184, 187, -66, -210, 369, -41, 99, 229, 62, 126, 146, -91, 109, 117, 102, -4, 18, 59, 110, 115, 16, 19, 36, -119, -57, -1, -76, 8, 121, -203, -73, 249, -8, -7, 38, -207, 114, -98, -88, 159, 64, -47, -51, -69, 75, 12, -154, 32, -148, -14, -57, 182, 53, -60, 89, -119, 115, -92, -85, 118, -186, 98, -6, 229, -94, -80, -275, -356, -77, 188, -74, 57, -109]
6843a09J7J87k43L50k8k41J7L44m04J10L50k23k10j20J26J21L7j35J59j43K05
6864A67p5J0l6q9k60L89O9k67J47l5k37K86J36j42r3k4k54L40J57k59K05L7j92
6887b0k67K38m1L00Ol48l8J08P9J03k31K03N7j90j75K52J44j58l2j16P1J5m1j87
6911b68L48j00L7J79j5k4j91KJ79j83j08J75j04J70q0O5k18K88Q1l59K6J38k01
6934a63k0K04J92k16J01k97R5L26k93M6n4J50j31q4J98R1k73K76k26K11o4r3j43
6957a67J02J12J24p6r1L03j90j12J88r7j18K3N5q0j06M5m6J21R5Q3j44o5J24m9
6981C4k1o7PL5j0J49K3j91K9p6P1O0j45J43j00q0M43n43K39Lk25K61R6j4l13L49
7007A57j60j07J35q5J51N6q2L6m7j88K43j78N9K25j06O0n9j49k6K9R9k4n8Q0K2
$$ y = [-109, -92, 95, -148, 202, 174, -67, -50, 294, -110, 0, 350, 127, -83, -203, -77, 44, 81, -54, 105, -38, 167, 92, 102, 66, -23, -283, 106, 175, -92, 55, 20, -217, 69, 205, 63, -30, -54, -308, 32, 189, -70, 135, 172, -20, -287, -49, -90, 210, 216, -132, -170, -62, 17, 120, -111, 92, 149, -41, -216, 36, 180, 22, -10, -126, -55, -40, -81, -268, 80, -20, 17, 196, 181, 157, -34, -32, 147, -36, -144, 31, -73, 97, 17, 82, -136, 152, 233, -126, -100, 38, -163, -183, 21, 213, -3, 98, -199, -104, 222, -71, -25, -79, 71, -60, -144, 54, 145, -128, 148, -78, 133, 69, -24, -167, -65, 47, 171, 95, 4, 307, 117, 5, 193, 96, -22, 1, 56, -24, -130, -85, -131, -10, 85, 168, 24, -41, 83, 34, 13, -54, -47, -12, -22, 127, 150, -41, -12, -88, -17, 43, -102, 41, -59, -139, 304, -239, 0, 3, -222, 39, 135, 121, -192, 157, -3, -110, 25, -60, 91, 147, 65, 101, 54, -134, 109, -69, -10, 215, 109, 169, 110, -39, -65, -36, 63, 39, -19, 61, 83]
7032H3k98J81N9L2j10J43N1j32j58J07n2j76K60j67J77J55k15P9j4R9j28j34J14
7055d4NJ69j98M9k7J15j2j81L7J59j86K08RK1k3K1j34O9M5m5n3R4J7j71L7J9q1
7082h1J56l48M41j61k2k37J33J51r7J81j23J74j67k47K42j15Q4k08L77l27N1L94
7104B51l25K6K7m1k7K7r3K97M7L6l37J56J11q7p7M1l3K18o0l15j3O4J32L0R3m50
7130c02J33J34L1Q4j31J33p1j31K04M3k21K4L00m89L85k70J46J95j70K53l33k
7152e5J26j17O8q6K74q3k95N7J9K52j85J55j90j48J97K98k90%j05J56l3q5%m4
7176a14K09k22J87j81J82j77K76j2k31mP8j14J34P7j20j48K51m1J98j41j2k49
7198a74J03K48l36L6K44j35R9j48M27l37M3j13K69k2j76N5J09j93o6j23J43N9
$$ y = [83, -215, -34, 25, 57, -53, 90, 141, 9, -149, -42, -94, -270, -10, -177, 0, 155, -60, 19, 5, 104, -24, -158, -44, -39, 130, -68, -19, -46, 69, 57, -124, -87, 72, -114, 94, 103, 124, 101, 122, -12, 57, 102, 57, 4, 98, 115, -56, -19, 0, -81, 75, -273, 168, 7, -15, -252, -119, 32, -65, 116, -7, 167, 0, -247, -5, -120, -36, -244, 133, -194, -143, 251, -74, -48, -21, -62, -89, -62, -155, 142, 189, 225, -112, 44, 155, 68, -9, 32, -1, 217, 157, -158, -171, -107, 25, 55, 148, -302, -169, -35, -4, 80, -51, 82, 11, -120, 84, 127, -94, -70, 230, -259, 126, -144, 2, 197, 27, 280, -53, -55, 71, -46, 22, -64, 210, 127, -168, -111, -92, 160, -25, 130, -60, -208, -11, 287, -3, -3, -108, 48, 15, -70, -70, -114, 95, -127, 60, -121, 61, -116, 160, 148, -83, -87, -9, -123, 11, 88, -32, -180, 71, 30, 228, 87, 75, -174, -71, 177, -159, -123, 121, -14, 85, -63, 364, 27, 70, -43, 226, 204, 28, 83, 192, -1, -67, -190, -47, 12]
7220A2LN1j46J16K7k5j09J31j50K88k32k1Q2N4k60K08r9M22m34J56P0j56O3p0
7244a9j11J99j06j91K64k31K43j40K31j87R0j83N6PR9J15j83rn5L77k81k3J67
7267A29N5j16j37M3J19j17J17k00K71n6J13q8k91K62j10k16L30mk33k6K38r0K21
7290B14k90K60l50K47j09j4J31J58n10J11O6o0R7J44m1k32L29j78N5q0k05M51
7312A94l18J43M4M6n3j01l14L96R9j76Q2j59R9pJ37j79O9o7J85k0j24Qj47L90
7336B27m4o3q%R3Jm77L70k48J98Qj14o7K63l02L22j45O7j04r2J17j80M13k61r8
7361a24J69j92K94J11l33J58r6J8j95J32J95k37Nj3K79k67J20Pj6l2k1j10k8K15
7385C9p2L9k12pJ85L9Q7k30j18n0N02l43j58L80k61L98j91N2j3J39k28J19J01
$$ y = [12, 15, 66, -80, 36, 63, 38, -71, 60, -90, 198, -34, -55, 27, 81, -179, 29, -70, 352, -82, 74, 144, -12, 51, -19, -130, 69, -37, -228, 36, -195, 48, -92, 139, -48, 42, -141, -85, -78, 21, 136, -47, -56, -111, 266, -15, -38, 129, 184, 68, -69, -26, 93, -24, 93, -107, 164, 108, 221, 133, -158, 104, -6, -222, 108, 104, -129, -155, 83, -7, 214, -76, 184, -166, 81, -28, -42, 89, 247, -263, -152, -86, -146, -49, 95, 54, -178, 151, -27, 28, -52, -257, 194, -124, 19, 63, 109, 56, -45, -359, 37, 136, -40, 42, -117, -18, -25, 112, -67, 2, -65, 120, 100, -24, -16, -163, 227, 183, 120, 112, 112, 205, 206, -271, 99, -149, 49, 57, -57, -124, 139, -163, 159, 14, 81, -23, -115, 2, -178, 235, -26, -124, 45, -147, 147, 258, -75, 83, -13, 5, -190, -58, 137, -100, -95, -108, 171, -96, 24, 31, 15, -17, -38, -148, -176, 39, -33, 6, -206, -213, -28, 11, 98, -132, -250, -300, 202, -141, -299, 81, -180, 218, 27, 79, 66, 205, -23, 96, 197]
7408A97J7j37j98J46k89K57J83k68j5%PK2J18j62K1J20Q4r9Mk76J58Q0N3r1J65
7433I7J57l7j56k79L02k95K46rj05L4J19j01J66k01R7n6l8J53j60k1n1L64j96
7456C0j69M0L13l08K66k98M4m0p1L79j71j11m4K72k75J07J30m42N32j00l0K12
7478B66j46l19J42M3j34L2o1M7K36k28O3K86k68J15j86M9Q6qo5J32l66J54L06
7501A76j51j6Q6j94J34J3j68J41k62l5J90J38j20R9k74L59L1j67j5J00N3j94j40
7524b16M33j79j93J61j63L75j74Q9k66K14k18K19j10p5K17j37j9j3J50q7J95n21
7546c18L69O4j38K72m92k2K90q7J9K05m8k7j8L5j72K35M2j92R5j02J19p4j26j27
7570a98J68N6j10m3J17L2k03M6K72k02K1Q8j61M01l65J54n3p6J62o9P7k36P8j40
$$ y = [197, 214, 77, -121, 25, -264, -7, 176, -92, -107, -107, -100, -78, 40, -122, -101, 19, 103, 4, 8, -268, -110, -30, 23, -68, 97, 254, 217, 61, -218, 84, -211, 35, 26, -79, -45, 74, -27, 139, -62, 35, -21, -59, 94, -66, -87, -138, 226, 30, -139, -99, 214, -94, 172, -126, -82, -122, -193, 186, 15, -96, -140, 132, -143, -36, 94, -348, 184, 84, 54, 266, 120, -199, -57, -14, -148, -116, -177, -130, 106, -122, -59, 227, -41, 74, -112, -63, 23, 15, -50, 82, -284, -130, 176, 25, 9, 95, -99, 35, 48, -120, 21, -241, -276, -86, 52, -68, 31, -243, 116, 147, -20, -35, 65, 118, -76, -216, 217, 38, -155, 6, -157, 218, 44, 133, -133, 81, -137, 82, -28, -103, 114, -23, -42, -55, 95, 8, 203, -318, 51, 115, -23, 249, -243, -265, 25, -62, -43, 162, 114, 87, 69, 104, -68, 167, 209, 17, 112, 10, 129, 55, -71, -198, -30, 26, -84, -127, -10, 22, -181, -135, 137, -65, -44, 44, -117, 284, -81, 73, 20, -56, 106, 37, 114, -122, -44, -184]
7594a84O5K47j13M8l81L23p0J16O4Kk00MK22o4k50M8K18k49J70J19j28j2j24M33
7618C04n04J06K00j55R6K20n58M49o1k8L5J79j73j21j61k50M33j56K45q3k32L05
7640I0N8j38j43M4l6K69R3k38M5j19P4m3J68l38M04k73p8M31o67M37K13M9pm71
7664a76N4J47rJ13j49M6j7K20k51M9J05r0l61M3M93j88j85r6K61O2j29K06m57
7687c09N84k72j12p3J74l70M29J34j05o2Qr1J01k4L1J37k20l3J32q6P9j04QJ97
7711A53k68r4L49o2j02R7j48J11j28J78l62L88j87M6J18R5k09J07K2j16J52j12
7733B8n2Q0N7k18j6K91k80O3J0m1J03K24m73J49J58p2j59M10l79j00J16K7K93
7756B19j55lk97M27k35J76j87PLo9j43K41J5k6n1J29n3j09M6K7J25j21R0J04m82
$$ y = [-184, -119, 128, 15, 63, -318, 5, -65, 51, 115, 117, -83, -79, 143, 79, -171, -123, 95, -154, 16, 135, 7, -5, -129, 304, -200, -94, 106, -49, 47, 267, -291, 158, 97, 69, 104, 283, 110, -11, -172, -422, 11, -145, 100, 17, -215, 90, 148, 10, -133, -89, -125, 144, 237, -1, 44, -75, -1, -44, 124, -214, 190, -83, -161, 270, -397, 40, 253, 302, 295, -176, -122, 25, 16, 129, -20, 26, 9, 229, -22, 27, 132, 42, -319, -276, 217, 29, -156, -252, 9, 71, -58, 148, -309, 275, 3, -109, -182, -8, -378, 51, 185, 80, 18, 26, -65, 36, 12, 43, 180, -40, -73, 59, -27, 52, -52, -44, 153, -115, -209, 140, 78, -24, 73, -75, 36, -92, 86, -276, 112, -75, -29, 89, 184, -25, 82, 104, -12, 140, 28, -24, 56, 113, -105, -121, 170, -110, -47, -37, -78, 25, 249, -224, -75, 83, 11, -148, 262, -117, -217, -101, -74, 219, 64, 61, -236, 191, -44, 132, -55, -48, -45, -114, -257, -16, -1, -27, -78, 51, -2, -111, -65, -38, 87, -34, 56, 160, -322]
7781c22K69oO9n9j0o6qK34m3O8j77j22L07k23K9K09M5l60J89n0L26j54k88J28
7805a5k32O0K70L1j68j47J37n1m5K66K1q3l5K51l08R8l0qQ9j5l24K27J5j06j21
7830b23J76M5j86J09Q8j47J79O4j05N5j18K6J7m7l6J47L47l69m8K67k79J52N4
7853A68k6j17K8l7j35J47J29l60K87OOk66K86j68k13K92J1jk58J91J49p2k7Rn
7878B4j70L76j99N1J48k24K08L1l37K10k17j68J72N7k0R1j47K23N2j95K04k67
7900i7K45k39J60l00L13k9k8k38K39j37Q2K8J40j11O8k57K50k80J6K95k71K10
7922E9Mq5q6J14l5l6K34k12Qj23J44k61K19J8n8M7J2j53R0JJ1k19M67k98K53l2
7948H3L3M7k82K70k35J14r4K00j02N0k85K43q6J79l00L81q1l5j72J18J15p4l30
$$ y = [-322, -53, -59, 10, -49, -59, -125, -133, 101, 58, 126, -51, -173, 134, -89, -60, 149, 194, -166, 23, -27, 299, 145, -143, -15, -247, -187, 83, 114, -54, -201, -64, -115, -160, 106, 127, 44, 9, 260, -48, 50, 20, 12, 101, 86, -238, -11, 4, -102, -223, -47, -2, -188, -79, 9, -138, 41, 105, 0, 55, -63, -37, -20, -67, -103, 44, 391, 22, -26, 241, -38, 114, 168, 142, 25, 53, 16, -119, 28, 157, -203, 84, 90, 96, -170, 116, -52, -265, 27, 38, 37, -221, -30, 119, 47, 20, 29, 24, -146, 230, 31, 82, 230, 6, 214, 245, -92, 118, -99, -267, -95, -38, -58, 33, -114, 109, 161, -34, 170, -97, 148, -91, 69, -231, 82, 53, 25, -213, 26, -111, -29, -1, 139, 28, 96, -161, 89, -191, -175, 120, -151, 59, 63, -22, -108, 6, -29, -65, 169, -43, -35, -158, -14, -275, -56, -38, -96, -49, -37, -190, -100, -99, -88, -307, 160, -138, 115, 83, 116, 163, -119, 151, -84, 30, -64, 136, 34, 84, -201, 42, -44, 135, -165, 216, 135, 100, -72, 46, 161, 87, -243]
7971b43K50J78j18K86p04L75k77L40p6l0PQ9LO3j69J9o3Q9O9P5p6o8r3L44l17
7996d7O5N5j69J26K07j47j91K04k74K4L4J12J56k46J10j8n9K85l29J93j94J26
8018B3p7R1K8J99l14j72J73J02k08J51o7j02N5L0J2P5J42K16k42k1K0j76J90j81
8042e3k5K18j34k09K03j1J22j93n7Q5L51l99K00KJ90l25K26j10k36K89J24j50
8064A08k29L17k22M2m5R0N2j22K07j57p8OJ52J20k64J24M3J8k11j81J15R6L5L
8088A9j26J37k6n4N6p5p4J34j39Q5J26J9k33K42k85J97j03p1R2K28m14J77K18
8111A30R3j16j9P5k97K3K63k56Q6k6K21j02q4M5J58l28J90J48k16J89j47J16n8
8134H8j63J58j81N7J00J03j38Q2r0l1J93L0j08k45J33P1o9m9K24m6k55J8J93l21
$$ y = [-243, 7, 185, 67, 353, -351, 24, -253, 87, 11, -19, -12, 77, 80, 143, -26, -7, -70, 19, 88, 163, 87, 19, -74, 270, -47, 18, 73, -96, 30, 237, 90, -101, 103, -171, -147, -113, -1, 155, -91, 19, 1, -58, 227, -102, 91, -103, 23, -54, 37, 65, 264, -50, -222, -49, 53, -155, -4, -71, -173, -118, -88, -76, -1, 141, 357, 115, 94, 114, -62, 128, -53, -78, 140, 6, -203, 0, -11, 111, -82, -139, -54, 297, -102, 98, 100, 290, -35, 191, 81, -155, 134, 258, 108, -121, 196, -26, 16, -29, 61, 113, -9, 198, 41, -37, -31, 121, 241, -23, 101, 144, 162, -49, -230, -115, -19, 16, 19, -107, 30, 4, -50, 6, -69, -143, -9, -148, -63, 63, 82, -151, 91, -194, 3, -100, -171, -79, 149, -265, -88, 130, 223, 107, 88, 163, -134, -111, 152, -104, -18, -44, 177, 75, -9, 36, 194, -134, 56, 204, -12, 177, 30, 146, 88, -75, 83, -98, -41, 59, 162, 24, 106, 16, -15, 178, 208, 100, -145, -12, 59, -10, -59, 165, 119, -136, -118, 75, -246]
8158b46J90R9mj96K1J19Q3o5J38j19o8P0J5K15m9kj87n1L3K83j38j46K01l6l00
8183a40j4K38J34k49P7j14n0K54
$$ y = [-246, -56, 43, 39, -157, -136, -17, 66, 1, 139, 20, -48, 22, 37, 252, 203, 201, 14, -37, -4, 279, 141, -5, 196, 160, -140, -154, 84, 218, -31, 46, -68, -118, 136]
8191A36
$$ Imaginary data points
##PAGE= N=2
##DATA TABLE= (X++(I..I)), XYDATA
0@%%%%%%%%%%Qj6J6j6K4l2L2m0N6o4P2q8J10j34J54j78K08k41K81l26L72m23M81
33B56n48O19o98P86q80R86j101J226j365J514j678J858k052K267k503K758l037
50a592L345l685M063m481M947n470O063o742P525q441R530j0851J2489j4589J7392
65I503k1334K7336l7683O0379k00478R7272J95944l24933J53799J21779k60475
76a78891Q348K57125j41386n8561J50682o6873p9795J30205m9279o8615J20617
87B3577L3565o8917K9746k3499l1067N4965m09j7255M5069n6028k5437J06163
99G0473k5918r3213P5671J3090p6587O9162K3784j06467L1937M2389p6305N0151
111a833O9250j03894n15Q4049r1373l7411J13171k8375o1347P5973j7334q2963
$$ y = [0, 0, 0, 0, 0, 0, 0, 0, 0, 0, 0, 8, -8, 8, -8, 16, -16, 16, -24, 32, -32, 40, -48, 62, -72, 82, -96, 112, -129, 152, -174, 198, -225, 256, -292, 327, -371, 415, -465, 521, -580, 646, -719, 795, -883, 975, -1077, 1190, -1313, 1445, -1592, 1753, -1932, 2131, -2350, 2597, -2873, 3190, -3552, 3973, -4468, 5062, -5789, 6700, -7889, 9503, -11831, 15505, -22178, 38201, -162277, -65005, 130939, -193994, -40195, 81584, -178891, -170543, 86582, -54804, -113365, 37317, -29556, -109351, 20854, -28425, -97040, 23577, 57142, -11775, 17971, -5528, -36595, 18370, 17961, 706, 45775, -10253, -35690, 70473, 44555, -48658, 27013, 40103, -36484, 32678, 56462, -50005, -18068, 24321, -51984, -1833, 67417, -36477, -36992, 47057, -44316, -81727, 31444, 3069, -58278, 17695, 361, -82602]
123h2602N3696L4295l8629M0317J5699p0260J179L8147j3953J4195K8327k1980
135a569j7387N755Q998J7669r267j0991K9924n821l1066K8696N358l8527L5430
148A7202K8730n3980L368L4201l9564N132M6357n2009k9459O3297j0619m0718
160b8062L6771j2256n1218M3534K9737m3104K494J3405l0177J3600K4838k5669
172b6107J874K2963j7344k880J4354j7150P366K8736j1447q160Q010j6528J0344
185e969L1848j9238j1071K5428j7344j1487L7890j1021k8088L5740J367l9189
197a1134K6234J6529l8017J9633K7174m6776k774M4804k6114k0387L8791j6288
209A1675l3499L6595P675l9980J4721K1718k8286n75K0753k0028q699K5434m445
$$ y = [-82602, -28906, 5389, -33240, 7077, 22776, -47484, -46305, -8158, -22111, -7916, 20411, -1569, -18956, -13201, -4203, 13466, 4199, -6792, 23132, 17311, -13755, 14941, 20299, -18228, 17202, 45932, -8048, -4680, 29521, -10043, -4911, 41446, -10563, -40022, 23275, 12656, -28062, 8709, -3547, -54765, -11231, 18506, -24598, -22104, -8699, -38876, -25276, -438, -26107, -24233, -1270, -18614, -21494, -7140, -24290, -16924, 11812, 365, -7795, 215, -16313, -5969, 25879, 6641, -4430, 20998, 3654, -7833, 30057, 19036, -9052, 26688, 28055, -11134, 15100, 31629, -6388, 13245, 40419, -6357, -9131, 35673, 9559, -10828, 27963, 11675, -21824, 14771, 22446, -17534, -2813, 18905, -9381, -9956, 10797, -9231, -17930, 7504, 3059]
222C059k0111P569O065o517M525M948q921n222J0469Q771o965p394O284L366k576
237b650R208L207j4880L390J5747p731o305J2892l226p810J3708j181j8383P787
251C773J3260r708j602P223j2072o874J3654J013j1309M181M519j0963l106R565
265A554l599o908R878L437j4224J701J1719j1128o003J8583j340j5522J2780L951
279D879k2088J0395K2986j8031q158J9904j1114j4041K4351K2k5407J6644J7377
292A7719k2267j369J4552j7243j248K8011o980k1789R932M435r345J0776O287
305A1471j5659R29J3765l948r894N95J096L181P534n48j0340p837M876J0334j073
320D482o613J300j127l379O984q39j3499N525J5332o897o449N867r243m701K0374
$$ y = [3059, -17052, -9483, -3418, -9935, -5410, -462, -9383, -14605, -4136, 4635, -2330, -9724, -3440, -74, -2650, 6558, 9765, -5115, -1725, 14022, 6291, -14, 12878, 9652, 1842, 15550, 14369, -4014, 3773, 17033, 7325, 5723, 12946, 874, -6000, 7654, 8667, -2642, 1539, 6058, -4905, -8011, 1554, -2045, -8953, 925, 4362, -9862, -8161, 3558, -7570, -13573, 5010, 3670, -11852, 928, 4879, -17209, -6814, 16172, -1859, -10017, 9887, -1227, -15268, 9083, 9105, -16302, 342, 17719, -4548, -5917, 8635, -8608, -9856, 18155, 11175, -10614, -682, 3753, -5592, 5184, 11471, -4188, -3259, 10506, 6558, -3336, -2741, -1645, 1536, 9070, 8522, -1818, -9655, -4779, 5555, 4482, -2131, -831, -1958, -5337, 1647, 808, -12691, -7166, 8166, 1269, -5180, 687, -8556, -13257, 7117]
335G117K133j8304O454Q650j3783M072J3500j4349m298K1283n234j7995J1510
348G56L581j4119J1509J3254j9285m324J5963q569r291J6325J138j4292Q905O566
362H117j5286J157J4033o365n796J1690q87j0968N084N268o476K739R874o034
376F150r186M565L477m140K871L636o957k549P679j387r504J877N925l227N77
391a93L336r018o150J1521M719q719N30M009o666K007Q995q162p929J2619N703
406F602r635J824K496r113M688J4965q644j1176J0615J840r207Q186L827j3733
420f465M348J5106j0753r783J1336l72p722J1477J901j6727M404J3497r393m528
434c674J0078m795o682J0490M20j2446M203Q172o473k638N281l869l901O189R07
$$ y = [7117, 9250, -9054, -2600, 6050, -7733, -3661, 9839, -4510, -8808, 12475, 7241, -10754, 756, 4337, -9782, 1727, 14981, -4304, -8628, 7335, -1234, -10525, 5800, 6938, -7354, 1551, 8117, -7169, -6012, 8021, 1656, -4140, 7550, 6663, -4305, 779, 6047, -429, 2310, 12184, 6150, -3036, 1529, 5006, 866, 3737, 7373, 416, -2133, 5546, 4159, -5345, -3468, 2457, -770, -193, 3143, -5875, -12025, -504, 4215, -4504, -3974, 35, -6631, -4624, 4371, -3791, -11720, 899, 6602, -3033, -1209, 1287, -7826, -3138, 11827, 3183, -7993, 2622, 4462, -4745, 3441, 7268, -6465, -2117, 12989, 2236, -7547, 3789, 3417, -4305, 7172, 9073, -7654, -3250, 10247, 854, -3674, 6404, 1609, -5073, 5417, 5837, -6609, -2406, 5766, -707, -3345, 1936, -1933, -5834, 355, 1262]
449A262p387J305N825k118l969K409Q51l302L737M614n909k750Q410O20o490M669
465A777L969o208L659P755r115m279J2309p2p905O400Q82j0186O584Q755j1986
480B339m044J0647m515o395Q384j906j0875P497P020j2160k885R486n020m531
494f958Q659k825j0701Q129P616r574j819Q137n192l652J0174k143r757P682P253
509E029r066o76P828m534k251R172k534q658N780O487n376o23M776l131j289P443
525H377q77p770L064O463l629k455M167k201l294O635J387r261j32P901l044m617
541G14L948l100n707P281L658j0417j172P424m456l184O823m372p144R089M686
556D071j1063L58P893m528q06R026m829q578J0379N133r861K594O860p247L58
$$ y = [1262, -6125, -4820, 1005, -1113, -5082, -2673, -1822, -5124, -1387, 3227, -2682, -5432, 2978, 3598, -2892, 1777, 5746, -462, 3197, 10952, 1837, -2442, 9867, 9795, 1890, 8290, 9172, -1014, 5570, 14325, 2339, -1705, 8942, 4427, -1968, 6416, 4510, -6365, 1132, 8152, -4008, -6893, 2593, -2427, -6958, 1701, -1124, -11825, -3696, 3920, -5654, -7473, 664, -4528, -8180, 1994, -149, -9906, -2224, 5029, -4037, -4713, 3115, -1419, -3670, 5502, 2968, -5690, 90, 6577, 1201, 578, 5354, 2223, 934, 8377, 7500, -270, 2794, 9257, 5628, 3173, 7340, 5139, 1845, 8480, 9867, 606, 474, 8375, 5331, 714, 4662, 1562, -4145, 3136, 6794, -3623, -4795, 2629, -1827, -5011, 1812, -2560, -9704, -615, 4071, -6992, -6634, 1259, -3269, -4075, 4951, 122, -8456, 1923, 7056, -2805, -211, 6649, -598, -240]
571b40J0283o292q217J0755K881r706L846M523q965J377Q954p374n895Q225o9
586D086o934L843J522o390K109N384m887l922M113J669l214N1K086k001j370M273
602D18M89o937J394P221m275l304O243k815m862Q918J301j1347M704Q683p905
617b074n95Q090q160k957J4157k565j0944P364M046q076N456N635j1024J4J1067
632I434m175o775N057j13m102N477J965r036j960O834m28m836J352N21m641J799
648c627N703n581o161P173K467p085K828L141p509K676R038o587n637R119J47
663A05o111O113J789q205M144P980o900k381O283j680l310M712L21n252K489M211
679D308l594l389L598J734l102J393J678m678p82O839j391o387M593K759o267
$$ y = [-240, 10043, 3751, -4466, 6289, 9170, -536, 3310, 7833, -1132, 245, 9199, 1825, -4070, 4155, 4086, -2848, 995, 2517, -3873, -1764, 3620, -1267, -5189, -1076, 593, -2621, -2570, -484, -2485, -3855, 418, 907, -6030, -4636, 2585, -1690, -4994, 1249, -1566, -6428, 2490, 3791, -7556, -2852, 5831, -2074, -2669, 5421, -2739, -5696, 8461, 5896, -5048, 2316, 6362, -1714, 3742, 9377, -1647, -1633, 9434, 5259, -1516, 3541, 3428, -674, 4803, 6768, -2268, -4228, 2606, 2178, -2658, -1306, -785, -5426, -3627, 2076, -3505, -9666, -2493, -26, -7111, -4283, -1142, -8651, -5975, 3063, -3524, -9161, -42, 105, -6006, 107, 1896, -6309, -2165, 5815, -1085, -3466, 2817, 1137, -2173, 2539, 2860, -2392, 97, 4308, 714, -2675, 923, 2657, -445, 948, 2626, -2052, -2834, 4005, 2614, -3773, 820, 3579, -2688]
694b688K869M304p837k4R615m431p421O691L08n858N903K463j0154J795Q092m826
710a199l627N297k297l649O633Q91p553J047O244k267k227K921r98k764M425K949
726C826n355j886O141K93l727K920K93n750L919O135o866k986O583j637m600N503
742B806q42o935N145N081p552j809N950k424k080N542k286o284N544L773n063
757a434m08L543k140r80M403j424m854K898M285l401k642K935n34k179L954L47
773B369o607J242O561l698l459M516j369m068O044J422q003K273P139m597k049
788b284N605l654l341P948O06q213L331N347m542j57M356m392k502O627j57o191
804a613J910L227l485K17L228l336l110M979R73m990J9L384k395n64L611k653
$$ y = [-2688, 181, 4485, -3352, -3376, 6239, 1808, -5613, 1078, 1386, -4472, 1431, 3894, -6260, -4465, 3627, -1199, -4826, 471, -1826, -5475, 1158, 2049, -5504, -4457, 1787, -480, -2707, 214, -784, -3548, 877, 3826, -1529, -3415, 2726, 3019, -708, 2212, 2505, -3245, 674, 6809, -57, -3043, 3540, 1903, -2697, 2806, 1964, -4971, 174, 5255, -2297, -4106, 1844, -580, -2660, 2882, 596, -5688, -144, 3629, -1434, -1842, 1701, -439, -1419, 2984, 1560, -3294, -396, 3889, 488, -2154, 781, 247, -1932, 2022, 2369, -4238, -2996, 3565, -133, -3592, 924, -445, -4513, 1531, 2953, -5050, -2777, 4362, -235, -2284, 3321, -333, -3674, 4274, 4880, -3333, -2, 5345, 803, 646, 5002, 610, -1892, 4735, 4578, -1613, 297, 3524, 39, 256, 3484, 148, -2962, 2017, 2990, -2000, -1981, 1403, -992, -1556, 2055, -598]
820e98l931M441L036n038l19L938k860j406M945k240m800N154K967o022K41L943
836A451l591m29N574l247n021N174K411m616J004K834l493P09N131k831m642M547
852I65L026l944R09K513l434k79N705k231n162L264K977l776L25K538m925j009
868b538O307j786o254L195J639m064J620K594n516o78O536j626n292K965J790
883a108l077K791K610m659j074N572k15l499K441J583k495J856K899l947j664
898a986N077O00l621J394J428l341J421L630l750k665M661J39l811K008R71l540
914a385J424M263m260l010M474j80l523K207J173m417J806M076m421l162M427
929e08O23l388K348N32m368J195M710l371l012M373M55l014K718R54m084K040
$$ y = [-598, -4529, -88, 2948, -2090, -2409, 1529, -1331, -2737, 2208, -32, -4832, 322, 3289, -2733, -2492, 1451, -2140, -2569, 3005, -242, -5263, -89, 2322, -2294, -1290, 1544, -1949, -1240, 3891, 1060, -3582, 965, 3991, 47, 956, 3469, 35, -244, 5461, 3230, -1932, 1332, 4309, 533, 858, 3396, -1529, -2538, 3769, 1983, -4271, -1076, 563, -3501, -1881, 713, -4803, -5481, 1055, -571, -5863, -2898, -1108, -4185, -1394, 1216, -3443, -4517, 1055, 840, -2659, -218, 1365, -1130, 726, 3625, -322, -1986, 3091, 3691, 70, 1464, 2892, -449, 972, 4602, 852, -1813, 2848, 2987, -824, 1184, 2155, -1385, 39, 4302, 42, -2968, 1506, 1326, -2197, 10, 1183, -3234, -1428, 2648, -1773, -4935, -508, 115, -3273, -925, -393, -4761, -3566, 1144, -2227, -5239, -866, -411, -3425, -707, 247, -3837, -1797]
945a797N171k958k720L764J98j843L830N92m631J673M798k236k387K816l70k067
961A833K922O35n115N35M081j811k958J926r88k629L046J105n004o50M214j390
977b48k395K046l57l080K934K516m257j004M528o42k729L020n29k519L365K822
993C471m323j187M063o06j302L106j081l181L033K921l562j142L860j475j502
1008A093L107o44l805L198L133m057j275L089j071j540L531j522m393K457L171
1023D472l397j442K784k331j413L312o31m283J498K949k817j286K227j137j153
1038b648L166j34m197J975L433j763o88K402j326j165L888P64l700J316L322j843
1054B802p51K506j765j504L968L37m418P46K855k038l04J772k467k518L387J085
$$ y = [-1797, 3374, 416, -2304, 1460, 1658, -185, 3645, 4237, -394, 1279, 6077, 3841, 1454, 4270, 3900, 1833, 4755, 5390, 275, 810, 4891, 3080, 122, 2048, 1060, -1569, 1477, 2582, -2422, -3072, 1142, -248, -2643, -597, -954, -4034, -1100, 1416, -2841, -3845, 683, 41, -2688, 332, -197, -2716, 649, 3471, -852, -2039, 2024, 1418, 116, 3222, 2141, -1040, 1993, 4914, 1352, 210, 4070, 2595, 1093, 4200, 3556, -249, 2949, 6082, 2025, 750, 3839, 2768, 1228, 4759, 3237, -1156, 1301, 4472, 1075, -367, 2417, 86, -1327, 1985, 1354, -2929, -1431, 1518, -1299, -2585, -358, -1495, -2648, 518, 384, -3813, -1838, 1595, -168, -856, 1546, 220, -945, 2943, 3707, 7, 1323, 4645, 2802, 2051, 4557, 2792, 1288, 5256, 5593, 1175, 1921, 4776, 2738, 2434, 4206, 1739, -779, 2608, 3693]
1070C693l755k69K161j770o80K359k235k216L208J277l813q9K664j906J34L020
1086A783k285l144L660K156l415J75K189k614M44L506k256k679L266J546k834
1101e02M84J535j968Q65L480k314k628K842J470j975R51Q29k430J35L507j313
1117B968k999J736J429k092Q3J095k162q04L361j009l865J411J394j999K80J531
1133C58l085p69L684p83k866J976J009k056J378J779k704o00M079n49k595J753
1149IJ054j486J541J739k949q90L308K27k191Q68M89j856R99K270k803k008L483
1166A804j23k600J300L32j840J264K109k877j972L013M47j844J332j00k442J377
1182h20K814k442j666K400L8j597R41j7j972J333K473k012j994J782N63j066J156
$$ y = [3693, -62, -331, 1830, 60, -620, 1739, -496, -2712, 496, 1773, -2040, -2129, 535, -1371, -1237, 1783, -502, -3646, 14, 2170, -1245, -1070, 1119, -1495, -1051, 2455, 199, -2480, 786, 2332, -502, -18, 1517, -451, 414, 3894, 1580, -1048, 1794, 3264, 1289, 2240, 3069, 639, 774, 4281, 2968, -31, 1705, 3134, 1042, 1125, 2220, 58, -746, 2615, 1606, -2259, -848, 546, -1453, -1173, 358, -2727, -3496, 188, -595, -3461, -1485, -476, -2532, -1154, 625, -2079, -2679, 1400, 851, -1744, 9, 1063, -423, 1118, 2857, -92, -982, 2326, 2553, 362, 1230, 1719, -137, 862, 3132, 329, -1679, 1804, 1681, -919, 381, 713, -1127, 137, 2246, -631, -2603, 410, 857, -987, 345, 245, -2197, -820, 1994, -448, -2114, 286, 324, -1273, -332, -349, -2321, -988, 1485, -527, -2521, -739, -176, -1242, -86]
1199h6L96k568O80L047q04k024J715N21j279J312R37k643K72L364r70k504J923
1216A289K57j741K157N51l213P2K738j178j547J361n29j905K116O24l084q8K845
1233G25j290j007J030k58j196J986J063k618m18K765m12j103J588p93j122J571
1249E11J438k176r97K390k16j245J244n25j738J758J720k670j142K209l96q71
1265g06J769p82k310K119J830k272q32J800o55l47J934o26k305J750J818j378
1281H07j117J165k77j104J963l06k638Q76K224j449r41J220q60p58K067l44k430
1298a902O84K449j432q38J150q85n23K155L00k616Q02K108j020o12J344j474p46
1315a056K528J11k683M96J624j037j96R96j269j190K348M67k454J37J440p18J20
$$ y = [-86, 310, -2258, -1578, 1469, 665, -1359, 356, 877, -402, 910, 1847, -796, -524, 2840, 1870, -634, 1289, 1546, -195, 1962, 2513, -700, -628, 2110, 932, -615, 746, 217, -1688, 428, 1052, -2032, -2120, 725, -565, -1572, -542, -800, -1996, -10, 1053, -1565, -1983, 782, 370, -733, 855, 62, -1060, 511, 1949, -227, -1224, 1166, 950, -295, 949, 424, -1314, 444, 2164, -506, -1648, 561, 165, -706, 1063, 281, -2029, 90, 1920, -352, -1184, 616, -39, -386, 1548, 922, -1383, 367, 2185, 807, -310, 855, 578, -526, 1437, 1131, -1507, -631, 1593, 144, -797, 423, -437, -1195, 872, 528, -1902, -1218, 1231, -201, -1039, 111, -774, -1297, 858, 1158, -1458, -656, 1452, 432, -180, 1164, -310, -1056, 1472, 1583, -1100, -604, 1020, -17, -213, 783, -486, -1676, 672, 1139, -1315, -1178, 262, -456, -336]
1332c36J276j295j441K198J331j998k47J375p69K61J362j046j725J705J573k276
1348e2j91J196j028RJ364j183k241J732J442j993j84J001j395j41K157j032k040
1365b579J708J394j438M2J059j576K95K360q41j797J390J262r19r3Q32j541R6
1382c46K325q25j887Q25J039j009L33N63j608l54K305m52k046P24J025j226M84
1399a30Q81j858n24K419j19j958N98P45p69N26Q93j756o59J879M21j986M25O81
1417b91j029N44R24j550r71K010L31j268K93L63q92P86J643j475j055J912J033
1434A308j670P09J75j263J134J836j710j169J668M86q77N40K5j861M35K015j338
1451D43j804J372K8r95R12r0k012N87J712r01j496J194K56p43J109r6j474J07
$$ y = [-336, 940, -355, -1796, 402, 1733, -265, -512, 863, 94, 355, 1717, 671, -1054, 651, 2224, -52, -243, 953, -75, -66, 1298, 115, -2126, -394, 1048, -945, -1129, -128, -1523, -1664, 493, -539, -2579, -871, 523, -915, -873, 186, -1390, -1095, 1265, 424, -1373, 17, 1279, 360, 267, 1099, -442, -346, 1979, 1154, -733, 92, 1131, 122, 455, 1018, -590, -944, 1361, 909, -1137, -413, 612, -614, -130, 751, -1107, -1631, 788, 669, -1289, -691, 54, -715, -189, 704, -1052, -1711, 168, 589, -1397, -972, -291, -1320, -776, 148, -1402, -2373, -363, -32, -1300, -1007, -644, -1536, -750, 893, -582, -1637, 275, 1308, -362, 347, 522, -741, 393, 2229, 519, -650, 1018, 1504, 627, 1167, 1192, -669, -234, 1781, 443, -1361, 11, 39, -956, -44, -134, -2146, -1559, 153, -748, -2244, -1050, -794, -1537, -428, -524, -1998, -1891]
1469a891K154m75j073Q75J41m47J002L49j584R9J981k09j644P22L17o77J135N39
1487A314j808l41K164m92j332J033l01r85J305Q32k262k58K091m18p67O14k41
1504A48j133J645O24k107k89J462l37p08Q05r72j118J290J169j622o70J163k47
1521h97m16P46j66j619J351J546j224o59J270jn63J491j28j360Q84J737j156o43
1539A93J039l73m08J481l85j983P28J607j268p16Q22m64o90J388l44j792J43J541
1557E19r50n95Q95o42n41J476L76j687J60J565p12o59J051o64q51K012K92j926
1575h81M06J338p32k59J232r59j262K051M02k019L65R94r01L84J113j462o21J960
1593A149N44j599J19L95o4K90Q76j171r82J531N31j107k66L57n89J49J053r21
$$ y = [-1891, 263, -212, -1285, -410, -269, -716, 286, 635, -949, -850, 1131, 922, -722, 0, 317, -360, 775, 1314, -494, -835, 1329, 837, -495, 538, 237, -748, 557, 1389, -873, -1131, 960, 542, -225, 389, 148, -985, 660, 1284, -823, -1112, 350, 13, -695, 110, -862, -1980, -690, 479, -1143, -1813, -650, -897, -1313, -567, -733, -2352, -1001, 545, -679, -1338, -68, -69, -632, 859, 731, -629, 255, 1992, 836, 193, 1232, 859, 451, 1932, 1547, -436, 292, 1899, 631, -85, 737, 273, -417, 971, 627, -1165, -1022, 519, -431, -1026, -131, -773, -1314, 162, 538, -1149, -989, 576, -136, -795, 256, -408, -1259, 753, 1045, -881, -475, 863, 131, -128, 1104, 145, -1117, 934, 1336, -683, -318, 676, -225, 159, 1272, -190, -811, 1149, 1693, 94, 213, 608, 544, 834, 1710, 539, -443, 1088, 1619, 512, 246, 603, 14, 163, 1216, 295]
1611B95j609J052R38j234k69N74p78j1J070l07j804J475P52r83L33O01o48J2J746
1630A205j193j068J509O49p52L34M47j183K64J504p74j345Q59M17o79M87L03j335
1648c51j65J564n41j154L01N79n04O05J19j286m1J550o3j306L74M66o17O20N43
1667F93j319k07J520J2j104L08N9m42O85N36j520n51J244K21n72j01M2m46R49
1686GM44j003n53J083K79n06K95l3n07N71R13p17j131J216M40o32L40j0p60M63
1706A99R71q99p33L13M52q23O73j54r29J80J214r31o82P00Q1n03Q50M4j590J066
1726e01J169q35m07O75n05J64Q26n67p10J71J383n46l77j33P9k62M43J29q02l73
1746i79J171l59k66k62L49n39P06P23j049l14J071L04q25N14q9n10P69Q68j303
$$ y = [295, -1314, -262, 676, -558, -827, -253, -1031, -1042, 28, -279, -2083, -608, 144, -839, -506, 95, -553, -541, 1205, 12, -1056, 453, 1102, 350, 684, 1131, -52, 212, 1716, 942, -403, 456, 873, 194, 681, 984, -351, -516, 1048, 507, -647, -346, 233, -271, 334, 453, -833, -874, 676, 613, -693, -319, 147, -470, 150, 693, -626, -833, 687, 699, -405, -97, -38, -480, 205, 741, -779, -1330, -86, 135, -437, -538, -496, -942, 7, 451, -552, -1105, -22, 257, -249, 46, 13, -494, 77, 990, 273, -858, 358, 798, 166, 506, 496, -264, 199, 1170, 271, -462, -149, 303, -520, 153, -1, -930, -750, 464, -467, -1149, -449, -368, -871, -21, 23, -1567, -501, 668, -167, -574, 101, -404, -240, 586, 19, -691, -520, 863, 317, -60, -193, -114, -376, 67, 196, -606, -979, 192, -167, -433, -695, -346, -885, -179, 544, -505, -819, 252, 556, -269, 245, 156, -354, 415, 1283, -20]
1765b0k69R98j25m02O90n45q35J032M78j246k69P10k78l02M36n69m51O03O42p52
1785d74l98M54n8o8P19l53o42L29J269p74l19M45l26L90N98j99j218N13J005q68
1805B5j30L91m37JQ91k20j069Q1J085n44j45L53o09M2R61j47r15K31P56m4j44
1826D13K4l57m45Q35O08j321j08N74Q1m54J59l1r69J047J01j019jN10l18r9Q96
1847A26p32p26J156N73j168K02O38n58L53P70o93k71J176K6m89K3L14l02K96M72
1867A186o79n17O59M0l34o1k55p3J3P05n51q89L21M65k83N7k06j49l2Q40l54m92
1889e89J24L96j03O6K04n57Q8P52j54p51L38K92k07l7L68o80K70N44k56o15J41
1910c66M99k58K85k19n4n08J177L38r39J91L08k58L67N33q15l88Q74L34j145K93
$$ y = [-20, -289, 709, 584, 182, 872, 327, -508, 524, 1002, -244, -513, 197, -81, -383, 53, -516, -967, -364, 278, -474, -872, -418, -476, -544, 175, -178, -820, -491, 778, 4, -315, 130, -196, 194, 792, 593, -625, -112, 893, 25, -105, 286, -151, -150, 741, 521, -548, -467, 618, 74, -71, 282, -327, -285, 676, 529, -386, -155, 601, 557, 413, 437, 80, -365, 470, 1078, -243, -351, 223, 304, -150, 9, -22, -991, 56, 157, -862, -863, -353, -671, -770, 126, -606, -1332, -176, 397, -771, -569, 69, -489, -136, 634, -59, -330, 846, 872, 383, 406, 720, 418, 714, 1186, 507, -10, 649, 689, 355, 294, 39, -34, -21, 684, 133, -756, -435, 30, -253, -196, -402, -551, -583, 257, -97, -589, -465, -69, -172, -106, 98, -459, -371, 381, 227, -524, -186, 106, -101, -138, 230, -450, -180, 364, 108, -507, -366, 133, -125, 160, -59, -113, -621, 556, 894, -45, 146, 454, 196, 563, 1096, 281, -107, 767, 1101, -44, 249]
1930B49nl49M40J34j104j91Q01j12j20r5l21k44N67N7o94j91Q78m15kK02j54M8
1952f21L63N41p81r9M76L24N6j4j60o2LP83l38m95J66M33m54K4m9l98K7P88k69
1975B44p69K03J36j38L54o6n79j04J204m93m99M44mm26O14l3j018M41P72m80l12
1996e09J78q2m9N02j0q55N3O61l81k09L47j07m40P03K36o78J46N76k01Q7L74n91
2018b49J13P61M0n05k17M30R9Nk9l04j39M39L78q04l34J49R2j30R6k16o21M02
2040e44O40o51m08J86J94r8K74L6o62O04O16l82m51M78N3JL67N1o46K09Q11o04
2062G4k58L44k16j43N83o8o99M8Q13l35l53L38n05K22P72l49n25J97M24p5J03
2083C92j47m09K01L38o1m87J59J68j74J91N1o47K42M16k69m51n2K55K54j22k80
$$ y = [249, 244, -105, 335, 469, -635, -826, -25, -137, -257, -352, -673, -917, -350, -293, -987, -1178, -300, -715, -717, -515, -669, -621, -258, 283, -498, -597, -121, 203, 259, 245, 85, 23, 26, 809, 471, -24, 142, 575, 121, 145, 96, -302, -275, 513, 244, -525, -322, -186, -324, 30, -36, -615, -719, 485, -8, -507, -63, -67, -493, 121, 88, -930, -489, 283, -197, -509, -331, -413, -462, 40, 30, -825, -772, -111, -492, -701, -354, -461, -901, -198, 38, -640, -494, 82, -119, -32, 342, -249, -136, 625, 665, 160, -57, 373, 472, 477, 448, 144, 5, 444, 822, 18, -316, -167, -75, -205, -109, -325, -946, -544, 96, -555, -963, -777, -583, -681, -407, -371, -1033, -429, 187, -195, -646, -168, -115, -114, 253, 304, -342, -133, 678, 74, -184, 160, -56, -199, 384, 316, -383, -335, 478, 143, -210, 128, -377, -155, 617, 268, -257, -60, 364, 289, 392, 245, -164, 37, 375, 314, -173, -14, 154, -20, 171, 222, -425, -183, 233, -36, -487, -539, -284, -30, -152, -432]
2104d32j05j53L62N85p37l86N02N0J25M97l23n33P86N86k69m85N64j53l0N83p39
2125B95n71Q25K69o07k92K98l82Q0N88o84l80L88L28j32m32K34l29L30N54n12
2145a32n62P68rm6J44r6j91L65O0j57l12L10j26o6N12l03m99K20J57L7j8n27L90
2168h1oK48j6p46J9Q93j10l32J06l5Q0J36M05l53l0K80Q8l74j26K54j79n7M73
2191E37n48j83N15j79p2k22L9l75M96K08o77k84O17J30j75K9j39k07K37O79o86
2212b60l79P63J65l42J17J45m78P07K6j54l65K23K7j52K45o18j03M41j37L8m01
2233d92J2L37J04p7k38r3L15J85j12q1r9K92j15L49Rj56l41N32j37l96J81p5P7
2256a9J84K5m62k31N87ko35L85Nl09M08J65o86J0M04J12j74N1pk95N40K87n20
$$ y = [-432, -537, -690, -328, 257, -480, -866, -364, -314, -189, 308, -15, -548, 238, 824, 555, 70, 634, 481, 451, 1034, 295, -276, 549, 818, 211, -81, 217, -165, -85, 503, -181, -561, -173, 155, 23, -409, -175, -504, -174, 380, -132, -694, 74, 65, 19, 163, 67, -124, 241, 301, 144, -168, 142, 16, -50, 462, 159, -340, -120, 37, 74, 56, -471, -81, -87, 161, 145, -601, -582, 311, 201, -131, -25, -60, 20, 156, 561, 208, 178, 458, 546, 172, 46, 300, 121, 64, 537, -11, -194, 321, 142, 70, -152, -113, -488, 8, 216, -461, -745, -128, 2, -173, -144, -283, -490, -253, 426, -260, -639, 124, 289, -53, 64, 209, -269, 438, 464, 310, -55, 168, 195, 43, 288, -330, -433, 8, -129, -91, -492, -480, -143, -39, -116, -354, -447, -132, 53, -59, -140, -239, 53, -62, 287, 296, 140, -201, 331, 194, -202, -21, -96, -19, 165, 190, -272, -503, 84, 82, -553, -168, -163, -472, -64, 101, -585, -575, -171, -59, -233, -182, -189, -484, 56, 343, -177]
2279a77j09L81L8M7J25l76N5k8L83m37q4L49p7j94J41m78j9M96K47n29L5k26Q9
2302c48r8K93ql44N48J2j87j13L3P7K24K67k37l66L88o1K80m48L5O9q0J32j55
2325h7m31Q3K79k3k41l0J96PJ14Nj86k60Q22k91j09M90n25K41M54J08q25L19K66
2348C76j20J03K60n22l37N47r2l38r1K98j36J99P3m90n9K84P9l54q1jR7M39Pl40
2372a99k59N76N5j56r4o4J37K23%k34k1M7L34k32j4M5j54J80R0k66k25M3M76l08
2396b0J56m02Q1M54K2K1n78M71J69l1Rk51n8L11R1j87k72J10O8J03j92K62o28
2419b91K46N23n80k33J59J26K4R9m47jr1M57l8j03J87p4l01N69k93k53L82mJ68
2442B31J76m15K55J09P0k3l18K49m7o6Oj93K61l45J02O1k63j72L16L1LL6r2m4
$$ y = [-177, -286, 95, 133, 180, 305, -71, -16, -44, 339, -98, -182, 167, 90, -104, 37, -441, -460, 36, 283, -246, -211, -437, -348, -446, -153, -161, -505, 43, 55, -132, -245, -212, -135, 89, 356, 119, -247, 141, 80, 360, -88, -53, 16, -64, 68, -87, -518, -435, -156, -179, -420, -450, -254, -247, -133, -128, -314, -574, 248, -43, -152, 338, -187, 54, 508, 616, -209, 110, 376, 256, 359, 619, 97, -240, 307, 215, -123, -214, 84, -52, 147, 220, -270, -329, -45, 34, -320, -401, -402, -305, 134, 141, -199, -458, 118, 173, 17, -77, -141, -4, 219, 219, -15, -36, 11, 345, 113, 99, 144, -10, 170, 260, -6, -231, -188, 288, -20, 136, -266, -185, 269, 291, 312, -266, 205, 374, 343, 352, 101, 43, 354, 445, 258, -14, 96, 164, 267, 75, 337, -291, -45, 478, -102, -335, -176, -50, -26, 73, -374, -375, -466, -9, -47, -150, 37, -37, -338, 231, -62, -315, 67, 63, 231, 407, -8, 247, 356, 426, 403, 85, 334, 287, 221, 227, 34, 295, -50, 52, 113, -150, -322, -6, 25, 28, 64, -28, -72]
2466g2K29M5J52n96K47j1L8J43j53m8j79M99k97l77K25K16j56J66k82k25L95L84
2488C43l24m22K02Q9J81N1ml42L57K5n9l8M6j48l0L94j25k80M07K3j97M5o4k5
2512A05MK29l01k00M9J33k23K15j81r8l6L77k36k73K62n2L09Q5q45K35J61L98
2534A17k25MP4l5O6K10j36k15J84NK62j18j99M4K99j05j92j58l3K37k3j18k17
2557b72M9J29J78O2l86J16M4j10L23k87L1J74m9M23m11J8J46J76l65K39m74l7
2579b83L18j2k05L3Kn8K30k58l8j62K40Q3L4l20L31j00J63K10k91l3Q1L64Rkk99
2604C7J78j9j71m5o7K08K49q4k51k2M5J12r5P5l63j7P2K02k35j2K1j24K54K07
2628A55k32k42L92o1n7K19j35k3J23K93m87J6R3K66r0j79N8l27M06M9m27Q4J14
$$ y = [-72, 157, 202, 354, -242, 5, -6, 32, 175, 22, -26, -205, 294, -3, -380, -155, 61, -95, 71, -211, -436, -41, 343, 19, -403, -201, -112, 69, 120, 116, -226, 131, 156, 97, 59, 105, -43, -73, 321, 196, -84, 323, 346, 149, 194, 130, 105, 109, 338, 37, -163, -114, 19, -204, 11, -170, -268, -304, 73, -163, -436, -174, -226, 83, 168, -677, -442, -281, 117, -108, -104, -30, -65, 1, 211, 75, -140, 44, 49, 311, 193, -6, 38, 337, 232, 40, -118, -151, 86, 63, -55, -272, -223, -94, 84, 146, -240, -124, -80, -190, 133, -154, -123, 51, 2, 425, 14, 32, 178, 354, -11, 228, -246, -283, 35, 23, -182, -149, -147, -205, 25, -233, -271, -433, -193, -110, -76, -396, -65, -165, -2, 208, -83, -116, -35, 329, 338, 336, 37, 215, 196, 25, -20, -87, 121, 370, 286, 35, 13, 58, 170, 75, 150, -213, -230, -158, 44, -191, -203, -182, -306, -52, 155, -77, -319, 73, 12, -45, 174, 39, 16, 139, 432, -55, -39, 54, 320, 230, 51, 109, -218, 188, 237, -190, -106, 8]
2651Hn1J73m33J00j64M28K28r1k55j97L61O9O7k56q0K06K69l63J36R7K20l6P0
2674E06j32l43O8K25j4j66J6k68M4J3K8m48M38k6J8N6k95K37J08k15J33n1k14
2697b82N16P2j61J0O9J5Q7k19p5l1J62K49j50m60J57K8Q8k12q3J2N8J15q4R2P2
2722D5Nj6J94n3l91K14J25K52m42K59k22L36o5J9j97N2j43J05L66l33j90j17K87
2745I0L5k69M2m6N5r3Q1K5j99R0J16j54R2j09J67L57k12j36L6J73p9L7j31L26
2769B94R1Oj82k75J9J33QJ56k96k90K80M17m70K42m61L88L2j62j76J72J4J66r4
2792A2K0J28k8j19P0o7K10k43J28o1j16rqQ9Q9n7j64m2k9K72k51l24L34J03j8
2817h1k9J11Lj66L44k84k2L00J49k74J15r0l2k3K22N2j33n1j18rJ87p1k00K0P
$$ y = [8, -43, 130, -303, -203, -367, 61, 289, 198, -57, -254, 107, 176, 243, -13, -93, 113, 382, 19, 155, 252, 472, 436, 506, 374, 31, 99, 324, 310, 144, 160, -108, -64, -51, -23, -471, -33, -59, -41, 15, -280, -43, 65, -150, -17, -68, -282, 234, 306, 145, 155, 224, 239, 326, 107, 32, 1, 163, 412, 262, -198, -41, -13, 75, -137, -220, -208, -150, -35, -119, -27, 45, 50, 34, 228, 175, -216, -2, 123, 375, -67, 192, -30, 306, 241, 260, 63, 115, -28, 77, 443, 110, -80, -197, 90, 125, -144, -102, -148, -93, -186, -105, -80, -279, -189, -73, -227, -135, -244, -77, 280, 68, -68, -32, 141, 62, 99, -32, 294, 385, 391, 209, -66, -47, 86, 94, 250, -46, -336, -56, 361, -109, 133, -328, 60, 92, -70, -246, -74, -60, 106, 12, 32, 160, 132, 13, 83, 16, 226, -17, 111, 50, -66, -75, -83, 6, 95, 38, -126, -168, -197, 75, -176, -500, -166, -63, -81, -110, 1, 4, -162, 182, -102, -124, 176, 325, 51, 166, 76, 44, 21, 243, 295, 162, 111, -7, -16, 171, 100, -100, -80, -73]
2842g3o6J9j45Q7J05n9O1j57k60O02j61Lk39j29K94R8N8q6l9K79j09q1Q1n1k16
2867a84M50J09j39k56O7J84n1j46J7j48K29k75J68k44K05M1O4j38rK71m1L6j6
2890A94k61r7L34K05k6k79K7nJ31j30j76OqJ93l9k30M2J24Q8k92J3kr1JL16j36
2916i8k8j3j7L10j22J4k49K73K15j0j80j06K99J70j32k85Q9m7K49k9n00J87Q1
2939G1j72J46j53P8J47k83J58j05R5q0J34J95k39l77N80l7Mk21j51L30J76j83
2961A13k0P6k21M2J48k08K14k33J75J56o0k00j7j98K27J77k83m3j29M53Q9n10
2983b52R8L47Q1j94j4j71K99J0n7J86l11K62q3k55K47j71n7K18L0k70L6j97PL68
3007A57k86j17M5K89r9j37j56K01J76K7j29p1k61J23L34K62j85J2j60K9M4j90
$$ y = [-73, -139, -120, -265, -178, -73, -132, -71, -228, -488, 114, -47, -44, -283, -412, -118, -20, 38, -48, -87, 192, 83, 2, 83, 32, -184, 266, 375, 236, -20, 47, 231, 180, 34, 51, -97, 132, -143, 25, -219, -14, 27, 91, -47, -56, 215, 174, 210, 194, -67, -164, 170, 375, 349, 70, 97, 92, 223, 93, -83, -77, -85, 108, 69, -161, -119, 5, 93, -199, -186, -188, -279, -278, 38, -98, -126, -139, -156, 154, 32, 46, -203, 70, 285, 275, 95, -11, 288, 458, 326, 41, 130, 83, 332, 303, -197, -10, 71, -101, 45, -108, -30, 117, -166, -8, -113, -18, -98, 36, 231, -8, -385, 195, 158, 162, -59, -210, 120, 296, 113, 93, 169, -52, -10, 138, -70, 144, -89, 86, 242, 182, -18, -35, -233, -6, 171, -112, -155, -284, 169, 258, -252, -154, 193, 274, 80, 66, -105, 194, 204, 147, 333, 22, 284, 201, -54, 193, 22, -35, 183, 213, -57, -21, -218, -211, 157, -129, -246, -201, 88, -11, -148, -304, -103, 73, 100, -29, -100, -361, -238, 96, 358, 173, 185, 25, 54, 98, -92]
3029i2K62j36J62j83J03j33k06L18o2k48J11K63o6k66L4j36L9J70RJ86j04j7J17
3052A25N4l64K85j42J16K37K6l8k82o0J45j89K43j38j47K58k32K01p0k40j03L09
3074fp6j67K08q6K83k51RJ53j40K99k22J13j71p0L90k1j89K9P9q8q0J81j44j24
3098i1k7K56k65P2j79K56l07j4J86j18L45k54M4j19J07K03j53P9j57m4J74J63
3120A57q6oj62J45lOQ4Lj38K51j92l1M6k52L9K05k70M6K81l1o4k03Q5J6J11J40
3146A77k00r5l9L76k69J09J6qM6J77o6j04k65Q4R3K19l51N1K24j12j39ml6j57
3170b73K11K16m72m9Q6J70q4m5J69j36N16k38J32k13K9Q9n7K58j81O6l67K18k63
3193b18J75l3J79mL2k41K7P1K30O8l14k41L39L18j54j31k65L26j93K57j59J38
$$ y = [-92, 170, 34, 196, 13, 116, -17, -223, 95, 33, -215, -104, 159, 93, -173, -139, -275, -236, -66, -57, 129, 25, 8, 125, 179, -185, 100, -42, 74, 311, 337, 299, 17, -43, 102, -87, 156, 18, -129, 129, -103, 98, 28, -212, -315, -6, -82, -249, -41, -127, 156, -95, -86, 67, -73, 226, 4, 117, -54, -124, 266, 245, 56, 85, 164, 76, -4, 177, 33, -91, -118, 138, -127, -55, -234, 22, -285, -299, -113, -231, 114, -140, -96, -215, -108, 95, -58, 21, -136, -180, -6, 157, 71, 65, -97, 48, 45, 51, 135, 138, 0, 251, 59, 28, 74, -178, -139, 66, -204, -158, 123, 92, 28, -175, -90, -74, 37, 177, -23, -118, -157, 219, -50, 59, 75, 67, 113, 290, 224, 120, -145, -61, 32, 251, -100, -49, 175, 63, -76, -80, -116, -273, -62, 154, -318, -367, -281, -111, -195, -240, -71, -207, 309, 71, 203, -10, 19, 108, 51, 309, 128, 194, -173, 45, -218, -43, -76, 103, 99, 131, -110, -83, -12, 218, 286, -28, -269, 70, 388, 234, 103, -162, 164, -29, 228, 69, 207]
3215B07k93M14m3o9k75J93rN5j5j89J01k08J66j10P1J62q0m34K53m8k72L80J12
3238F9m7p3n3K63j00N3K4l7r4P4r6J1J43j51M00j44q5q2J13Rj07Qr5O9k93K36
3264A5j60J9P0J75k3j94N2k14M80l12M8J6J41k20J97J0k13L34k17L26j64l3j47
3287a4j3R4K6J48j78p2o2rM9n6o3j5J88L1j28n1J16P1J04o1k01J19J32n8l4M5
3313A08Q3Kj05l3J36k00q1nK26J0j91L19k82j16K91j62R4j60p3p4j4L52j53M6
3337A8j6l0l1J34j9o2j84Q9K59o6K1j19j69L10M5j37k18J23L17k88m4J41r7K35
3361B12k74L2J65j51k9N6r9L7j63J95j09K15N4l28M3M17l0j31K6j68J5NM9l8O6
3386F7l07N12j91k81k8M0j74M10o6o1K2J1J94l83Q7j3J67r3K02j64l4J18j04K23
$$ y = [207, -86, 328, 285, 216, -59, 134, 125, 180, 165, -24, 77, -131, 35, -75, -4, 158, 78, -356, -103, -151, -423, -43, 69, 22, -51, -104, 159, 59, 112, 136, 99, 5, 79, -17, -6, 137, -14, 386, 242, 157, 75, 188, 197, 90, 98, 3, 72, -221, 15, -145, -126, -56, 119, 96, -98, -46, -260, 220, -92, -44, -28, 113, -107, 90, 100, -113, 221, 4, 330, 166, 133, -14, -27, 67, 93, 241, 63, -9, -71, -80, -31, -87, -150, -165, 23, 54, -74, -125, -9, 62, 166, 105, -96, 23, 155, 97, 63, 108, 191, 193, 88, 55, 191, -9, -90, -95, 131, 141, -50, 269, -13, -129, 162, 0, 94, -66, -139, -213, -227, 125, -28, 18, 2, -28, -59, 75, 56, -6, -190, -101, 158, 92, 113, -6, -175, 135, 180, 43, -175, -52, 265, -23, -67, 74, -23, 212, -62, -30, 135, -16, -45, 11, -88, -51, -214, -19, -128, 87, 141, -187, -144, 273, 243, 112, 138, -30, -15, -10, 39, 1, 67, -240, 272, 81, -200, -228, -188, -362, 48, -18, -79, -57, -46, 148, -235, -148, -161, 6, -87, 115, -49, -83, 35, -69, 154]
3410A54j95L1Rp5j2Q2R1J45ok29q9K74j16j15J2R1l07M07l03O9J04J7K3K1j18
3435c5j71J16j37L96k15nJ91j49k7P8j10Q2J60k22q2K50j51j18L98l81J23R5k37
3458a51K37m06r5K80J29J9j42P6j84J21O2l4K95l55J72P8M5mj79J21J14po3k33
3482a04J16K42l42J39j44o4J40L9j14P2j49R4J01J07k14j74M98l40Q0j02Jj03
3504b21M80k18J62o8N6j03m4m3J16J08j15n1Or2P5J19m0l16J18Qj97M25j79j64
3528a78k8J42J93j03k7M7j58O8K1R4j62K8j50L28j09j04J46K19q1j25J77k69n2
3551h3L11l19j21J84L2P8j0j04j86R6l7P5j02L12l28J04J56J07j36q7M4r9J48
3574C5J91l47J87K0J53k59p0K12q3j34J78Jk40M46o13R9l2J57qP8j52J34k6%P0
$$ y = [154, -41, -10, -1, -76, -88, -6, 85, 230, 224, -5, -94, 180, 64, -51, -39, 52, -255, 152, -151, -82, 22, 39, 62, 83, -35, -206, -90, -227, 169, -46, -51, 140, -9, -36, 42, -68, 14, 174, -48, -130, 120, -31, -149, 249, -132, -9, 86, -151, 86, -320, -415, -135, -6, 13, -129, -53, -237, -116, -54, -88, 207, -148, 24, 102, 147, 143, -36, 85, 199, 192, 129, -104, 12, 254, -88, 51, -93, -157, -17, 22, -92, -20, -169, -75, 26, 133, -81, -255, 243, -97, -17, -119, -118, -221, 259, 41, 203, 135, 191, 88, 44, 1, 117, 225, 110, 59, 65, -27, 48, 167, 127, -189, -71, -63, -260, 165, -14, -178, -206, -64, 129, 26, -1, 46, -112, -44, -23, 71, -91, -63, -213, 115, 6, -98, 48, 267, 186, 61, 238, -31, -83, 228, -91, -212, -28, 4, 82, 72, -32, -218, -122, -159, -84, -186, 126, -202, -98, 58, 165, 29, -58, -14, -113, 35, 226, -121, 66, 86, 239, -20, -90, 122, 39, -95, 83, 84, -156, 290, -323, -224, -256, -99, -107, -29, -181, -47, -73, -73, -3]
3599cl5J56j6q9K6J65k09J07J16O9l15k07L97kj57k98L54p6R6J34m29K32K55n03
3623b32K93k35L95k99j00L56l56L29l30J78k78K43O3M0p4K2K28k99J88j85J37
3644H4r4N3j39m5K55l4j22l7j02J42J27m92J90NJ27O2j53QK4K41O2k86K48K5k21
3669g2J86J21k19J67k77L70j29j87mOJ08J83j86Nk89L41l15K29j48J42J74k50
3691d4K7j40M3rQ8L0l0M3j58L76k35OM1J81l49L93l50n8L6J73n9m5l8K38J35m25
3717a30K1j8K21l63M73l39J83m2l7J88K8l26K6L25m09K46j67R9K00n5J18j90K4
3740G6N1l31K87j04O8k52J83L2r4r3R4J45l2j31j4J17m0o2J64O6j7j41P6m2l8
3765c2Q7K25k66J0J8k42K27J93m9k99M2q9K92J8j2l52L84j03j82J23m47K70J66
$$ y = [-3, -38, 118, 102, 13, 39, 204, -5, 102, 218, 287, -28, -235, 162, 160, 3, -295, 59, -17, 79, 213, -216, 16, 271, -232, 61, -174, 221, -78, -178, 178, -178, 151, -179, -1, -279, -36, 27, 67, -7, 15, 243, -56, 132, -53, 84, -10, 43, -96, -141, 114, 80, -42, -79, -181, -39, 88, -404, -214, -209, -82, -20, -173, -165, -141, 100, 162, -124, 124, 149, -72, 114, 235, 16, 183, -94, 276, 147, -40, -44, -38, 70, 253, 67, 72, -217, 124, -191, 38, -110, 32, 206, -44, -17, -157, -114, -123, -35, -5, -35, 8, -150, 226, -9, -3, 38, 219, -130, 263, -87, -145, -109, 64, 5, -40, -78, 160, 295, -130, -109, -127, 94, -269, 204, -135, 48, 6, -31, 157, 185, -141, -115, 210, -199, 47, -120, -21, 179, 124, 242, 52, 76, 127, -204, 83, -21, 47, -205, -22, 10, -84, -177, -83, 62, 30, -101, -115, 2, -38, -100, 64, 130, 113, -28, 48, 6, -32, 55, 280, 14, 24, 42, -200, 27, 220, 171, -128, -86, -175, 117, 135, 123, -229, 155, 52, -130, -7, -454, -184, -18]
3788a8r0j58J85L27m16J89r8J27l4K84m14l9K43m0k2L0n0k06L62m6p3ON7K3k30
3813a01P6ol6j18K50j06J07j74j34J99J43j17N3j72L54k00J24o1oJ38l40l2K39
3836H0k44L21l3N7p5k58J45k7K28j93Q5q8l39L60j24N3J28j35K62j59q2k01M89
3859B50l53K38k55J9R5J61K9j82j9lM4q4J33j92Q6p8K00p9p6oM8J48k48r7J39
3884h2K60n5j21O8or0pL3Q1j81K1k9P3K16p6j17M0K4l86K34R6p4K0q8J92J6k31
3911a69m2L12p3j62M1m8L7K18k19J11K7j5j06k5K72j00m6l4l4N7J16O5j96k28
3935b41N5J86L45m21L0k4O0R0j1P8kk47k3j90K44q3J92J76l66J28K08L3l1j30
3959E6r0J65l15K34o1L0J0Lj24R0q4pL68Ol70J76k55MJ66j97J3J15k4p4L00k88
$$ y = [-18, -108, -266, -81, 246, -170, 19, -79, 48, 14, 298, -116, -155, 88, 48, 26, 56, 6, -200, 162, 116, 43, 49, 106, 129, -101, -25, -31, -67, -185, 65, -41, 66, -108, -242, -43, 100, -17, 36, -136, 218, 18, 142, 81, 75, 213, -127, -159, 80, -164, 157, 124, 181, 106, -152, -7, -34, 194, 1, 86, -2, -341, 19, -105, -52, 76, -59, 203, 44, -38, -239, 250, -103, 135, -120, -101, -6, 155, 184, 2, -17, -20, 24, -60, 73, -119, -33, -111, 89, 10, -66, -72, -24, 124, -124, -221, -82, 178, 123, 2, 70, 64, -26, -33, 0, 81, -100, -79, -108, -35, 181, 105, -12, 28, 52, -334, -100, -4, -78, -58, -146, 46, 62, -169, -211, 101, 28, -134, -93, -141, -104, 114, -105, 6, 33, 18, -88, -113, 159, 59, 13, -21, -55, 2, 118, 183, -13, -241, -186, 0, 345, -76, -46, -70, -10, 80, 69, 147, 145, -102, -125, -315, -71, -154, 38, 214, -152, -24, 184, 217, 186, 56, -34, 131, -184, 50, -11, 19, 29, 32, -92, -2, -86, -93, 275, 281, -89, 87, -168, -164, 2, -195, -182, -67, -91, -165, 135, -153]
3985a53J87Q3j07j7p3J66J73k72n4K90j69k66K30p4K53n0k01J79k6j87Q5m9k2
4008g4mJ04j97J48j8j3R5j26K18m9j26L7L4J27j63J27k2R9k29R3j32J00r3k8O
4033h6J91j54mj52K25p4L1J3l5k5j7P8j65L34l83K32O1R9j33n6j6m9R3l7J35K8
4059A34J30J4l56pL10k00j47n5K3L95j69n7R1k70J36L6j17N0NL4k6j0J88Ok48
4084a10J86m0K1O1j31L3J2j37K92j20L6k2k49J58m8J37j70R3Pj30K47O0j72r5
4108h1l7j66J5K62J53j09k16K50l11OK40K1n3J61j23O0j85L41m9J62l12JJ62M7
4132B39j37J83k32j79P5l3J49k56O0J02j46K4J08j19j9O6K89o0ql15J34K07k00
4155f8q7J42J33j87K97l55J20q5J93j07j76O8m5J43j64P5nR1qk8jJ84j34J3N5
$$ y = [-153, 34, 117, 10, -7, -80, 86, 259, -13, -67, 223, 54, -212, 18, -56, 197, 147, -54, 125, 99, -88, -3, -52, -74, -78, 26, -171, -23, -41, -54, 41, -85, 133, 84, -42, -5, 29, 156, -7, 120, 98, 197, -32, 61, -71, 29, -64, -92, -86, 105, -49, -53, -205, 20, -54, -23, -10, -45, -70, -87, -9, -174, 160, -223, 9, 70, 169, 36, -20, -36, -85, 8, -29, 106, 134, 264, 278, -78, -85, 225, 25, -122, -177, -154, 241, 72, 15, 106, -164, -28, 8, -109, -59, -54, -20, -46, -56, 132, 138, -110, 76, 36, 57, 118, -13, 20, 32, -105, 187, 67, 103, 81, -168, -10, -58, 79, -91, 2, 9, -121, 126, 186, 14, -81, -118, -284, -269, -7, 146, 37, -179, 71, -240, -234, 6, 27, -26, 135, 12, 72, -113, 228, 179, 341, 29, 30, 192, 239, 102, 285, 53, -126, -51, -84, 65, -191, -131, -29, -175, -151, -43, -162, -181, -115, 174, 114, 106, -209, -75, 132, -68, -155, -13, 120, -67, 230, -125, -5, -90, 103, -4, -180, -112, -157, -14, -178, -103, -108, -17, -25, -53, -54, 130, -4, 9, 64]
4180F4k20K36j47J79k4j45P1j14J02MQ3M3r4J04k76J25O%J34l37K87l66K40O8
4204B3nj16j2O1QQO3j48P1L9k85L99j72J0J44J46k28o6p2L9J20n9L1j90K24j18
4230h5J79L7q2j89J73j03j20j40L13M3Q3q2K6N1l23K21Nj93J06k09M34j95J07
4253E7K1n9J23j27Q1j08J25J23j8l29m7L77n3j51l06J59K91k98K63O7j27k30K33
4276F7j41j10J36j66Q6K07o7L6l8K0l02K96K36n13L46j9j41kJ47n4k05L84j79
4299B4k68K26J73l27J53L7nj82K65Oj10N1o6l2JK07k9j27O9j99J63Q9j6k49R2
4324e4J17J04k04K0J13nj6j53O1q3K06k70K6j19K58j06o3K18rn0m6%L4K9o2K3
4350c1Q3j91J50J22J8l29K30J44k81J61O1j00k06R6K21o7r2j76K0R9k39L38n9
$$ y = [64, -156, 80, -67, 112, 88, -57, 14, -100, 2, 6, 89, 132, 38, 142, -134, -9, -3, -3, 131, -206, 81, -285, -45, 23, 18, -98, -110, -49, -41, -33, 30, -118, -47, -8, -293, 106, -66, -56, 88, 234, 6, -60, -132, -93, 27, -32, -1, -191, 33, -85, 94, 131, 49, -140, 33, -70, -190, -330, -17, 26, 109, 27, 53, 104, -219, 2, 7, -186, -80, -289, 145, -50, 57, 78, 19, 142, 15, 96, -12, 113, 236, 218, -111, -158, 219, 166, 15, -291, -132, 159, -139, 124, 191, 64, -166, 67, -74, -184, -48, -214, -128, 79, 12, 48, 10, 30, -272, 24, 260, -253, 93, 74, -67, -69, 78, 24, -181, 203, 24, -244, -18, 155, -172, -19, 18, 13, -169, 96, 102, -8, 43, -23, -55, -54, 153, 124, -3, 66, -133, 30, 119, 103, -146, -54, 63, 167, -37, -17, 96, 91, 75, -78, -17, -100, 106, -164, -138, -257, 1, -105, -168, 50, 41, -9, -55, -55, -21, 8, -54, -31, 52, -139, 11, 133, 151, -178, 52, 196, -85, 76, 137, 37, -169, -73, 148, 81, -11, -187, -167, -68, -307, 31, -28]
4373b8j5P1n2P6N4j89Nl9J97J01j21Qr1lJ73j91q6K78k68J31J64l9r2m2k0M2Q4
4400A08k34k2p0M42l06J49o7k66M26l2j39J25j15j53M09r7k11J04j97K06m1L7
4422E6m1o1o2O4j08NJ40O5M5k17m8L69J3k53o2RK6k1K05j03oL6n3N5j53O4K12
4449A76J4k75N3n9J77j69o4K51K8j83J74j04p5QJ02j47j36R7k8K96l04L61j86
4472GpJ26j96L3J39m1J43j21R2k67m2O6Q1j8P9l28Q3K63k21K07j87K9K3L20n9
4497B04J7l44J41l3k68J89K65QJ8j98j26K69lk01J4K31j76j04K72m34L68N8j89
4520b2r7L18m33J68k29J69K80r3l02L18M7n24J55k9L00K3J23n6k04J88m4j56k8
4543a28J01J12j91j2L06j06j66p4K9Q6j93J36j62L64j28n4j27J22p6R1J65J03
$$ y = [-28, -43, 28, -24, 52, 106, -83, -78, -117, 80, 181, 60, 68, -23, -26, 147, -44, -130, 148, -120, 11, 175, 136, 44, 2, -18, 24, 108, -126, -148, -218, 224, -82, 67, 0, -266, 160, 128, -11, 114, -1, -154, 255, 158, -53, 51, -146, 60, 19, 56, 15, -46, -108, -44, -152, -147, -7, 58, 103, -114, -162, 207, 220, -33, -95, -86, -60, -81, 124, 21, 15, 51, -2, 53, -100, -36, 176, 190, -85, -32, -91, 86, -83, -147, 104, 132, -51, 123, 19, -56, -48, 54, -93, -229, -132, -160, 136, -168, 193, 7, 0, 126, -70, -37, 102, 61, 204, 83, 175, -92, -134, -68, 13, -5, 74, -254, -171, 92, -129, 78, -109, -80, -57, 263, 204, 221, -123, 18, -15, -283, -94, 171, 179, 197, -1, -127, 142, 139, -62, -48, 183, 7, -97, 175, -259, 109, 167, -22, -119, 199, -234, -66, -295, -126, 154, 61, -241, 77, 124, -400, -245, -274, 26, 49, 172, 116, -88, 100, 56, -100, -128, -27, 85, -106, -118, 188, 82, -84, -158, -129, -43, -236, -100, -262, 102, -26, -80, -207, -85, -161, -70, 95, 198]
4565A98k69j05K65k4rj35J31P2k6j80J95j50K3k02K40l3J23l0k71M7J85K7j99
4588a27J11j07M8%J44j11o2K00j60ON6M6k82K92n0P9j5R4j80m2j42NQ7k4j7R6
4614e5K83k95Q3o9j20P7j25K61j51J91k64L96j93pj24j9J06O7N3k97J10J85k19
4637a26M8J89j32j7n3J71k29K37l6O4j42L2K32r4k84K40m3N5j62j05K47k6J12
4660A78m31L38l1Q4k23K12k39K8k6K85k01k9j12j15M64j76J25K01l60j18J4K15
4682H3j96o1K92k14J53K88k42m86M12o0J91l48j38K93k1j20K56Kj37O6n6l8K58
4705A77j47k4N9kl39K98j12J63o1J97k9l22%J3K5P9J5R1k13P4M5l7J84j68L8j77
4731a73K40L9l5k81J08K05m1j06j7J44l42L01M6O0j27n3k3lJ10j53j5K17k71J33
$$ y = [198, -71, -176, 89, 65, 56, -79, 52, 124, 98, -82, 113, -37, -14, -216, 24, -9, 114, 84, -187, -140, 45, 72, -127, -16, -123, -75, -75, 69, -42, -104, 96, -64, -58, -2, 44, -238, 54, 4, 83, 68, 162, -18, -60, -202, -197, -110, -134, -151, -55, 228, -67, 16, -53, -173, -96, -221, 40, -111, 80, -184, 212, 19, 12, -112, -131, -25, 42, 95, -202, -92, 93, -126, -78, 111, -21, -38, -91, 80, -149, 88, 52, 116, -26, 6, 238, 144, -140, 100, 57, 112, -50, -155, 92, 66, 178, -253, 85, 54, 138, -85, 127, -112, -84, -110, 175, -26, -55, -167, -282, 182, 6, 131, 332, -28, -146, -132, 83, -113, -174, 118, -96, 57, 345, 103, -383, 29, -31, 160, -188, -326, -33, -54, -174, 82, 84, -53, 13, -43, -81, 177, 30, 6, 65, 63, -276, 22, -90, 73, 12, 209, 180, -142, -142, -129, -104, -25, -10, 81, -132, -58, -13, -50, 134, -34, 4, -173, 67, 106, 71, -210, -102, 103, 62, -44, -61, 83, -259, 42, 88, 148, 21, -32, -55, -58, 52, -101, -116, 101, -170, -37]
4755c7k0J46j79K43j53k5J06J0j02Kq4K24k36Q6n6o7J53L2j41N7j77K07M9o1R0
4780F7lj22N8j03o4K96r2k51J10J17M9j5k61K34J00j58J68j26K7j23O3j0j8J61
4804A04qpn6l3K14j87k10K82j25j09p6L42nj52JK77l87j24L92j85M5L7RmJ42r7
4830H0J0J13j86J75m29L32q2j28J69j65m7J67j53o2J00M3K36j93K7L05j44j17
4852E1n4l2J16k56J25J38j31l74K60J98o0J57r4JJ38j40k98K81P4P6l14l9J84
4875GP2J14k83K72j08j62J91l17K45n6j46J67ML3j9j40Q5j4K23j22q9k6m1n0M8
4900a12L27k16O3M0N9l6J6k68K01n7k35K37J24k43j18Q3N5km1K48k45J58j11K6
4924d7J09k53O1K48l8j20P2Kj13J69j78K07j13j95K12k94J79O5n3j34N2J66j25
$$ y = [-37, -57, 89, -90, 153, 0, -25, 81, 91, -11, -9, -93, 131, -105, -19, -75, -142, 11, 43, -98, -41, -218, -11, 38, -23, 67, 64, -58, 0, -103, -167, 129, 37, -214, -104, 13, 62, 47, -214, 20, 120, -38, 130, 4, 31, -92, -29, -39, -57, 104, 96, 89, 33, 0, 214, 27, -183, 99, -26, -135, -211, 131, 126, -26, -25, 252, -135, -259, 133, -52, -7, 30, 39, 35, 177, 80, 90, 203, 17, 192, -237, 95, 13, -115, 54, -111, -158, 9, -144, -206, -106, -63, 173, -20, 7, 312, 168, 51, -3, -35, 81, -175, -50, 88, -43, -417, -157, 41, -19, 138, 44, 45, 183, 43, -255, 26, 100, 176, -138, -177, 7, 79, 193, -90, 182, 74, -88, 103, -214, 31, -25, -171, -4, 0, 33, 14, -126, -41, -55, 168, 46, -43, -69, -110, -160, -112, 215, -1, 62, 102, 161, 125, 141, -127, 74, 17, -218, 19, 143, -100, -218, -135, -80, -82, -123, 125, -120, 38, -73, -47, 62, -191, -130, 118, 80, -40, 32, 34, -79, 90, -88, 119, 6, -189, 23, -271, -92, -27, -80, -214, -162, 4, -121]
4947a21Q2J55J2J8j73k2o7R5J60l89L06P1j96J82j49mr3K69k72j16K34j4J2OP8
4972F4j71J58k83L45n2j6Q5R5m1n4j76j67J83K14k10J37j12k00K84p2o6L82l88
4995f1j35Q0J48K2p1J79j25n9p7K32k89K20M0j62l7M8M5q0j43J82J14m9j99Q3
5019i4K86j94K9%j21J38Kp0J28j59K10o0J16l16q3K37k88L63n3p4n5j8L0J76j03
5044B7r4j69J71L7k8Q6J08j6j52L7K9Q8q2J47l27K20j23R6K05l19o5J14J59k39
5068i0q6K31L3q3K3M2k49J09p8J93o3k5J07j99K48j79J22j41J47j4K37j54j03
5091B8J25M0p9k41M16kj90J25l53J84mj13j15J22O1j41K2J68j4O8o9j60K42k58
5115a38K38k3l00L17lk59K91J84k73J08Qk8M5l8j99j25K06J5J69n1j53O5k47K57
$$ y = [-121, -39, 116, 128, 146, -27, -49, -116, -21, 139, -250, 56, 127, -69, 113, -36, -40, -133, 136, -136, -252, -18, -32, -20, -14, 64, -107, 51, -232, 113, 61, 45, 130, 225, 184, 130, -46, -213, -30, 184, -26, 111, -1, -201, 83, 11, -55, 327, -61, -196, -116, 32, 54, -17, 162, 37, -22, -99, 133, -156, 64, 104, -58, -95, -47, -2, -82, -225, -43, 71, 22, -177, -94, 192, -2, 27, 27, -94, 44, 46, -24, 104, -55, 155, 95, 211, -105, -188, 49, -239, 124, 71, -3, -58, -76, -46, 130, 27, -67, -236, -65, -28, -56, 30, 138, 122, -30, 7, 36, 124, 42, 189, -138, 82, -41, 55, 260, -59, -124, -10, 149, -90, -176, 55, 88, 5, 28, 70, -179, -70, -148, 45, -18, -43, 64, -135, 113, -66, 56, -85, 62, 48, 285, 131, 28, 153, 193, 114, -127, 289, 287, 97, 222, -131, 53, 49, -64, -179, -57, 4, -137, -115, 53, 39, 107, 38, -122, 120, -138, 100, 77, -223, 94, 91, -168, 123, 307, 34, 142, 150, 122, 167, 129, -70, -195, 11, 26, 195, 144, -9, 56, -191, 66]
5139F6k5o9K44j56j91J53j85J48M3J9K1Q2r6j72Q4N9o1q0M4K18j8r6J33k06j11
5164a52J02K6J46M0n7P9k11Q8l1o4O6K9j00J18l40L21o7J85j19l44L02J03r0n2
5188b2j18L16M3j21N3o1q6O1q5j2Q7N2Rj48l4n6J64p2K8k1k1L6M8J38k92J25Q0
5215I1L9k20j19M12m01Q1J96P0k77J07o1m5J06R7J43j68J06l77K09J9J35k23k05
5238b85M23l45R2K24Oj93j44L34j85J62r4J89p4k24K19K5J62m15P0J4J7k24K06
5261d0j02K8q8K23k44Q3Q0J17j20J21r5J01j10p0J47J21l36J78n2K35k58L0J3
5284c8N7k7k15J74J89j09o3k24L87M3k28J71k46nJ39j35K83k00m4K20j91M1K33
5307B12l54Q1J19j17L80j59r5k06K1MJ51J17q8j87KJ05R2j30n8K66k45L51l19
$$ y = [66, 41, -28, 216, 60, -131, 22, -163, -15, 28, 47, 68, 150, 54, -118, -34, 25, -36, -116, -72, 146, 128, 32, 165, -41, -152, -50, -24, 122, 162, 105, 184, -27, 61, 30, -34, 32, 61, -39, 79, -261, 60, -7, 178, 59, -285, 17, 120, 30, -22, -140, 176, 219, 98, 151, 90, 4, 65, -20, -32, 55, 107, 116, -32, -66, -122, 42, -30, -2, -23, -44, -8, 40, 178, -114, 11, 91, 130, -90, -209, 203, -198, -117, 79, 149, -128, -21, -82, -127, -21, 76, 219, 51, 157, -220, -11, 8, 143, -80, -285, 138, -207, -115, 109, 115, -78, -222, 112, -73, 89, -5, 184, 110, -114, 105, 130, 292, -123, -53, -39, -22, -246, -40, -142, -114, -202, 21, -223, -140, -60, 57, -63, 58, -37, 64, -46, -116, 31, 152, -184, -6, -58, 177, -81, -51, -38, 19, -8, -223, -49, 140, 31, -32, -256, 131, 174, -54, 117, -129, -134, 5, -130, 153, -47, -91, 129, -62, -21, 212, -142, -61, 58, -59, 321, 162, 67, -139, -118, -114, 37, 154, 66, -121, -119, -14, 78, -52, -110, 156, -89, 262, -57]
5330e7n7J65j46L06Rl20j0K07P7k49n7R1p0P6J5j90PK06K03r5k09ML28l62P5J27
5356G4o6k13j5L35l30L84k16K0P4k17J80j62L72j60K3k02M2O5J32j62L8J43j77
5379c8J96k30L8k0L9J02n3J21k28R2j1k18L02j61n5J92j12K31k84O8l8K55k44
5402e6kK42j70k15J36L01m9l44Q0J54j70LJ09J48j42O9n4j29Q4l8N8q7L4j39k15
5427c92M99Q6k01J04J56j66J96m21L0j02M55j03M8k30L5Q3k89L20j87J66Ok16
5449a23K4J5L4n4J18jQ9j67j06N4J37j04R4j20J7Q0J02j36j35M6K57k77L54n2
5473A46j26n1J54m4k15o4K20J42l71K86M6l7k56M1J09r4K56j70rJ03k32L10j68
5496b4j52K71p1r5R3r3M0J37M3l44J09j9J20L2m0j74K20q4J08Q4k97N1L21k53
$$ y = [-57, -114, 51, -95, 211, 220, -100, -110, 97, 174, -75, -132, -41, -111, -35, -20, -210, -203, 3, 206, 111, -98, -94, 234, -128, -53, 74, 8, -205, -220, 115, -215, 169, -47, -27, 47, -170, 10, -152, 220, 60, 83, -119, -77, -12, 120, -42, -4, 139, -38, 158, -72, -34, -54, -15, 87, 34, 155, -73, 19, 8, -210, 92, -69, -124, 68, -44, 187, -97, -29, -67, 188, -56, -58, 184, 14, -201, -65, 236, 187, -157, -77, 77, -93, -90, 19, 167, 25, 94, 40, -89, -5, -43, 15, -72, -38, -177, -392, 107, 193, -8, 96, 252, 86, 282, -139, -109, -211, 244, 141, 189, -41, -6, 77, -212, 108, -79, 87, 93, -123, -99, -84, -50, -104, 14, 13, 102, -65, -171, -117, 20, -84, 10, -110, -93, -13, 89, -47, -182, -136, 121, -156, 198, 146, 20, -31, 123, 79, -136, -200, 20, 162, -209, 77, 123, 86, -170, -129, -20, -114, 142, -28, -37, 66, -166, 144, -24, -176, 95, 24, -71, 22, -71, -31, 106, 149, -195, -86, -105, 15, 47, 7, -167, 53, -31, 77, 161, -136, -85, 236, -17]
5520a7n5J94k97Q3j5K4l5J11l77K73L9J82j56N0R5j73k1J92K4k2J7r9L4j79J62
5545C4j23Nk30K71J0J6J37k68J09j50R8Q7k4J97l76K85k97J46Q1Q6n9P6Q6Lj20
5570H0k08J8L9J7K3L3J31k58J22k5k70K25K28O7m3m6q0L3jn1j0n7Q4j04j31J83
5596ao8K57k20J36q7K86l35j43L96k03k76M27l28K98k7Lj31Q1k47oR8r3J81J42
5620A40j48j87J02j14K06r8n9Q3k8J84j00j1J16p3m4k07P3K63n2QJ3j19K64k11
5644AO4L4q2l6O1k47J16N3kL9J32k9l2j5P2k1J6k86J77P1J08j25j00k7O7l5J73
5671A47J86m31K82j86M7L9k1K3j25j38j18J57L39r8%Q4l13K1J71j94J37n3J71
5694A27k66L19l64P2K44Pk9N1j5p0j78K04j49J6PJ02J31ok15j4j44K5L59k26J47
$$ y = [-17, -72, 122, -175, -92, -107, -83, -118, -7, -384, -111, -72, 110, -46, 4, 99, -74, -95, 97, 121, 99, 116, 17, 51, -128, 34, -89, -84, -314, -43, -33, -17, 120, -148, -39, -189, -91, -4, -28, 169, -207, 78, -219, -73, 8, 94, 35, 111, 197, 200, 80, -128, -110, -71, -54, -31, 2, 133, -125, -3, -28, -298, -73, 155, 222, 179, 133, 53, 86, 85, 34, 24, -33, 51, -53, -184, -1, -69, 188, -32, 104, 17, 303, -32, -175, 221, 18, -258, 169, -159, 139, 112, 115, -16, 65, -182, -188, -90, -183, -2, 140, -8, -195, -93, -207, -1, -99, -158, -75, -103, 81, -19, -30, 86, 13, -31, -238, -165, 98, 46, 54, 67, -52, 212, 1, 65, 99, 17, -19, 42, -205, -89, -36, -38, 1, 133, 104, 72, 57, 129, 108, 124, -162, 15, 86, 194, 69, -31, -58, 9, -26, 147, 333, -98, 184, -2, 45, 84, 63, 86, -39, -177, -295, -138, 201, 103, 103, 187, -126, -105, 66, -128, 9, -44, 127, -139, 180, -184, -112, 132, 139, 110, 161, 146, 76, -102, 102, -47, -31, -24, 78, 209, 203, -12, -26, -170, -145, 214, -12, 135]
5719A35k79k09J88K43j7N0k30J94k73K06R2j84M2k5K7J36J80k31j88K40op5J45
5742A61k54K8J33O3p9L6o1l7k6L8j17K66k67L12j31k42K85O7k08mJ1J35j34O5
5766D0J38l56K76M5o0P2l4M1l28K42o8p9K23k76K35k32q2J04k1J34n1k2l4j83
5790b76J72lJ51j55K3K80k39j48K48L5j24J10O1rk74oL48j34J9j20K34k92J4J24
5814C9J05P2l43J41j02J16j09m2J72k33J22J7J99o0k39N2L64k20L6j42K97k75
5836c3K15m7N7o7o2k3k07n6J45P8J0k02J83q9K75k23j5R1L3n3j12L35k43j0k7
5861d7Q8nj56rN11l40j7N3pJ05j59j42J86O0j35Pn6R1J00k84J29M6pq6j44J30
$$ y = [135, -144, -353, -165, 78, 61, 111, -119, 75, -198, 8, 100, -84, -42, -67, -40, 96, 276, 45, -143, 97, 91, 16, 161, -93, -65, 68, 131, 52, 88, 27, -10, -36, 2, -115, 151, -116, 196, 65, -177, 108, 175, -33, -37, -26, 109, -25, 40, 178, -178, 98, 143, 83, 155, 121, 162, -166, 76, 8, -71, 152, -124, 111, -121, -203, -99, -120, 14, -37, -59, -93, -276, -104, -107, 44, -111, -88, 192, -47, -195, 53, 88, -36, 74, 135, 126, -148, -154, 194, 60, 79, -41, 193, -99, -85, 39, 144, 216, -127, 14, -88, 28, -81, -123, 49, -184, -62, -45, 154, 94, -145, -93, 271, 51, 87, -55, 242, -33, 182, 135, 192, 125, 63, 40, -167, -223, -78, 0, 10, -192, -9, -98, 177, -46, -61, 30, 63, 10, -102, 233, -10, -20, -47, 41, 36, -120, -129, 382, 42, 25, 78, 71, 176, 17, -125, 61, 121, -14, -7, -63, 28, 128, -156, -27, 19, 12, -74, -218, -88]
$$ [...]
8191F2
##END NTUPLES=NMR FID
##END=
