##TITLE=1H_LR-758-R6-3CR1
 CDCl3
 8 sc, 
 23.10.2023
##JCAMPDX= 6.0         $$ Bruker NMR JCAMP-DX V2.0
##DATA TYPE= NMR FID
##DATA CLASS= NTUPLES
##ORIGIN= UXNMR, Bruker Analytische Messtechnik GmbH
##OWNER= root
$$ XWIN-NMR		Version 3.5
$$ Mon Oct 23 14:38:14 2023 Russian Standard Time (UT+4h)  she@DPX200
##.OBSERVE FREQUENCY= 200.13135
##.OBSERVE NUCLEUS= ^1H
##.DELAY= (6, 6)
##.ACQUISITION MODE= SIMULTANEOUS
##.ACQUISITION SCHEME= undefined
##.AVERAGES= 8
##.DIGITISER RES= 18
##SPECTROMETER/DATA SYSTEM= spect
##.PULSE SEQUENCE= zg30
##.SOLVENT NAME= D2O
##.SHIFT REFERENCE= (INTERNAL, D2O, 0, 15.7039)
##AUDIT TRAIL= $$ (NUMBER, WHEN, WHO, WHERE, WHAT)
$$ ##TITLE= Audit trail, XWIN-NMR		Version 3.5
$$ ##JCAMPDX= 5.01
$$ ##ORIGIN= Bruker BioSpin GmbH
$$ ##OWNER= she
$$ F:/spectra/data/she/nmr/H-F/1/audita.txt
$$ ##AUDIT TRAIL=  $$ (NUMBER, WHEN, WHO, WHERE, WHAT)
(   1,<2023-10-23 14:37:03.76 +0400>,<she>,<DPX200>,
      <created by zg, POWCHK disabled, PULCHK disabled
       configuration hash MD5:
       00 E9 B6 7A A2 85 ED C7 34 08 36 98 17 FE 4E 26
       data hash MD5: 16K
       3A 78 AD CE 31 82 AE 01 7C 29 10 DF 04 27 E9 24>)
$$ ##END=
$$ 
$$ hash MD5
$$ 6F 1A 42 C0 B7 6D AF F5 BE 01 C2 A5 EC 04 D3 B9
##$RELAX= 
##$RELAX= 
##$RELAX= 
##$RELAX= 
##$RELAX= 
##$RELAX= 
$$ Bruker specific parameters
$$ --------------------------
##$DU= <F:/spectra>
##$EXPNO= 1
##$NAME= <H-F>
##$PROCNO= 1
##$TYPE= <nmr>
##$USER= <she>
##$AMP= (0..31)
100 100 100 100 100 100 100 100 100 100 100 100 100 100 100 100 100 100 
100 100 100 100 100 100 100 100 100 100 100 100 100 100 
##$AQSEQ= 0
##$AQ_mod= 1
##$AUNM= <au_zg>
##$AUTOPOS= <>
##$BF1= 200.13
##$BF2= 200.13
##$BF3= 200.13
##$BF4= 200.13
##$BF5= 200.13
##$BF6= 200.13
##$BF7= 200.13
##$BF8= 200.13
##$BYTORDA= 1
##$CFDGTYP= 0
##$CFRGTYP= 5
##$CHEMSTR= <none>
##$CNST= (0..31)
1 1 145 1 1 1 1 1 1 1 1 1 1 1 1 1 1 1 1 1 1 1 1 1 1 1 1 1 1 1 1 1 
##$CPDPRG= <>
##$CPDPRG1= <>
##$CPDPRG2= <>
##$CPDPRG3= <>
##$CPDPRG4= <mlev>
##$CPDPRG5= <mlev>
##$CPDPRG6= <mlev>
##$CPDPRG7= <mlev>
##$CPDPRG8= <mlev>
##$CPDPRGB= <>
##$CPDPRGT= <>
##$D= (0..31)
0 1.2 0 0 0 0 0 0 0 0.06 0 0.03 0 0 0 0 0.0002 0 0 0 0 0 0 0 0 0 0 0 0 
0 0 0 
##$DATE= 1698057423
##$DBL= (0..7)
120 120 120 120 120 120 120 120 
##$DBP= (0..7)
150 150 150 150 150 150 150 150 
##$DBP07= 0
##$DBPNAM0= <>
##$DBPNAM1= <>
##$DBPNAM2= <>
##$DBPNAM3= <>
##$DBPNAM4= <>
##$DBPNAM5= <>
##$DBPNAM6= <>
##$DBPNAM7= <>
##$DBPOAL= (0..7)
0.5 0.5 0.5 0.5 0.5 0.5 0.5 0.5 
##$DBPOFFS= (0..7)
0 0 0 0 0 0 0 0 
##$DE= 6
##$DECBNUC= <off>
##$DECIM= 32
##$DECNUC= <off>
##$DECSTAT= 4
##$DIGMOD= 1
##$DIGTYP= 9
##$DL= (0..7)
0 120 120 120 120 120 120 120 
##$DP= (0..7)
150 150 150 150 150 150 150 150 
##$DP07= 0
##$DPNAME0= <>
##$DPNAME1= <>
##$DPNAME2= <>
##$DPNAME3= <>
##$DPNAME4= <>
##$DPNAME5= <>
##$DPNAME6= <>
##$DPNAME7= <>
##$DPOAL= (0..7)
0.5 0.5 0.5 0.5 0.5 0.5 0.5 0.5 
##$DPOFFS= (0..7)
0 0 0 0 0 0 0 0 
##$DQDMODE= 0
##$DR= 18
##$DS= 0
##$DSLIST= <SSSSSSSSSSSSSSS>
$$ [...]
##$SUBNAM2= <"">
##$SUBNAM3= <"">
##$SUBNAM4= <"">
##$SUBNAM5= <"">
##$SUBNAM6= <"">
##$SUBNAM7= <"">
##$SUBNAM8= <"">
##$SUBNAM9= <"">
##$SW= 18.05172834244
##$SWIBOX= (0..15)
0 0 2 0 0 0 0 0 0 0 0 0 0 0 0 0 
##$SW_h= 3612.71676300578
##$TD= 16384
##$TD0= 1
##$TE= 0
##$TE2= 300
##$TE3= 300
##$TEG= 300
##$TL= (0..7)
0 120 120 120 120 120 120 120 
##$TP= (0..7)
150 150 150 150 150 150 150 150 
##$TP07= 0
##$TPNAME0= <>
##$TPNAME1= <>
##$TPNAME2= <>
##$TPNAME3= <>
##$TPNAME4= <>
##$TPNAME5= <>
##$TPNAME6= <>
##$TPNAME7= <>
##$TPOAL= (0..7)
0.5 0.5 0.5 0.5 0.5 0.5 0.5 0.5 
##$TPOFFS= (0..7)
0 0 0 0 0 0 0 0 
##$TUNHIN= 0
##$TUNHOUT= 0
##$TUNXOUT= 0
##$USERA1= <user>
##$USERA2= <user>
##$USERA3= <user>
##$USERA4= <user>
##$USERA5= <user>
##$V9= 5
##$VALIST= <valist>
##$VCLIST= <CCCCCCCCCCCCCCC>
##$VD= 0
##$VDLIST= <DDDDDDDDDDDDDDD>
##$VPLIST= <PPPPPPPPPPPPPPP>
##$VTLIST= <TTTTTTTTTTTTTTT>
##$WBST= 1024
##$WBSW= 4
##$XGAIN= (0..3)
0 0 0 0 
##$XL= 0
##$YL= 0
##$YMAX_a= 825950
##$YMIN_a= -966150
##$ZGOPTNS= <>
##$ZL1= 120
##$ZL2= 120
##$ZL3= 120
##$ZL4= 120
##$ABSF1= 10
##$ABSF2= 0
##$ABSG= 5
##$ABSL= 3
##$ALPHA= 0
##$AQORDER= 0
##$ASSFAC= 0
##$ASSFACI= 0
##$ASSFACX= 0
##$ASSWID= 0
##$AUNMP= <proc_1d>
##$AZFE= 0.1
##$AZFW= 0.1
##$BCFW= 1
##$BC_mod= 2
##$BYTORDP= 1
##$COROFFS= 0
##$CY= 11.3945322036743
##$DATMOD= 1
##$DC= 2
##$DFILT= <>
##$DTYPP= 0
##$F1P= 15.7292609196834
##$F2P= 12.9074282941183
##$FCOR= 0.5
##$FTSIZE= 0
##$FT_mod= 4
##$GAMMA= 1
##$GB= 0.15
##$INTBC= 1
##$INTSCL= 1
##$ISEN= 128
##$LB= 0.24
##$LEV0= 0
##$LPBIN= 0
##$MAXI= 10000
##$MC2= 0
##$MEAN= 0
##$ME_mod= 0
##$MI= 1.114404
##$NCOEF= 0
##$NC_proc= 0
##$NLEV= 6
##$NOISF1= 3.799351
##$NOISF2= 2.8
##$NSP= 1
##$NTH_PI= 0
##$NZP= 0
##$OFFSET= 15.70392
##$PC= 1
##$PHC0= -23147.49
##$PHC1= 11.2527
##$PH_mod= 1
##$PKNL= yes
##$PPARMOD= 0
##$PSCAL= 0
##$PSIGN= 0
##$REVERSE= no
##$SF= 200.130013532006
##$SI= 16384
##$SIGF1= 3
##$SIGF2= 2
##$SINO= 400
##$SIOLD= 16384
##$SREGLST= <1H.CDCl3>
##$SSB= 0
##$STSI= 0
##$STSR= 0
##$SW_p= 3612.71676300578
##$SYMM= 0
##$S_DEV= 0
##$TDeff= 0
##$TDoff= 0
##$TI= <>
##$TILT= no
##$TM1= 0
##$TM2= 0
##$TOPLEV= 0
##$USERP1= <user>
##$USERP2= <user>
##$USERP3= <user>
##$USERP4= <user>
##$USERP5= <user>
##$WDW= 1
##$XDIM= 8192
##$YMAX_p= 0
##$YMIN_p= 0
$$ End of Bruker specific parameters
$$ ---------------------------------
##NTUPLES= NMR FID
##VAR_NAME=  TIME,          FID/REAL,        FID/IMAG
##SYMBOL=    X,             R,               I
##VAR_TYPE=  INDEPENDENT,   DEPENDENT,       DEPENDENT
##VAR_FORM=  AFFN,          ASDF,            ASDF
##VAR_DIM=   8192,          8192,            8192
##UNITS=     SECONDS,       ARBITRARY UNITS, ARBITRARY UNITS
##FACTOR=    0.0002768,     1,               1
##FIRST=     0,             0,               0
##LAST=      2.2672688,     0,               0
##MIN=       0,             -966150,         0
##MAX=       2.2672688,     825950,          0
$$ Real data points
##PAGE= N=1
##DATA TABLE= (X++(R..R)), XYDATA
0@%%%%%%Qq%%%qJ6j6J6j6K4l2L5m2M7n5O7p7Q7r8J12j28J46j67J89k12K37k65
$$ 0 0 0 0 0 0 0 8 0 0 0 0 -8 8 -8 8 -8 16 -16 19 -23 24 -31 36 -41 46 -52 60 -68 78 -89 100 -112 125 -140
34a40K98l33L69m08M49m95N49o09O71p34Q04q86R77j073J176j291J423j572J738
$$ -140 158 -175 194 -214 235 -260 289 -320 351 -383 421 -465 512 -561 615 -676 747 -825 913
53I13j926K138k385K679l028L448l965M617n466O609q207J0569j4319K0903l4377
$$ 913 -1013 1125 -1260 1419 -1609 1839 -2126 2491 -2975 3634 -4573 5996 -8323 12580 -21797
68b1797P0827l19185o95995J572169j70123j227720J110997K28262j262838O64020
$$ -21797 49030 -270155 -966150 606019 435896 -791824 319173 547435 -715403 -51383
78e1383O86323r09872J35166M74901o13229J82716N01265n29983l4090L38912
$$ -51383 634940 -274932 -139766 335135 -278094 -95378 405887 -124096 -158186 180726
88A80726l52905J33459L49491m50133m3613L26147k45301J01970K29065m40191
$$ 180726 -172179 -38720 310771 -139362 -182975 143172 -102129 -159 228906 -211285
98b11285P7871L61443l87731J13231M00202o12880m5706P37383m18791l50748
$$ -211285 -133414 228029 -159702 -46471 353731 -259149 -304855 432528 13737 -337011
108c37011O46856k76377m47363P00054l4644o19598M48603J14950n04745M28156
$$ -337011 309845 33468 -413895 286159 251515 -368083 80520 195470 -309275 118881
118A18881J88246o24586K32997L62230m46131J18749L14472m50206J6677M08468
$$ 118881 307127 -317459 -84462 277768 -168363 -49614 264858 -185348 -168671 239797
128B39797k69797p7525K57377k46830k3801L09354k04354q0873K22322k23321
$$ 239797 -30000 -107525 149852 -96978 -120779 188575 -15779 -96652 125670 -97651
138i7651o581L45304k63800j80239L66528j43040k09615L71802r5131l36478L18844
$$ -97651 -104232 241072 -22728 -202967 163561 20521 -189094 182708 87577 -248901 69943
149F9943O4700l02547K35102O1525l49778K18844K07819l39749P3895K24443k86680
$$ 69943 134643 -167904 67198 128723 -221055 -2211 205608 -134141 -60246 164197 -122483
160a22483L1004K92393k35639j03797K56450j21975r9095K30840r7920j62027
$$ -122483 -91479 200914 -34725 -138522 117928 -4047 -103142 127698 29778 -132249
170a32249J88001l293j15747J26044m3419j16991J51634m671j25073J24469j5276
$$ -132249 55752 52459 -63288 62756 19337 -97654 53980 49309 -75764 48705 33429
181C3429j45778J49859M6580j72660Q8060N8731j52169J04956R1067j95758N0517
$$ 33429 -112349 37510 84090 -88570 -510 58221 -93948 11008 102075 -93683 -43166
192d3166J45414j64314J1553J70443j59735n9751J98471q2878j01674J62518n3493
$$ -43166 102248 -62066 -50513 119930 -39805 -99556 98915 16037 -85637 76881 23388
203B3388j26749J60630J3268j50709R1286M5573j16409O7480N3707j07117L4799
$$ 23388 -103361 57269 70537 -80172 11114 56687 -59722 7758 61465 -45652 -10853
214a0853N1068q0557M4652M7855j02123K7321P4649q0962J1353O6409q5772N760
$$ -10853 40215 -40342 4310 52165 -49958 -22637 52012 -28950 -17597 48812 -36960 -31200
226c1200R0026p8738j8497R5248p1924m0175J13666m3429p4851R4351j3366p4402
$$ -31200 58826 -19912 -38409 56839 -15085 -55260 58406 14977 -59874 34477 21111 -53291
238e3291Q5588J607r1918O8821L2879q7945M2400M7198p9983J7153N5818n5081
$$ -53291 32297 33904 -58014 10807 43686 -44259 -1859 45339 -34644 -17491 38327 -16754
250a6754J943M2376m6682L547M7167m2690p902M3510l1303q827L9263k8416r925
$$ -16754 -14811 27565 -19117 -15570 31597 -11093 -18995 24515 -6788 -15615 23648 -4768 -14693
263a4693L8310l1019j0356M8874l2072k8403N5658j5271m1322M7908j276m7079
$$ -14693 23617 -7402 -17758 31116 -956 -29359 26299 11028 -30294 17614 16338 -30741
275c0741M0618J2650n2478K9162K9341n2321Q860M2855l6404j3419L7770j3527
$$ -30741 9877 22527 -29951 -789 28552 -23769 -14909 27946 -8458 -21877 15893 2366
287B366j8050K1758l299j0940J2389k791n727Q164l411J31M221r830P488R940
$$ 2366 -15684 6074 2775 -8165 4224 1433 -4294 3870 459 590 4811 -5019 2469 12409
301A2409k0855L799K4529k3917j1598L3386j1259k5477K7496J690k8277K1075
$$ 12409 -8446 -4647 19882 -4035 -15633 17753 6494 -18983 8513 10203 -18074 3001
313C001J0163l1426J3712K1676l0119l46L0094j9508j5148K6791k156j9692J5116
$$ 3001 13164 -18262 -4550 17126 -12993 -13339 16755 -2753 -17901 8890 6734 -12958 2158
326B158N585j4895P220R534j2607n19J3133n056j0750R092Q616j2993n942J6432
$$ 2158 7743 -7152 68 9602 -3005 -3524 9609 4553 -6197 2895 11511 -1482 -7424 9008
340I008q43j9241J0007J3943k0095k899K1230j3894j2925K5190n998k5088K4333
$$ 9008 8165 -11076 -1069 12874 -7221 -10120 11110 -2784 -15709 9481 3483 -21605 2728
353B728J1744l3084R218K7961k5082j0310L0706o487k2167J8812P859j8170P231
$$ 2728 14472 -18612 -9394 18567 -6515 -16825 13881 7394 -14773 4039 11898 -6272 959
366I59J1940j4800l201J6934m235j4772Q832J0475j4910n461J8549l821k0806
$$ 959 12899 -1901 -5102 11832 7597 -7175 1657 12132 -2778 -8239 10310 6489 -14317
379a4317J2054J3271j9368k8J6520j6602m802K4945j2460j8731K6173Q21k6852
$$ -14317 -2263 11008 -8360 -8388 8132 -8470 -13272 11673 -787 -19518 6655 7476 -19376
392a9376K1338J5828l1405L798K7021j7176p671K0648j2436j0805K3014k140k0206
$$ -19376 1962 17790 -13615 -9817 17204 28 -7643 13005 569 -10236 12778 10638 -9568
405i568J1663Q248j4847J345J3223o866j2797N243J2970n839j2641R284M157j4399
$$ -9568 2095 10343 -4504 -3159 10064 3198 -9599 -4356 8614 2775 -9866 -582 3575 -10824
419a0824J0941J2753k4942o5K8286j8932j3410L4444j2467l3137L5504J5903l9960
$$ -10824 117 12870 -12072 -12137 16149 -2783 -16193 18251 5784 -27353 8151 24054 -15906
432a5906J0039K3263k7777L984K7864k5943j1538K7741r694j3849K1904m492k1843
$$ -15906 -5867 17396 -10381 -6397 21467 -4476 -16014 11727 2033 -11816 10088 5596 -16247
445a6247J3100J1922o836n117l802M902P203p024L360N604j7257N256K2132j7658
$$ -16247 -3147 8775 1939 -3178 -6980 -2078 5125 -1899 1461 7065 -10192 -4936 17196 -462
459d62o542K2416k1268j0126M1921j3510l9444L3259J0029l4736K4996J3239m4772
$$ -462 -7004 15412 -5856 -15982 25939 12429 -27015 6244 16273 -18463 6533 19772 -25000
472b5000J6075L1338l6231L900L1338l8003q974M8685j5562l0236K4540P93j3928
$$ -25000 -8925 22413 -13818 -9918 21420 -16583 -25557 23128 7566 -22670 1870 2663 -11265
485a1265K0068j303j6711R070M33n36J4572j1827j0829J4695o769J178K1974k7123
$$ -11265 8803 7500 -9211 -141 292 -244 14328 2501 -8328 6367 -402 776 22750 -4373
499d373j9022M1796n062l2376L1416o26m2690L3950K3861m5888J0341K6003m0527
$$ -4373 -23395 18401 13339 -19037 12379 11753 -30937 3013 26874 -19014 -8673 17330 -23197
512b3197J1477M5545m1888k3523M6048q245k2267K8684p103k4768K1667O776j1781
$$ -23197 -11720 33825 -8063 -31586 14462 6217 -16050 12634 5531 -19237 2430 9206 -2575
525b575J2213j0008j5696K3896O100j6418M968n751o197K1887m608j7844J5255
$$ -2575 9638 -370 -16066 7830 13930 -2488 2480 -3271 -9468 12419 7811 -10033 5222
538E222o593j4538L0816j368l3858J9633R728k6927K8375J4079n3649J3990M6971
$$ 5222 -1371 -15909 14907 13539 -20319 -686 9042 -17885 10490 24569 -29080 -15090 31881
551C1881l7742j1911M2550k7532k5696M6535j026l3461J9111P45j9197K6837N001
$$ 31881 -5861 -17772 24778 -2754 -28450 18085 17059 -16402 2709 3454 -15743 11094 16095
564A6095l1669Q421J3153j1491J0095K527j9646R635N978j0513J8015j826l1197
$$ 16095 -15574 -7153 6000 -5491 4604 7131 -12515 -2880 3098 -7415 10600 8774 -22423
577b2423J9388K0890k5032Q089J2592l3755J4907L5947l7629r239L9443k8252
$$ -22423 -3035 17855 -7177 912 13504 -20251 -5344 30603 -7026 -16265 23178 -5074
589e074j7927N1497j3847m4103L3557J0159k8884K5087L406l9789K2234K3849
$$ -5074 -23001 28496 14649 -29454 4103 14262 -14622 10465 13871 -25918 -3684 20165
601B0165l1438O978J8122l0626M844K9608j8600p629J3704j6949O382K5305k1557
$$ 20165 -11273 -4295 13827 -16799 -11955 17653 -947 -8576 5128 -11821 -5439 19866 -1691
614a691j1971K0375r327m30J9791k0010q894K4371j4490n453L1969k4946k7274
$$ -1691 -13662 6713 -2614 -3044 16747 -3263 -12157 12214 -2276 -7729 24240 -706 -27980
627b7980M3103K101l4902K5786K560l6762L0565K1136m3468R548K6295l4354O051
$$ -27980 15123 17224 -17678 8108 10668 -26094 4471 25607 -17861 -8313 17982 -16372 -10321
640a0321L7354l1078j8838L1695n367r980J7621j3856j1919K1656k159q193J0346
$$ -10321 27033 -4045 -22883 8812 3445 -6535 11086 -2770 -14689 6967 4808 -3385 6961
653F961j1344m873J8324p119m155J3115k1452l753L6578j5233k7487K9465k052
$$ 6961 -4383 -9256 9068 1949 -2206 10909 -10543 -14296 22282 7049 -20438 9027 6975
666F975k6236L1278M428l8676J9804J8920l1806J5607K1868l9842J733L8435k1836
$$ 6975 -19261 12017 16445 -22231 -2427 16493 -15313 294 22162 -17680 -15947 22488 652
679F52j3426K4664j5269j0941K8895q162j9594J8203k424j3077J8812J029j8618
$$ 652 -12774 11890 -3379 -14320 14575 6413 -13181 5022 2598 -10479 8333 9362 -9256
692i256O299M216j361Q357r908r718J7794l426j1557J7280n205j9839K0618O369
$$ -9256 -2957 1259 -102 8255 -1653 -11371 6423 2997 -8560 8720 3515 -16324 4294 10663
706A0663k2065J4454O267k7016J7164K1721l1352j910K7580j8692p513K6142j3859
$$ 10663 -11402 3052 9319 -17697 -533 21188 -10164 -12074 15506 -3186 -10699 15443 1584
719A584j6910K4158k440j6520J7731n97k0457J3711J2215j6519k14P388n732K639
$$ 1584 -15326 8832 6392 -10128 7603 7006 -13451 260 12475 -4044 -4258 3130 -2602 37
733C7L034o260K893K26n499Q147J304j0558N971L270q439R736K850j7760Q731
$$ 37 3071 -3189 -296 -70 -5569 2578 3882 -6676 -705 2565 -5874 3862 6712 -11048 -2317
748b317J5180j7969r90J8475j4636p850K1876p185j5327J7273p27j7078J6633
$$ -2317 12863 -5106 -6096 12379 -2257 -10107 11769 4584 -10743 6530 5803 -11275 5358
761E358O297k3014O155J7372j4801n507J4470n728r067J0167K201q043J524L693
$$ 5358 11655 -11359 -5204 12168 -2633 -8140 6330 602 -8465 1702 3903 -4140 -2616 1077
775A077k643n71M412m53o522J784J0042m813r277J0508L348j3582O833J0457j4355
$$ 1077 -1566 -2137 2275 1822 -4700 -2916 7126 2313 -6964 3544 6892 -6690 143 10600 -3755
790c755k250J4840q181o679J3801o342j2240J5449L352j7321O556J0541j3572
$$ -3755 -6005 8835 654 -6025 7776 1434 -10806 4643 7995 -9326 -2770 7771 -5801
803e801R8J2310p328o956R267n36m838N512m7o089L208N596l089l641L265K350
$$ -5801 -5703 6607 -721 -7677 1590 1054 -3784 1728 1681 -4408 -1200 4396 1307 -2334 931 3281
819C281m483J61O614l384p260O624M176q350K425N104r436R46J1347q565p322
$$ 3281 -1202 -1041 5573 2189 -5071 1553 5729 -2621 -196 4908 -4528 -3582 7765 -800 -8122
834h122J2743k106j2122J1541O134j5671K113J2257q605l118J0264n338p139J0453
$$ -8122 4621 2515 -9607 1934 8068 -7603 -5490 6767 -1838 -4956 5308 -30 -7169 3284
848C284J757r649M424N172p821j68R144l594p488M326M473m222r42L680k717l280
$$ 3284 5041 -4608 -184 4988 -2833 -3001 6143 2549 -4939 -613 3860 -362 -1304 2376 -341 -3621
864c621M826K438n925J63M547m476q86Q157l118r437O647O657q145Q8O656o528
$$ -3621 1205 3643 -2282 -2119 2428 -2048 -2934 5223 2105 -7332 -685 5972 -2173 -2085 4571 -1957
880a957k130R191k942o440N827k65n757O856L711j0966M32Q713l576l850M995
$$ -1957 -4087 5104 2162 -4278 1549 1284 -4473 2383 6094 -4872 -4440 4273 697 -3153 1842
895A842k056m137M332L084l993j082K105j370M88M161j527n810J757O786k248
$$ 1842 -214 -4351 -19 3065 -928 -2010 95 -1275 -787 3374 1847 -3963 -2206 4580 2332
910B332n141M473J073o555M311O616q577l397Q450k634m499P814k512j0205Q289
$$ 2332 -2809 1664 2737 -3818 493 7109 -1468 -4865 3585 951 -3548 4266 1754 -8451 -162
925a62P922j1372q54Q759o173l402R686j684q643M557L682l541K381J456o482
$$ -162 7760 -3612 -4466 4293 -1880 -5282 4404 2720 -5923 -1366 2316 -1225 1156 2612 -3870
940c870R01P438j468n686J934K802k836j34M617j463o345K329O100l350k530K583
$$ -3870 -2969 4469 3001 -2685 -751 2051 -785 -919 3698 2235 -4110 -1781 4319 969 -1561 1022
956A022k468j922P817j380r185M896N263p040J491P665q719m152J1001m62p420
$$ 1022 -1446 -3368 4449 3069 -6116 -1220 4043 -2997 -1506 6159 -2560 -6712 4289 3827 -3593
971c593M660q4o309P466M628j0849k76R080m440m242Q111j640q541M222O870l514
$$ -3593 1067 983 -5326 2140 6768 -4081 -4357 4723 283 -3959 4152 2512 -6029 -1807 5063 1549
987A549m154J974m3n02L217O34n965q7O424j329m903M805R63q322M581R007q020
$$ 1549 -2605 -631 -674 -1176 2041 2675 -3290 -3377 3047 1718 -3185 1620 2583 -5739 -1158 7849 -171
1004a71n649Q730j480m547P512j535j0007P453O149r525Q05P927q101l309J0684
$$ -171 -5820 2910 1430 -3117 4395 2860 -7147 306 6455 -3070 -2265 5662 -2439 -5748 4936
1019D936r87q874K696L763k656J880J038n059K90N249j263k709J496J193l593
$$ 4936 3949 -4925 -2229 1534 -1122 758 1796 -3263 -2973 2276 1013 -1696 -200 993 -2600
1034b600J354N599k237o495K967N241l536j079L253l596j221O927k193o321N376
$$ -2600 -1246 4353 2116 -4379 -1412 3829 293 -786 2467 -1129 -2350 4577 2384 -3937 1439
1049A439J567p471M423P353r545m327J0266l84p153M207R22n975M450M867p452
$$ 1439 3006 -4465 -42 7311 -2234 -6561 3705 3321 -3832 375 1297 -4678 -228 4639 -2813
1064b813j480P286l724l830P594N29q931K698P556l400m363L190N86j658K090
$$ -2813 -4293 2993 -731 -4561 3033 3562 -5369 -2671 4885 1485 -2878 312 898 -760 1330
1079A330J642l464j299L380K47k658K121R11o111J800P671m328o781O273J374
$$ 1330 2972 -492 -1791 1589 1836 -822 1299 2210 -3901 -2101 5570 1242 -5539 734 2108
1094B108n952M996J542q274M087O400q755J197R105r332m561J4311l054j0915
$$ 2108 -3844 1152 2694 -5580 -1493 4907 -3848 -2651 6454 -2878 -7439 6872 3818 -7097
1108g097P752L598p585M415L174p035J733M638m188K36L295l479j411K768P77
$$ -7097 655 4253 -3332 1083 4257 -2778 -1045 3593 -595 -359 2936 -543 -1954 814 1591
1123A591k7l558j223N815j327m919M948k27o080O748J890r095N789M744j1508
$$ 1591 1564 -1994 -3217 2598 1271 -3648 1300 1073 -5007 1741 3631 -5464 325 5069 -6439
1138f439M671J1223j3278l716J5504n686q831J0881j784q531Q793J255q471N370
$$ -6439 -1768 9455 -3823 -7539 7965 2279 -6552 4329 2545 -5986 2807 4062 -4409 961
1152I61K319p298M141L608n501l5K253q82J943k159k531M658p23l810N086j256
$$ 961 3280 -4018 123 3731 -1770 -1805 448 -434 1509 -650 -3181 1477 754 -3056 2030 774
1168G74m861O393O3o841P152J059j0581P519P376j2624J002R963q121j557R053
$$ 774 -4087 2306 2369 -4472 2680 3739 -6842 677 8053 -4571 -3569 6394 -1727 -3284 5769
1183E769o574l953R251l934n097P859j966o728O037K489m840M52N44J51J971j679
$$ 5769 -805 -4758 4493 559 -4538 3321 1355 -5373 664 3153 -1687 -1235 -691 -540 1431 -248
1199b48o97K417k899K84M833m465j493N967m426l060R716l985r400R763K799j0094
$$ -248 -945 1472 -1427 -1143 3690 -775 -2268 3699 -727 -3787 5929 1944 -7456 2307 5106 -4988
1215d988M895M655q842K651O410p267K21N921n971j023P397l467l893L737R7n55
$$ -4988 -93 4562 -4280 -1629 4781 -2486 -2265 3656 -2315 -3338 4059 592 -3301 436 533 -22
1231b2J178k156O46J856k677J615K470m089Q8L321k965P82L497n952r60Q220m114
$$ -22 1156 -1000 -354 1502 -1175 440 2910 -1179 -1091 2230 -735 47 3544 -2408 -3368 4852 738
1248G38n029O892j227n952N987J533o429L237K323m490K115L903n598r44M622
$$ 738 -4291 2601 1374 -4578 1409 2942 -3487 -250 2073 -2417 -302 3601 -1997 -2941 1681
1263A681m01k780J097J290r42j018J457J712k728j110L201j155j670L676j931
$$ 1681 1280 -1500 -403 887 -55 -1073 384 2096 -632 -1742 1459 304 -1366 2310 379
1278C79m080N161K190p216K943M699o580L7O633l996l589N159p83l414M266k56
$$ 379 -3701 1460 3650 -3566 -623 4076 -2504 -2467 4166 170 -3419 1740 957 -2457 1809 1553
1294A553m523K887K853l958K0K874j565j726J792J185k023q14J534M28j081N12
$$ 1553 -2970 -83 2770 -1188 -1168 1706 141 -1585 207 1392 -631 -1445 89 517 -564 -52
1310e2R03k132M72K931k528j619L628n94m144M073J946n265O80M814l318j519
$$ -52 851 -1281 -809 2122 -406 -2025 1603 1009 -3135 938 2884 -2381 -1701 3113 -205 -1724
1326a724M049k259k849M784Km642K973K780n190J86N305l175l127L577Q75l256
$$ -1724 2325 66 -2783 2001 2003 -2639 334 3114 -2076 -1890 3415 240 -2887 690 1565 -1691
1342a691J477J686k651k3K693j450j693K361K20l158J418L491l158k265L932K47
$$ -1691 -214 1472 -1179 -1202 1491 41 -1652 709 929 -2229 -811 2680 -478 -2743 1189 1436
1358A436l690K034K726l917m33M508k390k530M193l30m565L792K764n332lM734
$$ 1436 -2254 -220 2506 -1411 -1844 2664 274 -2256 1937 1607 -2958 834 3598 -1734 -1737 2997
1374B997k508k502L783j23l716J938J909k399P0J562j940o53K889o95k830J853
$$ 2997 489 -2013 1770 1647 -2069 -131 1778 -621 -551 1011 -929 -1582 1307 612 -2218 -365
1390c65J650k405n12L627j711l398L701J597m554J996L467n308J54O241l471m561
$$ -365 1285 -1120 -1632 1995 284 -3114 587 2184 -2370 -374 3093 -2215 -2061 4180 709 -3852
1406c852O650p0o421M589L249o695P32N600l543k456M505k162l188M263J070m654
$$ -3852 2798 2728 -3693 896 4145 -2550 -1818 3782 239 -2217 2288 126 -3062 1201 2271 -2383
1422b383J078L047k414j575L573K17m069Q20M024j586k695K881L08l619K918K531
$$ -2383 -1305 1742 -672 -2247 1326 1543 -2526 -1706 2318 732 -1963 918 1226 -2393 525 3056
1438C056m539J26L949k875j130M732k795l835M254J491m141J801J188l921J909
$$ 3056 -1483 -1357 2592 -283 -1413 3319 524 -3311 943 2434 -1707 94 1282 -2639 -730
1453g30L437l548j225K799j159j625L309P98l853m93L580N76k839O72J676k359
$$ -730 2707 -841 -2066 733 -426 -2051 1258 2056 -1797 -2290 1290 1866 -973 -301 1375 -984
1469i84K01L901k284l363L069J194l435K825J523n919J182N566l326k697L301
$$ -984 -783 3118 834 -2529 540 1734 -1701 1124 2647 -3272 -2090 3476 150 -2547 754
1484G54j175k731M442P73m477J023K151j906J123K571k983k257K949K209j660
$$ 754 -421 -3152 1290 2063 -2414 -1391 760 -1146 -23 2548 -435 -2692 257 2466 806
1499H06j476P14N18j035J719J603l376j667L741l44j710J930j567l723M450K957
$$ 806 -670 44 562 -473 1246 2849 -527 -2194 1547 1203 -507 1423 -144 -3867 583 3540
1515C540n577j69L400l196N1N123l145m175M212J345k666K749K53n146K286M808
$$ 3540 -2037 -2206 1194 -2002 -1951 3172 27 -4148 64 1409 -1257 1492 1745 -3401 -1115 3693
1531C693k509k894K412k88j709K684J252l295j574K706Q12q71J75r20k145J938
$$ 3693 1184 -1710 702 414 -1295 1389 2641 -654 -2228 478 1290 419 594 -326 -2471 -533
1547e33L467k717l486L251O01k959L455J846o121j34O175k020k286L240k184k914
$$ -533 2934 217 -3269 -18 583 -2376 1079 2925 -3196 -3330 2845 825 -1461 1779 -405 -3319
1563c319N857J301o517J629L169k953O46L488l725k394L461P33j192N88j637j139
$$ -3319 2538 3839 -2678 -1049 2120 -833 -187 3301 -424 -2818 643 1376 184 772 -865 -2004
1579b004K483J312j457j729j2J591N60j608J486k14l467K547L948l777k092L820
$$ -2004 479 1791 334 -1395 -1407 184 744 -864 622 408 -3059 -512 3436 -341 -2433 1387
1595A387j509j272M586k196m794M821J756n071L105J984o095J551N818m207k120
$$ 1387 -122 -1394 3192 996 -3798 1023 2779 -2292 813 2797 -3298 -1747 4071 -136 -2256
1610b256M084l006r67N246j849m640L050K179l061J158J263j722p63J341J706
$$ -2256 1828 -1178 -2145 3101 1252 -3388 -338 1841 -1220 -62 1201 -521 -1284 57 1763
1625A763r40k455Q68K583j912m75K502k950j128M789j670l500L784r1m346L946
$$ 1763 823 -1632 -764 1819 -93 -568 1934 -1016 -2144 2645 975 -2525 1259 1168 -3178 768
1641G68K474n868P49M205l215k51L206l087j699M530j057l010K927N21l250K171
$$ 768 3242 -2626 -1877 2328 -887 -1138 2068 -1019 -2718 1812 755 -2255 672 1193 -2057 114
1657A14J819k182p08J175K96R1n69L00l41n79R36Q05j898k9K250k464n60L656
$$ 114 1933 -249 -957 218 514 605 36 336 -5 -584 352 1157 -741 -770 1480 -984 -1544 2112
1675B112j916l079L859J030m511K077K340l871P76L399k979j196L970j668k503
$$ 2112 196 -2883 976 2006 -2505 -428 1912 -1959 -1183 2216 -763 -1959 2011 343 -2160
1690b160L174Q12l536J274K683k262j117K127mj814J253Q80k068K43K093j526
$$ -2160 1014 1826 -1710 -436 2247 -15 -1132 995 991 -823 430 1310 -758 -515 1578 52
1706E2j747K434M74l044J135K467k677j030K789l1k721J679J248k228O18K302
$$ 52 -1695 739 1213 -1831 -696 1771 -906 -1936 853 822 -1899 -220 1028 -1200 -582 1720
1722A720k234j092L338p82k994K561J620l178K95L647k918j932L858j232k435
$$ 1720 -514 -1606 1732 950 -2044 517 2137 -1041 -746 2901 -17 -1949 1909 677 -1758
1737a758L379l34l864K482K603l884k38L362k211j946L864p08k831J619J128j566
$$ -1758 1621 1287 -2577 -95 2508 -1376 -1614 1748 -463 -2409 1455 747 -2084 -465 663 -903
1753i03Q52R32j329k15J130O34j091p76J559j64j505J778J303l551K58L498k193
$$ -903 -51 881 -448 -663 467 1101 10 -766 793 629 -876 902 2205 -1346 -1088 2410 217
1770B17k116L776j812k775M496j34m980K888K472m459J141M117m119j428M818
$$ 217 -1899 1877 65 -2710 1786 1652 -3328 -440 2032 -2427 -1286 2831 -1288 -2716 2102
1785B102j253k673L153j47k987K343J582k408o5J460o95o06J152M2j354l04J454
$$ 2102 849 -1824 1329 1182 -1805 538 2120 -288 -353 1107 412 -194 958 1000 -354 -658 796
1802G96J45k104O03J306j880Q8K249j775k056L681m77l193L324R96m648K280L808
$$ 796 941 -1163 -560 746 -1134 -1046 1203 -572 -2628 1053 576 -2617 707 1703 -2945 -665 3143
1819C143m032q34M301k384k057M276n90l644K770J245l353J091K346l004p02K578
$$ 3143 -889 -1723 2578 194 -1863 2413 1823 -1821 949 2194 -1159 -68 2278 -726 -1428 1150
1835A150o49j501Q75O00j569K13J178m14j370Q11J110j147k80J883r82j939L068
$$ 1150 501 -1000 -125 475 -1094 -881 297 -117 -1487 -676 434 -713 -993 890 -92 -2031 1037
1852A037Q08l219R63K981l181l65L867k366l011M304j48l686K399J905m278J303
$$ 1037 1845 -1374 -411 2570 -611 -976 2891 525 -2486 1818 1670 -2016 383 2288 -1990 -687
1868f87K911l073j226L450j553k397L513J03l222J735J450j884L7J776j060r83
$$ -687 2224 -849 -2075 1375 -178 -2575 938 1041 -2181 -446 1004 -880 -843 933 -127 -1110
1884a110J777O70j773P7J554o27j212J512Q97k555K26K649k185j503L171q21l349
$$ -1110 667 1337 -436 -359 1195 568 -644 868 1765 -790 -564 2085 -100 -1603 1568 747 -2602
1901b602K900J795m533J205L493l791n79M461k420k895M176J16l561K852J288
$$ -2602 298 2093 -2440 -1235 2258 -1533 -2112 2349 -71 -2966 1210 1326 -2235 617 1905
1916A905l260J202K494k759n83K802j011j696J678M02j832L80J461j064j050R25
$$ 1905 -1355 -153 2341 -418 -1001 1801 790 -906 772 1174 -658 -278 1183 119 -931 -6
1932fR18j521k76J818j221j958L093K52l311J656K739l540k0L935k631k115L863
$$ -6 912 -609 -885 933 -288 -2246 847 1099 -2212 -556 2183 -1357 -1377 2558 -73 -2188 1675
1949A675m45l166K742J229l543J681K362l363k37K712j467j461K339l60k407J665
$$ 1675 1230 -1936 806 2035 -1508 173 2535 -828 -1065 1647 180 -1281 1058 698 -1709 -44
1965d4J200j743l80J024j51j014J297R16k145m75K756j96k529J779J111k819J271
$$ -44 1156 -587 -967 57 -94 -1108 189 1105 -1040 -1515 1241 1045 -1484 295 1406 -1413 -142
1982a42K606k992j442L411m28k209K597k97l330K295J821k610j41K204k656j97
$$ -142 2464 -528 -1970 1441 1013 -1196 1401 1104 -2226 69 1890 -720 -861 1343 -1313 -1510
1998a510L048o98l017J748J417j862O76J214j537j267K427J013k372j21J776q79
$$ -1510 1538 840 -2177 -429 988 -874 -198 1016 -521 -1788 639 1652 -720 -841 935 56
2014E6r99K871o96l314J967K314k654j60K244k609n48L417j092k558J533N39j753
$$ 56 -943 1928 1232 -2082 -115 2199 -455 -615 1629 -980 -1528 1889 797 -1761 -228 311 -1442
2031a442J543J708l178r25L087M3j712J034J78j695J191K286j755j892K224L39
$$ -1442 101 1809 -1369 -2294 793 836 -876 158 336 -1359 -168 2118 363 -1529 695 1034
2047A034j916J614J484l882p9M108j132k450J917k64k563K789J411l556J82K131
$$ 1034 -882 732 2216 -1666 -1745 2363 1231 -1219 698 434 -2129 660 2071 -1485 -1303 828
2063H28j260n63K397j613k281K298J707k065q1Q88p02n31K223L97k934L81K441
$$ 828 -432 -995 1402 -211 -2492 -194 1513 -552 -633 255 -447 -978 1245 1642 -1292 -911 1530
2080A530j015j140K271r80l121L366J974m178L97K798k918l72L589k228k869L819
$$ 1530 515 -625 1646 666 -2455 911 2885 -1293 -896 1902 -1016 -1388 2201 -27 -2896 923
2096I23J19k904K461n5l062J612K736j917j433K102q12k99J329K52j658k41J493
$$ 923 1042 -1862 599 544 -2518 -906 1830 -87 -1520 582 -230 -529 800 1052 -606 -847 646
2113F46O42j408jJ383j926l61L426j611l221K976R94l521J830K467m497R2M376
$$ 646 1288 -120 -121 1262 -664 -1025 2401 790 -2431 545 1539 -1982 -152 2315 -2182 -2090 2286
2130B286k331k109L785j939k502L937M65l803J731K070k494N47J985k025q96K433
$$ 2286 -45 -2154 1631 -308 -2810 1127 1592 -2211 -480 1590 -904 -357 1628 -397 -1293 1140
2146A140k27j198N36L40o65n6R99K33k019j27K585j242j706K419o40k608K510
$$ 1140 913 -285 251 591 -74 -130 869 1102 -917 -1044 1541 299 -1407 1012 372 -2236 274
2163B74J772m132P13L083l029O2L645k846j982L914k93k733K251O17l012J557
$$ 274 2046 -2086 -1373 1710 -1319 -1257 2388 -458 -2440 1474 1181 -1552 699 1316 -1696 -139
2179a39K463k235j395K588p22j438J508K88j944J65J821o47j568J208Q24k028
$$ -139 2324 89 -1306 1282 560 -878 630 918 -1026 -861 960 313 -1255 -47 777 -1251
2195a251M37K196j756j819K873J35k780K255J150l123J114K917k893p37K907j384
$$ -1251 -814 1382 -374 -2193 680 815 -1965 290 1440 -1683 -569 2348 -545 -1282 1625 241
2211B41j295K499p6k682J168J688j869l93J762r95j362J713N55k338M74J427j022
$$ 241 -1054 1445 1369 -1313 -145 1543 -326 -719 1043 48 -1314 399 954 -1384 -910 517 -505
2228e05o55J894m88k142J564J607j842p4J708j241q10K599p40j934J204J051j789
$$ -505 -1160 734 246 -1896 -332 1275 -567 -641 1067 -174 -984 1615 875 -1059 145 1196 -593
2245e93M87J755j720j222J938L70k285J612P00j975JK284j448j913K692j2k318
$$ -593 -106 1649 -71 -1293 645 1015 -1270 342 1042 -933 -932 1352 -96 -2009 683 671 -1647
2262a647J677J446k709j95L166j622j437J967n8j725J815R36k387N29J698j425
$$ -1647 30 1476 -1233 -1428 1738 116 -1321 646 588 -1137 678 1614 -773 -244 1454 29
2278B9n20J647o57j198R31O69j280l34J267l17j264Q07R15j597j46K274j283j691
$$ 29 -491 1156 499 -699 232 901 -379 -713 554 237 -1027 -220 695 -902 -1048 1226 -57 -1748
2296a748K379L60k535J347K080l230L42K952k148j277L099q71k272K248O47k788
$$ -1748 631 991 -1544 -197 1883 -1347 -1005 1947 -201 -1478 1621 750 -1522 726 1373 -1415
2312a415J417J560k358p7K160j322j388K186j72j998J130J083j712j46J429k45
$$ -1415 2 1562 -796 -873 1287 -35 -1423 763 591 -1407 -277 806 -906 -1052 377 132
2328A32j208J234P50j371k47J563j92j645J785O94k780J023J996k084o20K379
$$ 132 -1076 158 908 -463 -710 853 661 -984 801 1495 -1285 -262 1734 -350 -970 1409
2344A409j125j773K745k3k811J629J583k886J60K682k306j206L030n04k276K021
$$ 1409 284 -1489 1256 1233 -1578 51 1634 -1252 -1092 1590 -716 -1922 1108 604 -1672 349
2360C49M09k048Q89J615j605l92J326J92j172O39P68q90q17J746J59k140J032
$$ 349 758 -1290 -401 1214 -391 -783 543 735 -437 202 970 80 -737 1009 1168 -972 60
2377F0J181j628n74K506j919j705L180j20l125K110J638l735R39L338l030q14
$$ 60 1241 -387 -961 1545 -374 -2079 1101 981 -2144 -34 1604 -2131 -1192 2146 -884 -1698
2393a698L474j525k093L033k54k692K148J272k360L16J908j632p10J795m26r47
$$ -1698 1776 251 -1842 1191 937 -1755 393 1665 -695 -379 1529 -103 -813 982 556 -391
2409c91K28Q99l68j040J057K95j621N29J666j728j342K830l61k717K575J098l695
$$ -391 -163 736 368 -672 385 680 -941 -412 1254 -474 -1816 1014 653 -2064 511 1609 -2086
2426b086J619K621l090m9K664j768j578L239p20k766K630O68k588J183J637k262
$$ -2086 -467 2154 -936 -985 1679 -89 -1667 1572 852 -1914 716 1384 -1204 -21 1616 -646
2442f46k55K161j008j441J478M45j605L02J397r99j225J516N43j579L20J659j521
$$ -646 -901 1260 252 -1189 289 734 -871 -569 828 -171 -1396 120 663 -916 -596 1063 -458
2459d58r91K649l38k064J107J458k215L40K336k052q47K421o35j846J884J74k277
$$ -458 -1449 1200 862 -1202 -95 1363 -852 -512 1824 -228 -1075 1346 711 -1135 749 923 -1354
2476a354J313J398k252m3K261j551j253K237o2k281J290J392j792l61J881p84
$$ -1354 -41 1357 -895 -938 1323 -228 -1481 756 694 -1587 -297 1095 -697 -1058 823 39
2492C9j247J482P36j992L39J527o18j218J920m0j702R39J292j825m39J764m16
$$ 39 -1208 274 1010 -982 -643 884 266 -952 968 928 -774 165 1457 -368 -807 957 541
2509E41k027J838L38k152J353J125j825j21K163j453j263K374l07k238J664J205
$$ 541 -1486 352 690 -1462 -109 1016 -809 -930 1233 -220 -1483 891 584 -1654 10 1215
2525A215k423O76J992j803q39K293n68j664J305J049j952J32J972j024j376J388
$$ 1215 -1208 -532 1460 -343 -1182 1111 543 -1121 184 1233 -719 -587 1385 361 -1015 373
2541C73P02j911O09J430j478j040J949k08j736J161J264k556M95J979j298j130
$$ 373 1075 -836 -227 1203 -275 -1315 634 426 -1310 -149 1115 -1441 -946 1033 -265 -1395
2557a395K681p68k220K456N79k521Q72K136k543j26K529j398j690K371J51j985
$$ -1395 1286 518 -1702 754 1333 -1188 -316 1820 -723 -849 1680 282 -1408 963 1114 -871
2573h71Q40R76j691J44J167l18j305Q85Q56j447K53J173j082o14J744k84j538
$$ -871 -31 945 -746 -602 565 247 -1058 -173 683 -764 -511 662 -420 -1034 710 426 -1112
2590a112J200J108j646q9K074j200j509J924L19k089J230J231k255p9K900k027
$$ -1112 88 1196 -450 -539 1535 335 -1174 750 1069 -1020 210 1441 -814 -893 2007 -20
2606b0j306K234n75j280J594M00k092M18J428j089q87J960o13j057R09J098j497
$$ -20 -1326 908 333 -947 647 1047 -1045 -627 801 -288 -1175 785 172 -885 24 1122 -375
2623c75n83J863o51j066J448M47k077N49J658j141r15J728n59j336J799N72k274
$$ -375 -958 905 254 -812 636 1083 -994 -445 1213 72 -843 885 326 -1010 789 1361 -913
2640i13L49J653j759k08K232j452j782K366O38k118N89J278j623j64K285q89j905
$$ -913 -564 1089 -670 -878 1354 -98 -1880 486 1124 -994 -405 873 -750 -914 1371 482 -1423
2657a423J463J044j766Q26J102j510o46J892p4j607Q99M08j293O43J404j730j202
$$ -1423 40 1084 -682 144 1246 -264 -910 982 908 -699 200 608 -685 -42 1362 -368 -1570
2674a570K028k2j225J117L07j946N12K371j687j297J921j94j474J591O41k107
$$ -1570 458 436 -789 328 635 -1311 -799 1572 -115 -1412 509 315 -1159 432 1073 -1034
2690a034K62J756q43p95J298j18j679J349J038j370n81J259l40j005J459r6j811
$$ -1034 -772 984 141 -654 644 526 -1153 196 1234 -136 -717 542 202 -803 656 560 -1251
2707a251Q88J380j428l92J740r96j342J925O89k603J094J522j775r8J857r75j724
$$ -1251 -363 1017 -411 -803 937 -59 -1401 524 1213 -1390 -296 1226 -549 -647 1210 235 -1489
2724a489K243J31j722J125O81j373q8J719j018o69R40M94j518M68Q23j120o67
$$ -1489 754 885 -837 288 969 -404 -492 1227 209 -460 480 974 -544 -76 747 -373 -1040
2741a040J656R6j802Q94J031k071N14K122j610r19J898m03j544J737P84k561Q09
$$ -1040 616 712 -1090 -196 835 -1236 -722 1400 -210 -1129 769 366 -1178 559 1343 -1218 -409
2758d09K020j844o47J947q62j051J808k21j771Q27J001j365O5P45k3j351R79P96
$$ -409 1611 -233 -880 1067 205 -846 962 741 -1030 -203 798 -567 -502 243 220 -1131 -152 644
2776F44r02p95J656l28j388J200Q29j982N48K107k085n63K236r11j685K688l35
$$ 644 -258 -1053 603 275 -1113 87 916 -1066 -518 1589 -496 -1059 1177 266 -1419 1269 934
2793I34k440J527J806k840N32K079j918r56K265n55j730J313N43j207L32P01p37
$$ 934 -1506 21 1827 -1013 -481 1598 -320 -1276 989 434 -1296 17 560 -647 -315 386 -351
2810c51l58J026p8n86P8P99o67m43J187N6j745J050J225j737n4K074j414j348
$$ -351 -709 317 239 -347 -269 530 -137 -580 607 663 -1082 -32 1193 -544 -598 1476 62 -1286
2828a286K430l20k221J726J086k927J263J855k263n40K424j158j261J674j9j555
$$ -1286 1144 824 -1397 329 1415 -1512 -249 1606 -657 -1197 1227 69 -1192 482 463 -1092
2844a092R85J118j891J27J344n82n52Q85L39j109K10J052m65r98P90N10j186M70
$$ -1092 -107 1011 -880 -753 591 9 -543 342 681 -428 -218 834 369 -629 161 671 -515 -45
2862d5J356j744m80J936o51j631J830J95k071R77J442j654l34K000j269j322K602
$$ -45 1311 -433 -913 1023 372 -1259 571 766 -1305 -328 1114 -540 -874 1126 -143 -1465 1137
2879A137m57j921J377J033j921M54J687j747m90J736N2j753R61P32j078p0J271
$$ 1137 680 -1241 136 1169 -752 -298 1389 -358 -848 888 940 -813 148 880 -198 -268 1003
2896A003r97q51R17M08r08j47J006p06o27J350J01j848J020J381j976J28J980
$$ 1003 6 -845 72 480 -428 -575 431 -275 -902 448 549 -1299 -279 1102 -874 -746 1234
2913A234j514j019K475l36j911J731P31k547Q10K358k413m06K096j056j232J754
$$ 1234 -280 -1299 1176 840 -1071 660 1391 -1156 -346 2012 -401 -807 1289 233 -999 755
2929G55l0j920J157Q42j454K34J013p94p87Q49Q53j340o3J173m73o19R85L80j457
$$ 755 725 -1195 -38 804 -650 -416 597 -197 -984 -135 718 -622 -685 488 15 -604 381 761 -696
2948f96L43J451j274o99K023o62j689J906O85k600J030J554k371J83K453k056
$$ -696 -353 1098 -176 -875 1148 486 -1203 703 1388 -1212 -182 1372 -999 -816 1637 -419
2964d19q76K349o76j462R50O98j430O38J203j379n54J370k81q28R23J25n80l18
$$ -419 -1295 1054 378 -1084 -134 564 -866 -228 975 -404 -958 412 131 -697 226 351 -229 -547
2982e47J222k80j030N26R36j350K22J370j147o69J215K20j652J075O77j600J20
$$ -547 675 395 -635 -109 827 -523 -301 1069 -78 -747 468 688 -964 111 788 -812 -692
2999f92K007j804q16K118m23j869J605P73j931M77K005j712n64J612l88j230J371
$$ -692 1315 -489 -1305 813 390 -1479 126 899 -1032 -555 1450 -262 -826 786 398 -832 539
3016E39K89j280K99J023p54q27J110j26j205R44Q51j285j16J038p80n17J360j39
$$ 539 828 -452 -153 870 116 -711 399 273 -932 12 863 -422 -538 500 -280 -797 563 424
3034D24j233P31J091j385l79J594j061q75J848m3j639O65J494j630q8J488r54
$$ 424 -809 -78 1013 -372 -751 843 -218 -1093 755 712 -927 -262 1232 -398 -486 1002 48
3051D8q81J611j55j461P13Q52j375K81J274r44p37J177J53j311Q69N57j292r8
$$ 48 -833 778 623 -838 -125 727 -648 -367 907 -37 -774 403 556 -755 114 671 -621 -719
3069g19J327o26n66J050j78j008N29J081j192m35J280K43j312O04P32j311J91
$$ -719 608 -18 -584 466 288 -720 -191 890 -302 -737 543 786 -526 78 810 -501 -310
3086c10J482j108r88J691l54j570J376Q79k090K82J789j423n83J680m62j460J703
$$ -310 1172 64 -924 767 413 -1157 219 1098 -992 -710 1079 -344 -927 753 291 -1169 534
3103E34K88j589N53R02j000l00J414n72q44J004K63j024J09J050q26n33J160p9
$$ 534 822 -767 -214 688 -312 -612 802 230 -614 390 653 -371 -262 788 -38 -571 589 510
3121E10j185M93J122j577k92J457k40j272J385L33j803Q65J160j200n85J872r14
$$ 510 -675 -182 940 -637 -929 528 288 -984 401 734 -1069 -204 956 -244 -829 1043 129
3138A29j259J953r4j820J344O41j490M47J016q94l86J040r6j128P55M17r99J62
$$ 129 -1130 823 729 -1091 253 894 -596 -149 867 -27 -413 627 531 -597 158 575 -424 -262
3156b62R02m67j048R79K70r32J67J264j130n97J673n91j362J261P46j468J04J713
$$ -262 640 173 -875 104 374 -558 -391 873 -257 -854 819 228 -1134 127 873 -595 -491 1222
3174A222j403o86J772l33j418J228P26j847P56J165j312n88J439m54q41J098R6
$$ 1222 -181 -867 905 572 -846 382 1108 -739 17 1182 -130 -718 721 267 -574 524 620
3191F20j649P07J253j154o09J200j84r27Q09O55j334M3J327r65k28R29J77j411
$$ 620 -1029 -322 931 -223 -832 368 184 -743 66 721 -613 -570 757 -208 -436 493 670 -741
3209g41R87M60j303J08J218o06o42J005K91j920J088J031j415k92J390q79o19
$$ -741 246 706 -597 -489 729 123 -519 486 777 -1143 -55 976 -439 -731 659 -220 -839
3226h39J388k11j361O54J221j488P9J452q30r82J216P63j502R24K70j369M51Q68
$$ -839 549 338 -1023 -369 852 -636 -557 895 65 -917 299 1062 -440 484 754 -615 -164 704
3244G04m72q54P65M38j000K84J044q91n77R19q9r19P73N29j226k33J587j125n99
$$ 704 232 -622 143 581 -419 -135 909 18 -559 360 271 -648 125 654 -572 -805 782 -343 -942
3263i42J256J19j500R42R05j860P28J278j138p31J727n59q70J150K45j514P16
$$ -942 314 433 -1067 -125 780 -1080 -352 926 -212 -943 784 225 -645 505 750 -764 -48
3280d8Q97j283J96P18m15m61P49O1r62J53J047q15n70R96R1q77L64P31r17l84
$$ -48 849 -434 -238 480 65 -396 353 414 -548 -395 652 -163 -733 263 354 -523 -159 572 -345 -729
3300g29J456n94j044J536J78j680P38J268j726J27J380n83j016J476l66j540J328
$$ -729 727 133 -911 625 803 -877 -139 1129 -597 -470 910 327 -689 787 421 -1119 209
3317B09L94j287N53R95j025m60R14j69o94L34M56m09l12O93m4n95M05N40r36M6
$$ 209 603 -684 -131 864 -161 -621 293 124 -570 -236 220 -189 -501 192 148 -447 -42 498 -438 -392
3337c92J349j029n83J265J43j591J309M79j537N39J158j385p02J921m61j331J354
$$ -392 957 -72 -655 610 753 -838 471 950 -587 -48 1110 -275 -977 944 483 -848 506
3354E06M6j222M40R37r32m58J326q05l72Q42K42j292N69Q10p13o61R02N66r63
$$ 506 552 -670 -230 707 -225 -683 643 -162 -534 308 550 -742 -173 637 -76 -737 165 731 -232
3373b32K27P82q40m33J192j71j078R10J54j283N85R62j141m53J593p78p61J323
$$ -232 -5 777 -63 -496 696 525 -553 357 511 -772 -187 775 -366 -819 774 -4 -765 558
3391E58k40j462J087J035j590L50Q62p36n61J333j49j129O70L34n08o2P64n85
$$ 558 318 -1144 -57 978 -612 -262 600 -136 -697 636 487 -642 28 362 -146 -208 556 -29
3409b9m71P64L77j126J06O76l41n13J251o24j203J288O90j397P6J177j074k48
$$ -29 -500 264 641 -485 -379 297 -44 -557 694 70 -1133 155 845 -552 -476 701 -373 -621
3427f21J256m45j081J040L56j251O80J054j103j27J194o28p27Q05l02m54J09R03
$$ -621 635 190 -891 149 505 -746 -66 988 -115 -242 952 324 -403 402 100 -354 -245 658
3445F58p59l27O92k25o48P43M52j103M3J012m00q98J065K6j060R19O40j250j27
$$ 658 -101 -428 264 39 -609 134 586 -517 -474 538 138 -760 305 331 -729 190 830 -420 -547
3464e47J159m31p22J308m80q92Q82N07j146O4J118j100k45Q09J61j122P37L69
$$ -547 612 181 -541 767 287 -605 277 784 -362 -298 820 -280 -525 284 445 -677 60 429
3482D29q66K53P55q00n12R95O26j211j9R74q62l14Q77k11r87Q40O71j108J16J442
$$ 429 -437 -184 571 -229 -741 254 880 -331 -350 624 -238 -552 325 114 -873 -33 638 -470 -354 1088
3502A088j527K00R54m95q07P65K52j039O71N20j039j0R89o50n16R93J40r38L25
$$ 1088 -439 -239 715 220 -587 178 430 -609 62 582 -457 -467 522 -128 -644 349 489 -449 -124
3521a24O32p18n59J127j96o73O16M06j077j6J231l78r82R83J06j143P47R18j361
$$ -124 508 -210 -769 358 162 -511 105 511 -566 -582 649 271 -711 272 378 -765 -18 900 -461
3540d61M2J032q76l30J309n22j035J056L57j173J87R44o71l26R75n60o17N29N79
$$ -461 -419 613 -263 -593 716 194 -841 215 572 -601 -414 530 -141 -467 508 -52 -669 -140 439
3559D39q57J47P97n33m83P61O60j366K75Q57p23n34R89k13j114J275L4j015N79
$$ 439 -418 -271 526 -7 -490 271 931 -435 -160 697 -26 -560 429 216 -898 377 411 -604 -25
3578b5O67j209k54J489p22q36J102J83p63K61O38q28l11R22m85k08O74J51o11
$$ -25 642 -567 -821 668 -54 -890 212 395 -368 -107 531 -297 -608 314 -171 -379 295 446 -165
3597a65J08Q76q50m02O13K01j079J065J47q90J21Q26k13r28P24K54j059M47Q15
$$ -165 -57 819 -31 -433 180 381 -698 367 514 -376 -255 571 358 -570 154 408 -651 -204 611
3616F11j218K19R85p02p10J378k61j136Q28P09j119P6Q34p52n0R64l57p55O12
$$ 611 -607 -388 597 -105 -815 563 302 -834 -6 703 -416 -340 494 -258 -308 656 299 -456 156
3635A56M70r44J38O59n41n13R87r0m50J76J18m07l72J018k32p35Q04J49r54O10
$$ 156 626 -318 -180 479 -62 -575 412 322 -128 48 166 -241 -613 405 173 -562 242 391 -563 47
3655D7N54j002j21J408o35p28O48M13j030Q80M52j001k99R16m10r32J205q8o46
$$ 47 601 -401 -522 886 251 -477 171 584 -446 434 886 -115 -414 502 92 -840 365 277 -369
3674c69M48N93q67k99O81l29k51M96L65j066J97P77m08m24P72M4q09M17O14j036
$$ -369 79 672 -195 -494 187 -142 -393 103 468 -598 -401 376 -32 -456 316 360 -449 -32 582 -454
3694d54%R66m04m91Q92j96r67O87P79j145P2P44o17l00P15J35q70N30N81j255
$$ -454 -454 512 108 -383 509 313 -654 33 812 -333 -261 483 -134 -434 281 416 -454 76 657 -598
3714e98L75O94p85l93R67o6q78Q91K2m41P5O99m83l38M31L67p74L21N12r86pR26
$$ -598 -223 471 -314 -707 260 194 -684 207 229 -212 -137 562 79 -259 172 539 -235 86 598 -388 -395 531
3736E31k43p69M89L72r39L74O52n21m87R35k18j007R00L68j036M68O87r40K22
$$ 531 288 -481 8 380 -559 -185 467 -54 -541 394 176 -831 69 437 -599 -131 556 -384 -162
3755a62O51n07n52P91J18q65N25L55o92J70M06j54l11K64L17q06K04M13k22l50
$$ -162 489 -18 -570 221 339 -526 -1 354 -338 -168 238 84 -227 37 354 -452 -248 165 -57 -407
3775d07N40P5n90K05N84p29k08J064o28m90O90J74q75M81Q94j145J07J081j065
$$ -407 133 208 -382 -177 407 -322 -530 534 -94 -584 106 280 -595 -114 780 -365 -258 823 -242
3794b42n65J364l11o70O96J25n91K99L81q95J11O31l96l01K43J48k04K78J60l28
$$ -242 -807 557 246 -424 272 397 -194 105 486 -409 -298 333 -63 -364 -121 27 -177 101 261 -67
3814f7j24J26N75m07l37R46q88m19J213l32p91P03L48j182N80J122j395j03J178
$$ -67 -191 -65 510 103 -234 712 -176 -595 618 286 -505 198 546 -636 -56 1066 -329 -432 746
3833G46o64q01J274k79p44O50Q4q87M98L51m32l1N50j76m01K82K95qn09M81j34
$$ 746 82 -719 555 276 -468 182 266 -621 -123 228 -204 -235 315 139 -262 20 315 307 -202 279 145
3854A45j57j65M49k32m49Q52k25o52R99jj284R24N03j139J93Q32q13j81J051o26
$$ 145 -12 -177 272 40 -409 443 218 -434 565 564 -720 204 707 -432 -239 593 -220 -401 650 24
3874B4m43P31j14o50L78M66n75p7O36k35n29L84P9m15L76L44l81j4Q3J64k02j93
$$ 24 -419 312 198 -452 -74 392 -183 -260 376 141 -388 -4 75 -340 36 380 -1 -15 68 232 30 -163
3896a63M07k59k78P58j39p89O26K70p75M09N36q16l58Q22l22m66P81J86r04N48
$$ -163 244 -15 -293 465 326 -463 163 433 -342 67 603 -213 -571 251 -71 -537 244 430 -474 74
3916G4L94p75K11O07n05m90R07n2p71N84M47j003J38O83m39l23K49L76n28L24
$$ 74 468 -307 -96 511 6 -484 423 371 -400 184 631 -372 -234 449 10 -313 -64 312 -216 108
3936A08J55n72J2N53r8m43L85J01m43L3L63qm10N47L37p99Q9N40m47j6L47l29
$$ 108 263 -309 -297 256 158 -285 100 201 -242 -209 154 146 -264 283 620 -179 -90 450 3 -13 334 5
3958Ek96O60N8r25N10M36q18J41N97n56k55Q61n68k79N54k3n55M29M33n50k65
$$ 5 -291 369 427 -498 12 448 -370 -229 368 -188 -443 418 -150 -429 125 102 -453 -24 409 -141 -406
3979d06N23l3l68L11K41m63K33J64J31k02j27M11q92L61P85n40n78N80j02q20
$$ -406 117 84 -284 27 268 -195 38 202 333 131 4 415 -477 -116 669 129 -449 131 29 -791
3999g91P96N81j084K25P10p81O0R81o48o30R37j76p53P95O6m34n4M64m06J9L06
$$ -791 5 586 -498 -273 437 -344 -284 697 49 -581 356 180 -573 222 288 -146 -200 264 -142 -123 183
4020A83j85J28j23J32j34J4J75Rn76J44N07k75l85N24j60n53Q03K15r52O15L39
$$ 183 -2 126 3 135 1 15 190 199 -377 -233 274 -1 -386 138 -22 -575 228 443 -509 106 445
4041D45o87j80R47o16l66Q02o01m66R19L5o62M35L86p16l2N29k36k9L39O2k37
$$ 445 -242 -422 525 -91 -457 345 -256 -722 197 232 -430 5 391 -325 -357 172 -64 -93 246 308 71
4062G1l03J34j32k13M87K23j20l05M58k25k37K97K5m46N51O9p91MQ75n14j71P78
$$ 71 -232 -98 -230 -443 44 267 147 -158 300 75 -162 135 160 -286 265 334 -457 -453 422 -92 -263 515
4084E15k65n64O51o8o70N06M25r10J89N70o66m9O38k66m30N42k66qk2M09l20q7
$$ 515 250 -314 337 269 -401 105 530 -380 -191 379 -287 -336 302 36 -394 148 -118 -126 -148 261 -59 -146
4106a46J24K83l88L4J48J73m77N26R4n71J17K76m66M39L47o21j52N39q5m81P64
$$ -146 -22 261 -127 -93 55 228 -249 277 371 -200 -83 193 -273 166 513 -108 -260 279 194 -287 477
4127D77j02m60N1M47n06k76L94r5j73L34J25o00J64O24m00K6L0P1j36L76j12k08
$$ 477 375 -85 -34 413 -93 -369 25 -70 -243 91 216 -384 -220 404 4 30 60 131 -5 371 259 51
4149E1j46N02m93j93M16O4o90N66K24n05L8L49P8n81M90q6j76N8M50n65J3K87
$$ 51 -95 407 -86 -279 137 201 -489 77 301 -204 -166 183 261 -320 170 84 -92 -34 416 -149 -136 151
4171A51j95k02O12no95K61O51p50L59j26j47J7K56L16o38L5K39j49j15J82J04
$$ 151 -44 -246 366 361 -334 -73 578 -172 187 61 -86 -69 187 503 -135 -100 139 -10 -125 57 161
4192A61m44K00J48l76M01O6k95o3K07P8m27K60J19J6j4J92k11n3L09mn41K04M50
$$ 161 -283 -83 65 -311 90 156 -139 -202 5 83 -344 -84 35 51 37 229 18 -35 274 270 -271 -67 383
4215C83o19J65M52n02j99N62k44k91M34J40p29R1P84m87k73M44j7n85L09J01P
$$ 383 -236 -71 381 -121 -320 242 -2 -293 141 281 -448 -357 427 -60 -333 111 94 -491 -182 -81 -74
4236g4k4N26o01j75P80m87j73K08J64l10K55K61m38r1K66L41n23J31L65m06l05
$$ -74 -98 428 -173 -348 432 -55 -228 -20 144 -166 89 350 -88 -179 87 428 -95 36 401 -5 -310
4257c10N68j35o40N53p0l37N37P1n15K05J49M5l54L23P8n24M65P6l33L0M60k90
$$ -310 258 123 -517 36 -34 -371 166 237 -278 -73 76 121 -233 90 168 -356 109 185 -148 -118 342 52
4279E2p2P6L0l6j91K04K0k6P0J58n05L98k89k62L03M32l82j85K73K15n47J67K27
$$ 52 -20 56 86 50 -141 63 83 57 127 285 -220 178 -111 -373 -70 362 -20 -205 68 283 -264 -97 130
4302A30l93J1N69l88n6L47j79k05L58J07m13mL57k32l96O50o3l95J55m7M8M8L53
$$ 130 -263 -252 317 -71 -127 220 41 -164 194 301 -112 -116 241 9 -387 263 200 -195 -40 -87 -39 9 362
4325C62m46l4L29k04j58J36K91j59l17J88J47j78j66M55o3L7p2k03j29L82j09
$$ 362 -84 -118 211 7 -151 -15 276 117 -200 -12 135 -43 -209 246 183 220 148 -55 -184 198 89
4346H9o5K61j9l58j68M38l00j08O97o22L9K51j31k10N8L08l9k90L68j5n80N78
$$ 89 24 285 266 -92 -260 178 -122 -230 467 -155 -116 135 4 -206 -148 160 121 -169 199 184 -396 182
4368A82j8k93lK51j63l04M32o7j58L51M1l96J76J06k20mL75q6l02K73k18j16K60
$$ 182 164 -129 -132 119 -44 -348 84 17 -141 210 251 -145 31 137 -83 -87 288 202 -100 173 -45 -161 99
4391I9K7k72k6O9K82l27J1K48j15j6J30j64k64L96N9l74J58N58o73N1N74m22j92
$$ 99 126 -146 -172 -103 179 -148 -137 111 -4 -20 110 -54 -318 78 137 -237 -79 479 -194 -143 431 9 -183
4414a83L19n6l24K57pm7ro3j52J07P1J48r3L3J89k49j5J47q8j36R5K48j71l35
$$ -183 136 80 -244 13 6 -41 -50 -113 -265 -158 -87 61 -32 1 190 -59 -74 73 -15 -151 -56 192 21 -314
4438c14O76k06m70Q38n05k18Q9N27n08P2K28m32J49K88k91J8J91j92K8K37l86
$$ -314 362 156 -314 524 19 -199 -110 417 -91 -19 209 -223 -74 214 -77 -59 132 -60 -32 205 -181
4459a81K1J84r1J59j6j8r6J09P2MK6k23J60J51l67k8K21k87N8J89J22j83l4K77
$$ -181 -160 24 -67 92 76 58 -38 71 143 147 173 -50 110 261 -106 -134 87 -200 -142 47 169 -14 -48 229
4483B29m02j34L84k42M2K82l12K23KN5p81R15R5l58L4K50k56j56K57k67M8L25
$$ 229 -173 -307 77 -165 -123 159 -153 70 72 127 -654 261 356 -2 32 282 26 -130 127 -140 -92 233
4505B33k09j13L1J15Q1oP7M6m69K37J63j45j52K23j40q0M7J06k01KK96l55K62
$$ 233 24 -89 -58 57 138 132 209 255 -214 23 186 41 -111 112 -28 -108 -61 45 -156 -154 142 -213 49
4528D9J40k36R2J01J85l97K13j3q3k20M00j39j05L0p9j95K23M4J2j34K47k06j14
$$ 49 189 -47 45 146 331 -66 147 134 51 -169 231 92 -13 17 -62 -257 -34 10 22 -112 135 -71 -185
4551a85O9K67k04r5P3j1j50J28K35k99K95J13l77j53N58m65L39K69k94m05O86
$$ -185 -116 151 -53 -148 -75 -86 -236 -108 127 -172 123 236 -141 -294 264 -201 138 407 113 -292 394
4572C94j03l66K37J07m90Q3J87Nj35L14k54j85L61l2K7q3J9j09P0NP1k91J01J45
$$ 394 291 -75 162 269 -221 -138 49 54 -81 233 -21 -206 155 123 150 67 86 -23 47 52 123 -168 -67 78
4596G8j14j68L14j34j56Q1L45l28%L03l51o3M50j92n05M71J19n09J15M65k87j7
$$ 78 -36 -204 110 -24 -180 -99 246 -82 -82 221 -130 -193 257 65 -440 31 150 -359 -244 221 -66 -83
4618h3j0n8J86R3m9k40J49J06j63p7J44o2J5KL01k96j04M69q8l16J62O5m04L42
$$ -83 -93 -151 35 128 79 -161 -12 94 -69 -146 -2 -64 -49 -47 254 -42 -146 323 235 -81 81 146 -258 84
4642H4N6j38k97L46Q6j63J12j09j9j56M77m83k89L48O9J82OJ17n08M59J84m00
$$ 84 140 2 -295 51 137 -26 86 -23 -42 -198 279 -204 -493 -145 -76 106 112 229 -279 180 364 -36
4664c6J8N8J23k25J44J57k75O5K79n00kM16l18K18j82J79m80K63p2K26j04O0K59
$$ -36 -18 40 163 -62 82 239 -36 29 308 -192 -194 222 -96 122 -60 119 -361 -98 -170 56 -48 12 271
4687B71n27K26K41q1j86j93J51L7K59j97j30M87r5k02J34j96o2k26M52Jl21K93
$$ 271 -256 -30 211 130 -56 -249 -98 -61 198 1 -129 358 263 61 195 -1 -63 -289 163 164 -157 136
4709A36o6j25n6K54M0k17k81M42k33j42J80o5j32O01m11j65J20M24l18p6K47j14
$$ 136 70 -55 -111 143 183 -34 -315 127 -106 -248 -68 -133 -265 336 -75 -240 -120 304 -14 -90 157 43
4731D3J4J98k12m2J3J28j07m8K50l48N6K03k51j32M40K1l02K66r1l17K3M95l44
$$ 43 57 255 43 1 14 142 35 -13 237 -111 -55 148 -103 -235 205 226 -76 190 99 -218 -195 300 -44
4754d4O5j39J1M2J33J47K4l02J13J64l61K52J16j23j45J27R4l26K06q6l9J04P9
$$ -44 21 -118 -107 -65 68 215 239 -63 50 214 -147 105 221 98 -47 80 174 -152 54 -32 -71 33 112
4777A12m06N22p7l84J7K50M7j13j66L00p3r1K34j72k9lK48m88L27K29k44K23K1
$$ 112 -294 228 151 -233 -216 34 81 -32 -198 102 29 -62 172 0 -29 -32 216 -272 55 284 40 263 284
4800B84l48QK08J03m83J76J38K15m13J36M8k45L16k35j34K46J38j94j00M14k92
$$ 284 -64 -56 152 255 -228 -52 86 301 -112 24 72 -173 143 -92 -226 20 158 -36 -136 278 -14
4821a4j58J96K15k58j76K85m9J1K12l2m88J76K78n33L28J36j93J32M7k09k7J7
$$ -14 -172 24 239 -19 -195 90 41 52 264 232 -256 -80 198 -335 -7 129 -64 68 115 -94 -121 -104
4843a04L83m40L17r2N1j07J54kk20Q6O8j39j26L18r8o8O3p6J78K43l05j71l8J04
$$ -104 279 -161 156 64 115 8 162 160 -60 26 94 -45 -171 147 49 -19 44 -32 146 389 84 -87 -125 -21
4867b1N5J67q1l0l11N27l47kl2J76j16l1J82k16j6L25m4l54M20j23n6j50O5J67
$$ -21 34 201 120 90 -221 306 -41 -43 -75 101 -15 -46 136 -80 -96 229 185 -169 251 128 72 -78 -13 154
4891A54j39m1J51j48JJ40Kk55J90N8l31L64J08j77k37L40j50k36L31j37j11L1
$$ 154 15 -26 125 -23 -22 118 120 -135 55 113 -218 146 254 77 -160 180 30 -206 125 -12 -123 -92
4913i2J38l28j73Q14n48NL93j5m17L18L41m33p3L13k13k76L59r1K9KK8Q1j40J21
$$ -92 46 -282 -455 359 -189 -184 209 194 -223 95 436 3 -70 243 30 -246 113 22 51 53 81 162 22 143
4937A43r4o4j1J88m13J61P6p1J3J11k00m6P8K2j74L23P4j16J91Rk57K46j52o1
$$ 143 49 -15 -26 162 -251 -90 -14 -85 -72 39 -161 -207 -129 -107 -281 42 116 0 191 200 -57 189 37 -24
4961b4r8K37j32k6j14L74k99k9L17q1j62j44L33j40k28L60k6k91J47o0l4J27K12
$$ -24 -122 115 -17 -43 -157 217 -82 -111 206 125 -37 -181 152 12 -216 144 118 -173 -26 -86 -120 7 219
4984B19l70N2J66K79k77kp2k33L45Q9l35J86j34K76m51J79J13j05J70N3j43K1
$$ 219 -151 -99 67 346 69 67 -5 -238 107 196 -139 47 -87 189 -262 -83 30 -75 95 148 5 26
5006B6N3J55j62j22L03k22j10K35L4j71j22R4m5J0J3j40L3R7R7j73J64L05l71
$$ 26 79 234 72 -50 253 31 -79 156 190 19 -103 -9 -54 -44 -31 -171 -138 -41 56 -117 47 352 -19
5029a9j78J59p6j50L51j99q0K57l0l09R9L93m82M14J9k29j74L49j67J40r5p5K74
$$ -19 -197 -38 -114 -264 87 -112 -192 65 35 -274 -175 218 -264 150 169 -60 -234 115 -52 88 -7 -82 192
5052A92n4j57j37M1K31l25L5J98J78k01q2R3j03N7N7L3r1l6qJ09qQ3j51O1j49
$$ 192 138 -19 -156 -115 116 -209 -174 24 202 1 -81 12 -91 -34 23 56 -35 -71 -79 30 22 105 -46 15 -134
5077a34J75P8j29K85j1l60J19K53m22J87K75m75K54jq0j15K50j67k23K51O6q9
$$ -134 41 119 -10 275 264 -96 23 276 -146 41 316 -159 95 94 14 -101 149 -18 -241 10 76 -13
5099a3j27J97j29L63m48nJ65j35L39m86J95M08l45j18L14j89k64K12N8J43k71
$$ -13 -140 57 -72 291 -157 -162 3 -132 207 -279 -84 324 -21 -139 175 -14 -278 -66 -8 135 -136
5120a36L44l64j12K62J55r8k40J19N3j8K65k77j29J43n2Pm5Ljm6N53l35j81J3
$$ -136 208 -156 -268 -6 149 51 -189 -70 -17 -35 230 -47 -176 -33 -85 -78 -123 -120 -121 -167 386 51 -130 -117
5144a17R7O9k46M78n28J49K65Pl02K0j45M04j35R7q4L4j02O9r5Q3PN9j17J40j39
$$ -117 -20 49 -197 281 -247 -98 167 174 -128 -108 -253 151 16 113 29 63 -39 30 -65 18 25 84 -33 107 -32
5169c2J3J53o6j52J69j14p8P7m1J12k86N19J4l24j37K55n6q3J07m9r3J73j4j52
$$ -32 -19 134 68 -84 85 -29 -107 -30 -71 41 -245 274 288 -36 -173 82 26 -57 50 1 -92 81 67 -85
5193h5p4L88k28m8K45j62j30L03j96r2J70L33n20j9K07J1q9J60j16q5l1J33K4
$$ -85 -159 229 1 -47 198 36 -94 209 13 -79 91 424 -96 -115 92 103 14 174 58 -27 -58 75 99
5216I9R3l21R9J36k43K59l29J07k8K5n5J69k01J87r8N4r5%R1L1R5M7j06R7No4
$$ 99 192 -129 -30 106 -137 122 -207 -100 -128 -103 -158 11 -190 -3 -101 -47 -142 -142 -51 -20 75 122 16 113 118 54
5242E4k10J61r9j6NK82p7j19N9j08k1j0J65o6M1kj80P6lP6L3l28J79K74j14r3
$$ 54 -156 5 -94 -110 -105 177 100 -19 40 -68 -89 -99 66 0 41 39 -141 -65 -68 8 41 -287 -108 166 52 -41
5268d1P9P3j35N8Pj87K96j14Nq0Jj3J1P8r6O3K52l02l3J39k12J47R7P4r5j19K15
$$ -41 38 111 -24 34 41 -146 150 36 41 -39 -38 -51 -40 38 -58 5 257 -45 -78 61 -151 -4 93 167 72 -47 168
5295A68k72M6J1J29k84K76p0j00l37J81M16L1j25J4j37j31L04k17m7K29j01M8
$$ 168 -104 -58 -47 82 -202 74 4 -96 -433 -252 164 195 70 84 -53 -184 120 -97 -144 85 -16 32
5317C2L19l14m62L11M5j75K42P4j84K17N2k68K62l5j63J04k07L98l58J90j45L09
$$ 32 351 37 -425 -114 -69 -244 -2 72 -112 105 157 -111 151 116 -47 57 -150 248 -110 80 -65 244
5339B44j58l02Q6J17K0k27J74l8J46m0j58J10P8N1l00J37K07M3j38Q6m49K09K95
$$ 244 86 -216 -130 -13 7 -220 -46 -84 62 22 -136 -26 52 103 -197 -60 147 190 52 138 -311 -102 193
5362A93Pk98O8P2n1K1J20k34P1J35j77l1K59o5Q1k39J40k8k65K92m5l05J97K45
$$ 193 200 -98 -30 42 -9 12 132 -102 -31 104 -73 -104 155 90 171 -68 72 44 -221 71 26 -279 -82 163
5386A63p7l1J10k50n3K81k47lJ80k54K64j26K63k20j57L89j15m84N33j16m13M27
$$ 163 86 55 165 -85 -138 143 -104 -107 73 -181 83 -43 220 0 -157 232 117 -367 166 50 -363 64
5408F4M5j17K38j00l6k24K72j51o3p4K17N7m72K71r3K94k60M1j33K06K11M5l44
$$ 64 109 -8 230 130 94 -130 142 -9 -72 -146 71 128 -344 -73 -166 128 -132 -91 -224 -18 193 238 -106
5431a06K42K2j53j30J20Rl1J59k70o8J89p9Lo5J50j04K45j34q6p5K05%J64j78
$$ -106 136 158 5 -125 -5 4 -27 132 -138 -206 -17 -96 -93 -158 -8 -112 133 -1 -87 -162 43 43 207 29
5455B9p1L8j5k7r8J77j90L51K8k01J81k25J20K9j29k8j13K53j58n2L54m03PJ86
$$ 29 -42 -4 -19 -46 -144 33 -157 194 222 21 202 -23 97 126 -3 -31 -144 109 -49 -101 253 -150 -143 43
5479D3j15k13J29K52n8J84r4j69r4r2M18q8r4J88k30Q8m6n3k24N46j18l25M85
$$ 43 -72 -285 -156 96 38 222 128 -41 -135 -227 191 103 9 197 -33 55 9 -44 -268 278 160 -165 320
5502C20k84p8J42Q7l20P4R6K3l67K35K04n09J91K37j54L2J76J9k97p8L25l7o3
$$ 320 36 -42 100 187 -133 -59 37 60 -307 -72 132 -377 -186 51 -103 -71 105 124 -173 -251 74 37 -26
5525b6J22k29J05O1nL8j71Pn3J95K96m88J11L19k71l6J98q5j14m2Q4j03J08j69
$$ -26 96 -133 -28 33 28 66 -105 -98 -151 44 340 -148 -37 282 11 -25 173 88 -26 -68 16 -87 21 -148
5549a48k4K00Q7Q8k92J77k7j54j31L27r6j30K48J72j87k58K99k82K44pJ22k09
$$ -148 -172 28 115 203 -89 88 61 -93 -224 103 7 -123 125 297 110 -148 151 -131 113 106 228 19
5571A9K4j49l6R0J60J15k52K47j42k91K13k5K4j23J23K28k11K0K75m36K23r7o6
$$ 19 43 -106 -142 -52 108 223 -29 218 76 -215 -2 -27 -3 -126 -3 225 14 34 309 -127 96 -1 -67
5594f7K04j65L61m67J34K56j93m0J14j85q7L43k07j54J65K8j92L61J78n71J99
$$ -67 137 -28 333 -134 0 256 63 23 137 -48 -135 208 1 -153 12 40 -152 209 387 -184 15
5615A5q5J90J80k32J35n7j75P2K69n90M06j10qk7j5k9q5M20P9l62J11J66j40p1
$$ 15 -70 120 300 68 203 146 -29 43 312 -278 128 18 10 -17 -32 -61 -146 274 353 -9 102 268 128 57
5639E7K14k13m85L83o5p4L36K0k5j84K54j94J1r6n8k20N77j07m4M0K8j04j27J87
$$ 57 271 58 -427 -44 -109 -183 153 173 148 -36 218 24 35 -61 -119 -339 238 131 87 127 155 51 -76 111
5663A11n2j29K57k40j30L1L53m8k00J15j21J19m0J41o4j13K07j10j75QJ09j06
$$ 111 59 -70 187 -53 -183 -152 201 153 -47 68 -53 66 26 167 103 -10 197 87 -88 -80 29 -77
5685g7P4K51k12n9J30j54n5K71M5k82K45l7m02R7J26j17N7K23k7Q0j97P2K78o21
$$ -77 -3 248 36 -23 107 -47 -102 169 214 -68 177 140 -262 -165 -39 -156 -99 124 97 177 -20 52 330 -291
5709b91K87J65k51j7J15l2R0R0k43J71R3j3k95J07j7P6L9m5M6j7J16k85q7K54
$$ -291 -4 161 -90 -107 8 -24 66 156 -87 84 177 164 -131 -24 -41 35 74 29 75 58 174 -111 -198 56
5733E6K50n56K04K36n0r3j12L36l47R4OR8l44L48K3q9k6m4K5l9J39j64q5P8Q1
$$ 56 306 -250 -46 190 140 47 -65 271 -76 18 24 122 -222 126 149 60 34 -10 15 -24 115 -49 -134 -56 25
5758B5p1J99p7k22K66J57l11L3L9L3m2J13j86J04j88L70l95J09L50l25k47J84
$$ 25 -46 153 76 -146 120 277 -34 -1 38 71 29 142 -44 60 -128 242 -153 -44 306 -19 -266 -82
5780h2L25m20J28K61l00N9R2j73L9p6J51K42j54o7R1l83L74r8l10N48j26k6j8
$$ -82 243 -177 -49 212 -88 -29 63 -110 -71 -147 4 246 92 25 116 -267 107 9 -301 247 121 95 77
5803G7M0k27J19J31L13n41L75k1l15K3j91K47o2O7j39r0K9L16j54o4R4K01n01
$$ 77 117 -110 9 140 453 -88 287 266 -49 -26 -217 30 -32 35 -104 -194 -165 151 -3 -67 27 228 -273
5826b73L42l8q9j32M74l83K36N3j19k37J33R8j58O7Or5m6L13l3j40N9R0o8k08
$$ -273 69 31 -58 -190 284 -99 137 190 71 -166 -33 65 -93 -26 -20 -115 -161 152 119 -21 38 128 60 -148
5850a48K29J22l5j4k03J13O8q3l12K43J40J08r5k01J74j39J2p8Kj7L26j36l89
$$ -148 81 203 168 154 -49 64 132 49 -263 -20 120 228 133 -68 106 -33 -21 -99 -97 -114 212 76 -313
5873c13L53k74K4J44K41k42M7K49j10k42p3K78r4q5K17j54LK65j14j36J14p2j15
$$ -313 40 -234 -210 -66 175 -67 -20 229 119 -123 -196 82 -12 -97 120 -34 -31 234 120 -16 98 26 -89
5896h9K5K49j03j70K70j68n8R7k55K95k8kj80o5K70k04K4O1K9R6k91M60m26M55
$$ -89 -64 185 82 -88 182 14 -44 53 -202 93 65 63 -117 -182 88 -116 -92 -31 -2 94 -197 263 -163 292
5920B92j0k8p8m45K06j00J04K02m38L39J9j10L7J12l89R4K5K85m18K09J59j96
$$ 292 282 254 176 -269 -63 -163 -59 143 -295 44 63 -47 -10 102 -287 -193 -168 117 -301 -92 67 -129
5942a29O4k1K70k44j8K50j15j29J65j00o4K91j62j91J86K2j58J55j31K52l05R9
$$ -129 -65 -86 184 -60 -78 172 57 -72 93 -7 -71 220 58 -133 53 75 -83 72 -59 193 -112 -13
5964a3o9J32K2J02j96J18N3L0l73J43n6m2J77j24m3J19J7k00J04m5K54j85J7L60
$$ -13 -82 50 72 174 -22 96 149 179 -194 -51 -107 -149 28 -96 -139 -20 -3 -203 -99 -144 110 -75 -58 302
5988C02k97j23%M8Q9P7pJ77l47l5K17k86J82Oj0j4O0p2n0m1K36j41P4j2J01k25
$$ 302 5 -118 -118 -70 19 96 89 266 -81 -116 101 -185 -3 3 -7 -21 39 -33 -83 -124 112 -29 45 33 134 -91
6014i1K62j57P8j63M1n6L55n48J97J85j21l5Q5R2mp8Pj1j13J82O7l65L36k73L09
$$ -91 171 14 92 -71 -30 -86 269 -279 -82 103 -18 -53 32 124 120 42 49 38 -75 107 174 -191 145 -128 181
6039A81k69N2j27o5J52J05K6o4J35K08m80K06j3k76k6K10J02j92K81m6j05Q3n3
$$ 181 -88 -36 -163 -228 -76 29 55 -9 126 334 -146 60 47 -229 -255 -45 57 -135 146 100 -5 78 25
6062B5O0k99N4K08p5K18j79kK32l14J42l20L90j06p9j46PJ30L3L04j51Q5k32j11
$$ 25 85 -214 -160 48 -27 191 12 10 242 -72 70 -250 140 34 -45 -191 -184 -54 -21 283 132 217 -15 -126
6086a26R3L4J58l30O1M9M4o5Q3m1j83L15o5j20N6oj6J55P1k27n4M7L45m04m8J79
$$ -126 -33 1 159 -171 -110 -61 -17 -82 1 -40 -223 92 27 -93 -37 -43 -59 96 167 -60 -114 -67 278 -126 -174 5
6112Ej32j71M79k00k29J97J60k74L14J05l61j3J10P8Q9j82J9O5l68K69k2%K8K20
$$ 5 -127 -298 181 -19 -248 -51 109 -165 149 254 -107 -120 -10 68 157 -25 -6 59 -309 -40 -62 -62 -34 186
6136A86k72r1K00J7%K45j51k00L34k03o6j04M02m23J02L88k69k36M50j89k13K19
$$ 186 -86 -177 23 40 40 285 134 -66 268 65 -1 -105 297 -126 -24 364 95 -141 309 120 -93 126
6158A26K1L2l52K87k16j47J51K20k37j11J47R8OP7j1k09p8L58l10K44k50k1j21
$$ 126 147 179 -173 114 -102 -249 -98 122 -115 -226 -79 19 25 102 91 -118 -196 162 -148 96 -154 -175 -296
6181b96K97P3k13P6J29j16J01r7m4Q3k2N5j68j7K46j67n7L29k63L4J96j56J5J66
$$ -296 1 74 -139 -63 66 -50 51 -46 -90 -7 -29 26 -142 -159 87 -80 -137 192 -71 -37 159 3 18 184
6205A84j2l33OK68J44m34K38J16j36j74K30k78J77L33l51K%K4j06J84N2oL6j28
$$ 184 172 -161 -155 113 257 -177 61 177 41 -133 97 -181 -4 329 -22 -20 -20 4 -102 82 134 128 164 36
6229C6O0j8J35l3l22m1L81k25r4J22p1q3K07Qj68J46j06J27l1q6J30N1n2K39k46
$$ 36 96 78 213 180 -142 -183 198 -27 -121 1 -70 -153 54 62 -106 40 -66 61 30 -56 74 125 73 312 66
6254F6j86K27l15pK20j26L4P7j90m5M01r9m5m9R2n6o8K02k9j28j5J90J58n39J07
$$ 66 -120 107 -208 -215 5 -121 -87 -10 -200 -245 156 57 12 -37 55 -1 -69 133 104 -24 -39 151 309 -230 -123
6279a23J07pj3J76j97j3K45j28k12p3L30j61J01j00j38K94J8Q8l73L06k31J56
$$ -123 -16 -23 -36 140 -57 -70 175 47 -165 -238 92 -69 32 -68 -206 88 106 194 -179 127 -104 52
6301E2nq2L29n05J47Q6n5J88k6l18K61k99K62j74J38n9l5Q9k7Mk3M7k44J7N65
$$ 52 47 -35 294 -211 -64 22 -33 155 129 -189 72 -227 35 -139 -1 -60 -95 -6 -33 -29 -52 -5 -249 -232 333
6326C33l02O0R6k15J21j84L12k42nJ9j71K66l3j71Q3l6M7l14J22J50r5J74k39
$$ 333 31 91 187 -28 93 -91 221 -21 -26 -7 -178 88 55 -116 -33 -69 -22 -336 -214 -64 -159 15 -224
6349b24M51k58N7Q8m8L1l6R8m00L43j19K7o1L12l71Q5J40J39l01J95J00l31M4
$$ -224 227 -31 26 114 66 97 61 159 -241 102 -17 10 -51 261 -110 -25 115 254 -47 148 248 -83 -39
6372c9J0J48m36M13l6k82K82n9n7j77K54j69K43L0Q9r3J07j52r1R0j1O8m5j59
$$ -39 -29 119 -317 96 60 -222 60 1 -56 -233 21 -148 95 125 214 121 228 76 -15 75 64 132 87 -72
6396g2K00k13k6J21j35M6J50K1l60J96J30L5J4j82k10K74k5L86m84K25N1l00n3
$$ -72 128 -85 -111 10 -125 -79 71 92 -268 -72 58 93 107 -75 -285 -11 -36 350 -134 91 142 -158 -211
6419b11K84J0R0q1j78o7R8J03J39N4k8r7k28L9M0R2L15k95l58M50lk21J59r2o3
$$ -211 73 83 173 92 -86 -153 -55 48 187 241 213 116 -112 -73 -33 59 374 79 -279 171 168 -53 106 14 -49
6444d9M3L16l00k55K99J66L3j17l8q0N9j11J74k65M06k56j54K3M8n2J41j57M01
$$ -49 -6 310 10 -245 54 220 253 136 98 18 77 -34 140 -125 281 25 -129 -106 -58 -110 31 -126 275
6467B75l55J69K86l44l88K33J52J07j85j40K30j9k4R2j00J76j18l42J81l1L21
$$ 275 -80 89 375 31 -357 -124 28 135 -50 -190 40 21 -3 89 -11 165 47 -295 -114 -145 176
6488A76j45J75j45k36K31L9j13R9l6j09J13J15j81q8Q9K91l29K7J30l2l31J51
$$ 176 31 206 61 -175 56 95 -18 81 45 -64 49 164 -17 -105 -16 275 -54 -27 103 71 -260 -109
6510a09L0O2j0J02q7J61j92O8k01J66j67J16K3K1j81n8K92k5j76J65O5J81j76
$$ -109 -79 -17 -27 75 -12 149 -43 25 -176 -10 -177 -61 -38 -17 -198 -256 36 11 -165 0 65 246 70
6533G0J48l34qP8n5J23K0R4m04J15K58l19l2L41l10Q7J97j2p8N6k0j32J75j96
$$ 70 218 -116 -124 -46 -101 22 42 136 -268 -153 105 -214 -246 95 -215 -128 69 57 -21 35 15 -117 58 -138
6557a38K43p5K6k0mNJ18l33K08J4N1j09j29K43l18K66K62n32J84K81k92r5J43
$$ -138 105 30 56 36 32 37 155 -178 30 44 95 -14 -143 100 -218 48 310 -222 -38 243 -49 -144 -1
6580aN2k14K39Jk98K78Q7j24k80K65P4L4r0Q3Pl04L24l04m9L01j24l8J09J49j37
$$ -1 51 -163 76 77 -221 57 144 20 -260 5 79 113 23 106 113 -191 133 -171 -220 81 -43 -81 28 177 40
6605D0j13m5LM8L0K01j9k03nL1N1J2J29k56K78k05j83K67Q9j88j9L33O0m76J61
$$ 40 -73 -118 -115 -67 -37 164 145 -58 -63 -32 19 31 160 -96 182 -23 -206 61 150 -38 -57 276 336 -140 21
6630B1M6j48J46o7o4P1J36k24k8K92k37j30J51m6m7j5K00l5j78j63K51Pk8L15
$$ 21 67 -81 65 -2 -66 5 141 -83 -111 181 -56 -186 -35 -81 -128 -143 57 22 -156 -319 -68 -61 -89 226
6654B26l22K33r9k57K89N3j92k84L75K3J98l99K29R3q3p3J28m11K54j2j01k5L05
$$ 226 -96 137 38 -219 70 123 -69 -353 22 45 243 -156 73 166 83 10 138 -273 -19 -31 -132 -157 148
6677A48R3l84N8j2M1j01J38k17K59j24J91P1l21J63J70j28jNj06J41k55J13P1
$$ 148 241 -143 -85 -97 -56 -157 -19 -236 23 -101 90 161 -160 3 173 45 44 49 -57 84 -171 -58 13
6700A3J75j81k81K95O0l21M23R6m77K69k19O5J26j01n5J56J47m38lM03q6N2k16
$$ 13 188 7 -274 21 81 -240 183 279 -198 71 -148 -83 43 -58 -113 43 190 -248 -251 152 66 118 -98
6723i8J02J70k91k14N00m17L61q4j69K57J3N2n59M65O9k5j85M2K04m68K58Q4K7
$$ -98 4 174 -117 -331 169 -248 113 29 -140 117 130 182 -377 88 157 132 -53 -11 193 -275 -17 67 94
6746I4l2K9m9P5J3p7K45q7j89m6J3R9k99RK19K7k1J26j91J46j61K3M9j87L15l
$$ 94 62 91 42 117 130 53 298 211 22 -24 -11 88 -211 -202 17 44 23 149 -42 104 -57 -34 15 -172 143 140
6772A40j76K13l42K14r2O8m62M16M4J70o1N4J24l71J09K8j15m9J50k3k2R7O4k64
$$ 140 -36 177 -165 49 -43 25 -437 -21 23 193 132 186 310 -61 48 76 -39 -88 62 39 17 114 178 -86
6796h6J15k07J88m5J5Oj0r3J93l54J71O0J85l62K25k2J22m1K3k27J1J77J68k07
$$ -86 29 -178 10 -35 -20 -14 -24 -117 76 -278 -107 -47 138 -224 1 -21 101 60 83 -144 -133 44 212 5
6820EJ6nN1N6J7m4M0J17k43j60J25J44j45k8m9K76l22M09j62o8nr3K00k2l76L60
$$ 5 21 16 67 123 140 96 136 253 10 -150 -25 119 -26 -54 -103 173 -149 260 98 30 25 -68 132 110 -266 94
6846I4N4Q0O4l43m3K6J47j07m8K12k32j0P5M9R1j47J9o1rp5J93O5J74l64J39l6
$$ 94 148 228 292 -51 -94 -68 79 -28 -76 136 -96 -106 -31 18 109 -38 -19 -80 -89 -164 29 94 268 -96 43 7
6872Gm5lJ92k74J80l06N85n00J31K72j94j94M41m03O7l3M2N7j71L05j90pk6P8
$$ 7 -38 -41 151 -123 57 -249 336 -164 -33 239 45 -149 292 -111 -44 -77 -35 22 -149 156 -34 -41 -67 11
6896A1R1r7J25j60j89M74m13J43j00ko3K34j30k54L70N2J16j01n8k25L04l0j04
$$ 11 102 5 130 -30 -219 255 -158 -15 -115 -117 -180 54 -76 -330 40 92 208 107 49 -176 128 98 -6
6919fN2o2K12j16n4m2p1J45j54J74j05j99L37p5J79n4K4k26k99K30K49j37j1K4
$$ -6 46 -16 196 80 26 -16 -87 58 -96 78 -27 -226 111 36 215 161 185 -41 -340 -110 139 2 -9 15
6943A5J06j53K99k26n5j03J4L00k74j53J90K8K33j92k44M19k09j52K8K39j83K51
$$ 15 121 -32 267 41 -14 -117 -103 197 -77 -230 -40 -12 221 29 -215 204 -5 -157 -129 110 -73 178
6965A78k25jJ56j64K98k48J59j77j32K30Kk11M4K39m32M20j2l01J38P0k23M84
$$ 178 -47 -48 108 -56 242 -6 153 -24 -156 74 76 -135 -91 148 -284 136 124 -177 -39 31 -192 292
6987B92l53J53Q2n59L6J27K0j36L34j30o4M6J16L5j9j89R9J53K9k09K93K5k73
$$ 292 -61 92 174 -385 -349 -222 -202 -338 -4 -134 -198 -152 -36 -1 -20 -209 -110 43 72 -137 156 181 -92
7010i2q5J3K62k96L92o7l33K94r7J37m1P6k52o2N3R8p7p1L07k16J5k8J84M2J03
$$ -92 -177 -164 98 -198 194 127 -206 88 -9 128 87 163 -89 -151 -98 0 -77 -148 159 -57 -42 -70 114 156 259
7035B59l44J30k33K72p2j24m6M7M88k45j64r8J84K7l14K19R6J47k31o0J95l2k69
$$ 259 -85 45 -188 84 12 -112 -158 -111 377 132 -32 -130 54 81 -233 -14 82 229 -2 -62 133 101 -168
7058a68J44M3J9K18k12K0k86K56n2k7K12l85J63nJ29j21O1Q8j35k00L11j31j27
$$ -168 -24 19 38 256 44 64 -222 34 -18 -45 167 -218 -55 -60 69 -52 9 97 -38 -238 73 -58 -185
7081a85J35J61j32LK44l2l62J34J05k3j30N5l5k6K61k30l3J11j71J17j30K37k0
$$ -185 -50 111 -21 -18 226 194 -168 -34 71 48 -82 -27 -62 -88 173 -57 -90 21 -150 -33 -163 74 54
7104E4j07J11o6R2k67K37o7J99k15J14M5o1k14J78l0jj23L36j74k91K76J58l18
$$ 54 -53 58 -8 84 -183 54 -13 186 -29 85 130 69 -145 33 3 2 -121 215 41 -250 26 184 -134
7127a34R5J71k65J96M3k10J31K57l42K5J9k26Q0j8n1M66J0m0l33J70j69P1J90
$$ -134 -39 132 -133 63 106 -104 27 284 -58 -33 -14 -240 -160 -178 -229 237 247 207 -126 44 -125 -54 136
7150A36J81m86J56n8k51L31n1L1J22k40O8J28Pm4k07K43j86J02J45m4j94J38m8
$$ 136 317 -169 -13 -71 -322 9 -42 -11 111 -129 -61 67 74 30 -177 66 -120 -18 127 83 -111 27 -21
7173b1nL4j26K25O7j14r8%J86j7J54p3m64K06J29m2k58N2L23k49R7K25l97J1J74
$$ -21 -26 8 -118 107 174 60 -38 -38 148 131 285 212 -252 -46 83 41 -217 -165 158 -91 6 231 -166 -155 19
7198A9L20k76O8j13j14J97l1k60J54K13j18j5p0RJ24M0j07K0J14m29J05K74j25
$$ 19 339 63 131 18 -96 101 70 -190 -36 177 59 44 -26 -17 107 147 40 60 174 -255 -150 124 -1
7221aJ00k0o4N9M0J37j36j85J42k07RJ27L4p8J59J2n0j98P2J1J42k33j39K35N9
$$ -1 99 79 15 74 114 251 115 -70 72 -135 -126 1 35 -43 116 128 78 -120 -48 -37 105 -128 -267 -32 27
7246B7J72l55K01N1j80l5L10l09l2K82j53J37j73N5J02J01j6m67L22r2j8K45j73
$$ 27 199 -156 45 96 -84 -119 191 -118 -150 132 -21 116 -57 -2 100 201 185 -282 40 -52 -70 175 2
7269BK29j55j48J43l8j03L1J49J02j29j95j92N45k65N5p7N7j00%m0J24Q6J9j0
$$ 2 231 76 -72 71 33 -70 -39 110 212 83 -112 -304 241 -24 31 -46 11 -89 -89 -129 -5 81 100 90
7293I0j60r8K93j5k03J84Rj58l0M10l68j19J3L40k12q6L47j48j84J77k02J19q9
$$ 90 -70 -168 125 110 -93 91 100 -58 -88 322 -46 -165 -152 188 -24 -110 237 89 -95 82 -120 -1 -90
7316i0L0J48k77R3L37m66L31Pj94K83j32k27J02j31L34j39r6j21J48J32Lkk64
$$ -90 -60 88 -189 -96 241 -225 106 113 -81 202 70 -157 -55 -186 148 9 -87 -208 -60 72 75 73 -191
7339a91J94J04J62k16K75n28J17J50j79K26j90N4J05k24K00n6Q0j03K16j05J1
$$ -191 3 107 269 53 328 -200 -83 67 -112 114 -76 -22 83 -141 59 3 83 -20 196 91 102
7360A02K3r6J57m39R4J32m2n9J12j30K13J19j02j83J80j36J54j56J84n7n1m4J3
$$ 102 125 29 186 -253 -159 -27 -69 -128 -16 -146 67 186 84 -99 81 -55 99 -57 127 70 19 -25 -12
7383a2K4o4j0M9J04k28K28kk67J57K08m66K97j14K87l31Q7j3O9J4l3J78p6K5K5
$$ -12 12 -52 -62 -13 91 -137 91 89 -178 -21 187 -279 18 -96 191 -140 -53 -66 3 17 -16 162 86 111 136
7408A36k15K5L2K2K23j23k63R2J92j59J86k8J2q0N4M0O5m4j31P1j96J57M0l74
$$ 136 -79 -54 -22 0 223 100 -163 -71 121 -38 148 120 132 52 106 146 211 167 36 107 -89 68 108 -266
7432b66K96j69K84k13Q6O6j17j44L51k38J58K12l99J22k11L74l98N0n3K44Q8J00
$$ -266 30 -139 145 -68 18 84 -33 -177 174 -64 94 306 -93 29 -182 192 -206 -156 -209 35 123 223
7454B23j86q2j71L47k33j33J67k39K84K43N8j89n7j0j3J1l7R4n6lj51LJ26l4Q8
$$ 223 37 -45 -216 131 -102 -235 -68 -307 -23 220 278 89 32 22 9 20 -17 77 21 18 -133 -130 -4 -38 50
7479E0j70J18N8j00P3j14m0J55j90L38k97J93k10kL24j46P6k01J08p1k01K53R9
$$ 50 -120 -2 56 -44 29 -85 -125 30 -160 178 -119 74 -136 -138 186 40 116 -85 23 -48 -249 4 103
7502A03No7MJ15k18J44l8r0P3O3k2J30j14p9M2l66L63J1n2n8m0L90m91K6L2RN9
$$ 103 108 41 45 160 -58 86 48 -42 31 94 72 202 88 9 51 -315 48 59 7 -51 -91 299 -192 -166 -134 -125 -66
7529f6N8l4j38K43k50p1J61K31P3l55O2L4J4R7j82J76k09J74j57M8K76n4m23K48
$$ -66 -8 -42 -180 63 -187 -258 -97 134 207 -148 -86 -52 -38 59 -123 53 -156 18 -139 -91 185 131 -292 -44
7553d4M2J4m0n8r2K18L4j60J70q4J87j85M8j02J67j26O0J5j81K14K2j28k8r7Q1
$$ -44 -2 12 -28 -86 -178 40 74 -86 84 0 187 2 50 -52 115 -11 49 64 -117 97 119 -9 -37 -134 -53
7578e3p7O8j9Q8j31K06O2k99j14L54j49l7J78J52k63p8J38L7j34J47JL3j37J13
$$ -53 -130 -62 -81 7 -124 82 144 -155 -269 85 -64 -101 77 229 -34 -112 26 63 -71 76 77 110 -27 86
7602H6K5J5m47L86q0N3j5J26j72R7j95J24J07j12K5l3J44l16L41j78k85L36J03
$$ 86 111 126 -321 65 -15 38 23 149 -23 74 -121 3 110 -2 23 -10 134 -182 159 -19 -304 32 135
7625A35r7N7j16J66j45mL25m60J77j28k2J74j89J51J17j17q5l80K83K57q1m8K37
$$ 135 38 95 -21 145 0 -4 321 -139 38 -90 -112 62 -127 24 141 24 -61 -441 -158 99 18 -30 207
7648B07j34L3l34J55o1J83M14o48J46O9J02j89J70j62K14k47m5P8l06M03o7K34
$$ 207 73 106 -228 -73 -134 49 463 -185 -39 30 132 -57 113 -49 165 -82 -127 -49 -355 48 -19 215
7670B15j83n5J77k71L08o6j80J53j58K48j40Q1k20k6M9o7K66k07J09J26m1j06
$$ 215 32 -23 154 -117 191 125 -55 98 -60 188 48 129 -91 -117 -68 -135 131 -76 33 159 118 12
7692A2j3j87L79l3l86K61n5k58N95j90Qm7k24K98p1J90k77l4J42n3r3j75L42p4
$$ 12 -1 -188 191 158 -228 33 -22 -280 315 125 133 86 -138 160 89 279 2 -32 110 57 -36 -211 131 57
7716E7jk14J65K6n9K33l64L4K54j20r8Q0j31K12J61j22k54K04L8k14K76l63K47
$$ 57 56 -158 7 33 -26 207 -157 -123 131 11 -87 -7 -138 74 235 113 -141 63 101 -113 163 -200 47
7739D7j56J34J44o5Mk73K41k52J53m8j27L83j65j30J37L2J90j83k3K6Kp9K01l08
$$ 47 -109 25 169 104 108 -165 76 -176 -23 -71 -198 185 20 -110 27 59 249 66 43 69 71 -8 193 -115
7763a15K50Nk00Q9n5k67K46J0J45j11R4j39J02l4LP8j07N5j66k14L91L4O1j34
$$ -115 135 140 -60 29 -26 -293 -47 -37 108 -3 91 -48 54 20 23 101 -6 49 -117 -331 60 94 155 21
7787B1M7o5j20L03k90j74L96j57o3q0K52K6j33J00j94K28j30j03R6K14j10rK4
$$ 21 68 3 -117 186 -104 -278 118 -39 -102 -182 70 96 -37 63 -131 97 -33 -136 -40 174 64 55 79
7810G9j65J72l37K99jL3j07%J77l95J69K03j58J75q6o0M5o2J75j28K7j4j71J7
$$ 79 -86 86 -251 48 47 80 -27 -27 150 -245 -76 127 -31 144 58 -2 43 -19 156 28 55 41 -130 -113
7834a13Lp0j5j04M37k85L1K13N7j47j09L11k06M3l62M98R7p0p4k01M01l34k46
$$ -113 -110 -180 -195 -299 138 -147 -116 97 154 7 -102 209 3 46 -316 182 279 209 135 -66 335 1 -245
7857b45K32j82J15j60J36N9K17k48N0l1n9rj76M1K37j11K25k96p9L13j25L25j1
$$ -245 -13 -195 -80 -240 -104 -45 172 -76 -26 -57 -116 -125 -301 -260 -23 -134 91 -205 -284 29 -96 229 218
7880B18l17N8J24k76L58N0l98K31k14J54O4j8O3M0j36j10J20J02K71l93M2j28
$$ 218 -99 -41 83 -193 165 215 -183 48 -166 -12 52 34 97 137 1 -109 11 113 384 -9 33 -95
7902i5K51j13n2j8j8L5J01j85J46K0n8j3K2J87j78m3k75N55k08J02l50J57k87
$$ -95 156 43 -9 -27 -45 -10 91 -94 52 72 14 1 23 210 32 -11 -286 269 61 163 -187 -30 -317
7925c17L07o9J72j25j05K98j7j07LP9j90k32K22J42o5j78J67o1K9m6m8J40j38
$$ -317 -10 -79 93 -32 -137 161 144 37 40 119 -71 -303 -81 61 -4 -182 -15 -76 -47 -93 -141 -1 -139
7948a39L47m68L07r1k0L16l14K46k29Qj5Q5M5N4j18j92N67n38qj49K98M8R1n6
$$ -139 208 -260 47 -44 -64 252 -62 184 -45 -37 -52 33 78 132 14 -178 389 -149 -157 -306 -8 40 131 75
7972G5m4%r4J33p0j64K62k77K39l1k04J20Q6J88j81k18jK14R9n5N7k08O8J70j8
$$ 75 31 31 -63 70 0 -164 98 -179 60 29 -175 -55 31 219 38 -180 -181 33 132 77 134 -74 -6 164 146
7997A46K5l16O6J0J68o4J1j04k27M87q2j71K25k5j11j5j21N2M7J08l3J9N2m3K09
$$ 146 171 -145 -79 -69 99 35 46 -58 -285 202 120 -51 174 149 38 23 -98 -46 1 109 76 95 147 104 313
8022C13m09J41N0k03P7m2L10k39J39p2k17K0J30K33m43K05l3p7K59No1j21l0K44
$$ 313 -96 45 95 -108 -31 -73 237 -2 137 65 -152 -132 -2 231 -212 -7 -40 -117 142 147 86 -35 -65 179
8046A79k29J52j87K02j14K29Jk61P3O9p1j53L33nk82p4K20J2k5k11K38j03j95
$$ 179 -50 102 -85 117 3 232 233 -28 45 114 43 -110 223 218 -64 -138 82 94 69 -142 96 -7 -202
8069b02L1K35k1j0k03j31L31OJ11R2m00K27R5j6Q6k31J81m72J31J37J60l88J98
$$ -202 -171 64 43 33 -170 -301 30 36 147 239 -161 66 161 145 231 0 181 -291 -160 -23 137 -251 -53
8092e3J13k10J97%J06j71M9P6l51K17J41J59l31K49N2k52j59L71l94K64j82L3
$$ -53 60 -150 47 47 153 -18 31 107 -244 -27 114 273 -58 191 243 -9 -168 203 -191 73 -109 -76
8114g6j03L39k24K56j88L8o0j26L5JK45k0l6r9L12j90J74n22K81L8k15L3j14j36
$$ -76 -179 160 -64 192 4 42 -18 -144 -109 -108 137 117 81 -18 294 104 278 -244 37 75 -140 -107 -221 -357
8138c57M61Nnj48l5k58K35M25k93L7P0j87j37K03L1R3j44m1K18l08K08P5k78O1
$$ -357 104 109 104 -44 -79 -337 -102 323 30 67 137 -50 -187 16 47 140 -4 -45 173 -135 73 148 -130 -69
8162f9l5J84j97N7p0K95j88J49Oj36j47M4j01L4L05O0l69j29L92j01Q7k88J01
$$ -69 -104 80 -117 -60 -130 165 -23 126 132 -4 -151 -107 -208 -174 131 191 -178 -307 85 -16 71 -217 -116
8185a16L29j62j52L08j56J3
$$ -116 213 51 -101 207 51 64
8191F4
$$ Imaginary data points
##PAGE= N=2
##DATA TABLE= (X++(I..I)), XYDATA
0@%%%%%%%qJ6j6K4l2M0n7P3r5J19j44J84k25K66l21L84m54N35o26P27q39R68j117
$$ 0 0 0 0 0 0 0 0 -8 8 -8 16 -16 24 -33 40 -55 64 -80 104 -121 145 -176 208 -246 289 -337 390 -449 519 -598
30e98J280j460J662j884K129k402K706l036L396l792M224m699N220n786O403p077
$$ -598 682 -778 884 -1000 1129 -1273 1433 -1603 1793 -1999 2225 -2474 2746 -3040 3363 -3714
46c714P813q622R505j0469J1530j2701J3997j5437J7043j8844K0884k3214K5905
$$ -3714 4099 -4523 4982 -5487 6043 -6658 7339 -8098 8945 -9899 10985 -12229 13676
59A3676k9053L2786l7305M2911n0073N9585p2894R2959j26964J99011n95935O99680
$$ 13676 -15377 17409 -19896 23015 -27058 32527 -40367 52592 -74372 124639 -471296 228384
71B28384N97566j656516Q13313O86938j230822K25152J090509r18910k29214P30138
$$ 228384 825950 -830566 -17253 669685 -561137 -335985 754524 -164386 -393600 336538
81C36538m15406j57709O49031m38440k66906M80132j81788j24132M14163l49340
$$ 336538 -78868 -236577 412454 -25986 -292892 187240 5452 -118680 295483 -53857
91e3857k09104M34103j20401j37512K86587l17010r4735M54913k52247j60671
$$ -53857 -262961 171142 50741 -86771 199816 -117194 -211929 242984 -9263 -169934
101a69934M45667l92417k56001P37252j93158o00520N84308L9239n96056N40216
$$ -169934 275733 -116684 -372685 364567 171409 -429111 155197 194436 -401620 138596
111A38596K23659p26532K75264M00914n28451J79966L81538n84708L0876N42351
$$ 138596 362255 -364277 -89013 311901 -216550 -36584 344954 -239754 -208878 333473
121C33473l81008j26502M19834l24323j58114M77136j69891k64048K99009j05981
$$ 333473 -47535 -174037 245797 -78526 -236640 240496 70605 -193443 105566 -415
131d15j56264L18431j06677k21819K46791p9293j35322L19718j36219k94852L47657
$$ -415 -156679 161752 55075 -166744 80047 754 -134568 185150 48931 -245921 101736
142A01736K3452l17037K84353O2625l90539K30432K19637l44617R6219K00892
$$ 101736 125188 -191849 92504 155129 -235410 -4978 214659 -129958 -33739 167153
152A67153l25471Q6934L06669l09430p2274L08466k01622j03096L17844j50933
$$ 167153 -158318 -71384 235285 -74145 -146419 162047 -39575 -142671 175173 24240
162B4240k14548K72322j5445j92900J99282m598k15351J63748Q3733j69228P9053
$$ 24240 -190308 82014 66569 -126331 72951 68353 -146998 16750 100483 -68745 10308
173A0308L9754j38815J12064O4573j56272P2305O3052j51346R0661J07302j80227
$$ 10308 50062 -88753 23311 87884 -68388 3917 66969 -84377 6284 113586 -66641
184f6641K2761J27839j34714K3924J35528j66693k5124J87509j18010p4153J83698
$$ -66641 -43880 83959 -50755 -26831 108697 -57996 -83120 104389 -13621 -87774 95924
195I5924r5347j25476J97084j3925j63611J36315K4935j57923J20439P5497j70582
$$ 95924 577 -124899 72185 58260 -105351 30964 55899 -102024 18415 93912 -76670
206g6670M6523J05908j15327J6850R3356r9755p679Q9323o6690l499P2370q2394
$$ -76670 -30147 75761 -39566 -22716 70640 -29115 -36794 52529 -14161 -17660 54710 -27684
218b7684j2163R8172o1125l5177Q2354n5370l5010R8529m6525o1437R6012k8721
$$ -27684 -39847 58325 -2800 -37977 44377 -10993 -46003 52526 6001 -55436 40576 11855
230A1855p5132J02505k272j03117P6565L3581r3241N5781M2177r8356L7785O8248
$$ 11855 -63277 39228 36956 -66161 10404 43985 -49256 6525 48702 -49654 -11869 56379
242E6379q6380O734P3595o8545j4937P4801m1934k8796N4465k8853k1319N2769
$$ 56379 -30001 -23267 50328 -18217 -33154 41647 -287 -29083 25382 -3471 -24790 27979
254B7979k7001l0532M8453j3814k9119M0158j1537k7646L8281j0946k7920M4426
$$ 27979 978 -29554 18899 5085 -24034 16124 4587 -23059 15222 4276 -23644 20782
266B0782j1042m2471M8220P795n3044L4906K2159n2324K3454L2863n1376R327
$$ 20782 9740 -32731 15489 23284 -29760 5146 27305 -25019 -1565 31298 -20078 -10751
278a0751M4197m4825j0905N1120k5734k9887M0396k155l0149K0651O099j7928
$$ -10751 33446 -11379 -22284 28836 3102 -26785 13611 11456 -18693 1958 8057 -9871
290i871R506L245j0445P514Q22m929N665n666J055J2402j4682l963K5523j4268
$$ -9871 -365 2880 -7565 -51 771 -4158 1507 -4159 -3104 9298 -5384 -9347 16176 1908
304A908j9842L0974P63l1532K1322J4623l0459J0700K0220k8467J642K8075k4473
$$ 1908 -17934 13040 13803 -17729 3593 18216 -12243 -1543 18677 -9790 -8148 19927 -4546
317d546j1624L2214j1477k4386K4572N904k4751R589J2892j6329J399J3113j0639
$$ -4546 -16170 16044 4567 -19819 4753 10657 -14094 -4505 8387 -7942 -6543 6570 -4069
330d069m184J3508k223j1706P936J0003j0293p072J5232L300j7958N528J7681
$$ -4069 -8253 5255 3032 -8674 -738 9265 -1028 -8100 7132 10432 -7526 -1998 15683
343A5683j5709r079K1561n928j8715K0223L246k7378J5479J8876l0846j845L1599
$$ 15683 -26 -9105 12456 6528 -12187 8036 11282 -16096 -617 18259 -12587 -14432 17167
356A7167j8627k0426K9594J310k7936J4318J5329j9276P67J5713j0982o903J7038
$$ 17167 -1460 -21886 7708 9018 -18918 -4600 10729 -8547 -7780 7933 -3049 -9952 7086
369G086J65j5433O891J3505j1182p983J7172J054k0290Q038J7918j7044p742J8928
$$ 7086 7251 -8182 -1291 12214 1032 -6951 10221 11275 -9015 -977 16941 -103 -7845 11083
383A1083r480j2336K1590m470k4234K0091J0177k8897J0336K2335k8284o230L1595
$$ 11083 1603 -10733 10857 6387 -17847 2244 12421 -16476 -6140 16195 -12089 -18319 13276
396A3276j1504j8156K1197k590j6354K0024M973k2443Q308J5028j3626k375J4626
$$ 13276 1772 -16384 4813 2223 -14131 5893 10866 -11577 -3269 11759 -1867 -4242 10384
409A0384n264j2914O760J2702n164j4125O912R010j2520K484J4485j9554p654
$$ 10384 5120 -7794 -1034 11668 6504 -7621 -709 8301 -4219 -1735 12750 -6804 -14458
422a4458K8275r652k2620K7817Q77l6018K5730K6564m0770k442L4783k0845r478
$$ -14458 13817 4165 -18455 9362 10239 -25779 -49 26515 -14255 -16697 18086 -2759 -12237
435a2237L0438j6573k1001K9568N36k2319J7737L719k3879J0287J7405j1433q599
$$ -12237 18201 1628 -19373 10195 10731 -11588 6149 9868 -14011 -3724 13681 2248 -6351
448f351R71L851O641o014l502P226j0517r53K1877j1899j6226K2677o472j7855
$$ -6351 -5380 -1529 5112 -902 -4404 2822 -7695 -8648 13229 1330 -14896 7781 1309 -16546
462a6546L4179q90m3838K5853K7160l6851Q118K6840l8599J585M1982k9426j5672
$$ -16546 17633 16743 -27095 -1242 25918 -10933 -2815 24025 -14574 -12989 28993 -433 -16105
475a6105L6426k3285k2211M6627m958m2916K1792J5255k1157J1498O179k1253
$$ -16105 20321 -2964 -25175 21452 16494 -26422 -4630 10625 -10532 966 7145 -14108
487a4108O921R629o268Q919n220j4541J5813L324q221J6623j3394k3403L7610
$$ -14108 -7187 2442 -3826 5093 -127 -14668 1145 4469 -3752 12871 -523 -23926 13684
500A3684R383m0287J9371J7784m0287J8486L6409m3919q246L9084k8145q604M6280
$$ 13684 23067 -17220 2151 19935 -20352 -1866 34543 -9376 -17622 21462 -6683 -15287 30993
513C0993k9755l7549M7327P197l6414K0495O711k9908J7543J7053j9148M055J703
$$ 30993 1238 -36311 11016 18213 -18201 2294 9005 -20903 -3360 13693 -5455 -1400 303
526C03j6085J9245J2627k2369M76O257o543J5788J485k2619J0992O834j6439J9382
$$ 303 -15782 3463 16090 -6279 -5803 454 -6089 9699 11184 -11435 -443 6391 -10048 9334
540I334Q126l6118J1023K4297k5835R241K2712m4047p63N4197k7522l1712M3151
$$ 9334 17460 -18658 -7635 16662 -9173 68 22780 -21267 -22030 32167 4645 -27067 16084
553A6084r226l5918M0974J2827m3633J1960J8269k1317J5026J3497l2789K733
$$ 16084 6858 -29060 11914 24741 -18892 -6932 11337 -9980 5046 18543 -14246 -11513
565a1513K4232j2094n05P831j8031M175J4913j2135N560N908k7528J1177K8806
$$ -11513 12719 625 120 7951 -10080 -5905 9008 -3127 2433 8341 -19187 -8010 20796
578B0796k4310p983K1558k2985J102L8873k8220k5200M2000r199l0562M3161K266
$$ 20796 -3514 -11497 10061 -12924 -11822 27051 -1169 -26369 15631 6432 -24130 19031 21297
591B1297n1552K6387K9211l4342R213J7687l6299J0705L4813l0002r361K6665
$$ 21297 -30255 -3868 25343 -8999 214 17901 -18398 -7693 27120 -2882 -12243 14422
603A4422k1145o970L2930j4070k0590J8307o030m641K3680j5398k0721K3316J200
$$ 14422 -6723 -13693 19237 5167 -15423 2884 -3146 -7787 15893 495 -20226 3090 4290
616D290j1747J7157j0429j6988K5344k021j7010K5485r217l2898L6657J7390m2806
$$ 4290 -7457 9700 -729 -17717 7627 5606 -11404 14081 4864 -28034 8623 26013 -16793
629a6793J3103K0706l4198J5201L1907m0806o698L8051k4157j1233L8941k0840
$$ -16793 -3690 17016 -17182 -1981 29926 -10880 -17578 20473 -3684 -14917 24024 3184
641C184l0307L4257O084k2239J3552l323j6504K0235N080j6812P598j996r017
$$ 3184 -27123 7134 13218 -9021 4531 1208 -15296 4939 10019 -6793 805 -1191 -10208
654a0208J7261r44j3377J1941q600r971L1355n120l5110K3902J4170l0380J8500
$$ -10208 7053 6109 -7268 4673 -3927 -13898 17457 12337 -22773 1129 15299 -15081 3419
667C419J7078l8822Q136L1549k8351j856K9341l0383j0980M2760j3111k8229K5772
$$ 3419 20497 -18325 -10189 21360 -6991 -8847 20494 -9889 -20869 21891 8780 -19449 6323
680F323j779j9330K4891P31k6301J4850Q782j7277J2789P253k1326M379J2571
$$ 6323 4544 -14786 10105 10836 -15465 -615 8167 -9110 3679 10932 -10394 -6015 6556
693F556n441K763l624j0875J4859M390j6422J1169L520k0803J4265J4594k3636
$$ 6556 1115 3878 254 -10621 4238 8628 -7794 3375 6895 -13908 357 14951 -8685
706h685L720J6012k2582N355K6730k6228j3032L1942r190j8782K4690l806k3044
$$ -8685 -4965 11047 -11535 -6180 20550 -5678 -18710 13232 4042 -14740 9950 6144 -16900
719a6900K0930P565k1946J1562Q538k1043Q400J7603j6652n748J2437l654j755
$$ -16900 4030 11595 -10351 1211 9749 -11294 -2894 14709 -1943 -7691 4746 1092 -663
732f63M938n670k88M153n010L858L992j0742K096Q114q326L004O861j5220K439
$$ -663 4275 -1395 -1683 2470 -2540 1318 5310 -5432 -3336 4778 -3548 -544 6317 -8903 -6464
747f464J8558j4297r162J9813o810j4249K0008M87k0097J3602Q040j8427R713
$$ -6464 12094 -2203 -11365 8448 1638 -12611 7397 7884 -12213 1389 9429 -8998 715
760G15J2523k1035K90K1547j1896j2081J5960j072j1866Q445M996j0097n1N866
$$ 715 13238 -7797 -7507 14040 2144 -9937 6023 4951 -6915 1530 6526 -3571 -3622 2244
774B244k402k349L330k58n081O69Q515l076r835P694O834j1872J970J2774j1135
$$ 2244 -158 -2507 823 565 -4516 -3847 4668 1592 -8243 -549 6285 -5587 -3617 9157 -1978
789a978o802J6049k812j1599J2139M62j4086J1592Q487j7754J943J4191j0961
$$ -1978 -8780 7269 4457 -7142 4997 5459 -8627 2965 11452 -6302 -4359 9832 -1129
802a129n156J3275m611j0287Q913K750p472L099K224o213J818O041l362m341L331
$$ -1129 -6285 6990 2379 -7908 1005 3755 -3717 -618 1606 -4607 -2789 3252 -110 -4451 -1120
817a120L132l716r32N655j183p150N162O376p291j226P402o108k729J1520m825
$$ -1120 2012 -1704 -2636 3019 1836 -5314 -152 6224 -1067 -2293 5109 -999 -3728 7792 2967
832B967j0437J1029K811j3521P307R372j4859j775J4557n946q368R996j401r304
$$ 2967 -7470 3559 6370 -7151 156 9528 -5331 -7106 7451 1505 -6863 3133 1732 -7572
846g572Q616M735j0806J598P857o533k375R200k124q366M324O181m157k772L541
$$ -7572 1044 5779 -5027 -3429 4428 -2105 -4480 4720 2596 -5770 -1446 4735 578 -2194 1347
861A347l87l450L713K984n581j263M986j880l435O610j036r261N272Q034p709
$$ 1347 960 -2490 1223 4207 -1374 -2637 2349 469 -2966 3644 2608 -6653 -1381 6653 -1056
876a056l249P761l575m560Q586k52q484M642L616o515L896N158r356j854J0154
$$ -1056 -4305 3456 -119 -4679 3907 3655 -4829 -187 3429 -3086 810 5968 -3388 -5242 4912
891D912j747o948M516Q84m985L506L695m825k373L099j2o87K719j409m589J525
$$ 4912 3165 -3783 733 1617 -3368 138 3833 -992 -3365 -266 -278 -965 1754 345 -4244 -2719
907b719O543j600o317L319L492n258J258P242o560n247Q898Q63o859N219J072
$$ -2719 3824 2224 -4093 -774 2718 -2540 -1282 5960 -600 -5847 3051 3914 -2945 2274 3346
922C346r478N754R438j0270m720J0303k831o500Q356N13r797L413O193m393n51
$$ 3346 -6132 -378 9060 -1210 -5930 4373 1542 -4958 3398 3911 -5886 -2473 3720 -673 -1224
937a224K698n002OP098j000o666K036L799j808j475L882p87n613K454O444k966
$$ -1224 1474 -3528 -3522 3576 2576 -4090 -2054 1745 -63 -1538 2344 1557 -4056 -1602 4842 1876
953A876m574K999N9k298N521K56r167L166P840o716j625P731n716o396J0324K313
$$ 1876 -2698 301 360 -1938 3583 3839 -5328 -2162 5678 -1038 -2663 5068 -648 -7044 3280 5593
969E593r981K481M136n939M204N983r877k703J0740k021o796O057J134q280L025
$$ 5593 -4388 -1907 2229 -3710 494 6477 -3400 -6103 4637 2616 -4180 1877 3011 -5269 -2244
984b244Q220m355n609K991J839q86J552K37m490n37O124m05n813L247K759p001
$$ -2244 5976 1621 -3988 -997 842 -44 1508 1745 -2745 -3282 2842 2437 -3376 -129 2630 -4371
1000d371K296R319o702q177R008K653p062M606J891r334M873Q755q987l198R331
$$ -4371 -2075 7244 542 -7635 1373 4026 -3036 1570 3461 -5873 -1000 7755 -1232 -4430 4901
1015D901m532o028J0220J125j0742K393O358l138q00J794l687m23N069o26m048
$$ 4901 369 -5659 4561 5686 -5056 -2663 3695 557 -243 1551 -2136 -2559 2510 1884 -2164
1030b164J191J701k567m7M557j568o290K724O369l353l464L639j250k383N963
$$ -2164 -973 728 -1839 -1886 2671 1103 -5187 -2463 3906 553 -2911 728 -522 -2905 3058
1045C058k23p303M184M788p112J397P703p270n694J0291K281r575K641M132n792
$$ 3058 2835 -4468 -284 4504 -2608 -1211 6492 -778 -6472 3819 6100 -3475 -834 3298 -2494
1060b494J971O000o734l279P605j454n796N753J703q477J454Q471l142o034K984
$$ -2494 -523 5477 -1257 -4536 3069 1615 -4181 1572 3275 -5202 -3748 4723 1581 -4453 -1469
1075a469K538k065J015J835l128j167L473J070k840J030J818l943O1P288k884
$$ -1469 1069 -996 19 1854 -1274 -2441 1032 2102 -738 292 2110 -1833 -1772 5516 2632
1090B632p838N567M265o590J929L912p555J502P783o942l097R453n598p384J2622
$$ 2632 -5206 361 4626 -1964 -35 3877 -3678 -2176 5607 -1335 -4432 5021 -577 -7961 4661
1105D661Q40j3581N475Q197q352O28N951o295p49O776l169k183L964j941k232
$$ 4661 5501 -8080 -2605 5592 -2760 -2132 3819 -2476 -3225 3551 382 -1801 2163 222 -2010
1120b010L616Q85j471j910j122M926J26o122L196K758o146L432M457q305J231
$$ -2010 1606 2491 1020 -890 -2012 2914 3040 -3082 114 2872 -3274 158 4615 -3690 -2459
1135b459P794r102j76J1730r428p963J5482j143j2685Q995L919j0754N926N530
$$ -2459 5335 -3767 -3943 7787 -1641 -9604 5878 4735 -7950 1045 4964 -5790 136 5666
1149E666r531K418O221p128J408N868n649j873M424o02k16o64k895L580J305m890
$$ 5666 -3865 -1447 4774 -2354 -946 4922 -727 -2600 1824 1222 1006 342 -2553 1027 2332 -2558
1165b558K690J972n940M111L118p509L694M412r225L230R558j0647l311J2386
$$ -2558 132 2104 -3836 275 3393 -4116 -422 3990 -5235 -2005 7553 -3094 -6405 5981
1179E981n028n881R377l106o714Q857m71p613O306J656q021M516M754o063o31
$$ 5981 953 -4928 4449 1343 -5371 3486 3015 -4598 1708 3364 -4657 -141 4613 -1450 -2081
1194b081K790q67J208j134j692K535r49j689M350k300l832N776j174m948P645
$$ -2081 709 -158 1050 -84 -1776 759 -190 -1879 2471 171 -3661 2115 941 -4007 3638
1209C638j99j0511P391O805j0713J311Q081p903q38Q371n656l540P366l759l428
$$ 3638 3439 -7072 319 7124 -3589 -2278 5803 -2100 -2938 5433 -223 -3763 3603 -156 -3584
1224c584O935j629o047M120J729k479J012j054p50K649j425n61L290l188j551
$$ -3584 3351 1722 -4325 -205 1524 -955 57 -997 -1747 902 -523 -1084 2206 -982 -2533
1239b533M539j958j291M096l765k560P619j602p239O079J936o928M147M001o899
$$ -2533 2006 48 -1243 2853 -912 -3472 4147 2545 -4694 1385 3321 -3607 540 4541 -2358
1254b358M75M967m058l62M896m298k922N408L00l846R45J712j288m16J019J391
$$ -2358 -1883 3084 -974 -1336 3560 -738 -3660 1748 2048 -1798 -853 859 -429 -845 174 1565
1270A565k125j596L196L50l065K588L33m326L608L426o323N6O297m874k528P050
$$ 1565 -560 -2156 1040 1390 -1675 913 1246 -3080 528 3954 -2369 -2313 3984 -890 -3418 3632
1286C632j933n916M894J667m529K649J702n175K198M062l892j524L879j165k127
$$ 3632 1699 -4217 677 2344 -2185 464 2166 -3009 -811 3251 -641 -2165 1714 549 -1578
1301a578K117Q94k033o38J585O70j031k99Q24j132l97K647j517k522L232O06m320
$$ -1578 539 1433 -600 -1238 347 1017 -14 -313 511 -621 -1018 1629 112 -2410 822 1428 -2892
1318b892K760L254m914j064N603k329k905L932l81m017L515K309n269J450L904
$$ -2892 -132 3122 -1792 -2856 2747 418 -2487 1445 1064 -2953 562 2871 -2398 -948 2956
1333B956l808j207N134j868m226L252K308l939P08K397k112q92K901m90k737J775
$$ 2956 -852 -2059 3075 1207 -3019 233 2541 -1398 -690 1707 -405 -1297 1604 1114 -1623 152
1349A52J314k945L67L143k005k674L409J240m048J080L365l247j466M207q86l894
$$ 152 1466 -1479 -1112 2031 26 -2648 761 2001 -2047 -967 2398 -849 -2315 1892 1006 -2888
1365b888L258J582m743K279L962m722j543N452j251m276L759J487m172J067L225
$$ -2888 370 1952 -2791 -512 3450 -1272 -2815 2637 1386 -2890 869 2356 -1816 -749 2476
1380B476k402r90K185q50j479K349L40l131R94K523k342j358L170m82l658K334
$$ 2476 74 -916 1269 419 -1060 1289 1629 -1502 -508 2015 -327 -1685 1485 1003 -2655 -321
1396c21K932m389j05M356l552k047N998j836n594N276K587o579K531M994n976
$$ -321 2611 -1778 -1883 2473 -1079 -3126 2872 1036 -4558 718 3305 -3274 -743 4251 -1725
1411a725j231O536k249m117M448j00m013L455K362m813r5L784j834k196K898Q58
$$ -1725 -2956 3580 1331 -2786 1662 1562 -2451 1004 3366 -1447 -1542 2242 408 -1788 1110 1968
1427A968m214J85M152r11l738K259J709l360J707K510l622j519M681j363k325
$$ 1968 -2246 -2061 2091 1180 -2558 -299 1410 -1950 -243 2267 -1355 -2874 1807 444 -1881
1442a881L963q81m494L926L022m833O17K382k691M01L438k896k516L557j25k715
$$ -1881 2082 1201 -3293 633 3655 -1178 -561 1821 -870 -469 2969 73 -2443 1114 989 -1726
1458a726K276J085l656k38L524L01l111j36K818j312j223L559q86m115K715K673
$$ -1726 550 1635 -2021 -2259 1265 1566 -1545 -1681 1137 -175 -1398 2161 1275 -2840 -125 2548
1474B548l475J002K541m600l05O111j940m413L221L33l140L121J580m800K22L534
$$ 2548 -927 75 2616 -1984 -2289 3822 1882 -2531 690 1023 -2117 1004 2584 -2216 -1994 1540
1490A540j711n72K092k592k093L215K295k400k015J476J120q01Q93J403k484j921
$$ 1540 -171 -743 1349 -1243 -3336 -121 2174 -226 -2241 -765 355 -446 447 1850 -634 -2555
1506b555M194O97k784R87J50k986L231L590n644j369M517k072j270L937j583n345
$$ -2555 1639 2336 -448 539 689 -2297 934 4524 -1120 -2489 2028 -44 -1314 2623 1040 -4305
1522d305L657L099l681R55J155l859J057N461k519m132K881J158k004J719J800
$$ -4305 -648 2451 -1230 -275 880 -2979 -1922 3539 1020 -3112 -231 927 -1077 642 2442
1537B442l600j105L035J562j895m25K85j618J590L066k443l839K994J871k971
$$ 2442 -1158 -2263 772 2334 439 14 299 -1319 271 3337 894 -2945 49 1920 -1051
1552a051J275K410n064j092O581j436m409L170k89l359M639K034o516M36N259
$$ -1051 224 2634 -2430 -3522 3059 1623 -2786 384 95 -3264 1375 3409 -3107 -2671 2588
1567B588k543j209L688k423l076M252J106k381o4k87o08J997J172k313j331M07
$$ 2588 45 -1164 2524 101 -2975 1277 2383 2 -62 -349 -957 1040 2212 -101 -1432 -1025
1583a025J793M57j649L64P16k851J320M219l486l491M389L60k865L563o01n245
$$ -1025 768 1225 -424 -60 656 -2195 -875 3344 -142 -3633 756 1116 -1749 1814 1213 -4032
1599d032M040L650n315O98L912n309P4O405l224m181M376k52k686M090l01n302
$$ -4032 8 3658 -1657 -959 2953 -2356 -2282 4123 899 -3282 1094 842 -1844 2246 1945 -3357
1615c357K794L330l598k65K262j847r26J981J139q48k353O04K729j352j489K107
$$ -3357 -563 2767 -831 -1096 1166 -681 -1607 374 1513 665 -1688 -1084 1645 293 -1196 911
1631I11j115k091M523m50m575L079K127m432J827L984n689p46N420k309k293L982
$$ 911 -204 -2295 2228 1778 -2797 282 2409 -2023 -196 3788 -1901 -2647 2773 464 -1829 2153
1647B153k279k458M201j6m040K150J863l059P89K437j892j646J962L30m14k34
$$ 2153 -126 -2584 1617 1601 -2439 -289 1574 -1485 -696 1741 -151 -1797 165 495 81 -153
1663a53l30O23m13M34J036j624l88K359j142j879L080m90l607K694K511m100J56
$$ -153 -483 140 -273 161 1197 -427 -815 1544 402 -1477 1603 1113 -2494 200 2711 -1389 -1233
1680a233L498k887j266L709j820k486L706n6m001K828J903l722L68L316j731j806
$$ -1233 2265 -622 -1888 1821 1 -2485 1221 1165 -2836 -8 1895 -1827 -1459 1857 126 -1680
1696a680K259M30j980R65J192j469m13K002q87j722K080J093l050M82K488j720
$$ -1680 579 1009 -971 -6 1186 -283 -696 1306 419 -1303 777 1870 -1180 -698 1790 70
1712G0k127L013O46l216R84K255k369l72K366j503j930K777N11l098J413K540
$$ 70 -2057 956 1602 -1614 -630 1625 -744 -1116 1250 -253 -2183 594 1105 -1993 -580 1960
1728A960l368j26L633j559k846L114M77l062K752R85l489J130L215l340j434M148
$$ 1960 -1408 -1534 2099 540 -2306 808 1285 -1777 975 1960 -1529 -399 2816 -524 -1958 2190
1744B190j703k596L322M22l377J309J661j805mJ071j020n93J185L94j005o95J542
$$ 2190 487 -2109 1213 1635 -1742 -433 1228 -577 -581 490 -530 -1123 62 456 -549 -1244 298
1761B98K98j612J109J626k586n33L626j029l151L296K58l871L400J437n069J689
$$ 298 596 -1016 93 1719 -867 -1400 2226 1197 -1954 1342 1600 -2271 1129 2566 -2503 -814
1777h14L777m317q16M944l047l375M737L94m104K566J147l303J801K252k635m90
$$ -814 2963 -1354 -2170 2774 -273 -3648 1089 1483 -2621 -55 1092 -2211 -410 1842 -793 -1283
1793a283K081m21j170J393L98j219j86J350P27j788m24J980j222q31K136j117
$$ -1283 798 377 -793 600 998 -221 -407 943 1670 -118 -542 1438 216 -615 1521 404
1809D04k512K966Q27l691J839K038m371M68M653l307k508M419p53l342L937O59
$$ 404 -2108 858 1685 -2006 -167 1871 -2500 -2032 2621 -686 -3194 1225 472 -2870 1067 1726
1825A726m139K190K582l271K04K663j882j646L192Lk383Q62J301j419MJ032o41
$$ 1726 -2413 -223 2359 -912 -708 1955 73 -1573 1619 1622 -761 101 1402 -17 -13 1019 378
1842C78j279Q12R40j239q80J655n95j536J857J194l174R7L364k285j531L900q64
$$ 378 -901 -89 851 -388 -1268 387 -208 -1744 113 1307 -1867 -1770 1594 -691 -2222 1678 814
1859H14l136L127J567m069J599K661l599q8M014k256k422L203j25l214K455J281
$$ 814 -2322 805 2372 -1697 -98 2563 -1036 -1124 2890 634 -1788 1415 1290 -1924 531 1812
1875A812l350N42K139j748o36K094j015j561J787P27j667j86J458k5j475J132
$$ 1812 -1538 -996 1143 -605 -1241 853 -162 -1723 64 791 -876 -1062 396 371 -1104 28
1891B8J493k270n76K961q16k268K571N03l252J936K278l969J11L756k837j839
$$ 28 1521 -749 -1325 1636 820 -1448 1123 1626 -1626 310 2588 -1381 -1270 2486 -351 -2190
1907b190L697o95l920L185J552l735J268K417l095ML306j997j869K916o2k108
$$ -2190 1507 812 -3108 77 1629 -2106 -838 1579 -1516 -1512 1794 -203 -2072 844 782 -1326
1923a326J316J396j793k72K026m06j687Q64J097j088p23J841p83k205K365J008
$$ -1326 -10 1386 -407 -679 1347 941 -746 118 1215 127 -596 1245 462 -1743 622 1630
1939A630l432N05L651l215j356L686j088l390L416J187l812J712K284k958J49
$$ 1630 -1802 -1297 2354 -861 -2217 1469 381 -3009 407 1594 -2218 -506 1778 -1180 -1031
1954a031L401k923r86L179m93k576K231L95k465J111K043j854j007J780k93j412
$$ -1031 2370 -553 -1539 1640 1147 -1429 802 1197 -1268 -157 1886 32 -975 805 512 -900
1970i00J098Q52j713q67K461l5k810J208J842k467Q6L372k232k246L484M70l133
$$ -900 198 1050 -663 -1530 931 896 -1914 -706 1136 -1331 -1245 2127 -105 -2351 1133 1603 -1530
1987a530K018R47l155J381L070k915j147K655j098j236K738n03l235J424J709
$$ -1530 488 1435 -1720 -339 2731 -184 -1331 1324 226 -1010 1728 1225 -2010 -586 1123
2002A123j278o30J436r72j206J760J375k807o83K549n93j428K317M0l401J872
$$ 1123 -155 -785 651 -321 -1527 233 1608 -1199 -1882 667 74 -1354 963 1003 -2398 -526
2018e26K860k324j091K231j120j177L059k20l434J507J854k093O28J387k717p14
$$ -526 2334 10 -1081 1150 30 -1147 1912 1692 -1742 -235 1619 -474 154 1541 -1176 -1890
2034a890K938L68k310N96P24j771O98K336j825j974J999J392k177P36J852k940
$$ -1890 1048 1416 -894 -298 426 -1345 -647 1689 -136 -2110 -111 1281 -896 -160 1692 -1248
2050a248m89L793n76l204K038P46k460K176J678l329o97L071p35j691K086q81
$$ -1248 -1737 2056 1480 -1724 314 1060 -1400 776 2454 -875 -1572 1499 764 -927 1159 278
2066B78k226J917J895k072j167J556k33p80J345L93k567L4K810n78j696J507k6
$$ 278 -1948 -31 1864 -208 -1375 181 -52 -832 513 906 -1661 -1627 1183 605 -1091 416 390
2083C90k007K122K395l788j070L798j438j763L623j105l610L042J836l459O86
$$ 390 -1617 505 2900 -888 -1958 1840 402 -1361 2262 1157 -2453 589 2425 -1034 -348
2098c48J553k770O26L210k326j937J884K76q68R45M32j727l55J589J038j826j68
$$ -348 1205 -1565 -939 2271 -55 -1992 -108 168 -700 245 677 -1050 -1405 184 1222 -604 -772
2115g72J261p64o48K824n12l640K300K400l096M60K751l427j233M677j350l758
$$ -772 489 -275 -923 1901 1389 -2251 49 2449 -647 -187 2564 -863 -2096 2581 1231 -2527
2131b527L578m85k885L082J417m569P62L383k618l17K490j900j345K336O33j887
$$ -2527 1051 566 -2319 763 2180 -2389 -1627 1756 -862 -1179 1311 -589 -1934 402 1035 -852
2147h52M54M12m26L96O33J05j358j69K502l29k638J802O83k545J565K210l583
$$ -852 -398 14 -412 -16 617 722 -636 -805 1697 1368 -1270 532 1215 -1330 235 2445 -1138
2164a138l45L481k358j633L518j256l437L741J022l612J414K184l032M55K915
$$ -1138 -1483 1998 -360 -1993 1525 269 -3168 573 1595 -2017 -603 1581 -1451 -996 1919
$$ [...]
8191F1
##END NTUPLES=NMR FID
##END=
