##TITLE=1H_LR-758-R5-iSp2
 CDCl3
 8 sc, 
 31.8.2023
##JCAMPDX= 6.0         $$ Bruker NMR JCAMP-DX V2.0
##DATA TYPE= NMR FID
##DATA CLASS= NTUPLES
##ORIGIN= UXNMR, Bruker Analytische Messtechnik GmbH
##OWNER= root
$$ XWIN-NMR		Version 3.5
$$ Thu Aug 31 15:32:32 2023 Russian Standard Time (UT+4h)  she@DPX200
##.OBSERVE FREQUENCY= 200.13135
##.OBSERVE NUCLEUS= ^1H
##.DELAY= (6, 6)
##.ACQUISITION MODE= SIMULTANEOUS
##.ACQUISITION SCHEME= undefined
##.AVERAGES= 8
##.DIGITISER RES= 18
##SPECTROMETER/DATA SYSTEM= spect
##.PULSE SEQUENCE= zg30
##.SOLVENT NAME= CDCl3
##.SHIFT REFERENCE= (INTERNAL, CDCl3, 0, 15.7039)
##AUDIT TRAIL= $$ (NUMBER, WHEN, WHO, WHERE, WHAT)
$$ ##TITLE= Audit trail, XWIN-NMR		Version 3.5
$$ ##JCAMPDX= 5.01
$$ ##ORIGIN= Bruker BioSpin GmbH
$$ ##OWNER= she
$$ F:/spectra/data/she/nmr/H-F/1/audita.txt
$$ ##AUDIT TRAIL=  $$ (NUMBER, WHEN, WHO, WHERE, WHAT)
(   1,<2023-08-31 15:31:22.31 +0400>,<she>,<DPX200>,
      <created by zg, POWCHK disabled, PULCHK disabled
       configuration hash MD5:
       00 E9 B6 7A A2 85 ED C7 34 08 36 98 17 FE 4E 26
       data hash MD5: 16K
       D7 41 F1 D3 C1 21 1B EB 8B 3F 2D F5 FD 10 2E E7>)
$$ ##END=
$$ 
$$ hash MD5
$$ 60 3F 3F F0 B2 80 6C B3 23 4C DF 55 1A EC DD E1
##$RELAX= 
##$RELAX= 
##$RELAX= 
##$RELAX= 
##$RELAX= 
##$RELAX= 
$$ Bruker specific parameters
$$ --------------------------
##$DU= <F:/spectra>
##$EXPNO= 1
##$NAME= <H-F>
##$PROCNO= 1
##$TYPE= <nmr>
##$USER= <she>
##$AMP= (0..31)
100 100 100 100 100 100 100 100 100 100 100 100 100 100 100 100 100 100 
100 100 100 100 100 100 100 100 100 100 100 100 100 100 
##$AQSEQ= 0
##$AQ_mod= 1
##$AUNM= <au_zg>
##$AUTOPOS= <>
##$BF1= 200.13
##$BF2= 200.13
##$BF3= 200.13
##$BF4= 200.13
##$BF5= 200.13
##$BF6= 200.13
##$BF7= 200.13
##$BF8= 200.13
##$BYTORDA= 1
##$CFDGTYP= 0
##$CFRGTYP= 5
##$CHEMSTR= <none>
##$CNST= (0..31)
1 1 145 1 1 1 1 1 1 1 1 1 1 1 1 1 1 1 1 1 1 1 1 1 1 1 1 1 1 1 1 1 
##$CPDPRG= <>
##$CPDPRG1= <>
##$CPDPRG2= <>
##$CPDPRG3= <>
##$CPDPRG4= <mlev>
##$CPDPRG5= <mlev>
##$CPDPRG6= <mlev>
##$CPDPRG7= <mlev>
##$CPDPRG8= <mlev>
##$CPDPRGB= <>
##$CPDPRGT= <>
##$D= (0..31)
0 1.2 0 0 0 0 0 0 0 0.06 0 0.03 0 0 0 0 0.0002 0 0 0 0 0 0 0 0 0 0 0 0 
0 0 0 
##$DATE= 1693481481
##$DBL= (0..7)
120 120 120 120 120 120 120 120 
##$DBP= (0..7)
150 150 150 150 150 150 150 150 
##$DBP07= 0
##$DBPNAM0= <>
##$DBPNAM1= <>
##$DBPNAM2= <>
##$DBPNAM3= <>
##$DBPNAM4= <>
##$DBPNAM5= <>
##$DBPNAM6= <>
##$DBPNAM7= <>
##$DBPOAL= (0..7)
0.5 0.5 0.5 0.5 0.5 0.5 0.5 0.5 
##$DBPOFFS= (0..7)
0 0 0 0 0 0 0 0 
##$DE= 6
##$DECBNUC= <off>
##$DECIM= 32
##$DECNUC= <off>
##$DECSTAT= 4
##$DIGMOD= 1
##$DIGTYP= 9
##$DL= (0..7)
0 120 120 120 120 120 120 120 
##$DP= (0..7)
150 150 150 150 150 150 150 150 
##$DP07= 0
##$DPNAME0= <>
##$DPNAME1= <>
##$DPNAME2= <>
##$DPNAME3= <>
##$DPNAME4= <>
##$DPNAME5= <>
##$DPNAME6= <>
##$DPNAME7= <>
##$DPOAL= (0..7)
0.5 0.5 0.5 0.5 0.5 0.5 0.5 0.5 
##$DPOFFS= (0..7)
0 0 0 0 0 0 0 0 
##$DQDMODE= 0
##$DR= 18
##$DS= 0
##$DSLIST= <SSSSSSSSSSSSSSS>
$$ [...]
##$SUBNAM2= <"">
##$SUBNAM3= <"">
##$SUBNAM4= <"">
##$SUBNAM5= <"">
##$SUBNAM6= <"">
##$SUBNAM7= <"">
##$SUBNAM8= <"">
##$SUBNAM9= <"">
##$SW= 18.05172834244
##$SWIBOX= (0..15)
0 0 2 0 0 0 0 0 0 0 0 0 0 0 0 0 
##$SW_h= 3612.71676300578
##$TD= 16384
##$TD0= 1
##$TE= 0
##$TE2= 300
##$TE3= 300
##$TEG= 300
##$TL= (0..7)
0 120 120 120 120 120 120 120 
##$TP= (0..7)
150 150 150 150 150 150 150 150 
##$TP07= 0
##$TPNAME0= <>
##$TPNAME1= <>
##$TPNAME2= <>
##$TPNAME3= <>
##$TPNAME4= <>
##$TPNAME5= <>
##$TPNAME6= <>
##$TPNAME7= <>
##$TPOAL= (0..7)
0.5 0.5 0.5 0.5 0.5 0.5 0.5 0.5 
##$TPOFFS= (0..7)
0 0 0 0 0 0 0 0 
##$TUNHIN= 0
##$TUNHOUT= 0
##$TUNXOUT= 0
##$USERA1= <user>
##$USERA2= <user>
##$USERA3= <user>
##$USERA4= <user>
##$USERA5= <user>
##$V9= 5
##$VALIST= <valist>
##$VCLIST= <CCCCCCCCCCCCCCC>
##$VD= 0
##$VDLIST= <DDDDDDDDDDDDDDD>
##$VPLIST= <PPPPPPPPPPPPPPP>
##$VTLIST= <TTTTTTTTTTTTTTT>
##$WBST= 1024
##$WBSW= 4
##$XGAIN= (0..3)
0 0 0 0 
##$XL= 0
##$YL= 0
##$YMAX_a= 107129
##$YMIN_a= -118197
##$ZGOPTNS= <>
##$ZL1= 120
##$ZL2= 120
##$ZL3= 120
##$ZL4= 120
##$ABSF1= 10
##$ABSF2= 0
##$ABSG= 5
##$ABSL= 3
##$ALPHA= 0
##$AQORDER= 0
##$ASSFAC= 0
##$ASSFACI= 0
##$ASSFACX= 0
##$ASSWID= 0
##$AUNMP= <proc_1d>
##$AZFE= 0.1
##$AZFW= 0.1
##$BCFW= 1
##$BC_mod= 2
##$BYTORDP= 1
##$COROFFS= 0
##$CY= 11.3945322036743
##$DATMOD= 1
##$DC= 2
##$DFILT= <>
##$DTYPP= 0
##$F1P= 15.7292609196834
##$F2P= 12.9074282941183
##$FCOR= 0.5
##$FTSIZE= 0
##$FT_mod= 4
##$GAMMA= 1
##$GB= 0.15
##$INTBC= 1
##$INTSCL= 1
##$ISEN= 128
##$LB= 0.24
##$LEV0= 0
##$LPBIN= 0
##$MAXI= 10000
##$MC2= 0
##$MEAN= 0
##$ME_mod= 0
##$MI= 1.114404
##$NCOEF= 0
##$NC_proc= 0
##$NLEV= 6
##$NOISF1= 3.799351
##$NOISF2= 2.8
##$NSP= 1
##$NTH_PI= 0
##$NZP= 0
##$OFFSET= 15.70392
##$PC= 1
##$PHC0= -21209.21
##$PHC1= 15.45272
##$PH_mod= 1
##$PKNL= yes
##$PPARMOD= 0
##$PSCAL= 0
##$PSIGN= 0
##$REVERSE= no
##$SF= 200.130013532006
##$SI= 16384
##$SIGF1= 3
##$SIGF2= 2
##$SINO= 400
##$SIOLD= 16384
##$SREGLST= <1H.CDCl3>
##$SSB= 0
##$STSI= 0
##$STSR= 0
##$SW_p= 3612.71676300578
##$SYMM= 0
##$S_DEV= 0
##$TDeff= 0
##$TDoff= 0
##$TI= <>
##$TILT= no
##$TM1= 0
##$TM2= 0
##$TOPLEV= 0
##$USERP1= <user>
##$USERP2= <user>
##$USERP3= <user>
##$USERP4= <user>
##$USERP5= <user>
##$WDW= 1
##$XDIM= 8192
##$YMAX_p= 0
##$YMIN_p= 0
$$ End of Bruker specific parameters
$$ ---------------------------------
##NTUPLES= NMR FID
##VAR_NAME=  TIME,          FID/REAL,        FID/IMAG
##SYMBOL=    X,             R,               I
##VAR_TYPE=  INDEPENDENT,   DEPENDENT,       DEPENDENT
##VAR_FORM=  AFFN,          ASDF,            ASDF
##VAR_DIM=   8192,          8192,            8192
##UNITS=     SECONDS,       ARBITRARY UNITS, ARBITRARY UNITS
##FACTOR=    0.0002768,     1,               1
##FIRST=     0,             0,               0
##LAST=      2.2672688,     0,               0
##MIN=       0,             -118197,         0
##MAX=       2.2672688,     107129,          0
$$ Real data points
##PAGE= N=1
##DATA TABLE= (X++(R..R)), XYDATA
0 0 0 0 0 0 0 0 0 0 0 0 0 0 0 0 0 8 -8 8 -8 8 -16 16 -16 24 -24 32 -32 40 -48 56 -64 72 -80 88 -101 112 -128
37 -128 143 -159 176 -197 218 -242 268 -295 325 -359 397 -437 482 -530 584 -643 711 -784 871
56 871 -968 1081 -1212 1369 -1557 1791 -2089 2484 -3034 3846 -5174 7680 -14021 60752 71187
71 71187 -118197 27408 72662 -89777 -7745 101020 -49950 -48668 56144 -14267 -32144
82 -32144 47808 -2281 -32501 10587 -4052 1213 25611 -19985 -10307 20098 -23191 127 44468
95 44468 -26057 -27731 36446 -11653 -20884 44816 -7950 -40533 29362 4658 -26723 34342 2476
108 2476 -43284 23531 14420 -32639 27157 15536 -49301 12807 32329 -34328 7386 31857
120 31857 -40104 -9513 40826 -16656 -12733 28513 -18519 -18738 29727 -949 -13433 16168 -10885
133 -10885 -13243 23050 -1770 -11392 16267 -11947 -16195 26894 409 -21245 18036 -1708 -25717
146 -25717 22365 14009 -27548 7026 12982 -23785 7646 22886 -20162 -6533 16977 -12305
158 -12305 -2559 20549 -9949 -11817 13304 -3952 -5099 15477 -4935 -12601 10284 -11 -6629
171 -6629 12001 -1792 -13794 7875 3605 -8217 8123 1642 -13572 4732 6838 -7785 4248
184 4248 4201 -11717 2122 8985 -6656 1286 6270 -9738 -441 10869 -5087 -2478 7886 -6773
198 -6773 -4200 11222 -1999 -6558 7074 -2421 -7052 8713 1824 -8362 3911 1375 -7129 5025
212 5025 4093 -7506 907 3293 -5435 2479 4929 -5866 -579 4263 -3772 1069 5315 -4568 -1693
227 -1693 4937 -2525 -557 5329 -3343 -3092 5021 -1368 -2408 4740 -2018 -4561 4282 301 -3872
242 -3872 3384 -108 -4947 2900 2049 -4003 1700 1553 -4142 1583 3131 -3116 369 2538 -2850 448
258 448 3501 -1999 -667 2639 -1797 -646 3132 -1234 -1661 2206 -861 -1519 2276 -477 -2204 1323
274 1323 -80 -1726 1331 102 -1993 785 475 -1390 918 563 -1608 684 1009 -1098 769 1147
290 1147 -1368 416 1574 -879 42 1451 -987 -438 1610 -544 -937 1176 -404 -1096 989 -91
306 -91 -1346 483 49 -1072 365 317 -1078 153 407 -748 210 661 -584 146 732 -358 190 814
324 814 -301 46 744 -251 16 705 -270 -171 513 -331 -260 395 -509 -485 379 -512 -559 433 -441 -700 589
345 589 -131 -753 631 153 -823 625 584 -661 447 758 -585 264 928 -475 7 832 -355 -224
363 -224 626 -249 -347 375 -271 -383 232 -231 -345 38 -392 -306 193 -234 -239 228 -294 -104 527 -100 -170 512
385 512 -69 -115 883 147 -323 595 164 -338 671 192 -640 216 252 -442 261 149 -789 -171 177 -382 32
406 32 -49 -744 -101 218 -291 234 125 -694 150 696 -294 371 556 -694 137 1139 -332 37 835 -710
426 -710 -300 1232 -146 -643 733 -565 -856 986 46 -1069 295 -313 -994 773 374 -1064 116
443 116 -36 -767 816 686 -794 127 282 -605 977 898 -889 104 457 -691 1002 1121 -1274 -275
461 -275 846 -810 384 1245 -1506 -1006 893 -601 -168 1183 -1224 -1316 1098 -183 -358 1189 -895
478 -895 -1300 1321 395 -457 1288 -461 -1391 1419 785 -638 1061 -103 -1481 1224 960 -909 606
495 606 -93 -1754 948 1072 -1277 197 151 -1978 668 1595 -1509 -285 786 -1617 161 2156 -1000
512 -1000 -870 1147 -796 -145 2082 -376 -1122 904 -248 -107 1774 -448 -1158 743 -368 -370 1616
529 1616 -599 -1696 826 -145 -876 1498 -194 -2108 692 568 -1041 1185 297 -1997 586 1209
545 1209 -888 852 834 -1838 333 1798 -795 284 1237 -1685 -388 2079 -480 -765 1144 -1065
561 -1065 -1084 1699 35 -1354 580 -521 -1199 1220 386 -1331 296 34 -976 1125 773 -1313 204
578 204 485 -766 928 1150 -1121 -93 1001 -564 412 1234 -983 -614 1017 -300 -233 956 -829
595 -829 -965 843 -141 -571 743 -637 -1113 850 77 -773 880 -243 -1305 1041 653 -1100 799
612 799 535 -1484 779 1429 -1107 113 1079 -1187 29 1598 -819 -583 1005 -847 -419 1446 -814
629 -814 -932 941 -770 -708 1579 -697 -1390 1358 -275 -1232 1772 127 -1918 1384 806 -1593 1333
646 1333 1065 -1968 712 1496 -1421 555 1278 -1808 70 1562 -1355 -85 1364 -1798 -387 1866
662 1866 -1296 -725 1676 -1489 -1133 2287 -712 -1583 1853 -480 -1725 2108 472 -1922 1419 521
678 521 -1720 1546 1106 -1813 754 1019 -1512 868 1238 -1804 232 1145 -1566 346 1439 -1817
694 -1817 -382 1428 -1396 -336 1656 -1421 -856 1696 -792 -876 1758 -715 -1278 1871 -98 -1193
710 -1193 1707 28 -1541 1691 594 -1577 1221 728 -1816 855 1137 -1696 345 1206 -1730 -42
726 -42 1306 -1358 -379 1283 -1148 -586 1351 -793 -731 1312 -647 -833 1444 -292 -916 1348 -29
743 -29 -1013 1407 302 -1232 1107 524 -1378 878 777 -1414 480 860 -1384 268 951 -1370 -67
760 -67 1067 -1195 -248 1123 -1020 -468 1285 -854 -624 1340 -558 -749 1419 -188 -964 1311 154
777 154 -1019 1105 347 -1145 923 563 -1164 607 540 -1269 348 693 -1149 175 671 -1178 -59
794 -59 918 -977 -194 825 -937 -259 1056 -599 -455 1040 -478 -411 1203 -146 -703 1012 -37
811 -37 -707 989 182 -856 656 220 -838 585 260 -894 254 272 -756 218 318 -818 45 302
829 302 -768 154 421 -692 64 574 -523 128 807 -446 -168 763 -255 -184 791 -141 -361 617 9
848 9 -467 529 17 -601 239 113 -459 80 59 -576 -60 99 -376 1 57 -307 -39 196 -155 82 171 -85
870 -85 49 255 96 40 204 -11 57 266 42 -26 156 -59 -165 177 24 -255 -58 -29 -319 -39 117 -304
892 -304 -144 56 -156 -174 222 -54 -133 179 86 -37 246 165 -64 174 192 -29 206 189 -132 138 198 -110 16
915 16 121 -245 -82 127 -221 -137 84 -255 -253 158 -84 -212 46 -78 -142 184 18 -100 177 53 10 320
937 320 136 -82 174 146 -63 222 165 -196 76 86 -168 87 79 -390 -123 106 -280 -65 113 -378 -251 221
959 221 -127 -168 190 -143 -189 278 123 -168 174 86 -161 363 341 -165 140 209 -184 192 361 -267 -154 163
981 163 -221 -77 275 -281 -403 77 -126 -143 253 -226 -410 66 -23 -4 308 -98 -315 297 130 -14 431
1002 431 -30 -426 360 377 -189 313 186 -638 99 576 -286 -72 206 -581 -218 532 -179 -258 84 -490 -268
1023 -268 537 -81 -375 140 -323 -239 657 186 -373 220 -42 -217 673 329 -354 111 45 -165 573 237 -571
1044 -571 -60 37 -294 470 199 -793 -127 160 -411 304 391 -794 -338 472 -155 27 543 -539 -457 575
1064 575 144 18 482 -335 -370 539 250 -18 347 -289 -476 492 251 -241 216 -243 -656 382 370 -370
1084 -370 -7 -136 -563 273 415 -295 -139 -57 -414 326 644 -270 -129 112 -193 339 710 -170 -347 198
1104 198 -85 135 715 -191 -563 81 78 -11 380 -206 -684 -83 143 14 272 -229 -651 -14 250 67 262
1125 262 -13 -608 108 567 37 134 96 -540 0 780 111 -131 196 -403 -128 786 177 -376 -16 -245 -279
1146 -279 503 289 -474 -308 -134 -265 354 340 -455 -320 91 -106 345 462 -359 -282 208 109 388 478 -293
1167 -293 -379 211 159 216 269 -258 -442 162 202 24 203 -334 -689 138 360 -102 24 -230 -540 44 448 63
1189 63 -30 -159 -419 215 583 181 -59 -62 -285 255 656 81 -220 -39 -249 26 616 25 -445 -91 -110 -119
1211 -119 451 76 -551 -272 20 -67 258 153 -509 -174 141 37 373 286 -469 -114 414 57 238 404 -390
1232 -390 -326 535 157 -99 310 -249 -477 384 253 -221 25 -252 -487 217 288 -268 -57 -169 -474 271 345
1253 345 -279 -30 69 -324 264 670 -240 -126 289 -241 170 670 -203 -314 301 -140 4 529 -178 -490
1273 -490 251 -122 -207 473 -185 -581 169 0 -321 362 21 -587 174 250 -253 290 203 -496 152 388 -177
1294 -177 230 231 -402 104 396 -127 113 241 -392 2 367 -237 -87 225 -426 -229 434 -156 -210 227 -354
1315 -354 -203 411 -80 -246 254 -105 -261 488 100 -322 290 56 -185 388 223 -250 215 96 -244 241
1335 241 208 -362 19 86 -270 99 123 -356 -72 139 -217 67 144 -287 -80 245 -106 98 285 -206 7
1356 7 287 -33 -12 262 -150 -52 298 -23 -131 202 -88 -190 208 -20 -155 68 -87 -195 63 -27 -256 31
1378 31 0 -187 85 43 -135 102 68 -140 117 157 -82 122 175 -41 99 174 41 48 79 12 57 84 -109 -69 49
1403 49 -82 -113 32 -165 -144 64 -79 -91 17 -86 -131 81 -73 -70 97 29 -85 167 101 -59 124 151 -40
1426 -40 71 112 -32 64 154 -54 -44 57 -47 -98 -24 -64 -54 -9 -43 -58 -77 -201 -51 19 -91 5 80 -59 32 177
1452 177 52 -24 127 -44 -41 233 41 -99 93 61 -117 130 74 -212 16 96 -174 -14 -18 -210 -95 99 -136
1475 -136 -16 65 -179 -91 45 10 -61 51 -48 -14 161 59 43 102 -67 3 226 28 -77 110 -65 -124 205
1498 205 36 -195 21 -21 -150 75 22 -196 -36 -16 -104 72 27 -130 -100 66 -53 91 165 -55 -50 164 47
1521 47 122 213 6 -81 107 121 39 104 -60 -142 -5 56 -88 -12 -125 -193 -91 87 -34 -76 -34 -194 -37 126
1545 126 62 -44 -63 -43 -22 166 101 20 -8 -22 73 222 66 -36 -17 -114 -11 106 12 -174 -63 -90 -105 75 21
1570 21 -216 -193 -32 -66 103 127 -141 -151 43 -6 131 191 -116 -96 171 72 89 215 -81 -201 131 127 40 43 -40
1595 -40 -237 -21 87 -27 -56 -125 -212 -40 99 -2 30 -87 -219 60 195 -88 8 21 -78 120 255 32 -13
1618 -13 56 -23 107 240 -3 -70 -31 -50 63 198 -45 -225 -23 -189 -71 267 9 -314 -88 12 -151 110
1640 110 125 -218 -60 191 61 66 155 -62 -99 137 144 187 55 -99 -82 113 54 43 71 -120 -132 98 4 -141 28
1665 28 -144 -206 86 38 -140 -24 -83 -135 45 148 -60 22 13 -25 164 150 15 20 41 13 116 221 -92 -104 103
1690 103 -91 -41 216 -122 -220 77 -86 -67 107 -33 -294 -2 22 -82 154 -21 -166 94 37 -55 164 83
1712 83 -168 105 95 -64 103 168 -160 58 181 -100 12 136 -176 -55 144 -136 -87 57 -145 -57 183 -101
1734 -101 -177 149 -148 -163 243 2 -135 256 -41 -162 215 98 -156 134 75 -161 172 95 -197 96 124 -206
1756 -206 34 157 -281 15 116 -271 3 136 -215 -44 134 -176 -50 155 -234 -42 314 -73 -25 239
1776 239 -34 -2 289 -47 -81 289 -76 -122 291 -60 -176 241 -5 -232 156 -17 -284 120 49 -291 147
1797 147 41 -314 46 105 -226 153 161 -316 81 304 -206 84 253 -223 -9 329 -111 17 293 -183 -69
1818 -69 301 -151 -108 301 -207 -212 243 -149 -248 207 -130 -306 221 -34 -314 176 4 -275 222 157 -286 143
1840 143 173 -219 158 210 -166 145 212 -167 131 267 -258 17 228 -242 -48 173 -214 -154 235 -194 -170 228
1862 228 -129 -203 239 -110 -244 198 39 -160 249 95 -157 154 109 -201 144 112 -223 131 122 -206 86 161
1884 161 -246 17 131 -219 -45 160 -212 -82 116 -131 -108 129 -150 -49 161 -124 -48 152 -106 -75 191
1905 191 -75 -93 205 42 -84 214 18 -154 235 36 -194 83 107 -177 12 99 -201 -28 73 -221 -60
1926 -60 150 -207 -80 148 -171 -121 113 -75 -68 183 80 -82 180 47 -56 172 52 -84 107 107 -81 123
1948 123 118 -134 -12 78 -93 13 36 -122 -6 39 -128 -117 67 -83 -66 47 -20 -69 63 26 -22 137 86 -90
1972 -90 156 63 -86 116 79 -62 35 77 -112 86 75 -47 20 20 -132 -74 79 -68 -64 57 -121 -38 86 -48
1996 -48 1 83 -64 -52 158 29 -58 178 -36 -67 122 40 -132 112 8 -119 104 54 -86 -58 66 -96 -6
2019 -6 60 -134 -75 51 -180 -18 50 -72 -96 76 -54 -41 124 -4 -102 87 92 -26 141 49 -57 34 74 -63
2043 -63 96 -19 -82 3 39 -51 -24 -39 -87 7 -26 -38 -4 -23 -180 -15 86 -74 29 78 -71 -4 94 15 -9 65
2069 65 -24 -82 140 56 -16 97 -27 -11 42 5 -117 28 -35 -80 35 -4 -76 -68 -37 -60 -11 18 -80 -29 18 60 24 11
2097 11 36 11 -3 83 32 18 43 26 9 64 24 -23 -18 82 21 23 -15 -53 -63 -34 -59 -1 -25 -71 -7 -56 -71 45 18 -98
2127 -98 8 56 -10 69 75 -69 -1 66 -13 66 96 -42 13 82 -51 10 81 -129 -53 123 -50 -102 35 -79 -117 52
2153 52 1 -97 51 3 -97 31 42 -45 66 22 -8 101 115 -33 38 55 -86 104 52 -115 14 67 -60 1 110
2178 110 -86 -40 30 -61 -76 51 -80 -115 90 -29 20 75 -45 -57 127 -15 10 134 35 -67 154 118 -88 109
2202 109 89 -109 100 121 -62 31 55 -90 17 97 -118 -18 31 -135 -20 59 -133 -46 23 -79 -14 116 -105
2225 -105 -89 95 -20 -1 183 25 -28 93 29 19 118 24 -88 69 24 -5 38 -71 -83 25 31 -107 65 15 -142
2250 -142 14 129 -78 -33 37 -111 -69 80 12 -55 35 -30 41 109 99 -32 -2 19 10 106 69 -61 9 -18 -28 53 17
2277 17 -105 -88 -15 -58 5 -7 -133 -115 -4 -1 42 43 -22 -52 27 51 61 -8 -31 4 39 58 89 46 1 -28 3 -10 4 -8
2307 -8 -39 -72 -38 52 2 -46 -51 -12 23 -3 -30 -45 -38 -2 11 10 60 -4 19 32 36 73 50 7 -28 -10 39 11 27 22 -53 -45 30 32
2341 32 8 -98 -77 -82 -1 20 -91 -52 -93 -25 16 31 -6 -24 19 15 70 38 17 13 33 0 37 76 0 -25 15 23 50 -5 -9 -55
2373 -55 -30 7 -44 -4 -3 -87 -23 -44 -40 5 17 -63 -24 -12 12 -21 40 18 31 77 7 60 43 -40 36 78 20 12 68 -88 -52
2404 -52 70 5 -81 38 -37 -52 -8 -23 -60 4 -44 -22 38 67 -42 54 70 -31 36 82 -67 15 41 -41 17 128 -47
2431 -47 -65 92 -62 -15 70 -64 -49 18 -140 -28 -4 -60 -104 19 -72 -74 64 -20 -77 64 -28 -65 90 50 -23 60
2457 60 79 -9 28 117 -23 52 58 -51 42 62 -95 34 34 -89 -33 53 -92 -99 35 -33 -58 66 -94 -111 59 4 -40
2484 -40 55 16 -1 80 5 3 89 78 -18 58 51 18 8 4 -51 26 34 -56 -4 -4 -173 -39 -7 -106 -39 -16 -63 -43 26 -79 -15
2515 -15 98 -6 6 120 -19 -79 49 17 -14 34 -12 4 42 39 -54 10 -30 -30 9 4 -36 -17 10 -20 22 1 0 -6 59 -19
2545 -19 -7 11 13 -31 64 -2 25 21 -2 -43 45 21 -15 1 23 -67 3 9 -17 13 -45 -38 -26 -38 -31 -38 9 -27 31 -14 -58 -9 14
2578 14 11 -10 10 35 -17 62 8 3 83 -6 -26 78 37 7 42 60 -5 -30 47 -48 0 35 -56 -19 50 -62 40 47 -63 -68
2608 -68 76 37 2 62 -35 4 58 24 -2 78 29 8 87 57 -75 98 90 -74 83 76 -43 47 49 -77 26 41 -96
2635 -96 -21 50 -101 -43 71 -58 -26 88 -31 -32 58 -48 -16 30 33 -41 102 66 -51 115 72 -26 63 77 -157 48
2661 48 107 -34 -1 30 -123 1 26 -68 -47 -54 -110 -40 48 -101 -39 36 -54 6 73 -34 -46 84 -29 -25 140 -14 -45
2688 -45 102 46 -39 90 16 -96 7 -11 -50 57 8 -116 25 15 -101 32 44 -53 25 128 -24 113 87 -79
2712 -79 -48 136 -25 34 87 -34 -32 144 30 17 67 -124 -26 51 66 -79 -24 -64 -147 111 -1 -96 -7 -30 -30 45 66
2739 66 -171 34 6 -78 84 144 -142 24 31 -62 122 139 -10 -67 79 -18 43 109 -110 -86 69 -8 -85 23 -63
2764 -63 -86 57 -14 -78 31 -42 -118 66 65 -58 74 -74 -95 32 49 -23 77 53 -107 49 99 -42 43 41 -124
2789 -124 6 159 -22 -28 41 -66 -30 78 -84 -44 20 -86 -20 99 -67 -92 20 -108 -13 136 -27 -82 56
2812 56 -3 -36 73 8 -137 82 33 -51 95 59 -184 24 21 -93 81 65 -127 -8 77 -68 6 81 -157 -76 81
2837 81 -10 -27 110 -19 -63 105 47 19 75 -52 -24 102 39 -58 25 -18 -5 93 -18 -61 12 -38 -61 62 2 -159
2863 -159 -53 -21 -111 72 59 -26 -39 11 -9 39 46 32 -3 45 7 62 96 -27 -102 58 58 -5 49 -4 -99 21 14 -10 -20
2892 -20 -79 -64 12 -6 -27 18 20 -65 -3 60 19 5 -40 -48 -35 74 49 38 -7 3 27 76 35 27 9 36 13 45 27 -87 6
2923 6 -38 -23 44 10 -20 -108 -54 -16 -14 -10 -51 -47 14 18 37 62 -12 20 39 53 63 28 15 -22 28 -6 50 -56 7 -13 -2 -18
2955 -18 -31 -1 20 10 -2 49 -8 -58 -32 -48 -7 30 -37 -12 29 9 -27 68 29 -16 31 21 -54 -6 -25 -45 -1 11 -44 -36 56
2986 56 -11 -21 -26 -54 22 3 -78 22 19 -6 -19 20 14 -73 51 2 -28 33 -11 -8 37 6 -32 68 33 -5 19 14 -10 49 2
3017 2 -23 -8 27 -49 49 -41 -73 19 -38 -85 -4 -2 -10 9 51 -88 25 27 -28 24 15 -8 36 60 -44 52 57 35 33 0 7 -20 10
3050 10 -83 -62 31 -13 8 20 -35 -55 40 -10 -66 8 -37 25 -11 8 -46 3 25 -43 14 4 32 75 22 -62 41 16 -82 28
3080 28 62 -58 -10 31 -44 -44 11 -61 -55 43 -44 -31 52 -23 -57 24 10 -41 33 -20 -29 -2 -19 2 30 8 -29 49 28 -34 -66
3111 -66 32 -63 79 56 -22 -29 60 -59 -15 26 -62 58 11 -63 7 103 -13 -39 -14 -27 1 114 5 -56 58 -27 5
3138 5 4 -6 -62 9 89 -28 -18 -6 -49 49 -50 -49 -18 -4 -46 -61 -1 -35 -70 -44 -40 -39 57 19 6 28 -1 17 68 -9 40 44 35
3171 35 -35 10 6 53 13 -21 36 10 34 26 -17 -1 -69 -34 -52 -23 -57 -21 2 -23 -17 -10 -25 -1 4 22 -18 -13 53 -23 -33 -3 -28
3204 -28 27 -1 -15 23 20 18 -29 66 7 5 28 5 -30 46 -18 14 -2 -58 -17 -15 -11 -87 1 -62 -22 75 92 21 36 6 11 67 37
3237 37 20 4 14 -36 22 73 -37 -5 -81 -4 19 -31 -17 -90 -25 22 -7 -2 -31 -7 -26 36 34 47 -28 -13 24 -5 26 43 -20
3268 -20 12 -14 -12 27 58 -40 -47 22 51 11 27 -37 -46 -22 4 -28 -23 -103 -36 42 25 1 -23 -20 33 -2 68 41 48 45 12 17 84 37
3302 37 44 7 -66 1 84 -16 -37 18 -2 72 -2 -23 -13 -39 -44 11 -12 -37 -70 18 -40 -7 -4 -19 -54 21 -10 -4 -1 7 -33 27 41
3335 41 64 -26 -17 -49 -9 -12 11 -2 -41 -104 0 -4 -11 0 -26 26 -31 2 -20 19 30 -36 -64 44 -2 -14 41 -62 -26 -7 3
3366 3 -13 24 -64 -43 36 6 -25 -7 -13 -29 63 -28 -34 36 20 -14 30 28 -20 -37 28 11 -2 59 -41 -18 -41 -11 15 8 -18 -24 -56
3399 -56 -12 -32 21 -87 -44 -2 -53 -19 9 -44 -37 -24 -68 -16 -23 -62 -71 -20 -48 12 0 -22 -8 17 14 50 -15 -21 -17 14 46 59 -26
3432 -26 50 -22 44 57 -15 7 -30 1 -40 36 19 4 -9 -1 36 21 -20 -28 -29 -6 -12 48 -4 1 45 5 6 53 -10 17 37 18 2
3465 2 -36 5 -32 44 21 -12 2 7 -28 21 5 12 4 -51 -54 6 15 -18 -24 -7 -29 1 13 -15 58 5 -16 -11 78 -4 44 1 14 -15
3499 -15 30 7 -63 9 10 -31 -13 29 -71 -10 -1 -35 17 -33 20 11 9 19 34 4 -20 -19 29 -20 50 73 8 24 40 9 44 -36
3531 -36 -16 5 22 -12 -62 -27 -8 -18 4 19 -44 -23 -15 -37 2 -66 -57 4 1 34 12 39 -35 15 -1 -34 40 71 40 39 4 6 -23
3564 -23 20 -22 3 -9 19 -16 4 14 34 -3 -6 10 -88 -37 -59 -11 -49 -12 -30 39 31 -1 36 -72 5 118 -1 16 1 35
3594 35 -8 22 -27 -17 20 1 31 -10 -20 7 5 3 -71 11 3 -44 -7 -20 -13 -11 -4 -39 20 12 -23 0 55 -36 -4 -9 8 -53 -14 -12 59
3629 59 38 46 5 13 31 -11 36 10 -23 -16 32 -3 -2 -53 -9 -22 -70 -11 -11 15 -29 -40 20 68 -10 15 -7 46 -8 -60 -12 -40 -2
3662 -2 12 -38 11 17 -30 -11 -46 -38 -10 20 -73 19 -43 -9 2 -45 3 18 8 53 13 -6 4 48 -9 17 1 7 15 16 40 -68 -15
3695 -15 17 49 -6 -14 -61 -11 -30 -19 -4 -22 -27 11 -41 35 19 -29 30 -61 -2 -10 14 40 -3 15 15 -5 9 38 -22 34 -19 -4
3727 -4 34 -23 -69 -31 -26 -32 -33 -32 -2 -48 1 -12 -5 35 -21 6 -11 -1 -46 19 6 -20 -7 -16 -4 2 1 19 49 27 -67 24 -23 -58 -3
3762 -3 36 -22 -27 -12 -15 10 13 -9 -17 3 5 -42 52 -37 -39 22 -5 15 64 10 -30 4 -52 14 11 27 18 39 7 -8 22 -17 -22 29 48
3797 48 -42 0 26 -50 -27 -31 19 17 23 -19 -28 25 -36 5 29 -44 15 27 -55 -18 23 -59 2 12 33 -4 8 19 -28 85 5 -33
3829 -33 -37 -49 -42 17 7 -38 43 -29 23 12 -27 -4 -32 19 6 50 36 -29 -7 23 -41 8 16 -65 -3 -31 7 -11 51 24 -14 21
3861 21 -38 -76 18 -58 32 -2 11 -11 -83 17 -5 -8 -26 -49 48 24 -19 23 -50 26 -4 35 -10 -38 9 -14 19 11 -17 -10 17
3892 17 28 9 -40 -35 55 -6 -15 -43 -34 -19 21 -32 -34 31 -10 -4 79 4 1 -17 14 42 -17 -13 50 -7 -73 17 11 -17 -1 -3 -36 36 50
3927 50 -12 -46 -25 14 -31 -38 -57 -29 38 7 12 44 18 12 27 59 26 2 -14 17 26 33 -16 -44 2 -15 -10 -9 19 -42 20 45 -55
3960 -55 -20 -49 -28 -32 -26 -11 1 -36 -1 7 45 13 -44 13 4 -6 34 81 26 16 -33 21 22 32 -13 -52 32 52 -18 7 25 -106
3992 -106 -5 -32 -85 -33 -37 -53 1 -54 23 13 10 -25 52 -45 -38 11 27 -9 -9 32 14 7 -3 -1 -34 -9 -61 16 16 36 -61 87
4024 87 3 -11 5 24 -25 34 73 5 -20 64 50 -46 -27 21 10 -33 -35 2 20 -55 -22 -31 -7 -22 45 -15 -12 -13 -52 -2 49 15
4056 15 -27 -19 26 56 0 15 -12 -21 58 29 42 -14 -18 29 -19 2 55 -1 -62 37 7 -78 12 14 -25 29 25 -19 -14 -3 -13 -10 26 4
4090 4 -11 -52 5 17 -5 4 -41 17 55 -23 -43 13 56 43 -36 54 -2 -18 16 -15 5 10 39 -30 -26 55 29 27 -9 -37 -30 -32 -69 -7
4124 -7 -51 24 5 20 -22 29 10 2 9 12 20 14 27 -14 -10 -32 35 -9 -10 30 -26 -5 59 43 -17 36 -44 8 19 -36 28 -21 3 -25
4158 -25 -58 -11 54 -13 -9 24 -21 -39 -42 -9 47 39 -3 45 -19 -12 38 -17 -51 -9 -20 31 -16 10 -7 -7 -23 68 8 -3 -56 2 -5
4191 -5 -31 7 11 -28 -4 18 36 16 3 45 -7 -28 35 -27 14 37 -11 -32 -68 -18 -47 -12 20 -32 36 -13 -50 -6 -16 -20 25 -8
4223 -8 -28 16 -43 25 23 -17 -37 9 42 32 20 13 14 45 -31 3 -22 13 36 -29 -1 -4 -1 -64 -14 8 32 82 -17 38 -16 -29 16
4256 16 -1 -50 0 -1 0 -11 -36 50 8 17 24 7 31 -54 17 47 -9 16 -12 -17 0 59 26 17 26 1 52 58 6 17 -47 -23 -7 11
4290 11 14 -25 1 -7 8 15 15 -37 -24 -27 -7 5 40 11 13 27 -16 -6 -11 33 -39 19 12 -8 -19 10 48 32 -8 0 25 38 3 27 -5
4325 -5 61 -12 10 7 -10 17 -26 7 -13 -52 -1 2 -21 -7 67 0 -10 -3 -23 -102 -21 37 -16 39 -16 -25 36 -22 -14 9 7 9 12 16 26
4360 26 37 67 -45 -10 20 49 34 26 13 -31 19 -63 -1 14 -22 -32 -48 16 1 -71 -95 -4 -34 -47 -13 -45 32 -18 7 27
4390 27 23 8 -21 41 39 15 26 -8 9 -12 73 -1 43 -34 16 -37 67 65 26 57 4 -10 -28 31 -43 -61 -48 -47 -16 -24 31 20
4422 20 29 42 -3 11 16 4 -7 -10 13 32 38 19 -15 0 18 29 -26 -29 -23 -8 -1 17 33 1 32 41 -10 38 3 -58 -23 30 39 -6 34
4457 34 22 21 14 19 27 24 -13 33 43 -25 28 19 -52 -10 55 -38 -26 11 -15 65 27 7 -43 20 -29 -25 -51 -16 -6 58 22 27 8 31
4491 31 40 32 0 23 27 26 -15 38 19 -45 52 13 21 7 5 -7 4 18 -22 -33 8 -19 -32 -32 12 -16 -51 3 -41 -1 12 -9 -26 6
4525 6 -26 12 7 -21 -42 36 2 -42 -23 -22 2 -16 -14 18 11 4 44 35 -32 -19 26 8 -52 17 -8 -55 -54 -7 -26 -3 -7 42 -44 18 29
4560 29 50 39 -42 49 15 -13 -61 4 7 -35 -1 -37 -9 22 -29 -35 17 -20 -52 56 -24 3 21 11 -25 -6 37 9 -6 -29 -15
4591 -15 -29 -10 25 16 -9 -4 -35 -19 -2 24 3 -42 -13 -5 -37 -10 27 -21 -24 -35 -45 1 23 23 24 -14 -5 -3 6 14 3 -45 58 14 -38
4626 -38 -17 38 6 -20 10 -49 30 41 17 4 -35 -51 -23 4 -42 34 -36 14 12 -32 23 -16 -18 29 18 17 18 6 25 16 10 22 21 -8
4660 -8 -13 26 15 -4 -12 -10 -4 -3 -36 -21 3 4 4 14 2 -10 -29 -59 -8 -24 14 -8 15 -56 47 6 -15 6 24 49 33 30 10 -33
4694 -33 5 -25 6 15 6 34 -3 23 -8 49 9 0 16 6 -27 34 16 -28 20 11 -32 24 -20 -34 2 -5 24 29 -1 44 26 3 -13
4727 -13 14 -23 -4 0 -20 42 50 -11 -15 -6 28 24 -37 15 -31 -10 16 -17 13 61 -13 4 34 26 -37 -11 -43 25 26 12 -2 -2 -18 -24 -18
4762 -18 9 32 20 7 -8 -17 16 -20 -23 -12 -2 16 -15 -72 -13 19 -62 -6 -30 18 10 -2 -64 6 61 42 18 23 -28 29 21 -7 10
4795 10 36 -18 28 14 -23 9 -26 -3 -10 -7 -20 -17 64 -24 9 8 -77 -35 -11 -15 32 39 -23 1 -88 -41 24 33 -18 18 57 8 -52 0
4829 0 3 19 42 4 -4 -9 20 -36 -1 33 -27 -39 -23 -2 42 11 6 -32 24 -30 95 49 22 -59 17 -35 -7 -11 -32 43 -1 -35 12
4862 12 43 16 -27 -40 -18 61 10 2 -5 -3 14 -24 -16 10 5 35 45 -3 -13 -28 13 -2 48 4 8 19 -51 3 14 -64 11 -20 -50
4895 -50 -41 -27 -10 -8 19 41 10 30 -26 -16 -7 -27 36 2 68 7 0 44 -39 46 41 2 38 35 -8 10 42 -24 -58 -1 -25 -3 17
4928 17 -4 -95 -52 29 -57 -33 -30 38 -27 -41 11 -9 6 -23 -29 -23 -6 5 32 25 13 -21 43 73 -28 5 38 -13 41 -8 4 -30
4960 -30 -44 2 13 -43 -14 -14 27 36 -22 2 -32 49 38 25 -6 9 -4 11 -43 -62 9 44 -16 19 27 -10 18 1 -7 -11 -29 -24 10
4993 10 38 19 17 -3 -41 -18 0 -1 50 39 -41 -7 66 38 10 48 -10 28 22 41 4 13 3 -9 -5 -3 9 11 -11 -23 3 21 -14 -27
5027 -27 -47 -27 -12 -7 22 -1 -13 16 36 25 -29 11 71 2 53 55 31 -27 14 -12 7 11 0 16 -48 -65 -60 9 -4 -79 15 -5
5059 -5 -60 -23 -47 -15 64 20 16 37 -36 -11 32 44 -12 1 44 -51 13 16 37 -12 4 -40 15 27 13 14 12 -32 0 5 20 6 -7
5092 -7 -36 18 -3 -12 22 -21 -3 -25 -21 -73 -55 11 -37 -47 11 -23 -43 -83 -32 75 12 51 10 65 -19 -14 24 11 26 -17 -28 30
5124 30 -31 17 -32 29 21 -26 -18 10 26 -33 17 52 -29 3 -2 47 -36 -34 8 -54 6 13 35 -54 -5 54 -22 -47 4 19 -57 -24 13
5157 13 -31 75 -1 -9 -35 34 -41 21 103 48 -33 -15 -1 -19 27 -21 25 13 59 -5 20 -2 -20 9 9 8 0 31 -50 -21 39 -41
5189 -41 51 -8 -13 -49 -53 -24 12 2 -27 -51 4 11 4 32 -8 -8 5 10 12 0 39 -8 16 69 24 24 99 28 11 -14 2 31 -19 -24 -62
5224 -62 -2 -15 -23 -12 14 38 -34 10 -17 -10 7 0 -10 -46 -15 -18 -16 6 -13 -7 39 6 -11 25 40 -2 -41 6 59 25 2 -22 2
5257 2 3 23 35 32 22 -15 14 -1 12 22 9 -46 -16 28 30 -8 -29 3 19 36 46 9 -57 -45 23 29 9 -32 15 -48 15 -45 5
5290 5 27 6 -11 0 -2 3 26 43 42 8 26 -28 1 82 -10 -32 -30 -42 -14 -5 1 -15 -35 -32 -35 -77 26 -34 58 -35 -54 -32 -22 -11
5324 -11 -54 -7 -22 -9 24 31 34 13 40 -41 16 -14 56 -27 36 -19 -3 20 29 17 -6 20 3 23 -11 44 -25 2 21 -53 -17 45
5356 45 9 -8 4 6 -6 -27 -10 4 28 -30 14 23 0 -21 3 -43 34 36 -3 -31 1 31 -9 17 -10 45 -40 -11 -34 -40 -20 -11 1
5389 1 -8 -65 -32 13 -26 0 -29 -34 -4 -9 -27 -31 -31 -5 -17 7 20 -3 7 -31 -35 -2 -30 -37 -6 38 -25 31 34 -15 16 -10 -38 7 9
5424 9 2 -41 33 44 10 12 -25 3 4 -20 -22 -17 -34 5 37 -35 -57 23 -41 -4 -23 0 -24 -56 35 -62 -22 -11 -9 -29 -37 -22 -31 24 -4
5459 -4 -25 57 24 -46 -17 -18 75 49 21 -15 -8 -51 30 44 33 -3 -27 9 24 -4 -60 -86 -24 -22 -72 2 22 -24 -28 -25 -49 -18 -26 37
5493 37 29 62 -3 43 -56 -4 2 -1 5 -10 69 2 -5 -4 -34 24 -6 1 -8 -14 22 -29 -3 -35 27 -43 -16 -27 -33 -35 19 -57 -6 18 35 5
5529 5 -7 -30 28 -25 21 -9 3 -15 -7 20 16 18 -1 -2 -40 -41 -27 42 -48 43 50 -22 -40 15 30 17 5 28 -29 8 24 -10 -56 -9
5563 -9 57 4 10 9 22 -15 -41 -83 -43 -58 -6 8 32 -11 -5 -22 -39 37 13 -26 -68 18 0 -2 52 70 -21 -23 -7 37 47 51 13 -19
5597 -19 28 9 -12 4 23 4 -57 48 46 5 21 0 18 -33 5 12 -13 6 -27 -11 20 -25 -50 7 -28 -26 -24 -31 14 41 38 26 -25
5630 -25 -8 3 25 -12 2 33 -12 6 -1 -15 -22 38 -22 -36 15 4 -12 -11 -31 1 3 41 -10 -27 -67 -56 -41 -12 -31 -21 -7 42
5662 42 -8 8 24 25 -22 -20 -26 -20 -24 1 28 20 -12 18 41 2 33 -15 29 75 2 -1 36 -4 -13 -14 -1 2 17 -28 13 -3 49 9 -51
5697 -51 -15 9 1 34 5 6 14 11 7 -9 30 -55 -12 8 -3 13 34 60 -63 22 30 14 30 33 0 28 53 -14 45 -21 4 -13 6
5730 6 -73 1 47 30 -20 -38 -55 0 -26 6 2 14 -13 7 -35 13 31 -16 55 -19 58 -31 36 18 -13 11 0 0 -3 16 5 26
5762 26 -32 23 47 14 12 30 18 -10 -53 6 -31 20 -14 -36 -12 9 -21 -19 1 -3 -73 11 -19 -3 -3 -10 -1 -16 -3 -4 -9 -36 7 -18
5796 -18 5 25 12 19 -25 3 -32 10 -18 -7 41 -33 12 -20 86 23 36 -19 -25 -8 -21 -15 -7 8 34 4 -47 -42 43 -19 -39 -20
5828 -20 22 12 46 -8 -11 12 16 43 20 2 -17 38 3 -18 20 16 26 9 6 47 -1 34 -2 -21 -1 31 -31 -30 -21 -49 27 22 37 0
5862 0 20 -10 -15 0 23 -81 -13 -39 -18 -8 -36 -17 -54 -44 45 -25 -16 27 34 -25 20 1 3 -48 17 38 6 17 9 5 13 0 -29 8
5896 8 -55 -9 -16 -20 21 20 -28 -24 -23 23 -14 13 32 -44 -13 25 53 27 -1 5 27 10 -6 -31 -25 18 5 -69 2 -23 -55 -15 59 24
5930 24 85 19 53 25 26 75 37 25 9 -15 15 -30 -21 52 -13 22 14 -28 -19 -18 -42 -58 -2 11 -45 2 -12 15 -13 -39 44 38 -3
5963 -3 71 31 -23 -19 -19 -15 6 -10 6 8 33 -6 10 25 -10 -24 7 12 22 68 15 -31 -60 28 8 -35 -5 -1 -49 -3 -2 -24 9 -106
5997 -106 12 -16 4 10 15 4 47 18 -56 -17 -38 34 46 29 3 -25 7 -51 10 28 -57 25 21 -19 12 18 4 21 13 -19 20 -73
6029 -73 12 -41 -8 -11 -63 -78 -3 -7 -11 -21 -8 2 -23 -68 -28 33 11 60 -42 -12 40 5 -15 -31 -3 -8 -26 -5 -3 -4 -23 17 4
6062 4 -25 3 28 21 6 0 -27 -47 28 -5 -61 -10 -6 -36 11 5 43 -38 7 -13 -35 -5 -1 -5 -32 51 -43 -1 -20 42 -17 -11 -23 40
6096 40 23 -2 -21 -18 -25 22 15 95 43 21 3 -62 -25 -42 47 30 22 -25 -22 -84 18 38 2 -26 52 5 -26 1 4 -10 -8 40 -44
6129 -44 27 -6 9 21 -16 13 17 -26 27 -14 25 -7 -1 64 -9 37 21 5 12 -7 16 -1 24 -22 3 -18 -43 -41 -26 -15 11 -4
6161 -4 -45 18 2 -19 -25 28 -48 -31 24 -24 24 -17 7 33 29 29 3 -41 -22 17 51 27 20 -10 -45 -28 -27 25 70 24 8 -15 -1
6194 -1 -11 29 -3 -2 34 -14 -35 2 49 -41 -47 0 10 -19 8 -25 -26 -71 53 40 39 -25 -15 38 41 1 13 28 11 45 1 31 36
6227 36 4 18 -3 -1 3 -16 14 38 30 -15 4 -1 3 -38 22 -1 -14 -21 -16 35 50 -11 -30 -7 -15 -14 -25 -16 27 14 -34 -44 11 -17 -46
6262 -46 7 34 -8 -27 -15 22 22 -24 35 5 22 17 40 11 -10 -9 8 -31 -42 15 -30 28 23 -14 42 -21 -3 20 9 6 11 74 22
6295 22 22 -9 28 4 -7 -9 -73 7 12 -41 -29 20 -16 -9 56 -14 -10 36 38 22 5 -27 23 -25 47 -6 -27 -30 -12 -6 -14 -12 -5 50 -16 -2
6331 -2 -7 41 35 2 11 14 -38 21 -28 -8 -13 9 24 28 25 10 25 -3 42 19 0 5 17 13 64 6 26 51 -20 -3 22 -13 2 34 -35
6366 -35 -3 59 13 -4 18 -16 39 8 28 -56 -44 62 -13 -27 -9 -10 -47 -24 -9 6 3 28 -23 -37 16 3 49 71 53 12 56
6397 56 -11 -32 -10 -50 26 30 40 -5 23 7 -17 -8 24 28 27 -12 -60 22 -44 -15 34 -71 -48 -6 8 40 -4 9 -2 31 -51 -27
6429 -27 18 39 36 9 54 -36 3 -6 4 -3 11 -34 43 29 28 16 -38 28 3 0 -24 38 42 0 -89 3 1 9 1 12 2 -66 -115 40
6463 40 -34 17 14 63 37 41 -23 -26 -12 54 -49 -8 -10 23 16 9 57 -66 -3 25 27 11 21 1 -5 6 -10 -12 4 28 -9 30 -41 18
6497 18 -7 -28 -5 26 -9 -18 3 -31 0 -12 -48 4 19 0 -10 -17 38 1 0 43 5 -8 54 -14 -39 -17 6 -14 14 -1 22 58
6529 58 -13 19 -18 -42 -58 -25 -39 -22 -4 50 -14 -26 -1 -48 -48 10 -35 14 -17 -14 13 8 -18 1 -1 33 28 12 21 20 39 -6 49 -18
6563 -18 55 -36 17 61 -18 -9 -8 9 3 7 6 40 3 0 27 -21 -30 23 -45 -20 -21 17 4 47 -38 6 44 15 3 -20 -36 9 -2 -24
6597 -24 29 -18 31 8 -22 3 41 4 11 -40 -1 58 -6 46 -40 26 -57 15 -22 -2 -80 -8 -39 32 -33 -14 34 -31 -27 5 -24
6628 -24 -17 -38 17 -10 6 6 -23 -3 0 16 -23 -21 -20 7 69 -69 -29 45 -40 -11 -23 71 35 -6 -4 27 -10 4 49 -37 19 -11 -6
6661 -6 18 -57 11 0 21 -15 -43 -39 -25 -11 -29 0 -17 -14 -29 -7 -3 11 2 -2 -37 68 38 -21 16 11 41 10 -23 7 -8 -55 -13
6694 -13 63 -8 -2 -13 35 44 -17 -22 -35 7 -8 -17 -31 -4 -17 -12 -4 -20 -5 39 -15 7 9 13 13 -2 -24 50 84 3 14 -11 -32 -4 43
6729 43 26 19 17 22 37 66 35 10 9 -16 21 46 25 6 22 -4 24 7 -30 -27 0 -24 -46 11 37 24 4 -6 33 30 14 24 1
6762 1 -47 -20 4 0 18 6 28 -3 1 3 -16 63 31 -14 42 26 20 7 -24 -47 -15 14 -15 -8 -11 -4 16 -12 -7 -10 -20 -3 17 1 -4 -31
6798 -31 24 -15 13 -24 -5 8 -25 -33 -15 63 -18 -31 -51 -19 -24 -16 -13 12 -2 44 16 24 -8 -3 31 -22 -26 -31 -7 11 14 11 1 -19 -41
6833 -41 -63 43 -5 -2 18 46 35 -1 26 -29 -33 -38 16 -46 -5 -3 4 -34 49 37 -14 26 3 33 13 -14 31 47 21 35 52 -13
6865 -13 15 -11 2 38 -39 -15 0 -16 36 9 -19 21 -5 63 -37 40 20 17 44 -19 -31 -21 -27 -65 -30 12 18 -34 -6 16 28
6896 28 35 63 5 52 -21 14 13 2 11 -19 -4 2 -20 15 -15 12 12 -48 -1 -3 45 -29 9 -46 14 -5 -72 -45 -28 -4 -20 -58 -55 -25
6930 -25 5 7 28 -37 -49 11 24 -12 -16 46 -3 -30 -23 -30 -6 14 30 20 83 -17 59 16 12 -27 24 -19 -6 -25 20 -3 -23 71
6962 71 -22 2 -9 15 -3 -21 -47 21 15 -5 21 16 8 3 13 29 8 6 20 9 -33 34 -34 61 -12 27 -38 77 24 -17 50 13
6994 13 16 23 25 -31 20 14 46 25 19 -39 23 -3 12 -24 -33 17 6 46 34 -22 3 30 22 -32 -3 6 1 8 -27 41 -20 24 -6 43 32
7029 32 8 -74 -2 -16 -19 -32 30 12 -18 5 14 -33 -15 37 12 53 21 18 36 17 3 -36 6 12 28 12 -26 -37 -36 9 -37 -8 -33
7062 -33 -27 2 53 21 38 -26 13 4 -4 23 -21 -4 -44 -13 10 -14 4 -24 17 -44 9 4 -34 61 -6 10 -15 -46 -15 -41 -51 -38
7094 -38 16 -33 -23 -21 -8 6 -13 50 -50 -3 3 35 -21 55 17 -45 23 6 -2 21 68 -12 13 20 41 9 9 -21 -26 46 -14 2 -33
7127 -33 -16 -28 31 -4 12 24 -15 -25 5 -29 14 3 49 18 8 -24 -54 -1 34 13 24 7 -52 -11 8 9 -22 -6 24 11 30
7158 30 28 -7 33 -60 -18 -15 -12 -24 1 -48 -7 32 4 -36 -9 34 13 -38 -46 -1 -59 22 -11 -8 22 30 -25 46 10 9 14 -2 -4 -27 10
7193 10 1 -5 -21 -34 16 -35 -14 -81 62 12 26 -36 7 63 -37 77 -41 35 53 -17 -39 -38 -1 5 20 11 -7 -27 -28 50 -54
7224 -54 -21 -1 -59 -10 9 23 0 -25 -15 -8 -3 24 46 42 -19 35 5 38 19 31 27 47 -18 1 -20 29 -42 -4 -42 7 24 -6
7256 -6 9 -15 25 19 34 -37 -50 -52 -28 -50 -15 -6 -10 31 11 8 39 -27 43 -22 2 -29 71 25 25 18 27 10 22 51 -37 0 31 -12
7290 -12 -13 -3 -37 44 4 -13 29 24 10 -35 -30 -22 -11 -13 -49 -36 7 -6 10 23 27 21 26 28 8 -42 12 -11 -32 -26 10 9 19 41 -5 20
7326 20 -15 -14 20 -14 -42 -10 12 5 59 -25 -22 -2 35 26 -30 8 -63 15 -17 35 -21 -39 5 3 8 -53 -10 -6 11 -60 -38 -46 -15 -25
7360 -25 -8 -20 -4 -3 16 13 -10 10 58 25 29 40 20 16 45 43 40 14 35 13 -44 11 -74 13 -21 -25 -3 -17 -11 2 -34 -1 -7 5 -45
7395 -45 -27 -82 -46 -18 -14 -19 -28 -53 -43 37 13 10 -1 -10 32 -40 8 31 13 4 5 7 -17 1 18 4 1 4 11 -28 -11 4 7 23 25 -5 20
7432 20 -51 -74 -25 0 16 7 26 -46 -8 -10 34 60 -9 -25 54 0 -26 19 -12 30 -19 -3 19 42 -36 18 -33 -23 32 -5 -4 -47
7464 -47 29 -6 -6 -5 -54 -13 48 14 47 -57 -47 -51 21 41 -28 -3 -42 8 -16 71 15 13 8 -1 14 -14 -8 31 30 -36 -16 2 29 20
7498 20 43 28 21 -28 -14 15 14 -21 16 5 12 20 -32 -44 -16 19 39 3 12 -13 -1 -17 -12 -40 -68 -10 -18 8 -36 1 -1 9 -6 -9 6
7533 6 -32 6 0 44 9 -15 19 17 -1 58 -17 15 36 -47 84 -24 13 57 0 -16 -25 -20 38 -63 -10 58 50 22 -18 -81 17 61
7565 61 -26 11 -10 -11 -3 21 13 -10 -2 9 13 46 24 22 -18 0 16 -7 33 11 -2 51 -31 -50 -10 14 9 44 57 2 25 26 10 42
7599 42 3 14 17 5 27 -18 -57 8 43 -13 -17 41 -4 8 -22 -28 7 28 29 -29 41 15 15 15 -25 -23 -13 1 48 68 32 -7 -35 17
7633 17 57 -10 43 -1 25 -12 22 -40 -9 -14 -23 -44 -32 10 -13 -29 -3 14 -4 13 12 44 -7 36 36 47 -15 8 10 36 9 32 38
7666 38 5 13 21 4 21 33 28 54 -15 -15 -5 -36 1 17 0 -5 2 0 -5 -42 49 2 13 -17 -33 18 -12 -6 15 16 -33 -16 -36 24 -2
7701 -2 -20 -23 34 12 20 1 25 -33 -4 -32 -57 -53 -13 -33 -21 55 10 0 -10 39 16 21 30 -14 12 20 -8 -46 6 -55 17 -5 -21 28
7735 28 2 7 16 -53 27 30 -2 -31 4 -7 25 -29 -15 18 -34 40 0 27 31 16 16 20 -7 18 -26 -58 -14 36 37 26 25 -61 4 25
7769 25 8 16 -62 -33 12 -18 -19 -36 5 40 -26 -16 9 -2 40 -25 24 -20 19 2 7 45 24 10 54 -18 3 8 -33 31 21 15 -2
7802 -2 -38 -13 -26 21 -5 -24 5 29 -14 2 -11 -25 -18 -24 -40 -24 -17 -14 -31 -4 -51 -6 8 -33 6 -3 -19 18 -14 -15 9 4 4 7 21
7837 21 2 -3 4 -9 3 18 5 17 -25 0 -27 17 -45 4 -7 16 30 37 8 -24 31 7 5 30 -30 -19 -18 8 -12 1 58 34 -33
7870 -33 -26 75 8 14 1 -56 -1 -12 -4 -1 29 25 28 17 5 23 15 41 44 -10 -61 8 64 -28 19 6 23 -24 -17 11 -7 -12 -31 -57 5
7905 5 -13 -30 -21 22 40 -13 28 -84 -5 -14 -9 18 -6 16 54 33 -18 38 8 18 -6 15 -16 9 41 25 50 -18 22 -31 -19 -30
7937 -30 46 -47 -36 -31 -32 47 -28 -67 -18 -80 6 -6 -58 -13 -79 -36 27 -7 0 -19 -7 -16 -2 2 -44 17 14 14 -55 -17 2 32 -5 72
7971 72 29 -18 11 29 13 -33 -21 -6 -24 -4 1 -41 -5 24 -84 31 -9 2 -8 -27 -16 -13 7 -11 4 18 0 -18 10 42
8001 42 -2 -6 -25 15 57 -38 -6 10 7 8 -5 20 22 -29 41 25 -23 -5 18 21 24 17 -81 24 -4 -40 31 22 24 -10 -28 -6 44 -53
8035 -53 -20 -46 -30 41 6 -68 24 34 29 -37 28 35 84 -10 -18 -18 15 45 -10 -14 -6 15 -2 20 -20 28 -14 -48 -5 29 -43 12 -43
8068 -43 -38 10 -30 9 -14 12 -9 33 15 -13 -34 14 -21 -58 -8 -11 -40 -31 -3 10 -10 18 13 28 6 -21 -27 -45 -52 10 -18 -18 11 -33
8102 -33 -31 -8 33 41 -14 -40 -12 17 29 7 -61 25 3 5 14 15 51 9 10 -18 -22 -44 -2 13 -13 54 -2 -29 10 -7 -29 33 8 -6
8136 -6 0 34 -1 26 -55 -9 65 -28 32 33 -31 -24 12 18 0 -3 1 6 -15 -27 12 -36 -7 -46 38 -27 15 1 4 6 45 25 1 19 -30
8171 -30 -5 63 21 -37 2 22 13 -17 4 31 -18 -8 -26 0 21 -37 -5 -12 26 -15
8191a5
$$ Imaginary data points
##PAGE= N=2
##DATA TABLE= (X++(I..I)), XYDATA
0 0 0 0 0 0 0 0 0 0 0 0 0 0 0 0 0 8 -8 8 -8 8 -8 16 -16 17 -24 24 -32 40 -40 48 -56 64 -72 81 -95 105 -120
37 -120 133 -148 167 -185 206 -228 254 -280 310 -342 378 -417 459 -506 557 -613 677 -746 825
56 825 -914 1016 -1133 1269 -1431 1625 -1864 2171 -2570 3123 -3935 5261 -7873 23597 -94688
71 -94688 -29003 107129 -67267 -37760 102114 -23281 -81288 60771 14635 -45689 35944
82 35944 14410 -46257 10412 13486 -6519 17832 -11613 -23111 22899 -6889 -12073 36887 -13850
95 -13850 -41157 34432 9043 -31310 31501 7273 -47635 21501 25542 -30845 17180 16828 -43449
108 -43449 12145 32903 -30853 7046 27071 -42542 -1797 45211 -26059 -13931 35900 -27037
120 -27037 -22787 44513 -4893 -29523 24873 -4554 -26228 27497 9094 -24260 10333 1096
132 1096 -16704 19964 6883 -19457 10627 332 -18015 22027 10110 -26510 9653 11079
144 11079 -23942 13380 21950 -27633 -4053 21848 -17304 -2819 25398 -16125 -16481 20154 -3874
157 -3874 -10700 18184 -4757 -18095 13063 4139 -9992 11269 106 -15517 8903 7322 -9110
170 -9110 7241 2976 -14128 5831 9957 -8730 2774 5438 -12229 1773 11326 -7197 -1606
183 -1606 6349 -9389 -1461 11249 -5217 -4559 6857 -6456 -3958 11413 -2628 -7429 7280
196 7280 -2328 -6488 10339 1487 -9526 5327 2547 -7470 6648 5175 -9266 1454 5411
209 5411 -6064 2263 6188 -7217 -1863 5841 -3886 -614 5579 -5081 -3369 5393 -2142 -1974 4889
224 4889 -3304 -3996 5243 -463 -2973 4598 -1442 -4433 5036 1258 -3875 3731 503 -4911 3791
239 3791 2913 -4382 1815 2074 -4680 1633 3765 -4014 -324 2821 -3568 -264 3843 -2874 -1750 2904
255 2904 -2066 -1237 3424 -1450 -2276 2712 -565 -1644 2942 -153 -2404 2210 690 -1776 1993 826
271 826 -2302 1200 1304 -1649 801 887 -2014 262 1177 -1472 43 855 -1744 -150 1274 -1252 -379
288 -379 1109 -1297 -454 1594 -725 -731 1497 -379 -813 1678 228 -1123 1241 513 -1040 1054 792
305 792 -1097 380 768 -931 130 667 -987 -296 551 -745 -362 506 -754 -511 479 -439 -397 550
323 550 -322 -379 582 -24 -243 664 29 -201 712 177 -180 651 85 -355 601 35 -512 534 25 -789
343 -789 422 150 -917 211 227 -1034 11 497 -944 -213 667 -704 -279 873 -361 -386 842 -28
361 -28 -375 797 217 -296 592 229 -257 422 224 -220 257 33 -190 235 -146 -371 126 -335 -405 224 -239
382 -239 -585 178 -78 -437 458 59 -657 333 389 -373 504 502 -519 198 793 -120 257 542 -413 -12 684
403 684 -74 -66 208 -526 -147 429 -293 -226 16 -795 -193 568 -506 -314 347 -743 -303 1053 -223 -553
423 -553 766 -253 -467 1326 290 -784 661 196 -669 1119 632 -1104 232 486 -799 590 691
440 691 -1191 -342 358 -712 278 591 -1191 -438 457 -554 272 791 -1080 -475 901 -314 354 1177
458 1177 -1085 -577 1350 -111 26 1363 -873 -1081 1543 192 -580 1040 -666 -1483 1218 517 -1032
475 -1032 644 -504 -1715 1027 751 -1220 354 -113 -1579 979 1196 -1088 221 293 -1274 941
491 941 1652 -1008 28 672 -1179 725 1763 -1109 -426 902 -1224 292 1929 -1339 -1126 1061
507 1061 -931 -535 1924 -871 -1880 1003 -133 -813 1513 -217 -1854 797 515 -455 1286 -20
523 -20 -1494 841 645 -461 1315 92 -1710 979 976 -908 877 344 -2023 417 1363 -1081 219
540 219 587 -1920 -56 1608 -975 -297 814 -1599 -389 2056 -610 -736 1287 -983 -763 2258
556 2258 102 -1383 1126 -43 -1068 1707 809 -1591 302 499 -1002 950 804 -1567 -191 593
572 593 -879 419 710 -1508 -516 816 -662 91 981 -1238 -709 1236 -205 -236 1163 -638 -914
589 -914 1348 347 -515 925 -178 -962 1017 612 -779 539 -89 -1126 736 606 -1090 243 104
606 104 -1389 561 963 -1392 -125 774 -1338 68 1558 -1017 -727 1322 -577 -421 1697 -330
622 -330 -1100 1208 13 -623 1504 -90 -1274 1131 182 -989 1272 23 -1764 993 530 -1599
638 -1599 998 626 -2269 516 1374 -1736 213 1374 -1844 -216 1988 -1128 -423 1675 -1156 -521
654 -521 2005 -620 -759 1650 -839 -921 2109 -420 -1353 1658 -479 -1666 1981 163 -2236 1274
670 1274 375 -2166 1286 1056 -2381 448 1235 -1833 534 1579 -1852 -159 1671 -1183 93 1702
686 1702 -1375 -371 1819 -767 -339 1758 -1074 -944 1851 -535 -1026 1637 -694 -1557 1658 -86
702 -86 -1630 1309 -20 -1897 1257 553 -1822 913 639 -1799 887 1215 -1656 462 1459 -1569 246
719 246 1859 -1337 -317 1791 -1020 -616 1819 -721 -948 1468 -434 -1139 1307 -253 -1296 1076
735 1076 -93 -1349 1007 155 -1484 768 420 -1435 746 750 -1469 500 993 -1223 363 1258 -1160
752 -1160 -21 1385 -899 -207 1442 -729 -521 1345 -596 -719 1237 -493 -982 1187 -406 -1169
768 -1169 1033 -52 -1321 946 178 -1418 767 642 -1273 558 769 -1189 479 1107 -996 184
784 184 1101 -901 35 1234 -747 -283 1051 -702 -346 1194 -587 -668 945 -486 -743 959 -334
801 -334 -1032 787 -118 -979 780 93 -1022 680 344 -842 647 560 -906 397 646 -661 353
818 353 732 -629 130 746 -575 73 586 -636 -198 554 -558 -192 544 -656 -407 549 -524 -448 624
837 624 -367 -579 641 -110 -520 679 74 -564 590 333 -452 438 383 -446 249 522 -255 97 361 -336
857 -336 -45 353 -168 -138 189 -303 -242 188 -200 -287 57 -170 -229 119 -45 -111 88 -74 -114 262 159 -95
879 -95 176 120 -14 245 207 -86 46 163 -68 66 205 -122 -205 190 -57 -276 133 -76 -396 -59 79 -237
901 -237 -80 -29 -254 -14 145 -94 91 177 -48 80 274 21 50 244 -44 -62 333 28 -102 163 17 -135
923 -135 194 17 -251 -21 -32 -245 26 -2 -271 -60 -5 -164 22 48 -196 25 162 -106 144 232 -163 95
945 95 278 23 108 287 -136 -15 322 -57 -115 146 -153 -255 253 -12 -358 77 -106 -379 94 92 -376 -50
967 -50 56 -270 106 238 -252 -78 248 -97 137 414 -135 -165 365 112 -13 412 32 -355 233 178 -109
988 -109 110 -120 -453 33 61 -175 13 -192 -505 43 184 -225 115 -37 -523 190 518 -231 54 265 -406
1009 -406 86 757 -20 -246 376 -215 -162 685 32 -354 223 -154 -202 488 10 -597 6 -68 -278 464 125
1030 125 -691 -76 137 -267 353 270 -612 -101 331 -59 405 316 -559 -30 432 -37 341 408 -684 -174 592
1051 592 -92 27 387 -602 -472 673 -4 -291 362 -401 -606 550 228 -385 72 -235 -501 523 396
1070 396 -272 123 -67 -391 554 514 -297 28 54 -366 425 630 -403 -206 51 -298 178 543 -398 -429 -10
1091 -10 -237 95 541 -392 -529 125 -94 95 543 -317 -613 259 254 35 484 -34 -600 247 488 60 319
1112 319 -46 -600 153 480 70 64 -181 -584 -1 457 -97 -137 -203 -625 8 564 -123 -259 -60 -405 -60
1133 -60 754 93 -413 97 -81 -70 694 263 -517 14 215 -61 464 382 -555 -291 265 36 242 271 -562
1154 -562 -406 205 38 22 167 -452 -500 276 173 20 231 -338 -364 364 377 69 145 -171 -372 410 498 64
1176 64 83 -51 -415 296 577 -117 -160 -103 -382 123 486 -86 -432 -221 -281 84 425 -95 -389 -76 -160 65
1198 65 554 -11 -472 -10 53 100 552 107 -527 -12 287 110 387 164 -507 -225 299 88 155 44 -557
1219 -557 -316 246 23 19 28 -559 -292 483 133 -126 192 -339 -372 584 369 -282 116 -10 -330 487 512 -240
1241 -240 -54 29 -246 327 468 -307 -193 -21 -302 164 374 -452 -314 93 -316 33 461 -368 -502 249
1261 249 -101 -45 547 -99 -474 351 160 -120 546 64 -451 286 273 -137 319 40 -580 146 303 -262 166
1282 166 170 -627 25 381 -332 -33 133 -535 -75 426 -206 -93 229 -297 -101 495 -43 -59 320 -290 -51
1303 -51 576 -28 -243 326 -148 -180 493 29 -394 231 -80 -385 406 53 -496 83 4 -372 236 139 -448
1324 -448 23 168 -286 185 308 -330 55 301 -117 216 325 -264 19 355 -100 134 277 -231 -166 224
1344 224 -117 -83 167 -232 -122 241 -96 -156 98 -146 -215 228 -102 -131 177 -54 -178 283 118 -152 233
1365 233 89 -107 235 166 -159 140 100 -151 96 171 -155 -29 132 -174 43 73 -194 -113 13 -196 -55 74
1387 74 -169 -99 65 -68 -69 128 -2 18 122 24 68 146 77 -27 94 38 -40 107 13 -7 70 -42 -122 54 -38
1412 -38 -160 -27 -24 -98 -20 -3 -165 -41 69 -128 -17 63 -115 -32 129 28 -6 165 17 58 134 57 18 87 56
1437 56 49 60 33 -24 -16 -54 -16 41 -67 -80 -2 -102 -94 38 -152 -133 82 6 -88 85 34 -156 128 142 -57 152 111
1464 111 -113 56 273 -21 80 191 -94 -20 156 -53 -104 129 -91 -125 38 -2 -137 -43 -67 -96 57 -19 -47
1487 -47 58 25 -41 149 92 -76 134 19 -28 225 111 -100 73 119 -38 72 105 -168 -119 47 -73 -83 31
1510 31 -129 -154 36 -58 -42 70 -97 -153 105 49 -44 92 -20 -74 107 225 46 57 78 -36 111 243 25
1533 25 10 -32 -151 -16 143 -18 -68 -92 -111 -62 83 -15 -109 -113 -89 -50 76 -21 -127 -60 -20 39 159 49 -75 1
1559 1 88 17 238 123 -81 -54 109 63 107 38 -117 -91 45 14 68 68 -222 -206 42 3 -79 52 -176 -193 103 108
1585 108 -61 79 -59 -161 110 151 -25 22 21 -78 112 252 17 -11 -18 -90 108 74 -13 -26 -64 -178 85 156 -137
1610 -137 -126 -62 -112 -27 166 -2 -194 37 62 15 193 8 -132 46 20 101 233 22 -151 41 90 -6 186
1633 186 80 -306 -48 140 -51 -6 71 -279 -183 140 60 -135 10 -128 -184 113 107 60 -35 -83 25 117 99 22
1657 22 34 -68 -29 170 115 -57 41 15 -166 126 152 -143 -110 -31 -116 1 26 -169 -196 -60 -88 21 59 -94 -166
1682 -166 70 -28 66 212 -111 -84 176 45 40 233 50 -67 162 97 -79 116 42 -226 12 122 -117 23
1704 23 -23 -173 -34 77 -153 -57 44 -212 -31 193 -122 -25 165 -160 -30 230 -4 -33 234 15 -56 212
1726 212 15 -116 205 43 -176 181 -26 -218 150 -35 -176 135 16 -300 106 97 -221 96 129 -264 59
1747 59 101 -218 62 119 -180 10 213 -160 21 261 -200 -10 257 -116 -86 146 -123 -81 180 -79 -176 211
1769 211 -109 -158 165 -127 -236 140 -112 -239 241 11 -240 235 89 -157 255 116 -202 227 142 -238 200
1790 200 199 -251 85 220 -203 44 185 -301 -74 221 -283 -73 201 -307 -74 231 -215 -149 237 -159 -172
1811 -172 251 -66 -147 278 -33 -121 363 74 -170 267 -20 -229 279 81 -248 232 96 -259 240 74 -364
1832 -364 81 168 -348 20 150 -332 -89 203 -279 -69 188 -242 -66 260 -179 -41 276 -144 -133 350 -48
1853 -48 -135 371 -112 -152 313 -15 -223 249 -4 -232 231 53 -324 41 67 -347 46 106 -333 47 207 -234
1875 -234 22 191 -229 28 260 -142 -26 253 -122 -13 264 -47 -79 204 -34 -46 209 -13 -119 153 -63
1896 -63 -95 124 -84 -177 108 -55 -193 132 -11 -277 149 70 -194 141 105 -187 114 208 -169 109 206 -97
1918 -97 28 248 -86 3 188 -127 -82 147 -159 -125 117 -89 -184 92 -39 -199 45 -44 -109 18 75 -180 7
1941 7 128 -101 80 112 -72 4 195 -37 36 173 -4 -3 180 -67 -39 165 -58 -108 82 -69 -138 65 -54
1964 -54 -150 -26 3 -167 1 68 -113 -33 14 -96 12 117 -68 80 139 -45 3 105 -25 25 110 30 0 118
1988 118 -16 -16 32 -97 -101 75 2 -77 34 -72 -160 31 12 -126 69 -32 -104 72 62 -105 -34 93 -28 72
2012 72 151 -54 -4 224 -75 -61 116 -86 -31 155 -46 -96 76 -22 -126 93 -25 -138 45 -23 -145 78 28
2035 28 -82 44 46 -103 13 88 -40 57 10 -91 90 122 -5 53 9 -93 38 140 -67 -26 -46 -119 -77 64
2059 64 -66 -63 4 -90 -36 102 -79 -140 2 -21 -67 102 10 -94 12 61 68 79 100 12 1 67 62 66 72 -46 40 49 -18
2088 -18 -21 14 -17 -82 6 27 -50 -34 -26 -54 -34 -19 -15 -92 -8 -13 19 51 13 3 -37 59 58 78 30 47 31 58 57 124 -4 -101 20
2121 20 12 -49 60 28 -78 -43 19 -31 -20 13 -90 -78 46 30 -30 88 -54 -44 57 60 -51 82 -23 -29 95 73
2147 73 -6 37 -5 -93 52 31 -78 -23 28 -97 -5 22 -108 -54 11 -84 -12 76 -75 76 63 -83 23 142 -51
2172 -51 27 55 -61 34 172 -49 -73 121 -24 -12 70 -24 -124 58 28 -132 33 -101 -121 41 -14 -107 -6 -22
2196 -22 -150 34 57 -121 -1 20 -92 99 126 -17 -12 100 -20 44 143 -19 -56 74 -56 -25 100 -73 -157 69
2220 69 -74 -49 111 -169 -173 34 -17 -68 50 -25 -127 70 51 -35 49 36 -60 84 86 -23 102 108 -86 52 152
2245 152 -45 40 137 -111 14 136 -85 -61 75 -72 -100 82 -34 -104 -13 -18 -38 15 45 -96 41 4 -38 83
2269 83 36 -67 15 38 -4 76 57 -41 -17 88 -36 -28 53 -61 -92 30 -12 29 -15 -73 -82 30 50 15 2 -60 -39 47
2297 47 44 12 6 21 15 55 112 48 -44 47 15 54 64 19 -62 -92 2 -103 24 -23 -67 -97 -57 -57 -9 -37 -63 -15 -42 18 31
2328 31 13 15 9 20 113 28 29 20 17 31 30 17 -10 -34 47 9 -18 44 -46 -37 -28 32 -39 -9 -90 -46 -41 -15 72 -8 -90 -54 -5 15 23
2363 23 38 3 6 84 46 47 37 38 -33 24 106 10 11 -21 -70 15 -21 -17 -31 -18 -72 -43 18 -2 -68 -34 -110 -61 38 -39 -39 -8 8
2396 8 -7 119 24 -16 71 55 -36 52 31 -16 -28 29 -49 44 65 -64 11 -30 -28 -17 48 -142 -36 22 -71 -57 20 -20 -97
2425 -97 65 -28 15 39 -41 23 80 64 -35 63 40 -112 80 50 -51 90 -28 -78 59 17 -128 -19 -7 -109 73
2450 73 72 -117 4 16 -84 -43 56 -78 27 101 -60 6 114 -5 -4 51 -52 28 115 -42 -51 57 -11 -41 71 10
2476 10 -81 5 -40 -195 -6 -60 -118 -44 -47 -98 6 29 -52 34 25 13 12 5 -76 54 92 -10 69 119 12 71 39 -44 17
2505 17 50 -73 -14 38 -75 -18 75 -5 -33 37 -49 -86 28 -55 -85 -18 16 -76 -15 9 -71 18 73 18 35 28 -39 43 58
2534 58 -65 -38 92 11 -74 63 29 18 -32 -52 -37 -16 -70 -48 -21 19 -56 -9 14 -111 -24 -9 -53 -9 35 -25 27 25 4
2563 4 47 58 7 -16 -3 19 -15 18 -52 -27 26 -43 -9 2 -18 -89 10 -19 -37 -9 -31 -51 52 77 15 -18 10 -29 20 52
2593 52 -20 4 121 49 -48 82 14 18 81 12 -7 -4 -15 -85 39 -19 -68 30 -47 -97 31 -16 -103 38 11 -21 8 51 -96
2622 -96 9 65 -5 78 95 -9 29 90 2 34 50 -37 -2 111 -34 -82 36 -79 -53 17 -21 -28 0 -29 -121 31 38 -67
2650 -67 38 -7 -97 59 120 -130 -3 44 -69 60 104 -43 -16 77 -55 29 110 -51 -29 46 -15 -34 58 -65 -85
2675 -85 84 -33 -70 60 -72 -111 -30 -1 -46 56 47 -143 55 58 -30 58 29 -91 -7 67 -110 17 56 -141 -41
2700 -41 119 -31 -51 111 -165 -17 41 -38 -22 17 -83 -18 124 -31 -82 -11 -40 -46 142 14 -37 51 -1 -38 147
2725 147 39 -81 -11 12 -18 48 55 -165 1 -9 -130 48 79 -162 -88 40 -7 71 105 -130 -51 83 -67 30 150
2750 150 -61 -64 83 -45 -12 116 -53 -86 187 94 -20 76 -42 -72 53 66 -71 31 12 -111 50 -10 -130
2773 -130 -101 0 -115 18 35 -46 -24 -54 -108 52 152 2 28 57 -64 20 164 -24 -22 126 5 26 135 -26
2797 -26 -55 74 -15 -20 139 -61 -88 -21 -77 -64 77 -28 -126 20 -26 -49 66 63 -124 48 111 -44 13 40 -89 -6
2823 -6 93 29 53 59 -70 -34 102 -48 -35 -14 -118 -34 136 -50 -58 37 -22 -86 95 52 -104 37 -2 3 116 93 -58
2850 -58 30 68 -68 55 77 -67 4 50 18 73 46 -73 -8 73 -54 -10 58 -62 -83 31 -26 -43 74 -72 -75 32
2876 32 20 9 46 29 -58 30 49 31 79 0 -10 73 72 6 34 11 -71 19 103 -6 -23 -16 -33 6 32 -91 -90 19 -33 21
2906 21 46 -7 -63 31 13 -24 -15 24 6 1 46 12 62 55 -54 -13 32 35 23 -10 -64 0 19 -6 45 -51 -69 -29 -11 32 8 -74
2938 -74 -25 -54 -30 30 -23 -61 -3 -5 13 34 12 13 60 10 10 60 53 17 2 68 -12 20 15 -28 -23 6 -50 38 5 -69 -20 -18 -51 51
2972 51 -35 -98 -34 52 -7 25 37 -21 -4 5 -1 -4 60 16 -35 30 -18 3 28 -5 -41 -1 -8 -98 -37 -50 -61 15 -2 -20 -28 -37 -32 1
3006 1 4 -3 17 -23 -22 36 76 16 115 60 -19 6 69 21 7 10 -98 7 41 -14 -54 -2 -71 -24 5 -58 -45 -60 -41 -6 46 -58
3038 -58 -60 -34 -51 -22 32 -7 -14 76 40 8 57 33 -19 2 31 27 51 4 -21 -13 0 -48 14 -5 -38 -6 -3 -59 20 -20 -113 5
3070 5 66 -7 39 -16 -46 1 -3 -3 -8 26 0 -33 62 -23 -49 36 6 -36 47 35 -79 -4 4 -47 -13 3 -52 15 -12 -47 6 -7
3102 -7 -41 2 -14 -38 -7 1 -49 49 2 -90 53 35 -51 19 19 -21 8 12 -42 -60 48 -84 -29 12 -11 -43 -4 -5 -16 18 -41
3133 -41 -18 -60 29 -19 15 37 -23 -74 28 -23 4 34 0 -26 -4 0 18 41 31 -10 11 5 -56 6 -31 -30 -54 -90 -54 -21 -19 -25
3165 -25 -37 15 -42 -10 21 4 12 59 42 5 20 22 6 3 22 17 -2 38 46 -3 36 -20 -3 40 14 -79 -68 -36 -63 2 -8 23 -10
3198 -10 -4 -41 -21 -28 -33 -6 29 2 10 19 5 71 31 67 -22 36 -36 -30 88 53 -13 -32 22 30 5 9 4 -18 -23 -8 -13 -3 -31 -73 -21
3233 -21 -33 1 18 -18 17 4 -4 -1 4 48 -30 54 58 -5 58 7 -21 42 -26 19 1 -36 -12 -10 -9 -35 -16 -9 -33 12 24 -18 17 -78
3267 -78 -12 42 -10 24 0 6 -35 17 26 -21 45 29 -28 33 -32 1 7 -81 -49 8 -22 -57 -16 -42 -16 13 -44 -39 -71 -55 -51 25 67
3300 67 -36 13 -31 -9 67 75 -33 -27 46 17 16 71 -9 -26 0 40 10 -12 -30 -53 -67 -53 -23 -1 20 -57 -24 -39 -7 6 -55
3331 -55 -15 1 12 -8 16 26 -2 -6 24 47 27 -3 -27 10 75 -23 -23 -45 -26 1 23 -25 5 28 -41 -1 43 33 -23 30 -3
3362 -3 -38 2 -15 6 5 -6 13 28 8 17 23 4 -18 54 -6 -30 -6 6 -56 38 -48 -39 -61 -32 -40 -18 25 -40 -6 -2 21 -16 73 -89
3396 -89 35 18 41 -16 -12 -11 22 84 41 7 9 -6 -44 46 52 49 -11 18 -43 65 21 -64 -26 23 -28 -9 -22 -47 -40 -2 -19 -14 83
3429 83 -17 -5 59 26 3 74 9 26 22 15 37 58 32 -18 19 34 -24 13 -30 -21 7 -49 -30 13 -40 -39 40 -32 7 -6 -5 -26
3461 -26 -77 -40 16 -27 -16 -24 -4 24 63 49 0 -40 -1 18 63 3 52 18 8 38 -7 -18 23 1 -14 -27 -31 7 -27 -18 -25 46
3493 46 -9 21 -18 -24 -4 -2 2 -17 20 -10 -14 27 31 -36 -43 24 23 5 -8 -32 -3 -15 -14 35 29 -79 -7 -16 -6 -53 62 -45 -54 66
3527 66 -21 -12 -2 10 -14 -6 46 4 11 -37 -26 31 11 2 -20 21 -60 -64 26 -52 -29 26 -45 19 1 -32 -68 30 -15 -29 46 24 39
3560 39 7 35 -14 20 -3 25 5 19 8 32 -24 23 23 39 -34 -6 -36 -69 1 -47 -41 -36 2 -62 -20 8 -27 -26 10 19 -11 -7 55
3593 55 -19 3 36 7 30 73 -38 60 -3 -19 36 -2 24 -34 42 -52 7 7 -18 -43 -44 -2 -7 -60 -53 -47 -47 -23 -3 35 -62 -9 9
3626 9 -25 5 11 3 -22 51 -30 -42 55 -2 -25 16 -18 71 37 1 -31 -23 14 -30 -26 -12 -48 11 -11 -1 8 50 -34 -21 16 -14 15
3659 15 3 -5 47 20 2 -3 -25 -12 -37 -6 12 -64 -40 -8 -26 6 0 -31 52 1 23 29 32 5 -20 -2 -4 -10 -6 6 8 14 43 26 17 86
3695 86 28 6 -24 4 19 -17 13 28 -5 1 7 -28 -21 35 -25 -80 -27 -34 -27 11 41 -9 -6 -24 -6 -47 5 -80 5 48 7 11 71 4
3729 4 11 76 -24 29 47 9 9 59 -2 -48 71 27 -32 57 -11 -23 8 21 -32 -11 -8 -61 23 -13 16 27 66 -51 23 33 -45
3760 -45 57 6 0 74 60 31 -22 -13 3 -5 -33 28 47 22 5 -26 2 -41 -14 48 1 -22 0 2 -21 87 46 -21 19 13 17 24 16
3793 16 -39 42 15 7 -3 90 -44 -27 -4 -17 32 -43 -40 -79 -5 -48 73 -24 14 -16 49 19 -22 56 25 13 -29 3 -9 55
3823 55 12 17 -10 -36 -4 -39 -26 -39 -34 14 -78 11 -28 -4 8 47 -44 -10 3 -16 -46 -16 41 12 -31 40 -35 11 25 9 60
3854 60 28 36 8 42 6 26 6 10 -2 -23 -24 33 3 -20 3 33 -47 -14 -31 -22 -50 -26 -94 -52 15 -38 -13 -14 44 -23 -9 34 11
3887 11 7 27 20 6 70 -30 32 14 5 -23 4 -37 -11 40 -20 13 -34 2 10 -31 29 -1 51 -40 -15 -23 1 -25 18 -4 -8 26 -26
3920 -26 -40 -27 7 -18 -9 4 -7 25 31 -10 19 -12 6 5 -65 -23 -6 -27 -26 26 -25 -15 -51 -30 27 4 27 -39 31 7 -6 8
3952 8 23 -53 -52 12 18 -49 -52 -18 -28 10 -26 -51 45 19 -23 10 -70 -43 -6 -23 -33 24 56 -26 4 -25 -19 51 -22 42 -2 30 -10
3985 -10 13 5 -1 -32 92 1 -2 -3 20 28 -5 55 -22 30 35 3 -5 -20 -60 -38 15 -80 -12 25 -30 43 -35 -55 13 9 44 22 -9 23
4019 23 5 25 7 22 66 -26 -37 52 -4 32 -22 2 -20 -15 -16 -35 6 -34 -26 -42 19 -56 -30 -5 -77 36 -7 -54 -15 -38 -41 51
4051 51 -8 0 3 -68 -30 -3 1 7 -19 50 -38 7 -49 2 24 -31 2 2 20 9 3 16 -6 24 34 -67 45 -25 17 -14 35 -2
4083 -2 27 54 -32 -37 -9 -19 2 -53 -2 -30 -12 -45 -29 -26 -57 -5 20 -64 -39 17 -15 9 -26 65 -11 49 1 24 31 35 -48 -7 0
4116 0 -61 106 34 24 9 17 29 -30 10 -34 8 -18 33 -38 -22 -7 52 -23 0 -42 7 -46 -67 -15 27 -7 29 -29 -9 -4 -1 17
4148 17 -23 -17 2 101 -10 1 -47 19 53 75 14 -55 -35 22 45 3 -53 -9 32 -7 -32 -60 -23 21 -26 35 -27 -7 14 -30
4178 -30 -14 -31 6 39 -6 27 16 5 32 41 -45 18 23 22 -40 -48 -1 -6 -36 19 -9 -74 17 -5 -58 19 20 -25 -11 29 -46 -10 -34
4211 -34 -19 39 16 -31 -1 3 9 60 -26 -47 -47 -36 8 -15 -14 -21 28 -51 12 -14 -2 -65 -7 32 2 22 -25 17 -2 -25 -38 38 57
4244 57 7 14 26 4 -6 -15 -53 -12 3 -19 -57 62 -13 -27 35 37 -18 18 10 22 21 -58 -7 -22 -28 -39 31 18 -4 44 -4 31 -28
4277 -28 28 24 -30 35 -31 26 36 27 -7 33 16 -38 31 33 -8 -6 -15 -50 44 1 39 40 -38 -5 -56 29 -33 -26 20 -25 45 -28 20 53
4311 53 -83 -37 24 -9 -23 58 -19 49 -4 -12 -34 -71 41 -15 -2 -24 -5 16 29 -25 11 48 -9 7 34 11 -20 1 -52 58
4341 58 -12 49 -12 16 3 -20 31 -36 -18 23 -2 -27 10 -28 -11 -19 -26 -58 -34 13 12 15 61 8 40 25 12 12 8 44 -10 22 -15
4374 -15 -45 32 -75 -22 60 -13 25 -12 33 -68 87 -29 -8 31 -32 -29 18 -8 2 16 14 -64 41 -27 -10 10 50 -16 -2
4403 -2 46 3 68 -19 -21 -9 16 -6 9 -6 -31 46 32 12 -18 17 -57 43 53 -38 -42 -25 -68 2 22 -72 -60 -6 -38 10 30
4434 30 -20 -22 -14 19 -16 58 -22 -6 4 38 10 18 43 1 49 7 -9 36 -2 -52 -3 -1 -5 -57 55 -8 -55 -14 -19 -55 -27 -18 -61
4467 -61 -29 -45 9 -30 -22 21 -35 13 12 6 -10 4 -13 -23 -17 -93 -14 15 -20 -13 8 16 -2 20 -4 -12 -37 14 35 8 -34 -39 45 13
4501 13 10 -50 -16 39 -18 2 19 19 47 -12 -7 -22 -29 15 -48 -14 -32 -61 -35 9 0 -11 -17 -42 -54 -24 -49 31 49 -13 25 7 78
4534 78 23 9 30 45 88 28 2 23 -3 -8 15 43 0 15 -2 -28 44 -25 9 13 72 -21 -59 -20 -32 5 2 57 10 -4 -14 22
4566 22 -56 -40 33 -7 -23 -29 -14 41 52 34 -32 21 -53 -17 -11 -35 55 -2 -47 -28 7 -3 19 25 -25 -22 -25 -23 -40 -15 13 7 26 -6
4600 -6 -32 52 -19 12 9 -9 -19 -69 -38 14 31 -22 18 -3 -19 38 -21 5 -53 18 11 -40 36 -24 2 -15 17 -24 56 10 -24 -12
4632 -12 45 -13 52 -16 -27 21 4 -3 -37 20 -32 -13 -16 -17 -1 19 17 -1 22 -20 -3 12 21 -7 -18 32 -13 12 -21 -49 13 10 -32
4665 -32 -14 62 -3 38 64 1 20 -16 -40 -72 -63 -7 -18 -28 8 -46 -26 -76 21 -26 25 -38 -10 -41 -49 -10 -9 -1 -50 -39 4 -3 19
4698 19 49 -3 7 -6 -10 22 25 33 -23 -2 7 -1 -22 2 5 -40 8 46 -9 24 -58 9 -45 -7 17 -36 -7 -8 -9 -31 5 -55 25 -5
4732 -5 -19 22 -17 -11 2 -21 31 -22 -2 37 -5 47 61 -4 -55 -7 -12 1 -1 69 -1 16 27 29 43 47 25 -5 -30 19 -7 -10 25 24
4766 24 -1 53 -15 29 -29 -13 -17 -35 16 21 -52 -35 -6 -31 -26 -29 -28 -35 44 -19 3 10 21 -22 -38 -27 -26 -2 -3 -12 35 9 53 -20 -31
4801 -31 7 -22 34 7 -5 -49 17 -5 9 9 -28 -3 22 32 41 -22 7 -23 22 -50 6 -3 -56 38 6 33 47 -19 -31 20 -23 -23
4833 -23 3 33 -52 -1 36 15 42 -23 -23 -18 51 16 -7 -50 -31 -10 -37 -34 28 -5 4 -4 -12 -37 0 21 1 -24 4 16 -12 -25 -8
4866 -8 -52 -5 -14 -16 3 22 31 1 36 -11 8 -5 -21 -48 79 -11 -13 2 1 -65 13 16 -57 3 2 34 -20 18 25 20 -43 51 -1 -48 -101
4901 -101 18 15 34 -23 -56 -7 -17 60 18 -33 -8 29 8 -10 -1 46 44 35 -13 15 10 -8 56 3 -3 6 56 -5 29 -53 3 -7 -25
4934 -25 -42 1 23 1 50 -21 -28 -45 -9 5 1 -5 21 1 -70 10 -17 -68 -37 14 5 28 18 5 -21 20 19 9 7 18 20 -13 18 -34
4968 -34 -24 28 -8 3 -26 -32 -31 -15 44 33 -37 -4 -19 -34 -4 -17 7 -31 94 -32 -18 44 29 -17 0 -58 -52 35 6 0 -1 25
5000 25 40 -3 20 10 2 34 -57 41 12 -22 45 13 -15 4 -2 1 21 -38 -8 -14 24 39 21 6 -37 16 -19 -31 -3 8 -32 7
5032 7 -38 -11 2 35 19 38 9 -5 31 20 -4 59 -6 60 36 6 -39 -52 25 39 31 35 11 9 -6 -67 -55 8 4 -8 2 64 8
5065 8 -19 13 -31 36 86 -25 -30 -24 24 36 28 20 -4 50 8 19 19 24 -28 24 -1 -4 19 21 -44 -6 -33 12 -39 17 8 40 23 32 23 24
5101 24 -14 -1 4 -29 -24 -40 -16 -5 8 40 28 32 7 45 1 13 11 -8 -1 14 18 18 24 -2 48 27 -80 66 -52 1 49 15 8
5134 8 -46 -20 -17 57 -15 30 -4 -47 10 -16 8 59 7 -15 -36 -19 -4 62 52 40 -7 10 -14 28 41 -20 23 46 -72 -22 -2
5165 -2 -17 4 -4 18 -33 55 25 13 54 16 58 -8 -20 -24 16 44 3 -24 -24 16 -40 40 30 19 7 -6 -35 23 -35 -2 -9 -12 -64
5198 -64 -32 -33 24 8 16 62 8 -20 16 28 -1 -31 19 23 -15 12 -8 -24 71 -1 -10 38 -22 32 -15 7 20 -50 -14 17 55 -20
5230 -20 -15 -54 7 -10 -35 33 21 -47 29 -8 -5 -38 25 -4 45 20 24 18 0 8 -33 -40 -23 4 41 17 -36 -42 50 25 -24 -17 20 -22
5264 -22 -73 36 27 -4 -24 -32 -8 26 -46 -19 3 17 5 -36 30 -13 -27 6 27 61 -22 24 18 22 30 70 -9 27 -43 -17 3 51
5296 51 32 8 -11 -19 -14 13 48 11 16 37 -41 -4 -62 -28 -14 -36 32 -9 -25 -21 -24 -36 -7 9 -1 -50 -16 -50 3 43 -26 19 15
5329 15 -12 2 3 0 8 20 -11 -91 17 43 23 -5 19 31 14 47 10 20 -19 -7 26 10 -10 -4 -17 -31 3 16 -30 -59 -14 48
5361 48 21 16 -10 2 27 -37 -17 -10 -9 50 -37 -25 30 42 -20 19 -37 31 46 31 28 -19 -62 -29 6 47 35 -25 10 -11 36 -49
5393 -49 -39 11 14 -19 6 -27 -39 -12 4 14 50 21 16 -44 3 -25 7 2 -47 -27 -11 30 4 25 6 0 -9 -49 0 -16 -6 -30 25
5426 25 15 2 19 -7 -11 -37 -4 -26 20 -11 -25 40 -40 -41 11 -59 5 -38 9 -52 1 -28 -47 12 -23 27 -47 -44 -9 -28 -3 13
5458 13 -12 3 -13 -16 5 -22 31 -2 5 27 73 33 38 -15 11 -21 -45 24 8 22 -9 22 8 36 40 -6 -46 18 21 37 7 -6 -5
5491 -5 -20 17 -3 -15 -31 -15 -16 -43 -8 12 -11 53 1 6 68 15 7 20 27 -28 -4 11 -7 -59 -5 -1 -21 -8 4 -38 33 60 -13
5524 -13 2 -6 -27 -42 2 -16 -6 14 50 11 4 13 -27 -11 -33 46 84 -45 12 50 45 9 13 -10 24 53 -6 51 46 -7 17 11 59
5557 59 2 24 47 60 -58 75 5 8 -22 4 -17 -18 12 -5 33 -35 -1 -26 -13 23 20 -11 -8 25 -17 15 36 -23 -13 -13 26 6
5589 6 25 6 17 22 -27 -5 -10 -25 2 8 -5 29 12 31 -19 -19 3 12 29 12 -3 27 53 -5 -2 3 -10 -34 9 -66 1 -27 38 -13
5623 -13 -7 -10 -5 3 -32 14 -30 -32 55 52 62 -3 -40 -27 -49 24 2 30 -34 -5 14 19 24 -20 -19 -39 5 -27 19 -2 -19 9 37 35 -57
5658 -57 17 -34 8 -18 -3 47 -26 16 23 13 17 -12 -11 33 14 -15 40 -27 48 6 -43 24 -39 10 4 -24 -8 9 -15 42 13 15 -10
5691 -10 -11 -68 35 -22 -18 2 15 38 -5 21 -66 8 7 94 -15 20 34 -8 -25 -11 -7 -20 -62 -15 -7 3 -11 8 15 -11 54 51 10
5724 10 -14 25 2 -45 -3 -29 50 9 25 -19 28 -85 10 34 15 -53 7 69 -39 3 -31 25 56 -46 -57 7 39 -29 14
5753 14 -2 25 13 74 -9 35 -56 -4 16 5 -37 -6 25 48 20 -1 6 22 8 2 -62 45 -4 17 -27 8 3 -29 -15 -51 8
5784 8 -39 15 24 16 -27 35 -30 40 27 18 17 16 -6 -4 10 1 32 -33 31 15 -17 -5 13 -17 6 -9 12 -5 15 0 -60 1 -5 -18 -1
5819 -1 38 15 -5 -9 -3 6 -13 -19 43 17 -1 51 -13 -16 -12 33 9 3 -14 20 -49 -52 -19 -33 -61 -29 0 -12 -45 -37 -1 26 -7 -39 12
5854 12 -34 43 7 29 39 17 10 55 3 39 36 -16 17 8 11 -21 42 -85 0 28 11 -4 -14 -7 -9 56 29 -38 36 12 -13 -15 -14 18
5888 18 17 34 4 4 -1 23 16 -1 22 -3 -9 8 -3 0 19 -26 32 23 -14 32 2 20 4 -79 32 55 13 96 59 30 -8 0 20 15
5922 15 -6 -11 -78 -17 9 -40 5 64 -31 -4 38 -49 -17 -15 1 30 -51 39 -12 8 16 14 10 -41 -45 -28 -5 -15 7 31 -25 -35 -14
5955 -14 -7 36 6 1 18 27 -30 -12 -17 -37 27 -3 -34 -19 34 15 58 11 39 60 7 -40 -13 -2 3 39 37 34 -44 64 24 11 -22
5988 -22 -55 -9 -30 7 15 -23 -40 20 -9 38 6 -13 -41 6 25 26 -38 -7 -40 -6 -55 4 -35 16 50 47 -11 15 19 12 5 43 -10
6021 -10 32 -11 15 8 -61 21 18 -26 3 -2 -23 50 -49 21 6 -45 -61 -10 -37 21 -38 -23 12 -10 -47 0 -34 -3 21 49 -31 -52
6053 -52 20 -44 -16 -17 -47 -6 6 5 -1 -10 20 -64 -14 5 3 -12 10 10 -28 -12 24 -12 -7 -21 -29 6 -36 7 3 -1 51 -5 14 4 -31
6088 -31 4 10 -7 -16 11 18 -29 25 25 -15 -2 0 1 20 15 14 2 40 -35 21 1 34 -15 -21 6 16 -1 -8 -46 11 14 3 -39 4 -62 1
6124 1 0 23 -29 -61 -30 -4 -8 -11 0 -29 -42 13 2 33 40 22 33 31 21 -8 40 5 -9 43 -10 21 -11 19 -15 26 33 4 15 -18
6158 -18 11 25 -2 15 -51 -48 -4 4 -20 48 -14 -51 -25 -52 74 5 -39 -47 -28 14 63 -39 -11 -2 -13 61 -14 7 14 -30 7 43
6190 43 23 -15 -14 -12 -3 -80 -36 21 -50 -39 24 -47 -31 -46 21 -3 -14 4 9 45 -26 -45 -22 5 -24 14 -66 34 -16 46 -4 3
6222 3 25 -9 9 24 71 12 44 -1 14 38 17 -29 14 -3 -37 18 -47 -41 -23 16 -27 -39 17 33 -5 31 -14 -6 15 -37 -12 8
6254 8 -6 9 2 22 2 3 -15 12 22 6 -10 -27 39 22 -27 -40 36 13 5 31 11 5 -9 38 25 -8 4 21 -30 -2 46 -3 18
6287 18 -4 42 1 -36 11 -1 -21 47 -10 -50 -11 -9 22 -29 38 59 32 27 50 42 -37 11 48 15 60 41 47 -37 0 -8 -3 -38 28
6320 28 -13 -31 -30 -50 -17 -6 30 -16 -37 -30 53 45 -46 18 -11 0 -6 -6 -43 -3 -30 -69 17 6 30 -52 16 -6 -31 -2 19 -15 18
6353 18 -12 27 6 20 17 -1 67 -38 -20 -34 2 34 -4 42 42 -12 -51 -39 -16 18 31 -1 -15 -8 7 5 33 -18 -56 -3 -53 0
6385 0 -44 70 58 -34 -6 -19 2 7 -35 1 1 -3 -6 14 27 -34 3 -38 -71 57 -1 12 -9 -21 0 10 9 -2 -19 5 -25 -25 17
6418 17 34 -36 25 -40 -5 28 -1 13 1 -16 19 -4 -53 30 -8 2 -21 -15 30 34 68 4 47 -15 16 30 20 20 -12 -5 -6 13 -26
6451 -26 1 9 13 13 5 47 26 -11 6 -16 -18 -24 7 33 -2 8 1 -11 48 3 -6 -55 -39 -2 23 32 28 28 -31 -47 43 43 7 -5 9 -20
6487 -20 -15 52 7 62 18 -3 -47 -16 6 -17 42 16 -42 1 -33 27 45 -24 -19 -6 -14 -19 7 -29 1 14 10 -31 5 -18 41 7 20
6520 20 9 33 -19 17 41 -40 -3 17 -4 8 -36 4 17 -1 8 -16 24 -24 -20 60 -56 -4 25 0 -33 -4 -1 -17 4 18 -26
6551 -26 28 -5 -54 -11 -29 -2 3 3 14 -6 21 -46 -6 -5 -21 -13 14 2 32 14 45 6 16 6 37 -6 -13 20 -15 -36 -27 33 10
6584 10 -6 -39 -9 6 -11 6 11 21 3 6 21 -8 -3 22 27 -19 46 -30 -6 13 -42 -108 -1 -56 15 -6 -3 36 -30 24 1 3 -17
6617 -17 3 -2 37 13 18 -26 5 -2 -37 -11 -2 27 28 -42 -23 4 28 -55 -53 15 -58 -28 35 -23 -21 44 4 -8 66 26 6 -2 2 57 -1
6652 -1 -38 0 72 -31 10 8 -42 40 31 16 -26 -65 -19 9 47 13 -21 -4 -69 16 -3 -16 -53 12 -4 -30 -31 -10 -11 -1 -45 -39 51
6685 51 6 -49 -45 -28 -63 18 -6 -3 6 39 -1 -17 31 5 -42 13 75 35 -13 -4 -71 -11 4 19 -26 -47 -41 -14 -20 -15 8 -37 25 -38
6719 -38 -53 4 20 -37 -26 46 -43 22 -18 -12 2 2 -6 16 23 -3 -14 10 33 -10 44 3 -46 66 -13 23 71 10 -18 -19 65 -40
6751 -40 -49 -18 -37 12 -60 -33 -29 -71 92 2 8 -8 2 9 2 3 12 -16 -52 -32 17 4 -15 55 -21 -15 -1 -7 29 19 -21 52 -2 -14
6785 -14 4 43 -14 -10 4 -41 18 -38 -31 15 11 25 19 21 -2 -11 -28 9 0 -31 45 -49 -40 -13 -79 24 -33 44 -2 -7 28 -5 -8 -9 -9 22
6821 22 -23 -6 -20 -24 -26 20 4 63 13 56 -59 -13 41 6 42 -24 28 65 -21 -33 -32 -23 -33 -18 2 -34 38 -29 -69 -24 7 9
6853 9 49 -9 -39 10 -2 -14 -6 -6 -12 -34 42 0 -7 -15 41 -38 -2 -59 -12 -2 -1 -35 -13 -26 10 -42 72 24 10 7 -22 -3 -17 10
6887 10 4 -26 -69 -28 -40 -14 -25 34 16 17 11 -18 10 28 22 25 -48 39 -4 5 32 -11 6 -4 -11 32 22 -11 19 34 34 -26 -17 -7 19
6922 19 43 -53 -4 19 7 -36 3 4 15 -47 36 -62 36 69 67 -28 6 -48 -18 -12 -40 -6 45 -37 -27 1 -1 18 18 -13 -4 66 1
6955 1 21 -22 -12 45 27 -18 -11 -57 -16 13 -8 -21 -27 -32 -5 16 -44 44 -43 -53 -1 -25 16 -53 24 8 34 -54 14 36 102 -6
6987 -6 -30 65 27 21 20 -31 -27 19 24 57 46 40 19 29 -5 -22 10 -17 -19 -14 -33 -21 29 46 23 -35 -26 2 -28 -29 -5 23 27 -13 -4 -6 15
7024 15 -12 -48 2 -15 34 6 60 -10 28 -9 0 -14 -14 32 34 43 36 -2 -48 22 34 -43 9 -21 7 6 7 -4 -24 -50 4 0 -48 -22
7058 -22 14 19 0 34 11 -35 -2 -26 -30 -5 14 -8 -6 -22 -9 -8 -50 65 3 46 -36 9 12 -4 30 -6 19 24 8 -20 7 0 0 36
7092 36 26 23 41 -42 1 -25 -26 -13 18 2 37 -44 -27 20 32 0 0 3 -41 9 -3 7 -8 -14 -16 36 -22 -14 3 57 2 -22 18 16
7126 16 -19 -2 10 2 -23 -50 -13 -4 -27 0 28 15 -3 -5 -42 -16 4 -29 -5 12 -31 54 -7 -27 -17 24 7 -30 -30 -64 32 -3
7158 -3 -18 -14 -2 5 -31 82 21 31 -4 -6 69 15 -4 18 -6 7 -62 -8 25 -36 5 -25 49 -20 -10 30 68 17 6 -44 -8 -6
7190 -6 11 45 -8 -3 31 -45 -15 41 24 11 1 32 -1 13 21 -1 -14 11 -3 0 -9 -1 9 -22 -10 -13 7 13 -37 20 49 0 -29 -38 20
7225 20 -21 2 62 3 13 23 -18 -2 -13 -4 39 40 16 -48 37 32 -16 21 28 33 18 16 23 46 34 6 -6 -5 7 16 -25 17 -12 21 -6
7260 -6 7 20 43 -58 -13 -14 -14 -26 -37 25 1 54 22 9 -8 7 13 -9 -20 16 -29 -13 47 15 -8 -29 3 -12 0 -26 -19 -9
7292 -9 -35 10 -33 6 9 -20 37 37 -38 -52 13 19 5 -16 -6 -11 72 9 9 -40 12 -30 6 -4 12 39 16 2 -28 -17 -12 4 12 -1
7326 -1 13 74 9 50 -22 12 29 -43 13 -9 -51 15 -36 39 -10 15 1 -40 -5 -32 -2 46 -33 -10 -26 -4 -1 19 -15 2 -5 12
7358 12 40 -18 -27 -56 76 -29 45 -1 -42 -2 -11 -6 28 -12 -9 -4 -24 -12 6 -33 -23 52 20 -26 -21 -14 -7 39 -10 -20 14 49 -15
7391 -15 -25 -19 -23 -28 3 -36 -36 19 12 -5 -20 2 -3 -38 -79 3 -23 -75 -37 41 -26 29 14 -21 -20 15 -51 -28 38 -2 23 3 -66 5
7425 5 25 -29 -48 -23 45 13 -48 0 -19 -6 4 9 -2 9 -24 -17 38 16 -28 -12 19 55 -40 45 38 -19 15 -43 13 -20 -9 29
7457 29 9 0 2 -17 -25 3 16 -14 44 -65 -18 50 -63 -35 -7 30 -13 -32 -23 36 11 -20 40 11 -44 -44 -83 -51 3 6 7 -55 -63
7490 -63 -22 20 14 17 11 34 -51 6 -17 -54 17 25 30 -71 34 7 25 -33 4 -11 -30 44 -32 -16 26 -56 11 -12 -36 -8 -3 0 -27
7523 -27 -41 9 32 41 26 -26 -24 -49 -18 -26 -2 0 -7 -17 -9 28 49 -9 -4 49 -12 -28 9 15 16 47 20 -35 -4 -58 -57 32 11 -6 34
7558 34 -7 0 -2 -14 -37 -36 11 20 -50 -39 -23 -27 -11 -12 -21 24 -18 -12 26 34 39 32 -23 47 2 4 -37 -3 -43 -32 -10 18 10 2 -16 -10 -16 -19 -53
7597 -53 -23 22 15 -4 -24 -14 30 9 -10 -25 -29 9 -24 -30 21 -35 -37 -16 -44 -39 -7 -10 -15 4 5 4 21 -58 0 13 21 -9 19 41 28
7632 28 -25 6 42 37 -78 -25 14 31 -31 61 -11 14 8 34 -24 -31 -34 24 -48 -6 -12 -21 -40 14 18 -32 12 2 21 7 -7 -5 -42 -19
7666 -19 27 -53 -5 -6 7 -10 -21 49 1 20 -57 -21 18 -20 -26 -23 1 26 -17 -49 40 -30 10 14 -27 -21 -50 21 -11 -45 -19 -18 -32
7699 -32 -6 2 17 39 -16 3 -24 -22 3 59 29 -16 37 32 60 32 38 7 10 5 -21 -12 -44 -1 -27 40 1 4 -44 -38 -23 47 18 -40 33
7734 33 -24 -61 -11 -73 -12 -11 50 17 -7 -37 22 -18 -47 64 5 -35 40 4 40 -24 24 -43 -2 -3 -28 -26 2 34 7 26 0
7765 0 9 -36 -24 -53 -14 -77 -11 1 -42 -24 1 37 -38 -29 -23 -7 5 56 -41 52 4 -14 11 44 -32 -17 -5 -38 -24 30 -50 -33
7797 -33 45 -14 46 17 -10 -46 17 24 -3 11 -28 -62 1 -20 -42 -24 0 4 -26 11 -55 -9 4 -11 6 10 -37 -12 -33 4 -26 -28
7829 -28 23 -9 -2 29 -8 26 -54 -17 18 -55 -8 -29 18 34 -15 8 -7 -13 1 -1 -32 -8 0 -25 -34 32 -48 3 -6 -29 -31 -11 48 2
7863 2 -8 -20 -25 -28 -5 -28 29 -27 -38 -36 4 -9 35 -8 -19 -64 5 -3 -3 11 -7 -27 -16 14 37 -20 -15 -18 7 11 -64 19 25 -20 -9
7898 -9 -10 -33 38 -13 -16 -12 -40 -28 -47 -9 -27 -38 15 -18 1 -34 -15 8 -3 -6 -8 17 29 13 12 50 -6 37 -14 -47 -11 26 -26 -40
7932 -40 18 10 -41 -36 -17 -48 -7 0 -91 12 -10 -21 -53 -48 -37 -40 -34 -19 -40 -16 26 21 -31 56 8 -8 15 -26 41 -30 17 -15 39
7965 39 26 -38 53 15 3 1 5 10 -5 -4 -33 -8 -17 -59 -40 -17 7 -51 3 -41 -27 37 -1 -25 -14 49 19 -23 17 -42 13 -16 -19
7998 -19 -32 4 -11 -32 -28 17 -8 12 2 -14 -15 -34 5 -41 -2 -39 9 32 -35 -16 -16 9 4 11 -71 -16 30 -16 -32 -31 4 -29 2
8031 2 27 -13 -21 -44 -19 21 -35 -18 8 -22 21 -65 -1 -38 84 -37 5 22 7 -9 -23 -8 3 -19 13 18 5 -12 17 31 35
8062 35 39 -40 22 -69 7 -27 -16 11 9 -13 -9 -69 -3 -5 -15 -28 4 7 -24 -39 20 -12 20 15 16 -33 -9 -29 31 -2 -44 5 11 -23
8096 -23 5 23 54 53 -2 -5 -5 9 22 -19 -27 10 -54 -63 -49 -52 -22 -5 -3 9 37 -31 -2 4 12 -25 -4 -18 -4 -17 21 -18 0 13 -13
8131 -13 -7 -8 0 17 -22 24 29 28 66 -42 -2 -53 -2 25 -33 3 -43 16 45 29 -18 7 36 -3 -5 -3 -10 -18 -17 -30 -6 9 -37 -9 -32
8166 -32 -1 10 -31 6 -1 -34 37 3 11 84 5 3 32 2 -41 -16 12 -20 -30 -7 15 -49 55 27 -19
8191a9
##END NTUPLES=NMR FID
##END=
