##TITLE=1H_LR-758-R5-iSp
 CDCl3
 8 sc, 
 29.8.2023
##JCAMPDX= 6.0         $$ Bruker NMR JCAMP-DX V2.0
##DATA TYPE= NMR FID
##DATA CLASS= NTUPLES
##ORIGIN= UXNMR, Bruker Analytische Messtechnik GmbH
##OWNER= root
$$ XWIN-NMR		Version 3.5
$$ Tue Aug 29 15:03:48 2023 Russian Standard Time (UT+4h)  she@DPX200
##.OBSERVE FREQUENCY= 200.13135
##.OBSERVE NUCLEUS= ^1H
##.DELAY= (6, 6)
##.ACQUISITION MODE= SIMULTANEOUS
##.ACQUISITION SCHEME= undefined
##.AVERAGES= 8
##.DIGITISER RES= 18
##SPECTROMETER/DATA SYSTEM= spect
##.PULSE SEQUENCE= zg30
##.SOLVENT NAME= CDCl3
##.SHIFT REFERENCE= (INTERNAL, CDCl3, 0, 15.7039)
##AUDIT TRAIL= $$ (NUMBER, WHEN, WHO, WHERE, WHAT)
$$ ##TITLE= Audit trail, XWIN-NMR		Version 3.5
$$ ##JCAMPDX= 5.01
$$ ##ORIGIN= Bruker BioSpin GmbH
$$ ##OWNER= she
$$ F:/spectra/data/she/nmr/H-F/1/audita.txt
$$ ##AUDIT TRAIL=  $$ (NUMBER, WHEN, WHO, WHERE, WHAT)
(   1,<2023-08-29 15:02:38.21 +0400>,<she>,<DPX200>,
      <created by zg, POWCHK disabled, PULCHK disabled
       configuration hash MD5:
       00 E9 B6 7A A2 85 ED C7 34 08 36 98 17 FE 4E 26
       data hash MD5: 16K
       A2 B2 55 07 69 AC 27 DB EF 57 0B 06 41 E4 DA A5>)
$$ ##END=
$$ 
$$ hash MD5
$$ 4E 0A D5 48 29 81 02 C1 F3 38 11 C2 69 93 1D 56
##$RELAX= 
##$RELAX= 
##$RELAX= 
##$RELAX= 
##$RELAX= 
##$RELAX= 
$$ Bruker specific parameters
$$ --------------------------
##$DU= <F:/spectra>
##$EXPNO= 1
##$NAME= <H-F>
##$PROCNO= 1
##$TYPE= <nmr>
##$USER= <she>
##$AMP= (0..31)
100 100 100 100 100 100 100 100 100 100 100 100 100 100 100 100 100 100 
100 100 100 100 100 100 100 100 100 100 100 100 100 100 
##$AQSEQ= 0
##$AQ_mod= 1
##$AUNM= <au_zg>
##$AUTOPOS= <>
##$BF1= 200.13
##$BF2= 200.13
##$BF3= 200.13
##$BF4= 200.13
##$BF5= 200.13
##$BF6= 200.13
##$BF7= 200.13
##$BF8= 200.13
##$BYTORDA= 1
##$CFDGTYP= 0
##$CFRGTYP= 5
##$CHEMSTR= <none>
##$CNST= (0..31)
1 1 145 1 1 1 1 1 1 1 1 1 1 1 1 1 1 1 1 1 1 1 1 1 1 1 1 1 1 1 1 1 
##$CPDPRG= <>
##$CPDPRG1= <>
##$CPDPRG2= <>
##$CPDPRG3= <>
##$CPDPRG4= <mlev>
##$CPDPRG5= <mlev>
##$CPDPRG6= <mlev>
##$CPDPRG7= <mlev>
##$CPDPRG8= <mlev>
##$CPDPRGB= <>
##$CPDPRGT= <>
##$D= (0..31)
0 1.2 0 0 0 0 0 0 0 0.06 0 0.03 0 0 0 0 0.0002 0 0 0 0 0 0 0 0 0 0 0 0 
0 0 0 
##$DATE= 1693306957
##$DBL= (0..7)
120 120 120 120 120 120 120 120 
##$DBP= (0..7)
150 150 150 150 150 150 150 150 
##$DBP07= 0
##$DBPNAM0= <>
##$DBPNAM1= <>
##$DBPNAM2= <>
##$DBPNAM3= <>
##$DBPNAM4= <>
##$DBPNAM5= <>
##$DBPNAM6= <>
##$DBPNAM7= <>
##$DBPOAL= (0..7)
0.5 0.5 0.5 0.5 0.5 0.5 0.5 0.5 
##$DBPOFFS= (0..7)
0 0 0 0 0 0 0 0 
##$DE= 6
##$DECBNUC= <off>
##$DECIM= 32
##$DECNUC= <off>
##$DECSTAT= 4
##$DIGMOD= 1
##$DIGTYP= 9
##$DL= (0..7)
0 120 120 120 120 120 120 120 
##$DP= (0..7)
150 150 150 150 150 150 150 150 
##$DP07= 0
##$DPNAME0= <>
##$DPNAME1= <>
##$DPNAME2= <>
##$DPNAME3= <>
##$DPNAME4= <>
##$DPNAME5= <>
##$DPNAME6= <>
##$DPNAME7= <>
##$DPOAL= (0..7)
0.5 0.5 0.5 0.5 0.5 0.5 0.5 0.5 
##$DPOFFS= (0..7)
0 0 0 0 0 0 0 0 
##$DQDMODE= 0
##$DR= 18
##$DS= 0
##$DSLIST= <SSSSSSSSSSSSSSS>
$$ [...]
##$SUBNAM2= <"">
##$SUBNAM3= <"">
##$SUBNAM4= <"">
##$SUBNAM5= <"">
##$SUBNAM6= <"">
##$SUBNAM7= <"">
##$SUBNAM8= <"">
##$SUBNAM9= <"">
##$SW= 18.05172834244
##$SWIBOX= (0..15)
0 0 2 0 0 0 0 0 0 0 0 0 0 0 0 0 
##$SW_h= 3612.71676300578
##$TD= 16384
##$TD0= 1
##$TE= 0
##$TE2= 300
##$TE3= 300
##$TEG= 300
##$TL= (0..7)
0 120 120 120 120 120 120 120 
##$TP= (0..7)
150 150 150 150 150 150 150 150 
##$TP07= 0
##$TPNAME0= <>
##$TPNAME1= <>
##$TPNAME2= <>
##$TPNAME3= <>
##$TPNAME4= <>
##$TPNAME5= <>
##$TPNAME6= <>
##$TPNAME7= <>
##$TPOAL= (0..7)
0.5 0.5 0.5 0.5 0.5 0.5 0.5 0.5 
##$TPOFFS= (0..7)
0 0 0 0 0 0 0 0 
##$TUNHIN= 0
##$TUNHOUT= 0
##$TUNXOUT= 0
##$USERA1= <user>
##$USERA2= <user>
##$USERA3= <user>
##$USERA4= <user>
##$USERA5= <user>
##$V9= 5
##$VALIST= <valist>
##$VCLIST= <CCCCCCCCCCCCCCC>
##$VD= 0
##$VDLIST= <DDDDDDDDDDDDDDD>
##$VPLIST= <PPPPPPPPPPPPPPP>
##$VTLIST= <TTTTTTTTTTTTTTT>
##$WBST= 1024
##$WBSW= 4
##$XGAIN= (0..3)
0 0 0 0 
##$XL= 0
##$YL= 0
##$YMAX_a= 275062
##$YMIN_a= -302908
##$ZGOPTNS= <>
##$ZL1= 120
##$ZL2= 120
##$ZL3= 120
##$ZL4= 120
##$ABSF1= 10
##$ABSF2= 0
##$ABSG= 5
##$ABSL= 3
##$ALPHA= 0
##$AQORDER= 0
##$ASSFAC= 0
##$ASSFACI= 0
##$ASSFACX= 0
##$ASSWID= 0
##$AUNMP= <proc_1d>
##$AZFE= 0.1
##$AZFW= 0.1
##$BCFW= 1
##$BC_mod= 2
##$BYTORDP= 1
##$COROFFS= 0
##$CY= 11.3945322036743
##$DATMOD= 1
##$DC= 2
##$DFILT= <>
##$DTYPP= 0
##$F1P= 15.7292609196834
##$F2P= 12.9074282941183
##$FCOR= 0.5
##$FTSIZE= 0
##$FT_mod= 4
##$GAMMA= 1
##$GB= 0.15
##$INTBC= 1
##$INTSCL= 1
##$ISEN= 128
##$LB= 0.24
##$LEV0= 0
##$LPBIN= 0
##$MAXI= 10000
##$MC2= 0
##$MEAN= 0
##$ME_mod= 0
##$MI= 1.114404
##$NCOEF= 0
##$NC_proc= 0
##$NLEV= 6
##$NOISF1= 3.799351
##$NOISF2= 2.8
##$NSP= 1
##$NTH_PI= 0
##$NZP= 0
##$OFFSET= 15.70392
##$PC= 1
##$PHC0= -21206.65
##$PHC1= 13.65272
##$PH_mod= 1
##$PKNL= yes
##$PPARMOD= 0
##$PSCAL= 0
##$PSIGN= 0
##$REVERSE= no
##$SF= 200.130013532006
##$SI= 16384
##$SIGF1= 3
##$SIGF2= 2
##$SINO= 400
##$SIOLD= 16384
##$SREGLST= <1H.CDCl3>
##$SSB= 0
##$STSI= 0
##$STSR= 0
##$SW_p= 3612.71676300578
##$SYMM= 0
##$S_DEV= 0
##$TDeff= 0
##$TDoff= 0
##$TI= <>
##$TILT= no
##$TM1= 0
##$TM2= 0
##$TOPLEV= 0
##$USERP1= <user>
##$USERP2= <user>
##$USERP3= <user>
##$USERP4= <user>
##$USERP5= <user>
##$WDW= 1
##$XDIM= 8192
##$YMAX_p= 0
##$YMIN_p= 0
$$ End of Bruker specific parameters
$$ ---------------------------------
##NTUPLES= NMR FID
##VAR_NAME=  TIME,          FID/REAL,        FID/IMAG
##SYMBOL=    X,             R,               I
##VAR_TYPE=  INDEPENDENT,   DEPENDENT,       DEPENDENT
##VAR_FORM=  AFFN,          ASDF,            ASDF
##VAR_DIM=   8192,          8192,            8192
##UNITS=     SECONDS,       ARBITRARY UNITS, ARBITRARY UNITS
##FACTOR=    0.0002768,     1,               1
##FIRST=     0,             0,               0
##LAST=      2.2672688,     0,               0
##MIN=       0,             -302908,         0
##MAX=       2.2672688,     275062,          0
$$ Real data points
##PAGE= N=1
##DATA TABLE= (X++(R..R)), XYDATA
0@%%%%%%%%%%%Qj6J6j6K4l2L2m0N6o4P2q8J04j20J41j65J92k24K56k88L28l75
33a99M23m77N38o03O75p54Q40r36J040j152J274j408J554j715J893k086K297k528
51a324K784l070L389l746M147m603N130n742O462p327Q389r729J1475j3851J7283
66I667k2685L2394n4864J90006L4465m91891L64764J24836m08568K04370K64175
77B46669l73706J9927K40907j86695l922J89663j71262m3190J39378p8589N430
88a5390R7813j24904m074R1248q0590M4819P6738j59049K9411J28997j36201K3114
100b8068J49595j77662m1743J99127j02310p0955J69493j06158j01544J85983
110G5758m6831j08037J57801o3643j40625J89483Q242j73510J37841L4381j87266
$$ y = [0, 0, 0, 0, 0, 0, 0, 0, 0, 0, 0, 0, 8, -8, 8, -8, 16, -16, 16, -24, 32, -32, 40, -48, 56, -64, 77, -88, 104, -120, 136, -152, 176, -199, 224, -253, 285, -318, 357, -397, 443, -493, 547, -605, 669, -739, 815, -900, 993, -1093, 1204, -1324, 1460, -1610, 1779, -1967, 2180, -2423, 2707, -3035, 3427, -3900, 4489, -5240, 6235, -7616, 9667, -13018, 19376, -35488, 154518, 188983, -302908, 61856, 186692, -221876, -17506, 246669, -127037, -107110, 133797, -52898, -56820, 132843, -38419, -81609, 57769, -20820, -15390, 82423, -42481, -46555, 44693, -35897, 8922, 85660, -73389, -43978, 85019, -51182, -28068, 121527, -56135, -97878, 101249, -1061, -72016, 97477, -8681, -110225, 75758, 28927, -79110, 78691, 15048, -125577, 63906, 72148, -101362, 36479, 70860, -116406]
121a16406J15455J10056j65292K6883R2837j15281K6871R6366r0883j494N4096
132C3208p9046L9496P5338j02064O279P6975r2479J4298J07226r6462l6035J02680
144D9414o4552k9692J14104o4670p3873J08768k3567p3430J03568r516j07809
155g1255P7135L9272q3932M5684L4485q2836K6859N0775n2664J7227K8540o3291
167c4001K0309N1967n3039L214M5088n5874n866O4113l2515k5344M1128k5955
179f775j6831M7463j7807k4118L3965k1625j8775N0654j4633l8745L9644l557
191H860l6058M1857P463m6277K4283J4787l4898K6288J6927m4785J5212K6968
203B0627l7009J1335L2555m0684o204L9521k1634j2021L0630j8344j6385K8068
$$ y = [-116406, -951, 109105, -56187, -29304, 63533, -51748, -24877, 71489, -19394, -20888, 33208, -45838, -6342, 68996, -33068, -26789, 50186, -42293, -27995, 79231, -17231, -53266, 49414, -15138, -44830, 69274, 4604, -69269, 39499, 15932, -57498, 46070, 36554, -71255, 5880, 45152, -38780, 6904, 41389, -41447, -14588, 36187, -16477, 750, 29290, -34001, -13692, 38275, -14764, -11550, 33538, -22336, -28202, 35911, 3396, -21948, 19180, -6775, -23606, 23857, 6050, -18068, 15897, -5728, -24503, 26151, 11518, -27227, 12417, 8860, -27198, 14659, 22122, -24155, 128, 14915, -19983, 6305, 23232, -21553, -6341, 20627, -16382, -5047, 27508, -13176, -19380, 20141, -1493, -13514, 17116, -1228, -17613, 10455]
215A0455p497j1811K1181j4464j3807K8357p177j8674K4418n878k3433K5070N731
228A2471k4056J4075M939k0208J5771Q158k1269J1085P694k1743J3228J4819k4747
241i783L475J8242j8795K19J9383j5447o139J6401r340l715J4913j1184o578J6322
255G974p535q298J6354n622j3198J4510J616j2434Q849K287j0646O845L533q422
269d187N643J747r399O761M942j0370L466O581r122R75Q124o339j723N772m215
284a344k25N191n037n89N895n312j533P944m464n260P689o79o168N437J177n894
300c172L226K060m208K606J115m615L025K506n158J754L893n004k18M966k866
315i0k067L609j166j480K372j101o26K061j985n93L250j977k128L545p41k853
$$ y = [10455, 2958, -8853, 12328, -2136, -15943, 12414, 5237, -13437, 10981, 5103, -18330, 6740, 12471, -11585, 2490, 7429, -12779, 2992, 11150, -10119, 966, 8660, -13083, 145, 14964, -9783, -6308, 11934, -6861, -6642, 12741, -2706, -8845, 7556, -1784, -5499, 9414, -1770, -8348, 7974, 439, -7859, 8495, 2873, -10325, 4185, 5801, -6633, 2216, 4503, -6143, 702, 4235, -4187, 1456, 3203, -6196, 565, 5507, -4863, -1397, 5184, -3938, -2963, 5161, -1178, -2901, 2871, -1344, -1569, 3622, -1415, -2004, 3891, -1421, -2954, 4990, 526, -4734, 2955, 2276, -3892, 1545, 2722, -3172, 54, 2114, -2094, 512, 1627, -2988, 37, 2543, -2615, -861, 3032, -1972, -2190, 2776, -90, -2157, 1452, 286, -1194, 1178, 77, -549, 1512, -473, -1066, 2184, 207, -1921, 1624, 883, -1970]
331a970K726M33k514J346L09j416J741o59j689K728m93l007L250Q82m061K088
347c06K422l580P23K800k844nK515k329J63K378k669l05L191k338j399L394j378
364D33k380K748R1k087J299J98j154J029k58n64J302j048r19K203m55j634J759
381E63j11j570J628L26j325J096l97j249K217j91k303J973L15k624J985J566l089
398a190K97J764j603M82J350j967P9J135j225J130J003k653M75J979j729O69J701
415A697k836Q0K585j939M60K118l602p5L941k542j020L593l135k288N081r65l131
432a978L334j234l194M265M71l549K558m13l224M084J184m236K087P29l523L442
448H03K033m267J279J106l304L488K127n237J554K111m419L324L666o595O3M657
$$ y = [-1970, 756, 1189, -1325, 21, 330, -1086, 655, -4, -1693, 1035, 542, -2465, 785, 1667, -2394, -306, 2116, -1464, -741, 2059, -785, -790, 1725, -604, -441, 1937, -732, -1037, 2154, -184, -1583, 1811, 433, -1947, 801, 892, -1195, 104, 302, -852, 177, -81, -645, 657, -391, -1310, 893, 438, -1196, 563, 452, -1118, 510, 836, -489, 607, 210, -1039, 1178, 987, -1316, 657, 972, -1652, 333, 1899, -1190, -893, 871, -732, -250, 1100, -867, -788, 347, -878, 252, 1255, -1398, -923, 1056, -673, -4, 1697, -1139, -1059, 1526, -413, 47, 2165, -1437, -1512, 2429, -113, -1133, 2460, -675, -2963, 2118, 1153, -1978, 1356, 122, -3072, 1193, 1664, -1885, 673, 260, -2964, 1120, 2304, -1932, 155, 884, -2639, 803, 2836, -1431, -152, 954, -2350, 1138, 3265, -1972, -418, 1693, -2726, 598, 4264, -2331, -2268, 2389]
464B389m296J156N069o078j670N654l036m77N207n180k899O529j868k224N208
479C484l927l846O550o50l362M639k891m340O672O8m709M676j675n592O724J535
495C356o183L831L61o104N686L005o853K863J952o491M763M822p749J132M594
510B985o353K286O615o789j820N779m013j92O140m798l125N052k286n72N086m547
526e52k969N283k143j122N401m522l805O438j410k987N957l271n557P008O51n251
542b851N183o48o735N762L164o111K900J656o378L884M653o054Q07L319n723J884
558a288N988n519j746M830m064n38O385l642l891M774j410k227N312j702m812
573c550M033N45k961M099k05n272L188K167l406K535J053n091K117L382l605J075
$$ y = [2389, -1907, -751, 4318, -1760, -3430, 2224, -812, -1289, 3918, -1262, -4161, 2368, 500, -1724, 3484, -443, -4289, 2261, 1611, -1751, 2888, -3, -4343, 2329, 2397, -2312, 2364, 689, -4903, 1821, 3356, -2827, 1004, 1365, -4739, 947, 3952, -2901, -38, 1914, -4577, 186, 5008, -2741, -1609, 2985, -3368, -1082, 5533, -1256, -3076, 2703, -1310, -1502, 4638, -160, -3285, 1767, -519, -1091, 3995, -552, -3521, 1762, -381, -1503, 3898, -624, -4429, 2009, 599, -2388, 3569, 298, -5259, 1749, 2400, -2851, 2332, 1684, -5051, 711, 3875, -2236, 664, 2320, -4058, -174, 4479, -1575, -768, 2551, -3172, -1288, 4700, -819, -2565, 2265, -1799, -2337, 4048, 406, -3485, 1289, -121, -2348, 2964, 1262, -3550, 483, 1028, -1933, 2166, 1961, -3311, -123, 2044, -1362, 1173, 2226, -2865, -748, 2634, -971, 104]
589A04K171m766R00M504l355p34L110l530p43M965k255k271L267k118j477M612
605B384j610k904L497j445k332N001j082m378M093rm131M831Q56o062L286K523
621B518n072K935K890o015J356M044m446J245L584n415N56M544m246M90M360n651
637b323j58O268m731j305O363n373k667Q218l349m738P240k546n627P723k60o791
653d056N657M22o206N806J556o900M154J837o283M988K573p485L613L583p057
668c798L783M674q231J640O347o980P73O872p040j468P753m796k436P079m520
683c48l529P218k658l757O144k854m197O679j557m704N998j488n391O645P5o358
699d082N546Q58o707N438K477p192L782L260o826L253M290o885J723M999o405
$$ y = [104, 2275, -2491, -1591, 2913, -442, -1176, 1934, -1596, -2339, 2626, 371, -1900, 1367, -751, -2228, 2384, 774, -2130, 1367, -78, -2410, 2591, 1509, -2869, 1224, 1215, -2916, 1915, 2771, -3291, -5, 2518, -2554, 381, 3271, -2744, -1388, 2656, -1790, -545, 3039, -2376, -1820, 2724, -1522, -1032, 3328, -2323, -2481, 3787, -944, -2249, 4114, -1259, -3926, 4292, 943, -3795, 3445, 899, -4728, 2995, 2735, -4056, 1601, 2023, -4183, 1623, 3179, -3721, 433, 2270, -4013, 975, 3548, -3937, -324, 3259, -3798, -15, 4659, -3572, -1932, 4415, -2565, -1792, 5080, -1960, -3428, 4325, -471, -2907, 4172, -348, -3877, 3341, 683, -3074, 3070, 216, -3981, 2698, 1141, -3563, 2435, 947, -4444, 2201, 2276, -4082, 1464, 2322, -4385, 1053, 3530, -3662, 120, 3380, -3446, -193, 4097, -2788, -1065, 3934, -2471]
714b471J047N684o081n36O348n212j601O752m379l125O735k842m015O340j554
729A090m855N524j41n104M770Q04n247L816J602n040L298K084n177K565K798n092
745b305K010L428n285J093M251m833Q3M667m326r48N019l454j866N066k885k385
761b670N053k179l133N024j286l829M936o58m403M725L38m932M062J343n377L477
777D91K522n571K155L380n231J448M011m901P2M330l920m48M433l669j402M521
793B221k648j620M322k451k220M274j481k506L999j375k983M033l95l284L478
808A364j61l673L513P78l848K602J145l921K309J964l870J472K098l498J075K566
824A915l168L76K504k750J70K708k437l70K637k174n29K818j921r95K792j651
$$ y = [-2471, -1424, 4260, -1821, -2357, 3991, -1221, -2822, 3930, -449, -3574, 3161, 319, -3696, 2644, 1090, -3765, 1759, 1618, -3486, 1284, 2088, -3159, 657, 2259, -2781, 517, 2601, -2576, -11, 2787, -2305, -295, 3133, -2152, -1059, 3192, -1641, -1558, 3109, -1217, -2165, 2854, -600, -2466, 2600, -285, -2670, 2383, 204, -2929, 2095, 809, -3020, 1916, 1258, -3145, 1580, 1918, -3014, 1048, 2391, -2986, 491, 3013, -2558, -403, 2977, -2254, -806, 3205, -1696, -1624, 2706, -1214, -1662, 2771, -898, -2300, 2221, -427, -2047, 2275, -176, -2396, 1878, 397, -2109, 1890, 515, -2468, 1565, 1170, -2114, 1364, 1203, -2470, 1043, 1821, -2027, 575, 1720, -2201, 108, 2072, -1798, -326, 1772, -1726, -651, 1915, -1253, -877, 1627, -1123, -953, 1755, -682, -1052, 1585, -589, -1118, 1700, -221, -1216, 1576, -75]
840g5j307K898j070j906K599n16k129K300J77k353J666N71k052J208R73j896N54
857c58J077j382L43J088j237o6J052p69k8Q61o48l10P64l17j62O27n09k81N68
876C13j53k78N52m18m83P22q9m87N12j00p18N76M19p18J23N70p74%R87n71n30
897e45Q44j47o56Q78J01q89N37L17o77L83L90q18J41O26o99J75N02p87l7P94o23
918a90j87P92o73k88R89m24n66P86j80o09Q32np21N44R9m77N42J07o24K75K38
939B60m14M73Q9p67L84K54n53M62J76q63K51N77o69K29N26r03n3J048n80l03P83
960D07n93n21J200r4q50O85k6q70J054M06j160M13L67q93O43O21j117LP58p86
980c53K48R51j207l48J053n36j37J125r48q57J261j12m38R46n65j066J184J97
$$ y = [-75, -1382, 1516, 446, -1460, 1139, 623, -1506, 794, 971, -1382, 284, 855, -1197, 11, 984, -912, -358, 719, -663, -320, 768, -469, -535, 517, -252, -280, 581, -67, -377, 387, 70, -92, 535, 26, -255, 313, 160, -118, 434, 16, -467, 255, 166, -321, 191, 91, -627, -51, 368, -350, -227, 343, -431, -431, 556, -15, -545, 299, 152, -504, 374, 475, -414, 123, 440, -237, 146, 536, -282, -141, 485, -214, -39, 463, -324, -361, 433, -190, -377, 415, -258, -546, 443, 19, -547, 239, 59, -550, 282, 277, -444, 100, 199, -278, 264, 371, -253, 22, 260, -154, 319, 408, -359, 25, 279, -274, 188, 364, -499, -248, 329, -340, -111, 415, -488, -541, 507, -73, -376, 407, -186, -707, 493, 399, -451, 234, 208, -662, 392, 798, -362, 51, 418, -475, 168, 789, -328, -325, 433, -353, -105, 846, -361, -709, 344, -192, -329, 796, -152, -1009, 252, 140, -298, 648, 83, -983, 201, 398]
998C98n67Q78p02r92J393K20r71J148n42j579J646P96j739Q07M23k087J259J718
1016A507j958j39J194j594M45J981j476q63J316j025J52J900j283j119J331n73
1032b04k03J878j149j502J435r2n32J566q33j612J383J71o88J396q03j650J513
1049G4M00r89J332n26k029J703R27j508J024K10k182J187J718j522J42P36j689
1066i92M77J884j036m89N79j151L03J528q01o94N17q70K77J613r22r52O78n57
1084f08Q9J651p01j362O51J27j06J207m36j309M51L51R6P76m52j301N34O17j12
1103A63P75n39j436N86J020m27K85p5j385K30J402j16m46j28o71Q6J150K16n58
1122A32m49m49M81R61j28n39j67m96L97J320l04j173K38Pk19J142L05j700k07
$$ y = [398, -169, 709, 7, -985, 408, 628, -343, 805, 263, -1316, 330, 1126, -613, 194, 617, -1470, -211, 1507, -451, -590, 604, -990, -545, 1436, -40, -903, 413, -612, -460, 1440, 157, -962, 369, -204, -407, 1471, 322, -1180, 255, 163, -369, 1197, 364, -1248, 135, 306, -382, 1014, 211, -1439, 74, 474, -515, 817, 291, -1738, -35, 892, -616, 408, 618, -1564, -377, 1341, -181, -39, 697, -992, -515, 1369, 333, -156, 423, -728, -425, 1103, 302, -392, 125, -745, -468, 1145, 223, -729, -51, -608, -519, 1132, 431, -931, -280, -153, -259, 948, 512, -797, -346, 5, 101, 877, 425, -876, -342, 275, 163, 938, 399, -1037, -451, 569, 142, 427, 352, -1033, -803, 599, 483, 37, -91, -762, -676, 474, 690, 132, -317, -766, -285, 676, 548, 9, -158, -654, -257, 1063, 759, -414, -176, -169, -388, 754, 1059, -641, -848]
1141h48R29j06L16N39j184q98J217M76k57K69p61q22J102O68m03R9n76q49J175
1160H6Q92q29m5j66q22Q15J243p87p10K41m50M24J133o47q55Q7r3M67R10p90p99
1181f95L47j25M19J096q92j118P16K34MQ95n19j275M98P32q3M96m74j051M44P30
1201C79p9L91n19j210P73Q84n93K87n4j421N13J549o99m19M96j102J8J601k07
1220E88q97K99m05n8J327k17r75L17l28j16J455l22j333O41N6o36J375J22j813
1239i20M61P16p58P91O30j693m9J227n41K23O21j393o5J221m47P0O68j324j97
1258g59J599o39l78J100j278o77J974m00j096J148o46j126J766K24j544R12p4
1275A06j190J389M73j445O16K42j138J208P10j723N59P55j418R87J091j835J34
$$ y = [-848, 81, -25, 291, 830, -354, -1252, -35, 441, 184, 453, -308, -1130, -28, 640, 237, 336, -240, -1089, 86, 978, 149, 104, -62, -884, -69, 1174, 387, -323, -82, -532, -108, 1025, 378, -477, -390, -483, -16, 894, 104, -695, -348, -473, -54, 1042, 150, -968, -252, -18, -14, 881, 362, -913, -415, 317, 234, 730, 256, -795, -351, 379, 300, 691, 172, -1038, -265, 619, 26, 313, 259, -1162, -649, 900, 201, -218, 278, -824, -806, 795, 588, -309, -10, -415, -473, 854, 637, -338, -21, -349, -465, 990, 668, -665, -24, 32, -604, 771, 893, -920, -459, 257, -501, 290, 920, -773, -822, 405, -136, 87, 708, -685, -750, 471, 24, 94, 762, -562, -759, 840, 201, -177, 923, -355, -1032, 942, 542, -554, 594, -52, -1178, 588, 812, -732, 180, 106, -1084, 305, 778, -667, -51, 191, -947, 261, 971, -752, -193, 562, -856, 131, 1222, -613, -479]
1292d79J312j282L29J332j569l13J435r54j38J308j257n75J421o77m50J405j036
1309a88q03J560m55p62J326o58j051J479j07j060J220j93j264J370K72j302J010
1326C94J24j369J147M73j390P15M95j384Q54Q12j468L89Q06j276L77J086j239
1343d54k3J013j021J46J052j017j92R90p34m6R87p71m19R98m92l62J007o21o27
1362e86J002k04o85R83l08q66Q98Q0q30O79J58r93O47M59q31K46M16o58K63N33
1382D03o01J68K87m68J86M29m67l8L79m17J36L61l39j31M20l60j15M67l58k03
1402b61L94k12k30M72j72l34M41k5l35L94o9l51L30J69l84K41R0l82K87K12m25
1423a50K14J34l68K06K69m52J24K19l35N9L02l62o8L92k80j47L47j66j25K90k28
$$ y = [-479, 833, -449, -120, 1212, -357, -670, 765, -189, -327, 981, -276, -851, 570, -107, -557, 848, -188, -991, 569, 114, -648, 678, 20, -1031, 448, 341, -719, 501, 308, -956, 414, 686, -616, 394, 518, -851, 296, 769, -621, 94, 589, -795, 59, 871, -597, -208, 598, -678, -301, 785, -454, -477, 536, -485, -339, 713, -304, -496, 494, -240, -286, 701, -70, -489, 509, 17, -345, 662, 41, -586, 416, 212, -473, 510, 202, -664, 234, 314, -516, 163, 321, -672, -25, 434, -397, -151, 265, -393, -130, 403, -198, -30, 257, -211, -25, 404, -63, -101, 278, -139, -3, 358, 19, -112, 308, -52, -167, 300, -58, -261, 133, -79, -309, 163, -9, -343, 98, 73, -262, 132, 63, -288, 42, 211, -173, 68, 158, -224, 63, 275, -150, 64, 198, -170, 36, 305, -147, -23, 196, -139, -80, 222, -140, -208, 184, -96, -243, 104, -62, -187, 103, -125]
1444a25LK34j32r1K52k01p7M14l26j03L55k01j73M78j01m12L35K7l43L36M2n21
1466c30K54K67m06K26J41m93J75K76k18N8K31m05K7M17k37n2K32k50p7L60k6j29
1488D1Oj81K17J53j87k3pk61J60M04l89j00K95l61l2N70k72m11L87P2l70M36J73
1511C20o26K03K62k52J96K37m36r2L87q8n5J80k96j95M00R5k91J24j34k09L06
1532C6J45k52j6q8j49L41J97l01o8P8j73K30L99l54k17J57%J5L20j42k71N5J41
1555H3OJ87k06k34R9k4J64K23m40j88L57j22m1M19l07m63M82J68l40L15j0n28
1577d00L63M00l72J45J1n25K87M91l55M8O8n30K42N90m16k26L37m27j9O15j82
1598A45m13K08o7l9L79j23k38J22j60J32M13l31k17L42k69j07P72m11n73N94r
$$ y = [-125, -122, 112, -20, -111, 141, -60, -137, 277, -49, -152, 203, 2, -171, 307, 206, -206, 129, 156, -187, 149, 191, -330, -76, 191, -215, 11, 152, -341, -166, 110, -108, -50, 181, -224, -197, 220, -17, -69, 163, -87, -164, 196, 170, 41, 47, -134, 83, 236, 49, 26, 19, -242, -82, 322, -67, -167, 128, -233, -265, 305, 33, -378, 9, 81, -289, 147, 320, -306, -103, 159, -93, 103, 340, -96, -188, 199, 111, 56, 236, -60, -255, 145, 240, -51, 73, -61, -270, 36, 181, -71, -87, -175, -324, 17, 214, -87, -155, -77, -250, -20, 379, 25, -192, -35, -35, -20, 300, 158, -113, -58, 83, 89, 276, 70, -164, -65, -89, 75, 298, -142, -330, 27, -95, -136, 283, -24, -487, -5, 163, -177, 138, 128, -400, -37, 363, -9, 136, 147, -378, -91, 400, 45, 93, 161, -369, -127, 463, 47, -179, 158, -269, -288, 327, 145, -268, -60, -127, -166, 213, 90, -148, -26, -186, -54, 359, 28, -189, 153, -116, -223, 549, 138, -435, 159, 150]
1619A50m55O40N9q15K90M67m92J38L04n91j5M96j39p2J42l91N1L59j42lK29m63
1641b53KN83k48k11L18k22k42N70K0m65J52j0j80L15J14k94kkn5J81N5k24l1O4
1665f5j84L63O2m22O9K19j27J08K67l66j57L40l4n9K46k08k91L39P1j66J59j21
1687D3k49K77K0k38L04j72l67M26J99n53K97K00n77J98O44o87m2N42l85j15O40
1708D05l09m05N35j50k09L96j36l07L67j62j34M37k64m15N71j26m58O55j90o25
1728e24O91P9p37M82L38p87M54L73o68K53L99o49K11N25p21J04O14p19K20O28
1748E66p85l0P81p10q2Q39p10l32R16n19l43Q00l63n61Q75k49n12P31k86n11P76
1769B91j41n68P63j43p01Q29P0q53O84J74q79O08L68r33N74K70q30M61M59q89
$$ y = [150, -305, 335, 394, -421, -131, 336, -156, -18, 286, -305, -320, 176, 37, -35, 107, -284, -233, 126, -16, -19, 210, -253, -251, 332, 84, -127, 191, -31, -273, 297, 317, -148, 4, -6, -186, 129, 243, -51, -53, -55, -110, 71, 126, -98, -129, -65, -249, 114, 176, -246, -177, 42, -85, 23, 290, -76, -233, 107, 73, 14, 260, 52, -239, 100, 171, 5, 164, 43, -206, 71, 91, -147, 157, -15, -382, 44, 243, -310, -13, 187, -390, -192, 452, -235, -277, 265, -120, -235, 405, 96, -309, 226, 76, -133, 263, 127, -180, 187, 25, -109, 328, 64, -351, 220, 94, -364, 291, 101, -524, 167, 246, -491, -9, 329, -458, -4, 369, -299, -46, 353, -296, -85, 440, -281, -177, 437, -282, -62, 566, -219, -249, 532, -178, -260, 579, -131, -463, 453, -66, -409, 391, 28, -533, 342, 93, -419, 312, 26, -485, 291, 150, -418, 345, 202, -499, 330, 400, -453, 231, 405, -474, 134, 502, -431, 143, 413, -417, 44, 503, -386]
1789c86K82N45r05L31N95r00J91P39q48J37P88p96j35Q49o91j86R56o30l80R63
1809E19n02m56R83m02o20R24k73o61R15k40q40R62q7p56P72kq61P01J79p94O04
1830F5K35q56O44K79q49M86M83r44M20O23r41J85P79r11Q3Q90q85r4Q65p03k23
1851c69R04n86m07R20m62n33R03l74n04Q62k97o01Q51k19o53Q55q7o86P43N1q27
1872e16O65K76q45M86M02q53L97L88o74K51M23o58J70M98p30J08N40n31m3N76
1892C30n41j12O46m56j57O21l81k65O23l39k34N59k82l03N93k04m13O27k35m35
1912c58N74Nn59M96M6n54M14K15o00K53L08n53K43L56m64QM61m40j05N84l77k06
1934b53N05j87k94M43p4l78M49o0l72L29J20m22K06J95m27J75K56m26N2L64l59
$$ y = [-386, -104, 441, -464, -133, 462, -438, -247, 492, -356, -219, 569, -227, -362, 487, -204, -390, 566, -64, -444, 519, 17, -439, 544, 142, -478, 446, 173, -488, 427, 187, -653, 309, 222, -534, 238, 236, -625, 76, 255, -539, 65, 300, -556, 88, 367, -482, 4, 487, -457, -37, 586, -355, -170, 609, -302, -219, 671, -214, -308, 557, -146, -369, 535, -51, -458, 462, 0, -533, 370, -4, -508, 354, 57, -544, 307, 88, -565, 290, 203, -483, 260, 311, -516, 149, 425, -420, 66, 468, -385, 12, 400, -274, -23, 400, -258, -88, 410, -320, -212, 328, -203, -246, 330, -211, -323, 323, -133, -290, 331, -50, -315, 308, -31, -265, 294, 12, -291, 302, 98, -315, 312, 77, -358, 216, 221, -338, 158, 204, -350, 64, 279, -321, -68, 240, -313, -70, 286, -178, -170, 291, -149, -254, 330, -47, -253, 252, 65, -229, 214, 140, -238, 211, 151, -221, 108, 228, -194, 12, 207, -220, -45, 211, -215, -163, 201, -158]
1955a58m0L55k43j07L41j49j52L06j69k05L18J5k45K54K2l38L49L5l54L27N7m42
1977b23L23J27m19K12K29n75K14L47n04J76L66m80j4M87m25q8M85l51j62N34k76
1998a7k22M46j53k70N03j13l85M71k36k96N64j71m09M82q0m46N35rn82L96K32
2019B40o17L90K98o84K92L95n58J56M32n83L0N44m16n0M32m28r8N56l12k03N01
2040C17l53j99N57k50l07L99j77k72M34q0l60L89q4k96M08O0m45L15P4l87L56
2061I9J05m02K30J13l38K69J50l66J34J59k88J59K17l76%K28j29N1J08k05p8K59
2083I9j46o2K19j81n2J63op7J15n8r6R7J00j28L7M9k9m7J04k8q8lO3m8P0N2j24
2110el5O9m8j7P9o6j06J31J9k9K5k6j09Q0O5j23J67j13pJ67o9r6J14k8j16K11
$$ y = [-158, -198, 157, -86, -193, 148, -1, -153, 153, -16, -221, 97, 112, -133, 121, 143, -195, 154, 189, -165, 162, 219, -223, 100, 227, -192, 20, 249, -326, -112, 235, -269, -93, 273, -207, -221, 266, -159, -247, 238, -113, -275, 259, -17, -239, 207, 54, -216, 287, 174, -211, 260, 24, -272, 292, 121, -288, 194, 114, -332, 203, 194, -388, 8, 240, -377, 13, 311, -373, -81, 314, -244, -88, 344, -239, -209, 335, -81, -131, 301, -127, -225, 331, 19, -184, 317, -36, -235, 322, 72, -235, 164, -13, -285, 149, 69, -291, 98, 14, -282, 126, 186, -259, 56, 130, -257, 99, 204, -198, 32, 145, -193, 76, 226, -140, -6, 153, -135, 24, 241, -135, -135, 93, -36, 15, 123, -82, -160, 99, -47, -109, 110, -71, -123, 40, 34, -43, 72, 14, -82, 15, 115, -13, 24, 73, 44, -3, 101, 73, -15, -18, 45, -3, 67, 119, -5, -40, 29, -19, -36, 43, -23, -129, 2, 21, -8, 17, -9, -118, -38, 27, -96, 71, -42, -49, 118, 49, -47, 67, 39, -77, 134]
2136A34o3j95J39N5j85J31R8k21M2P1r1O0O4j75N1J58j74J17J14l33J48K00k67
2159a22O6K34k77O8K10j94p8K77k32p3L27j45k06K34j15j11L07j24k27L09j42
2180a4j42K73j02k45K87o7j66L46m3l98L17P9k56J91N6k31J31J15j92J33N8k61
2202a31J75R7k75K17R6m18J45L07l75Q0K57l77K0L49j72q8K28k89k5L66j78l3
2224b4J43k18j6L61k03j24K45k29j01M74j28l93L80q8l22M52l2m41K12J30k73
2245a95J99J49l86J41K07k70K19N5l22P6L08k04j5K78l86J7L99k37m8J77j51j72
2267a61K72N6k26J39j17p7J53M8r1Q3j45l8J88p8j04R9m6j18K43K7k34J38J7j15
2291h7K01Qr6o9R4j2RN4j35P5m7rQ0Kp2p8rN5K5N5j40pR4K3j3qk2n7Q0P4k8m3
$$ y = [134, 71, -124, 15, 70, -115, 16, 114, -107, -65, 6, -85, -25, 39, -136, -85, 73, -101, 16, 130, -203, -55, 145, -122, -56, 178, -99, -31, 179, -15, -93, 184, -48, -121, 206, 61, -145, 89, -26, -137, 170, 46, -181, 128, -14, -156, 117, 15, -230, 57, -10, -176, 170, 127, -271, 46, 125, -131, 60, 116, -115, 16, 131, -61, 72, 130, -131, 44, 141, -134, 83, 179, -239, -94, 213, -162, -82, 175, -202, -182, 167, -5, -93, 135, -154, -179, 187, 9, -24, 119, -99, -115, 246, 43, -81, 164, -65, -166, 308, 180, -213, 167, 79, -243, 209, 177, -264, -52, 78, -195, 4, 153, -233, -92, 115, -155, 64, 119, -203, -127, 181, -23, -38, 240, -146, -129, 270, 33, -15, 162, 11, -161, 111, 167, -59, 80, -37, -114, 39, 87, -4, 79, -66, -104, 84, 6, -98, 1, -45, -163, 80, 107, -127, 11, 28, -87, 114, 122, 26, -43, 51, 39, 48, 102, -33, 42, -5, -14, 66, 68, -4, -82, -91, -36, -11, 44, -96, -103, -9, 14, 1, -7, -29, -86, -6, 68, 40, -3]
2323cqnL3J08k1q5J4Ok2N3K2j07n2N5J5M8J5j76pJ77o0KO6j60pJ03K4o9J08j13
2353d6n3J73n1RQ4j37KJ30r6n1J59j40n9J50O1k16R3k8j75J61J07j84M2P2j00
2378i3J6J18o1j0N8j30N5J24p7n1Q3o3L2N2m2j5L0J8n1N8J2q0K6l4J0Nk3O2o7
2407c8q1J00N3j07O3j9o7R4K6j31O1R1j05J08O3j06j7O8j01L1J17j19k8J43j50
2432e1L6R3j50N6J10j87L0K15j87l4J74j82j6K37k02l7J82q7o5J91q4j61K52j32
2456Aq5K07l7j94J97j5j74J89qj97J36P7k13J32L5k02J43J01k41J38R3j45N2P6
2480F6j62P0J24j80Q3J27j84K9R9j10j0J69j16n7K19j73o8J67j55k0J39r7n3J39
2504D6o9n8J37l6j34J14lj20J36O5j31Q3J4p8M5R1j04k3J12p7l1M5Qm1N0j03P6
$$ y = [-3, -11, -16, 17, 125, 104, 19, 33, 39, 17, 70, 92, -15, -67, -12, 3, 51, 66, -110, -117, 60, 0, 2, 68, -92, -99, 4, 28, -41, 67, -46, -99, 74, 23, 32, 116, -21, -19, 111, 15, -36, 123, -17, -76, 74, 135, -81, 12, -16, -191, -30, 77, -107, -65, 7, -93, -77, 41, -20, -30, 28, -102, -47, 77, 0, -51, 32, -31, 1, 53, 11, -4, 26, 44, -7, 51, 63, -17, 9, -25, -15, -10, -33, 29, -38, -119, -19, 34, -73, -10, -29, -96, -2, 24, -107, -46, 45, -60, 48, 111, 5, -12, 56, -45, -14, 103, -16, -44, 99, -51, -15, 78, -72, -16, 94, -93, -63, 152, -35, -69, 105, -77, -93, 144, -58, -95, 87, 0, -65, 126, 42, -119, 133, 1, -84, 123, 86, -108, 89, 74, -100, 89, 81, -116, 20, 97, -116, 16, 51, -151, -8, 93, -148, -10, 83, -62, -10, 66, -96, -26, 98, -82, 1, 128, -56, -27, 72, -38, -48, 121, 5, -52, 167, -6, -74, 93, -62, -82, 57, -40, -93, 46, -23, -81, 56, 20, -114, 0, -3, -123, 13, 78, -53, 30, 44, -34, 11, 102, -2, -25, 87, 10, -21, 24, 32, -9, 41, -62, 14]
2531A4pL4j21J9J03r9K8J8q2OJ42o1j28J31M4j07R2L8j14O7Q5j13K0J46j68L6
2557B3L5l5j7J00j47j2J67j95P2J06j68n5J90q0j02K05j26j02K06p1j20K64j10
2580B8j49K08j7j65J40L4k01K00Q2k98J89R4l27K26Q8k94J30J12j89M6J49k14
2602a28N6J84k09L3J88k59J1K99k11n0K54k22q2L33j84j29L29k18k13M04j42j84
2624a40L31j71k03K94j8k74K27ok53L27J6l53K49O8k85K63J29m09K08J87l49J36
2646b6K73l39N0K58k69L8K78l39n4L16k46l1L40k96j24K77j09j00K52k01j65L40
2668A23q5k20K92j50k41L67Jk12K24jk76K80J02l48K43P1l74K68J53l56P9K45
2690A85l80J57L12m41R7K06l12J48L14l48j40L70k72%K93k16k22L84j59j11L28
$$ y = [14, 7, 41, -80, -61, 42, -57, -29, -11, -93, -87, 55, -6, -134, -3, 41, -66, 26, 64, -50, 17, 102, -11, 9, 155, -13, 23, 58, 23, 6, 106, -41, -53, 114, -81, -9, 97, -71, -126, 64, -16, -118, 87, -39, -141, 65, -6, -126, 138, 28, -121, 87, 70, -95, 45, 79, -122, 78, 160, -138, 51, 145, -182, 44, 132, -162, -32, 80, -109, -63, 86, -128, -72, 112, -97, -64, 124, -135, -124, 175, -36, -86, 168, -54, -136, 197, 13, -116, 213, -5, -218, 186, 44, -140, 191, 20, -183, 111, 93, -181, 46, 40, -213, 114, 130, -223, 26, 94, -191, 72, 201, -208, 0, 187, -162, -26, 247, -92, -42, 216, -53, -15, 263, -76, -130, 186, -60, -91, 249, -47, -171, 106, -3, -103, 149, -52, -217, 123, 38, -182, 110, -40, -281, 86, 87, -125, 99, 98, -178, 102, 204, -144, 99, 170, -204, 64, 217, -139, -60, 185, -195, -38, 274, -167, -70, 136, -176, -28, 286, -62, -202, 168, -104, -104, 189, -27, -249, 135, -24, -135, 193]
2711A93j53k27K89k4j77K91j08l36L63Qk60K85N7m16L08Q0l23K08L4l09J85K26
2733A94l20J74K3k40P2K81k71M0J41k59R2K94k58r4K81k00MK77k37j50K41j19
2755c4o7K89j49k31K56m2j65K69k8k76K21N2k37J89N9k97J90N5j63J62R3l02J05
2778e1K50k85J25J84l18K3K11r6m3R4j46o1K61q0j98J59j01q0K48j09n2J26j52
2801i1k0J98o4j67K03p8p2J69K7j84R2Q4j66J48Q9k58N9N7o2J59o2j70P6P2n5
2826a6Q3Kk17L1K15j10K9N8k12J17J12j15J1J04j60rK14j21n4J28j40j5J80m6
2850F9j18J58j46p9K19n2j87J38K4k04K39l4r0P5J2j10J60J1j68R1K6o1K4P3j39
2875f9N0J08j12R0Rj41R1M3j34J45k4j14L8J27j62J13j0j31LJ47r0o6J07q2m4
$$ y = [193, 40, -187, 102, 78, -99, 192, 84, -252, 111, 119, -141, 144, 201, -215, 93, 173, -150, 58, 92, -217, -32, 194, -126, 48, 71, -169, -97, 184, -87, -47, 94, -165, -73, 221, -37, -131, 150, -50, -46, 231, -6, -156, 85, -34, -101, 188, 39, -192, 64, 22, -143, 126, 98, -178, 43, 95, -142, 47, 106, -191, -1, 54, -109, 53, 146, -156, -51, 199, -86, 39, 223, -95, -72, 139, 43, 0, 94, -52, -113, 148, 68, -130, 29, -72, -152, 96, -13, -65, 61, -91, -111, 87, 23, -144, 59, -19, -91, 78, 105, -79, 13, 97, -69, 79, 168, -90, -31, 26, -36, 123, 61, -109, -33, 39, -16, 67, 69, -148, -117, 98, -12, 17, 75, -137, -20, 92, -23, -12, 92, -68, -77, 137, 16, -38, 90, -50, -65, 115, 69, -49, 109, -37, -116, 103, 51, -136, 2, 26, -178, 61, 27, -63, 12, 24, -86, 74, 85, -83, 8, 34, -27, -3, 70, -69, -19, 89, -23, 67, 76, -65, 26, 69, -65, 80, 56, -58, -20, 107, -55, 58, 48, -83, -80, 67, -23, -89, 18, -64, -108]
2900a08J65n7n3J00q8q5K41n0r5Q2n7p2J52k9j50J42n9n1R6J9j13Q5J5q2M6N5
2926D9j29N4K4r2Q2Q5j37L0O4o1M5M7l2l3N6pl6L5l8k0M6j4j0J0j2n5K6L0k6L6
2956A7k7j9o7O0M9k9k9K6j6M8j1K3o4J18r6k7J32n5o8R1n4j1O5l7n3N7j7o7O1
2985@O2j60R2M2j35J21Jj31J27N6j68L5J06j18j5J31o7K1K8q2J8K06k38O3N6r4
3011d3L2J42j34j04J80j30k3J22nj56K20k1r9Q7k1j87J95k1j44J40N5j61J06Q
3035C8q5Q9M3r5N8P7k30J28P7j56K7P2j46J40J0q7QJ05j88Q7J25j62l0J95j42
3060d2l5K23k19l7J87n3j16J84l6k05K30J7j43Q6K1j34J11O1j94J03P0j59P3O3
3084E6j56J12Kn3lO4o6j9O7j2J6Qm2J4O3m1rP8q6n9N2J5K3O8j45Q6N4j29RO2o6
$$ y = [-108, 57, 0, -53, 47, -41, -126, 115, 65, -30, 52, -5, -77, 75, 46, -104, 38, -21, -72, 24, 43, -70, 15, 30, -52, -6, 49, -80, -26, -2, -94, -12, 73, -64, -34, 30, -31, 14, 61, 29, -4, 52, 45, 9, 44, 6, -14, 32, 18, 8, 18, 6, -49, -23, 7, -19, 17, -10, -29, -96, -36, 13, -16, -45, -19, -35, 13, 2, 25, -39, 79, -17, -44, 88, 33, -35, 56, 2, -9, 56, 19, -34, 23, 6, -61, 0, 62, -98, -6, 36, -99, 22, 23, -108, 19, 75, -93, -58, 48, -70, -85, 46, -21, 0, 28, -54, -36, 170, -68, -5, 51, -43, -11, 131, -3, -107, 73, -57, -80, 42, 37, -119, 101, 80, -19, 68, 47, -140, 55, 34, -110, 30, 85, -76, 30, 38, -47, 42, 85, -10, 48, 125, -105, 23, 100, -56, -29, 43, -103, 37, 47, -40, -32, 73, -115, -28, 97, -65, -95, 100, -42, -77, 146, -73, -110, 77, 24, -92, 92, 56, -149, 81, 98, -45, 41, 62, -72, 39, 100, -94, 9, 79, -80, -7, 56, -100, 12, 14, -39, -42, 22, -44, -63, 4, -8, 8, 16, -26, -12, 51, 10, 1, 79, -7, -66, -14, 1, 24, 92, -53, 33, 87, -42, -33, 29, -37]
3115c7l0P3r1N9L2q7L7L4M2q2O7n0k4J23l3p2Q1k0o3M3P4p6l2M3m4L1K6n7K4Q8
3145G9r8k1P5n5j0N7o5N0M8q7LJj4llj2K4N0j0m5O0j6mM2Ll1j9%M0kMm9Pj3J7
3180CKM4p7J3nl6N2Nj08J29l2k6N7J8k1qp0Q6J8n2O1J2j12J04J2n5qk0j1k3L8
3211a0o2R6n0m2R5jj09P7j2j5R0L6j79K7J48j53Q9Q6j73P5O9n0KM8j09nO0q9J04
3240D3Pq9L0Q1k4o8R8o9j17J50l9o3R3k7r0R3L5j02N9L1j22J10j7j8M5j8r3J20
3268C9J0o3QN5l6J6P5j47j9P4%o0J04j11OO3M9j53J52j03l7J06n0k9J24r5n7J48
3296F9n8n0J16j2j23K5J41j46M4J4j04R2M4j21K4J21j53O4K2q7L2P3k4J7N4m7
3322B7o9P3k9o0J44n4n3O5k6n2O5mj14J40jq8R1o0m3K9R5j08O8J6j28M7J13j22
$$ y = [-37, -67, 6, -85, -26, 6, -81, -44, -10, 32, -50, 17, -33, -57, 66, 33, -39, 42, 22, -41, 2, 76, 0, -32, 11, -33, -2, 24, -33, -9, 79, -19, -40, 35, -20, -30, 27, -38, 12, 60, -27, -24, -23, -37, -40, -43, -55, -31, 19, 9, -36, 24, 8, 4, 46, 49, 18, -1, -1, 39, 37, 41, -8, -1, -14, 3, 5, 49, -28, -15, -20, -56, -4, 1, -107, 22, -10, -36, 21, 39, 18, 10, -60, 26, 44, -8, 53, 65, -47, 57, 69, 14, 6, -14, -25, -48, -10, -72, 24, -26, -68, 27, 26, -83, -6, -18, -33, 57, 93, -86, -59, 89, -64, 25, 111, -62, 13, 82, 32, 34, 82, -27, -32, 28, -61, 43, 50, -39, -9, 72, 48, -20, 78, 9, -108, 42, 3, -60, 33, 6, -84, 9, 44, -58, 1, 32, -90, 20, 3, -15, 30, 12, -81, 39, 49, -14, -6, 49, 13, 29, 104, -43, -62, 12, 12, -48, 56, -55, -49, 14, 63, -90, 62, -41, -78, 28, -22, -51, 73, -22, -79, 69, 11, -39, 77, 65, -58, -33, 108, -38, 6, 20, -84, 8, 52, -69, -45, 76, -77, -13, 9, -78, -46, 27, 3, 20, 74, 27, -42, 31, 2, -58, 86, 32, -21, 44, 18, -34, 31, 27, -87, 53, 52, -36, 55, -5, -48, -19, 76, -32, 36, 52, -76, -29, 84, -38]
3350c8O5Ko0K2L9rp1J26o2n3J47o7o1R3p6m6Q6l1n1M3k1m9J37l0n9P1j1r4Q3l
3380B2j45J08K0q4O6M7j82R9J11j24P6O1j09K9M8m3kN5j57P5J43r6m3J04q6k5
3406c2N8j7l9L7o0JJ26m4q4J35n0j13J12j0j08J65m9j42K08k7p2P5l6p1R7mj17
3433f1M8L9o4J7O8r7M0N2j10P5M8p7J1M7r2K0Q9r8J5J33r0mqj1l7J18n4j8M9m0
3463Hj3L1M8j23Q8o6j2L9P2q9K2q0K1L4N0j30Q0R9j38JO2o1N5nOJ0M4n2L2k6m8
3494d1K1O9M1l8m5Qj6J1pk1O0o2jQ4o9r2M2R4o0j1k3O9J4M4j21Q0Om0N3l9k1N4
3526D3j6p4J2J0M1o8J08p7L4k7L0q7L2J8J9lM1n2K1k5pL1j0Kj6N5l8j8J0L7k0
3557FmJ7QMm6M0j3jN3l6j5l3J1J4l4RK5o4L7JK8l2lM4kk4n5K4M8n0K6M2n7O4j9
$$ y = [-38, 27, 29, -31, -9, 30, 21, -50, 76, 14, -39, 108, 41, -20, 73, -3, -49, 37, 6, -45, -2, -23, -72, 65, 35, -24, 47, 36, -58, 25, 22, -123, -15, 5, -79, -13, 34, -148, -49, 62, -62, 14, 75, -34, -5, 43, 0, -2, 53, -104, -29, 114, 18, -25, 79, -7, -32, 26, 9, -30, 7, -53, -52, 74, 30, -54, 81, 31, -82, 30, 20, -88, 77, 28, -114, 94, 67, -5, 70, 34, -37, 60, 56, -61, -13, 26, -38, -21, 47, -50, -10, 42, -68, 7, 55, -22, -11, 36, -56, -36, 53, -45, -30, 103, 13, 9, 1, -10, -47, 71, 17, -1, 48, 8, -5, 26, 74, -49, 39, -27, -39, 0, 72, -17, 5, -75, -54, -20, 30, -100, -20, 79, -59, -58, 4, -57, -2, -7, -1, 9, 53, 1, 33, 7, -41, -20, 49, 90, 52, 7, 15, -1, 10, 3, -18, 42, -20, -21, 63, -6, -98, -56, 38, -22, -33, -56, 13, 27, 71, -50, 30, 36, -4, 49, 10, -11, 43, 27, -47, -35, -25, 16, -52, 56, -21, 13, -14, 16, -71, -39, -21, -2, -5, 36, -16, 5, -20, -27, 4, -6, -4, -20, 35, -3, -21, -11, 26, 6, 2, 19, 27, 31, -15, 25, 12, 11, 64, 28, 13, -20, -9, 5, -29, -20, 5, -59, -22, -21, 7, -25, -28, 16, 14, -10, -65, -41, 7, -43, -17, 25, -32, 32, 13]
3592A3qmP7j15K0N5p3N4K2q1O3Rq8K7O0p8Jj8O4lP7J1o8K7Kk7k1L8o1N4K9j08
3624e0N2mM4j4n0J4rJ7mpJ9L9o6J8J1n8Q7m9rK5Mo9O0j2L4M3k4k4oO0o6J7k2j6
3658a5k2Q5j13K6J05q9J7N6r9NM4j2k4J03j06NQ6n6k9M3J8qnm7l6Q2Om0N3jq5
3689e3J22m2J9m1L0o6N3k5n3L4Op1R3J6q6Q2K5j02M2K2l0K0k7L1k5R0j12K7R5
3718G4q2J6L1q4L6Q6p1Pj4K8p2J11q0k3J08m3o1O0J5q2M1K4o1N4L3n7K2J3l7Q2
3748G4j1p2J1P2j11M2L3j5J3l8l0qO6n0QJ6lp9J15o7QN4l7k5mM5m3N8m8PP0p8
3780b7M9n0N5Rk6lk0K6OJQ9k1j66Q7J6k8L1l2k6J4j0l4O9j5jLm6R5n3j2m9Q6m0
3813b3l4J30rp4R1o5l9M6L4j7l9k8rN4j8J9k2k1Nl6M0l5l4J15m2kK3n4mJ21j08
$$ y = [13, 5, 1, 78, -37, -17, 38, -35, 19, 41, -40, 23, 32, -56, -29, 31, -47, -46, -64, 0, -3, 74, 85, 17, 44, 46, 19, -2, 36, -25, 29, 58, -50, 2, -2, 42, 28, -22, -8, -17, 0, -4, -11, 8, 47, -19, -1, 10, -48, 39, -10, -19, 6, 10, -59, 1, -11, 23, 66, 42, 18, 12, 72, 6, 23, 1, -15, -37, 48, -65, -39, 66, -23, -6, 50, -49, -44, 0, -12, -36, 67, -39, -34, 52, -4, -33, 10, 28, 20, 15, -32, -68, 14, 20, -20, 33, 32, -53, 69, 27, 46, 5, 35, -31, 22, -3, -56, -22, -16, -87, 6, 22, -64, 18, 43, -59, -17, 5, -25, -5, -32, -1, -26, 64, -48, -21, 74, -8, 8, 39, -45, -9, 77, 6, 13, -1, 27, -45, 66, -14, -37, 71, 28, -33, 27, 42, -40, 1, 25, -36, 18, 51, -6, 16, 29, -8, 74, 63, -9, 2, 74, -37, 5, 38, 23, 36, -2, -32, -40, 26, -24, -16, 0, -3, -82, 33, -34, -26, 28, -9, -34, -38, 7, -36, 22, -26, -19, 51, -27, 22, -28, 27, 36, 10, 7, -13, 13, 19, 20, 109, 88, -78, 9, 25, -3, 28, -4, -30, -16, -26, -60, 9, -6, -7, -4, -50, 45, -8, -20, -69, 17, -23, -57, 73, 64, -10, 81, 16, -23, 23, 57, 40, 1, -27, -36, 18, 0, 19, -3, -24, -19, -55, -15, -50, -84, 31, -11, -13, 10, -44, -48, 73, -35]
3844c5mJ03l2p0L0J2j2k7N9J3m4K2j1J0k0K5l8L8k0J1K5q4P8Rp8QJ8K2l7O6o2
3875b5O8J7l4KQk6jO3q3J6N7l7p0L2OQJ9o0K3nL3l3L3J9n2O6l2pn5R5m2j7n3Q4
3909A7J7L7m6LJ8o5m0K7P6k5K7q4l6J18r1K9K7k5pJ0k0N6n4oj1K2M1j4k3J5l2
3940c9O9m6J6k3M2on2K6J21j03M1m4p4R0l1m9m9R9l2L9L9k6%k2l3pQ1p0J8L4l7
3971b8J5K5k1K3M8j03K5M2m3K6l2LJ1J8Ol8N4j8n9N0%K4K1k5k1K2q2P9L8j10J
4002d9P7J8j3lq3M3O4l5j2l8R1j04LO9m1J6Mo2N0ml1N0M%p0O3j6Nnp7P8J19j31
4035b0K6L4o7L7LJMK2k7K5q2N9q7J35l4q0O7kJ1j4n6M6L1p9j2L1L0m3M9m4L8j2
4067a0M4p4J1O7k1J1k7J0kK1k9K9K6rl0LK4m4%J9n8N6j2Mrl4LP7m4n1O6K2l5K8
$$ y = [-35, -39, 64, 32, -38, -8, 4, -8, -35, 24, 37, -7, 15, 4, 14, -6, 19, -19, 19, -1, 10, 35, -49, 29, 38, -40, -32, -14, 8, -29, 37, -25, 43, 60, 26, 28, 36, 10, 9, 72, -11, 5, 62, 25, -45, -13, -7, 1, 20, -40, -17, -22, 11, -22, 11, 30, -22, 44, 12, 5, -50, 45, 3, -14, -67, 17, 34, 71, 25, 28, 46, -19, -59, -32, 44, 19, 46, -38, -74, 44, -47, -18, 9, -16, -23, -13, -33, 23, -31, -37, -48, -26, 15, 1, -22, -7, -39, 30, -16, 0, -23, 19, 13, -39, -13, 108, 5, 46, 2, -72, 18, -13, -62, -111, -12, -44, -5, 34, 8, 8, -14, -47, -54, 27, -43, -25, 9, -28, -13, 12, -9, 14, 62, -41, -16, 26, -17, 9, -23, -20, -9, 9, 15, -23, 31, 13, -46, 4, 4, 28, 49, 24, 3, 25, -57, 22, 60, -50, -49, 28, 46, 33, 30, -53, -10, 54, 19, 7, -31, 60, -44, -41, 28, -13, 3, 7, -55, -5, -9, -40, 10, 14, 14, -56, 7, -9, -4, -9, -86, -8, 111, -20, 6, 40, -27, 10, 13, 14, 18, 40, 13, 38, -44, 15, -72, 63, 29, -51, 16, 14, 25, 11, -45, 1, 32, -47, -59, -28, 2, -41, 8, -36, 2, -10, 34, -40, -29, 38, 17, 28, 1, 11, 9, 30, 1, 30, 56, 47, 17, 20, 44, 0, 0, 19, -39, 17, 5, 9, 0, -34, -31, 46, 2, -49, 17, 39, 4, 32]
4101C2L3r9M4LL6q4M2qJ9jm5Q4Om1n5L9J1k3l2J8j9L8J1m4Q7m1n5O0J6k2p9J11
4133D2q2N3j8j5L9nm3J4K9l4J4L1l9K3K4j8J7m5K4lk9l9M7nM0l1K9l5J6j0j0l
4165b2J1k9j0O7j5j1%O2p2l2N2j7j7M9l4j8K3JRk4Lj9j7O5jnN1o0J2L9j6o8M3
4198@jL4j1mj7M6l1m5N8j1K3l3%lK5k2k7j1K0j5J5K6k5J3l8k0L6Qmk6OO2m5PK7
4233A7j13J20k6K2m8mM5%Q9q6J2k6k5M4j0l2M6p8M5K5l0j1J8mj1M5no7R1qo1M8
4265B2l6J2K1j2j1L8Lp3L4M2q2R5j8pm4KOk3N1O6j06j7N7j5J3k4%K6K3k9%K7n1
4298a0L8k9j9P1nq0K7mmJ3ro4O0O9p3j8O8l9l7O7m0L7j4J7k1N8l8q5O7k3K7M5
4330E2j5m5L0J9p3L2Nj7M3Rr8Q1k8r%J7k0K6rp8J06j5k1o7Q3K7l2L1J2l6L0n9
$$ y = [32, 65, -34, 10, 13, 49, -35, 7, -1, 18, 17, -28, 56, 62, 21, -34, 5, 16, -7, -39, -21, -40, -2, 9, -35, 52, 11, -44, 16, 32, 10, -69, 42, -40, 13, -5, -20, 19, 14, -29, -15, 14, -20, -6, 25, -14, 9, 33, 15, 32, -13, 11, 8, -21, -60, -13, -18, 22, -9, 20, -15, 1, -9, -19, -22, -11, -40, -50, 17, 2, -9, -9, 53, -19, -51, 1, -16, -33, 16, -18, -36, -13, -12, -3, -27, -24, -43, -60, 5, 4, -1, 50, -10, 2, 41, 25, -43, 0, -1, 33, 22, 18, 1, 47, 16, -29, 29, 18, 41, 8, 8, 5, 30, 8, -19, -30, -10, -25, -10, 16, -9, 4, -34, -54, -18, -10, -14, -40, -34, 28, -17, -10, 17, -96, 24, -2, 20, -28, -32, 13, 13, 102, 16, 28, 2, -23, 21, 11, -21, 25, -53, -8, 17, -13, -24, -6, -10, -21, 24, 19, -48, 43, 35, -26, 22, -14, -2, 19, 7, -4, 34, 37, -36, -2, 40, -42, 53, 35, 28, -16, -14, -8, -31, 20, 86, -20, -37, 20, 5, 18, -6, -6, 20, 43, 14, 14, 41, -10, 28, -1, -20, 51, 46, -34, -7, -11, -15, -2, -11, -75, -15, 54, -19, -37, 31, -8, -45, 22, -18, 19, 5, 22, 1, 59, 21, -64, 3, -20, 7, 52, 37, -8, 22, 41, -32, 0, 5, -12, 31, 40, -58, 23, -5, -14, -14, 3, -17, 9, 0, -78, 28, 13, -8, -75, 8, 35, 3, 34, 46, 10, 40, -19]
4362a9rP9j9j0K8n3pK4M5o0K4k6oM0Jp4N3k4m1M7N2n4m5R0l1rJ4n5K2M9k7k8N9
4395C0p4j0J33q0k7M5j2m6P4p6K3K8K2l5P0l7j00R3oj7M4o6J3L8K9j16N9j3l3
4424d7K2M0m7Pj0l6J12l7l2J7P1j17M6M0m9NK8o2O1n1O0n6O8p6N7M2j7n7J6n1
4454e3L4M8oj8K6Kn5KL0L5o4Q1p2J2M0r0N6k3k2k9M0k4qN7l1M5l6J1k0N1o9L1
4486a9lK3n2L4M4K2o5L9j4J3M7r7O9n3L2oL6j9p4L1l3MO2j7j1OMl2L6l5KK8Kk0
4520a6j5rL0PlMj0L5m2J5L3p7L8N1q4L9J3J1m7P8k6l7K9%l3K0nJ3k1L3o2P7q4
4553d5J0M3j6K9k1L0p4J5N9m1LL5m7K1K2k6J1L1q2jO0j1l8L6kj5P4m3q8L8O6j16
4585h3P9N8m2m1K5M7p0N1Ll2J5m8PQO3k3Mn1j3O2mj1j3MLj2M6l3K7m9J5M0j0j9
$$ y = [-19, -28, 51, 32, 22, 50, -3, -10, 14, 59, -1, 23, -3, -9, 31, 32, -42, 11, -13, -54, -7, 45, -9, -54, 36, 5, -4, 10, -45, -23, 26, -1, -29, 30, -44, -54, 79, -1, -28, 17, 5, -41, 33, -43, -20, 8, 30, -5, 65, 28, -72, 21, 15, -2, 42, -24, -11, 27, 56, -60, -1, -14, -47, -25, 15, -32, -25, -35, -71, 41, 4, -28, -11, 60, -57, -11, 29, -20, -15, 13, -49, 12, -39, 21, -35, 33, -43, 14, 56, 39, -18, -2, -53, -19, 29, 23, 5, 31, 33, -22, -20, 10, 45, -19, 62, -10, 2, 42, -48, 8, -15, -37, -66, -26, -50, -58, -1, -32, 13, -23, -12, -32, 19, -50, -19, -22, 1, -51, -17, 27, 49, -16, 23, 9, 22, 69, -28, 41, -12, 20, 14, 50, 31, -43, -12, -45, -41, 21, 4, -7, -1, 3, -29, 7, -28, -26, 2, 4, -16, -31, -40, -10, -3, -6, -2, -12, 23, -19, -4, 29, -48, -10, 41, -43, -4, 9, 20, -27, 51, 25, -12, 17, 17, -16, 4, -1, 12, -9, 24, -38, 39, -45, -35, 8, -8, 21, 0, 30, -44, -29, 30, -11, -8, 27, -20, 1, 23, -3, 8, 39, -43, -44, 16, 5, -33, 3, 1, -14, 60, 17, -71, -33, 33, -83, -4, 54, 12, -29, -4, 43, -27, 24, 27, -5, 10, -38, -31, -23, 40, 17, 21, -30, -43, 19, 15, 4, -9, -5, -2, -14, 32, -1, 26, -23, -8, 32, 22, 3]
4619CK1K3n5M0k4j0l4R9j11J7Q7r4L0N8r7L7J6k0k4N9m5J0M7j23K2J01mr9R8o0
4649c2P3k0l8k1N2j5J7k4K8KJj8j2M5lj29J40p5J4M7L7r2J1L9m8l8R1p4J1N3n9
4680c7K2L5Kl1M4l1L2J3n9l8P9Jm5Qj8J2J2nlJ1MLJ1n3J4N9j0n4%M1k1K1knNK2
4716C9m0J9J2J2ll7l8K8ML6r9M2PJ7nj4K0K0pj1P7l1j04R4m2k0RL4k7K2K6ql2
4749@K3L2k8Rn9L8LK3ml3m5M3K8Mk2k2k4K5O0p2NL5j1K4LK1l6o2JL4QJ2l9L5J0
4784A9J1k2j8L7j5%l0K9m1K7N0pn9N2n4J2J1p3N1K5nk3J2J1%k4K2K6l0pKl9M9
4817alqK6m7M9lo3M2J7j3M0l1o5N7K9nj7m7L4N3Jr8O5M9q3K5J4k1j8N4o5M9m1
4850b5K2NK0q3M5oj5L5K0j3j8KJ1jj1o2P4K8o5MM1jn5J12q9J4MK6j4n8O0K2qn0
$$ y = [3, 24, 47, -8, 32, 8, -2, -36, 63, -48, -31, 56, -38, -8, 50, -47, -10, 6, -14, -38, 21, -24, -14, 33, -90, -68, 33, 29, -70, 28, -32, 41, 21, -17, -38, 14, -1, 16, -8, 20, 22, 23, 5, -7, 38, 35, -94, 46, -29, -15, 32, 69, -23, -12, 27, -21, -59, 32, -42, -31, 22, -37, -15, 20, 22, -9, 35, 4, 36, 49, -10, -48, 31, 32, -13, -5, -23, -11, 1, -4, -7, 4, 8, 11, 22, -31, -17, 42, 32, -22, -22, 19, -2, 19, 17, 12, 17, 39, -1, 18, 30, 42, 39, 2, -36, -8, -4, 32, -67, -25, -18, -1, -6, -20, 0, 20, 13, 2, 79, 48, -56, 38, -4, -24, -15, 19, -8, 14, 40, 32, 0, 23, 55, 27, 36, -23, 15, 18, 41, 37, 4, -41, 2, 30, 34, 12, -10, -34, -9, 51, -21, -16, 19, 8, 32, 35, 56, 20, -42, -41, -7, 1, 13, -26, 9, 19, 30, 8, -10, 27, 12, 12, -18, 11, -30, -3, 47, 40, -19, 33, -21, -9, 2, -71, -20, 5, 0, -23, -11, 0, 0, -24, -2, 24, -6, -13, -11, -50, -1, -4, -12, 14, -33, 16, 13, -50, -8, 9, -4, 36, 5, -60, -3, 26, 21, 4, -43, -9, 44, 45, -53, 12, 61, -22, 3, 17, -4, -22, 32, -33, 16, -25, -3, 2, 22, -61, -16, -22, -37, -2, 18, 5, -13, -11, 0, -1, -12, -74, 0, 28, -37, -33, 8, 7, -48, 64, -25, -11, -7, 19, 5, -53, 7, 29, 21, -29]
4884b9lJ3N0m2J3OK1l0K0l9L7mn8O0J1qk8L9m9mj4M6n8M9oO7r5N0k4K5%K6k7m6
4918c1O7l0Pn3O8j5L5n2N4l6pkj9M0J6o8j8M1L7PPr8Q5k1m0K6J7L9j3J3k7n0J9
4951bM4n0O1l4J6n8J3P0o1k8k1L1K3l0M4j6%p1N7j1L2J0J1k0Oj6Pl2M1k0k2O0
4983C4n4K9l8j2j9Q7O0r5mj9J6J1L3o6P9o3K1M2k8K9k7n7N6K3m5l9Q9j5m1K0M6
5014E3q0N1l2K9Pn2O4p5NM1o6OL7J2JM%nL5n6k0L0k7P1l2M%L9p1N1L2p2K1JJ3
5049A9l6N1l6N6J2p2Jk5K7o7Q8m7NJ6QOLk9L1j1m4L4qJ0oK5J1J8o1M9l6J0M0p3
5083c1L5J8m2L7n0J6n0K2k3J21Jn9jL7r6Q5n0KO3jl9M4l8m7L2pLJ0k1J9kJk9J6
5117b4QNL5jl6NJ1n2O2Oo8N7M6j12L1R9p1Lm4N7n7L0L0rK3j3o5M1m1J5O4l3lK1
$$ y = [-29, -32, -19, 31, -11, 2, 8, 29, -1, 19, -20, 17, 13, -45, 15, 26, 18, -10, 29, -20, -24, -38, 8, -50, -1, -7, 60, -35, 15, -9, 16, 16, 42, 15, -31, 36, 6, 13, -40, 28, 13, 48, -4, 50, 14, 7, 5, -14, 26, 42, -26, -44, -3, 34, 41, 48, -50, 35, 14, -26, 0, 17, 56, 43, 56, 29, -21, -2, 42, -8, 53, 19, 35, -23, -10, 60, -1, -29, -50, -19, 4, -26, 18, 2, 2, -69, -12, -23, 9, 19, 30, 10, 16, 0, 7, -25, 16, -4, -26, 34, -20, 9, -29, -41, -60, 27, 87, -8, -12, -31, -15, -4, 29, -37, 42, -21, 0, 42, 14, 43, 16, -41, 15, 38, -7, -46, 43, 28, -13, 7, 53, -27, 24, -8, 21, 28, -24, 40, -35, -30, 11, -55, -49, -12, 0, 1, 5, 5, 0, 35, -21, -41, -11, -38, 33, 1, 5, 5, 44, -27, 24, 56, -16, 5, 6, 19, -17, 34, -2, 54, 66, -6, -5, -30, -3, -70, 18, -29, -24, -8, 0, 6, 9, -20, 11, 0, -44, -10, -18, -8, -14, 11, 22, 40, -21, 28, -8, 2, 42, -31, 4, 22, -20, 17, -33, -17, -67, -45, -68, 53, 54, -5, -6, 31, -65, 20, -30, -28, 35, 34, -5, 39, 1, -46, -14, -21, -18, -8, -29, -10, -12, -11, -40, -24, -16, -11, 24, 23, -13, -8, 3, -49, 13, 19, -49, 8, 54, -58, -27, 72, 1, 4, -40, 17, -40, -10, 20, 11, 34, 21, -44, -3, -44, -29, 35, 2, -1, 20]
5151B0m0J4j9L6o7Q8l1j8Mj1J8J3n1K6j8L4J6%K3n5l5K4J6K1j5K8Kkk5m4N1J4
5183A7n7J5L2j0j0L9o5J1K7l5M5l2MJ9k7j9O4l7nO4L1pp1M3k5Mj8L1p9P7m6J9
5215ak0M1q7K7N4jj7k8L5Lm1J2Rk0J7L3m4L1K8k9Pm6M1Q%m2M4k2qJ2l2J7mJ6J8
5250A1J7J2k2Jk3jK%J7K7Qr5jP6p6N2j4K3l7nO2p3J9K0p0R0j2l3J1l0M7pK7Rp1
5285c9R1j09K1J2j1N1pNj2k3K3%Qk4L1rj1l%oL0m6N3k2Ok4k9N8m1K0J0Lm1mN1
5320A2Kk8K1m1K4%K4L8k5%K4k3MJ1n3lO1mk6j8L6k1Oj0Moj1l5M2RK0k6ppK3m2
5356b5JK3jK3p9Q9J7q5M3J2j8J6N3n4Mn4M1L6n4MK0j0j7lK7j9OK6Rl2K2j6k5M
5390a6ONj2K1LQj0M3o5L9j9M8j25J17o9M1k7N7p6L6O1o5J1M9p0J5k8M0ml1K5l8
$$ y = [20, -20, -6, -25, 11, -56, 32, 1, -17, -13, -24, -6, 7, -44, -18, -36, -2, 14, 14, 37, -18, -53, -29, -13, 8, -7, 21, 23, 21, -4, -48, 3, 17, -40, -25, 7, -3, -13, 26, -39, -28, -1, -36, 9, -23, -19, 0, -27, -46, 18, -19, -24, 40, 71, 64, -7, 36, 11, 15, -3, 28, -51, 26, -20, -1, -21, 20, -67, -40, 14, 13, -4, -32, 3, 6, -35, -23, -14, -34, -17, 16, -28, 3, 31, 2, 9, -37, 4, 12, 12, -30, 14, -8, -16, -4, -36, -19, -23, -7, 11, 28, 40, 18, 19, -4, -5, -3, -3, 14, 41, 49, -46, -47, 29, -47, 5, -9, 14, -23, -28, 34, -39, -20, 0, -70, 20, 8, -25, -14, -44, 3, -4, 23, 32, -39, 52, -57, -36, -24, -35, 16, 9, 14, 2, -21, 2, 2, 10, -14, 17, 8, -3, -6, -6, -12, 18, -28, 25, 3, 9, -15, -44, 14, -27, -7, 3, 6, -35, -39, 12, 14, -14, 7, -34, -10, -10, 14, 52, 27, 27, 51, 28, 32, 43, -10, -13, 48, 44, 18, 0, 36, 15, 21, 11, 15, 9, -2, -37, 5, 14, 34, 8, 1, -6, 17, -25, -24, -1, -2, 21, -58, 31, 48, -37, 6, 18, 0, 16, 69, 15, 19, -35, 6, 42, -12, -8, 12, 2, -15, -18, 9, -10, -4, 22, 31, -1, 21, 5, -20, -16, -10, -5, -17, 4, 7, 15, 5, 48, -17, 22, 3, 51, -74, 43, -26, 15, -12, 45, -31, 5, 66, 1, 12, 61, -9, 6, -22, 18, 14, -17, 8, -30]
5422c0J23j06rmK5M5n5M0p8M6m9N6k6N9n2l6P9m9J2K7k0j3M0%m0L8mj6j4J8Qk
5454A3k2k7M3k2QN0l5N9k1l6K3k7kl1M6q6P5k7jK6j9K4K6m8nK3o7K4J9M3j9l0
5486b3J5O4o8K8lJ6o5P4l6Mk0RL0L2Qo6J9n2R5m1l6N4l8l9K0OqL6J5K2n7Qj8J1
5520dK0L2l7nl0j0O6k5l2%l7N2J2J5J7n7J3ON8k1l5M4n2j5J5J6j5K4l5J5j4L8
5552A9NL9l7Kj4l0m9O3O1r6M2K8l3O0q8Q6q4J6M6k3j0n0P3jk3lj2O0j4j8j6j2
5584a3L3n1R8n6J2J5m1M7l1RKo5nN6j0k2J4RnL8o5k7J1L5j6Q6l2m4P2j06P6J3
5616C7j4l9J1J7n0N1L1l7J6j8l0P2o4N3J3n6%J5k3L4j8QmL4k4m2L7j3JK2j3j4
5648gnJrk3J2K6K1K5p3M8l1J8j4kN3q9K3J6N3o7O0l2j1k5P2m5lN7j9j4j5L4n3
$$ y = [-30, 93, -13, -22, -26, -1, 44, -11, 29, -49, -3, -52, 4, -22, 37, -15, -51, 28, -21, -9, 18, -2, -15, 25, 25, -15, 23, 19, 3, -11, 7, 15, 13, -9, -36, 7, -15, -7, 43, 8, 67, 46, 10, 33, 6, 4, -27, 19, -67, 8, -19, -20, 6, -13, 11, 37, -11, -16, 7, -60, -36, -17, 26, 7, -23, -8, 56, -12, 16, 13, 29, -36, 38, 2, 6, -14, -5, 25, 57, 65, -1, 18, -34, 61, 20, -16, 38, 0, -39, -19, -13, -21, 15, 30, 52, -5, 3, -15, -4, 16, 48, 11, 6, -24, -34, 32, 7, -25, -25, -62, -10, 2, 17, 34, -23, -10, -4, 54, 33, -2, 42, -10, -25, -10, 6, -9, 15, -20, -5, -19, 19, 24, 63, 26, 28, 14, -16, -65, -2, 59, -37, 5, 33, 0, 60, -28, 58, -26, -10, 36, 13, 3, -47, 26, 25, 2, -1, -13, 47, 33, 15, -1, -13, 20, -31, 67, 11, 23, 38, -3, 44, 13, 22, 24, -41, -46, 10, 0, -22, -8, 1, -4, 34, -31, -58, -47, -12, -28, 58, 26, -18, 54, -52, 24, 37, 23, -16, -5, 12, -38, 13, 44, 7, 23, 5, -25, 47, -17, 36, 49, -7, -7, 8, -15, 19, 1, 9, 5, 39, 15, -27, 10, -3, -2, 20, 7, -7, -12, -11, -20, -43, -31, -5, 16, 41, -32, 16, -15, 3, -11, -13, 40, -49, -26, -10, 43, -24, 36, 4, -7, -32, 40, -5, -8, 49, 30, 16, 1, 35, -18]
5681a8l5O7RO1p5l0K2k3k2PL8l0N3l1oJ7Q0q1NK4J9o4jJ8k6N4k2oQOrJl7M3Kl7
5717a9N0J6m0J7j1K5o6K6k1L9rj6nN2n6J2j1K9o0M5m2M3K2m9O3o2qP3Jo4L6Rl3
5750a4M5o8J5Q5Nm6mJ4J0o2K4rP7j03M7l4QL9l2J8m8N4k1n5P7k3K1jQk8L8r2N4
5783aL0j5j2%jj7J9l7M3m9K6J0j9l0P6r6M2KK4n6Q5k1m2N7Jl6l3M6l3L1J5%J1
5816B0n4R7p1l4L3N7q8M8J4p9K4L3L1o7oM5k6M5Jj8qK8k9lk1K5j8K1KLO9q9J5
5849@k4K7n4L8j6Q3k2n8jM5Ql0%k7k6O5Rn9J6rpM7j9J6k0J6J2nK8p2LM7j1J1k6
5884a5K3K7p3O6m7JQP2q2J6pj3N8j4k7K6l2M9l7j9RJ1o0N1L7l9Rj0j5K8J6m9L4
5917BM2l0j28J41J4j5kl2l5O1j5L5o7O9l6j1lkJ6k9K4m4J37p8q8M5M8Pm3J8M2
$$ y = [-18, -53, 14, 23, 84, 9, -21, 1, -22, -44, -37, 1, -29, 24, -7, -13, 4, 84, 3, 8, 32, 51, -13, -14, 4, -22, 32, 10, 4, 12, 18, 9, 10, -27, 16, 18, -19, 31, 47, 7, 24, 13, 38, -28, -2, -23, 16, 7, -9, -14, 38, -18, -6, -17, 12, -48, -3, -45, -2, 20, -29, 34, -28, -36, 37, 38, -26, 10, 19, -14, 31, -37, -22, 63, 68, 22, 18, 32, 42, -20, 4, -5, 72, -31, 16, -18, -10, 29, -3, 15, -33, 21, 0, -55, 22, -1, 20, 19, 27, -1, 37, -55, -1, 29, 14, 2, 2, 1, -16, 3, -34, 9, -40, -14, -4, -23, -53, 23, -73, -31, -29, -5, -61, 24, 3, -39, 18, 19, -17, -50, -4, -37, -6, 9, 9, 20, -34, 63, -8, -42, -9, 48, -40, 8, 22, -57, -33, 0, 31, -36, -42, 3, -23, 22, 23, 5, -3, 25, -4, -7, -28, -3, -21, 0, 2, 5, 74, -15, 0, -24, 3, -51, -13, -29, 54, 32, -26, -27, 18, 26, -4, -4, -31, -57, 8, 17, -42, -26, -35, -42, 5, -14, 2, -18, -2, 10, 5, 33, -39, -36, 11, 0, 11, -15, 8, 35, -38, 28, -19, -18, -10, 62, -20, -4, -11, -24, 34, 20, -7, 19, -13, 36, -1, -20, -11, 0, -60, -9, 28, -11, -2, -12, -27, 1, 17, -32, 2, 44, 14, -114, 27, 41, 26, 24, -8, -43, 18, 3, 38, -29, 40, 4, -7, -10, -12, 4, -25, -1, -45, 92, 14, -74, -29, 19, 26, -17, 1, 43]
5948D3p5j3lQ9l4J0qk4k9P0l2K0n0P3kj04J12n0K1k2J6k1N5k1m1K8pn7N1L9J1
5979D5n1N8q4R1n1j9QM3k5l7L1N7p5L4l2O8k9o1Q2p8K2j6M3p0O8lk3lK2k0L9l4
6011@j9N6o0L7J4q1P6nm4K3jl3M8M2o0Kk9N8k1k8KN4o7N5jk8Lk4O5k7Lm8M6K1
6045B9j7n7O6j6j9J6L6k0J6j8p2M2LL0j5J3L7p3J5k6M1k5L2On8O9l7j2O1p1K8
6076Dm6P6m7R6j17JN2L9k8mlm0NK4jo8J8P9m6J1j4J1PN0o7K%J5j5RM6q0L0k3J
6111b3J0kj8QM1J5m8k4j7R4o7K4Ll4KK9J9k2M5n2RK7L1k3l5N1o6NK2mj1pL1m5
6145c2N8o3PL8k2j3L2k6k5M0pm3N8k7M0jj2m8P1m5J7k6K8k4L4K7j2M4k6ml9Rr
6178aM0m6L6k7m0J9K7j3k5M8j9l7O5j9Ko%J2k7N5o0K0L4j0r0P7n6j3N0J3l4%L1
$$ y = [43, -32, -45, -48, 41, 7, 17, 9, -15, -44, 26, -6, 14, -36, 37, 35, -69, 43, -7, 14, -8, 8, -13, 42, 21, -20, 8, 1, -56, -5, 34, 45, -6, 52, -32, 59, 8, -11, -3, 40, 15, -22, 9, 66, -9, 25, -7, 61, 32, -29, 53, -25, -3, -19, 24, -46, 22, 19, -4, -7, 15, -5, 34, 0, -19, 37, -23, 14, 28, -53, 23, 18, -26, -3, -4, -37, 11, 53, -7, -5, -34, 24, 3, -25, -23, 31, -36, 19, 18, -10, -7, -31, 34, 7, 10, -38, 8, 29, 12, -45, 21, 5, -14, 2, 38, 18, 34, 16, -56, -14, -11, 19, 4, 17, 54, -19, -4, -30, 11, -14, 18, 24, -34, 35, -2, -14, 47, -24, 4, -42, 34, -13, 83, -34, -33, 19, 58, 30, 26, 23, -17, -12, 12, 11, -57, -39, 40, -6, 5, -9, 2, 9, 59, -8, -6, -6, 9, -6, 3, 49, -31, -1, -24, -23, -13, -15, -33, -25, 16, 31, -17, -41, -58, 36, -31, -7, -4, -38, -36, -7, 12, -10, 35, -17, -8, 19, 50, 27, -8, 43, -23, -18, 4, 0, -11, -18, 13, -32, 26, -37, -30, 8, -14, -27, 5, -21, -46, -6, -13, -56, 2, -25, 15, 14, 2, -46, 25, -20, -3, -29, -1, -25, 9, 36, 24, 68, 42, 38, -1, 8, -1, 39, -7, 29, 2, -38, -19, 8, -5, -30, 18, -1, -38, 27, 8, 10, 4, 4, 16, -11, 44, -16, 4, 38, 28, -62, 15, -41, -54, -4, 9, -25, -25, 6]
6211FQl7O5j9n7R1p9k1O4J1J4r0K4oQ7j8k8oJ5q4O3n9P5k1OJ7j1j5LML7p8L6N
6245BQ5p1k2O4m1L6j6m2J6k1K0jn9M2OQJ6j2pJ6l4rK9k5M8j1j2j5M9ol1k2K8k
6279Fj7N2k0q7N7j8m8OR9%r6P4m5P3Rlk2k0l9M4P5q3J1m5O5rnj0N6l8Rn1Q1k9
6313C2p6L2oJ9n2R2l3Nl1N9m8K4m5J3K0J8j0o3O6kk7L3l8LQ3n3%j9j1P9l6k6J1
6346A3qj1l4K8j4J9JKnJ8K5l2m0M5pK9k7n3L9L0o6%J6J7K7nl0L4J7k1j6L9n4M7
6380B3K8j10Q4l9n2L4O8m9k0O3k6K9k4pLj4Kk2J6m3O1j2nJ1j7L1k7M4jpok2J7
6413A1K4p7K9L9l5M9m6L5K0k3Jk9L3J2o2O7l6L1k6l1M2J2o3L4j1K1J0m2J7mj1
6444iL9m0l0P0o1L7jK7Jo8N4m9K0M2m3K2pJ9pm2L0j0K4n8N6l9L5n6M9j3j5N2k5
$$ y = [6, 14, -23, 42, 23, -34, 57, -22, -43, 21, 32, 46, -44, -20, -26, 61, 43, 15, 9, 24, -60, 3, -56, 19, -2, 4, 21, 10, -5, -2, 2, 39, -39, -3, 2, 87, 16, -6, 58, 17, 53, 37, -5, 11, -10, 10, 9, -50, -8, -2, 6, 22, 10, 3, 19, -15, -24, 5, -20, 28, 17, 5, -10, 39, 33, 2, -20, 8, 6, -11, 41, 21, -66, -9, -27, -75, -69, 30, 30, -66, 8, -37, 36, 45, 42, 20, 0, -39, 5, 80, -3, 8, -37, 28, 19, 14, 4, 60, 22, 31, -20, 61, 32, -44, -12, -18, 1, -51, 41, 8, 13, -18, 41, -7, 17, -28, -15, 5, 23, 13, -50, 16, 14, -13, 20, -18, -15, 68, 15, 15, -4, -15, 64, 28, 2, 13, 5, -6, -40, -12, -26, -7, -6, -4, -9, 9, 34, 2, -38, 7, 0, 29, 2, -51, -12, 18, -48, -48, -32, -15, 12, 7, -23, 11, 28, 7, -9, 30, -24, 23, 51, -59, 25, -14, -66, -32, 36, -13, -33, 30, 4, 33, 9, 2, 5, -9, -7, -29, -13, -56, 5, -7, -12, -1, -18, 13, -14, 30, 29, 22, 16, -6, 11, 35, -42, -13, 26, -9, 40, -6, 29, 49, 26, 27, -2, 31, 43, -19, 48, 12, 43, 17, -14, 28, 40, -23, 11, 0, 21, 31, -11, 6, 2, -9, 30, -10, -40, 30, -31, 6, 5, 32, 33, -35, 19, -30, -10, 32, -11, 11, 4, 23, 16, -26, 4, -6, 18, -40, 16, -23, 12, -44, 5, -8, -23, 29, 4]
6477Dj6n9J07p5L9PK4n7jNM0k4nJ7j5J7J5k4J8k6O4n2QK2J8l0m1rM1L3o2l9Q0
6510B4qJ8N3j06M9K8j5j9j4Oj7L7m3L3l6J4j7j4j4P7K5r8J05Jo1M3m7j0j6M7m5
6541b0J8jm7J05k8%l8K4K1J7m4jJ9N6j25K9M3j8J2j0M7p9mM2Oj3J2l9Lj1L1K1
6573B8nm8lM7l1j4M6l4OJ8k9K2J6k7Ll5l3P8J0P2o0kk8k6LN7k8pJ2mj0L6j8L1
6607D3j01R5j8p3O7k6k3N0Nn1P0J4j20N6M8q1L5kL5l4jO3m3l1j2O2kj3J1l5K3
6638A1lmmM4p5P1k9L3n6k1qM5J4k5M0mpo5M3Ml0K0k8K6Mol5LN2n4O4l3j5K4N3
6673D9p5L9j1J0m7L9k3K3L9n4J0K8j9rJJ4Nj9jK0J2o6J32r8Jl7N7k9M0l5k4jJ3
6706a6L5j3n1O8k7K3%J0m3R%J8J1n4M0Ml4J3j4M5l0M8m5l2N6Jk3l1N1l1N7J3k6
$$ y = [4, -12, -71, 36, -39, 0, 7, 31, -26, -27, -22, 18, -6, -11, 6, -9, 8, 23, -1, 17, -9, 55, 3, 11, 33, 51, 21, -20, -29, 12, 45, -17, -56, 24, 16, 34, 87, -19, 30, 58, 43, 24, 10, 16, -1, 36, -7, 26, -10, 4, -13, -27, -41, 36, 61, -37, 68, 69, 8, 51, 4, -6, -22, 25, -20, -2, -3, -50, 55, 27, 27, -11, 13, 34, 51, 7, 6, 25, 81, -44, -15, 28, 10, 22, 12, 59, -20, -24, 18, 24, 11, 23, -16, -13, -24, 7, 28, 23, -25, -28, 19, -12, -26, 20, -14, -8, 10, -19, 3, 19, -8, -5, -40, -73, 5, 15, 87, 27, 25, -3, -29, -26, 31, 3, -4, 8, 4, -6, 30, 12, 43, -58, 37, 19, -54, 13, -13, -36, 14, 19, -32, 38, 52, -68, -12, 36, -45, -10, -12, 23, -11, -12, 51, 8, -23, -35, 27, 25, 12, 23, -12, 11, 8, 4, 0, 44, -31, 40, 11, 44, -12, -33, -41, 4, 18, -7, 33, 29, 22, -43, 0, 4, -26, -6, -34, -8, -4, -10, -45, -42, 10, -44, 20, -13, -28, -4, 49, -26, 13, 2, 12, -35, 4, -19, 4, 43, -11, -1, 27, 8, -1, 0, 14, 19, 0, -1, 19, 31, -35, 97, -1, 0, -37, 20, -9, 31, -4, -28, -29, -16, 19, 6, -45, 23, -4, 19, 19, 29, -14, -5, -5, 13, 24, -30, 10, 14, -20, -7, -21, 24, -6, 42, -3, -35, 21, 22, -1, -32, 19, -12, 45, 58, 32]
6739C2Ro1M1J5k1nl6%K1oj0L2kK3m8m9N3N3m0J2L4k4J7o1K3J7PNn1j2K0O3p9K1
6773gK3m3L9q1J19o9K2o1M1J5J7l0N6j01M7NPj1M9o4J1O8j14P8k3%L7l5J3J1l1
6804a2L3m3M4j1p2K5kO4K0m1K8mpPl2rL2n4m4J18k6j6K0j7JK4j1Ll2J2j5L7l8
6837a8L7oj1p0L3j7J31o6jjk1K9k0K8l0N3p6qP9o6j9P3m4N6m0r0P4k6L2J7n1M3
6869Dm0J5J2Kp4P5j9Q8q8kN5k2M3m0j3OM1l4N3j5l6K7k3j2l8M9J8n0pM4Pj1j2
6902COj1k8M7k5lJ7j5L4p6P9k7J3Rm4L9r1L5m1J12l0j8N7k6m2MJ9l9PM9n8K3P
6935a4qPpM9l6M1o0M3km2K7jJk2K6j8nM1o3K3J7L0pl9MJ5J3J7m3kJ3N2k6j3Om6
6971b9Q8q8oJ4Qj8M3m4L2K5o3OJ8m%K6kK4lk1j4N9m3Nk3J1J8k5M8L7p5j0MJ8J4
$$ y = [32, 41, -20, 21, 36, 15, 10, -26, -26, -5, -11, -21, 11, 9, 32, -16, -65, -12, 41, 1, 13, 47, 23, 40, -21, 2, 19, 26, 31, -20, -32, -12, 51, -28, -7, 16, -27, 12, -69, 50, -19, 3, -58, -17, -2, 15, -15, 41, -60, -13, -8, -1, -12, 37, -27, -16, 52, -62, 16, -7, -7, 30, -5, 8, 19, -12, 21, -22, 22, 11, -61, -36, -38, 26, 46, 5, 33, 29, 22, 29, -3, -12, 20, -34, -78, 40, 14, -2, 18, 1, 2, 26, 15, 18, -14, -2, -17, 20, -18, 19, 13, 2, -68, -35, -52, 79, 13, 12, 11, -10, 19, -1, 27, -3, 50, -26, -34, 45, -21, -40, 33, -11, 45, 5, -85, -11, -37, -5, 12, -39, 4, -36, -21, -9, -7, -81, -6, -25, 63, -25, -27, 28, 6, 49, 9, -4, 2, 43, 9, 62, 47, 11, 38, 15, 3, -35, 14, 32, -18, -25, 19, 26, 15, 3, 9, -2, -30, 17, -8, -11, 6, -9, 25, -51, 28, 1, 14, 23, -21, 18, -73, -38, -79, 33, 3, -15, 42, 16, -26, -22, -3, -42, -35, 14, -44, -21, -14, -22, -15, -22, 27, -9, 32, -28, 15, 13, -29, -2, -3, -2, -24, 2, -16, -21, 20, -43, -20, -3, 27, 20, -19, -15, 0, 13, 30, -13, -15, -2, 50, 24, 11, 17, -29, 59, -29, -35, -21, -13, -31, 12, -32, 0, 25, -38, -32, -14, -18, -18, 8, 6, 30, 27, 6, -8, 51, 8, 13, -10, 1, 19, -6, 42, 79, 4, -6, -2, 16, 30]
7006C0q2J4O6Pm3j8K7K6n5O9m4k2K8L5o5rN6J1l0oL3L1j9q3M8%L5o0M0qK4l8K2
7039B0l5k1M2%l3kR4o0J1j9MM9l1m1j4J4J7kLqJ3k3N6m5M2n9L2MJqm4ML1N6n1
7074c%%K8k5k6LK8j8Mp5Q0k5jJ0J7Oj4L4m2P3o2J9ml0J4nj8Q9l6J7qm9lM6k6k
7110dL8j0m4P7J2q4L4j1m2RkrL6K1l8K5L0n8L3oJ7m4K9m2j0L8J1j2j6Rl0M3j3
7143a3K5J6o4O2k0OP2r3o5O3l0M5Kj5k3L0k1K7l9L3K6n1KkM9l9J3QK1k0J6k5k1
7176b5M7J3m8KL3p2J4M5L8m5n5P2J5m1K0k1QL0m7J4J2o1NP7l8J5JL7Kl1k9K8J1
7209B6j7k8l0K5j2P0j8m1%KK3qj9M6j0kmP3n9j5K9l9L3k5lnkjj1L6m8K8J8j5l6
7244c9LQ2p6nN5JK9m2p0N6K6Jk5k2l3Q2k8Nm3P7m5K1J2l2K1RN1q4L8l0PL1j5o
$$ y = [30, -52, -38, 28, 35, -8, -26, 1, 27, -28, 41, -3, -25, 3, 38, -27, -36, 20, 31, 1, -5, 28, 59, 40, -43, 5, 5, 40, -20, 20, 12, 36, -2, 20, -15, -36, 6, 6, -27, -29, 65, 5, 16, -3, 1, 50, 19, -22, -36, -22, -5, -7, -4, -12, 1, -22, 34, -11, 31, -28, 4, 8, 9, 1, -43, -39, -8, 48, -3, -3, -3, 25, 0, -26, -23, 5, -13, -9, -84, -4, -29, -30, -20, -3, 3, -11, 23, -19, 54, -8, 11, 7, -23, -9, -14, -32, 57, 21, 38, 30, -19, -22, 24, -2, -4, 34, 24, -20, 57, 69, -15, 19, 8, -34, -25, -27, -36, 0, 21, -17, 8, 38, -20, 13, 7, 24, -20, 9, -33, -43, -5, 6, -6, -22, -13, -43, 0, -13, 12, 28, -36, 26, 6, 12, 84, -9, -74, -11, -41, 4, 6, -9, -32, -2, -23, 4, -35, -2, 24, -27, -25, -27, 22, -17, -4, 4, 25, 5, 21, -4, -25, 22, 35, -13, -11, 22, -50, -36, 9, 47, 2, -53, 19, 34, -7, 13, -8, 0, 30, -17, -3, 9, -52, -47, 30, -8, 7, 8, 45, 47, 16, -13, 15, 26, 9, -19, -49, -24, -36, 34, 16, -25, -25, -23, 0, -8, -27, 19, 9, 7, 3, 76, 17, 2, 31, -8, 25, 0, -3, -8, -10, -11, -22, 14, -34, -6, 12, -3, -39, -36, 46, -30, -35, 20, 21, 50, 8, -62, -6, 20, 21, -4, -26, -59, 23, -5, 0, -43, 34, -11, 10, 22, -10, 11, 20, 71, -13, 25, -5, 2, 33, 18, 12]
7278A2Mm2RK8k0RL7oj3%k0RJ9m5nJ2K2l1K4M3o5K0K3j2N2o6J1J6ok1J9j2Nm1j0
7313d1P7n1M8l4k6N4j5k1k7M5o9P1ll4K6m3N5m0K1MpL8j0l2M7m1j3L5m1L7l5M8
7345B3m9K8K0k1M3p5j6N1k3rL9Nj5j7om4M1O0n7j5O5p2O9l0k1j1J8K7Lk3L1mk6
7378a1k0J6j5N5j3Prl4J3k1qN1m2nN2Mj7qMk2J2L6m2O7o2mJJ4Mk8N1o3L1K2j3
7413Cn2L5k9PJ5Q2q4N7J5n2L8m9k8P9m8K7K5j1K2r2P2j4%J2j4kJ0Pl8M1J4k3n0
7446b5j3N4%kl7Nk1N8m6P0n7K1j2J8k9K0j9k9M5j3K4mj7L8Mm5K8R%j0j3k2K5m
7480ApL8o3P1l4k2O1m8J0j6K6j5J3l4L0N4j11O6j5n0O3LMK7n6K1l9M8Jo2K9m0
7512d6J9O0Km6Qn1P8J1j1j2Jj3M1m0Lj1Jm4M9M1m4%L8l7k6O3j0o1K1R7m9m8O8
$$ y = [12, 16, -26, -17, 11, -9, 0, 37, 31, 18, 18, -2, 7, 26, -19, -24, -12, 10, -21, 3, 46, -19, 1, 24, 12, 64, -2, 9, 25, 19, -2, 17, 5, 10, -31, -41, 36, -15, 33, -1, -27, 27, 12, -9, -36, 9, -60, 11, 8, -26, 0, -43, 12, -28, -7, -3, -10, 28, 18, -14, 33, -8, -21, 14, -27, 10, -25, 23, -26, 2, 22, 1, 44, -31, -47, 4, -19, -28, 11, 16, 1, -16, -22, -66, -25, 35, -22, -37, 28, -44, 25, -5, -26, -37, -19, 8, 11, -12, 19, 15, -11, -31, -15, -30, 25, 12, 19, 10, -24, -11, -32, -40, 11, -31, -36, 16, 20, 3, -5, -1, -23, -11, 25, -17, 50, -12, -16, -15, -1, 3, -25, 26, -37, -6, 16, 3, -49, -14, -43, -36, -21, 61, -23, 34, 49, -3, 35, -14, -42, 37, -11, 16, 41, 30, 52, -40, 32, 18, 18, 30, 16, 14, 24, 31, -7, 34, 48, 25, -25, -38, 16, 16, 14, -23, -18, -39, 19, -27, 43, -14, 7, -5, 13, -16, 4, -15, -44, 1, -12, 12, 8, -9, 29, 33, -12, 16, 25, 25, 15, 2, -20, 5, 1, -6, 32, -31, 40, 6, -16, 45, -3, 7, -9, 17, 2, 15, -19, 11, 65, -46, 20, 5, -45, 18, 21, 25, 52, -4, 17, -22, 26, 27, -35, -6, -46, -27, 33, 35, -11, -3, -54, 24, 35, 24, 12, 13, 0, 41, 1, 4, -7, -6, -50, -1, 40, -4, -4, 34, -3, -29, 34, 24, -37, -16, 81, 32, -16, 52]
7545E2l5j1l6P1o4jN9n2M4oJ8j3k8m1RM0nrMN8j4JM1r2L2j7J1l1K6j5K5K2k4m6
7579b7JL7Rk6N0l1Kj0Rk4j9J0N4n1k6P9p1N1j4ml6L1K4k6j2L4l1qK0K6k2K3Rm
7613B7M2p1ml0M4L5q2M9l0Q2l8l0k4L5J1k8k9K9k6K5K1K1j1M3n3LL9n0K5jn7O3
7645C0p0K1L6j6j6L3J6k5Nl4K9J0m6Q2o1L7k7OlJ0k3N0n0j1L9kr%K1Kp4L5J7K0
7679C2n8L9M7m1Ok9J4j2pOL1m5L5k6k6K7R0q3n1L2N7m1n9N0N8p9LM7o3J6O2o0
7711b8N2Lo1O9n3N0J2o1M4m5L8oLQm0K8K3Kn4J1Lj6J9j6MM9l1J5M2o8j9N3n6r
7745c5N9j8n1Q8l8j0L1j0l8Q0n5j1PN5q4N5M5o3j7N5j2Kl3Ml4RN6n6N0l6N0o9
7777b4O3l9J1J3m9K5K0j3J4Rm2j4L8%K0Lm1J5Nj6l2pJ06o9pQ%L8l3pMK1k0J3J4
$$ y = [52, 17, 6, -30, 41, -23, -24, 35, -17, 27, 21, 39, 26, -2, -43, -34, 6, 1, -8, -4, 54, 40, 41, 82, -10, 22, 5, 16, -15, 11, -4, 21, 43, 19, -27, -26, 11, 20, -6, 44, 13, 15, 5, 14, -10, -29, -19, 35, -16, -42, 37, -34, 17, 3, -1, -37, -6, 18, -8, -20, 14, -17, -25, -5, 21, -1, 22, 31, 27, 69, -2, -6, -36, 8, 43, -39, 10, -20, 62, 24, -6, -30, 5, 16, -12, -41, -12, -38, -13, 8, 29, 18, 61, 8, 11, 50, 0, 25, 24, -33, 30, -40, -19, 17, 1, -15, 18, 34, 9, 14, -20, 9, 19, -27, 55, -6, 31, 4, 10, 7, 17, -6, 44, -6, -17, 22, 20, 11, 11, 32, 34, -40, -5, 12, 32, -26, 13, 60, 19, 25, -4, 10, -2, -9, -3, 28, -17, 18, -8, -34, -7, 83, 0, -51, -19, 38, -3, -62, -12, 46, -33, -30, 17, -46, -30, 32, -28, 24, 27, -34, 35, -18, 32, 44, -17, 27, -18, 20, 14, 17, 25, -15, 13, 36, 38, -16, -5, -2, -18, 1, -15, -11, 38, 7, 22, 64, -4, -23, 30, -26, -35, 24, 6, -45, 43, 5, -5, 26, 16, -22, 58, 3, -8, -1, 54, -30, 25, 70, 7, -10, 45, 33, 35, 2, 6, -28, -19, 37, -19, 31, -5, 45, -24, 39, 0, 11, 24, -25, 0, 20, 7, 21, 30, -12, -26, 12, 12, 32, 35, -6, 9, 14, -2, -34, -41, 65, -4, -11, -3, -3, 35, 2, -5, -1, 20, 0, 13, 27]
7812B7pm5Q4l4l1L8k2L9p1N3p3qR3m7K4Pn2P8n6j7K4j0O%j1K6jjj8oL7oNl8l6
7847d9M0M3Qo7L8L4nl1Pk1N6l8Qm0M9o0NJ1k8K6J3K5j0K9j6Nm0Oj9J5k6j4K2P
7881a7j1O5m7L7l4lM3n6M3k6qK7Qnq2J17n2JK6n3M4j3J4L3n4Kn%k3O6o7Rk6N2
7915El6nP1n1l4N2L9n3M2m7L4k5k0M7q8J6L3ON4l1nk0%K0j4K3L5k9k3M2m2N7r6
7948d3L1LK9n8J7NP8m6J6Pl2k8KJ6l2N5m7L1Rnk2J3L5l9M1nm6LpN8n6L9rj6k1
7983b4pK5pl0Q8j4p1N7j9O4q7P6k0l5JQ2q7j5K6N9o5Ljn9P7Mm5R1l3On6L1o8Q1
8017B8pJ2k3onm2N9k4M5l8rQ2r1J7j2O5m8l1L3K2k0J9l0j0j4L6k1j3J5j4N4l7
8049ho0P5J3k3Km1P2m5M4r7J0O2m2M4L7n6L7k5k9J5K3j5Pk8PP9o4M7n0M7l9k2
$$ y = [27, 20, -25, 59, 25, -6, 32, 10, 49, -22, 31, -42, -50, 43, -4, 20, 27, -25, 53, -3, -20, 4, -6, 0, 0, -11, 15, 14, 13, -5, -11, 26, 20, 25, -13, -49, -9, 34, 42, -25, 13, 47, 42, 11, 18, -3, 53, 15, 23, -17, 32, -28, -23, -12, -40, -14, -1, 24, 14, 43, 27, 32, -8, -2, -21, -6, -32, -46, -24, -17, -28, 37, -10, 27, -7, -10, 33, -23, 20, -6, -14, 13, 21, 16, -66, 51, -1, 0, 26, -27, 17, 4, 18, 51, -3, -1, -6, -6, -29, 37, -30, -21, -47, 5, -31, -36, 35, -16, -50, 2, 41, -12, 30, -17, 17, -8, -28, 19, -69, -53, -20, -14, 40, 9, 4, -16, -16, 4, -10, 13, 48, 19, -4, 38, -4, 53, -43, -12, -9, 20, -38, -21, -16, 62, 16, 32, 39, 7, -21, -19, -3, -35, 20, -27, 4, 13, 8, -14, -1, 34, -5, 36, 31, -15, -12, -19, 39, -17, 22, 13, -3, -24, -31, -6, -13, -43, 45, 31, -40, 17, -2, 62, -25, 51, 31, -4, -3, 79, -8, -23, 3, 62, -3, 0, -1, -60, 17, 21, -24, 67, 34, 40, -16, 15, -53, 28, 21, 33, 10, 4, -1, -43, 16, -8, 37, -1, -10, 72, -19, -2, -14, 51, 3, -28, 5, 27, 7, 26, -4, -14, -28, 8, -13, -26, -11, -25, 29, -8, -68, 7, 20, -3, -1, -42, 30, -15, 29, -68, -58, 4, -38, 6, 43, -13, 24, -1, -30, -15, 8, -7, 0, -28, -21, 58, -6, 41, -9, 38, -1, -23]
8081b3K1j8j7N2M5p1MoPL4n4J4m0P4l8M8j2l3Lj3O9k7pK1l7nmnM1j8qRj3J1lk2
8117b1O6j5Nm0J1j3PL1p0L3K7n3nM4o3K0N1J6l4mj0O1n5L7l7N0l5k4lM0j1J9m0
8150a5M8m2k7M4PrK2j6k3J3Pl3J4M4o0K7kM6m2Qj5MpK2Rk8L0k8m2K3K1J5l5M4
8184B4mk4j7K5n1M5K8
$$ y = [-23, -2, -20, -37, 15, 60, -11, -7, -13, -6, 28, -26, -12, -52, 22, -16, 32, 20, -13, -10, -23, 46, 19, 12, 33, -4, -9, -13, -18, 23, 5, -3, 6, -7, 4, 1, -21, 45, 30, 35, -5, 6, -7, 0, 31, -39, -6, 21, -32, -37, 7, -56, -36, 15, 31, -3, -7, -17, 44, -11, 26, -11, 39, 4, -20, -23, 17, 6, 25, -15, 33, -9, -36, 8, 15, 6, 28, 12, -11, 2, 9, -24, -10, 34, -26, 1, -1, 45, 3, 11, -4, 0, -7, 15, 24, -4, 26, -2, -44, -21, 0, 15, -20, 24, 20, -4, -21, 4, -47, -2, 26]
8191B6
$$ Imaginary data points
##PAGE= N=2
##DATA TABLE= (X++(I..I)), XYDATA
0@%%%%%%%%%%%%qJ6j6J6k4L2m0M8n6P0q1R4j13J34j55J79k08K40k75L16l60M09
34B18m63N21n88O62p42Q29r24J028j143J269j406J554j716J894k088K301k536
51a330K795l079L393l743M132m571N074n650O318p103Q041r187J0623j2488J5010
66H235j8632K4325l4872Q4058l04788J58150L58586m40988O9438L47473l12825
77f1840j31943L44355j31459j18369K05472r9554j29532J83110l1633o9685J01558
88F0480p6544o1089J29850m7813k7458R1639j12878l2899J65434r0639o1212J58065
100I4936j09211j08143K10230l3792j49314J51220k0835j51856J65331L0156j65407
111h6685J14277K5624j67274J40548Q3648k00989P0804J13594j79113M7442J62169
$$ y = [0, 0, 0, 0, 0, 0, 0, 0, 0, 0, 0, 0, 0, -8, 8, -8, 8, -16, 16, -24, 24, -32, 38, -43, 51, -62, 72, -83, 96, -112, 128, -147, 169, -191, 218, -245, 276, -312, 350, -392, 437, -487, 541, -602, 667, -739, 815, -901, 993, -1095, 1206, -1330, 1465, -1614, 1779, -1964, 2168, -2403, 2671, -2979, 3339, -3764, 4277, -4910, 5713, -6775, 8235, -10397, 13928, -20944, 63114, -241674, -83524, 275062, -165926, -96488, 250985, -61840, -193783, 150572, 19113, -99256, 106216, 6662, -122870, 60240, 28607, -41078, 60480, -16064, -77153, 52697, 4884, -22574, 69065, -43813, -76712, 88722, -1917, -63129, 94936, -14275, -122418, 87812, 54020, -95294, 55926, 35091, -116765, 48566, 78722, -86685, 27592, 53216, -114058, 26490, 110138, -90851, -20047, 93547, -85566, -38124, 124045]
122A24045j56822m2087J41361q2745l1908J19465p0669n3245Q4268m6177r009
133b3523Q9386p9626m0639J01030n4379l5570J11492o1645q0240J11002j6074
144B1214p3502R9620j9788j04856R6237K7827j00249P0487L4004j16590M9083
155a6513P9992q9068N701O4090p2894j832P4509m5978j7599M6009m6026m595O5116
168D0912m0892k7333N4365l3112k7706O6770j5708m9150M1442j705l2214M2152
180A7821j219m0770K9470J648l0073M0384K847n0023K9908J9561m1761K5581K3987
193B7361m9221R726L3962l3158O890K8989l9860j074M0048k8776q615L8258k8972
206d442k1034M4186r093k7927K9142m519k5963K6554M268k2532J6548j491k0021
$$ y = [124045, -32777, -74864, 66497, -16248, -48156, 71309, 640, -52605, 31663, -14514, -23523, 65863, -13763, -54402, 46628, -7751, -43321, 68171, 6526, -73714, 37288, 21214, -52288, 47332, 27544, -77312, 18925, 46752, -53497, 16990, 50994, -65596, -16513, 63479, -25589, -19888, 44202, -28692, -30524, 43985, -1993, -19592, 26417, -19609, -24204, 40912, 20, -27313, 27052, -6060, -33766, 33004, 17296, -31854, 9588, 7883, -24331, 17821, 16602, -24168, 5302, 6950, -23123, 17261, 20108, -29915, -7, 19554, -22207, 3374, 27361, -21860, -12134, 21828, -11330, -4440, 24549, -15311, -16385, 23663, -5113, -13728, 24530, -4442, -25476, 18710, 9617, -18310, 10832, 6313, -19650, 6904, 11172, -11360, 5188, 3697, -16324]
219a6324K4079L980k6299J7452P153k6408J7337J6070k7397N221J5900j9453O450
232b239J6132k1065J650J6355j8334K976K0402k1181o296K3670j2537r712K1152
245A0973r165j3967J7950k324j1175J3877m340j2164J5549n11j3710J3359J435
258E787j6242J1277Q005j4803M437P895j1048L030P853q774J327N692q575K842
272a297P972r537q76R251p074k912R452m328n358O823j603l368N480k688l356
287c419O127k464m189P338j466p166O651K493p471L507L799o161J333M268m241
302a061M26K964m145R92L921m495n02M879l733k204N380j528l800L574K71k663
318a724K099J21j724J910o30j563L023p02k916L031P85l440J927J749k923P12
$$ y = [-16324, 7755, 11735, -14564, 2888, 10041, -16367, 970, 17040, -10357, -5136, 10764, -8689, -2239, 13893, -7172, -5522, 10833, -7501, -4525, 15877, -5304, -11600, 12070, -467, -10179, 10973, 1808, -12159, 5791, 3467, -7708, 6169, 1829, -10335, 5214, 4703, -9007, 4352, 5787, -10455, 822, 8827, -5976, -1539, 6356, -4692, -1662, 6191, -2583, -1256, 4436, -4139, -1297, 6675, -2862, -3738, 5513, -1561, -4473, 4979, 651, -4707, 2116, 513, -2855, 2625, -63, -3419, 2708, 244, -3945, 3393, 1927, -5239, 1412, 3905, -3566, -59, 3740, -2421, -1088, 3180, -1061, -635, 2329, -1816, -824, 3097, -1398, -1900, 2979, -754, -2958, 2422, 894, -2906, 668, 939, -1724, 375, 496, -1228, 682, 52, -1511, 1512, 810, -2106, 925, 1710, -1730, 197, 1946, -977, -265]
334b65J433j758Q92N95k150J738P94l232J955K172m099O83L533l246q48L529k112
351c86j387L009j310j310K790j501j540L368j138k460L189k2l106K319J180k691
367i96Q34J117j400N42M27j024Q57k28j345J805J92k087J197P30j773J028R56
384H32j715O40N35j232J468O58k496J160J608k551R72K303k866o00K647j169p08
401e14J704j502p07J779q48m0J202k150l83K748j376p35J923j981q59L114j159
418B16j201K361k165j270M259j283k788L428j136l237M558P99m600K375J024l694
434b354L097J984m405J117J702l293K466K572m736M67K698l117J571L153m383
449a461m67L170k549J422L080n005k45M246l286O04M601n521k023O283k455j921
$$ y = [-265, 1168, -590, 302, 897, -1253, 485, 1279, -1953, 2, 2174, -1925, -1242, 2291, -955, -1803, 1726, -386, -1773, 1236, -74, -1384, 1406, -95, -1635, 1733, 595, -1865, 1324, 1302, -1804, 515, 1695, -996, -162, 955, -445, 97, 524, -500, 357, 129, -1216, 589, 781, -1306, -109, 621, -1152, -124, 832, -883, -243, 292, -940, 528, 1186, -1310, -150, 1458, -1093, -121, 2182, -684, -1284, 1363, 194, -514, 1190, -312, -1019, 760, -88, -128, 1074, -1076, -1459, 1289, -87, -822, 1101, -880, -1739, 1375, 216, -985, 1376, -789, -2059, 2200, 917, -1871, 1557, 421, -2816, 1742, 2541, -2059, 316, 1340, -2354, 743, 2727, -1678, -561, 1141, -2152, 314, 2886, -1850, -1383, 1315, -1802, -231, 2922, -1461, -1928, 1242, -1307, 115, 3195, -1810, -2055, 2191, -1095, -491, 4110, -1411, -3434, 2849, 394, -1527]
465a527N129l989l834O569p93l580M599k657m647O614N16m913M039j026n119N993
481A374J842n629L023L46n077N443K525o349K592J730n652M718L913p227J263
496a165L668n667L063N156p152j86M990n270J513O300p044k050O820m159j245
511b428P263n159m712P139j280l269N886k759n111N690L88l192M383k302m651
526d114N615N38l684M255j913n367O151J417n406M120j92o490N750L489o827K372
542b86K613o665L641N495o532j88M419n180J276O244n532k131N272l644p66O615
558D651m203m270N689j251l057N823j809n781M696J340l942L733K39n730L223
573f49L038l939J999J518n165J937M165l663K61K470m278O69M812l117j339L254
$$ y = [-1527, 3602, -387, -4221, 2348, 1555, -2025, 2574, -83, -4730, 1884, 2400, -2513, 1526, 500, -4619, 1374, 3216, -2413, 610, 956, -4121, 1322, 3847, -2502, 90, 1820, -3832, 886, 4799, -2428, -1165, 2503, -3164, -101, 5055, -2097, -2283, 2707, -2563, -1050, 5250, -1794, -3844, 2976, -1183, -2428, 4835, -324, -5036, 2103, 823, -2446, 3440, 681, -4430, 1260, 1648, -1544, 2839, 537, -4114, 1501, 2039, -1645, 2610, 697, -4670, 1481, 2898, -2508, 1612, 1420, -5070, 680, 4169, -2658, -286, 2327, -4338, -697, 4798, -1734, -1922, 2497, -2683, -1407, 4837, -695, -2826, 2446, -1198, -1964, 4651, 448, -3822, 1867, 616, -2441, 3382, 1573, -4208, 488, 1828, -2114, 1619, 1858, -3872, -649, 2389, -1550, 449, 1967, -3198, -1261, 2904, -759, -498, 1972, -2306, -1637, 3175, 58, -1281, 1973]
589A973l239p07N122k288k973L585j626k145M723r37m028L087l5k643L747k5m294
606b703K804Q53l222L582Q14n218K844K489m629K754K876o001J309M824m610K39
622i95M431n009q45N647l287j604M454l673j852N651k691k425M819l356k703O647
638C209k480m304O188k173n044P538k98p177N830J310p099N779K971q095L365
653d80L991o605L094M298p152J469M926n986J713N086p079M75O271o006m4O639
669D610o607j874Q116m696l128P652m277m632Q233j797n560O663j232n930O674
684B215M21o080M941N72n873N343J552o505M161J877o432M485L076p265K991L977
700C456o820K536N055p037P24N799n881J08O194n681j392O654m529k097O747l989
$$ y = [1973, -1266, -1973, 3149, 861, -2112, 1473, -153, -2298, 2425, 1488, -2540, 547, 512, -2131, 1616, 1591, -2703, 101, 954, -2268, 1314, 2128, -3090, -246, 2243, -2386, 368, 3244, -2757, -1448, 3376, -1234, -995, 3436, -1573, -2418, 3229, -58, -1662, 2792, -881, -2733, 2918, 227, -2198, 2621, -735, -3438, 3209, 729, -3575, 2613, 440, -4604, 2934, 2636, -4541, 1289, 2599, -4500, 1279, 4250, -3845, -480, 3511, -3094, 0, 4298, -2854, -1385, 3541, -2445, -732, 4354, -2725, -2250, 4021, -1985, -2029, 4610, -1997, -3871, 4245, -451, -3579, 4073, -204, -4836, 3397, 1600, -3960, 2703, 1471, -4459, 2215, 2636, -3444, 1497, 2069, -3804, 1539, 3091, -3414, 747, 2624, -3808, 677, 3753, -3512, -521, 3456, -3364, -828, 4227, -2810, -2086, 3713, -2168, -2060, 4134, -1547, -2939, 3715, -814, -2911, 3836, -153]
716a53l448O919k521m443O693j549n501O111J34n992N126J325o345M010K582n947
732b999K759L164n646J824L809n009J010M034m785L00M515m229m95M792l978j320
748b254N290l219k279N279k428l188N186j400l831M722n70m254M402J61m647L995
764I65R99m953L492J749n252L005K755n449K001L628n273J293M347m998j31N004
780C182m142j026N172l510k199N107k248k619M627j796l308M547p24l461L861
795A463n67l586L730M78l905L054O69l967L073J548m132K195J762l974K033K488
811B362m030J127K777l755P18L291l461j81L291k872n51L426k484j240L221j796
827a57j363L096j562j720K865j084j673K826q38k188K665k84k215K538O6k624
$$ y = [-153, -3601, 3318, 797, -3646, 3047, 1498, -4003, 2108, 2242, -3750, 1376, 2701, -3644, 366, 2948, -2999, -240, 2924, -2722, -898, 2911, -2098, -1088, 2946, -1839, -1539, 2976, -1253, -1748, 3044, -934, -2254, 3036, -183, -2462, 2817, 389, -2799, 2387, 987, -2844, 1878, 1308, -2946, 1456, 1617, -3030, 965, 1964, -2989, 503, 2252, -3000, 5, 2760, -2689, -688, 2940, -2333, -1040, 3307, -1691, -1822, 3182, -960, -1986, 3186, -324, -2523, 2584, 336, -2283, 2344, 548, -2760, 1787, 1063, -2398, 1463, 896, -2690, 1040, 1518, -2387, 667, 1336, -2631, 442, 1990, -2142, 53, 1815, -2159, -126, 2362, -1668, -541, 2236, -1519, -801, 2490, -971, -1152, 2139, -733, -1284, 2142, -342, -1582, 1639, -157, -1520, 1576, 14, -1706, 1159, 75, -1598, 1228, 390, -1798, 867, 583, -1632, 906, 972, -1652]
843a652K074Q10k602J653J194k592R10J515k041M12J672j826k05J599j136l67
859e82J406r81o95J253m23n68R60m70n89Q22J4m83O03k21n10O48Q4m62M51q4n07
880c34N87J94o04K43L24q00L42O59p77j26O47m51l50Q76k98q67P60J97p97N76
900AL57r00K50P11o22Q4N88o73j12P98m04k58O72n58k71Q91l91m49P07k79o28
921d86R55j64p76N94N2p13N98K78q36L04L49n29L28K98o14R5M64l45K09K77o30
942b92J75N57m83J21L95p45K6Q32n77k39O93o50l35J122l77p47P34k10p42R93
962B51L03j205M18N60r21N67P65j147p1R32o70J26R34j004m20J090m03k51R24
981G78q00q28J354j38p13R02m42j181J208M25r91O09p7j108R59O99r76L97M9j147
$$ y = [-1652, 422, 1232, -1370, 283, 1477, -1115, -205, 1310, -731, -319, 1353, -473, -678, 921, -215, -582, 824, -157, -852, 401, -22, -590, 370, -100, -689, 133, 147, -336, 267, 46, -464, 184, 268, -194, 257, 173, -334, 253, 447, -157, 86, 410, -390, -48, 611, -166, -292, 355, -96, -446, 430, 132, -735, 25, 222, -575, 1, 358, -542, -292, 419, -203, -119, 469, -204, -316, 482, 78, -180, 492, -66, -337, 554, 163, -286, 421, 142, -486, 469, 305, -471, 123, 175, -538, 60, 338, -498, -194, 155, -374, -46, 252, -362, -267, 197, -148, 61, 338, -292, -117, 440, -43, 78, 473, -272, -246, 586, 9, -230, 463, -187, -522, 600, 223, -524, 210, 0, -742, 251, 554, -651, -233, 327, -594, -27, 738, -409, -480, 452, -218, -92, 842, -162, -582, 508, 105, -146, 778, -22, -850, 504, 366, -347, 555, 113, -1068, 140, 565, -426, 183, 106, -1002, -43, 656, -320, 77, 126, -1021]
1001a021J160P96j332M45L39j432J158J451j993M6J180j632M76K065j792j051
1017a137J747q31m06J975j163j550J541j23o91J666p79j739J573K60q44J397n87
1034C09j774J461P23j034J055k79j817J332R81j063O21n7j750J277J164j428N22
1051B43K49j896J101J707j778RR87j803M76K206j477r26J305j031j35K037q51
1068D23j322R88l47j78J583o63j248P65n2j35J369o66j496R25K10l79J184m83
1086D78j641P71P35m73O36j49j487N21R98k62L12l06j157O06J035m22J84j74j212
1105a007O27J401n82m36J81r51K34J530k07j024o6j53J01R91K3r71l74O2N75Q05
1125G59l88q74qRL83J084l67j400K47P13j27N47L62j629l32J535J19m82M01q05
$$ y = [-1021, 139, 935, -397, 48, 387, -1045, 113, 1564, -429, -383, 797, -835, -359, 1706, -86, -1137, 610, -221, -627, 1348, 185, -1365, 176, 53, -638, 1028, 249, -1490, 83, 343, -501, 896, 309, -1465, -4, 719, -315, 740, 461, -1356, -24, 957, -106, 515, 458, -1292, -15, 1149, -279, 243, 492, -1404, -303, 1404, -374, -365, 622, -1181, -705, 1501, 24, -902, 403, -628, -763, 1274, 423, -899, 89, -258, -436, 1147, 484, -764, 1, -51, -186, 1183, 517, -979, -54, 156, -223, 961, 478, -1163, -392, 343, -130, 506, 357, -1130, -609, 389, 127, 439, 133, -1024, -418, 617, 195, 379, 205, -1007, -380, 1021, 439, 3, 184, -767, -533, 997, 790, -234, -300, -453, -352, 639, 662, -309, -683, -621, -46, 759, 371, -503, -511, -502, -119, 965, 598, -802, -555, 158, 31, 578, 940, -689, -1021, 514, 633, 151, 552, -253]
1145b53q87J320P43q25r8k85o65J016P96p85l25r8n37R65R79j095m89L78m21N80
1165A4J190r50j023M96J58K38Q78o27j126M32L79J93O29p73r99O71L15R8N80p44
1185B9j234R01P77m56L86k59j253O08J098l19p0k40q95O04J023l20j15k45r02
1204h82P56J151o73m17K60q93K71J577o93j038N78l71k36J422j43j333K43K43
1222a78k14J039q0j308L77L22k11R46k3j492M51P66o22P91L81j771J48J419o70
1241G1J5P63j430l74J623l32m73O32r99m41J544k64o04O26q26n32J767k37j149
1260f20R46m16r79J795K31j749Q29L60j230J237P83j872L77Q52j181P75R48j673
1278e87Q9R72r99M56J086j642j27J354j051J27J361j540m68J714p84m83J516j086
$$ y = [-253, -1140, 180, 923, 98, 0, -285, -950, 66, 862, 77, -248, -346, -883, 82, 1061, -34, -523, -145, -566, 14, 1204, 254, -769, -273, -115, 123, 1001, 374, -752, -320, 59, 252, 881, 108, -891, -220, 95, 193, 773, 29, -1205, -304, 473, 17, 403, 144, -1109, -501, 597, 278, 208, -32, -927, -323, 700, 380, 265, 20, -882, -126, 1025, 352, -65, 195, -698, -427, 1150, 457, -581, -3, -374, -610, 812, 669, -664, -421, -178, -392, 647, 567, -741, -364, -42, -253, 693, 670, -822, -371, 395, -227, 564, 945, -826, -678, 741, 71, 86, 849, -581, -955, 668, 336, -137, 495, -504, -945, 599, 335, -269, 357, -469, -1001, 766, 529, -620, 326, -90, -1069, 726, 957, -792, 37, 397, -833, 404, 1187, -685, -308, 544, -637, 138, 1086, -587, -498, 474, -525, -69, 1017, -625, -752, 602, -449, -322, 1039, -501, -969, 745, -39, -522, 994, -92]
1296i2r35J751m02q04J223n94j095J524k2j106J101l65j223J498J50j356J095
1313C48j3j384J320M43j464P05M67j348Q90R30j488M21Q19j376O07J066j359J26
1331b90J045j139J66J188j216k73J205r15j61J287j019n10J156o16m24J096n52
1348B8q47J149k14o91J025l28q95J031q8o87Q17q7q83Q91L15r91O53K40j035P34
1368A37N50j047K75O19r29K83O76p29j01O14o07k8O62n08k25N60l44j08N08k99
1388d1k68N30k33j53M50k56k69M48j00k91M75j96l12L95L4l98L91k2m80L68J52
1409B24m94K06J68l86J31L43m17N8L26l65Q5K94k54l6K87k42j5L33k30j52M05
1430B69k32j68L87k18k08L58j44k31M03j18k98K47l8j62K52j00k26K39o7j54K99
$$ y = [-92, -1027, 724, 322, -482, 741, 147, -948, 576, 554, -552, 549, 184, -1039, 459, 609, -747, 348, 335, -1049, 271, 714, -750, -45, 422, -926, -36, 894, -594, -173, 646, -730, -123, 943, -416, -290, 755, -384, -218, 970, -246, -519, 686, -229, -390, 897, -122, -632, 524, -92, -516, 580, 28, -819, 330, 116, -575, 450, 122, -773, 258, 170, -517, 300, 213, -670, 221, 536, -455, 198, 438, -597, 137, 687, -360, -85, 534, -395, -112, 564, -165, -266, 348, -259, -287, 375, -133, -358, 202, -142, -250, 258, -41, -309, 221, -12, -165, 285, 29, -240, 208, 108, -183, 292, 96, -216, 179, 213, -185, 206, 184, -296, 72, 224, -270, -64, 104, -282, -151, 192, -225, -167, 159, -206, -121, 173, -81, -117, 170, -72, -87, 246, 16, -136, 269, 37, -131, 256, 38, -170, 188, 44, -187, 216, 98, -200, 47, 9, -153, 99, -1, -227, 12, -55, -209, 90]
1451I0o1l05L13J01l90L81J09n25L30K44m10K19K40n13R2L93l23m9K95l44j5L37
1473B09j92j82K26j55k26M91j14k91J91o7r5K87J3k03P5n4P5J80r5j24J17j75
1495a09O8M25l12k72L76j12k21M67j07n49L49K59m76K37K28o52J41N49l63j16
1515a90M40m40j84N47J1l20K22r2k46L66J62k79j1N7k38L10J91k46j94J00q6J50
1537C0K62l07k49J96m6J11K60k35l41K38J13p2K12j10l36K26J22PL2j02j70J41
1559a8J20M2J10k32l31L74J43k30J93j38m75L73M52m92L5J06m13J91N12l32k09
1580b19K51l27P7N89k69l06K81k80J23N74l35m03L24n9j39M75n8o70L01K08j84
1601d6K70l2m82J21J40l5K89k52l34L30Lk17N78j55p69N36M33o11L34L26q67K10
$$ y = [90, 29, -276, 37, 138, -252, 129, 238, -287, 43, 287, -123, 96, 336, -177, -85, 308, -15, -64, 231, -113, -128, 209, 17, -165, 61, -94, -320, 171, 57, -234, -43, -110, -205, 82, 95, -108, -33, -87, -12, 168, 73, -51, 66, -109, -41, 384, 72, -200, 176, 64, -157, 310, 203, -346, 3, 262, -214, 23, 251, -401, -260, 289, -74, -190, 250, -190, -374, 173, 184, -136, 86, -6, -252, 114, 276, -3, -14, 43, -195, 115, 306, 60, -134, -34, -120, 30, 292, -15, -264, -68, -114, -3, 257, 22, -319, -81, 32, -40, 172, 62, -274, -48, 74, 81, 113, 11, -159, -18, 102, 144, 254, 22, -309, 65, 208, -22, 171, 33, -442, -69, 383, -109, -74, 32, -381, -190, 322, -10, -219, 32, -295, -218, 371, 102, -204, 77, -203, -80, 494, 159, -244, 80, 21, -118, 357, 299, -371, -70, 138, -46, 224, 192, -290, -169, -29, -64, 225, -27, -361, -31, -28, -245, 333, 178, -591, -55, 378, -233, 101, 427, -440, -230]
1623b30P07m23j12L71m54j31N68o7k70J50l15l8M69j48k74K41k44r8N68o3m69
1644b62K33J3l26M60K25n07mK33j53J47K04l19q7J74OJ19P5l40j0J88n3N7J15
1667A88l75n3K84o9p1K50k64k26M15P4k69J49J2l06K93J77k43N3P4k83K59K50
1689C19l55J08J31l98K55K81n15K4M24m79mO01m38l65O14j77m24O36q8o02N09
1710E7J44m50L42J06m83L28J40k85K82k8m08M62R3n75L87J86o25L62M08p51J75
1731a33N66p69M9P07o17j08O12n24p5O61n11k23P06m56k19P94n07l82Q44l86m12
1752c83Q25k97o43Q32k9p38P01j1p62P30J25p84N73J01p46O28K17q08M93K60q70
1773e86O16M02r29L65N98q92L40O55r27J66P14p31J4P23p06r0Q27o87j39Q12o57
$$ y = [-230, 477, 54, -58, 313, -141, -272, 296, 229, -41, 109, -206, -244, 225, 77, -197, 44, -200, -298, 270, 207, -262, -29, -16, -342, 118, 343, -164, -168, 65, -88, 59, 263, -56, -143, 31, 37, 156, 231, -109, -119, 69, 16, 73, 188, -187, -240, 44, -25, -96, 154, -110, -336, 79, 153, -116, 33, 45, -261, 32, 209, -34, 19, 93, -190, 69, 319, -36, 72, 203, -195, 60, 341, -174, -150, 274, -205, -209, 392, -46, -411, 203, 26, -398, 238, 150, -452, 57, 201, -249, 93, 199, -284, 44, 184, -101, 181, 153, -255, 207, 300, -275, 112, 298, -327, 35, 443, -308, -133, 433, -336, -287, 420, -197, -305, 307, -217, -292, 369, -142, -365, 341, -115, -334, 460, -47, -429, 415, 29, -383, 442, 145, -498, 334, 305, -433, 268, 257, -505, 225, 350, -434, 139, 240, -506, 122, 339, -469, 24, 284, -586, 30, 432, -497, -132, 466, -426, -86, 569, -358, -192, 522, -209, -195, 528, -178, -268, 559, -128, -267, 545, -112]
1794a12l50R52o12k95R39n22n55R47l16o57R33k31p46R51q5q12R01k3r23Q32J82
1815C98r04O65L06r38O30L39r05M27M55q77L51N40q75K81N71q56J87P03q04M2
1835b64Q05q22l0Q66q03j87R83o60l99J066n49n16R96l62o19R08j67p48Q52o4
1855B86p19P43k2q46P71J05q63O79J86q82O23K76q12L93M99q86L49O36q58J19
1875b23O74p08L7O55n57q7O90n60j85P33m86j97N65l76k48N96l33l10N76j62m87
1896c93O09j51m66N99j12m80N39nn31M96J05n64M01K23n84M37K09n27K08K76n00
1917b11J74M37n88O8N26n02p6N48m62k06N78k74l42N04j45l66M48K0m62L87J17
1938A73m70L00K10m40K07K47m47J19L91l98j0L71k79j18M37k44j67K93j80k05
$$ y = [-112, -462, 490, -122, -417, 522, 0, -555, 392, 76, -581, 352, 121, -625, 326, 241, -571, 330, 307, -616, 216, 398, -506, 159, 465, -473, 157, 496, -409, 18, 473, -404, -53, 487, -388, -107, 464, -392, -205, 498, -306, -264, 541, -281, -311, 555, -248, -435, 548, -112, -511, 555, 6, -510, 486, 124, -495, 413, 246, -502, 350, 286, -433, 310, 288, -558, 213, 318, -545, 134, 320, -562, 61, 337, -475, -82, 417, -469, -120, 516, -342, -223, 451, -257, -220, 435, -122, -209, 481, -79, -264, 469, -17, -214, 351, -25, -273, 323, -10, -320, 256, 94, -393, 216, 65, -401, 198, 86, -394, 145, 140, -391, 105, 210, -354, 47, 270, -314, 123, 332, -195, 13, 289, -211, -37, 400, -188, -120, 406, -96, -172, 376, -86, -292, 286, 12, -330, 174, 29, -337, 111, 131, -331, 56, 173, -297, 3, 213, -227, -20, 227, -220, -101, 290, -108, -118, 253, -26, -144, 293, 49, -118, 175, -5, -210]
1958b10L04j2l21K25P7l46K94J01l67K38J66l46J71J85l26R9L06m19J05L48l82
1979a10N7L18l65j6M80m42r4M20l12j78M81j96l80N30j79l48N01r2m57M81J0l90
2001b81M27Nm27L21J52m34L44J77n82K99L17n62L36K59o30J12N73o05J20M59n77
2022a97m2N61m45j87O68m81k03O55k93l44N10k29l23N30r2l71M26l2l82N07j8
2043B18n02L96M7l79L51J32m76K99J59n00L22J75m40J09K27l68K10K19l74L7K75
2064A37k90J22K43l36m6K88j52l8K64k79q9L10n0j87K36j20j36J97oj20J31m3
2086C6j62J07J58j89M6M3j44Q5N7o1m8M0j7M5O5n7l2MR2l0J9m0l4l0J15Jk4M9
2114I4j03m3J26Qj20N3l6p7J07L8q0j4l0k0J09jj59J23J2j37K11R3k35N6J97k00
$$ y = [-210, 94, 82, -239, -14, 63, -283, 11, 112, -255, -17, 149, -197, -26, 159, -167, -68, 238, -181, -76, 272, -110, -53, 265, -100, -116, 364, -78, -172, 248, -64, -242, 239, 43, -337, 193, 14, -334, 167, 75, -382, 99, 109, -281, 146, 151, -276, 45, 197, -237, 107, 284, -298, 1, 318, -244, 92, 351, -279, -167, 406, -199, -79, 380, -197, -239, 322, -123, -310, 358, -123, -326, 329, 36, -308, 202, -27, -350, 180, 88, -283, 143, 111, -271, 236, 218, -284, 112, 159, -220, 131, 263, -213, 86, 245, -255, 67, 242, -198, -89, 138, -230, -20, 199, -175, -138, 137, -153, -31, 212, -124, -170, 118, -34, -72, 192, -87, -176, 134, 84, -103, 133, 13, -123, 74, 68, -52, 79, 36, -126, -19, 139, -50, -4, 39, -105, -20, 37, -24, -72, -32, -49, -4, 61, 4, -28, -24, 68, 38, 57, 17, -17, -47, 68, 69, 45, 94, -9, -52, 74, 82, -38, 15, -21, -98, 9, 47, -33, -47, -77, -97, 12, 11, -148, -25, -13, -150, 61, 154, -81, -25, 172, -28]
2140b8L5J59k37J4K11j72k3J48j62l6K51j76j9J15k29M2K42k44m1K10j37j53M12
2163A82k30j75L23n7j77L13n2k45K22P0k37K13m9j91J73Oj26J63M6l89K31J54
2185A68l58K21J32l24N8L26l31O0J98l22L6L04k38R1R0k70J17K71k66O1J70l76
2207a82Q0L73k54j48K94k52n7L13r4k45K87j66q1K43o5k14J66o0j35L55p4l83
2229b99L60l7j97L93k3n35L32K02l56L08J57n36J20L40k27N5J13l10PK98j64p0
2251f9J74k60o5L68j38j14K00j80j36L85p0k12K08r9k16L45J4k18R2M7j69K77
2273A64k2j95R0Oj14J98m7j91J12n4q0J66Q8k72N7Q2n2L4J63k24o4J91l6L5O9
2298A04r7n5M0P3l9J4r8O7N1K6n9K6j24K9J03l1k8L3o3o3J05jKo2Nl5M9M6M3j71
$$ y = [-28, 7, 166, -71, -57, 154, -18, -41, 107, -55, -91, 160, -16, -35, 80, -149, -107, 135, -109, -150, 60, -77, -230, 182, -48, -223, 100, 43, -134, 179, 127, -118, 104, 174, -63, 150, 101, -90, 83, 89, -37, 126, 172, -217, 14, 168, -190, 31, 163, -161, -103, 223, -108, -48, 150, -172, -136, 168, -70, 21, 111, -159, -42, 229, -37, 24, 194, -182, -102, 271, 17, -131, 163, -89, -146, 167, 73, -172, 115, -51, -132, 111, 46, -168, -2, -62, -197, 158, 84, -299, 61, 24, -173, 220, 197, -338, -6, 196, -160, 148, 305, -231, -111, 229, 2, 57, 170, -140, -133, 165, 1, -69, 105, -155, -220, 148, 10, -104, 96, -84, -220, 165, 95, -117, 91, -8, -224, 121, 135, -83, 9, 56, -113, 164, 142, -53, 37, 43, -71, 127, 80, -111, 1, -53, -133, 33, 121, -151, -94, -12, -64, -30, 133, -91, -155, 36, 0, 35, 104, 7, -48, -8, 65, 26, 40, -58, 9, 60, 86, 27, 53, -71, -42, 61, 30, 2, 35, -28, -91, 14, 13, 15, -47, -42, -77, -28, 18, 61, -110]
2328a10K0M6M6Q2m3p7oR9m0Q6l0j45lJ45n6KQ1k05L4J48k1q1M9q1p1J43lj27J22
2357Dk9q3J30K7j11O0M5j11J32O6j88N8R2j70O6J34j29r2K05j54RJ24r9n4Q3k3
2383hL4L5q3k1M2l1MJ09j4j14P1p6P0L2k4J9J5l4M9L3o8kk1j0qP4j19L3P5p8J6
2414@M8j12RO0p4L4L3n8J8N3l7L7P0n6m2R3m2q1J81j07k8P0n0m9J37p5j00J41
2442G3q0p7J80o4j33J46k4j74K17m0j57J42K4j59J68Rj74J07J40j87N1J79k24
2465e7P7J77k64O8J43k24N1J48j34l3J67k16J0J58r6o1J63r7o9J67q5j23J79q0
2489c1m0J29r8q4K02J1j72J40lj48J93m9p7J25k2j42N9L9j16P6P8j78O9O7j19
2514i1N3N8q5NQ9j4q2Q9K0j07J34p6qJM9J5l4R3r1L1J4o2n8J04p4m6Q3K2q7PJ12
$$ y = [-110, -90, -44, 2, 84, 41, -36, -42, 57, 17, 103, 73, -72, -75, 70, 14, 16, 97, -108, -74, 74, 53, -28, 21, -60, -131, 12, 9, -118, 4, -25, -108, 22, 49, -62, -2, 43, -68, 64, 130, -58, 0, 92, -78, -12, 122, -7, -99, 106, -48, -39, 85, -14, -68, 15, -8, 26, 61, -22, -43, -1, -32, -28, 81, 67, -47, 24, -52, 18, 50, 26, 45, 60, 26, 75, 108, 40, 38, 17, 7, -1, 73, -46, -13, 62, -16, 0, 48, -64, -55, 5, -69, -35, -2, -60, -42, 11, -26, 11, 81, 25, -17, 76, 34, -47, 134, 27, -1, 69, 19, -30, 107, 32, -68, 73, -7, -84, 96, 32, -101, 45, 21, -153, 64, 24, -133, 9, 33, -126, 42, 51, -123, -16, 124, -63, -12, 167, -57, 20, 197, -67, 1, 144, -80, -29, 119, -15, -48, 119, -97, -87, 71, -25, -86, 77, -20, -89, 78, -7, -130, 49, -31, -71, 58, -40, -124, 78, 89, -83, 57, 54, -94, 99, 50, -27, 98, 76, -66, -7, 32, -84, -8, 70, -108, -39, 28, -91, -38, 20, -65, -60, 29, 15, -67, 22, 42, -65, 69, -7, -15, -14, 35, 50, 16, 109, 18, 49, 63, 1, -57, 47, -27, -73, 10, 32, -55, -48, 64]
2545F4j49M3J03j25K9J19p8p4J47o1m6O8%j25J75q9n9J59j12PN0%j11J44m9j16
2571h6J13m3j32J72Rj21M5P4j44J15J05k47J15J47k17M0J85k10N1K03k14nK49
2594B04k87PK22j49l3J72k17L3K00j87n2J94j53j14K67j31j65K86r9j63K84o6
2616E3k56K31J5k75L03P7l32K67R3l82K60J11k83J29J98m39L36J22l63R9K37l91
2638a90J68K31l37l0L75l39k3M18l26j06K71j83q9M02k54j86L22Rk87K86j02k43
2660b13L40N1l29K89n2l50M13N2l86K25O4l66L05J36m14K26J59l27J66J86l93
2681b18J47K37l73J71L21l38r1L53k44k9L34k90j77L75j69j24M16k96k49L77n7
2702G6k35K74r7l32M15J2k58K52r8k21K11J69k96J79P1k92J60K22k87J05J66l71
$$ y = [64, -85, -42, 61, -64, -35, 84, 6, -68, 79, 18, -28, 40, 40, -85, 90, 1, -58, 101, -11, -4, 46, 46, -65, 79, 30, -86, 27, -16, -148, 24, 33, -88, -43, 31, -113, 2, 107, -140, -25, 122, -95, -55, 130, -80, -29, 174, -40, -45, 204, -83, -76, 146, -3, -36, 136, -81, -48, 152, -35, -87, 107, -46, -160, 107, -24, -189, 97, -2, -165, 119, 53, -203, 28, 43, -232, 71, 148, -184, 83, 176, -206, 54, 165, -118, 11, 209, -230, 106, 228, -135, -36, 201, -190, -22, 209, -128, -158, 217, -122, -145, 273, -53, -159, 112, -71, -160, 242, -12, -198, 124, 133, -154, 132, 30, -213, 127, 178, -151, 138, 86, -264, 149, 201, -185, 40, 104, -262, 43, 179, -235, -9, 150, -177, -11, 175, -218, -71, 166, -207, -36, 285, -53, -144, 209, -35, -64, 270, -20, -197, 178, 9, -115, 301, 5, -244, 133, 76, -159, 115, 18, -314, 101, 113, -145, 107, 9, -212, -1, 168, -128, 51, 122, -170, -10, 212, -75, 30, 196, -175]
2724a75J76J85k42L5K23l13J07J90k19l0J93k34j0L64k80j56K20j36m4K97j35
2745A6k88M14j69j54L00o7k65K89J8k12K64l7l27K47Q2j64J15J09l30J00K29k44
2767g4J04P8k68R5K04j91j5J16j59jK26j38m7J72j69o7L16r7k42K22j6j84K28
2790I3K6k27J28k1q2J57l1j46J08k3r2J78J6k50J63O8j19Q8J1j90Q9J69q5j11
2814h3J64k00O4J45r9P1N2j62M1J24j45K3Q7j64M2J25o8j11J65j34QJ51j04p6
2838h4J04p3o8J49kk8J00q7q6J86m5j98J32O6j67J49M4j81P7J48k36J66L0j80
2862h4P7J01j57N3R5j90P7N2j16J18j7q7K3J03n9K5J04k13N6P4o6P9Qj71N7J57
2888I9r2k7Q1n4p6J85j01j01J06n1p0J82o5r4Q9l7j40K19k9j28J51l3p0J01qo8
$$ y = [-175, 1, 186, -56, -21, 202, -111, -4, 186, -33, -63, 130, -104, -114, 250, -30, -186, 34, -102, -146, 151, 16, -272, 142, -27, -181, 119, 52, -213, 76, 94, -118, 146, 109, -218, 29, 111, -53, 62, 171, -159, -59, 170, -74, 30, 108, -160, -65, 139, -52, -67, 49, -110, -111, 115, -23, -70, 102, -67, -134, 182, 85, -157, 65, 49, -135, 93, 119, -108, 20, -1, -83, 74, 43, -103, 5, -18, -110, 68, 84, -166, -3, 65, -54, 34, 45, -145, -56, 113, 28, -83, 81, -119, -55, 90, -9, 62, 114, -48, -7, 117, -28, -5, 82, -82, -40, 85, 17, -94, 71, -63, -55, 96, -8, -84, 20, -53, -121, 28, 26, -2, 98, 11, -75, 111, 66, -132, 0, 66, -101, 48, 92, -89, -12, 136, -100, 66, 96, -84, -7, 94, -63, -10, 85, -105, -28, 24, -92, 26, 9, -78, -55, 48, -11, 14, 118, -95, -39, 35, -31, 48, 56, -115, -58, 99, 7, -20, 61, 7, -69, 116, 15, -86, 20, -31, -101, 81, 16, -78, 11, -26, -166, 53, 24, -104, 47, 14, -56, 45, 37, -31]
2914c1L6N5j03Q8j5m8K9J7n9N8N0j70R8nj4j7J23j58j6P1m4jJ07j45M1O8L6j8
2942C3L7m4p3P8j2L9jp2M9l7N3l4j5LK5p4N7N5j13RmL3l3K0J9n2P2Np4R0mr1R3
2975C7Rj25J46M5j58Q0J02j50N1K0j62N6J38j21P8L0j47L3O1r5L8R8q5l8J39j30
3001e0mR7j27O3J84j97j04K31n7j13K02p8r6J06k9r9J20Mj47J39J0j25P3P9j98
3026a16R8Q0j57J21M5j83N1N2q0Q9Q5j25r5K11j58J1K22k17J5J47o9j0P0j13j7
3051d3J38n8r4J80o8j64K18j08r0J73q4j37J50L7q8O5J4j97J59O7j59J47mj06
3075e2M0R1j41QQ6p5J0J30q1o7J42j41QO7l6rP3r1MQ3p6k5O1PK7J0p4oJ51j25
3105aJ5N2rj04R3m8n3J24l5j21J93n8j08P3J8q1P8K0j28M1J11j25L3R8k02P8M7
$$ y = [-31, 5, 60, -43, 45, 30, -18, 11, 28, -31, 27, 77, -93, 5, 0, -14, -31, 92, -66, -82, -11, -55, -56, 51, -94, -53, 15, 51, 33, 70, 26, -47, 31, 19, 58, 57, -15, 34, -3, 50, 16, 1, 4, 29, -45, 12, 67, -46, -37, -41, -8, -41, -21, -2, -54, 18, 23, -51, 39, 35, -56, 37, 46, -79, 67, 112, -46, 34, 136, -14, 37, 57, -105, -49, 89, -32, 46, 76, -71, -38, 23, -72, -34, 64, -21, -59, 80, -50, -54, 43, -84, -21, 163, -34, -138, 93, 36, -77, 125, 47, -49, 57, 28, -71, 49, 53, -94, 45, 55, -70, 3, 82, -116, -18, 62, -95, 26, 71, -112, -61, -9, -89, 0, 85, -40, -135, 76, -82, -71, 151, -66, -51, 96, 27, 17, 87, -26, -43, 95, 37, -57, 123, 55, -109, 109, 1, -89, 84, 0, -137, 13, 50, -38, 27, 41, -156, 3, 70, -89, 58, 54, -52, -12, 79, -62, -54, 32, -43, -33, 97, 16, -51, 91, -50, -42, 25, -11, -20, 53, -38, -34, 49, -27, -52, 9, 16, 43, 53, -21, -27, 124, -1, 14, 66, 57, -47, 46, -2, -55, 69, 34, -87, 106, 48, -60, 13, 31, -50, 28, 48, -80, -39, 72, -53, -20, 78, -124, -46, 1]
3132Ao6M7J05p9k5N1m4J8P1j31P0P3o5K0K2o1m1N8J0o3N0m1k9N8m3lQ0k3o8qP1
3163A5J7r6RN8J0K3o9jMM4O1n6j5Pm0M0L8j6l8M5o1j2M7L0ro2MK1Kk0L7l9MN2
3197C4m5l9Q7n8l2J60n1j39Q6L5j14J04M6p1k1O3r3Q7J4o4J3Lq1R4J3l8k3K1K8
3226A9n1N9m9k9R1j5o7J00k2q6J42r8k5J54j15o4J08m0n3Q8K6j71J22L8j20L3
3252b5N9p6JR2j29L2Q1q9R2K1j16J6J28j28ON8m6m0J74r9m2J26j29kP3k6kN7q4
3281a7n5J38m3o3J1n6oJ17l5p5O9mr1J28N4r3J7K6k0L8J7j23K3P4n8L5R3n3q8
3310d0R3l3N2m3p0jP5J0r4P7l5j11J12km1N3or0P6O5p8J13l5r5N3K9n3M0J9r6
3340e6O7O3r1l8Q6p4M2L7p6M4J9q3j9Q3Jr4Q7J5p0J58o9j28J02Pm7P8k0j24J59
$$ y = [1, -65, -18, 87, 8, -17, 34, -10, 8, 79, -52, 18, 91, 26, 46, 68, 7, -34, 24, 34, -29, 21, -20, -49, 9, -34, -37, 43, 20, -48, -56, 15, 32, -64, -55, 3, 13, 36, -33, -34, -30, 14, 75, 19, 4, 11, -29, 11, 49, 33, -5, 40, -21, -33, 14, 44, 35, -27, -23, -2, 0, -20, 17, -22, -18, 34, -11, -50, 37, -21, -53, 107, 56, -83, 3, 38, -76, 28, 74, 3, -18, 45, -48, 39, 53, -11, 2, 5, -76, 18, 31, -7, -30, -9, 19, -32, 27, -22, -51, 40, 25, -42, 58, 36, -50, 92, -6, -31, 123, 8, -56, 52, 12, -41, 47, 73, -98, 24, 62, -58, -25, 34, -42, -41, 51, -78, -46, 35, -54, 38, 59, -57, -41, 87, -41, -35, 23, -23, -63, 111, 12, -30, 96, -33, -35, 38, 12, 10, 67, -17, -72, 66, 23, -40, -29, -85, -91, 26, -9, -84, -15, -19, -110, 18, 72, -21, -4, 22, 2, 40, 57, -66, -43, 31, -27, 8, 101, 48, -40, 53, 20, 72, 29, -41, -42, 33, 43, -51, 26, -9, -120, -8, -10, -51, 2, -4, -94, -18, 47, -31, 82, 47, -48, 5, 34, -19, 21, 40, -56, 11, 74, -17, -55, 31, -43, -1, 36, -40, 4, 23, -60, -79, 4, 5, -89, -2, 13, -57, 101, 32, -96, 6, 13, -34, 44, 24, -100, 59]
3369E9j04PO4J4n8Q0jr5J4N6j15K3Q7o7L6Q4j34m6J53p1K0J8n6J5R2o5q0P2jp2
3399g1J51Nj55J67m6j25J68q0o1N1j2j15J12J2j20J76%j06J10Mj31P9Rj51Q3O1
3425A5p6K3J04p5P4Oo6j2K7l7J4O7m2m1Q0r6OP4p6m7Q5j6j7O6m4p7R0k2n6R3j3
3456A1q1N8K2p0Q3Nq2Q7lr2Q8M9j41P7L2j36J61jo9m0Q4l6k5P4k6q3M9j3j0P0
3486D2m8k8M8o1M2K6k4j2P6l7o1N3j9r9J21j3p0R1j2m2N9m5l4Q5n2M9m7M6l2k3
3516b1l7J9M6L2Pr6P2l0N2n9N0n3J8kPqj7l5M7lj7Q5q3N0l8L4j5Mjm9P3o7l6Q8
3550A7j6n8P2K3n9j3R1j3l5M9o9K7Rl0L6j3K2lnlqK7p1n2J44l2m3L8nm7j6O1l6
3583a1K4J5n5M2J4%k0m8j4K8R0%p2M1k6OK1m1O6p8L2ojM5k1n5J0rL1N9j20O7j
$$ y = [59, -45, -38, 26, 40, -18, 62, 61, -34, -20, 36, -79, -56, 31, -36, 0, 84, -50, -96, 57, -14, 6, 24, -32, -17, 75, 10, -70, 2, 1, -71, 80, 85, -70, 97, 51, -74, 94, 14, -47, 4, -8, -123, -11, 1, -119, 57, 57, -49, 61, 65, -66, 13, 22, -129, -46, 15, -61, -38, 66, -9, 65, 71, 5, -7, 20, -17, -3, 64, 22, -19, 61, -35, -29, 45, -31, -78, 7, -9, -26, 40, -4, -81, 9, -13, -69, 24, 11, -70, -12, 10, -60, 23, 28, -54, 33, 30, -62, 26, 75, -66, 11, 43, -93, 68, 67, -2, -42, 42, 6, -19, 55, 29, -54, -5, -18, -28, 42, -6, -34, 14, -47, -5, 21, -3, -15, 61, 24, -37, 16, -3, -102, 19, 6, -64, 27, 15, -27, 32, -13, -47, 38, -14, 35, -12, 34, 2, -21, -58, -39, 7, 39, 46, -50, 22, -8, 44, -15, 35, -18, 0, -2, 5, -3, -20, -55, -8, -11, -28, 57, -26, 24, -14, 20, 5, 9, 8, -41, 32, -35, -71, 17, 1, -57, 15, 38, -21, -34, 57, 44, 9, 58, -11, 16, 25, -5, 31, 18, 40, 37, 32, 29, 21, 48, -23, -75, 69, 37, -6, 32, 27, -20, -36, 25, -11, 13, 28, -27, 15, 29, 29, 9, -39, -53, -25, 65, 65, -7, 34, 8, 14, 35, -6, 60, -18, 14, 8, 7, 52, 31, -24, -14, -23, 8, 67, -53, 14, 13]
3616A3l0P5o4Mk8Q6q5K5L6k9JK0L2m0L7lm4j8L7j4k4L7k0n0O4m4P3r0J3O5k2o3
3648e0M5M0o1L4L3o0L4qnj4j7L4Qj3j6l8J50r8n2Q8q5j4N3N0m1O5o2k2Q8l6j07
3679g7O4K8m6M5N4j70J09rm4R5L7j15N3Km0L3Jr1N3R6j49J20k0j15O4K6j9K2O9
3708G6o2p0P1%n3R9n7n0Q3K2r0L4Mj2N5m4K1Lj8k2P2L8j36L8J9o2M5N7p3j9P4
3739D3p2L2pj7%K0krOk7M1lo1k9J04p8N1N4l7J5N9n3n8M2J4r7P9L4o3k2O3p2R0
3772D0o1K4J6KJ2j7l2l8M7K5l2n3J03k1Mk9L0m7k0K7j0O2qp0Q5K2m9ml2M3j6k1
3804a8L9K5k2n0J5K2n3J9J9l6L6jJ6L3p0L9K0k9k1oK7%rK8k3L4n6PKmJ9o3N2k5
3838c4M9j4q9R4J9q3J3O8j5K7Lm0M0p2L9M3pp3P0K8n9J7J3n6K7km2K3J04o2m5
$$ y = [13, -17, 58, -6, -2, -30, 56, -29, -4, 32, 3, 4, 24, 56, 16, 53, 50, 6, -12, 25, 11, -13, 24, 4, -46, 18, -26, 47, -43, -30, 35, 13, -50, -5, 35, -26, 8, 41, -19, 15, 7, 2, -12, -29, 5, 13, 0, -16, -54, 96, -2, -54, 34, -51, -65, -12, 38, -3, 62, 0, -22, 66, 30, -77, -13, 15, -31, 14, 68, -102, 7, -2, -46, 49, 86, -29, 24, 26, -14, 19, 20, -71, -18, 78, -71, 49, 29, -86, -22, 4, -15, 7, 76, 14, -56, 15, 15, -38, 61, 4, -46, 37, 59, -31, 3, 7, -5, 50, 6, 27, 30, 12, -10, 62, 100, -36, 2, 21, -41, 4, 61, -12, -31, 43, -29, 3, -4, -21, -21, -1, -3, -12, -6, -33, 8, 5, -56, -85, 19, -59, -8, 46, 9, 24, 83, 30, -28, 14, 28, -69, 10, 44, -19, -41, 22, -50, 40, -21, 3, 19, 21, 33, 16, -16, -54, -7, 18, -14, -67, 36, 15, 19, -10, 20, -27, -47, -20, -30, 32, 24, -46, 39, 61, 12, 8, -24, 19, 3, -18, 21, 46, 24, -26, -11, 11, -42, -23, -4, -40, -4, -5, 11, 44, -26, 13, 33, 4, -17, -23, 4, 4, -5, 23, 0, 34, -22, -15, -13, -17, 2, -61, -9, -34, 15, 1, -88, 6, 25, -58, -45, 23, 8, 35, 38, -2, 38, -34, 5, 48, 41, -32, 38, 66, 7, 24, 37, -19, 8, 6, -36, -13, 91, 29, -16]
3869a6N0l3k0OK7l6%lK8O0r2J7L5l4QN4m6NJ9l2l7M9kJQQpLl6J1oM0q2J02q0L8
3905GPk2k7J4N6l2om3J0K9K8l8k1P5l3M3l0j5lK2M6l9r9J10Oq1O1l1l0O1j8rK6
3938B4l1J9lj1J5j9M3l2M8p7J7N9k5m2J0OK4o9n0J01J3L8r3N0J4k4J5nq0L0J1
3969b4O1l1k0l4K6O0l5J5j9k8K1%rLM5o9J9J8O9q8JJN5M1j03O4o5K5n0J9M5l2
4001a9K5J6m3J5%j2nL7l6RR1o9l7M8k1q2R1J3q7R8p2j4N5Pn5O6K8j04K4L6l1L0
4033Bk6j4QP2l9n5P7j1j9M2j04L9k2L2M9k2k1Nk8M3J5M2o7NP0j00K0J8k9m4O8
4064FM4j9j5j9j9N1m1K6k8j4M6oJ9o2L0K2n7O6o7M0K4k4Mj5J9k7K5l4L5j2K2j02
4096h2L3K8Jj6Q8p2l4L7j7M8K2k5J9j7l5K6L5j0o5Q2n3J3l6R4n9NM2m5jj9mOl
$$ y = [-16, 34, 1, -19, -13, 14, -22, -22, -25, 3, 63, -29, -12, 23, -11, -3, 51, 5, 10, 29, -3, -40, 9, 7, 8, 16, 24, 17, 20, -16, -5, -11, 29, -53, 49, -31, 7, 14, -8, -35, -21, 35, 3, -3, -46, -36, -7, 21, -17, -38, 37, 4, 47, 17, 2, -1, 21, 67, 28, -71, 39, 45, -36, 25, -6, -36, 25, 7, -2, 24, -7, 12, 9, -2, 13, -6, 37, 5, 53, -24, -7, 52, 27, -15, -5, 1, 25, -44, -94, 7, 20, 58, -35, 15, 29, 5, 20, 15, -65, -35, -24, 37, 6, -14, -48, -22, 38, 3, 18, -1, -29, -8, -8, -17, -14, 31, -38, -19, -1, 68, -20, -19, -18, 37, 78, -25, 39, -26, -1, -51, -32, 13, -19, 6, 22, -21, -6, -6, -18, -23, 14, -22, -13, 78, 9, -28, 20, -1, -83, 8, 21, -66, 32, -40, -54, 1, 8, -47, 19, 47, -57, -33, 3, -28, 2, -24, -38, -30, 42, 3, -52, 25, 14, -5, 37, -67, -28, -50, -18, 31, 9, -12, -7, -35, 8, 23, 65, -2, 3, 73, -27, -7, 11, -18, -62, 6, 50, 31, 16, -3, -22, 29, -12, 14, -14, -28, 18, 12, 31, -31, -1, 21, -36, 30, -37, 3, 27, 3, 7, -8, 11, -16, 9, -25, 10, -2, 20, -82, -49, -21, -20, -36, 52, -20, -54, -17, -34, 14, 36, 11, 30, 13, -22, 4, 39, 29, -36, 46, -7, 6, -30, 64, 5, 10, 52, 7, 6, -13, -17, -11, -14]
4129a4j6J5L4Ln6M8k5PmL3rl3K8j0rK4k9P4l3o6J8M8J4l3J2j5K8m1K8n4K2LK4
4162A6m0kM2L2n4L1j2l1l3N7oJN1p3N0Pp3M7oKK4n6l6O2J8k0J7m0nM7nm2L0J2
4196A2pj1n2J5O4l5pL9l8L5k0M1l4l2M5j9k4nK7%l1N5j3P4j01qRj8J3K9j7K4L
4229A3j2m8K7j8N2k5MnJ0M3m0L1m1nK5m8L0L6n6N4j2jl0K3k3m0N2N8Kpo2j6K2
4262gjo4O4j1JN2k5j0L8k5j2j5J0L0O2n1m8O9l6k3j0O1m3j6K0l9L0qk1O8k6l8
4294b4j0M4K0l7P2r7M8K9o6KM4l8K0K4k6l5M1k3k4Q0n0k6N6n9L3rM9j18J33p6
4324b3j8N9O0p9qK5j6NL1p9O7Pl6Nj0L6k9M8j05P6M1p2kP9q1lL9k3p3J05n5J6
4356a3N9j6o9L8Pl6J10q8m4O6k4L6M7p9j3K6N5j10OJ10p2M3Ro8j0N5o7j8R2q5
$$ y = [-14, -30, -15, 19, 22, -34, 14, -11, -4, -8, 25, 16, -17, 11, 1, -8, 16, -13, 61, 28, -38, -20, 28, 42, 9, 21, 6, 34, -7, 21, -33, -11, -8, 16, -24, -26, 16, 48, -6, 25, 13, -18, -51, 6, 0, 1, 52, -21, 29, 36, -37, 10, 4, 6, 30, -26, -62, 0, 18, -2, 15, -25, -30, 17, 12, -30, 0, 12, 5, -6, -58, -43, 21, -14, -21, 18, -20, 15, -5, 36, 2, -30, 15, -4, -28, -33, -6, -6, -37, 18, 5, 79, -22, -30, -21, -39, -26, 3, -14, 10, 13, 1, -47, -20, -38, 14, -11, -7, -12, -2, 41, 1, 32, -9, -14, 11, -37, -7, 29, -27, 27, 15, 14, -16, 7, -16, -56, -4, 54, 56, 49, -13, -29, -7, -8, -72, -8, -19, -18, 34, 9, -1, 37, 12, 0, -15, -5, 25, 87, 36, -12, 57, 21, -2, -12, 49, 6, -10, 10, -29, 1, -7, -28, 40, 14, -24, -34, 10, 30, -7, 65, -32, 16, 45, -21, -19, 25, -13, 7, 31, 5, -30, 11, -12, -36, 44, -6, -32, 24, -35, -2, -11, 38, -80, 53, -23, -41, 18, 78, -1, -9, 16, 0, 5, 36, -43, 24, 31, -5, 0, -10, 26, -3, 45, -60, 16, 57, -15, -17, 62, -19, -22, 17, -6, -79, 26, -29, -13, 46, 30, -39, -1, 6, -30, 80, -8, -52, 14, -10, 26, 73, -6, -19, 7, 62, -48, -42, 68, -4, 39, 48, -20, -30, 25, -42, -60, 32, -53]
4386e3OQ0m7j1mMj9Q4n9M2r6O8k6M8J1JM9m2r9P8K5j10N1Q3r9P0N4j76J08oJ5
4417C0n2L4n5O2qp%K6m3J7K5q9J7M7jlK7n9K6K3j0Mj2M6m1j8M4m9P3l8K0p5K2
4450a7m7J9Q2j28J06ml6j5P4n0O0oo3LN4j4k6L8rjJ9j5m9O9Kq7K2j5L1J4%k1p
4483a7O9l8Mj5n9N8k1J4k8M8n1K0M2l6r7J48l3k1O6o3MlJ8rL8o4J2L4lj2l5L4
4515Dpj4O1p3KM6Mj8pNn9J23j05KO5nj1j6QqJ7K5pj3k4j9j2M7l2N9o7K9k4M7o2
4550c9NQ0j16P4m2O1qk9Mj2M0l2%L5k0J7Nk9J1QN0q1K2l6K2opK5jM9q6M8Qm8O
4585b2N4l5k5N5l7K2K1m4j6P3m2K6PKq1M8K4J0l3o3K4M1mrO4m3m1RM7k4O6j21
4617d7j7N7J8p8N8K7j05R8Qk5l7Q2j0p8M4nJ5K1o6M0lJ0p7Q3l7j3O2Nm7j2P8q6
$$ y = [-53, -47, 33, -14, -25, -29, -25, -44, 40, -19, 23, -73, -5, -31, 17, 28, 29, 78, 36, -63, 15, 40, -70, -19, 64, -35, 35, 89, -87, 21, 15, 30, -22, 12, -43, 19, 11, 4, 4, 30, -13, 4, 29, -60, -43, 4, 3, 0, 27, -32, -6, 17, 7, 11, -1, 45, 4, -14, 30, -19, 54, 16, 36, -39, -17, -64, -45, 37, -91, 15, 11, -25, -40, 34, -16, 44, 38, -25, -22, 32, 18, -8, 30, 21, 20, 39, 24, -25, 44, 46, -41, -19, -34, -3, 11, 11, -10, -17, 52, 14, 18, 3, -56, 2, -19, -5, -33, 15, -36, -16, 26, -10, -107, 41, 8, -13, 53, -10, -6, -9, 9, 0, 38, -26, -14, 20, 17, 5, -30, 4, -3, -17, 44, -29, -27, 19, 23, 5, -2, 3, -56, 67, -38, -36, 29, 24, 13, -3, 5, -3, 14, 39, 32, 19, -5, -24, -36, 11, -21, 38, -29, 0, -24, 23, -39, -34, 46, -70, 4, -38, 23, 15, -14, -10, -22, 18, -14, -14, 21, 1, 18, 23, -6, 5, 13, 63, -18, 4, -32, -10, -16, -23, 2, 1, 50, -36, 12, 20, -28, -22, 32, -3, -28, 27, -10, 12, 33, -11, -27, 46, 4, 30, 37, 39, -42, 6, 30, 40, 7, -56, -32, 9, 5, -4, 60, 17, -24, -15, 32, 8, 74, -47, -64, -7, 11, -67, -9, 18, -87, 11, 19, -6, -43, 39, 29, -49, -5, -10, 5, 26, -40, 0, -3, 7, -70, 13, -24, -37, 25, 30, -17, -29, 49, -37]
4649c7N7lm7O7jn9m3J04n0O7o1m4N8m1K8L3Qm3l0P4r4M3L3r0N2JM3nk5rJ4N2l6
4682A6NL3n3m0O8J0m6K1Ml8OM4n3M1ll2K1J8l2K5N3l8j9k3j9N7Pn1k8P4m8L8l
4715A5n1M6j9l2L8Qrl0O5o8M6j2L5n7J8J8j4N5q8J7N4k9j1K3k3k2L7qk1kPNrl2
4749e0N0j9k0%K9j0j8J5L6n5L1jJ8Nl4j2rL8K6poj6k9M4K1k0m2%O6rol5O9o3K
4784a1M0l5J3L3k8l8J9k2Q8j2m7j0M6n9K2L7lk4m0M7n6j5L9k6N6j1q1R9l5n2P4
4815Hk7kMM9pl3K4k8L2n6M8j5k4L2l0Q4q8QK5O8q8O0o7J2LM7n6O2l8m4j3nM7J0
4849Bj1j6N5j1n5lQ4n1O8p0j1M3Qkk2JL0p9N0l6N9j0kk5n9J9P4k2l0L5Ro9R2m0
4883Ek7M2NKJ6l7K3k9O1n9L8j19P0L0j1L3K1j07P0l4KJm0L2j4ML3m6R0mn0K6R
$$ y = [-37, 20, 17, -30, 37, 36, -23, -66, 38, -12, 55, -6, -50, 8, -33, -5, 28, 36, -7, -37, 37, -57, -14, 19, -71, -19, -18, 25, 20, -5, -14, 0, 52, 16, 21, 54, 1, -39, 29, 39, -7, 14, 18, -20, -14, 30, -23, 18, 15, -17, 4, 22, -10, 15, 68, 30, 11, -12, -31, 26, 33, -18, -46, 28, -20, 18, 15, -36, 10, -9, -41, -3, 5, -4, -34, 31, -37, 9, -3, 32, -25, -7, 11, -3, 52, -36, -19, 35, 6, -5, 18, -5, -27, 10, 2, -19, -21, -14, -9, -18, -50, 0, -19, -39, -39, -10, -20, -38, -23, 13, -42, -11, -12, 6, 11, -23, -35, -44, -6, 20, 13, 7, -9, -38, 6, 27, 7, -35, -35, 31, 22, 16, -19, 50, -13, -11, 29, -6, 7, 40, 12, -26, -7, -29, 59, 47, 0, -10, 36, -23, -1, 36, 33, 9, -31, 16, -40, -55, -16, -42, 14, 3, -78, 21, -14, -66, 8, -19, -21, -17, 32, 25, -8, 16, -12, 20, -36, 12, -3, -27, 5, -25, 59, -29, -21, 4, 72, -16, 44, -23, -11, -8, 39, -17, 45, 7, -37, -50, -55, -8, 2, -9, -25, 30, 19, -36, -39, 45, -6, 62, -8, -19, 24, 32, 30, 8, 9, 39, -40, 10, -26, 33, 23, 21, -4, -63, -44, 30, 8, -22, 13, 22, -47, 45, 5, -22, 20, 25, 27, 43, 6, 29, 0, 61, 2, 40, -79, -9, 21, 10, 43, 64, -43, 27, -7, -5, -4, -44, -12, -26, -22, 11, -35, 55, 51, 1, 27, 36]
4916C6j8j4L3p1N1l2QL7k3k6%k4O5l7Nj5O6Kj9k6m6O4K5q5J9K7L4n7J4O8p0%p
4949a6l3O7L3n6l1qR6j11P0J3n9N9j8j1jK6nkk7J8K0n5K1oL6n1J5N1o9O1M6m2
4981C1M3p5RO4p3nK1J3l2L7Pj2k2L3k7k4m6N8M5p1l4J1P5o3K0j7J8oP1p1pQ2q2
5014b9j4KQ8o1N6n9K0J1Pn4M0k1k4P9p0K8J6j9j5L9K9m6J1K3m3l0M6o6K2J7O6
5045D9o2L9j5mN3o5L9k3k9Kj2K2K6m8O1k9o0O5qK1pJ1l1l0N0PK7o7j0O0o5L1l8
5078d0P1Nk5J1j4Ql3N3k9K8o5N8j1j1oMJ5l2l4jK9PJ1m2M6l8K2J5K5K4n0j8N5
5111C8n9L6M2m9l3J8L5m4L7k0j9K0J6m4L1j4m5N5nq5J05J5n3mK6J8%j1k7O0l5
5142Ej8J9L3o1L2J5k0L3j7mk9K3j8OJ4m6K4M3k7m5O7k9J7L3o4j1PM2m8L0J1mN2
$$ y = [36, 18, 4, 37, -34, 17, -15, -7, 30, 7, -19, -19, -43, 22, -15, -10, -25, 41, 43, 24, -2, -48, 16, 41, -44, -25, 2, 36, -21, -7, 61, -9, -9, -16, -49, 18, 51, -5, -36, -44, 52, -59, 11, 24, -35, 24, 6, -5, -6, 20, 15, 13, -14, 4, 24, -31, -10, -16, 20, -31, -16, 35, -34, 27, 73, 31, 74, -1, 8, 72, -1, -6, 15, 28, -4, 33, 40, 28, 6, 39, 12, -12, -58, 0, 45, -26, -60, -49, 26, -37, -17, -34, -16, -22, 49, -22, -29, 53, -29, -43, -41, 47, -14, 42, -17, 3, 14, 21, -33, 7, -14, -38, 41, -29, -1, 15, -4, -19, 20, 49, 3, 14, 37, -6, -36, 10, -56, -34, -17, 49, -13, 26, 11, 7, 60, -5, 34, 11, -18, -16, -28, -6, 20, -28, 33, 4, -56, 9, 1, 22, 15, 26, -5, -35, 15, 22, 49, -18, -28, 32, -33, -2, -40, 31, 36, 11, 22, 8, 16, -17, 36, 7, 35, -30, 28, 17, 6, 0, 4, 19, -13, -47, -48, -19, -12, -1, -43, 3, -35, -13, 2, 27, 51, 1, -17, 38, -21, 15, 57, 8, -25, -7, 28, -16, 21, 1, -18, 2, 18, -26, 5, -9, -54, 1, -4, -89, 16, 31, -22, -26, 0, 18, 18, 7, -20, 40, 5, -13, 6, 39, -22, 10, 25, 5, 38, 21, 17, -12, 11, -7, -1, 13, -33, -9, 34, 7, -38, 29, 0, 17, 50, -14, -25, -18, 24, -24, 6, 17, 13, 65]
5175F5p0KL8L1p6N1Pq6M0L7k9J3Kj0L0q0RQM0qk2l3K4OnM2m9M2Ol1qKPj6N6n0
5211a5K3QJ5q2Q6j13Q6K8p9Q5m5jO3q1N7l2J5l4L6k7N3k1l2M4l9J7k0PJ0j9K5
5242A8M1kj3o3J7N2j9o7JP8m2k6l0J5J00k2p2J3NL2Pm9M1l9j9M6l0K1K5m3K1L6
5274C3l7K1nj4kM1%j1l4Lm0J1K5M0q1O9M0n4j0J2j4jk1lj1M7K7o1l8R5o0N3l4
5307a4oM2N0q0N9m1kj8L8o3O8j1N1n0n2M8k9j2K5L9r9M6J2M0p6N7j8m1P2J7m0
5338A2J4n7K7p4O5k0J0J00n2Oj7j9K7l5n2P8rm4O1m0rP1o7L6l7K4o5Q0k1NM4k2
5370B0j1k1M3j3J2k5N2k1jm2n1Q9n2k2KJ5k5M7pm1Q6k7j5Kn1L3L0k7J8J1j1J5
5402A2Mm4O7j7n8J8K7Qk3P4l6n9J5l8K8l7P0j9mnM0n8rM1NO1n5J1l9N5n7K3k8
$$ y = [65, -5, -3, 35, 66, -10, 41, 48, -38, 2, 39, 10, 23, 25, 15, 45, -35, -26, -18, 22, 14, -8, -41, -17, -11, -16, 26, -23, 19, 25, -6, -14, -12, -5, -21, 35, -15, 8, 16, 31, -51, 35, -78, 8, 36, -43, 42, -3, -4, 59, -22, 35, 3, 18, -16, 20, -7, 46, 25, -7, 37, -2, 15, -5, 2, 12, -7, 18, 59, 57, 44, -19, -2, 50, 31, -36, -35, 43, 1, -25, -55, -40, 60, 38, -34, -21, -16, 16, 23, -26, 15, -24, -43, 3, -27, -6, 19, -24, -3, 33, -4, 17, 12, -2, -4, 37, 37, 26, -8, -5, -45, -34, -9, 31, -50, 19, 59, 5, -5, 7, -7, -8, -29, -32, -43, 4, 31, -30, -68, 27, -33, 20, -14, -20, 22, 72, -8, 51, 10, 8, -10, 28, -35, 33, 22, 73, 23, -29, 19, -10, -22, 3, 42, -57, -11, 1, 41, -35, 22, 4, -37, 35, 52, 12, 26, -31, -4, -78, -13, -33, -23, 77, 25, 31, 14, -5, 22, -13, -65, 13, 4, -40, 21, -19, -28, 43, -24, 12, -25, -1, -66, 14, -7, -2, 42, 20, 9, -12, 31, 18, 30, 5, 57, 36, 35, -7, -58, 31, -21, -43, -41, -26, -51, -4, -11, -52, 34, 7, -8, -6, -57, -24, 6, -21, -3, 8, -3, 12, 16, -28, 39, 22, -36, -18, 9, 17, -6, 68, 32, -27, -12, -50, -22, -59, 11, -8, -12, -17, 23, -35, -44, -3, 2, 63, 8, 19, -20, 35, -22, 1, -27]
5435b7M5J5k6j8%RK8k9qlJ9J4J3o7P2k0jml8l5N8JM6k7j4j3K6p4P2prjJ1o1P0
5470A7Nkj8J9L9m0j0oM3m3m7M1Ol8qM3j8L5j7J1k5L5J2m3L2o3P4k8M4k4n4J15
5502H7j02M3m5L9l3O9o5k0J2L9nj5Ql4M7J6nJ7p3l4O9m1qL9l7P7J5m9m2M3M8k5
5534C5j8j1k1L7j8k0J0J8j7OJ7k6N3o7L2o8J4j5Q7Pl0n1RM6k0j0Q7n9J1J8o1L3
$$ y = [-27, 18, 33, 7, -11, -11, -2, 26, -3, -11, -14, 5, 19, 32, -35, 37, 17, 16, 12, -26, -61, -3, -2, 44, 17, 3, -10, 16, -58, 14, 7, -2, -3, 8, -53, 17, 22, 20, 2, 21, 60, 20, 10, 4, 47, 4, -43, -2, 4, -34, -42, 1, -17, 18, 1, 12, -13, 22, 34, -9, 23, -40, 34, 6, 50, 26, -28, 87, -15, 28, -17, 22, -11, 58, -7, -27, -15, 24, 19, 4, 12, -22, 25, 41, 36, 53, -20, -54, 15, -26, -34, 5, -32, 45, 60, 11, -31, 12, 60, 35, 17, 6, -15, 22, 4, -16, -6, 12, -5, 1, 18, -8, 45, -22, 10, -58, -44, -59, 28, 35, 5, -46, -37, 9, -11, -21, 66, 7, 18, 36, -25, 8]
$$ [...]
8191G
##END NTUPLES=NMR FID
##END=
