##TITLE=1H_LR-758-R5-HS1
 CDCl3
 8 sc, 
 31.8.2023
##JCAMPDX= 6.0         $$ Bruker NMR JCAMP-DX V2.0
##DATA TYPE= NMR FID
##DATA CLASS= NTUPLES
##ORIGIN= UXNMR, Bruker Analytische Messtechnik GmbH
##OWNER= root
$$ XWIN-NMR		Version 3.5
$$ Thu Aug 31 14:56:28 2023 Russian Standard Time (UT+4h)  she@DPX200
##.OBSERVE FREQUENCY= 200.13135
##.OBSERVE NUCLEUS= ^1H
##.DELAY= (6, 6)
##.ACQUISITION MODE= SIMULTANEOUS
##.ACQUISITION SCHEME= undefined
##.AVERAGES= 8
##.DIGITISER RES= 18
##SPECTROMETER/DATA SYSTEM= spect
##.PULSE SEQUENCE= zg30
##.SOLVENT NAME= CDCl3
##.SHIFT REFERENCE= (INTERNAL, CDCl3, 0, 15.7039)
##AUDIT TRAIL= $$ (NUMBER, WHEN, WHO, WHERE, WHAT)
$$ ##TITLE= Audit trail, XWIN-NMR		Version 3.5
$$ ##JCAMPDX= 5.01
$$ ##ORIGIN= Bruker BioSpin GmbH
$$ ##OWNER= she
$$ F:/spectra/data/she/nmr/H-F/1/audita.txt
$$ ##AUDIT TRAIL=  $$ (NUMBER, WHEN, WHO, WHERE, WHAT)
(   1,<2023-08-31 14:55:24.06 +0400>,<she>,<DPX200>,
      <created by zg, POWCHK disabled, PULCHK disabled
       configuration hash MD5:
       00 E9 B6 7A A2 85 ED C7 34 08 36 98 17 FE 4E 26
       data hash MD5: 16K
       C4 BB A4 3B 5A 0B DA 4E 05 8D 87 C0 36 36 9C 88>)
$$ ##END=
$$ 
$$ hash MD5
$$ 20 C6 21 D5 CE 3C B0 C8 31 CA 79 B9 98 A3 1A B1
##$RELAX= 
##$RELAX= 
##$RELAX= 
##$RELAX= 
##$RELAX= 
##$RELAX= 
$$ Bruker specific parameters
$$ --------------------------
##$DU= <F:/spectra>
##$EXPNO= 1
##$NAME= <H-F>
##$PROCNO= 1
##$TYPE= <nmr>
##$USER= <she>
##$AMP= (0..31)
100 100 100 100 100 100 100 100 100 100 100 100 100 100 100 100 100 100 
100 100 100 100 100 100 100 100 100 100 100 100 100 100 
##$AQSEQ= 0
##$AQ_mod= 1
##$AUNM= <au_zg>
##$AUTOPOS= <>
##$BF1= 200.13
##$BF2= 200.13
##$BF3= 200.13
##$BF4= 200.13
##$BF5= 200.13
##$BF6= 200.13
##$BF7= 200.13
##$BF8= 200.13
##$BYTORDA= 1
##$CFDGTYP= 0
##$CFRGTYP= 5
##$CHEMSTR= <none>
##$CNST= (0..31)
1 1 145 1 1 1 1 1 1 1 1 1 1 1 1 1 1 1 1 1 1 1 1 1 1 1 1 1 1 1 1 1 
##$CPDPRG= <>
##$CPDPRG1= <>
##$CPDPRG2= <>
##$CPDPRG3= <>
##$CPDPRG4= <mlev>
##$CPDPRG5= <mlev>
##$CPDPRG6= <mlev>
##$CPDPRG7= <mlev>
##$CPDPRG8= <mlev>
##$CPDPRGB= <>
##$CPDPRGT= <>
##$D= (0..31)
0 1.2 0 0 0 0 0 0 0 0.06 0 0.03 0 0 0 0 0.0002 0 0 0 0 0 0 0 0 0 0 0 0 
0 0 0 
##$DATE= 1693479323
##$DBL= (0..7)
120 120 120 120 120 120 120 120 
##$DBP= (0..7)
150 150 150 150 150 150 150 150 
##$DBP07= 0
##$DBPNAM0= <>
##$DBPNAM1= <>
##$DBPNAM2= <>
##$DBPNAM3= <>
##$DBPNAM4= <>
##$DBPNAM5= <>
##$DBPNAM6= <>
##$DBPNAM7= <>
##$DBPOAL= (0..7)
0.5 0.5 0.5 0.5 0.5 0.5 0.5 0.5 
##$DBPOFFS= (0..7)
0 0 0 0 0 0 0 0 
##$DE= 6
##$DECBNUC= <off>
##$DECIM= 32
##$DECNUC= <off>
##$DECSTAT= 4
##$DIGMOD= 1
##$DIGTYP= 9
##$DL= (0..7)
0 120 120 120 120 120 120 120 
##$DP= (0..7)
150 150 150 150 150 150 150 150 
##$DP07= 0
##$DPNAME0= <>
##$DPNAME1= <>
##$DPNAME2= <>
##$DPNAME3= <>
##$DPNAME4= <>
##$DPNAME5= <>
##$DPNAME6= <>
##$DPNAME7= <>
##$DPOAL= (0..7)
0.5 0.5 0.5 0.5 0.5 0.5 0.5 0.5 
##$DPOFFS= (0..7)
0 0 0 0 0 0 0 0 
##$DQDMODE= 0
##$DR= 18
##$DS= 0
##$DSLIST= <SSSSSSSSSSSSSSS>
$$ [...]
##$SUBNAM2= <"">
##$SUBNAM3= <"">
##$SUBNAM4= <"">
##$SUBNAM5= <"">
##$SUBNAM6= <"">
##$SUBNAM7= <"">
##$SUBNAM8= <"">
##$SUBNAM9= <"">
##$SW= 18.05172834244
##$SWIBOX= (0..15)
0 0 2 0 0 0 0 0 0 0 0 0 0 0 0 0 
##$SW_h= 3612.71676300578
##$TD= 16384
##$TD0= 1
##$TE= 0
##$TE2= 300
##$TE3= 300
##$TEG= 300
##$TL= (0..7)
0 120 120 120 120 120 120 120 
##$TP= (0..7)
150 150 150 150 150 150 150 150 
##$TP07= 0
##$TPNAME0= <>
##$TPNAME1= <>
##$TPNAME2= <>
##$TPNAME3= <>
##$TPNAME4= <>
##$TPNAME5= <>
##$TPNAME6= <>
##$TPNAME7= <>
##$TPOAL= (0..7)
0.5 0.5 0.5 0.5 0.5 0.5 0.5 0.5 
##$TPOFFS= (0..7)
0 0 0 0 0 0 0 0 
##$TUNHIN= 0
##$TUNHOUT= 0
##$TUNXOUT= 0
##$USERA1= <user>
##$USERA2= <user>
##$USERA3= <user>
##$USERA4= <user>
##$USERA5= <user>
##$V9= 5
##$VALIST= <valist>
##$VCLIST= <CCCCCCCCCCCCCCC>
##$VD= 0
##$VDLIST= <DDDDDDDDDDDDDDD>
##$VPLIST= <PPPPPPPPPPPPPPP>
##$VTLIST= <TTTTTTTTTTTTTTT>
##$WBST= 1024
##$WBSW= 4
##$XGAIN= (0..3)
0 0 0 0 
##$XL= 0
##$YL= 0
##$YMAX_a= 299173
##$YMIN_a= -338477
##$ZGOPTNS= <>
##$ZL1= 120
##$ZL2= 120
##$ZL3= 120
##$ZL4= 120
##$ABSF1= 10
##$ABSF2= 0
##$ABSG= 5
##$ABSL= 3
##$ALPHA= 0
##$AQORDER= 0
##$ASSFAC= 0
##$ASSFACI= 0
##$ASSFACX= 0
##$ASSWID= 0
##$AUNMP= <proc_1d>
##$AZFE= 0.1
##$AZFW= 0.1
##$BCFW= 1
##$BC_mod= 2
##$BYTORDP= 1
##$COROFFS= 0
##$CY= 11.3945322036743
##$DATMOD= 1
##$DC= 2
##$DFILT= <>
##$DTYPP= 0
##$F1P= 15.7292609196834
##$F2P= 12.9074282941183
##$FCOR= 0.5
##$FTSIZE= 0
##$FT_mod= 4
##$GAMMA= 1
##$GB= 0.15
##$INTBC= 1
##$INTSCL= 1
##$ISEN= 128
##$LB= 0.24
##$LEV0= 0
##$LPBIN= 0
##$MAXI= 10000
##$MC2= 0
##$MEAN= 0
##$ME_mod= 0
##$MI= 1.114404
##$NCOEF= 0
##$NC_proc= 0
##$NLEV= 6
##$NOISF1= 3.799351
##$NOISF2= 2.8
##$NSP= 1
##$NTH_PI= 0
##$NZP= 0
##$OFFSET= 15.70392
##$PC= 1
##$PHC0= -21206.21
##$PHC1= 12.05272
##$PH_mod= 1
##$PKNL= yes
##$PPARMOD= 0
##$PSCAL= 0
##$PSIGN= 0
##$REVERSE= no
##$SF= 200.130013532006
##$SI= 16384
##$SIGF1= 3
##$SIGF2= 2
##$SINO= 400
##$SIOLD= 16384
##$SREGLST= <1H.CDCl3>
##$SSB= 0
##$STSI= 0
##$STSR= 0
##$SW_p= 3612.71676300578
##$SYMM= 0
##$S_DEV= 0
##$TDeff= 0
##$TDoff= 0
##$TI= <>
##$TILT= no
##$TM1= 0
##$TM2= 0
##$TOPLEV= 0
##$USERP1= <user>
##$USERP2= <user>
##$USERP3= <user>
##$USERP4= <user>
##$USERP5= <user>
##$WDW= 1
##$XDIM= 8192
##$YMAX_p= 0
##$YMIN_p= 0
$$ End of Bruker specific parameters
$$ ---------------------------------
##NTUPLES= NMR FID
##VAR_NAME=  TIME,          FID/REAL,        FID/IMAG
##SYMBOL=    X,             R,               I
##VAR_TYPE=  INDEPENDENT,   DEPENDENT,       DEPENDENT
##VAR_FORM=  AFFN,          ASDF,            ASDF
##VAR_DIM=   8192,          8192,            8192
##UNITS=     SECONDS,       ARBITRARY UNITS, ARBITRARY UNITS
##FACTOR=    0.0002768,     1,               1
##FIRST=     0,             0,               0
##LAST=      2.2672688,     0,               0
##MIN=       0,             -338477,         0
##MAX=       2.2672688,     299173,          0
$$ Real data points
##PAGE= N=1
##DATA TABLE= (X++(R..R)), XYDATA
0@%%%%%%%%%%%Qj6J6j6K4l2M0m8N6p2Q8j04J20j40J64j92K24k56K92l32L77m30
33b29M89n52O20o97P81q72R71j081J203j333J474j631J802j987K192k416K660
50A394k928L226l559L928m341M805n332N941o649P482q483R710j1255J3269j6007
65h799J9956k6163L7305o3023K17752L5008n50513M08437J23267m39035K51095
76E287K63228m39915O5538K85527k55320j8515K56172j75316q3199J35638o4102
87b4977K5357R4950j52733O698J06282j02867N2231J00185j83723K1952J54728
98I8083j49781N820J74057j66643n7501J82426j05560m0928J84662j46095j08705
109a30165K22599o2658j28941J94076o2696j77460K02904K4500j91833J47747
$$ y = [0, 0, 0, 0, 0, 0, 0, 0, 0, 0, 0, 0, 8, -8, 8, -8, 16, -16, 24, -24, 32, -40, 48, -56, 64, -76, 88, -104, 120, -136, 156, -176, 201, -229, 260, -292, 328, -369, 412, -460, 511, -570, 633, -700, 774, -857, 945, -1042, 1150, -1266, 1394, -1534, 1692, -1867, 2061, -2280, 2525, -2807, 3134, -3515, 3967, -4516, 5194, -6061, 7208, -8799, 11157, -15006, 22299, -40724, 177028, 212036, -338477, 69960, 193227, -245808, 5287, 268515, -171400, -105862, 179665, -75655, -94170, 162002, -13314, -96513, 39125, -24977, 380, 95330, -57403, -50705, 55577, -47290, 4941, 105126, -78597, -56645, 98083, -51698, -45878, 128179, -38464, -95965, 86461, -19099, -60027, 124635, -21460, -130165, 92434, 29776, -99165, 94911, 32215, -145245, 57659, 82159, -109674, 38073]
119C8073N0417k09074J03951J22203j57345L5775Q6430j38152L3754J15178r9698
130a8488l553O5266r1095K7966Q6697r3557P979P4192j06960J3284J21205r6784
142a3848l5579J09093q2569m1364J39850n4450r3354J07539j6782q3182J04448
153C9802N275j05878O6609K8499q2440O1718L7868r4523K8342N0982o5422K7395
165a773M9529p6763J956O1900m7268j704N2566n2042j8102N7751k6385j6742M5379
178B8302l3107k5930M9779j3217k2271L8834k3490k9741M8932o114l3228L9052
190A7801r572m1341M5131J0523m5845K9780J2502m8072K7840L0906m5450P961
202g836K8814l8395O205L8116l2571r790L1467k2987p131L4498j9505j7537K7861
$$ y = [38073, 88490, -120584, -16633, 105570, -51775, -16000, 70430, -67722, -33968, 81210, -18488, -22041, 43225, -47870, -19904, 66793, -26764, -18785, 55407, -51553, -38269, 82936, -13848, -49427, 59666, -22903, -64267, 75583, 21133, -72221, 35318, 18536, -64646, 39802, 45077, -60801, 5808, 34307, -48133, 13585, 51453, -43070, -14728, 36254, -29168, -1773, 47756, -29007, -27051, 34849, -12419, -14123, 38443, -13599, -31701, 26050, -335, -17077, 28302, -4805, -30735, 19044, 5827, -16444, 22390, -1100, -30841, 18091, 11977, -21251, 17801, 8229, -33112, 12019, 22542, -23303, 6477, 18979, -29093, -1253, 29653, -15797, -7836, 20978, -17417, -11212, 26904, -5667, -15457, 16010, -6977, -14108, 20390, 885, -16652, 11209]
215A1209j2175j2939K9780j1028k1713K4701l811j7433K5168l384k5060K0818
227D133M351k0828J8980M277k5921J4915J1363k1596J1642J0872k4473P978J7055
240A2748j9995L505J5828k0249J70K0331j5141m659J7671j3142o643J9370q107
253A687j0300J5580n539j0488J5436j902j2286J1462M3j1145J0732K240j1985
266f465P261L777j0318O274M968j0455L656N860q559K818O228q384P96O829o582
281b296P4O854o319j601P449m669k576P208m045l949P254k101n001O437r24n891
297d096N784J037o304M149K219o072K904L474n610J274L943m563K81M335l834
312a079p96M142k813j269L922k039j852L557j436j954L289r96k260K930o04k271
$$ y = [11209, -966, -13905, 15875, 4847, -16866, 7835, 4024, -13409, 11759, 8375, -16685, 4133, 8484, -12344, 6636, 10913, -15008, -93, 11270, -10326, 1316, 12188, -12285, -4307, 12748, -7247, -3742, 12086, -8163, -7993, 12338, -2803, -7462, 10209, -2933, -9576, 9794, 1687, -8613, 6967, 1428, -9060, 6376, 4474, -7812, 3650, 3693, -7452, 3280, 5520, -6465, 796, 4573, -5745, 529, 5497, -4958, -1302, 4558, -4001, -1183, 5045, -3339, -2543, 4286, -2296, -2222, 4632, -1687, -3288, 4161, -508, -3084, 4124, 79, -3870, 3384, 1283, -3718, 2719, 1795, -4096, 1688, 2725, -3579, 570, 2789, -3283, -379, 3095, -2515, -1241, 2702, -1861, -1580, 2755, -1079, -1875, 2267, -546, -1815, 2107, 68, -1784, 1773, 337, -1617, 1672, 676, -1584, 1346, 742, -1529]
328a529K679k96k484K435m4k479K420K27k795K249O15k964K216J061l234J844
344g9J625l184J296K211l319Q17K725l038J69K894k709m96L081k162j059L003
360A775j674j614K902j022j837K426o21j843K077k4j768J509p6j341J367J23j182
377h23J111j94r90J700l61j320J558m09j378K106K1k115J597L54k081J804Q57
394A437k585R33J086j937J162J149k316M16J322j619Q96J230k387N43J562j987
410a095J077J654k829L20K390k407O49K553l291m68L419k252o43L492l048j887
426b366M284j481k123L876k139l225M544p6l349L413p32m023M118J389l973K420
442E57M03l978L515K172m225J788J085m094L307K680m720J207K148m469K560L907
$$ y = [-1529, 1150, 854, -1630, 805, 761, -1718, 702, 929, -1866, 383, 998, -1966, 250, 1311, -1923, -79, 1546, -1638, -342, 1869, -1450, -633, 2092, -946, -777, 2117, -592, -1088, 1993, -169, -1228, 1775, 101, -1513, 1389, 367, -1470, 956, 335, -1508, 569, 545, -1223, 286, 210, -1131, 236, 359, -823, 288, 94, -896, 804, 443, -877, 681, 272, -1106, 1000, 1021, -1094, 503, 857, -1224, 580, 1437, -1148, -215, 871, -1066, 96, 1245, -1071, -655, 667, -952, -56, 1174, -1213, -670, 892, -1095, -18, 1636, -1193, -873, 1517, -890, -241, 2312, -979, -1447, 1972, -280, -923, 2569, -479, -2366, 1918, 437, -1686, 2190, 51, -3174, 1370, 1294, -2055, 1358, 626, -3397, 721, 2110, -1863, 557, 960, -3018, 497, 2669, -1556, 232, 1317, -2777, 530, 3210, -1510, -303, 1845, -2624, -64, 3843]
458C843n465J98L727m578J243N124n475j297N169l891o16N834m322k925N722k561
474b70k349O066k924m229N538r68l338N202j389m710M632J05l603M541p73m866
490c335M314N58m062M623k95n951M735J760n494M391J675p365L718M381o322K240
506d29M080o908J119O148m931n90M655m968o60N999l363j793M037l569j141N605
522C291k736k644M118k800j856N526j919l636L946j335k546M743j040l738L547
537I21p62k536M574r60m215M148l6m076M974M92o111L885K718n746K842L622o289
554b555O98N237m257q28M515l574j735M555j785j943L146j875j627L634j450j925
570a769L399j700k374M413q12l752L885K87m226L476J838m987J953K925m073Q44
$$ y = [3843, -1622, -1424, 2303, -2275, -1032, 4092, -1383, -2680, 2489, -1402, -2018, 3816, -506, -3431, 2291, -270, -2619, 3447, 523, -3706, 1832, 864, -2474, 2728, 1339, -3371, 1261, 1366, -2237, 2304, 1531, -3335, 979, 1537, -2525, 2098, 1803, -4148, 587, 2347, -3147, 1244, 2919, -4446, -728, 3653, -2669, -429, 3651, -3257, -2138, 4010, -921, -1511, 3144, -1824, -2484, 3515, 152, -1641, 2396, -1173, -2314, 3291, 555, -2089, 2029, -771, -2627, 2899, 980, -2656, 1290, -45, -2591, 2152, 1112, -2626, 921, 159, -2377, 2197, 1237, -2978, 1170, 1134, -2942, 2032, 2524, -3587, 298, 3016, -2730, 112, 3734, -2555, -1857, 3380, -877, -1705, 2810, -764, -2499, 2056, 271, -1672, 1474, -401, -2028, 1606, 156, -1769, 1630, -70, -2444, 1969, 1157, -2595, 1290, 1577, -2649, 827, 2665, -2322, -369, 2556, -1517, -673]
586f73L273l726j84L325k679l97K887k671n75L281k637o81L549k893j410M549
602B338k416k513M814j694l587N057m08m589M362O23m923L796J632n003K832K068
618B389m872K657K576n063J974K930n181J984L916n778R88M790n563M07N848n619
634a617j321O545m526j963O831m151l502O913k663l867O693k562m859O881j324
649A508n263O715j244o543P054O39p431O206J666q483N562M112q700L619M942
664D359q343K489O412p508L62O441o568p8P090n868j677O823n006j874P362m558
680a42l513P233l347l976P353k458n494O727p50n596O186j17o312N398J166n977
696c619M766J388o422M341K617o466L595L230o878K768M753o662J336N365o284
$$ y = [-673, 2600, -1126, -1310, 2015, -664, -1061, 1826, -845, -1420, 1861, -776, -1457, 2092, -801, -2211, 2338, -78, -2591, 2223, 529, -3058, 1999, 1591, -2998, 1364, 1987, -2936, 860, 2492, -2511, 321, 2389, -2483, 174, 2750, -2313, -339, 2591, -2590, -606, 3310, -2468, -1480, 3310, -2253, -1846, 4002, -1617, -2938, 3607, -919, -2882, 3949, -202, -3704, 3209, 546, -3321, 3372, 810, -4049, 2832, 1508, -3755, 2960, 1716, -4827, 2227, 2866, -4565, 1641, 3307, -5176, 386, 4498, -4202, -583, 4359, -3984, -1495, 4917, -2591, -2229, 4212, -2356, -2434, 4656, -1212, -2889, 3934, -1072, -2946, 4416, -142, -3655, 3578, 231, -3745, 3608, 1150, -4344, 2383, 1633, -3963, 2223, 2106, -4206, 1192, 2358, -3619, 1147, 2535, -3887, 454, 3071, -3395, 200, 3430, -3448, -680, 4073, -2589, -1253, 4112, -2172]
711b172J2O342n239j519O222m258k419O304l049l411N775k167l750N708j219m612
727c452N115k44m877M898P58n593L866K061n474L103L021n713J670L816m714Q59
743i00M092m642k29M494l548q49M338l447j620M697k404k143M339k154k810M650
759A864j049l260L877o73l520L954L56l860L196M67l873L311J395m289K435J597
775A928m213K452K466m551J367L002m237R21L761m126m72M103l375q20M305k862
791c51j945M123j881k084M043j420k803L537n23k607L221j85l148K745M49k723
807a552K352N06k922J871R94k512J716Q98k896J442J455k509J066J424k781Q68
823e80J938k403N93J801k339J14K231j848l23K090j671o82K284j072r92J976j001
$$ y = [-2172, -2160, 4182, -1057, -2576, 3646, -612, -3031, 3273, 224, -3187, 2588, 421, -3329, 2379, 1160, -3452, 1663, 1419, -3458, 1440, 2198, -3395, 471, 2532, -2942, 161, 3182, -2531, -861, 2955, -1759, -900, 3192, -1450, -1679, 2815, -733, -1582, 2756, -691, -2311, 2386, -18, -2161, 2178, 24, -2786, 1864, 815, -2445, 1432, 759, -2761, 1193, 1549, -2311, 885, 1352, -2521, 790, 2185, -2104, 331, 1928, -2285, 167, 2633, -1918, -551, 2451, -1786, -865, 2896, -1230, -1702, 2401, -974, -1794, 2511, -351, -2296, 1827, -54, -2138, 1905, 485, -2318, 1219, 696, -1911, 1310, 1125, -2023, 722, 1171, -1552, 800, 1306, -1616, 255, 1249, -1263, 453, 1351, -1545, -103, 1352, -1157, -91, 1333, -1448, -580, 1358, -1045, -452, 1349, -990, -876, 1355, -493, -816, 1274, -397, -1079, 1205, 133, -859, 1117, 116]
840A16j087J883n03j196J385k85j264J422M9j280J037Q7j149P80N29j175N02N19
858C70r55L26P57p87O0N64n50lO80m03l33O03k06k70M64m4l79J98J10k21L9J93
880B13k81m8K18j54q2K25j92j35K04j1j75K66q1l08M58o5l04M86p9n41O31J42
902C87p18N06K63p76M23M90q60J14P43q62j2R13q06l50J052n81m99R96m30p14
922g21R84jq32P80M9q42O24M33p89L50M11p54K94M88n05m7L92n03J87M05m70l3
944a00L05n27K12O33p72n7M98n72LR16o17m89Q00l65l65J097k30j096Q48J84p56
965d50Q92K80j403M73Q64r01L04P61j259j15J132n78j63P90j016m28J351l38n63
984c67P98p97o12J454o3q96Q33m39r05J437K68j093O28j11j030J321N39j349M27
$$ y = [116, -971, 912, 409, -787, 598, 313, -951, 471, 520, -760, 277, 364, -785, -5, 524, -651, -149, 370, -585, -259, 498, -289, -229, 335, -215, -218, 462, 59, -274, 329, 123, -147, 317, 273, -106, 92, 202, -19, 20, 213, -68, -116, 102, -52, -134, 91, -101, -236, -32, -43, -218, 48, -33, -341, 117, 52, -252, 234, 155, -386, 245, 387, -331, 175, 438, -338, 85, 575, -285, -171, 572, -290, -302, 611, -195, -545, 507, -74, -573, 423, -7, -721, 263, 262, -570, 210, 259, -583, 41, 474, -315, 35, 446, -308, -14, 474, -31, -78, 314, -189, -2, 403, -67, -100, 205, -322, -110, 523, -249, -306, 192, -380, -377, 539, -78, -567, 233, -132, -497, 600, 370, -726, 122, 306, -450, 442, 722, -681, -208, 656, -245, 59, 820, -439, -554, 578, 0, -163, 627, -389, -817, 534, 196, -367, 431, -366, -978, 476, 413, -483, 350, -89, -994, 443, 711, -382, 246, 135, -895, 426, 965, -384, 43]
1003D3K20j124J158Q74j636J47Q18j367P22J538j770n52J467j035j48J830j134
1020E1j206J305k37l74J413o77j317J058K00l68J014n31j256R74L31m97Q77l46
1038D14j446Q19Q24o62O11k50j414P99Q91o88M40j03j412P96J141q61K27L06j499
1057a067M71J692q28n27O37j010j25J834k97j213M88l29l13J380M0j161k0On2
1076c94J029M7j207J67R0j74R99K08j410q4P04k24N30O11j234o37J103J57r2N13
1096G02p82p83Q21N70j96J40n93o78P70M29p3L7o10p18R47N71m81J71l96r28R54
1117a26R72p01k84M6p58O32J182n93n18L9n71O48J077p48n28J97o39N66J395r90
1137B98j022P64m32q2J572n89j561O96M20m38J078j7j657L35P59k46O52Pj403
$$ y = [43, 263, -861, 297, 1171, -465, -318, 500, -867, -145, 1393, -377, -929, 538, -497, -645, 1185, 51, -1155, 150, -87, -461, 952, 275, -1042, 16, 216, -152, 862, 331, -925, 49, 380, -117, 760, 414, -1032, -213, 611, -51, 560, 310, -1104, -305, 586, -102, 338, 235, -1177, -381, 760, -101, 126, 432, -1067, -596, 1096, 268, -259, 378, -632, -757, 1077, 780, -433, 55, -274, -587, 793, 833, -328, -348, -342, -394, 635, 682, -525, -358, -268, -442, 557, 765, -645, -729, -25, -249, 281, 892, -342, -979, 124, 281, 189, 702, -80, -863, -42, 528, 332, 472, -121, -799, -29, 400, 327, 364, -246, -964, -17, 554, 73, 244, -152, -1080, -126, 846, 145, -139, -93, -851, -219, 963, 370, -148, -109, -680, -32, 1045, 297, -231, -34, -673, -107, 1288, 298, -724, 40, -392, -474, 1098, 509, -1052, -356, 64, -374, 704, 687, -970, -635, 124, -122, 530, 537, -866]
1156h66K62R43k95N07J29j425J56J201l60L2M34j343j50J285j43k93L76j024k34
1175h08J227q8m38L16p10m09J417M1p76L47l48o25J206N06j070P5J77n57P05P80
1195I68r27l51K20k51N57N46p76l21K82k98M07O59q41m85N36j35R9P72o18p66
1215g23O27J54j64O38l13r26O37L19k81N37k17r55O40M36n24N11J15j268M82R01
1235F26p64P4N65j146P4J258o36l89P16q24k37J296m79n33P50o38l39J307l61
1254C20q18R68m77p44J501j78j250J049r0j068J327J88j431P62L73j142R09N53
1272G52j576O59P02j286P62Q40j636L75J084j256M18J133j528PJ364j140L7J247
1290I58j242l17J416r15l86J367j049o00J570p99o55J462q43q88J582m50r90J366
$$ y = [-866, -604, 339, 44, 551, 680, -745, -589, 612, 252, 284, 718, -625, -775, 510, 367, 74, 450, -574, -808, 419, 331, -107, 209, -501, -910, 507, 548, -228, 119, -229, -854, 352, 858, -212, -137, 40, -517, 188, 968, 41, -310, -90, -341, 216, 762, -14, -335, -53, -351, 56, 715, -126, -611, -75, -210, -111, 661, 43, -723, -96, 58, -106, 532, 219, -707, -70, 249, -32, 505, 288, -667, -27, 409, -115, 396, 511, -757, -275, 626, -138, -64, 501, -645, -571, 687, 51, -338, 378, -446, -683, 613, 134, -399, 351, -287, -626, 681, 320, -498, 470, -7, -751, 750, 572, -678, 371, 281, -787, 540, 728, -703, 59, 432, -710, 199, 752, -824, -165, 537, -749, 13, 853, -783, -408, 676, -580, -162, 971, -557, -550, 814, -326, -289, 958, -284, -601, 815, -100, -486, 881, -168, -768, 802, 3, -652, 810, -33, -921, 661, 211, -779, 587]
1308E87n03j074J457o7j275J240L6j290J207K85j343R70M00j417R49O51j458O76
1326C1O75j325N75Q53j346L51Q64j180K56R88j207K0J132j181O1J162j058k15
1344e44J148q20k73J144p74m27J108n28n69J093l32p84J054k68p31Q62r5q27Q61
1363B98K8q15P04K6p73O17J80p56N44L11q38M12M39p60K71M69p84K91O30p38N6
1384a88O63o33n3O95n05k25O60l64k96N58k28m05N60p0m54M25J4m90L87P1m28
1405c06L02J21m31L09Q5l28K70J90l78J55K40l78J32L00m19O4L78l68k6L63k76
1426aj78M37j73l57M62j33k99L01N7l18J27O7j35P0R3j15J07q6k7J51m2m6N5J9
1450C6p2J54%j51K14j69j24L25j16k86L07J8l82L02J16m51K32K39m78J32M30m33
$$ y = [587, 84, -990, 467, 400, -875, 365, 401, -889, 318, 603, -740, 230, 630, -787, 162, 813, -645, 31, 706, -619, -44, 809, -537, -186, 678, -502, -246, 742, -465, -445, 687, -494, -433, 729, -329, -544, 604, -216, -489, 655, -119, -546, 562, 34, -535, 558, 226, -558, 496, 228, -503, 359, 264, -563, 298, 326, -489, 215, 241, -532, 85, 265, -491, 53, 364, -474, -62, 377, -383, -112, 357, -427, -136, 494, -244, -188, 475, -158, -211, 484, -21, -246, 414, 50, -246, 312, 84, -321, 239, 169, -285, 140, 154, -336, 51, 122, -306, -4, 117, -314, -5, 80, -248, 22, 212, -166, -11, 229, -149, -17, 283, -136, -72, 306, -62, -88, 275, -1, -179, 258, 85, -272, 190, 57, -242, 59, 116, -202, -75, -8, -143, -73, 20, -95, 12, -74, -101, 50, 8, -38, 17, 36, -36, 118, 118, -33, 181, 12, -112, 213, 97, -189, 118, 136, -246, 56, 172, -279, -47, 192, -286, -154, 276, -157]
1472a57r0M37k48j88M12j07k99L67J7k14J17M3j57R8J61j87L8M7j36R3K7q5M7
1495C6K4j36QJ18r8k6N3n0k2J23j3r1J06j01K2M4M7l7j3Qj0J34l3n3Q5j28KJ94
1523A93j13k11J87o8j24J98M7l53J97Q3k55J09L32m18RL49l22J03K70k82j05L65
1545A91j93m7L28k93j35M27j94k61M41k21l01M46o1l66L86k9n35N06P6m38L35
1566F2N9m67M17Q2m40M15K7n43M13K77o04L41L07o76L05N30p02P6N09n97K2O35
1588D48n18j79N21m05j14O13m18k18M97m00j84P43m08l31N81k59l04O33j37n40
1608c79N91r8m32N96o8n44M42J10n08N58O9p06M08K25o44M80K01p24L08M59n96
1629b52J30N07o45O0N15m49o4M45l82j84O11k52j70L69k79j63M90j87k49L83k01
$$ y = [-157, -247, 190, -58, -246, 166, 59, -240, 127, 144, -70, 47, 90, -67, 31, 192, 5, 43, 90, -46, 47, 74, -11, 36, 60, -76, -68, 50, -48, -74, -21, -71, -93, 30, 17, -74, 32, -69, -47, -3, 44, 7, -6, 2, -8, 126, 93, 40, 125, -3, -1, 193, 80, -131, 56, -12, -136, 62, 109, -244, -47, 36, -219, -110, 222, -196, -187, 162, -160, -57, 213, -69, -174, 191, -2, -49, 279, -14, -149, 278, 84, -177, 264, 43, -258, 188, 127, -239, 147, 118, -417, 89, 165, -273, 62, 121, -346, 71, 153, -287, 128, 155, -388, 25, 302, -302, 39, 346, -330, -25, 505, -197, -121, 388, -209, -187, 448, -70, -249, 272, -133, -247, 366, -52, -270, 227, -173, -357, 386, -22, -353, 228, -31, -335, 298, 161, -379, 212, 114, -318, 278, 210, -334, 108, 218, -290, 268, 337, -369, 39, 264, -380, 100, 301, -423, -115, 344, -252, -122, 385, -260, -200, 315, -134, -198, 247, -135, -319, 292, 40, -130, 239, -40, -203, 287, 100, -149, 234, 33]
1650C3l27M96j8m29M07n7m53M45J45m93K75J07m63K50L08k92r7K83k45k9L36k13
1672c1l6J82j93k5L30j93m3J95k17l8L11k09k59M49k05k58M61q2m22L84Qm45N01
1695A65O0o21K98K78m51K23L59n58J24M89m80mM82m80j09N79l07k18N10l10l30
1716c01N82j76l12M32k35k73M63j18k84M02k18l43N82r2n53O66p2o08O00J70p02
1737c90M88J85o85M21L98p00L02L90p08K95M51p29K11M64o93J74N89o50j59P25
1757C79n49k46Q35m95l21O60l60k52O11k47l65N73j78l61O50k01m63O87k50m45
1777c38O69j41n08N40l8n78O03J5o06L96K78o47L34L38o92K81M41o88K61M13o00
1798b67R8N64n79J7N61n71n6O54m71j71N91m68k14P34l83l28O06k90l51N96q7
$$ y = [33, -294, 202, 184, -245, 162, 105, -348, 97, 242, -251, 24, 131, -332, -82, 226, -66, -163, 120, -125, -154, 182, -31, -67, 115, -78, -103, 227, 34, -9, 186, -31, -69, 242, 33, -226, 223, 18, -240, 221, 139, -283, 101, 109, -336, 165, 225, -396, -98, 180, -271, -48, 311, -247, -123, 366, -114, -118, 364, -116, -225, 354, 47, -171, 339, 29, -301, 281, 105, -207, 225, -10, -283, 180, 62, -222, 180, -38, -381, 201, 109, -444, 222, 150, -458, 142, 312, -390, 98, 283, -402, 19, 417, -283, 19, 409, -299, -4, 447, -282, -71, 393, -300, -126, 463, -187, -346, 379, -170, -416, 419, -76, -397, 263, -97, -349, 262, 15, -350, 223, 45, -316, 334, 133, -330, 357, 107, -338, 331, 190, -318, 222, 184, -394, 209, 224, -382, 14, 292, -355, -21, 317, -375, -94, 347, -341, -80, 333, -267, -169, 395, -184, -167, 394, -177, -233, 421, -50, -221, 370, -98, -312, 422, 39, -289, 317, 27, -324, 272, 185]
1819A85n11M77j00m79N60P7n25L44J13m79L66K25o13L15L28m75J76L60m84R2L66
1840C18m72P5L84l87p9M53l49j12M79l75k35N25k12l18M81j74l60N07o7m20M46
1861A08J4m00L47J66m84K68K26m60K33K58l84P1L22m43P5M10l65o3L42l35m7L52
1883B11l03j31M05j92k13L86k02j95L11o4k79L99l0l33K74O5l39K91J54m06K17
1904B6J34k50R9K31l50M4K52k86lL07k62lJ48k14J4K95k41j11K56j49j22K55p7
1927gj95K75L4l02L17N1l88K11J66k50J62R2l03J00K69l07N0K07k59n1L51k19
1949Dj31K64k16j49L48o0k53K73n3j85K65Rl83L59K8l64L27J56m37J89K46m34
1971a97K35K89m85P0L85m09rM10m33j7M71l84j26M23k75k59N18k27k65N22j69
$$ y = [185, -326, 151, 51, -428, 132, 209, -316, 28, 141, -338, 28, 253, -360, -45, 283, -192, -16, 344, -140, -48, 318, -154, -79, 305, -82, -161, 292, -57, -169, 310, -65, -300, 225, 13, -305, 176, 2, -358, 149, 82, -338, 108, 122, -278, 69, 235, -249, 19, 245, -215, 18, 276, -108, -37, 285, -158, -83, 327, -38, -101, 241, -94, -141, 211, -92, -223, 182, -10, -223, 163, -39, -234, 77, 13, -266, 133, 103, -230, 44, 109, -230, 61, 215, -191, 26, 160, -90, 9, 240, -110, -66, 186, -100, -103, 204, -58, -61, 87, -127, -113, 182, -59, -170, 86, -63, -185, 70, -7, -202, 73, 107, -195, 122, 173, -215, -4, 162, -88, 74, 166, -137, -37, 232, -75, -25, 182, -77, -128, 223, 4, -127, 137, -79, -228, 120, 60, -193, 80, 27, -158, 107, 116, -267, 92, 120, -244, 83, 239, -198, -9, 237, -197, 38, 327, -158, -88, 297, -112, -121, 289, -144, -161, 310, -74, -200, 223, -52, -311, 207, -20, -285, 237, 68]
1992F8l90M95n1m21M44L6m47M25L9m30L66Q6m65L61J35m26K64J64n10K30L15n77
2014b89K62K50m89J16M21m59L9M50m98n8N73m29q7M76l48j86N47k55k62M45j52
2035F7k55M13j49l17M14q6k57K81L3l56K48P0l01K53K6k39J33J61l23K57O1l12
2057a78J44J44k25J33J70k88P8J35j19l7K36k58n0L31k00p7J78j34j77K91n6j88
2079a47J52k3q9J62j6j89J48L8j71J51J34k26J2R0r7M7R7p2m8J46l8l4J6o1KR
2105gR8j22KN6p7K0O4r7J8L7J0m1K7n9N7J1q8L9O7qk2O3j07K4R5q2L9L4n4k1J18
2136I4l2j01M5M6j14K8J24j87P2R1m4n6N4k3n6J05j1p9R5q5J6L0j6%J24j50OO0
2164C6KOj7np1Q4K8o0J6p8J4N7Jj2k9j1m5N0K6L8n8k5nR6k8N6j4o7M6L0J8q6R8
$$ y = [68, -322, 173, 122, -299, 145, 181, -266, 159, 198, -232, 134, 220, -245, 116, 251, -175, 89, 253, -257, -27, 288, -289, -27, 223, -266, -150, 271, -188, -149, 301, -197, -255, 318, -111, -198, 278, -70, -256, 291, 36, -226, 219, 67, -188, 225, 76, -241, 173, 87, -170, 111, 144, -212, 36, 106, -195, 58, 84, -155, -22, 139, -184, 73, 134, -178, -34, 110, -115, 18, 188, -100, -22, 113, -6, -43, 193, -65, -115, 216, 16, -61, 117, -17, -194, 97, 41, -147, 5, -18, -107, 55, 39, -150, -2, 36, -135, 16, 150, -76, -64, 26, -71, -24, 73, 1, -47, 99, 61, 27, 43, -18, -16, -7, 91, -31, -29, 27, -50, -30, 34, -63, -45, -8, 2, -39, -12, -71, -14, -3, -91, -52, 15, 7, -15, 48, -59, -35, 60, -22, 17, 51, -3, -24, 94, 62, -39, 6, 52, -62, -34, 90, -97, -25, 66, 22, -34, 20, -3, -59, 46, 35, -44, 51, -34, -18, 12, -4, -4, 120, -30, -24, 36, 38, 44, 27, 22, -49, 35, 63, 3, 19, -59, -45, 12, 13, 1, -28, -39, -84, -34, -8, 30, -28, -53, -58, 38, 10, 66, 52, -15, 31, 61, 79, -7, 91]
2197I1n7p0J15o6O7l8l4o5J07J5q5J1l4K2m8R4o8L5n3M6l5N6L5L2j08KO4j9k7
2226a5M7Lm9M8M8q3K9J5p4P5M2j20p7J46n3NN4m7l5Q4pj31J88j12o8N9R3q7N3
2255C1K1j00N8N6q4QJ15o1l5Q2j9m1j4m7l1J45m0p4K5m3K7N0k0q3K3L4m2Q0J2
2284C3m7K8L9p3M7O7n0k7K1k4J6M7q6%N4jPl1j9l4O2l0l6O5p8kN9L5o5Qk1K7j0
2317a9QJ0K0M3n3J4M3J3q4M0j9J8pmq6J17o2l4P1k3m7J5L5l7J5P8p5kLl5JQ4o7
2350b6K2k8K7l1Q3q1K2R7j21O3O1j31L5R3j26m2J35m8p6J13k8j16J36m7q6J03
2376CQq5R3K5j22L0J15j17RJ07q1L2O0q6k3J20l6l8R7r3l6N9m0rM6l2lok3K0M4
2407C8j05J9M8q2nR0k8j9J24o4j1JM3o6N5m1M9Ml5m0R9m6o0M6J7q2J27j50K4R3
$$ y = [91, 34, -36, 79, 13, 80, 42, 8, -57, 50, 65, -20, -9, -43, -21, -69, 25, -43, -8, -61, -15, -50, 6, 41, 73, -35, -33, 31, 12, -15, 32, 35, -14, 34, 82, -1, 28, 43, -31, 44, 86, -34, -111, 35, -18, -13, 41, -6, -41, 43, 36, -95, 93, -19, -87, -28, 65, -22, 31, 52, -48, 10, 66, -18, -10, 105, 44, 9, 91, 72, 31, 17, -30, -61, 84, 44, -30, -5, -48, -21, 29, 9, -74, -51, -17, -59, 21, 33, -14, 14, 53, -20, 27, 94, 44, 17, 38, 14, 30, 77, -9, -9, 45, 44, 51, 20, 1, -33, 29, -1, -37, 28, -50, -52, 7, 42, -23, -15, -36, -9, -19, -11, -1, 19, 62, 9, 23, 66, 79, -5, 35, 16, 34, 27, 23, -63, 54, -8, -42, 29, 6, -41, -26, 9, -28, -13, 65, -10, -12, -9, -44, -43, 41, -26, -4, -32, -5, -36, 47, -34, -12, 85, -36, 27, 88, -43, -8, 85, -41, -83, 52, 4, -72, 41, 13, -103, 33, -14, -100, 3, 11, -74, 19, 44, -78, -48, 67, -50, -41, 66, -15, 17, 77, -9, -32, 88, 52, 14, 111, 18, -18, 41, 1, -8, 38, 6, 3, -3, -26, -6, 38, -67, -48, 0, -82, -87, 3, -25, -44, 80, 16, 5, 6, 49, -17, 38, -3, 46, 50, 15, -25, 74, 28, -32, 14, 31, -51, 76, -74, -50, 43]
2437D3j08J4L1k5j0J05l4p2P0k1m6L7O1m6M1M0r5J07k7q1K4J1m7J2J0K9n9Q0p1
2466b7k6N0K4q6J13q8n3P0Q1j60P8M3J8J9k6n6R9m4q7N6M9Ppo6O0K9q4J5N4j09
2496e4N6L1o5R9r6K1k5L2k9P4l6j6L0j6%L9k0r0P3M2p4K1O5l4M6m2p1J03j9m0
2526EO5l7p3M3O5j57R7M7j52J22J5j69J15N9j01N3O4j36J38jj11N1N3q7j0K05
2552A63j74m8J63j58j0J47o8j03J98o4j42J48k8j85K06j8j41J67l7j73K38m5j61
2575a25J27K9j53J67L2j39J24L1j57N8J60k68J14J66k10OO2j6q1K42k42o1K75
2598A41k25m8K03j35l8K16j54m3R7Lr9K17j14j29K39n5j59J60K6k57J83N8k00
2621a13J97L2k49J89M2j85J1J97k88P2K04k16M7J80j73mJ92k09L8J61j33p9K09
$$ y = [43, -65, -51, -20, -45, -55, 50, 16, -56, 14, -7, -53, -16, 45, -1, 40, 80, -15, 92, 65, -16, 8, 19, -28, -16, -6, 23, -36, 44, -27, -53, -3, 21, -65, 48, -40, -93, -23, 58, -102, -24, 19, 37, 56, 30, -26, 73, 29, -58, -2, 47, 54, 47, -19, 41, 70, -14, 1, 55, -54, 2, 33, -32, 67, -29, -8, -33, -1, -30, 44, 8, -8, 22, 6, 6, 45, 25, -65, 8, 50, -24, -3, 62, 28, 74, 32, -39, 64, 45, 5, 70, 33, -40, 3, 68, -89, 8, 55, -97, 25, 40, -129, -14, 45, -56, -3, 61, -75, 63, 62, -49, 2, 55, -32, -42, 163, -11, -59, 104, -54, -64, 83, 15, -88, 110, 46, -96, 52, 24, -161, 45, 27, -114, 53, 16, -157, 81, 36, -125, 2, 31, -122, 45, 77, -62, 62, 93, -64, -6, 154, -114, 0, 166, -44, -38, 24, 8, -73, 169, -73, -134, 141, -84, -132, 71, -64, -102, 114, -40, -83, 14, 17, -82, 135, 21, -108, 131, 76, -83, 77, 103, -154, 29, 87, -113, 84, 116, -133, 56, 98, -87, -76, 121, -167, -95, 109, -107, -60, 120, -53, -57, 135, -74, -36, 125, -8, -87, 122]
2644A22j27l6J93j71r9K32r6r8J78m9j69K00m8k05K43k4j50J28N6j99J23M7j51
2667a00J22J9j32J18J02k94J97P5k38J70M6j29K9J73k49M7J80k06K2J82j76L6
2689fJ89k64J9J85j65p9K49j33j58K45j19j30K57n5j62J93n0j46J85L8k17J93
2711F9N8k51J59P1j72R7N6j85L9J18j19J5J86k17M6J10j75N8R8j07j2J79j57k5
2735f1J51j40L0J19j16j6J00r4qJ55m8j29R3n9j1Q6p7l8R9J5j26J03J0j14Q4L
2761A1o4P1l0m7L8Rr3J20J8Jj9M0q5mL4jK9J9q3R2O1r7m8N0m2M3k8oPM2l7o7N6
2794a0l6J4L7L6o9L2m0j1M9qM4j8j7m3P7j1M0l6j05R6q5K2P9k1j5L1p1M1L2o7
2824c3j8K2RoQJ9j9Lj3N7n0N8l4J8J8m5k4JO8K2m6J9o7M3j7ooK5oQ9m8o0n3J9
$$ y = [122, -5, -41, 152, -19, -118, 114, 18, -80, 98, 49, -120, 80, 32, -173, 70, 46, -104, 24, 80, -119, 4, 51, -100, 22, 41, -91, 27, 129, -165, 32, 107, -131, 39, 85, -44, -15, 158, -91, -44, 136, -70, -48, 134, -42, -6, 183, -81, -62, 123, -42, -121, 128, -5, -163, 82, -37, -167, 90, 35, -127, 66, 16, -130, 55, 93, -124, 69, 127, -124, 35, 106, -66, 31, 87, -98, -59, 59, -60, -45, 141, -76, -30, 80, -95, -37, 61, -46, -58, 121, -36, -61, 90, -50, -20, 99, -17, -33, 67, -27, -35, 120, 72, -57, 36, -23, -34, 52, -25, -63, 36, 51, -75, 28, 38, -76, 8, 11, -53, 18, -12, -59, -21, -12, -105, 15, 33, 34, 15, 55, -30, -34, 0, -1, 28, 47, -36, 56, 117, 20, -28, 22, -20, 23, -5, -11, -4, 38, 1, -66, -10, -46, -32, 5, 41, -28, 4, -36, -47, 2, -6, 38, 20, 3, -40, 37, 26, 66, 30, -75, 21, -64, -42, 37, 16, 1, 32, -39, 2, 34, -33, -51, -29, -20, -26, -18, 1, -18, -15, -28, 29, -21, 37, 3, 21, 39, -6, -30, -29, 39, 61, 15, 34, -33, 10, -7, -13, -19, 6, 0, 89, 41, -19, -72, -53]
2858e3K6O3q1k1J31l5q5O7pn0RJ7N1RKj0n0k4P0n1N2nRJ6m6N2m3l7lK3l7L8j7
2891b0J5j5k0J6P3k5n5K7j8M8j3J1k6KJ7j8MN3j28K9J52q9n2R3m4l7N9q8K7M9
2921B7o3p9R9L6m7R8o5m3R8n8rPJk8J09r6j8R8j4j23J00j1l8P0qr3N5M2j07O4
2951DO4j57M3J25j83O9J26j80Q5P6p5l7J23j01OP3o8l2J19p7l5J33r8k5J14p4
2977A8o0J04m4p1P3oq2J17K0j78J46M0j04O2R5k17M3J49k23J07J10j02k2J05q2
3002bn0J69k06N8J48j49l0J60p0o6J01o5j27J68k8j24J61j9j77K28o6j16J20M3
3026F1r8P0L7j51P6N3q9K9R9r4K9P0j15M2N7p7k4P2p2mJ39j22l9J52j46k4J34
3053F5j01m2J35o8m8P9o7r2J40L9r7Q8M2j25J08l4j17J32L6j14K6J39j67J9N4
$$ y = [-53, -27, 36, -45, -66, 65, 30, -55, 12, 5, -45, -36, -19, 32, 41, 43, 33, -17, -41, 29, -22, 30, 25, 34, 50, 4, 56, 13, -24, -27, -4, -41, -3, -20, -5, -20, -40, -24, 49, 24, -31, -4, -22, 26, 13, 24, -2, 0, 17, -1, 3, 56, -72, -43, 109, 20, -32, 61, 17, -20, 39, -49, -22, 27, -36, -115, -16, 20, -27, 71, 6, -37, 61, 3, -6, 1, 2, -26, 83, -13, -31, 67, 53, -70, 30, 19, -19, 51, 43, -50, 5, 47, -60, 4, 68, -89, -46, 79, -104, -35, 91, -89, -4, 72, -3, -40, 83, -18, -12, 61, -7, -39, 80, 3, -32, 101, 3, -22, 92, 18, -42, 62, 18, -53, 20, 14, -68, 49, 69, -109, 37, 77, -27, 35, 130, -87, -44, 105, -118, -11, 99, -3, -25, 80, -2, -52, 117, -89, -31, 117, -32, -62, 98, 28, -38, 63, -2, -129, 39, 11, -113, 48, 29, -148, 80, 14, -102, 18, 61, -37, 33, 70, -81, -5, 48, -41, -12, 87, -7, 22, 92, -23, 19, 76, -1, -25, 47, -25, -29, 110, -12, -51, 101, -45, -69, 65, -36, -78, 57, -11, -59, 20, -47, -139, 1, 40, -57, 31, 73, -52, 56, 22, -95, 37, 73, -41, -15, 124, -43, -24, 30]
3078C0o8j6J06j02M0L1j28R1R1j59kJ39n0o0J24j09n7J51o6nL2Ml9R8p9m2P1k
3106B4q9J52o9q0R2L6j93R4O9r8P0K6l9%Pq5M1J28j54Q6K7j14J11l1Nm6Q7p0j8
3135c1P8o3K3L4m1j9L6n7j6M7K7p2P3k0n5K7K6m6P0Ml5O6lj7l6J3K2l4N7m2j2
3166DJ6j3J9L7n2k0K2L5p4nP4p5L8j5m6NO8l8K4jK0m3K0j8MJ02j39K5L4L4k7p6
3198f1O5lk7j5j0Q5m7m8R1m9jL1Jl0K2K8n9L3N7p9PK3l4Olm0PR0o7J9J06j48J2
3231c8J06q7K2O4q4K2o8M0p5J58o8n9Q7n1J0loRn0Q2l8lO6m5oM6j4J3k1k1M0P
3263C5o2R9j5q4M1K6m4n3M2lk2P8q4L2N8j01M2K1l3NL0o7K1O0l3RQM4o4L3m2o9
3295i2J19o3OQQ0l2p3P3n0L5%l0K7O1r1J2J0m0J00Kj12J0R1n9K2K3k5k6NL0j7
$$ y = [30, -38, -54, 52, -50, -10, 21, -107, -16, 75, -84, -86, 53, 3, -57, 67, -42, -99, 52, -14, -19, 13, 17, -22, 76, -3, -45, 26, 24, -65, 87, 18, -62, 30, 66, -127, -33, 36, -62, 8, 34, -5, -5, 2, -83, -42, 86, -68, 18, 45, -69, 42, 11, 16, -30, 57, -13, -31, 47, -16, 7, 41, 0, -19, 17, -40, -56, -9, 18, -54, 19, -1, -56, -29, -3, -49, 21, 25, -10, 56, 53, 36, 0, 13, 35, 1, 58, 16, 4, 20, 7, 26, 63, 11, -9, 13, 48, -26, -31, 43, -32, 6, -9, -55, -50, 18, -20, 4, 3, 23, -20, 0, -18, -14, 88, -51, -26, 8, 42, 15, -61, 4, 1, -26, -41, -51, 34, -13, -61, 30, -19, -20, 11, 12, -18, 4, 32, -27, 6, 63, -16, -9, 14, -20, -14, -17, -57, -50, 40, -27, -8, 98, -50, -38, 68, -19, 3, 67, -17, 5, -63, -23, -98, 60, -8, -67, 20, -31, -21, -24, -30, -21, -71, 11, -27, -30, 36, -9, -15, 31, 17, 30, 9, -12, 28, 35, -27, 72, 57, -27, 14, 40, -4, -57, -15, -18, -40, 38, -46, -14, 44, -57, -15, 6, -27, -22, 8, -59, -38, 22, -11, -2, 6, 50, -14, 19, -23, -92, 27, -36, -30, -22, 58, 26, -47, 26, -24, 11, 11, -19, 8, 69, -22, -10, 0, -40, 60, 62, -50, -40, 51, -8, 14, 37, 12, -14, -9, 21, 4]
3326DQ1o7k1M6r6M4L6r8O8K9l5M9j4jm2L1J1m1pL9l4J8oj8L2O5j18pR0q0J5nJ6
3359a6J4m2J7N4N4o1pNoOj0L1p0K3l2R%LRM4l4j1jM5l6j7R8m5j7J6j9k6K8k4O1
3394D3m1l3L1N9p0l0K5k8N2n6R5qk6K1o4L9j1j9J7j0m3P2Mp0Q0n2JO5J9j02J3
3425b7Nl0J8O4j6l6m1K9PO9o9jM5qo4Q5l2p3J08k0qlJ4n0Qk3O0K2l4k0P2l7l7
3458b3L3J3l2j2J4n4N5P1n3n5K4l2M0J8k8k9O4J5p9j2Q9m1L4k6K2l0M9l9M9l7
3488Hk7lJ8K0j5O5j11RO4m2k6O8m0k8O4o8kM0k9M3L9j6j0jL8o3j3k1L2N8n5k6
3520c0nO2p2N0k8l5N8L6j8J7m4J9j8L7l0K7J3l5qk6j2NQ5l2l1j3K7pQ7n8k0m8
3552d7P6m5K9Jo2P8k9n6N1l9J7k5N3ml7J01r3k2O9J0p4O0o5O6j6%M0mk5k6rK0
$$ y = [4, 85, 18, -3, 43, -53, -9, 27, -71, -3, 26, -9, 40, 26, 25, -17, 14, 25, -16, -23, 16, -18, 0, -6, -24, 8, 73, -45, -52, 38, -42, -27, -32, -16, -2, -44, -27, 27, 81, 20, 13, 18, 12, 18, 8, 39, -31, -8, -40, -31, -31, -28, -19, 25, -9, -20, -21, 24, -12, -29, 69, 24, 7, 23, 4, -22, 6, -18, 43, 2, -31, 0, 59, -11, -41, -16, -44, 8, -48, 47, 39, 13, 34, -30, 9, -2, -21, -4, -14, -57, 15, 19, -51, 29, -23, -22, 43, 62, -40, -27, -22, -52, -34, 30, 14, -22, -63, -34, -27, 42, -27, -28, 17, 9, -55, 30, -2, -75, 33, 13, 5, 2, 16, -34, -26, -49, 11, 33, -1, -21, 51, 14, -23, 10, 23, -9, -21, -7, -61, -6, 65, 12, -43, -19, -51, -11, 7, -21, -50, 14, 29, -50, -62, 27, -14, 20, -6, 16, -14, 35, -4, 45, 8, -19, -22, -4, 16, 1, 66, -45, -36, 28, -14, -40, 28, -12, -40, 24, -44, -46, -6, -35, 8, 47, 31, 21, 20, 58, -5, -18, -39, -7, 51, -4, -30, -35, 27, -45, 5, -23, -58, 0, 36, 18, 35, -9, 10, -8, 29, -1, 26, 39, 4, -4, -30, -42, -37, 48, 16, -15, -28, -1, -8, 79, 21, 1, -47, 29, -16, 13, 14, -48, 30, 1, -55, -4, -43, -26, -51, 2, -2, -39, 62, -31, -53, 16, 26, -48, 12, -53, 13, -3, -3, 37, 33, 8, -18, -27, -7]
3584gK3J7k6j4K7n8k5Q3k8L0j9k5N4m6jl2M8L7p9P1m3mk2Q5j11Q1O%Qj3j6L2J0
3617D3j01J9L2k4P0Nl2n5O1m4M0%n1J3j3K2J5om1J3RJ9K9L8k6o0J5M2J9mK3q3
3649a3j7L3m3P2J6l9kJ5p5R8m3o2J15q7LN9k7k3j0P4j5j9j9Nl7L9j4M9M3o1p5
3680f0R1p1J2P0l2k0LnNM1m5NJ1l2K8Kk2L8l1L5m2L5qm8M4K5k6j3K3l3N1k4J7
3713B4J2p0P1l1PL7r0Q2n0J5l9j6O0lk4m0J16j05M2PL6k0qK2r6M1L1l7P9kn6M8
3745D3p4J5J3J4j7K9K3p7P2ok2j6QQl0R4p9Lj2On4L2oJ4m7J4L4kN8r4Q0l2j4L8
3779A6K8l0J1m6N1j1K4l0J7j3k8N9o0ll3N7J0n6O3q1M5qq2Q8JMM5k0k7OK5K9k0
3812C1J7o4QJ6j1Qj4J4nL0o7P1o0j5M0%j4K2nJm2O2J4p9M9pJ7J5l7k0NK4kK0n0
$$ y = [-7, 16, 33, 7, -7, 20, -38, -63, 20, -8, 22, 3, -22, 32, -14, -15, -47, 1, 38, -41, 30, -13, -17, -39, 46, -65, 16, 22, 22, 30, 17, 1, 33, 43, -58, -39, -7, -31, 39, 44, 12, -43, 18, -26, 14, 14, -37, -24, -37, -15, 0, -6, -47, -34, -25, -6, 23, 61, 35, -25, -10, 32, 51, 47, 70, -13, -30, 3, -40, 32, 48, 9, 7, 22, -53, 45, 2, -60, 55, -32, -29, 30, 3, -20, -30, 44, 29, 10, -9, -4, -41, -2, -16, 33, 76, 15, -60, 31, -40, -28, 42, 10, -10, -7, -12, -7, 34, -11, -6, 5, -27, 1, 3, -19, 19, -12, 23, -19, 16, 8, -40, 4, 29, 3, -10, 13, -20, 31, 7, 24, 36, -34, 37, 6, 13, 50, -40, 42, -8, 7, -32, -48, 12, 9, -15, -55, 61, -44, -2, 5, 41, 21, 13, 35, -61, -20, 11, -26, 53, 51, -5, 43, -31, -16, -3, 11, -6, 23, 46, -31, 41, 35, 13, -3, 5, 13, -17, 77, -2, 1, -11, -5, -59, -27, -33, -19, -66, -52, -18, -20, 38, -56, 24, -8, -22, 16, 44, 14, 25, -21, 30, 19, 43, 13, 30, 17, -11, 48, -12, -15, -48, 9, 19, -37, 26, -55, -10, -18, -100, -12, -11, -7, 38, 18, -9, -3, 22, 51, 31, 48, -16, -8, 8, -3, 5, -9, 5, 0, 30, -37, 34, -26, -41, -1, -1, -15, 7, 2, 3, -39, 23, 37, -42, 7, 0, 17, 32, -5, -25, -20, 4, 2, 22, -28]
3847b8jN2n2J0lO9j14Q8k0l5j8L5l5N1l2L6rOl3pK8k9P0k3j5R0n3J2nq9P0nm3
3880c2J6K4l5R7l5j6k3O0l4Lp9L9k0Olql7K5qL1R4q2K3j3MrK7l9O5qj7l0N2l8
3914@j5KM5o1L7L8m3k3K0k5l4L9m5Q6K6o4L6Lj3p1L3K7K5p1L3O0j08N7Mmk8RJ0
3947a5l0J24p5k4J7%K4O5j26L2J1l1N6m4k2J6K7n6L9M7rkk7J0n0M1K8k7KJ9m8
3978b8J0mJ9K7k2oJ2j7m8M6j4K5j3L7j25O0N9m1l6Q9j4m1j4L6j8L8K1o5P9n8N5
4009D9l5qL0j6m2K8K9o2O6k6m6N5r4Q6n2j6O1n7N1K4l6j4N0j4j8N3n4nk6K2N9
4040D2k1L8qj30J10l1KnM4j8m9j6pL3K5j0Pj10J10l0J0N4n2J0j6M1J1l5lqL1l5
4072a6K0K3q%m3M7j5Nk3MkK2J5k8k0O2j12P8m3l8P4j9k8J1P3l3l8k3Q4pj5o0L5
$$ y = [-28, -29, 23, -29, -19, -22, 47, -67, 21, 1, -34, -52, -17, -52, -1, -33, 3, -6, 0, -33, -40, -12, -41, 29, 6, -9, 81, 28, 40, 35, -54, 16, 11, -32, -16, 8, -27, 70, 35, 19, -4, 56, 22, 25, -54, -15, -35, -29, -32, -40, -77, -52, -60, -29, 65, -17, 6, -7, -3, -12, 15, -24, 41, 33, 16, -14, 38, 0, -15, -13, 32, -29, 8, 46, 3, -20, 0, -25, -59, -20, -65, 21, 47, -17, 19, 22, 9, -62, -29, -2, 23, -48, -15, 45, -63, -6, -2, -6, -34, -25, -15, -45, 79, 4, -20, -3, -3, 21, 86, -40, -8, 3, -28, 28, -16, -38, -22, 5, -51, -12, 35, 26, 24, -3, 7, -43, -2, 26, -1, 1, 20, -28, -18, -22, -3, 24, 2, -4, 8, -9, -57, -11, -25, 0, -13, 24, -101, -41, 18, -23, -59, 30, 16, -25, -39, -3, -21, 17, 38, -27, 52, -6, 49, 14, 6, 36, 20, -22, 6, 35, -27, 39, 13, -33, 22, -72, 14, -38, -54, 7, -50, 1, 25, -11, -25, 25, 11, -7, 46, -8, -13, -39, -17, 42, 21, 59, 51, -79, 31, 0, 2, -3, 41, 23, -26, -42, -49, -16, 9, -1, 6, -104, 6, -24, -14, 40, -12, -2, -18, 23, 34, -1, -4, -12, 19, -16, 4, 27, 19, 19, -24, 23, 8, 13, -10, -6, -8, 14, 29, 1, -19, 43, -69, 9, -34, -72, 2, -17, -45, -34, 39, 6, -32, -55, 29, 22, 7, -53, -18]
4105a8K8J5lJ1p5L0qk0K4j6J6L5J1j9nL2p4N6j4j5J6k1%mnM2j1k9M9l2N6q9O2
4138B5L6l2j6j6L7m4J2Kn0K2O8m1Nl8k3Q0o0M1j0Mln2N8p7M1O5k6J8j8K8lM4r0
4171a3j5M5k6k6Q9l1o0Q3k5k4m1O1m7JK1L3k8Ql3k1M9noj6L7J1K3J1m2J8k5k2
4203a6l6PmR1m8K9Ol8K0l1K0K%Rj3m1K2l5N6J4o3O5J0l3M7k5jj7L4J3n5plNK6
4238A0j3KRj0k7M6Jo6N0j8j4j8Q1o6J6O3Lo5K8K6o2pK1J3M2j7k1j3K2p1P4j1J
4271IL4n6L3j2l2l5J04k8l2j6L6J9l4jJ5K7p0OJ4oJ1KK0k4N7k4mJ1M5o1l8O7m8
4304a1K4Jj2k4M7o1J4L4N3q1O0j5p1L8Oj3K1m0nL5J1KNn2oM3j2j9O9l8k4M0k7
4337hj7L7kRk2k1M0J2qm7J5M4p7L5K6j4j5M8K1l6l9N7n7N5l2oJ5LL3m3j4P1r4
$$ y = [-18, 10, 25, 22, 33, -42, -12, -20, -40, -16, -32, -16, 19, 30, 11, 6, 38, -36, 20, 6, -9, 7, -14, -14, -18, -23, 19, 8, -21, 28, -4, 52, -37, 25, 61, 29, 13, -3, 34, -10, 2, 4, -46, -24, 44, 3, 8, -30, -53, 27, -33, 8, -2, 2, -1, -53, 5, -72, -31, 34, 8, 26, 8, 36, 33, 77, -13, -28, 17, -9, -35, 54, 23, -37, 46, 21, -3, -44, 17, -30, -29, -8, 25, -3, 5, -28, -49, 0, -5, -11, -27, 10, 21, 44, 55, 13, 31, 6, -16, -52, -45, -49, 42, -6, 23, 29, -9, 11, -20, 0, 2, 2, 11, -2, -43, -21, -56, 0, 14, -49, 16, 26, -7, 40, 15, 14, -3, 31, 44, -11, -18, -21, -16, 10, -3, -1, 8, -2, -29, 17, 18, -48, 2, -16, -30, -48, 33, -33, -17, 46, 49, -16, 12, 38, -24, -31, -10, 3, 45, 28, 7, -6, 16, -55, 19, 8, 9, 43, -13, 20, 8, -24, -59, 45, 17, -15, -31, 5, 24, -10, -11, 4, 31, -39, -33, -19, -25, -14, -12, 8, -16, 41, 17, 13, 24, 69, 8, -30, 37, -11, 13, 14, 2, -22, 25, -36, -22, 12, 65, -16, 44, 29, -42, -4, 2, -11, 10, -30, -35, 0, 11, 13, 18, -34, -40, 3, -9, -28, 41, 3, -21, 19, -8, -25, 12, 10, 19, -3, -24, 16, 28, 20, -27, -12, 32, -45, -10, 16, 2, -13, 35, 56, 20, -19, 38, -19, 36, 4, -2, 13, 16, 49, 6, -8, 63, -31]
4370c1O4p4P1K9n1j7l2QK8j6j9L2K7Pm1KL1rNn%j3J7k1k9K1K3K8k7P%oM1q1oM6
4406Ik4O3m6Po8R3NKo0M8l6J6L9j01L6N1m3Nj6L9j4n5P2l2J4L3l9L0j4k9N4mk0
4439A5j3j4L1n1M4l5N0n4P5k4k1jk8J5k9MM8l7K5rMMnJ01p9qK9l4mkK0j6OJ7l4
4474a0L1J3p4N7qpj1K3ok0%N6l6Ol7NN4n1J3Lj5k0N4q0P8m2%K0k6M9j6lMo3N9
4509@K8j3%l7L8k8l6R0m2L3l5J1l9L0P5l5n9N6n1k4N1q1M5J9j0pN5k8lJ2jm8j7
4542e1J9l2Q1k6m3N3J4lkjpmoK1PM8j05J1k2J00o4LL6n7NL4J7k9m0O4n0K1m1M0
4576iJ6K2q7O8l3J3K9k3K5j2pk0L5mJL3o6kk6O7Kk2Jj9M4m8QrP0m6J0K6Lj2l2
4611dJ5L9m2Kj8Qj9O5o7N4l9K2k3l5P9l6Jj8OJ3MJ5l4O0m4N0p2N9n9J9LoJM4r0
$$ y = [-31, 33, -41, 30, 59, 8, -9, -41, -33, -5, -21, -40, -8, 19, 26, -15, -13, 18, 9, 14, 9, 9, -4, 13, -8, -37, -16, 7, 35, 8, 15, 15, 9, 50, -31, -37, 9, -15, 48, 2, 9, -59, 34, 39, 41, -19, 29, -7, 9, 48, -53, -17, 34, -9, -4, -20, 19, 5, -50, 22, -10, 4, 37, -2, 28, 14, -15, 39, 35, 15, 2, -12, 19, -32, 12, -23, 27, -27, 48, 24, 3, 2, -26, -11, -40, -36, 12, -25, 0, -9, -5, -1, -6, 95, 16, 8, 37, 3, -1, -3, 17, 1, 7, 24, -10, 21, 34, -40, 17, 9, 2, -9, 14, 8, -12, -12, 44, 8, 14, -23, -18, 36, -15, -2, 1, -14, -34, 20, -60, 18, -24, -24, -4, -30, 19, 3, 0, 4, -59, 0, 28, 15, 15, -22, 16, -12, -48, 42, 0, 33, -2, 9, -30, 0, 75, 40, -19, 37, -14, -38, 13, -68, -23, -4, -14, -21, 34, 6, 3, 15, 14, -34, -51, -32, -64, 17, -9, -52, 1, 15, 12, 10, 9, 2, -2, -8, 13, 20, 68, -37, -26, -48, 52, -12, -9, 27, -30, -25, 9, 26, -3, -43, 21, -29, -8, -49, -9, 7, 29, -58, 10, -23, -10, 19, -4, 21, 9, 2, -18, 17, 13, 14, 47, -19, -21, -47, 20, 22, 0, 1, -18, 26, -22, -14, -23, 47, 1, 11, 37, 40, 28, -4, 11, 50, 8, 10, -8, 0, -19, 46, -21, 33, -6, 16, -7, -42, 37, 1, 2, -16, -10, 3, 7, 22, -12, 48, 4, 54, -18, 41, -18, 1, 4, -2, -1, 43, -47]
4646d7N5k6RK9J1Om0K0k8L0m7N7q7P8NJ0n4P4p2J0oO1j01P0k6n0O8Opn2P0Jk7
4679@L8n0N9m5O7m0j7%JrqM7o0OlJ9n3L2N1m6l4L1K1l5L7qKK7Ok2k5%K8M1n4j4
4715a0kL0%k2nJ5k8Q7qq9N2J0j0m5J4K9j2N0k6Ml1l1K0nJ3j5L0j2m9N9M4k8o1
4748c2J1J5O7p3L5l4M6r0PO1J6pJK3m2n2O2j6k2K7LK6o5M5%k9L3qPm2L4mK4l2
4782eO5l2k8km4Q2m8J9jk6K0oJ4j9k1LO6p0M9oK8j8o0O4q0M5k3O7o5Q1k0K2m9
4815BO6q2K2pj4j8k0RL8K8k5pJK5%m5J7oKpj1j9P0QpJ8n0K1l2K9J6o3N2J5L2n7
4851AL3k7L1n8NM6l5k2jKJ5qj3N3l4K5n0N2n5L2M4p6L0K5m3N4RL0n2lk0M0pl2
4885iJ0P9p4j0K9o6M1j2k7O5l0qJ02r6O1J5n3QKl9l8P3k4K7k6j7M8l0On1L2M8
$$ y = [-47, 8, -18, -9, 20, 31, 37, -3, 17, -11, 19, -28, 29, -58, 20, 25, 35, -19, 55, -17, -7, -13, 48, -53, 17, -9, -59, 9, 15, 8, -44, 26, 27, 0, 38, -12, 47, 2, 69, 29, 12, 12, 13, 4, -4, 43, -17, -11, -14, 5, -48, -16, 35, -11, -45, -14, 7, -28, 9, 1, 3, 30, 36, 14, -11, -11, 17, 58, 4, -10, -12, 18, 18, -4, -9, 6, -22, 65, 57, -32, 20, 30, 20, -25, -11, 18, 6, 56, 30, 34, 3, -28, -8, -13, 0, -15, 15, 3, -46, 13, 57, 29, -32, -21, -6, 61, -12, 23, -11, 35, -55, -48, 13, 29, 22, 23, 46, 4, -48, 14, -2, -24, 3, 6, 32, -33, 12, 12, -17, 16, 8, 15, -27, 7, 3, 27, -5, 60, 28, 0, -2, -46, 36, -12, 7, 6, -20, 0, -6, 8, -11, -32, -29, 37, -33, 16, 10, 38, 20, -40, 24, -56, -11, -34, 33, -32, 49, 29, 51, 2, 68, -14, 8, 1, -13, -31, -51, -42, -4, 24, -1, -8, -7, 18, 18, -27, -10, -16, -14, -21, -32, -51, 19, 27, 20, 38, -12, 9, -23, 6, 22, -41, 11, 26, 58, 1, 34, 7, 38, -20, -15, 31, -4, -26, -27, -25, -10, -18, -31, 22, -12, 13, -37, 15, -40, -8, 36, -40, -10, 15, -28, 26, 35, 65, 13, 10, -10, 30, 23, -9, 1, 80, 6, -4, 25, -41, 0, -12, -39, 26, -4, -12, 90, -6, 55, 70, 17, 25, 27, -12, -50, 23, -1, 26, 0, -17, 31, 1, 7, -44, -12, 36]
4917C6lJm2km4N7J3m3kMJ6K9m4J9j5RM6Nl3n0P2k6L5j8n0N9k2K9m2nKK8k3kL9
4952C3m0o0P4j2OK9l%m1J5o9J17n2Lm2Q1q4K5K8j9M7j4m4NP6p6K1l9M8ORq1M6
4985gj9K4k2P2m7L6j9j2l5N6kk0L3l2jj9J4K6j0j6l9j0J6K7mK2J0n1O4p7J06o7
5017cj9k8J07k1ll3l5O8n0RJ7m6J2oK4N2n5oPj7L2JLjqpJ9k7nk6O0%q6O0k9N2
5053A2onj2nQ%m4P5n2n6J18m1j3K8l2j1L0nL0Ll1%N6m3k7j1O0m0k1JR4n4o6N3
5087gj7PM6l6J9m7J9qNN9n0l4J8Ok9Q0Ol5lL3m5j1P1j5rm5O5pp9O4k3KNL7n0n
5123a3kOk3jK9J2n7M1J7n2J8J6k3L7J1L2l8P0m6Po1l4M8j3j2Q4k9Jk0J1ml2j6
5156c6rR0n6P5r2J0QP0o2l1L8j1K8j6l1LMJ4j6rk6N0m5K0P2n5JL8j1%M8p0jM0
$$ y = [36, 33, 34, -8, -10, -54, 3, 16, -27, -29, -25, -9, 20, -24, -5, -20, -11, 35, 40, 7, -43, 29, 3, 38, 20, -30, 29, 7, 36, -6, -11, -9, 19, -4, -6, 33, -7, -67, 7, -5, 1, 30, 27, 27, -14, 1, -68, 49, -3, 0, -42, 39, -45, -20, 8, -11, 36, 22, -22, -17, 59, -17, 4, -35, 13, 19, 28, -53, -7, -26, -2, -24, 48, 1, 37, 18, 6, -29, 27, 25, 5, 38, 6, 5, -14, 0, 26, 16, 0, -39, -49, -33, -6, -10, 12, 22, -29, 35, -42, 64, -3, -22, -50, 57, 36, 33, 0, -35, 33, -17, -8, 9, -37, -25, -31, -7, 45, -10, -16, -9, -26, 6, 7, 10, 9, 1, -6, 13, -14, -19, -45, 15, 15, -71, -11, -40, 12, 6, 1, -11, -16, -8, -8, -52, 23, -29, -85, 33, -8, -21, 7, -25, -36, -6, -11, 19, 22, -9, -9, 47, 4, -23, -34, 26, -14, -35, -34, 60, 6, -60, -7, -24, -17, 29, -7, 12, -35, -16, -24, -19, 40, -10, -44, -26, -20, -49, 31, 37, 2, -1, 32, -13, -24, 47, 32, 23, -22, 43, 36, -43, 21, -2, 0, 5, 42, -8, -13, -15, -9, -32, -33, -4, 8, -49, -8, 9, -43, -25, -9, -32, 5, 16, 48, 10, 80, 34, 41, -20, -54, -6, -19, -31, 53, 24, 25, 5, 16, 12, -20, -36, -45, 45, -11, 64, -28, -18, -10, 60, -2, -33, 5, -6, 22, 6, -25, -22, -18, -4, -20, -29, -55, -5, -50, -30, 42, -13, -12, 26, 15, 15, 63, -7, -8, 32]
5190C2p1L4KK6J0p7M7j1J8oj2l1M1k4J7M2m8J6j9J3Qj3M9n7j4N5m5N2q3k9R7K4
5222D3l4JppL2o6P3n2%N0M8o0NJ3n9O8j3n0PNK6J0p6P3k3j0P1p3PM6p2J7L8n9
5256b8jO1r2P6j03P9K4l5O0m9qP6l1l3L7m5L3o4L1pN3j8j6Pn2N3n6Q5pm4O4o8
5288a8J9j6p3J28o4l7OP7n4kK6K2N0p3L5J1m8Pj4L5Ol4M0JPn9J6k2K2L1k2l0N3
5321B6m7nK6j6OK5kk3J7m1LL1%LnLmN1l4o0M3J0m6K3l9L6J4K0k0j5L0m9L6m0Q2
5356C9m2L5qo1L7NLj9NLkn8M8L7Rp3rjJ07m9L5m4p0K9L0L4q3P0LJ8j4j1J8l9J1
5391gk8L6j6J1Kl9N3J8j5m6P2K1r7K1Jj4K9nO4q7L4Mj0j2M5%p1J5PJ7j1p1P3k1
5425b7O2o1N0j04L2M2J5K2m7J8k5J5m5N9n0kM5JLK4m6j6L5K5j0k0l3M5kK3k1j7
$$ y = [32, -39, -5, -3, 23, 33, -44, 3, -8, 10, 4, -8, -39, 2, -22, -5, 37, -11, 5, -14, -1, 7, -6, 43, -14, -28, 27, -18, 34, -49, -78, 19, 43, 9, 10, 3, -4, 28, -38, 35, -17, -17, 33, 81, 21, 26, 39, -20, 48, 35, -15, -8, -3, 23, 33, -43, 30, 7, -3, 68, -5, 2, 48, -24, -7, 31, -28, -29, 32, -60, 16, -87, -8, 16, -19, 41, -8, -16, 60, 29, -4, 33, -12, 21, -43, -12, -19, 34, 16, 0, 7, -45, 8, -48, 37, 30, -14, 50, -18, 1, -15, -88, 40, -24, -61, -55, 22, -32, -34, -8, 14, 64, -9, 26, 37, -11, -4, -18, 17, 23, -11, 29, 30, 37, -22, -6, -28, -6, 25, 3, -27, 26, -21, -26, 0, -16, -10, 15, 13, -10, 7, -34, -31, 0, 0, 3, -2, 1, -3, 48, 14, -46, -3, 7, -39, -16, -55, -19, -5, 15, -5, -20, 10, -39, -3, -43, 39, -3, 32, 24, -37, 0, 5, 8, -11, -6, -3, -5, -63, -15, 22, 31, -42, -51, -52, 55, 6, 41, -3, -73, -44, -14, 20, -63, 7, 10, 28, 14, 3, 21, -18, -7, -35, 1, -15, -4, -2, -41, 12, 30, 15, -31, 41, 62, -35, -14, -13, -27, 2, -3, 61, -26, 8, 12, 2, -10, 35, 35, -36, -21, -14, 3, -8, -79, -6, -27, 35, -26, 24, -80, -48, -6, 9, 31, -16, 2, -23, -8, -53, 6, -44, -46, -1, 0, 3, 27, -19, -35, 0, 25, 15, -5, -38, 7, 5, 28, 7, -10]
5457a0J7Ql7M7j1j7J5Lm6M3K9m1J0rjn1L6jN4n2J3K0k2J0k7oP7o1P0l9j5l0J6
5490hL5m1M1m6K8j1krK9p0N2K4j2j2n6O8Ln1P8j4m3OmPK9k9L5l6%l4K6L2K2mk1
5525A2pn2N7M1l4M8m3Rk6L4m6j8O7rj9m5J1Lj4J3K9M9m8k2qnL7l7O6Lo0pNL1l2
5560a7k3N6j5L6o0j6O3k8J8o9LM7l9P5q7J27n7o2N1J8j4J1qk9N6k1ml4J6jj5P
5592a5j4JL8M5o3j1K4qn1J1L8J9K4j0n5L8Jj7J7K4j0l2K1K8l6j6K6l3jP2j0p5
5624c0M3M4r7M2k2M7p3K6Mk2J9M2o5Nj1M3L8k2jj5K1k0pJ0lm1L8m0N3j9J1L7k3
5657A2l7P1l7k2N2m9j9oK2J9o5L6L4k0K6k0K5l2l0j1O4Po7Q2rm0L3Jk6M4k0km4
5690b8M2K5j9l4J4K5k0k2N5m5J1l1J8qL0l1J5K4l7j5K6M6j01M4M1n4L7K0o8N8
$$ y = [-10, 7, 15, -22, 25, 14, -3, 12, 15, -31, 12, 41, 0, 10, 1, 0, -51, -15, -16, 38, -14, -1, 19, -3, 7, -20, -26, 51, -10, 60, 21, 6, -24, -8, 27, -14, 27, -19, 9, -2, -4, -13, 16, -54, -2, 22, 10, -2, -58, 10, 13, -38, 40, 26, -17, -11, -15, -8, 21, -8, 27, -9, -9, -43, -17, 15, 37, 33, 12, 5, -47, 10, 51, 17, 65, 22, 31, 5, 39, -7, -25, 42, 33, 14, -31, -20, -17, -31, -18, 11, 60, 12, -10, -18, -23, 14, -23, 43, 46, -14, -21, -16, 15, -17, -40, 16, 1, 37, -23, -39, 24, -4, 14, -55, -52, -5, -44, 31, -56, 71, 14, -48, 3, 21, 7, 18, 10, -19, 37, 16, 12, -22, -6, -7, -22, -15, -29, -28, 10, 55, -8, -19, 5, -3, -54, -43, -5, 14, 38, 28, -27, 11, 12, -5, 12, 36, 26, -6, 15, 43, 7, -9, 17, -16, -17, 55, 45, -30, 13, 57, -40, 2, -20, 27, -46, -20, -16, -38, -19, 23, -42, -37, -48, -5, 33, 11, 10, -5, 16, -4, -11, -1, -4, -45, -7, -47, 6, -13, -2, 35, 12, -25, 46, 9, -13, 39, -10, -29, -35, -13, 6, -59, -23, 11, -9, 17, -3, 22, -10, -40, -51, 13, 20, -47, 35, 26, -14, 19, 20, -6, 38, 18, 16, -28, 14, 39, 20, -14, 0, 25, 5, -17, 38, -7, 4, -27, -9, -17, 13, -18, -3, 21, -16, -31, -5, 41, -60, -16, 25, -29, 8, 28, -40, 18]
5720A8k4l0k6M5j5M4j7k9J1mJ8jK7n0P7p7L4Pn4KK0J6J4mKk5l1N7Mk0MJ9k2qM4
5755B6m2KJ0j9O7k3m1rl0Q8k1M7k8k2J9k1j1nn6L6OL0J6K2k1Oj6L3l8R2j08j1
5787b2O2k3l4M4k3l4L6k7Q6p9K9n1N9LJ1n0M8n3j2J7M6j1k3JOm4M1l9L7J2OLq2
5820f0O9lj4L0o6O2m0MM6j7j6K0Nl9K4K3m1L5m8j9N4l4k5Q1o1Q6l3Pn7JJ8j4M5
5853B3m0J7jJ9q0K7O0m0J4L6L6q9qJ01j7n8J6j5K7m5j4L9K0k8l0J2j7M5j0M5k5
5884B0j0L1n7Rj9m5O6K3n7M5l0J3J4Lro6O5L8l3j5j4O9n2jK7j9%L3J3J4o6%Jj8
5918b7K2j7N6Pr4O7j1o7K4LL5M4k4k7j0M5M4o8NRk3k1J1J6J5k1KLl9L8k2L4k9
5951b0O2km7KK5K3J5m8K6K0n5p3Q5J4J7l1L5q6L0K0m8L2lj6J9l5J7O4m1kN0n4
$$ y = [18, -6, -36, -62, -17, -32, 12, -5, -34, -23, -27, -9, -10, 17, -33, 44, -33, 1, 8, -46, -44, -24, -8, 6, 2, 4, -21, -52, 5, 9, -11, -7, 12, -10, -18, 26, -16, -14, -4, -23, 44, 21, -20, -29, -59, 29, 8, 55, 27, 5, 24, 3, -8, -13, -69, -33, -27, 3, 19, 41, 20, 26, 10, 43, 5, 97, -11, -22, 40, 17, -17, 27, 4, -30, 6, -21, 65, -14, 15, -36, 23, 26, 37, -13, 35, -18, -30, -13, 33, 22, -1, 0, 6, -38, 3, -36, 1, 13, 19, 22, -60, 9, 6, -8, 22, -44, 18, -22, -18, 28, 11, -5, 15, 20, -19, 5, 28, -13, 22, -26, -45, 9, -25, -50, 31, -30, 56, 23, 30, -27, -26, -8, -22, 23, -17, 0, -1, 18, -62, -35, 25, -15, -1, 35, 71, -18, -26, 75, 58, 0, 16, 1, 28, -17, -31, 8, 28, 0, -30, -18, -35, 10, 0, 45, 20, 10, 41, -16, -7, -26, -71, -5, 18, -39, 6, -24, -11, 3, 6, -3, -69, -4, 34, 1, -14, -28, 41, -11, -12, 15, -4, -4, 29, 42, 56, -10, -10, -9, -27, -5, -22, 34, 41, -53, 14, 3, -64, -40, -37, -2, 42, 18, -9, -19, 26, 70, 2, 7, 16, -7, -28, -17, -1, 14, -7, -5, -2, -41, -3, -25, 9, -20, 42, 40, -7, -5, 20, 43, 58, 10, 36, 56, 1, -72, 13, 27, 44, 13, 48, -38, -8, 12, -36, -4, -7, -23, -4, -39, -22, 42, 1, -1, 49, -5]
5983eJ6MKJLL2m4j7k2J3jO0m6L9j2K8l0J2K1l5O6j44P4J1J8j01P3m2J9M4n8RQ
6016dM2n6j2M7qM8r5MM7k9rM9m2J6J6j3K8o7K7j6%K5K4j2k2rN8j5j5n1P2m5K6
6049Il3K2J8j3k3J6M2q3JO1O5j11K5k9O3k3Rk9j7J8K2Mok7l6J5M6rK8Kk7J4K5
6082C9Np5L1pL5j0l3K8jqL0m0j7L6L0p3M2n3O2mN1o4l7M9p1J3L9K0jJ8k2m8M0
6115Dk4N6o9j9P6m1K1K3p3P1J0p2K8M7r8M8K1JL1j3qk5l2L6kk0K3jmO0p2mLj0
6149b8K8NJ4l6pOl2K3K0J9M7q9rJ8L6NK7mk3nk8N1K6o1m4M4Mrk3J8Ml6R2p8K8
6184CN1q1M0Nk8JNk0R2q8K4qk4O0k8rJ6Pm2JK2k6J7j1M6k6j7P8l4Knm2K9qJ9R
6220C0Pop5K5lJ1k4L8K5n3J9j8j9j0Q1m4l2JOK1J0JJ3oL4l1oPOK9lo7J2L5r2L5
$$ y = [-5, 11, 15, 17, 18, 21, 53, 9, -8, -30, -17, -18, 42, -4, 35, 23, 51, 21, 33, 54, 19, 85, -59, 15, 26, 44, -57, 16, -26, -7, 37, -21, -12, -4, 38, -18, -30, 17, 9, 57, -38, -34, 13, -16, -25, 24, -18, -2, 14, 1, 29, -38, -11, -27, -27, -2, 22, 10, -12, -21, 37, 22, 7, -44, 28, -17, 9, -24, -2, 16, 3, -20, -4, 38, -45, -44, 17, 82, -29, -4, -33, 30, 7, 16, -13, -30, -12, 10, 14, 8, -19, -55, -40, 6, -3, 25, 27, 0, 14, 39, 44, -31, 0, -7, 28, 18, -15, 13, 12, 4, 34, -6, -23, 13, 43, -30, 12, -41, 21, 17, 68, 4, -33, 16, -55, -42, -3, 17, 16, 34, 12, -36, 4, -20, 36, -33, -52, 24, -17, 4, 27, -46, 25, 35, -37, -9, 38, -60, -12, 9, 10, 41, 28, 20, -5, -37, -1, -3, -23, 0, -1, -5, 55, -17, -21, -18, -28, 0, 5, 19, -17, -24, -18, -50, -27, -7, 12, 59, -30, -39, -21, 15, 20, 47, 43, 20, 15, -13, 38, 64, 3, -41, 3, 7, -2, -25, -7, -3, -39, 53, -25, 3, 54, -27, 13, 18, -10, -9, -4, -24, 68, -20, 4, -4, -28, 32, 4, -5, 11, 18, -24, -23, -1, -27, -10, -21, 25, -1, -18, 60, 26, 28, 23, -19, 10, 2, 21, 30, 37, 31, -44, -19, -22, -11, -35, 3, 28, -25, -6, -24, -43, -53, 28, -16, -48, -47, -41, -20, -10, -9, 4, -2, 32, 1, -5, 2, 8, 37, 34, -33, -21, 14, -78, -43]
6256d3O6N6p3k0L8l0L4J5j7n3kN4m4k1J7J3o%l7L9K7K2j9oKJ9l4j2j3L0K2jn7
6289c4O5m9Mk3N2J0j4jJ2o6M6J2J1r4P6K2J2pl8j8M5om1pP9m5%J1k3L5Nl3J3j6
6323elj5O4l8OrJ8%m6N7n7J8j3M5k3mJoL0k8J9l0j4R7m6j1J8k1J8m0k8M2L1l2
6357ek8N6J5o0K3l1K7j7K0k5J9NkOK6Mj6j6K7m2k%M7Rko2J4j5M3j4MJ2K4m9mj6
6393b5J2M8n9O7o8J8m1O0Jj5k9nM6j9J7n1P0J1%o8K6OK2k1J7J7p0N3K4l9k7j3
6425c5pN8n5J10o1kL7p1K1K0j9m5P2l9J6jJ3m0J0J4LJ4k8mL3j1k5J6j6J8OOm9
6458d1N4qjjkNN5jr2N3l7M8l7K3L2k6m2j2P5n4M8k3L8n5p0O5Oj6l5K0P8m3j0L8
6492C2o5L0p1O8L1k8j4J5J5J4j5p1O1L9jn6J9l3J4L0K5m6K0k4J8k8K4L4k5j3L
$$ y = [-43, 23, 79, 6, -14, 24, -6, 28, 43, 26, -27, -29, 25, -19, -40, -23, -10, -16, -16, -53, -14, 13, 35, 16, 10, 12, 31, -3, -15, -28, 2, 24, 23, -34, 31, -18, -14, -37, 15, 25, 11, 10, 22, -44, 2, 14, 25, -69, 7, 29, 41, 34, -4, -22, 23, 17, -24, -31, 48, 3, 3, 14, -9, 26, 31, -2, 11, -5, -8, -23, 41, 3, 9, 0, 18, 18, -28, 29, -28, -10, -23, 22, -1, -5, -4, -10, 20, -8, 11, -19, -33, 64, 18, 7, 25, 4, 22, -18, -46, -4, 27, -5, -33, 23, 38, -22, 1, -30, -3, -20, 0, -25, -6, -1, -3, 3, 29, 33, 17, 1, 28, -14, -16, -16, 31, 40, 38, -24, -10, -25, 18, 4, 8, 20, 44, -5, -9, -25, -13, 35, -24, 43, -25, -7, -48, 12, 13, -2, -31, -36, 10, -9, 8, -43, 27, 38, 38, -30, -4, 2, 24, 3, 20, 37, -33, 20, 44, 5, -22, -35, -42, 16, -39, 71, 10, 8, 45, -26, -5, 15, -4, -49, 23, -16, 0, -1, 12, -28, -18, -4, -1, 13, -15, -19, 14, 3, -22, -6, -22, -4, 2, 8, -41, 13, 5, 4, 3, 1, 6, 61, 60, -32, 21, -16, 32, -5, 18, 50, 24, -18, -30, 45, -9, 39, 16, 54, -1, -71, -6, 0, -16, -51, -31, 47, 4, -6, 32, -33, -3, -74, -6, 25, -3, -17, -2, 13, 27, 12, -59, 2, 41, 40, -16, 3, -30, -16, 14, 39, -7, 13, -11, 7, -21, 3, 37, 12, -1, 2]
6523Bl2J6L5k9j8J7K1Lj0k1l2L5K1l9k9K8K3J9K3l7L4k3mK7q3J40j15M4j1k0K9
6554A4j9N9n5N6k9l9mM2l1Ljl8M3n8N9ll1K8k9L5RJ5J8o1j2N3k7l3M6J1kn1M3
6587A1l2M6n8O0ll2K4M0j3n3MJ9j1m1L0J3l2L1Ol1l7M9QK3k9J2m5LLN1p1M8Nn5
6621e7L7O5l0Lmk7J4KK0o7O7PJ4n6J9mj0J9J5J2k2K0MJ3k8k3j4k9N3m1O1m2o7
6654g6L9OJN0NJ1l2m5M0K1j1J9k9M1l4j3k2L2j5LJ1rL8mj5J9j5pJ4l7M6o5M1p
6688Am2K9Pj6PM4p2L9n3RN0L5o9N2k9kO0n6l%n7J08p6J0N3n1O4k7j2J5n1J0M6
6721B3k0L1o4j0M9n5j5M3j7L2L2JNn6jlJ8J8l5P3j3o5R1n0k5j0J9K8j2k2m6M5
6753a1k2J8PQK9l3Rl3j6L5l0K1KL3n1L9l6K3l4M2J6l4L3r9J15OJ2m5o2O2l4nK0
$$ y = [2, -30, -14, 21, -8, -26, -9, 12, 15, 5, -16, -48, -13, 8, -31, -60, -32, -9, 10, 33, -4, 30, 7, 3, 30, -53, 87, -28, 16, 5, -15, 14, -5, 54, -1, 55, 26, -13, -17, 25, -6, -3, -4, -42, 1, -57, 2, -1, -32, -4, -33, 2, 11, 26, 44, -17, -29, 24, -3, -36, 10, 21, 19, -32, 11, -21, 25, -33, 27, 24, -8, 16, 56, 43, -10, -6, 13, 2, -39, -9, 4, -28, 3, 9, -22, -59, -10, -2, 21, -8, 4, -41, -38, -35, 16, -55, -7, -2, -57, -20, 45, 15, 18, 14, -13, 1, 3, 23, -44, 23, 30, 44, -12, 7, 3, -7, 12, 27, 39, 17, 37, 41, 54, 26, 3, -11, -40, 13, -28, 33, -9, -76, -37, -31, -30, 20, 25, 36, 4, -41, -1, 20, 9, 28, -1, 40, 6, -7, -29, 3, -12, -9, 2, -7, 31, 27, 12, 31, 16, 9, 23, -14, 32, -33, 8, 1, -41, -12, -5, -21, -14, 30, -42, -3, -56, -47, 3, 38, -31, 21, -8, -10, 50, -6, -9, -9, -66, 42, -34, -24, 29, -22, 42, 15, 3, 18, -33, -23, 23, 3, 34, -30, -40, 9, -46, -61, -18, -35, -3, 29, 30, 35, -21, -22, -25, -7, 11, -24, 49, 36, -29, 62, 12, -13, -23, -4, 24, 12, -10, -56, -11, -33, -15, -8, 0, 29, -4, 5, -28, -44, -9, -39, -18, -16, 17, -34, 5, -31, -8, -42, 0, 16, -18, 15, -84, 31, 37, 49, 4, -58, 4, -30, -35, -15]
6786a5j7k4O2lL7kp6Q9o3J4n7j4M8K2nK6n8O1Jk7J7K9l4l2M5n9K2o6Q9m7J4M6
6818B3k9Nk8jJ7MjL3r1M6K2N6j17N8l6K6L4m0N8Jj3lk4k2N7m6J0j0L2Pj3n3O3
6851B5k4K3n7N7j1l9M4j8Lj9L6k3q5M7J7L3r0J07o7P7q1K9PL1K9m7Nm2P2rn8j9
6883d7P4k2m1L9km6K4M4l8k4M3k6O4k1n8L4J2Lj8J7oJ5n7K2JK2Qk7K6N0o0m8L1
6916a2k7O7l7o1Q8pl4j4K9N3l2J0l0JK0m3N0K1o8N9Kjk6M4j05N4K2j3nK9j1mk1
6949blqK5j7q6J12JQp7N3k5J0J3k2K2N4o0k6M9Pl3L3n5N4k4m2R8r3P3m6j7J5K4
6982A5o1N0k8J7MrK9l5M8l9OK8k6lk9Q0o1Mk5PPNlK0Nlk1j6K4L0l2L7jJ8p9Q8
7018E1%o3K6j0L2J4n6j2L4K1n5M5k4omO1k1o3J0KM9k7m5L7k6L0j4M0pl2oJ0lK2
$$ y = [-15, -32, -56, 6, 3, 40, 38, -38, 51, -12, 2, -55, -69, -21, 1, -4, 22, -36, 25, 26, -1, 16, 45, 11, -21, 24, -35, -13, -79, 10, -37, -23, 23, -6, -1, -29, -30, -13, -9, -10, 23, -68, -22, 0, 56, -61, -3, -39, -13, 21, -19, 39, 40, 27, 24, 0, -22, 35, -11, -1, -11, 21, 28, 15, -38, 25, 1, 24, -33, 24, 13, -26, 18, 0, 3, -16, 20, -3, -88, -41, -24, 9, -81, 26, -41, 36, -45, -16, -9, 22, 51, 4, 9, -33, 39, 30, -28, -47, 27, 5, -36, 3, 1, -45, -21, 23, -15, -39, 4, -22, 42, 21, -37, -3, 9, 12, -6, 11, 5, 20, -37, -15, -14, 8, 16, -11, 15, 65, 5, -43, -12, -39, 28, -9, -70, 18, 11, -23, -37, -8, 45, 13, 23, -7, -6, 14, -29, 21, 42, -26, 33, 35, 34, 8, 52, -53, 1, 23, 10, 5, 34, 23, 19, -2, -5, -13, 12, -5, -91, 21, 22, 30, -47, 6, -19, -9, 4, -18, 4, 58, -2, -28, 21, 28, -5, 28, -27, 27, 3, -39, 59, -34, 39, -7, -24, -9, 15, -46, 4, -24, -7, -3, -12, 17, -18, 30, -9, -3, 25, -1, -4, -33, 47, -14, -10, -35, -28, -21, -16, -19, 1, 6, 3, -18, -34, -10, 20, -12, 25, 24, 42, -37, 51, 51, -12, 14, 4, 36, 50, -6, -18, 16, 37, -18, 27, 3, -3, -7, 54, 33, -30, -20, -18, 31, 4, -41, -4, -30, 0, -14, 26, 19, -13, -19, -9, -12, 10]
7052A0l8N5k0l7N3kl1Q0r3PJ6N3j00M2J8k1j6N1J4q8J7j9O6n6J3k7M8n1j1L9k
7083c0L7m1%N6m3K6rnj2K9m7qJ05o3K4m7M9J4j2K0p1J4J12j21N4p3M8%k3O8k9
7114B2j3ml6K8N4r7O7J3j07J01m1l3P5m6ll7L0L4oJ9m5K2K0j6QJ6k3L4n0k8Q5
7145D3o3KJ0Pl2K0j5M6l4JL1j2j2PK1o3J2N0n7K9j2J2jl0M7j2pM7j6m9J5L7k0
7178BP6p0l2L8n0J07p8O1n5K4ol7jK3l1L7j1QK3o0M2J8M1j00L5Mk0lM1j5mm7K7
7211a3K3mJ3K3m7K9k9lj0j3OK2QQk7J6n3O1QMk6pnL6k6l5Q1l1J4l3J2j0M0j0p2
7246e0N3k0M5k1m5L9j6N1jn7L1KJ1m0J6j3J7mj6k6O5j5j9L0m1N2j2j6ROk3KK5
7279A9jpk4N3j8J9o6M9q4OJ6J8J3J8j0j4R2j11K9m3O8n1L9Kpj0K0K1J7m6k0J9
$$ y = [10, -28, 27, 7, -30, 23, 21, -10, 70, -23, -16, 0, 53, -47, -5, 13, -8, -24, 27, 41, -47, -30, -49, 17, -39, -26, -53, -5, -56, -67, -28, -30, 7, -34, -34, 22, -21, 5, -4, -9, -21, 8, -39, -47, 58, -5, 19, -28, 21, 35, 23, 43, -28, -14, 98, -23, 31, -42, 6, 6, -17, 51, 22, 9, 5, -31, -3, 51, -46, 21, 34, -73, 28, -13, -46, 29, -17, -20, -57, -27, 7, 1, 20, -25, -3, 17, 1, 9, 25, 2, 36, -14, -42, 43, -20, -18, -8, -1, -33, -13, -28, 18, -16, -15, 16, 4, -8, -1, 20, -43, -31, 19, -38, -9, -21, -9, -10, -40, 7, -5, -12, 35, 19, -30, -15, 22, 2, 78, 8, -24, 14, -36, 71, -7, 54, -1, 23, 17, -20, -21, 2, -29, 8, -3, 5, 28, -32, 10, 28, 69, -31, 4, 8, -12, -15, 26, 11, 7, -40, -13, 10, 6, 19, 42, -5, 24, -5, -8, -18, -31, -25, -3, 5, 13, -14, 2, -51, 10, 18, 22, -4, -11, -16, 20, -6, -41, 40, 9, 23, -10, 2, -8, 32, 22, -50, 3, -17, 28, 7, -38, 1, -15, 36, 35, -22, 9, 11, 22, -18, -2, -15, 2, -2, -18, -44, 21, 6, -13, 17, -24, 28, 16, 0, 9, 15, -8, -6, 19, 18, 11, -13, 40, 22, 41, -25, 24, -60, -54, -38, -20, -7, 11, 1, -13, 79, -32, -3, -46, 22, -29, 10, 12, 5, -5, 15, 36, 53, 7, -13, 6]
7311Fk3O7p8M4k6L5Kl4L8j9QJ3on1O5n1K3m0%L2l1N0Qk8J4k8J0%Kn6K3M5qm0P6
7346D2n3L5o6O8k2k1K5Llk6N5m0J8L0o0O8p1Ok2J3M0m1L4J3m9M4K5k8L5l2m6k
7378b8%L7K1l0j7O3o2j1n8J45n1rL5m9L5l6LJ9J9J5K4m6n9M3K9k4k2K1j1j8K3
7409Aj9J9m0N0nm2L7q2Q4n4J8K5J5qm0jL1j8L5j9l2j6R1Pk8K8k8JJ2Jl4nJ0l8
7443d4O7j5m2j1J8L0j1NO4n1om4L4kK4l4k1K2L3j4L8m5k6N1m0k3M0O5o3J9j9j2
7475a3L3%m2N6n5K5k6NO9o8M6j1omJJ8o4M2l4L0Qk9J0j0%k4J30r0L4n0m4K9N6
7508B2m7K2j8K7j3p0J17n8qN5o8N3l0N9j7%K3m1l9mP5j5m8k3Q3l2J2j0k7M4r2
7539f8Q6n2L7J4j0l4K1J0k1j3K6J2J9k3m5N6n8O1m3k5P2j3k6K1j4Q0o0n7M0j2
$$ y = [6, -17, 50, -28, 16, -10, 25, 27, -7, 31, 12, 20, 33, 27, -24, 41, -10, 13, -27, -27, 5, -26, 24, 32, 4, 18, -10, 0, 0, 2, -54, -31, 14, 6, -34, 42, -11, 24, -42, 26, 4, -17, 8, 11, 8, -18, 37, -3, 15, 45, -15, 53, -18, -12, -34, -21, 19, -22, 12, 25, -24, 20, 45, 17, 52, 20, -26, -28, -28, 9, 30, 0, -17, 46, -16, -27, -85, 60, 9, 0, 35, -14, 21, -15, -12, 7, 26, 41, 65, 19, -40, 3, 32, 8, -14, 7, -4, -22, 1, -18, 1, -39, 11, 6, -36, 1, -81, 3, -51, -33, -8, 7, -1, -41, -42, -11, -29, 6, -13, -45, -61, 30, 37, 9, 37, 9, 10, 22, 23, -11, -16, -6, -44, 23, 8, -34, -45, -27, 3, -8, -3, 61, 10, 4, -40, -6, -8, 16, -18, -39, -17, 16, 2, 40, -5, -31, 20, -20, -43, -3, 62, -1, 18, -1, -13, 20, 20, -22, 34, -21, 4, -22, -17, 52, -16, 30, 19, 13, 9, 10, 28, -36, 6, -28, 2, 10, -19, -9, -19, -19, -43, 87, -3, 31, -19, -63, -34, 22, -25, -3, -21, 6, -7, -77, 40, -18, -26, 29, -39, 14, -16, 43, 26, 26, 49, 8, -31, -35, 40, 25, -23, -46, 37, 5, 17, 7, -20, 24, -68, 18, -34, 3, 17, 7, -27, -6, 4, -17, -30, -4, 8, 27, 4, -41, 15, -43, 18, -25, -50, 22, 9, -17, 4, -10, 70, 10, -47, -7, -19]
7569a9K6L3nm1LM1rK5n5M3o5M5j7%nk2K8n8J3M1M8q9K6J0ml1K8Ok5lQL6nJj6n
7605a3K1k5MJ7l5l3M3Q0o0K1l1j3N2m3l7J1N8n5j3N5k4qnJj9K9L5o2MN1o7K1L2
7638hJ0kL7o3pJ7K4JQJ9n3P4r5Q4o5L8m0M4j3l6RL0l8M8k1k7N2mn9j4M8l4L5j4
7672a5jRK0K2k2o8O0q0N6J7qK8j9N6l2n2L0k4K9jk9O2j1l9M2k1q2J26n2rK5l1
7704a4M0m6J1M0o7L0J6k5N9o9J2M4o8N1j4o7Q0k6K7K0q8L7K4j1jP4p9L1nj9Kj1
7736a2J8K4l6j8O9j2m5NL7n8M1k8KL6m6J1M9l8LmKrPj1k6KN1j9l0N5m6L0L8m2
7770@oj0m1J05n0j1pjO0k6J1Lm5J6K9J6j9LqK4j8l2J3j2n7L2P2m2J1%m4M2%%l
7805EM4l5Nj5l6J6L3j7J1l0O0rp0J8K6kQJ5J2k7J2nJ8k1Oj6m5O3n6O5j7K3j5k5
$$ y = [-19, 7, 40, 35, -6, -3, 38, 29, 54, -1, 42, -23, 22, 5, 5, 0, -22, 6, -52, -39, 2, 50, -39, -13, -3, -7, -38, -10, -4, -29, -32, -24, 12, 7, 8, -8, -13, 8, -17, -13, 4, -31, -64, -21, 59, -1, 20, -11, -24, 28, -15, -52, -41, 17, -38, -51, 4, -20, -28, -33, -32, -51, -22, 13, -49, -45, 6, -61, -40, -8, 2, 0, 37, -26, -33, -16, 8, 9, 17, 36, -17, 57, -38, 46, -19, 19, -21, 23, 10, -26, -17, 13, -25, 23, 2, -25, 27, 23, -36, -50, -2, -36, -1, -15, -16, -7, 13, 35, 13, -55, 5, -75, -19, -2, -10, 18, -1, 55, 23, -29, 1, -23, 6, 5, -24, 38, 27, -12, 30, 9, -73, 53, 1, -8, 17, -14, 26, -20, -9, 31, -36, -6, 10, -15, 44, -25, -13, 31, -37, 14, 0, -67, 13, -13, 14, 34, -54, -17, 7, -4, -5, 69, -10, 21, 16, -3, -1, -12, 6, 30, -6, -24, 45, 33, -12, -7, 30, -28, 13, -15, -13, 23, -23, -12, 37, -1, 2, -2, 0, -9, -2, -13, -39, -37, 14, -5, -35, 20, -26, 4, 42, 0, -6, -16, -57, 48, -2, -13, -20, -21, 39, 13, 24, 27, -18, -2, 27, 43, 24, 27, 19, 43, 25, -7, 6, -6, -63, -31, 41, -1, 10, 10, -34, 8, 8, 8, 5, 49, 14, 19, 4, -32, -16, 17, 0, 11, -19, 41, 32, -38, -20, 6, 4, 12, 27, 39, 12, 24, 19, 37, 16, 22, 6, -39, 24, -32, 33, 16, 39, 24, -1]
7839aKj0QnJ5j6k7L0Kk1lO7n7O0o3O2n3OJ6p2P9L3o8M8%o0qL2J8J4%j4J0l4O2
7874E2o0L7k8J8L3n7K1j7J0k6J1m1P7l8m7K8O4k4k4%j1O9o8K3J3QJn2L7M2n7L4
7906B8l5k5L9rl2j8R1k8K3k0K6n7K5MrK9lJm3M4j8j8k9M8j3m3l3P6j4kL2j3j3
7939ij0N6jk2k1j2Q0o0j7k3J0M4Qj3K9l1k3J4LJ2m6P0o8M6o6lP7l0l0K2LM0J5
7972D4Ko7j4M6l5MMP7j8Mk4l1Ql2Q9n5jj7K8n5O1J0n1J4J1N5kn2lK4m0M1j0j6
8006aj4N1nm1J0L0l3J8l4Olj7J2N2m7J9k5K1L9o6L0qMKOn7N1k9M1k2K4l5j7Q4
8040D6q4K9J2Rj6mK4J8p5N4J1k6L3Lnp7N2K7K0n2j1j6M8m5P8r5O6l1K5l6K6K7
8072C5m4l5N4j9%L3Lrk8N1m5OK3K0n3kL2l6M9o8qM5N3j7m5rqK1M9k7j4l7K8k4
$$ y = [-1, 1, -9, -1, -6, 9, -7, -34, -4, -2, -23, -26, 41, -16, 44, -19, 43, -10, -4, 12, -60, 19, 52, -16, 32, 32, -28, -36, -4, 14, 28, 28, 14, 24, -10, 52, -8, 29, 1, 19, 52, -5, 16, -1, 9, -17, -6, -47, 30, -8, -55, -27, 37, 13, -11, -11, -22, 47, -21, 2, 15, 23, 24, -28, 9, 51, -6, 28, -7, -32, 7, -2, -34, -52, 39, 11, 34, 14, 40, -17, 8, 12, 3, 32, 29, 30, -13, 31, 13, -5, -34, 14, 1, -42, -75, 1, -13, -15, 17, 4, -9, -19, 37, 36, 14, -7, -19, 61, 1, -16, -39, -29, 15, 23, 10, 39, 8, -15, -1, 2, 14, -32, 38, -30, 16, -50, -53, 24, -6, -36, -14, -11, 29, 44, 46, -21, -35, 11, -24, -20, -16, 61, 43, 47, 23, -8, 0, -32, 57, 2, 1, -16, 12, -43, 18, 28, -23, -9, 2, 57, 55, 3, 0, 24, -16, 25, 15, -1, -15, 36, 31, -10, 0, 30, -3, 15, -19, -13, -16, -33, -21, 31, -16, 3, -22, -1, 38, -28, 2, -6, -2, 0, 6, -51, 0, -29, 12, -10, 14, -21, -38, 46, -38, -9, 3, 12, -4, -8, 16, 34, -41, 13, 24, -2, 31, 34, 29, -48, 4, 31, 51, -1, -12, -28, 20, -25, 53, -42, 24, -7, 18, -18, 8, 35, -9, -44, 10, -9, -9, 24, 27, 18, -10, 41, -4, 2, 25, 45, -8, -10, 22, -14, 35, -33, -41, 4, 57, 40, -5, -14, -22, -1, 48, 21, 7, -30, -2, -26]
8106b6L1N0p7O7j3L0m7j7l8O8m1K1mN5pn2j7kO2j9o7R8o9M2k8j4L3ql1l7P8j2
8138Ik6KJL6Jj2l1J0J7J1J7p0L0Q1r0j4QjL9Mj5l4O2j5j4j1rj9O7q4O3ll4K9n0
8173d5K0J1L6m6K3J4J1o1J4K7k8J6L0o6J6J6J6l4
$$ y = [-26, 5, 55, -22, 45, 32, 62, 15, -2, -40, 28, -13, 8, 4, 59, 52, 0, -17, -19, 43, 24, -43, 55, -14, 28, 0, -14, 19, 11, -20, -57, 21, 9, -17, -15, -14, 22, 23, 11, -20, -10, 7, 18, 35, -35, -5, 76, -14, -28, -20, -21, 18, 22, 7, -27, 35, 20, 6, -5, -14, -33, 34, -50, 13, 10, -24, 5, -45, -25, -14, 22, -24, -1, 13, 24, -37, -23, 4, -24, -8, 22, -44, -28, -12, 4, -30]
8191c0
$$ Imaginary data points
##PAGE= N=2
##DATA TABLE= (X++(I..I)), XYDATA
0@%%%%%%%%%%%%qJ6j6K0k8L2m0N5o3P2q8J04j23J47j72J98k29K65l05L50l99M53
34B41n12N78o52P33q21R16j020J137j266J404j554J719j901K098k312K549k808
51a471L092l408L755m141M574n061N615o251O988p855Q891j0155J1741j3794J6566
66I086k0539K6760l8200R0772l43752J82973L92073m84166R7986L63192l73123
77i6938j09040M04138j92660j46892K75937r6707j84826J86373o041n7456R5005
88G0893j02229n6260J53778o5093l1365J16409j30433n0179J92740r4173q3186
99g9098J79202r6003j30519J97754k7124j26250J62228n6908j65701K05439K6793
110H9813j95330J41950L6496k06990J47912J12185k18021O8331J31378j97662
$$ y = [0, 0, 0, 0, 0, 0, 0, 0, 0, 0, 0, 0, 0, -8, 8, -8, 12, -16, 16, -24, 31, -32, 40, -48, 56, -67, 80, -92, 106, -123, 142, -163, 187, -212, 241, -271, 307, -345, 388, -433, 483, -537, 600, -666, 738, -816, 903, -998, 1100, -1212, 1337, -1471, 1621, -1787, 1968, -2173, 2401, -2660, 2955, -3296, 3692, -4163, 4728, -5427, 6314, -7480, 9086, -11453, 15307, -22893, 67879, -275873, -92900, 299173, -184993, -87007, 276185, -96938, -205978, 198160, 5500, -141392, 134545, 37838, -146988, 39385, 33344, -24112, 70893, -31336, -87596, 66182, 1089, -30276, 86133, -44300, -94479, 98261, 4088, -79098, 100104, 4101, -126418, 71336, 44212, -82038, 80190, 23282, -142419, 63020, 89813, -105517, 36433, 72929, -134061, 13851, 126036, -91985, -23654, 107724, -89938]
120h9938L3688J81566j47408m3974J34432j00518k5422J42552p8352o4367R4384
131C6643n2664k0657J03175o9179m6353R5210o3454l5044J27720o0654q8311J14085
143D0517k5727q3117J23214p766j28937Q9773M1034j04826O8684M7523j17368
154e6996L5401P3782q3051K0063O6096q7901m092Q1007n2861j2038O4011n8986
166a5565k5758P7322k8020l4457N5723k9310l9030O1946n454m1222M0509j0196
178F488l9861M7092O694m0718K9616q76l8885M0864J3465m6067K5062J3236m4752
191b8642L0521K9085n0436J0571L2160m3060Q998M3735m0827j2451M1023k5993
203e316j2041M2577k2178k6335L5696p910k1217L2403p495k9091K6689K604k2715
$$ y = [-89938, -56250, 125316, -22092, -66066, 68366, -32152, -57574, 84978, 6626, -57741, 36643, -16021, -36678, 66497, -2682, -49035, 46175, -17279, -52323, 75397, 14743, -73568, 40517, 14790, -68327, 54887, 47121, -81816, 7957, 48991, -55835, 12849, 60372, -56996, -21595, 52187, -30864, -10801, 55295, -32606, -36698, 44309, -8552, -20590, 43421, -15565, -41323, 35999, 7979, -26478, 29245, -65, -39095, 22851, 17397, -23825, 16684, 6488, -33373, 13719, 20413, -20305, 9311, 8435, -30450, 10414, 23879, -22188, 2874, 16110, -28642, 1879, 30964, -19472, -8901, 23259, -19801, -10803, 32932, -7895, -20346, 20677, -5316, -17357, 25220, 3042, -23293, 12403, 4493, -16724, 15679, 8184, -20907, 5782, 8386, -14329]
216a4329K3675Q93k8985K0113J0014k3537J6398P847k8229J3755J6394k3282Q393
229h80J4047k5130O096K0806k0497L10J8168k0397j590K3256j5716p430J9876
242A0919j3506q634K2596q722j3824J8304n003j3465J8207r88j6432J3406K328
255E186j4406J2053M575j5429P759O673j2560O216P372j2719L026Q699r942J669
269a828Q365r484o84R123o978j683Q323o426l049Q470m248l831P609l631m782
284d734P722j726n503O657q24o156O367J059o793M869K245o783L702L857o615
299b656J792M578n737N25N212m802j178N314l463k052N004k415k808M402j213
314E03l031L806m81l227L248J66k990K647N77l124K282J054k951J877J123k895
$$ y = [-14329, 9346, 10239, -18746, 1367, 11381, -12156, 4242, 12089, -16140, -2385, 14009, -9273, -880, 13167, -11963, -5867, 14939, -5558, -5248, 12920, -7477, -9067, 14189, -1527, -8957, 10919, -2587, -11221, 11375, 2653, -11171, 7133, 2130, -11335, 6872, 5884, -10548, 2858, 5186, -9220, 2833, 7408, -8021, -262, 6411, -6149, 67, 7439, -5280, -2254, 6445, -3497, -1828, 6537, -2947, -3631, 5492, -1486, -3169, 5154, -1272, -4321, 4149, -99, -3930, 3679, 48, -4734, 2988, 1262, -4241, 2416, 1592, -4564, 1803, 2862, -3931, 938, 3183, -3600, 102, 3959, -2656, -864, 3714, -2023, -1498, 3714, -1088, -2266, 3048, -415, -2467, 2537, 122, -2686, 1716, 503, -2528, 1278, 797, -2430, 818, 984, -2006, 641, 1218, -1906, 376, 1430, -1521, 356, 1479, -1416]
330a416J626J366k799J357J589l066J161J940k924P52K201l046L79K661k872j30
346a221L022k658p66L318k109j342L382j625j871L302q50k326K932l48k494K652
362I98K45k609J945O26k462J591R63k177Q49Q93j743Q56P79j503N70M62j181J056
380A58M42j705R91O06j652J438Q73k393R63J360j954Q86J637k417L1K136j601
397b01r0J774j901n47K107j247k67J615j945m99K204j299m11K005k236o90K950
414A322j472j038K777k023j810L839r19k295L313j349k951M129K55l576K967k0
430A149l977L789J723m471J872J430m200K718L014m602N57K454l688J787L492
445C047m442j75K991l265J203L936m463r22M034l184K18M846m566k106N249k637
$$ y = [-1416, 210, 1576, -1223, 134, 1723, -1343, -182, 1758, -1166, -414, 1787, -1259, -880, 1781, -1091, -1221, 1801, -857, -1623, 1695, -414, -1756, 1626, 1, -1870, 1432, 582, -1744, 1188, 840, -1654, 998, 1243, -1366, 579, 1205, -1257, 334, 1297, -880, -31, 862, -881, -25, 754, -749, -179, 283, -898, 158, 600, -1105, -114, 492, -1160, 278, 1151, -1242, -279, 1081, -873, 13, 1650, -767, -736, 1400, -201, -291, 1483, -418, -965, 1142, -105, -372, 1243, -702, -1201, 1003, -296, -707, 1298, -938, -1628, 1322, -150, -1188, 1589, -434, -2244, 1595, 676, -1619, 1694, 345, -2606, 1523, 1778, -1798, 1169, 1149, -2828, 961, 2684, -1787, 85, 1515, -2685, 33, 3047, -1555, -998, 1456, -2232, -445, 3047, -1395, -1570, 1421, -1844, -641, 3295, -1168, -2090, 1944, -1240, -1022, 3824, -742, -2848, 2401, -236]
461b36j487N458l636l740N825j399l261N503k188n022N691J53m508M816m22n758
477d211M775J829m992L506J174n638L437K760m627K545J610n266K968L082m768
492a816K310K176n954K715M396n843J425M015o597J110O505n540j274N732n139
507a779j597P274l340l798N346k419k872O100j505m357M220j032k788N201r24
522A730m557L857r8l369M745j07n149L330J169l678L514P35m879K565J741l549
538b000K995R02n027K906K419m588K770K513o083J802N006n245Q6N214n051j559
554b940O323k712l226M904j700l410M529j77l571K826p1k750L067J19l132K612
570F91N3l138L326R48m529K480K337m524J859L345m638J23M359l355r87M070k547
$$ y = [-236, -1723, 3735, 99, -3641, 2184, 785, -2476, 3027, 839, -4183, 1508, 1661, -2847, 1969, 1547, -4211, 564, 2393, -2599, 907, 2081, -3557, -120, 2640, -1987, 558, 2168, -3098, -130, 2952, -1816, 494, 2670, -3284, -569, 3827, -2016, -591, 3424, -3173, -2063, 4442, -1098, -2372, 3360, -1779, -3376, 3898, 558, -3240, 2106, -313, -3185, 2915, 1410, -2947, 1273, 241, -2547, 2654, 1730, -2827, 1030, 932, -2437, 2308, 2201, -2948, 382, 1551, -2127, 1387, 2122, -2757, -192, 1549, -2000, 995, 1897, -3130, -224, 2195, -2393, 377, 2890, -3193, -1391, 3615, -1630, -1544, 3670, -1381, -2940, 3383, 671, -2555, 2349, 649, -2761, 1768, 1591, -1980, 846, 775, -1975, 1092, 1211, -1921, 691, 744, -2394, 932, 1880, -2649, -169, 2168, -2356, -497, 2848, -1790, -1667, 2692, -663, -1650, 2420, -127]
587a27j891M018j508k001L164j373k015L397j174k314L459j169k919M052m39l984
603b824L999M54m711L726J816n363K584K960n061J761L659m900O57M073m297L10
619a157M229m359l41M585l983o23N101m392j666N940l743k491O376l434m020O781
635B803j741m868O362j188n778O178N31o075N293P37o477N358K082o837M454K406
651C240p436M530M166q105L010N151q266K247O968p974l33P587o788j308Q259
666D948n723l386P876l950l657P688l322m862P199j904m846O992j559o003O678
681B169R1o348O128Q25p150N241K547o956L973L003p059L124M168o379K011M109
697C497o390J624N071o072N37N482n932k53O478n253j842O735m289k897P034k881
$$ y = [-127, -2018, 2000, 492, -1509, 1655, 282, -1733, 1664, 490, -1824, 1635, 466, -2453, 1599, 1160, -2824, 1175, 1629, -3082, 644, 2460, -2903, -319, 2641, -2420, -659, 3000, -1900, -1243, 2830, -1467, -1157, 3072, -1287, -1628, 2957, -1026, -1649, 3452, -940, -2606, 3334, -409, -2900, 3476, 42, -3978, 2803, 1062, -3806, 2556, 1368, -4410, 1768, 2299, -3776, 1517, 2254, -4223, 1135, 3217, -3620, 834, 3240, -4196, 334, 4500, -3605, -595, 4556, -3710, -1463, 5505, -2469, -2802, 4785, -2003, -3311, 4948, -775, -4161, 3715, -235, -3892, 3796, 474, -4388, 2811, 907, -3939, 3053, 1494, -4509, 2169, 2260, -4088, 2040, 2865, -4285, 956, 3503, -3453, 520, 3523, -3536, -412, 3756, -2623, -612, 3497, -2893, -1269, 3802, -2270, -1733, 3749, -2183, -2436, 4042, -1211, -3053, 3682, -607, -3504, 3530, 649]
713F49m401O442j514m815O034m70n393M907O66n279M370J360n762L485K411n540
729b850K868L140n951J693M250n211O68M578m837o16N279l655j539M948l151k292
745b678N129j858k974M544j556l303M624m76l935L801Om052L813R79m485K773
761C52J412m217K668K106m436J582K481l986J583K944m220O76L290l738N05L836
777B838l975o53M311l123j089M502k908k307M517j601k736M293j196l550L958
792A281p3l477L263L74l758K693J264l468K162J304l526J624K007l047J205J786
808A614k944P81K274k603M55K043k577K57K402k185r4K147k276l16K675j919q55
825a121K402j636r91K598j108j504K239p46j608K287k61j831J758n0j573J583
$$ y = [649, -3752, 2690, 1176, -3639, 2395, 1925, -3468, 1439, 2105, -3174, 1196, 2556, -3206, 279, 2690, -2850, 18, 3158, -2793, -1100, 3150, -2061, -1393, 3185, -1652, -2268, 3011, -644, -2183, 2765, -386, -2678, 2451, 593, -2381, 2163, 607, -2696, 1928, 1452, -2483, 1318, 1324, -2728, 1085, 2064, -2421, 352, 1764, -2453, 215, 2321, -2115, -533, 1948, -2038, -455, 2489, -1731, -1055, 2235, -1503, -998, 2838, -1137, -1790, 2521, -602, -1691, 2811, -97, -2404, 2113, 512, -2224, 2069, 873, -2677, 1281, 1208, -2269, 994, 1368, -2390, 303, 1567, -1901, 261, 1565, -1961, -337, 1670, -1377, -172, 1614, -1330, -549, 1725, -878, -423, 1620, -957, -700, 1702, -483, -577, 1570, -706, -1022, 1653, -266, -1121, 1281, -355, -1346, 1252, 144, -1360, 879, 133, -1475, 812, 551, -1280, 478, 428, -1145, 438]
841D38L23j649J113M74j504J004P02j459N33P66j268M61Q92j145O9Q06q53q2R81
860F02p46l39P33m45k59P48k43m86N06J4m14L98J61m33J34L39k43j2K95k64j28
881h2K64l9j84J85p1j75K28j3k52J95n2l64M09P4m24K63J70n73L70M20o62J71
903a42N80p23O5Q16p19j79Q27n11l87J012m79o91R38j12q21Q74J8j023P65L91
923D99j035M18N38r67K80P30p75q6O94n96oO59m26k19M68k92K4N57m45k46N04
944B78k99j00O74n18l74O67k91l05Q20l71q40Q02N5o91P65M6j204O45O52q84M12
965f1O40j247O1J352p91j97Q68r19l87J342j96p74P04m45o29J223M7j048O90k11
985B2q25J212K85j224M65K50j052J036P43j529J74O90r12O48J016j471m2R11q52
$$ y = [438, 761, -888, 225, 699, -805, 199, 901, -558, -25, 741, -527, -66, 826, -319, -250, 556, -297, -379, 602, -144, -483, 250, -195, -454, 294, 51, -435, 71, 85, -329, 69, 230, -203, -69, 270, 27, 15, 310, 46, -82, 182, 143, -41, 144, 73, -102, 126, 113, -139, 56, 4, -360, 49, 123, -301, -38, 132, -441, -71, 349, -313, -142, 438, -285, -220, 596, -123, -302, 525, 14, -373, 639, 160, -531, 407, 295, -526, 348, 366, -657, 108, 499, -536, -118, 420, -547, -267, 463, -312, -398, 296, -300, -306, 353, -73, -292, 176, -116, -92, 465, 20, -226, 278, -21, -121, 553, 35, -339, 328, 37, -268, 552, 181, -659, 143, 198, -493, 272, 318, -886, -241, 411, -473, -61, 579, -668, -607, 745, -46, -243, 625, -294, -681, 661, 465, -309, 395, -50, -679, 544, 591, -457, 233, 22, -803, 409, 694, -530, -65, 185, -867, 169, 912, -617, -443, 247, -665, -17, 999, -472, -514, 397, -455]
1004d55M87J141j533m12J363q43nJ615j435j141J785k96q44J539o97j612J317
1021b6N98j002R29k14j482R86P97p71M81o9j340R02J009q39K89N3j262P43J227
1040A009q89m7K13j150O15J286q19k76K24j049N37J453r45o07N91r16R8J858q29
1059C57j264R44l10m41J596j01j652M88N11m15R24J82j387j1P24j16N98Q1j285
1078e77J1O99j60M69K29j338k17J177j03r8M62j008o84J299M60o48K19m37p25
1097i70R51Q38n81k30k65l97P26O29l54k90k78m39R24O79p93l02J2n73P18J063
1117A068r28p41L88l04M17R94o53q92K99K8L07R43p80q37N48n7J24J222q82j317
1137a053J022K69m10J079k48j875P37J146o48M17J02j510J86J353l35r5K07j193
$$ y = [-455, 32, 1173, -360, -772, 591, -252, -257, 1358, -77, -1218, 567, 271, -573, 966, 269, -1343, -26, 572, -430, 499, 285, -1197, -211, 586, -185, 296, 227, -1113, -211, 798, -41, 248, 301, -961, -218, 1009, 120, 73, 286, -864, -249, 1037, 218, -58, 166, -883, -346, 1107, 162, -445, 146, -770, -672, 1186, 357, -907, 37, -273, -714, 882, 781, -871, -383, 128, -287, 637, 819, -568, -579, 145, 29, 627, 708, -577, -566, 133, -27, 442, 671, -667, -884, 293, 190, 92, 554, -454, -1138, 161, 621, -27, 192, -245, -970, -19, 819, 238, 8, -257, -654, 72, 701, 347, 57, -221, -660, 264, 943, 150, -152, -140, -713, 5, 1068, 140, -601, -213, -517, -100, 894, 241, -651, -352, -324, -17, 926, 146, -691, -143, -200, -76, 1146, 264, -1053, -31, 238, -172, 907, 659, -1216, -479, 667, 19, 436, 538, -972, -786, 567, 232, 137, 344, -849]
1155h49J59J314l73j99K63j093M4J516l40n53M02p97j85J447o6r16L74m42k71
1174e65J213K2q64J20j88l92J212K39j235J26K67n58Q52O32j230k66O17k96L43
1193D9P00p76o28O09L0J92N12p32n26O16Q1K3N35p24o73P84J89k77N22m59q92
1214h45P02N82n31K34j00p87N50O31n30J28P1q26M92Q55o31j7L67r55K76J197
1234H63p11m70P91p55k59J336m00q48O95k93n78J215j96j031P33r5o07J099j3
1253D76j260P23K55q48J041K97j497P08O54j172P89O94j511K91J130j175M26R39
1271I60j483QJ330j096mJ204j405k31J473q93m13J360j066p03J686o99p55J447
1289G20p49r12J535k84j072J400m30j083J445o9j223J236r1j277J266K20j423
$$ y = [-849, -690, 624, 251, 52, 315, -778, -734, 782, 442, -111, 291, -506, -691, 756, 690, -226, 148, -294, -565, 648, 670, -194, -74, -262, -654, 558, 797, -438, -312, -45, -603, 249, 881, -349, -615, 2, -294, 49, 749, -27, -655, -46, -16, 176, 688, -44, -570, 46, 127, 150, 685, -39, -712, 72, 261, -16, 506, 47, -845, -143, 439, -92, 142, 42, -745, -195, 436, -94, 34, 105, -721, -229, 626, -5, -22, 345, -610, -334, 863, 152, -318, 473, -282, -541, 795, 395, -453, 242, -51, -629, 586, 390, -641, 92, -3, -610, 489, 476, -784, -61, 194, -654, 387, 684, -813, -105, 549, -623, 166, 860, -651, -360, 770, -405, 21, 960, -523, -515, 815, -281, -285, 919, -486, -717, 756, -137, -550, 810, -256, -959, 727, 28, -727, 720, -29, -941, 594, 310, -762, 638, 208, -875, 570, 501, -722, 514, 423, -854, 412, 632, -791]
1306g91J091K55j424J017O50j580P07P66j540P74Q99j553M41R92j331L03J160
1323H36j310L8J237j199L9J205j097k18J261r00l41J278q75n42J244o56n71J198
1341F27n91p93J230l64p98J097k59r42J044K6r64R09J60j021P94K97j006P23L06
1360D75r77N50M64r37M30N02q22K37O10p93J01O30p66J26O72p55o1P07o67r1P56
1381C91m84l68P56l45l72P11k15n32O47m5n04N94l1n17M73J63n45L50J46n32K81
1402B2K39m59K03K31m67R4L02l28L5L24m22Q2L38l32k1L68l53q2M66k42k07L88
1424A79j24k85L82L4l80L28J21m06J83J57k77N6J42k06R9P7j46L2j1q4J33rj12
1447a17J06j7q0J33J28k75J72l3j38K61M7k90K23J44m45K72K32m71R8L73m21j20
$$ y = [-791, 300, 555, -869, 148, 798, -782, -75, 691, -849, -75, 824, -729, -288, 704, -627, -324, 836, -474, -436, 801, -398, -359, 846, -251, -469, 792, -108, -449, 829, -46, -588, 656, 0, -571, 627, 36, -757, 473, 109, -689, 408, 149, -793, 251, 277, -687, 222, 382, -639, 155, 452, -554, 169, 475, -502, 48, 512, -425, 5, 507, -315, -78, 532, -261, -160, 470, -296, -170, 502, -253, -314, 393, -274, -365, 391, -93, -461, 295, -50, -422, 289, 74, -458, 189, 144, -360, 234, 203, -314, 159, 322, -223, 127, 273, -259, 22, 261, -198, 5, 236, -231, -137, 165, -163, -128, 196, -226, -144, 194, -138, -159, 209, -144, -226, 240, -2, -209, 179, 55, -230, 152, 186, -194, 134, 255, -151, 32, 189, -88, -32, 110, -96, 3, 80, -66, -34, -45, -129, 4, -5, -117, -11, -28, -108, 25, 153, -122, 50, 17, -121, 140, 187, -103, 120, 264, -181, 91, 323, -148, -50, 323, -98, -218]
1469b18N36l58k51M27j01l21L40K1l76K62J98k60j5K38k16M7J18j07m8J56q7O5
1491E0J10j32k6J29j36PK02j52p3P3K3p6j5j1k3k0K9n8Q5l6pN5j01J05M0m0j02
1518a00J35n9J8J53n3j85J48O7j90J83O8k90K0K96k53NL24l97r1L68j83j89M04
1541A99k53k66M11ml65M48j68k46L82K3l51L14K4m39M52J47n38K95J35m41K54
1562A3K67n28K33K22m47K82K07m89J08L46m62J49M21n86J7N69n58M1O50n37k26
1583c08O29k71k70O33l06l88N26j99k68N59k59m10O00j49m17N19q9n42N53Ln05
1604c59N11K3o25M99J88n69L96J70o12L41L61n68K46L43o20J93N30n88P9N02o75
1625b34J6O76m83k15O28m98k80P33k91l01M17j54m13N48p5l71M04m6l59M38K9
$$ y = [-218, 318, -40, -291, 136, 35, -286, 54, 75, -301, -39, 159, -101, -116, 122, -94, -47, 71, -36, -84, 72, -15, 50, 160, 28, 2, 131, -5, 2, 204, 52, -21, 52, 75, -1, -16, -27, -50, -70, -41, -99, -14, -50, -57, -2, -103, 2, 42, 2, -100, 35, -24, -6, 147, 94, -91, 57, 124, -66, 117, 185, -105, -85, 211, -42, -37, 287, -110, -201, 167, -16, -205, 199, -54, -320, 91, 87, -278, 170, 2, -244, 138, 161, -190, 124, 148, -291, 161, 308, -230, 65, 200, -241, 13, 280, -248, -15, 207, -240, 42, 249, -240, -132, 214, -248, -99, 322, -264, -247, 322, -236, -195, 455, -82, -308, 321, 50, -220, 413, 107, -281, 245, 46, -222, 337, 78, -332, 268, 119, -298, 221, 132, -410, 143, 146, -359, 152, 175, -450, 49, 237, -332, 64, 234, -378, -37, 324, -244, 2, 345, -275, -82, 448, -140, -61, 441, -234, -218, 458, -25, -240, 388, -110, -390, 343, 52, -249, 168, 14, -399, 149, 74, -297, 107, 61, -298, 140, 169]
1646A69m23L89m2m40M79J53n35L16K11n37K90L87n36j2L87l36o3M46l18k02L67
1667A50j30k39M01j15k91K28p5j06L35j40k24L07p6j96L50j00l09L15R0l80L85
1688A80Q8n52L05K19m10J86K89n25ON09m60M6M48n14j10N42k74k37N36l03l73
1709d04O33o8m93N41q7m20N04N3m67L61j5l96L84Q3m30L48N3n55N07J43o42L83
1731A6K25o43L60L68o74K25M87o98J08O52o22mN84n66k2O45n24k16P37m83k62
1752c07Q02m40m24O96k50m08O86k33n30N88l0n29N26Jn99N47N4m75L87Q5n26M21
1774D2J55n57M17K55o76L22M17o28K90L55o57K00N11o59R8N13o64R5N96n83m6
1795b04N43n03j56O78m86k35O44l82l31P61k71m06N80j52m42O04l4n67N66J3n61
$$ y = [169, -254, 135, 93, -347, 132, 285, -250, 66, 277, -260, 30, 417, -119, -131, 256, -80, -143, 303, -15, -217, 150, 20, -219, 182, 67, -224, 4, -71, -177, 158, 18, -206, 101, 25, -171, 179, 79, -230, 85, 175, -205, 180, 268, -284, 21, 240, -170, 16, 305, -220, -214, 295, -165, -119, 329, -185, -295, 247, -27, -264, 272, -31, -404, 229, 161, -332, 209, 122, -298, 206, 259, -208, 153, 138, -258, 126, 209, -221, 127, 180, -375, 132, 275, -367, 16, 241, -402, -42, 326, -348, -123, 364, -334, -226, 426, -196, -200, 384, -182, -204, 441, -83, -299, 438, -45, -307, 495, 55, -369, 327, 77, -331, 355, 122, -408, 180, 150, -379, 147, 148, -451, 96, 150, -325, 62, 147, -379, 42, 197, -360, 57, 312, -364, -42, 375, -253, 37, 392, -265, -65, 446, -213, -115, 398, -266, -171, 425, -158, -204, 339, -164, -320, 358, -128, -363, 281, -101, -432, 329, 58, -348, 232, 80, -362, 242, 208, -359, 207, 220, -341]
1816c41M67K06o38L25K86n33K66K87n98K14L79n69J37M31m91m5M45l73o0M56l70
1837a19o2M53l23j74N10k83k74N28j84k69L84nm55M84l4m02K78J44m15L00J73
1858B55m79K32J89m57K35K39m21P4L35l31J5M02l69j06L98k02k31M76k36k05M06
1879B19j59k57L86o3k91K98Ok97L09m0l07K62J5k90J99J35m01J94K30l51Q9L25
1901B11l86N6K99k43n1L01k63p5L54j60j72L80j96k04K87q1j23J66j5k60K73M0
1923A38k73J72O4l51K37J30k41J33J19k94P4K00k58L6K73k53q0L88j82j85L09
1944A56j02j66L37j23k93L31Ml02K57Q9m17K55J60m16K63J69m32J85J83l36Q3
1965a15L32m00M0L90m04J8L91l24j17M82l19j81N28k70k92N14j71l30M22p4l92
$$ y = [-341, 126, 332, -306, 19, 305, -228, 38, 325, -273, -59, 320, -249, -112, 319, -172, -217, 228, -145, -205, 251, -119, -181, 272, -51, -225, 285, 2, -272, 256, 72, -197, 187, 182, -273, 211, 177, -225, 53, 197, -218, 82, 255, -224, 8, 197, -260, -25, 214, -207, -133, 202, -129, -114, 288, -81, -187, 211, 9, -222, 254, 18, -187, 219, 60, -197, 189, 126, -165, 133, 139, -158, 151, 111, -196, 66, 81, -209, -10, 125, -276, -82, 148, -203, -114, 211, -175, -119, 180, -63, -114, 187, -76, -151, 203, 43, -129, 251, 55, -149, 138, 57, -66, 100, 85, -175, 98, 138, -135, 37, 101, -250, -13, 117, -124, 9, 128, -166, -92, 108, -150, -114, 159, -94, -174, 214, 32, -153, 156, 54, -112, 225, 102, -191, 140, 144, -158, 99, 188, -229, 26, 186, -230, 33, 202, -230, -45, 138, -198, -115, 217, -183, -143, 247, -157, -139, 252, -72, -189, 293, -26, -207, 321, 51, -241, 273, 102, -228, 194, 120, -272]
1986b72M05K4l94L71Om99L95J22m30K89J93n09K13L47m79J58L09m34J60L50m81
2007a56R2L71m49M1M77n37K7M55m52o3N25l81j70N31l54k86N53j86l97N18q8m15
2029c44M42L2n00M67Q2m39L61J29m99K91K10m41K68J99l88J25K95m09J31J89l09
2050a08M5J87k64R4J50j54n1K40k26L1J96k39n7K53j20j29K69j29j01K80j15k07
2072a55K87q8j64K54k5k41K14kj38J07R4k40J06J16k16K6J35j68lJ45j21O2O5
2095E0p1q6Q3R0j19O3K1r2N9J06m6n2K2k6lR6n2o1R0p6m5L9J6p6R0p4L3L3Rn0
2125b9M5o4m2R3J0p9P2L7j40J66J3p9k1J03n7pN5p0j8R5n4l0K0n9k3P5K2j06R4
2154B2p1l5M7JqL3j2r2J08jLK5Jl2Q7J6p9L5j5k2L6M2k8Qm3q6P3Q3j18k1L5J2
$$ y = [-272, 133, 157, -237, 134, 140, -359, 36, 158, -272, 17, 210, -299, -86, 261, -218, -60, 249, -185, -25, 325, -156, -64, 307, -142, -101, 376, -161, -134, 321, -131, -194, 331, -50, -220, 311, -43, -329, 224, 38, -359, 159, 71, -344, 98, 130, -370, 97, 179, -260, 101, 230, -269, 22, 232, -209, 59, 258, -130, -5, 290, -119, 12, 201, -108, -63, 124, -140, -46, 104, -50, -101, 139, -87, -56, 140, -99, -156, 97, -23, -152, 117, -12, -113, 167, 52, -155, 132, 44, -120, 134, 109, -132, 82, 80, -58, 49, 143, -97, 9, 125, -91, -65, 70, -98, -101, 44, -77, -15, 50, -21, -107, -24, 66, -53, 10, 31, -61, -2, 104, 58, 6, 28, 2, -1, 95, 43, -18, 72, -4, -49, -10, 6, -70, 20, -54, -21, 12, 21, -29, 16, -48, -90, 3, 13, -66, 6, 43, -97, 69, 82, 3, -18, 85, 28, 21, 76, 6, -12, 83, 29, -1, 19, -40, -63, 12, 34, -72, 22, -49, -84, -37, -36, -44, -11, -23, -115, -7, -8, -5, 20, 21, -11, 76, 92, 13, 48, 33, 11, 47, 89, 61, 69, 26, -60, 13, 96, -22, -43, -8, 4]
2186Dm8L8Qm6j4K5O3m7m6P9k5k7J18p6j9M4M9r0kJ31q1o0J04o0l1M0K5j35Q7r
2216aJ9j6jOm3N7mOq8N8M4p8%O3q7OJ49r3N6K5r2J9J7on0Q3l0p5Q5O7j21KN3o9
2250c9J0M1%o5N7r7O6P7l8j13J10k4n2J75q5o8P1l1J4M5j8LK0n4k2K7K9n2j1K6
2280BJ4rJ1r0K6K4j7O6j1o8mO4M4m4M0o5QO8jnK4m1o4Q8J6n6L0m3j3Rkkk2L9l4
2315a8L0Qm3l7J6j1P8J1%m6l5J04m8M3l6k8L5ppK7J5k6m0Q4m3J1l6Qj7R4r3q7
2347i4J69j03m4J04p6lP2l6o6J27p1J5Q2p2n3J04mj18J22l3j06J05R4j91R6J4
2373C4j30J03N7j38K3J30j27k5R1r9oJ78j31j5R5m0n1R0m5j2P0n5k0J9QL1k4K5
2401C6l7N9p9KP1o1k2jk0J7Q1p5n1R4p6k2J63j03l5M2M8q1J44l2r4J22o7n8J57
$$ y = [4, -44, -6, 2, -44, -58, -33, 30, -17, -63, 16, -9, -36, 82, 6, -13, 31, 80, -10, -12, 119, 38, -22, 82, 22, -9, 31, 56, -79, 8, -1, 18, 2, 1, 7, -36, 21, 17, 23, -65, -7, 37, -41, -41, 22, -65, -59, 90, -3, 53, 78, -14, 5, 22, 16, -34, 49, 19, -56, 29, 96, -25, -23, 30, -39, -29, 12, 12, -53, 4, -93, -27, 50, 12, -101, 9, -15, -67, 108, 23, -45, 26, -5, 9, 54, 36, 39, 59, 5, -17, 10, 39, -13, -24, 2, 16, 7, 18, -72, -46, -22, -39, 27, 16, -52, -56, 8, 52, 8, 48, -17, -9, 59, 58, 53, 77, 36, -28, 60, 76, 20, 50, 7, -6, 3, 1, -1, -23, 16, -18, 12, 20, -23, -60, -44, -55, 23, 34, 34, -12, -47, 57, 9, 52, 16, -12, 23, 16, 9, 36, 51, 25, -15, 69, 26, 37, 1, 9, -8, 86, -7, -94, 75, -28, -72, 32, -44, -47, 25, -11, -77, 50, -21, -6, 76, 4, -49, 55, 51, -67, 55, 22, -84, 21, 115, -76, 20, 34, -96, 7, 64, -74, -51, 79, -48, -73, 18, -81, -87, 91, -40, -55, 40, 0, -51, 39, -6, -18, 52, -3, -23, -4, 4, 35, 11, 36, -1, 58, -21, -19, 52, -9, -31, -32, -52, -35, 46, -29, -80, 14, -62, -84, 79, -24, -59, -17, 31, -50, 94, 62, -32, 90, 23, -35, 122]
2430A22n9o2J5J0m1R6n1q2L4J6q2Q7P3j32P6k5r0Q3jj03R7K1n9N3K8l2l0O8o3
2459c3N5L2k1J2Kk0j7oN4q7P9n1k4L7o2O0M9m4m9j4L8K0J7o6M1JoP0r6J2jQ1k9
2492C4m2j5N9n5R5k5n8M2r8K4K0ML8k1N5L1j00n6J12n6o1K6K6J9O8m9o3J21n9
2521A6p5M8M3o7N4O2m8o9R3j09R6j3p4K4N2j17N0J33j52m2J59j17n5J95j20k3
2547e6J15n8j06K09j33m2K09j01j46K25j9j64J72J8j80J44pj77J23Rj23J06K9
2570D7j26O5J28k38J08J73k01J4J76k15L9J37j79j2K17j56n9K03j09j08K05k6
2592H3j23K12j57j09K56j20j59K46j02j54J98j0j89J33O4j32R7O0k01J27O5k71
2614a86J65J43k99J30J88k52O5J78k21P0J42k01O0J74j82k9K52k33l0J85j35j05
$$ y = [122, 63, 1, 16, 26, -15, 81, 30, -52, -18, -2, -84, 3, 76, -56, 20, -5, -95, -12, -13, -116, -19, 2, -57, -4, 24, -8, -38, 30, -33, 22, 54, 33, 45, 47, 27, 10, 4, 58, -29, 50, -1, -25, 12, -50, 10, 59, 15, -34, -48, -10, 10, 27, -39, 2, 3, -3, 67, -29, -17, -18, 63, 34, -8, -23, 36, -19, 76, 51, -7, 35, -63, -39, -19, -15, 23, 2, 57, 88, -12, -68, 44, -12, -73, -47, -21, -2, 66, 17, -46, 75, 16, -59, -11, 32, -35, 19, 81, 33, -36, 57, -52, 44, 31, -43, -19, 33, -84, -34, 99, -53, -95, 64, -53, -108, 87, -33, -56, 59, 1, -105, 104, -29, -71, 138, 37, -109, 116, 97, -67, 105, 123, -57, 87, 80, -97, 26, 35, -88, 18, 47, -79, -14, 114, -124, -16, 157, -44, -30, 146, -69, -30, 107, -72, -84, 133, -23, -82, 121, 12, -96, 109, 83, -40, 172, 15, -94, 162, 42, -117, 129, 27, -127, 71, 61, -128, 5, 69, -63, 34, 94, -107, 20, 85, -186, -21, 122, -177, -47, 141, -111, -46, 132, -89, -19, 123, -78, -18, 156, -26, -55, 197, -36, -66, 119, -16, -121]
2636a21K41q9j51J57j0j60K23j34j02K22m1k00K54k3k18K11M8j67J17L8k06P7
2658c4J54k28R4Q8j94J28P4k12Q6J12j56L1J73k42J1J95j97P3J74j82l0K11j44
2681a5n3J39j04n1K35j73m1J94j39p0K02r8j52J84K9k24J71J7j58J80o6j28J28
2704GP5k09R0R6j61P9P1j71Q4J27j61J15R0j54JJ22j58J2J82j23l2R9n9r2J54
2729H4r1k1J15j06k3R0o2r1J41o9p0J17l0n7J09m9l9P1J7n6R8m5o5L5M7j16O7
2756AP1r7J3O6j06K6P2l7oK4m7n8R3o6M8K8o2k8P5Jl8L3L1r1J27q4m4P2Rp1K6
2787a9N3p9O0NL3o4P5p4k9L7m9J9jO8q2j3Q0p0M2J6n3Q3k0pj7O3m2n4Q9l0m4L
2819b1L7m3O8j8o6N2l1K1nL2l5l9OPk5L4K4o3M5o0M3l4M9J3L4j3j2pM3Rl6M5l0
$$ y = [-121, 120, 31, -120, 37, 27, -133, 90, -44, -146, 76, 35, -165, 89, 66, -152, 59, 107, -60, 57, 95, -111, -34, 120, -108, -14, 74, -120, 8, 82, -130, -44, 68, -88, -57, 116, -126, -115, 80, -117, -44, 130, -52, -82, 129, -15, -68, 71, -33, -84, 151, -22, -63, 131, -8, -78, 124, 26, -126, 58, 87, -137, 34, 51, -107, 73, 7, -121, 7, 82, -127, -37, 59, -102, -23, 48, -123, -39, 88, -73, 42, 132, -22, -21, 101, -57, -45, 137, 14, -18, 81, 22, -70, 84, -7, -28, 87, -19, -42, 48, -14, -105, 36, -33, -103, 14, -16, -73, 36, -13, -52, 19, 36, -20, 78, 33, -32, 3, 50, -66, 1, 72, -25, -12, 54, -52, -26, 46, 9, 3, 27, -20, -78, 15, -51, -3, 25, -37, -65, 10, 11, -27, 6, 37, -54, 73, -11, -55, 17, 26, -45, -19, 34, -45, 15, 20, 53, -11, 64, -10, -39, -2, -51, -32, -33, 35, -47, -60, 20, -50, -8, 8, -45, 38, 18, 11, -6, 57, 15, -39, 50, 20, -24, -21, 16, -27, 41, 23, -43, 9, -22, -1, -6, 26, -9, -48, -42, -35, -60, -26, -2, -65, -20, -80, -37, -71, -22, -9, 25, 12, 0, -7, 36, 45, 9, 54, 24]
2852B4P6q6L3%k9j3JJ0o9Q0j6q5OM6J7L8o1J1L5o7K2M0l7kK7Pppj0RM1p6N9l2
2886a5L5K4j1J0k9NKm7K7jmMj4l7M2l7N7J0l3m0K9M6m9OM3k2n4N5l9j7N9j7n0
2919f2P4J3j12J34l1l8K8m2l9J03m9rN4Lm0K1qk0P1n0k0J9P4q5j1J60k11M4J02
2948G3j33%J08o3m4R7n2j4O6l5r1Q5j5j04J26k3p6R3rp2Q9M1j42J73p1q9J22K1
2976F1r8R9j3j46J07J9p4rJ36j37J00Q5k20O2J72k30P4M2r5j1J06n5p4J12l0r9
3002a16J75n2j42J92n7q6J62j03k5P5L8j43J55Mj13O7N5j43Q2O2j78J22J04k83
3026a48Q0J15j19k3J54j33QJ22j03K6N7o5j0R9q7j6J78j61o6J39m7r1J19oj72
3051a50K17k5j78K04o9m6O7K8j70J81J3j23L0Q1j65P9O8j00K5Q8p8J1R0p4oO2
$$ y = [24, 100, 14, 47, 47, 18, 5, 6, 16, -53, 27, 11, -74, -68, -22, -5, 33, -28, -17, 18, -49, -27, 13, -24, -26, 1, 8, 1, -6, -16, -7, 34, -42, 17, -15, 20, 44, 33, 43, 14, 19, 21, -26, 1, 0, -4, 0, -14, -51, -9, -46, 11, 21, -12, -52, -23, 23, -26, -20, 23, 1, -53, 2, -37, -54, 5, -12, -62, 12, 25, -87, 47, 16, -22, 6, -36, -75, 28, -21, -30, 24, 27, -13, 8, 0, -20, 51, 1, -19, 0, 74, -11, -22, 138, -73, -29, 73, -60, -60, 48, -15, -59, 38, -14, -28, 38, 3, -88, -3, -18, -122, 4, -19, -95, -2, -11, -83, 6, 47, -95, 78, 7, -82, 40, 61, -37, 62, 49, -97, 10, 29, -45, -54, 82, -55, 45, 130, -90, -28, 144, -86, -12, 30, -65, -76, 30, -25, -99, 13, -17, -116, 59, 7, -135, 57, 0, -86, 76, -27, -52, 23, 61, -82, 73, 77, -36, 31, 86, -57, 25, 87, -91, 31, 135, -148, -68, 47, -72, -95, 59, -74, -66, 56, -47, -21, 36, -29, -39, 60, -27, -43, 135, -26, -92, 47, 0, -91, 28, 22, -150, 67, 42, -136, 68, -1, -47, 20, 48, -122, 59, 72, -51, -21, 60, -105, -26, 42, -58, -33, 55, -23, -12, 78, 4, -2, 60]
3077F0q7pR7r3L7N8j14p4J70p8k2R6p4q0J29rr4P0O0j18J09J2j26J32l4n5L1J9
3105A5n0N5L8j30J11Oo5O7j4q6N6L9r4N2M4l6r9Q4rj1M8r7J1Q2j15J06j2jn8P3
3135A0Nm4N5nK2j5p0J6M2J4m1O8m2m5J3N0k6RJ1k2pM1q4K6N2q2M2jl6K1L0l6N7
3168B8k1k1k3L3m0l3R1J0r5RO5Jk8j3M7olNq2R1r5N6K4j6l9P8n7J2K4lm5mJ27
3201G7j53K8P4p0N0Rl7L0J7q7M0L5rm1O4r9OP6l2k2M6j6p2J43p3l5O8k0k6Q9j7
3232D3r0M2Lj6M8J3p1P7n1K3k3J6n0O1j6l2j0L0o2M9Jj1O4L1j42N1Q0j18LQ8j0
3263B1J6M7o8m1N2l5k1Q3o4oL5k6j3Q1p0MM6L3p3O8r5n6R0j0jPKq2R6m9M2k5R
3296cl3J3jk5k2J28q3PK4k8QK3k3L6K3o2J5N9p8oP8o2oM0m7K7L1l5m7LJ4k0N5
$$ y = [60, -27, -34, 63, -30, 7, 65, -49, -123, 47, -31, -53, 43, -31, -111, 18, 9, -85, -15, 45, -73, 36, 48, -78, 54, 20, -35, -4, 15, -35, 20, 58, -72, 39, 45, -20, 47, 33, -53, 3, 42, -52, 0, 44, 8, -91, -7, -16, -27, 21, -76, -65, 17, -98, 8, -4, -5, -63, 10, 15, -29, 26, 21, 43, 28, -42, -26, 16, 30, -11, 57, 15, -30, -17, 33, 7, 16, 27, 5, -2, 39, -45, -19, 33, -49, -7, -8, -44, -23, 7, -29, 28, 7, -14, -37, -4, -44, -77, 14, 24, -71, -62, 3, 4, -24, -37, 10, 4, 1, 6, -76, 15, -80, -24, 0, -16, -55, 23, -34, -22, 2, -1, -46, -50, 77, -76, -48, 26, -44, 6, 15, -22, 8, 25, -62, -22, 13, 4, -37, 27, -72, -66, 10, -22, -44, 2, -14, -86, 57, -16, -51, 17, -3, -29, 60, 43, -47, -5, -2, -18, 30, 43, -28, 49, -2, 21, -2, 14, -36, 25, 9, -23, -33, -3, -65, -16, -15, -26, 38, 69, -73, -22, 58, -60, -57, 31, 21, 37, 84, 16, -25, 27, -8, -29, 54, -10, -16, 19, -7, -20, 61, -9, -5, 41, 74, 1, 69, -26, -82, 8, -2, -3, 4, 6, -76, 20, -29, 13, -12, -3, -36, -23, -24, -49, -71, 57, -26, -19, 5, -23, -15, 8, -15, 21, 44, -18, -3, 56, -22, -28, 50, -12, -18, 22, -25, 2, 33, -2, -49, -46, -32, -52, 3]
3329Cqn4L6J8j7K4Ml7J2K9l0K3ml2LK8j3j6P6l0Kl3k7J01o3L8l9N0o0J8nkKl1
3363c4L1n4R1n7K5lJ3o1P5K0j00M9L2m2m3N0k9PPNJ3J1o5qQ0m9K6MK0m1K9k3N3
3396C2j6NNm4P0r6P4N4j05O3j5l2k2N8m4jnm8L5O9p7MO9j09N2O9o4J1K2k8J4M2
3428D2J7j00O5k0o6M9M6q8Q6l7j0N0k1k2J2K7o7J0L0m8K9J4j2K2j0j4J4M5r4L1
3458b0J1jK0K8m9Nk3L3MPk8M9J9l1j6j1N0q7M1m2L8KJ1lj7j5qK2M0r5K0J21o4
3491A1n6L5K1m3R0o2ML7j4J2k9J2p8R6n4JP0p1k6L2l0L5j6J4n6L6N9k5k1P0l9
3522A5n9R4m6J0K4j14L3O8l0k5M8Pj9k6L0l9R4o5J4Mk2LJ8Mp5L3J6k5K2K5m4p
3554c4J1J7NM8r1M3K4p0N7M8j17L9M6l7RL7J0n5O0k8k2J0j7J2M1l0p0Q8p6LM3
$$ y = [3, -5, -59, -23, -5, -22, 2, 6, -31, -19, 10, -20, 3, -1, -33, -30, -2, -15, -31, 45, 15, 17, -16, -43, 58, -5, 33, -6, 44, -16, 2, -3, -5, -3, -34, -3, -57, 34, -23, 2, -1, 12, -49, 26, 46, -54, -5, 27, -15, -58, -8, -37, -30, -23, -18, -5, 6, -59, -67, 13, -36, -10, -6, 14, -27, 2, -21, 32, 16, 21, 26, -18, 52, -44, 30, 84, -21, 42, 27, -5, -27, 31, -13, -14, -19, -67, -32, 37, -40, -36, 33, -76, -24, 45, -19, -8, 14, -14, 0, 42, 59, -41, 24, 4, -62, -13, 33, -55, 31, -6, -16, 34, 13, -9, 3, 30, -37, -27, 3, -45, -16, -2, -14, 8, -2, -16, -2, 43, -51, -20, -9, -10, 10, 38, -11, -6, -29, 4, 8, 15, -13, 36, 55, 24, 8, -3, 47, -40, 1, -41, -3, -1, 10, 7, -10, -25, -33, -11, 29, -66, -46, 75, 11, -45, -10, 11, -32, 58, -4, 0, 37, 23, 35, 6, 18, -60, 36, -18, -17, 53, -18, -44, -12, -42, -7, -23, -9, -65, -29, 30, 5, -16, 54, 15, -44, 50, 4, 14, 38, -76, -43, 25, -5, -30, 18, 25, 6, -20, 10, -29, 65, 0, 14, 18, -4, -1, 17, 21, -54, -21, -5, -30, -8, 17, -27, -34, -23, -6, -1, 47, -44, -1, 23, -47, 10, 58, -59, -20, 26, -11, -2, 35, 45, -10, 50, 22, 0, 10, -7, 5, 46, 16, -54, 34, -42, -39, 4]
3585DJm3R0m2o8K1k7K5J3O5p0kK9m8K2L1kK7L0j09R9Mj02L6J0j8N1n0l2P2N3j02
3617c2M1K4n1M7M6o0l1R2p7l9O0o3L1O9p9m4J39j18N6K1m0m6M3%qJ9Qn8J3J4k9
3648e2Q1j9K5q1P9o6Q4l9m5M0J6m7L9J2k1k1K2NqJ0j6qmP6p8J0L1l3m0mpP4K2
3681C7p3J2j3j3O1J3J2kK1m2M3J4n3K6K6p8K9k9j0J7J3k0%K6J6%m8O6m8L6n4l6
3713e1J51j05OJ1n2N3J6n2j4P0J3o8J9J1qK9%p3O0ll1k1M0l0k8N3J4l8j3L3nO4
3745E1r9L9M7l0J6m0K9l7J1k5M5K2Pm4l0M2jK7j8J5J0j7j4l6m3K3L0l6O2Nj9K2
3777A4j4jpL8J2m4L3p6O4j5K5k8Kj5N6p2M7nml9j7J8N8p2NM2j9K8j7jkk4J4jK9
3812A2k8K1l4%J3oM3n0O2l4O5l7j1j2%l4N5J2p1J5J9rm7P5l0K3K2o0L4l0lNj3
$$ y = [4, 5, -38, 52, 10, -58, -37, -64, -39, -26, 39, -31, -33, -4, -52, -30, 1, -1, 26, 56, -53, 46, 50, -52, -16, -6, -24, 27, -23, -55, 17, 70, -32, 9, 33, -18, 29, 75, 15, -16, 76, -1, -40, 20, -43, -12, 57, -22, -66, 73, -45, 11, 32, -8, -54, -11, -11, -19, 0, 8, -50, -37, -23, -52, 29, 10, 35, -46, 33, -33, 51, 12, -33, 7, 23, -24, 15, 27, 6, -15, 7, 12, 4, 14, -2, -10, -14, 62, -16, -6, 25, -8, -48, -52, -59, 15, 37, -36, -24, -37, -50, 11, 24, 36, 34, 55, 13, 56, 70, 17, 43, 69, -9, 20, -9, -19, -2, 11, -9, -9, 17, 33, 33, -15, 51, 3, 39, -15, -51, 100, -5, 1, 12, -40, 13, 29, -23, -37, 33, 46, -22, -3, 8, 0, 29, 29, -44, 16, 13, -18, -39, 1, -29, -57, -4, 10, -28, -41, -8, -13, 51, -48, -9, 38, 8, 24, -16, 13, -24, -13, -38, 7, 29, 36, -8, -38, 4, 3, 30, 12, 27, 37, 20, 6, -30, -73, -50, -20, -56, 6, 11, -8, 14, 0, -1, -8, 30, 42, -2, 31, -45, 19, 4, 29, 1, 3, -12, 44, -28, 19, 14, 10, -29, -46, -28, 30, -42, -37, 5, -14, 14, -3, -4, -6, -30, -16, -17, 12, -16, 5, -29, -29, -16, -22, 21, -29, 33, -1, 64, 27, 16, 4, 4, -30, 25, 37, -34, -19, 0, -9, -56, 19, -11, 12, 34, -26, 8, -22, -25, -20, -33]
3845c3M8n4K1jK6lk5J3J0k3RJ4K9r7Q8k2k3N8m3K2lmOo5K8J1RJ4qj0M7p2L2k2
3879b3k6L5O6j06Q4l7NJ5K6o0O0o5J5j1N3o2m6J18r2jJ7l0M6J4o2O3J2L2p0J9
3909a1M3l7K3pMOk7jrK0L9m9rK2ql4K6L6n6M0l7mJ6pKLQLJ9j6m7N0j9NJ9JJ2n
3947A4jK6n8N3n1M5j1Oj1j1L3j3k5K8o3N9mn0L4k6j4Q1l0n0Q1r8N0N0j7m4O8j01
3979e0PM5M4p4J0l6P1L4k5o7PK3L3o4N3l8Q3l6m2N0l7KL6n3M3K3o4M8l1OJ4n5
4011d0K9M7p6R5n3l2j5L7Kp2Q2L2lp8K0M9n7lMOJ4L0k4J7l3N8rl2J6k8M5k5Mk
4045EJ5j0j4K7p4R4l1MK3l4Rk5rN5Pq6M5j6k7M1n5J22n7j9L8k4j6J0Rk6J3J0k
4078BK5j4k4pJ8L7k0l0K7k6N6m4p2O7j6Lok1O8l3pO4m0l3k0lK5j3K5N0r7N3j5
$$ y = [-33, 15, -39, -18, -19, 7, 4, -21, -8, 2, -21, -12, 2, 31, -66, 22, 0, -23, 35, -8, 14, 11, 7, 13, -52, -24, -13, -4, 10, 2, -8, 39, -33, -1, -23, -49, -14, 52, -54, 30, -7, -2, 13, 39, -21, 39, -26, -11, -22, 31, -31, -77, 41, -51, -52, -35, -65, -19, -5, -67, -4, 8, 40, -30, -11, 32, -5, 18, 11, 15, 21, -6, -7, -16, 4, 43, -6, -15, 7, -1, -35, -9, 27, -29, 11, -26, -30, -14, -21, -19, -16, -8, -5, 14, -2, -49, 1, -18, -13, 6, 7, 19, 14, 13, 39, -19, 34, -17, 28, 17, 23, 12, 1, 34, 21, -4, 24, -39, 20, 16, -34, 0, -26, -40, 41, 11, -39, 42, -56, -6, 44, 27, -17, 51, -50, -43, 2, 46, -28, -18, -54, 17, 51, 26, -41, -34, -11, 22, -42, 11, -27, 56, 20, -22, 28, -9, -7, 29, -24, 19, 42, -22, 26, -5, 1, 15, -40, -11, 36, -40, 55, 2, -30, -45, -8, -6, -78, 4, 36, 33, -45, -25, 24, -33, -36, -32, -26, -12, 18, -6, 11, -22, 36, 27, -5, 11, -17, 28, 3, 7, 5, 20, 10, -4, 23, -51, 43, 12, 16, 39, 5, 14, -11, -20, 35, 42, -44, 1, -15, -42, -1, -56, 66, 9, -10, 28, 4, -12, -2, 7, -19, -6, 4, 2, 27, 13, -11, -18, 0, 37, 17, -13, 14, -12, 44, 0, -72, -5, -21, -18, -24, -45, 23, -10, -17, 47, 7, -26, -46, -49, -24, -37, -12, 38, -59, -6, -21]
4111b1lL6%rm8O0o1j5O4J7J2k3n8L6J7%mJ1j2m3J6Q1p5N3l8J0r%RL7l0M6r3K2
4145a5O1m9%l7J3N2j8j6N1p0j5Q5p8O3q9O5K6Ll4N9n5rN9q7M1L9j0l1k5L2K9r
4177C1m8LL7m3J9l1l4P6Jq1R6j3m0j0M0n7L9O1n0K8J2m6L8J3k6Or%L8l5m0O3K9
4210F7r8J6L7l3nk0Q3q3M9Kk1RJ1n3J6nlN6m5QPrn5J17K4o5k5Mj9qP2j7K8nl4
4245Coj7k8M2l5O2oK5p4K2k8K4j0NK4j5J3j2K4k8J5K8m7L3l1k0O4j05L7J7L2k5
4277a7K7j9mL0oj7j3l0P3j3OM4l4j5j3j0%J4L5p9N2k6J3n9J13m3oN0j12O1J1J0
4309B3j17Q3K2k7J0K4l4Rj2l8L7L7n1Rok7K5m7N8L0Rn7O0m3K5O%nj6J5lK5j8m3
4343c7N2J3m2j6N8J6r7O0o6J4M1N0o2OL3rkJ3r6Q3o1L8K4L7j0k4k0l2O1k8J6K3
$$ y = [-21, -24, 12, 12, 3, -45, 15, -46, -61, 3, 20, 32, 9, -49, -13, 4, 4, 0, 11, -1, -44, -28, 53, -22, 31, -7, 3, -6, -6, 3, 40, 10, 56, -37, -15, 46, -3, -3, -40, -27, 25, 7, -9, 42, -28, -43, 42, -36, 27, -62, 3, 29, 32, -2, 57, 2, -7, 52, -35, 6, 45, 35, 4, -21, 11, 40, 31, -17, -14, 23, -20, -1, -32, -66, 10, 11, -70, 26, 13, -27, -37, 3, -54, -15, 46, -4, 24, 36, -10, 28, 41, 15, 21, 12, 12, 50, 15, -25, 38, 67, -31, -15, 22, -11, -16, -36, 47, -36, 13, 15, -6, 3, 14, -39, -23, -28, -31, 25, -20, -12, -5, -14, -69, 48, 72, 7, -18, -14, -33, -41, 31, 14, 42, 37, 3, -3, -20, -48, -6, -41, 21, 15, 40, -34, -12, -40, -16, -26, -21, 3, -12, 1, -11, 13, -15, 0, 28, -19, 14, -17, -37, 27, -78, -41, -24, 8, -17, 10, -9, -13, 17, 11, -6, -19, -49, 24, 11, 17, 61, 27, 12, -1, -11, -11, 3, 38, -41, 11, -15, -2, -61, 52, 9, 3, 53, -59, 2, 13, 23, -94, -11, 11, -16, -6, 18, -16, -7, -19, -57, -20, 17, -34, -25, -31, -58, -33, -80, -22, 8, 17, -40, 20, -23, 2, 8, 8, 3, -13, 2, -1, 24, 6, -37, 15, 28, -14, -30, 28, 44, -53, 7, -59, -45, -4, 46, -16, -10, 23, 14, 12, 25, -71, 12, -49, -11, 13, 50, 40, 16, -4, -36, 25, -3, 13, 36]
4375C6Km7J4J6M9j08L4K6l2L9pm2N3pL7j5m1j9k5M9o7L1%O4q4N2j9M9o4PKkJ0
4408imRl4J9J1l4M8k2oL1n1J8N2k0lj8mkL2k7K5J3n4K8k0ML2oOl1J9%m6L1l3O8
4444B2k2n5N3K7l9k7N0j1k9P6o2K2j1l1L0P2k1m8L7l8lJ3j4L3k2k5J6l0K3J2K6
4475B4n2O2l4l0j8O8J4k2k2pK3J6Pk7m7J5M3RK4k2q2L0M3K%j7m3O1k4Njn0P2j9
4509AjJ2M6n5oj8R1p4j5k0kL3J5k0k2R7m5k7J5nk6KM3o8R6l4Qo5MQ3Kj2J0l1Q
4544B0k5M7q2O8Nm0OK6k5J2KJ5m5K4l8jk6P7r4J7Q8q2O0Nk4j3O6q6MM7K0m0K3
4577A1mK1k9mKl2M0oK2j6L3m0l4M6l%pO1o0%M1m2o7K7O9m0L0l2jJ1Qk6m9Q6q2
4612f6J3OM1L2j8l9j0K9n0Q1k8kKJ3K4mml6Jj5K6K4L2n0l4K1pO2o2J8K0n2NoL0
$$ y = [36, 38, -9, 5, 21, 70, -38, -4, 22, -10, 29, 22, -20, 33, 26, 63, 48, 7, -12, -37, 12, -55, -24, -24, 40, -44, 8, -11, 38, -26, -19, -17, -19, -9, -13, -4, -38, -19, -8, -42, 6, -16, -22, 9, -42, -24, 28, 8, 5, -13, -17, -19, 13, -14, 11, 24, -30, -2, -22, -18, 14, 8, 14, -17, 2, 2, -44, -13, -46, 22, 0, -55, -2, 25, -14, -41, 9, -2, -31, 45, -17, 5, -6, -37, -7, 65, 44, -4, 33, -5, -8, 5, -9, 24, 2, -23, -7, -37, -14, -2, 24, -28, 34, 0, -30, -48, 20, 34, 12, -10, -17, 6, 22, 29, 2, -45, -30, 13, 22, 46, 24, -58, -28, 15, 17, 17, 0, -43, 18, -6, -1, -2, -52, 20, 1, 0, 12, 58, 3, -3, -21, 70, -4, -19, -39, -41, -8, 7, -13, -35, 62, 17, -10, 5, 0, -26, -24, 19, -49, 47, 13, 21, -44, -40, 43, 45, 33, 43, 12, 20, -5, 42, -40, 28, 33, -7, -1, 25, 0, 12, 14, 29, -16, 8, -30, -31, -57, 20, -74, -57, 31, -51, 9, 14, -10, -23, 43, -43, -39, 8, 28, -12, 11, 7, 28, -1, -5, -3, -35, 5, -1, 21, 5, 38, -2, -36, 10, 7, 7, 0, 61, 1, 1, 42, 0, -67, -40, 29, -11, 19, -13, -14, -3, 5, -21, -70, 16, -66, -53, -47, -6, 26, 8, -31, -41, -12, -62, 19, -9, -11, -9, 4, 28, 24, 20, -16, -15, -30, -4, 20, 52, 2, -32, -11, -18, 44, -18, 0, 20, -32, -27, -33, -3]
4647cJ9k2m1K4M6m5nO8j01O5j9n0N5j4j8Q0m9m2k1O6k1L5j2J3m1j0N5L9j5o0M7
4678B3k8J0L3J0o2MM1o7M3p2P3Ok9k9O5m3j1J9J8k2K1mjo3Q4j1Qj4k1L8Pl9N6
4711D3j11Q8m5M6ql4L9pk2O3q1M5J2k2J4J3K4n5MK7m6L6k8k9N8k8Ql0j7M7qJl
4744fJ1j6j8QJ4m2N3k5n7Q3nQJ2m1J6K8kJ0nM3o0k2RLK9k4K1l1l6M0OkM7p7jM2
4780A3k7M4q2N3p2L7rL7M5m9J2K5j3m4M1j9L2n1QM1KK1m4OJ3o1L4KqM5m4mJ4N1
4814D9m7k2J1j4nK3J0J6mk7J0l1M7k1n7L9j3k1Q5m3lJ7o7R2K4j7k4l6MK0K0j8
4846cL0K7n0l0K6Lq4O8N7o0M5j2lm7o9R0k8N0J7m2j1oJ2J1LL5j8n0L5j9N4l7o0
4879f6N1L9l5n8P9L5ml6J3m8pJ11q4L1jNj5k5L1j6k6L0l3J4L0j7p8N7K3j4k3L8
$$ y = [-3, 16, -6, -47, -23, 23, -22, -27, 41, -60, 5, -14, -64, -9, -23, -41, 39, -10, -52, -73, -7, -28, 7, -5, 8, -33, -43, 12, 51, 36, -24, 23, -5, 5, 38, 48, -14, -10, 31, -36, 7, -65, 8, 14, -15, -44, 21, -22, -33, -14, 4, -18, 3, -1, -2, -65, 19, 8, 16, 2, -19, 19, 26, -13, 43, -68, 20, -25, 21, 13, -21, 18, 11, -11, 52, -29, 16, 28, 6, 20, 33, 57, 2, 6, 33, -13, 23, -5, -34, 24, -4, 4, -26, -43, 4, -4, -3, -6, 5, -11, -29, -21, -7, -49, 4, -21, -78, 5, 0, 8, 20, -21, -5, 23, 21, 31, 26, 69, 9, -13, -4, -1, 28, 4, 25, -6, -42, -2, 4, 2, 49, -28, -29, 13, -14, 30, -52, 1, -71, -34, -43, -6, 39, -10, 2, 27, 14, -30, 11, -8, 24, -27, -19, 22, 24, 45, 1, 7, 20, -41, -7, -5, -13, 32, -12, -16, -2, 49, 2, -20, -9, -23, -28, -5, 5, 21, 17, -10, 0, -31, 16, -5, -62, -23, -36, -57, 28, -15, -18, -1, -68, 24, 48, 31, 7, -29, -25, -5, 15, -3, 27, 54, 4, -26, 0, 3, -81, -13, 44, -16, 29, 17, 14, -33, -102, -12, -40, 10, 27, -15, -26, -32, -20, -9, -6, 29, 11, -39, -4, -23, 31, -6, -66, -15, 24, -11, -69, 10, 45, 41, 5, 18, -30, -37, 74, -10, 21, 20, 25, 10, -15, 16, 0, -26, 4, -29, -15, 15, -2, -80, -23, 0, -14, -37, 1]
4911AK9l2K5k0m8LJ5K3J5l7PPl9M1lJ5j7k2L1j3N9l7J0k5L3j02K8K9MjJL3n1R
4945b9L2L1l9MJ0n8K4j0M1l6k2M0j3J0j4N4qm7L0r5J31l0rL9k2rNm4N0rN7j04
4977d0O2l3ql8R3n4J0OM5p5N6l3J2PLm0m6Q9m3k2J4J9j2L6k5k0mJ9Kk3oM1j6N4
5011C0J9k3l3jk6M8l2K0k0K1M2m8j8L1j3kk3K0l0J3OQj4PK6PJ9o3J1k8J33j15
5043b8nO0o8L5p7J32n4kJ9J3J8k2k6L3n4j2Q1n1K1jqRn7N1kl2L5k1J4K4l4K0K1
5076C2k5k3J5rJ1LrJ3m0O4k5n4P7m4O2n6j3j8N6L6m6Nj0M8l3K5k2m9R2p0l4N6
5108A5Mn3J10n2n1K6k0kk0KK8J9OJ3n4lK6L3n9J5Rk0kK1Lm6O3MJ0jl9N0m1%j1
5143a7M8o6lL8kJ4k7M2rk3J1Jk5N8r4K5P5l7n7J6K2J6J1n6jL2j9j4O0m2N7rOp4
$$ y = [1, 30, -2, 23, 3, -45, -42, -27, -4, 11, -26, -19, -12, -51, -10, -13, 2, -15, -37, -6, -19, 40, 3, 13, -12, 21, -81, -53, -24, -20, -21, -20, 13, -38, -29, 3, 34, -5, -1, 9, -49, -25, -35, 6, -30, -52, -12, -25, -15, -29, 25, 17, -30, 0, -95, 36, 6, -3, 36, 14, 5, 10, -34, 16, 7, 64, -40, 22, -11, -19, -57, 36, -18, -8, -2, 43, -32, 24, -9, 3, 10, 13, -27, -73, 16, -27, -49, -35, -16, -28, 8, -17, -37, -41, -22, -20, -43, -49, -8, -24, 30, 49, 26, -7, -8, -34, 14, -18, 2, -18, 3, 45, -3, -21, 10, -3, -5, -28, -8, -38, -25, -19, -11, -25, -18, 8, 15, 34, -29, -18, -46, 87, -28, -33, 27, -41, -6, -83, 49, -5, -7, 12, 25, 43, 21, -5, 28, -26, -38, 43, -8, 13, 12, 4, 13, -44, 7, 5, -27, 8, -13, 1, 25, -9, 11, 32, 7, -16, -1, -10, 1, 4, -5, 8, -32, 32, 7, -47, 30, -14, 48, -8, -21, -39, 17, 53, 7, 12, 2, 50, 17, 42, 20, -29, 63, -7, -41, 15, 19, -34, 76, 24, -27, -1, -21, -23, -43, -41, -13, 6, 12, 25, -29, -32, -6, 27, -32, -17, -8, -28, -30, -9, -6, -52, 11, 15, 25, 24, -15, 35, -6, -6, -17, 31, -35, -38, 0, -2, 12, -15, 27, 18, -5, 6, 7, -18, 40, -54, -29, 46, 9, -48, -32, -10, 6, 17, -39, -40, -8, -27, -41, 19, -23, 34, 25, 31, -43]
5177d3KJ9RL1p1J01j4n1O9l1k4j7K7K2p7K1K1jl7J4K9m8K3JJ5pJ8J8k5k0j0O0
5209B4j1m1K9J3m1J7K8p4L6K7k5j7j5K1O8o5P6l1J8o3J6k7j9O2m1N8Ol2K9J4%
5240D0l8j0NK1j5j7k4j3K1k3L4L4o6QM0N9j40P5l5N9j3M1k3l1M0k7M2p9K0j3o
5271c4L9L3j5j1l5L0J8p5J10n9%k6K1jJ4Qj8J4n1QO3j0j7J7n7J1L1Jm9M5kL5M
5304D2l9O7n2m4nM8K4l0J7J7q9R1p4M6m2j0P%N0L1K2j06M6LOk3m3%L4j1K2k9j5
5337c9M0L5Qk5m6N5m8M1J0l5j7P4l3j6L1m7J9Op7N9j0KQJ1m7J20j01M6o1j9Q2
5368B6m0M2l4k7O8k7J2l2M6n1%LN3l5%J9n7O5l4n1K6K2PPjK2n5L0J4LL1n6LL0
5402B9J6rn1N0m0j3j4J7J8OKl5J9m7M2k7O7k8L2k3k4J1K1lRqm7J4j5J7j1N2j8
$$ y = [-43, -41, -22, -13, 18, -53, 48, 34, -17, 52, 21, -3, -20, 7, 29, -48, -27, -6, -7, -44, -30, -1, -49, -26, -25, -10, -17, 1, 19, -6, -26, -36, 24, 13, -28, 1, 14, -27, -10, 18, -56, -20, 7, -18, -35, -50, -29, 39, -26, 50, 19, 37, -26, -10, -37, -56, 6, -35, 23, 29, -3, 26, 40, 40, 2, -8, -3, 18, 3, -14, -38, -51, -30, -53, -19, 15, -51, -43, -3, 56, -84, -9, -44, 15, 2, 43, 20, -11, 29, 2, 44, -35, -15, -28, -34, 5, 38, 23, 12, -23, 7, 25, -50, 60, 1, 1, -25, -4, -5, 9, 17, -1, 13, -38, -30, 33, 23, 6, 23, -34, -23, 8, 9, -40, 5, 3, 38, 42, 3, 70, 18, -26, -31, 17, 41, 11, 28, 45, -44, 47, -27, 19, -23, -33, -26, -26, 24, 55, 77, -29, 17, 20, 26, 3, -40, -40, -6, -17, 5, -24, -39, 1, 36, 44, 19, -27, 28, -20, 21, 31, -4, -21, 53, 20, 4, 35, -12, 7, 13, -64, -5, -15, -13, -5, 6, -41, 79, -22, 24, -37, -56, 26, -14, 28, -6, -33, 35, 8, 20, -12, 34, -17, -17, -14, 39, 4, 4, 23, -34, 31, -3, -54, -28, -6, 1, 8, 7, 29, -26, 4, 18, 21, 52, -4, -1, 29, 45, 36, -15, 35, -5, -18, -32, -15, 3, 9, 11, -24, -5, -52, -10, -37, 30, 2, 34, 11, -13, -2, 19, 16, 25, 17, -30, -16, -31, -14, -25, 27, 9]
5435Iqnl6N8qR1r6o7P3QK0q0L5J0JM0n7K1Nm2M5ok9k0N2oLj7nqk6J1N9k6M1pJ1
5472D4n8oM5mm7j7L1K6L6J3q4O6Rm2K6r3O2n5P0l7Kj6J9N0n3L6OL2k7l3j8QKN5
5506D8n8M4m8P0m3PK1Ko8K4Jl0L2n2J52j17l8N1L4J2l1M5k7o2J6MJ8orOPj1J0
5539DPJ9o5K9k0%K2j8QK3p9L4M5%J4l5J5L5m5j1L3j9k0l5O8m4N6l2M6j4J2k3K0
5572C0l5J1J4l0L1k0K7o2n5O8k9O1JK7j7l2J9j8JJk1M5k8l3P7j7n4L7j5N9o2L8
5604A9o4N9Nm3J2J7Rjj6m2O0m4L0pRJ7l0k2kL4opj7M1n2N4m7LoPL1o4N7k5M4M
5640A7k1k3L8mJ1L3k7Nk3M4n4m0J6J1J0j8L3Nl8M9k6J4l5M1n3K6J0K0j3k0J1K4
5672B3j05Q0Kl6M7m0M0o0P4l7lL9j1j8N5l1m5K5K2p1M9k4L0L4o9J2l5N2j7K4n8
$$ y = [9, 1, -4, -40, 18, 10, 101, 5, -62, 11, 19, 39, -41, -6, 4, 5, 45, -12, 9, 14, -28, 17, 11, -18, -38, 14, 8, 11, -6, -11, -19, -45, -34, 25, -1, 40, 33, 44, -14, -20, 25, 21, -26, -43, -12, 14, 50, 63, -21, 45, 54, 12, 38, -55, 7, -48, 22, -15, -13, -29, -10, 40, -13, 23, 29, 61, 34, 1, -17, -9, -7, 48, -10, 34, -14, 56, 13, 20, 41, 43, -25, -1, 0, -30, 2, -50, 102, -15, -53, -2, 32, 44, 13, 58, 31, -31, -15, -11, 7, 1, -8, -2, 5, -6, 4, 11, 30, -35, -6, -26, -26, -4, -22, -14, 9, -70, -36, 9, 9, 23, -12, 3, 38, -7, -18, 15, -4, -24, -59, 9, -35, 21, -11, 35, 21, 33, 10, 30, -5, 6, 20, -10, 21, 1, 28, -34, -89, -21, -50, 11, 12, 39, 22, -10, 9, -9, -8, -7, -28, 17, -11, -44, 33, 16, -38, -1, -16, 43, -19, 19, -45, 14, 19, -24, -12, 5, 14, 13, -3, -45, 15, -29, 1, -6, 3, 20, -10, -32, -34, 0, -6, -13, -30, 11, -41, 13, -34, -31, -37, -30, 1, -63, -6, -31, 13, 17, -4, -27, 11, 7, 18, 51, 24, 29, 6, 50, -4, -44, -28, -17, -7, -25, 8, 13, -25, 24, -2, 12, -23, 18, -35, -9, 1, 21, 8, -12, -1, 23, -82, -2, 0, -36, 11, -29, 11, -49, 25, -12, -15, 24, 13, -5, 50, 19, -26, -1, 21, -50, -1, -25, 5, 39, -30, -18, -53, -1, -18, 6, -52]
5703e2L0J6l2QJ2K5o6J18j37K9K7o1J06k3j2N3n5mmRRj4j3K2Lj0k0j3O4rk3L3
5735A6qk5j3K5%j2PL4Mj7p2K1M3rm1R3n7j3N8n9qL5k1K3L7l5JmoJK2lm3l0N3l7
5771d0O1l1j5K3l2J08j09J9N1J5l4Pj4k3J7L6o0mj0m9R7m6L0kj1l1K9m1Q5k3L3
5802C6Jq2L2k1K7pL0k3Oj3J3J5K3Nok8MNJ3k9oj3J8J2K7p9M5lJ3k5M5J2n5P3j18
5837e3O4n6K7Qlm4N5J6j9rk0Pm9Q9p2N0%k3N2l7J0P6j22J0j0O8Nm6j4K7M1m3M4
5870B9l3K2K1k4n0jK6jo6J08k9Qk9MN7j9n8L1o7J07j16L9L5L2k6o2K3K1l5mO1
$$ y = [-52, -22, -6, -38, -30, -18, 7, -59, 59, -78, -49, -22, -83, 23, 0, -12, 41, -14, -18, -22, -13, -4, -18, -31, -9, -6, -16, -36, -49, 15, 6, -17, 16, 8, -17, -30, -5, -5, -17, -10, 24, 28, 11, -61, -40, 3, -6, -47, 46, -11, -24, 34, -25, -33, 2, -19, 4, 41, 6, 7, 3, -3, -2, 20, 17, -26, -56, -3, -40, 21, -10, -25, -2, -34, 74, -35, -16, 35, 50, 16, 23, 9, -14, 3, 39, -21, -25, -35, -84, 13, -33, -3, -5, -16, -47, -18, -59, 26, 3, 36, 37, -45, -13, -34, -7, -14, 16, -7, -1, -14, -1, 14, 37, 42, 36, 8, 12, 17, 30, 1, -5, -18, 0, 12, 39, -40, 5, 2, 15, -10, 35, 47, -8, 65, -53, 11, -45, -18, -10, -13, -57, -2, 14, -5, -14, -34, -27, -76, 13, -59, -9, -9, -32, 20, -17, -7, 69, -53, -43, -53, 15, 20, -26, -40, -13, 28, -15, 29, -4, 18, 39, 15, -35, -36, -10, -11, -77, 31, 2, 10, -19, -15, 42, 23, -35, -4, -71, 36, -80, -41, -6, 26, 0, -62, -39, -18, -53, -57, 4]
$$ [...]
8191C8
##END NTUPLES=NMR FID
##END=
