##TITLE=1H_LR-758-R5-HS-2
 CDCl3
 8 sc, 
 31.8.2023
##JCAMPDX= 6.0         $$ Bruker NMR JCAMP-DX V2.0
##DATA TYPE= NMR FID
##DATA CLASS= NTUPLES
##ORIGIN= UXNMR, Bruker Analytische Messtechnik GmbH
##OWNER= root
$$ XWIN-NMR		Version 3.5
$$ Thu Aug 31 14:49:13 2023 Russian Standard Time (UT+4h)  she@DPX200
##.OBSERVE FREQUENCY= 200.13135
##.OBSERVE NUCLEUS= ^1H
##.DELAY= (6, 6)
##.ACQUISITION MODE= SIMULTANEOUS
##.ACQUISITION SCHEME= undefined
##.AVERAGES= 8
##.DIGITISER RES= 18
##SPECTROMETER/DATA SYSTEM= spect
##.PULSE SEQUENCE= zg30
##.SOLVENT NAME= CDCl3
##.SHIFT REFERENCE= (INTERNAL, CDCl3, 0, 15.7039)
##AUDIT TRAIL= $$ (NUMBER, WHEN, WHO, WHERE, WHAT)
$$ ##TITLE= Audit trail, XWIN-NMR		Version 3.5
$$ ##JCAMPDX= 5.01
$$ ##ORIGIN= Bruker BioSpin GmbH
$$ ##OWNER= she
$$ F:/spectra/data/she/nmr/H-F/1/audita.txt
$$ ##AUDIT TRAIL=  $$ (NUMBER, WHEN, WHO, WHERE, WHAT)
(   1,<2023-08-31 14:47:52.87 +0400>,<she>,<DPX200>,
      <created by zg, POWCHK disabled, PULCHK disabled
       configuration hash MD5:
       00 E9 B6 7A A2 85 ED C7 34 08 36 98 17 FE 4E 26
       data hash MD5: 16K
       FC BE D8 EB 6B 12 44 5C A2 43 04 A7 6F 84 E8 FB>)
$$ ##END=
$$ 
$$ hash MD5
$$ 2E 01 FD BD 1B E2 0D BE 06 08 C6 04 C0 33 28 16
##$RELAX= 
##$RELAX= 
##$RELAX= 
##$RELAX= 
##$RELAX= 
##$RELAX= 
$$ Bruker specific parameters
$$ --------------------------
##$DU= <F:/spectra>
##$EXPNO= 1
##$NAME= <H-F>
##$PROCNO= 1
##$TYPE= <nmr>
##$USER= <she>
##$AMP= (0..31)
100 100 100 100 100 100 100 100 100 100 100 100 100 100 100 100 100 100 
100 100 100 100 100 100 100 100 100 100 100 100 100 100 
##$AQSEQ= 0
##$AQ_mod= 1
##$AUNM= <au_zg>
##$AUTOPOS= <>
##$BF1= 200.13
##$BF2= 200.13
##$BF3= 200.13
##$BF4= 200.13
##$BF5= 200.13
##$BF6= 200.13
##$BF7= 200.13
##$BF8= 200.13
##$BYTORDA= 1
##$CFDGTYP= 0
##$CFRGTYP= 5
##$CHEMSTR= <none>
##$CNST= (0..31)
1 1 145 1 1 1 1 1 1 1 1 1 1 1 1 1 1 1 1 1 1 1 1 1 1 1 1 1 1 1 1 1 
##$CPDPRG= <>
##$CPDPRG1= <>
##$CPDPRG2= <>
##$CPDPRG3= <>
##$CPDPRG4= <mlev>
##$CPDPRG5= <mlev>
##$CPDPRG6= <mlev>
##$CPDPRG7= <mlev>
##$CPDPRG8= <mlev>
##$CPDPRGB= <>
##$CPDPRGT= <>
##$D= (0..31)
0 1.2 0 0 0 0 0 0 0 0.06 0 0.03 0 0 0 0 0.0002 0 0 0 0 0 0 0 0 0 0 0 0 
0 0 0 
##$DATE= 1693478872
##$DBL= (0..7)
120 120 120 120 120 120 120 120 
##$DBP= (0..7)
150 150 150 150 150 150 150 150 
##$DBP07= 0
##$DBPNAM0= <>
##$DBPNAM1= <>
##$DBPNAM2= <>
##$DBPNAM3= <>
##$DBPNAM4= <>
##$DBPNAM5= <>
##$DBPNAM6= <>
##$DBPNAM7= <>
##$DBPOAL= (0..7)
0.5 0.5 0.5 0.5 0.5 0.5 0.5 0.5 
##$DBPOFFS= (0..7)
0 0 0 0 0 0 0 0 
##$DE= 6
##$DECBNUC= <off>
##$DECIM= 32
##$DECNUC= <off>
##$DECSTAT= 4
##$DIGMOD= 1
##$DIGTYP= 9
##$DL= (0..7)
0 120 120 120 120 120 120 120 
##$DP= (0..7)
150 150 150 150 150 150 150 150 
##$DP07= 0
##$DPNAME0= <>
##$DPNAME1= <>
##$DPNAME2= <>
##$DPNAME3= <>
##$DPNAME4= <>
##$DPNAME5= <>
##$DPNAME6= <>
##$DPNAME7= <>
##$DPOAL= (0..7)
0.5 0.5 0.5 0.5 0.5 0.5 0.5 0.5 
##$DPOFFS= (0..7)
0 0 0 0 0 0 0 0 
##$DQDMODE= 0
##$DR= 18
##$DS= 0
##$DSLIST= <SSSSSSSSSSSSSSS>
$$ [...]
##$SUBNAM2= <"">
##$SUBNAM3= <"">
##$SUBNAM4= <"">
##$SUBNAM5= <"">
##$SUBNAM6= <"">
##$SUBNAM7= <"">
##$SUBNAM8= <"">
##$SUBNAM9= <"">
##$SW= 18.05172834244
##$SWIBOX= (0..15)
0 0 2 0 0 0 0 0 0 0 0 0 0 0 0 0 
##$SW_h= 3612.71676300578
##$TD= 16384
##$TD0= 1
##$TE= 0
##$TE2= 300
##$TE3= 300
##$TEG= 300
##$TL= (0..7)
0 120 120 120 120 120 120 120 
##$TP= (0..7)
150 150 150 150 150 150 150 150 
##$TP07= 0
##$TPNAME0= <>
##$TPNAME1= <>
##$TPNAME2= <>
##$TPNAME3= <>
##$TPNAME4= <>
##$TPNAME5= <>
##$TPNAME6= <>
##$TPNAME7= <>
##$TPOAL= (0..7)
0.5 0.5 0.5 0.5 0.5 0.5 0.5 0.5 
##$TPOFFS= (0..7)
0 0 0 0 0 0 0 0 
##$TUNHIN= 0
##$TUNHOUT= 0
##$TUNXOUT= 0
##$USERA1= <user>
##$USERA2= <user>
##$USERA3= <user>
##$USERA4= <user>
##$USERA5= <user>
##$V9= 5
##$VALIST= <valist>
##$VCLIST= <CCCCCCCCCCCCCCC>
##$VD= 0
##$VDLIST= <DDDDDDDDDDDDDDD>
##$VPLIST= <PPPPPPPPPPPPPPP>
##$VTLIST= <TTTTTTTTTTTTTTT>
##$WBST= 1024
##$WBSW= 4
##$XGAIN= (0..3)
0 0 0 0 
##$XL= 0
##$YL= 0
##$YMAX_a= 322019
##$YMIN_a= -360610
##$ZGOPTNS= <>
##$ZL1= 120
##$ZL2= 120
##$ZL3= 120
##$ZL4= 120
##$ABSF1= 10
##$ABSF2= 0
##$ABSG= 5
##$ABSL= 3
##$ALPHA= 0
##$AQORDER= 0
##$ASSFAC= 0
##$ASSFACI= 0
##$ASSFACX= 0
##$ASSWID= 0
##$AUNMP= <proc_1d>
##$AZFE= 0.1
##$AZFW= 0.1
##$BCFW= 1
##$BC_mod= 2
##$BYTORDP= 1
##$COROFFS= 0
##$CY= 11.3945322036743
##$DATMOD= 1
##$DC= 2
##$DFILT= <>
##$DTYPP= 0
##$F1P= 15.7292609196834
##$F2P= 12.9074282941183
##$FCOR= 0.5
##$FTSIZE= 0
##$FT_mod= 4
##$GAMMA= 1
##$GB= 0.15
##$INTBC= 1
##$INTSCL= 1
##$ISEN= 128
##$LB= 0.24
##$LEV0= 0
##$LPBIN= 0
##$MAXI= 10000
##$MC2= 0
##$MEAN= 0
##$ME_mod= 0
##$MI= 1.114404
##$NCOEF= 0
##$NC_proc= 0
##$NLEV= 6
##$NOISF1= 3.799351
##$NOISF2= 2.8
##$NSP= 1
##$NTH_PI= 0
##$NZP= 0
##$OFFSET= 15.70392
##$PC= 1
##$PHC0= -21206.93
##$PHC1= 12.05272
##$PH_mod= 1
##$PKNL= yes
##$PPARMOD= 0
##$PSCAL= 0
##$PSIGN= 0
##$REVERSE= no
##$SF= 200.130013532006
##$SI= 16384
##$SIGF1= 3
##$SIGF2= 2
##$SINO= 400
##$SIOLD= 16384
##$SREGLST= <1H.CDCl3>
##$SSB= 0
##$STSI= 0
##$STSR= 0
##$SW_p= 3612.71676300578
##$SYMM= 0
##$S_DEV= 0
##$TDeff= 0
##$TDoff= 0
##$TI= <>
##$TILT= no
##$TM1= 0
##$TM2= 0
##$TOPLEV= 0
##$USERP1= <user>
##$USERP2= <user>
##$USERP3= <user>
##$USERP4= <user>
##$USERP5= <user>
##$WDW= 1
##$XDIM= 8192
##$YMAX_p= 0
##$YMIN_p= 0
$$ End of Bruker specific parameters
$$ ---------------------------------
##NTUPLES= NMR FID
##VAR_NAME=  TIME,          FID/REAL,        FID/IMAG
##SYMBOL=    X,             R,               I
##VAR_TYPE=  INDEPENDENT,   DEPENDENT,       DEPENDENT
##VAR_FORM=  AFFN,          ASDF,            ASDF
##VAR_DIM=   8192,          8192,            8192
##UNITS=     SECONDS,       ARBITRARY UNITS, ARBITRARY UNITS
##FACTOR=    0.0002768,     1,               1
##FIRST=     0,             0,               0
##LAST=      2.2672688,     0,               0
##MIN=       0,             -360610,         0
##MAX=       2.2672688,     322019,          0
$$ Real data points
##PAGE= N=1
##DATA TABLE= (X++(R..R)), XYDATA
0 0 0 0 0 0 0 0 0 0 0 0 0 8 -8 8 -16 16 -16 24 -32 32 -40 48 -56 72 -80 96 -111 128 -144 168 -191 216 -245
33 -245 277 -311 350 -393 438 -492 547 -606 675 -747 826 -913 1009 -1112 1226 -1351 1488
50 1488 -1638 1805 -1991 2199 -2432 2695 -2997 3344 -3750 4233 -4819 5542 -6467 7692 -9390
65 -9390 11906 -16014 23794 -43450 188754 225276 -360610 82424 215719 -269750 -15806
76 -15806 287072 -160680 -117333 166057 -70053 -65308 168855 -49738 -109699 69971 -13882
87 -13882 -22500 86293 -41829 -42172 41615 -51974 25333 106131 -104251 -54597 115888 -58936
99 -58936 -46208 142417 -52664 -114698 102404 553 -64607 107368 -31575 -116164 107492
110 107492 16828 -104913 110802 23871 -164912 71377 101446 -114727 25444 78535 -116836
121 -116836 1378 106393 -62842 -13479 64954 -78885 -15864 98580 -36435 -37024 51297
132 51297 -42202 -20044 69815 -23284 -22872 39115 -53636 -10695 91583 -40741 -57095 73658
144 73658 -24668 -63407 87832 14584 -86873 35921 25160 -54807 45099 30210 -71538
155 -71538 16319 38905 -49586 22169 48024 -61190 -14886 52825 -20993 -8256 34740 -31229
167 -31229 -17123 35966 -13786 -5054 32635 -33032 -24986 46687 -2771 -28186 26838 -6020
179 -6020 -30118 25740 10235 -18135 13380 -9460 -21403 31801 6469 -30733 18964 7749
191 7749 -33140 19364 25418 -28394 -300 15341 -20514 10196 22082 -26642 -2203 23227
203 23227 -22659 -3349 33455 -17595 -23140 23912 -124 -14244 16519 -3071 -15590 12379
215 12379 -1255 -8248 17806 -5718 -21023 17386 8448 -17457 9245 7459 -16856 5171 9939
228 9939 -8751 5921 2112 -15781 10163 12344 -17175 2002 13878 -15363 -3253 17031 -6874
241 -6874 -7392 7810 -6127 -1021 10969 -9011 -5121 12893 -7433 -8567 15923 -758 -14301
254 -14301 7951 5089 -7654 4548 2103 -6215 4838 849 -6261 7776 2713 -11613 3808
267 3808 8761 -7653 -1883 6489 -3600 -2615 3161 -1423 842 1071 -5838 1817 6144 -5867 -2741
282 -2741 6911 -2227 -4825 4665 1464 -2906 980 -695 232 3877 -2914 -2821 6088 -520 -6183 4838
298 4838 3936 -6277 -486 4661 -1786 -1580 1205 -1148 712 570 -3175 1401 3180 -4369 -1929 5146
314 5146 -545 -4151 2119 2054 -1973 -523 865 938 513 -2059 68 3521 -1075 -2927 2728 1736 -2872
331 -2872 -139 2018 -172 -910 -897 311 1946 -1648 -2540 3055 921 -4336 857 3362 -2554 -1611
347 -1611 2170 -107 -600 418 -926 1066 1499 -2671 175 3867 -1832 -2807 3401 1297 -2943 422
363 422 1851 -705 -807 -206 658 921 -1661 -1247 2103 105 -2450 583 1326 -1231 -891 566 861
380 861 185 -1742 -223 2589 -526 -2238 2141 1340 -2567 440 2503 -686 -854 254 -111 1116
396 1116 171 -1738 865 1013 -2455 84 2656 -1364 -2330 903 791 -231 -348 -729 582 -25 -1774
413 -1774 1573 2242 -2748 -1238 2709 -135 -785 1577 -866 -837 1597 -752 294 2721 -2542 -2607 3892
430 3892 545 -3190 1986 726 -3485 991 2037 -1284 186 -851 -2420 2389 1479 -2730 972
445 972 1038 -3215 985 3361 -1350 -882 206 -1325 2224 1981 -2674 685 1405 -3597 1635 4731 -3370
462 -3370 -2492 2643 -1431 -56 3493 -2706 -2344 2471 -1883 -255 4636 -2903 -4531 3760 667 -2150
478 -2150 3054 -689 -3810 2342 1072 -888 3182 -1651 -4236 3977 2054 -3114 2432 490 -4594
493 -4594 2052 3002 -2243 1085 -341 -4170 3008 2909 -4092 1055 1844 -5296 1160 5289 -3301 -1585
509 -1585 2440 -3108 340 4842 -2665 -1932 2935 -2558 -641 5581 -1429 -3890 2376 -49 -860 3396
525 3396 -1126 -2823 1776 -1012 -462 4314 -2147 -4528 3164 621 -2455 3320 -250 -4806 2074
540 2074 1881 -1954 2593 -69 -4871 2524 3380 -3082 1359 1973 -4603 689 4566 -1998 -638 1784
556 1784 -3309 235 4513 -2251 -1931 2635 -2492 -1664 4770 -435 -4003 1487 94 -1663 2789 236
572 236 -3188 1014 441 -1490 2866 769 -3882 791 2337 -1490 1128 1563 -2897 -98 2422 -947
588 -947 669 1313 -3116 -285 3288 -1264 -1111 2033 -1967 -1749 2909 -9 -1688 1103 -1304 -1259 2885
605 2885 -373 -2137 2020 -614 -2327 3251 1054 -3289 1360 1092 -2429 2225 1748 -3388 847 2000
621 2000 -2765 1247 2808 -3485 -731 2882 -1802 -293 2335 -2529 -903 2371 -1882 109 2837
636 2837 -3427 -1315 4318 -1869 -1781 4131 -2081 -3138 4676 24 -3232 3517 -490 -3890 4129 1347
652 1347 -4246 2562 1192 -4199 2601 2546 -4080 945 1716 -3531 1964 2392 -4277 742 2622 -4064
668 -4064 1140 3964 -4386 -926 4187 -2786 -727 4264 -2840 -2004 4111 -1526 -1582 4056 -1919 -2788
684 -2788 4065 -399 -2689 3297 -825 -3217 3367 169 -2984 2906 -369 -3796 3313 1068 -4144
699 -4144 2279 1435 -4174 2014 2578 -3771 914 2396 -3405 1101 3123 -3417 195 3376 -3184 -222
715 -222 3957 -2687 -1437 3686 -1932 -1703 3674 -1528 -2441 3348 -942 -2731 3211 -184 -3335 2554
731 2554 635 -3190 1987 1131 -2995 1505 1303 -2669 1487 1614 -2884 1130 2212 -2757 590 2642
747 2642 -2534 -214 2868 -1989 -723 2643 -1736 -990 2724 -1540 -1526 2629 -1110 -1972 2635 -658
763 -658 -2310 2377 -128 -2203 2156 -29 -2479 2318 701 -2692 1954 1139 -3013 1565 2098 -2915
779 -2915 558 2119 -2496 362 2539 -2372 -457 2369 -1961 -580 2664 -1870 -1502 2426 -1012
794 -1012 -1352 2220 -900 -1786 1969 -290 -1424 2044 -437 -1892 2094 372 -1832 1692 453 -2046
810 -2046 1545 966 -1821 1144 745 -1964 1079 1269 -1943 594 1239 -1923 206 1584 -1621 -234
826 -234 1286 -1448 -166 1496 -1231 -372 1449 -1185 -459 1739 -750 -798 1532 -477 -909 1564 -64
843 -64 -1045 1233 -69 -1122 1226 292 -1297 621 484 -1201 423 703 -1033 -41 453 -683 15
860 15 517 -683 -158 394 -426 5 579 -340 -260 371 27 38 371 -128 -103 310 31 55 435 -194 -334 413
882 413 81 -320 232 17 -554 117 221 -448 -139 167 -514 -58 503 -285 -401 495 -63 -378 537 219
902 219 -485 218 316 -220 266 288 -341 89 353 -223 167 352 -470 -163 448 -226 -207 285 -311 -330 388 -117
924 -117 -338 156 -235 -344 434 32 -393 227 60 -193 395 194 -301 115 125 -57 442 111 -431 191 222
945 222 -237 335 164 -636 -94 366 -284 -91 156 -709 -249 487 -197 -277 355 -395 -484 706 235 -531 185
966 185 38 -416 593 538 -383 92 173 -365 490 581 -581 -145 288 -418 227 630 -702 -507 358 -282
986 -282 76 685 -602 -716 447 62 -152 603 -412 -846 519 417 -89 523 -380 -802 791 503 -233
1005 -233 588 -251 -1066 826 890 -705 116 -3 -1212 546 1209 -677 -380 155 -965 285 1272 -675
1023 -675 -712 249 -610 240 1308 -609 -857 404 -200 191 1373 -459 -1067 577 173 36 1075 -361
1041 -361 -1182 432 292 -82 790 -506 -1294 482 389 -265 714 -385 -1510 582 748 -460 439 -68
1059 -68 -1387 393 1211 -235 59 93 -1023 287 1263 -112 -267 40 -716 241 1171 -147 -447 -94
1077 -94 -698 244 1200 -267 -787 -40 -390 136 1126 -134 -1011 -157 37 229 862 -119 -1040 -122 280 455
1097 455 749 -255 -983 -22 509 435 631 -327 -1000 70 720 291 209 -297 -1035 -166 910 433 -229 -523
1117 -523 -728 -34 759 505 -303 -656 -557 278 901 251 -423 -415 -418 364 1135 235 -748 -342 44 177 924 421
1139 421 -1009 -655 485 307 365 368 -887 -856 455 586 168 4 -745 -749 517 719 29 -77 -650 -688 693
1160 693 922 -156 -210 -344 -572 659 1041 -158 -517 -234 -304 546 920 -319 -682 -306 -178 513 733
1179 733 -472 -840 -110 -120 409 783 -535 -1013 70 277 285 658 -229 -934 40 613 449 336 -329 -747
1199 -747 167 555 367 333 -479 -945 304 669 -33 141 -266 -966 231 963 -65 -284 -110 -731 -36
1218 -36 1005 91 -462 -118 -426 71 986 124 -540 -44 -246 137 1051 38 -769 59 29 -119 887 197
1238 197 -1055 -91 333 -139 504 188 -1111 -329 464 -49 312 162 -978 -198 639 -15 233 229 -902
1257 -902 -147 931 -26 -13 504 -746 -345 1098 141 -449 423 -415 -550 989 252 -693 221 -218 -576
1276 -576 777 252 -787 115 -84 -522 719 392 -862 84 257 -524 554 560 -865 6 535 -450 376
1295 376 722 -771 -179 671 -384 167 688 -702 -344 729 -304 -124 595 -692 -478 718 -248 -356
1313 -356 585 -446 -579 765 -21 -381 582 -179 -562 722 191 -495 524 -28 -568 621 304 -552
1331 -552 353 106 -581 471 376 -633 161 201 -706 244 421 -628 -26 319 -567 128 474 -555 -99
1350 -99 424 -325 74 555 -402 -155 541 -193 -67 539 -301 -248 567 -60 -248 417 -204 -395 462 0 -384
1371 -384 308 -103 -505 282 121 -415 106 19 -390 188 241 -297 21 139 -149 119 229 -163 26 221 -157
1392 -157 151 235 -223 62 208 -176 81 190 -260 -85 164 -171 -113 188 -203 -202 161 -48 -215 165 -67
1413 -67 -249 162 76 -162 112 72 -129 173 205 -89 95 67 -47 100 155 -114 32 66 -182 70 126 -161 -33
1436 -33 37 -191 -10 104 -207 -74 82 -102 20 93 -86 -57 121 -133 -22 206 -106 -77 174 -57 -50 308
1458 308 39 -152 128 -5 -32 164 -43 -227 96 44 -139 94 -63 -317 48 55 -153 61 -2 -246 32 221
1480 221 -52 -89 33 -97 71 201 22 -50 11 -6 158 121 -54 27 -115 -152 153 88 -210 -40 41 -207 69
1503 69 230 -202 -244 141 -63 -39 269 -64 -349 70 151 -26 166 99 -240 38 270 40 50 95 -122 -53 234
1526 234 106 13 9 -167 -114 169 75 -199 -106 -184 -85 155 96 -168 -120 -93 -90 132 147 -202 -160 79 99 164 198 -107
1552 -107 -193 73 114 185 74 -109 -194 82 81 128 26 -254 -149 116 -15 22 139 -275 -263 146 100 -104 165
1575 165 -171 -314 210 171 -99 94 -11 -205 267 281 -118 48 6 -273 174 330 -147 -130 49 -196 41
1596 41 308 -129 -215 -56 -118 115 184 -150 -137 -80 -117 247 254 -233 -132 131 -96 126 456 -254 -352 284 -4
1619 -4 -92 393 -33 -410 205 147 -74 156 -20 -387 5 193 -86 29 -82 -330 -5 200 -91 -53 6 -291
1641 -291 20 353 -30 -37 80 -191 9 286 72 -106 16 -29 28 202 26 -89 -3 -35 84 231 -111 -236
1663 -236 -31 -31 -98 100 -39 -278 -35 51 -83 67 29 -183 -17 99 3 60 108 -88 -88 194 63 37 84 -122
1687 -122 -22 178 29 -93 116 -128 -157 226 0 -229 98 -36 -236 137 185 -263 46 184 -194 79 272
1708 272 -145 -87 256 -75 4 268 -94 -51 216 -94 -4 193 -135 -92 261 -67 -136 281 -127 -261 275 -39
1730 -39 -267 167 -37 -246 237 102 -322 197 101 -260 220 179 -279 231 242 -305 205 221 -365 133 309 -294
1752 -294 90 271 -345 -80 326 -298 -46 246 -313 -150 291 -207 -194 287 -247 -152 351 -140 -209 353 -161
1773 -161 -205 458 -114 -246 359 46 -249 386 47 -365 283 100 -300 264 96 -381 211 134 -357 214 73
1794 73 -430 180 163 -421 133 202 -464 106 305 -379 43 338 -350 1 376 -239 -26 406 -233 -124 418
1815 418 -173 -162 417 -165 -180 403 -144 -266 361 -192 -306 324 -69 -297 286 -83 -361 307 21 -383 287
1836 287 9 -321 276 155 -370 224 243 -348 191 301 -341 136 328 -332 2 346 -323 -68 304 -266
1856 -266 -83 288 -282 -159 318 -235 -177 379 -223 -257 383 -93 -217 360 -75 -265 349 46 -259 277 97
1877 97 -252 237 105 -292 201 126 -287 116 102 -249 129 131 -303 74 131 -237 -45 148 -174 -29 170 -216
1899 -216 -17 203 -148 -20 196 -185 -67 341 -14 -33 268 -114 -131 253 -85 -156 238 -20 -143 240 -28
1920 -28 -281 127 35 -307 99 115 -277 51 132 -195 41 198 -182 -22 165 -144 -11 220 -98 -89 264 -13
1942 -13 -88 243 -1 -98 190 54 -148 160 87 -190 38 139 -191 23 106 -169 -51 106 -173 -80 155 -109
1964 -109 -100 235 -61 -43 175 -69 -75 140 -17 -65 167 -55 -85 141 30 -167 160 62 -193 155 84 -185 59
1987 59 37 -275 77 145 -184 0 85 -201 74 243 -136 -70 162 -153 9 244 -158 -87 221 -93 -49 250
2009 250 -164 -109 280 -57 -87 269 -80 -202 255 -17 -239 208 0 -273 166 111 -258 151 95 -236 137
2030 137 226 -176 42 166 -205 86 217 -163 55 199 -117 74 245 -186 -16 160 -156 -54 160 -139
2050 -139 -74 110 -137 -21 201 -84 -154 65 -131 -92 159 -83 -154 157 1 -49 174 31 -137 110 143 -43
2072 -43 115 73 -110 75 122 -77 59 66 -131 -17 57 -45 -44 -17 -132 -11 48 -55 -17 -2 -82 -5 25 54 3 36
2098 36 -37 81 38 45 47 -29 25 98 65 21 -21 -4 -5 13 38 -48 4 -57 5 18 -26 -33 -58 -15 -60 5 -22 -32 9 -47 -11 86
2130 86 23 -2 89 -12 5 69 -66 -105 64 40 -48 69 -16 -86 38 99 -86 39 -28 -132 31 16 -73 -20 -28 -59
2156 -59 94 21 -107 -2 49 -108 82 89 -124 7 107 -82 144 122 -86 2 87 -25 68 60 -130 -51 80 -113
2180 -113 -5 94 -154 -94 92 -27 -55 175 -40 -127 94 46 -66 77 -12 -105 100 65 -2 53 -106 -71 116 -6
2204 -6 -72 77 -85 -134 174 72 -149 46 -30 -129 42 50 -73 -59 4 -78 80 129 -78 -64 46 -46 99 75 -129
2229 -129 -38 63 -57 84 161 -154 -84 84 -3 1 185 -68 -155 95 17 -56 115 -62 -187 44 62 -106 37
2252 37 -82 -170 89 83 -77 -16 -39 -146 43 135 -15 11 48 -101 52 122 -25 -36 50 -59 47 89 26 -92 -10
2277 -10 -43 20 54 -26 -58 -26 -36 122 102 -16 -84 -14 14 70 97 21 -108 -43 61 42 79 -14 -41 -15 71 85 -13 -2
2305 -2 -116 -46 -19 30 -24 -55 -88 -47 44 3 -31 -44 -71 18 86 32 -49 -14 -4 1 81 51 -43 -53 26 58 90 51 -43 -101 10
2336 10 10 -23 46 -35 -86 2 11 -20 20 -56 -158 -37 38 -60 -6 8 -82 -8 44 6 22 17 -46 19 104 42 50 28 -67 -29 45
2367 45 12 -83 41 -50 -64 56 -28 -84 32 -28 -65 35 -50 -107 -46 -35 -9 88 57 -20 27 -1 34 39 14 -40 9 34 12
2396 12 15 -24 -5 -5 -81 71 73 -49 -50 -14 -15 -13 47 -17 -14 -65 24 -9 9 6 -26 60 46 -20 40 24 -19 77 69 -41 33 20 -44
2429 -44 25 31 -2 30 34 -97 34 28 -73 62 -15 -66 -17 0 -37 47 39 -57 -18 80 -86 26 50 -72 59 59 -10 50 111
2458 111 -58 4 109 22 -48 49 -50 -45 73 -6 -27 25 -91 -104 78 -20 -80 57 -43 -44 46 -4 -40 -7 -5 -81 30
2485 30 15 -67 15 23 -23 71 16 -100 51 1 -37 6 71 -23 -57 -3 -25 -8 37 -66 -22 41 -75 -8 -40 -73 -76 34 -21
2514 -21 -31 5 7 -38 28 34 2 16 20 -56 67 12 53 27 78 -18 -10 -19 -24 16 66 4 -80 -20 -34 -92 -66 -10 -23 -87 -21 -90 0
2547 0 59 7 -64 -8 -25 -13 91 -10 -56 64 42 -45 38 46 -53 48 48 -38 -8 -21 -76 29 47 -103 -54 43 -91 -6
2575 -6 8 -134 -21 15 -51 -11 26 -71 -43 84 5 -22 81 -58 -5 116 -39 -65 88 -39 -62 67 -9 -63 91
2600 91 9 -127 95 -14 -155 71 9 -59 78 130 -106 15 52 -119 5 65 -89 66 83 -88 6 131 -39
2623 -39 27 62 -95 -45 148 -97 -36 115 -48 0 163 -28 -93 93 -115 -89 86 -62 -110 130 16 -45 127
2646 127 -8 -165 103 61 -54 104 25 -139 70 92 -99 65 70 -148 12 84 -160 15 47 -145 26 121 -122
2669 -122 -89 81 -174 43 151 -85 -75 95 -61 -20 199 -92 -47 154 -31 -44 181 53 -157 51 16 -23
2691 -23 165 1 -173 108 61 -88 119 33 -205 -22 80 -141 12 61 -174 29 115 -68 19 92 -124 22
2713 22 141 -97 -31 69 -157 -60 206 -62 -58 106 -50 -100 172 -38 -93 21 -109 -63 95 -38 -71 52 -65
2736 -65 -82 176 51 -119 -4 16 -102 121 66 -151 2 92 -20 80 86 -128 11 111 -60 13 79 -162 -23
2759 -23 119 -26 49 48 -104 -67 84 16 -34 39 -76 -73 62 18 -51 85 -83 -94 101 75 -70 78 1 -69 132
2784 132 86 -97 -29 1 67 57 38 -116 -38 14 -44 143 54 -68 -53 45 -77 -1 45 -176 -37 93 -4 37 60 -42
2810 -42 -53 64 13 13 38 -72 -84 33 3 8 56 -44 -36 60 46 -20 -13 -83 -40 63 38 -26 -21 -80 -65 -4 21 -17 -14 -11 -20 40
2842 40 47 -41 -31 10 -41 19 57 -93 -48 32 -48 51 91 -41 -51 30 -43 -21 3 -89 9 26 11 11 89 -50 -42 41 42 2 -6
2873 -6 -30 -49 44 -8 -15 -15 -34 4 107 38 -32 53 7 -41 64 -1 -62 -18 -18 -60 7 45 -79 -42 -57 -69 31 22 -92 -14
2903 -14 -29 -48 45 65 -15 17 45 -55 28 26 -45 -6 49 -21 16 5 -45 -95 64 -20 -49 28 -28 -54 4 32 -51 9 -40 -45
2933 -45 24 6 8 -10 -6 -8 48 -2 -33 52 -32 6 32 -13 -33 14 6 0 1 -44 11 2 -25 -10 2 26 11 -41 -31 -33 7 -15 46 7
2967 7 -69 8 50 25 22 45 -10 5 8 -69 28 70 -53 -32 3 19 -9 2 -56 27 49 -19 -32 -10 -39 -39 93 -16 -63 78
2997 78 -4 13 32 -9 -62 70 -7 -22 94 -31 -32 48 -8 -60 49 53 -42 28 2 -44 -4 -25 -42 59 -25 -42 49 18 -58
3026 -58 -50 -12 -90 10 68 -98 -22 11 2 42 46 -21 -56 57 -33 -34 72 -10 -59 27 29 7 72 7 -77 41 21 -34 38 -23
3056 -23 -86 14 65 -45 60 19 -37 -57 14 -50 26 -15 -19 15 120 -40 -3 108 -71 -20 29 -51 23 26 -46 35 56 -15
3084 -15 -3 42 39 -44 3 -20 -59 -8 8 -57 8 -9 -42 -1 -19 20 42 6 -22 41 51 12 36 -18 -7 43 -15 20 -4 1 -17
3115 -17 37 5 -31 41 58 -1 43 -19 -34 16 -6 -33 -24 13 -10 12 84 -29 -20 4 -19 14 38 -46 -8 16 15 22 49 30 -68 -35
3147 -35 -96 -12 2 -39 8 19 -67 -60 -5 -26 -19 -15 43 -11 -28 -8 -1 -7 17 22 -10 6 15 0 28 32 -22 14 -7 -71 2 -9 -11 15 -53
3182 -53 2 -14 18 -7 -37 -14 -38 -12 -9 32 -57 28 -3 -5 32 43 -22 11 24 -17 100 52 -16 -59 65 -9 40 22 -44 -4
3212 -4 29 -98 -21 15 -70 -27 47 33 3 4 -30 -5 64 4 -19 -52 -88 -40 -2 28 -91 49 13 -9 39 42 -32 49 16 -40
3242 -40 -1 28 -14 35 -28 -70 28 29 -18 -7 54 -22 49 51 -56 24 15 -47 -21 42 -69 -67 83 -38 -33 35 -23 1 74 -40
3272 -40 -50 -23 -80 -22 29 -7 -88 -35 3 -10 20 51 -20 -10 18 -34 55 6 -68 29 68 -1 51 0 -15 -26 13 -7 -11 19 -38
3303 -38 20 -12 -32 9 51 -38 -67 22 -14 -48 5 -31 -64 14 16 -61 70 4 -75 14 42 4 49 -32 -61 42 10 -13 -37 7
3333 7 -25 49 50 -50 -10 30 -25 4 107 -51 -24 8 8 -7 7 -7 -62 77 10 -2 -21 13 -19 9 -23 -73 35 6 -26
3362 -26 29 9 -2 59 52 -5 -43 3 -11 60 28 -15 -5 41 -21 -25 -4 -66 -35 10 23 -12 -27 -20 -21 97 -8 -22 15 -34 17
3393 17 51 14 -62 -15 -25 -52 31 36 -60 25 -27 -22 41 68 -90 26 -15 -29 59 -3 -14 52 12 -52 60 -18 -45 19 40 -32
3423 -32 0 41 -72 7 45 -23 -46 5 -70 14 58 -32 -7 19 9 -54 4 -71 -77 16 -37 -31 12 -39 -13 -4 22 -66 11 30 -92
3454 -92 46 39 -3 39 -2 -21 26 6 -12 35 -70 -20 35 45 7 -13 6 -50 -7 9 -16 -33 44 -32 -44 24 -28 -3 40 -53
3484 -53 -1 46 24 10 -39 16 27 4 39 -53 36 17 -30 61 -11 -10 -13 13 13 9 41 -13 -23 36 -16 7 18 -38 -57 36 -50 -50 31
3517 31 22 -6 4 -21 18 -55 21 -5 15 -2 -39 9 2 28 30 5 -5 -20 -91 -38 -14 -47 -45 -21 -8 -22 -44 10 -44 4 -89 -3
3549 -3 -26 1 15 26 4 22 -40 18 32 -8 40 -20 -72 14 -20 -26 -14 -6 -29 28 -5 -9 -34 -24 -26 -54 -39 -45 7 -17 -29 5 -9
3582 -9 -70 -8 7 -8 -8 -16 15 -31 22 5 -11 21 -32 -6 3 28 4 19 21 2 8 -65 -88 -23 -5 -14 -59 31 10 18 41 -28 -10 -25
3616 -25 -50 1 38 -21 -3 32 -16 -7 25 -8 13 -5 8 -47 83 8 -43 28 -1 -45 49 48 -2 -44 -14 -17 56 32 -51 -16 17
3647 17 3 46 49 -10 -24 39 -7 -4 29 -38 54 23 -27 -32 4 11 -6 30 -18 -22 13 -39 -5 74 -6 -20 28 4 -20 4 9 -17 22
3680 22 -28 15 -3 -27 -37 10 98 -42 -2 -20 -24 -15 21 -39 -39 -1 17 -54 36 22 -19 35 -49 -7 -27 -38 -5 -19 -2 -14 48
3711 48 -11 23 31 33 -1 7 10 -13 35 -14 -34 17 -6 -32 -10 -16 -32 15 2 -12 -69 -15 5 21 -3 32 24 -36 -13 -8 -14 -7 25 -23 33
3746 33 12 10 14 21 18 22 53 15 -28 -31 43 0 -6 55 -3 7 -17 -7 26 -45 32 17 -30 -3 -26 30 -10 -43 -26 -2 -42 -2 -31 11
3780 11 0 11 -26 13 20 -25 -9 37 -12 18 21 -66 26 -19 16 -30 1 -70 -78 -19 -72 13 -53 -25 21 24 1 38 3 16 50 -36
3812 -36 23 -20 29 -46 -28 -12 -19 3 -45 26 43 7 36 15 14 -46 -43 -6 -59 -19 -22 -18 29 41 6 -4 -23 43 3 34 21 19 2
3845 2 -16 74 21 65 5 -27 -1 -4 41 39 -3 -38 10 -5 18 16 20 51 -64 -26 -4 -29 10 -1 44 -3 -41 23 -24 19 40 -2
3877 -2 12 5 32 -22 54 36 -45 6 -22 -76 -7 28 -9 4 -6 40 2 15 -32 -8 -17 -13 40 -34 38 0 -23 -4 -41 -19 -24 -17 32
3910 32 -50 10 4 -33 3 9 -13 17 -29 59 -35 -20 2 -20 15 6 -83 -36 7 1 2 36 12 -25 -6 -64 -29 18 -24 35 29 34 -9 -19
3944 -19 -2 3 -37 -26 -50 -10 22 18 19 29 -23 -1 2 -6 -11 51 -23 -15 53 -4 -12 -24 -54 25 23 -39 -4 26 32 15 18 35 -27 6 4 -17
3980 -17 14 6 -18 -17 -24 10 -26 -41 -66 -39 9 -43 -36 -12 -68 -33 -15 -58 -3 -8 9 -23 23 -26 -48 -2 6 -4 43 -41 46 93 -56
4013 -56 -50 17 -29 -11 44 -13 12 0 33 -9 -20 -10 -18 9 -9 10 39 -28 15 -63 -29 -57 2 0 -9 10 -6 22 21 0 -6 3 55 -2
4047 -2 -20 -4 -48 27 37 -7 36 20 5 -5 37 28 -15 23 -28 -8 17 -4 -49 -15 34 -1 42 -67 -43 -4 19 58 19 6 19
4078 19 0 33 -51 14 -36 -25 26 7 -26 -19 -51 -5 -43 -34 -12 4 15 -8 -25 18 18 -6 -7 0 -41 -18 57 2 10 -3 27 31 31 23 37
4113 37 -38 -57 -5 5 -33 9 -15 -9 -35 26 -22 8 15 20 -6 -14 2 3 26 37 37 45 16 44 6 2 -7 7 6 27 5 -45 -15 13 -31
4148 -31 4 1 -29 -17 -9 -54 -40 -32 -35 10 47 -25 7 19 5 18 -23 11 -21 24 -16 31 85 -23 0 36 -15 -3 58 41 47 -7
4180 -7 -15 -18 9 24 18 -49 5 42 -49 -16 -44 20 15 20 -21 13 -59 -1 10 -10 11 -39 -8 -39 18 -38 2 -31 27 29 2 17 -6 36
4214 36 -48 -4 -33 -11 1 -22 -40 8 -7 11 29 56 -32 -14 -2 -26 -28 -42 26 37 -82 -29 0 0 -64 7 48 23 31 40 0 -48
4246 -48 13 8 17 -38 -22 -33 26 -9 -14 7 -16 -40 -4 20 -29 3 -34 -7 -3 -37 -1 33 56 -24 -26 29 -5 35 -22 -14 -7 -23 -15 11
4280 11 28 24 7 6 -44 -7 -15 5 -28 -57 -6 -11 4 -11 -20 4 -20 -4 -30 -37 -26 26 -24 -24 -58 -37 -28 -6 -23 -3 -28 -14 -76 37
4314 37 0 -53 16 -10 -28 55 -22 6 -15 -9 -42 -20 0 -19 35 3 -41 -17 -29 34 19 15 -10 -24 15 -26 16 15 -12 -12 15 17 3
4347 3 -21 -36 11 89 30 -22 21 5 -12 69 16 -12 42 -14 -18 9 -49 -54 -38 -17 -19 -6 6 -20 4 -112 28 -53 7 -24 9
4378 9 31 -10 6 -10 -5 17 -19 -2 9 26 -16 -29 57 19 1 24 -17 53 23 -28 -29 51 -27 -56 -1 49 -3 25 -9 -15 23 -39
4410 -39 -8 -39 -4 -52 4 -18 -30 30 -13 15 24 -16 -26 15 17 -42 -64 -17 -3 -40 32 10 -39 12 21 -11 7 -53 -30 24 20 18 12
4443 12 -15 -48 4 -36 -29 -42 1 -3 -42 73 -30 43 -16 -40 8 56 -28 54 -11 -14 -33 -10 -23 -15 34 61 54 21 16 22 19 -36 -17
4476 -17 66 9 20 -24 -23 8 -59 -32 -29 -7 41 -51 15 -11 -19 2 -4 -72 33 18 7 -22 -41 28 -16 -30 -6 11 -33 27 53 23
4508 23 -1 8 6 -13 9 -49 1 36 28 -5 -79 -43 -7 -11 -43 26 48 34 14 -46 49 19 47 -22 24 -59 -27 -3 -45 2 29 -10
4540 -10 -53 -96 -25 -38 9 -7 12 15 7 -21 28 11 -35 75 5 40 9 -6 -13 -28 -3 -7 -47 4 54 -7 20 -23 -31 33 38 -65
4572 -65 -24 -19 -36 39 39 -15 14 21 -24 -58 -27 -8 -22 -31 -13 -8 -67 16 8 43 -22 19 20 10 10 1 -28 -42 -1 18 29 -24 25 -53 4
4607 4 -13 37 -15 12 -23 -68 23 -53 -14 -31 -10 31 23 -69 4 7 16 22 35 -9 22 5 1 -43 -18 -5 -8 -21 19 -33 57 -42 -59 32
4641 32 -53 -15 -17 55 9 -16 -31 -9 -26 -31 -49 29 27 -6 53 17 26 -86 -5 -83 27 -19 -26 3 -28 -17 -19 10 37 -16 -24 -33 47
4674 47 29 -20 51 -26 12 5 2 -35 -8 -19 14 39 15 6 -33 33 9 -22 52 18 -17 -21 29 -40 43 -18 -17 -57 -11 -33 29 -29 16
4707 16 -44 -15 -4 7 36 -20 9 -31 3 -46 37 -4 -26 48 39 -7 -14 -10 7 38 -15 -3 5 -62 -18 -10 -11 13 35 3 1 -44 -12 -51
4741 -51 48 9 -10 13 -33 50 16 -25 -29 -11 -37 7 6 2 -23 -3 11 -27 0 29 27 -19 20 27 -59 -9 -20 -5 -39 60 16 44 -11
4774 -11 29 18 10 -24 25 11 -8 3 -31 -2 19 22 -9 -3 45 -15 -1 24 -20 -19 -36 -66 -4 -69 -14 3 -28 26 12 0 -14 -28
4806 -28 -30 -5 28 8 -13 -11 23 17 -15 17 -19 18 -20 -15 -45 1 -18 82 -20 -19 -7 4 -49 31 20 -7 12 -3 -17 11 3 -41
4838 -41 37 -59 43 72 7 38 -4 -44 10 15 -32 -23 5 0 36 -8 61 15 -10 -18 3 4 35 -17 -2 -5 -31 3 31 -25 -61 -35 -29
4871 -29 -10 -27 10 34 9 -30 8 1 -22 -3 -6 -21 -11 -19 -41 -26 29 -26 31 18 -28 -26 -18 15 5 7 27 -19 -28 -7 7 -31 -52 -25
4905 -25 -5 26 51 9 49 -24 -7 -31 19 3 17 -11 -39 -9 -13 21 -78 16 36 0 -32 4 -16 -48 -20 -9 -17 -13 -29 -2 14 23
4937 23 6 -11 36 -1 45 41 -5 -12 5 -4 -13 11 13 -43 -25 -12 -70 -19 4 12 27 22 26 -41 -19 12 -25 30 -43 14 -9 -12 2 -64 -29
4972 -29 -27 14 -23 35 45 -17 68 15 -47 -16 37 -2 36 -52 -12 -5 -29 41 39 -13 -32 15 -10 -40 13 -9 0 12 31 21 33 -47
5004 -47 -84 -41 -28 -20 51 -12 17 27 37 -13 28 -13 9 22 18 -12 -20 39 12 -10 -13 -1 15 -8 -12 37 7 28 3 -18 -62 28 -30
5037 -30 -41 1 11 -44 37 -12 1 -17 28 -39 2 36 -30 10 21 47 -22 50 10 21 -21 -31 -38 3 8 -14 3 5 -30 -6 -3 -29
5069 -29 27 -7 -18 7 24 16 37 36 16 25 7 -5 -50 -16 -22 -19 50 2 -17 -19 1 -26 -44 -38 -6 -49 -36 24 -36 -22 -16 19 34 7
5103 7 27 -27 16 2 -11 40 30 -11 34 20 -19 -11 22 0 -44 35 4 -6 -28 21 49 22 -37 -18 -60 -54 23 48 35 4 -56 -17
5135 -17 17 -36 -12 15 -38 19 22 -21 23 -51 7 -20 -1 15 -8 -25 2 -9 49 -13 28 -27 -20 -4 -14 -30 35 -5 28 12 -14
5166 -14 -25 13 2 -5 47 -13 -8 -5 -2 23 -22 -16 -1 35 7 -7 -2 -33 -5 24 -20 -7 -17 42 -2 13 60 62 -63 -42 59 19 -25
5199 -25 9 17 44 23 28 -10 -6 18 -6 -25 17 -12 25 -24 -33 -36 -30 -4 -59 -14 10 -54 5 -21 -52 31 -36 -31 -61 -4 41 -4 7 35
5233 35 50 35 35 -4 47 53 37 -9 49 -56 -19 68 -2 -46 4 -74 -19 10 -27 4 16 -25 -17 36 -4 61 -60 -11 -7 1 -22 -36
5265 -36 11 36 -27 5 -14 17 -21 62 14 29 7 -14 24 -9 -22 9 -10 88 3 -30 12 -22 49 -24 17 23 2 8 7 14 -2 3 15
5298 15 -7 18 -24 7 -31 53 -12 5 29 9 11 -1 -58 6 29 9 5 -9 1 30 -30 7 5 -33 3 16 29 20 22 26 28 49 -18 24
5332 24 -50 -12 1 58 21 -2 51 -30 -4 -48 11 -35 7 24 -31 -27 17 16 -11 26 54 23 27 5 -27 -4 -24 -25 21 -11 -14 28 2
5365 2 6 16 0 -7 -6 57 14 40 -20 -16 -35 28 -11 10 10 -8 -27 35 -12 -14 -78 -36 -16 -24 -37 23 11 14 -7 -63 16 1 -12 16 10
5400 10 17 -10 -19 58 23 19 39 -16 -18 33 -37 2 -12 -1 -29 -8 47 8 1 7 -10 -2 -6 -29 -13 -72 -47 -3 28 -16 5 13 31 -24 6
5435 6 -17 7 -26 60 -34 -39 20 -26 -4 -26 -23 -43 -7 -5 -11 8 16 35 -5 -2 0 -26 38 20 -5 19 -21 -4 63 -19 16 -44 -45 -24 -9
5470 -9 -59 -24 -7 -2 -41 -31 -7 -45 31 9 0 -25 -11 -15 -46 -5 12 -17 -5 45 -30 16 53 36 -41 83 -1 5 -19 -20 -13 -14 23 14
5504 14 21 -23 -8 -52 -25 -39 14 -45 -1 4 -12 -1 -34 -16 37 1 -10 -12 -25 -26 -37 37 -8 -5 8 19 10 -1 -32 -15 -33 45 44 6
5538 6 -14 45 7 -11 -48 -61 12 -33 -24 -2 25 -28 2 19 17 -16 -6 51 42 1 -17 27 -30 -48 -4 -5 -55 16 20 -17 -24 -10 -8 39
5572 39 2 16 -15 -40 -33 15 -5 14 -45 -38 16 24 -3 -6 -23 -34 26 -11 -54 8 38 -22 -12 -21 -28 43 -60 -3 -11 -41 38 -30 -4
5605 -4 -8 -47 34 25 -66 1 10 -34 -24 -12 35 -12 -4 22 -12 -28 -14 -2 54 43 -1 -16 14 0 11 20 10 -7 -22 16 -31 -15 7
5638 7 3 26 -30 30 6 -35 -16 20 51 -52 2 15 9 66 12 -28 10 10 -33 -37 1 -16 34 20 2 13 -12 30 -10 46 13 -4
5670 -4 5 -12 -37 47 19 2 18 -32 -58 6 31 -48 -34 20 2 -58 -14 -3 15 -24 -3 -40 41 -17 -12 24 -18 74 -18 15 -26 -16
5702 -16 -27 21 -22 -33 -1 10 65 -16 6 9 20 20 6 7 -16 -8 -9 -29 -23 -38 -84 -30 -7 -29 -19 8 -26 -42 -19 21 -7 11 2 45
5736 45 -27 16 27 -16 55 32 -13 -21 27 -20 26 42 14 -37 40 -8 28 3 -2 17 -8 2 -4 1 -33 25 -14 -38 -23 -1 26 -5
5768 -5 -31 39 -10 -79 6 -8 -32 16 -8 -14 -38 22 17 55 3 22 21 -16 42 -8 -17 30 14 10 -7 43 -11 21 -1 48 21 -1 -18
5801 -18 -28 -4 -23 -19 -1 -15 -18 -10 -23 21 -24 -12 -29 -13 52 15 39 -10 14 37 -33 15 8 -78 -68 14 37 5 -19 17 -27 -24 5
5834 5 -14 -31 24 30 43 2 15 -17 -20 23 0 22 -5 -18 -14 -71 -4 -12 -10 -37 -12 8 3 33 -31 9 -15 -18 12 2 41 -41 10 -11
5868 -11 12 14 -13 19 20 -39 41 33 -14 34 12 7 41 -18 -22 21 -8 14 35 -13 28 20 -58 4 35 -26 -25 -31 -16 -41 4 28 2 -13
5902 -13 33 -26 -68 -79 11 31 17 -11 35 -3 -23 15 37 -19 21 62 -5 34 4 40 27 -25 13 -22 30 18 16 -1 -40 -30 -22
5933 -22 11 -44 5 -2 -48 13 -20 -21 -32 -26 20 -13 38 23 -22 9 -46 31 -40 -34 65 -9 6 14 -69 27 30 10 10 49 20 5 0 -17
5967 -17 -14 -14 61 -38 6 7 8 -3 -9 24 10 4 23 -4 -24 -5 6 -25 -53 -9 30 38 22 15 25 -79 35 7 54 15 -13 17 39
6000 39 -35 10 5 49 -29 21 40 -11 -34 14 -3 -31 3 -42 -10 2 4 39 14 -4 -26 -30 -13 -15 -29 -15 -21 -22 -20 41 22 36 20 49
6034 49 -4 -5 15 6 16 81 -25 32 10 -22 66 13 40 -10 -4 -4 5 -19 -24 -46 15 50 -44 -1 -44 -26 10 31 -3 -57 22 9 -18
6067 -18 26 11 -40 -11 -39 -57 -22 -48 1 38 -18 -71 -27 -11 -48 41 -12 4 1 21 5 18 -6 -3 4 8 -41 60 -16 -23 -21 -21 -14 -33
6101 -33 -3 -38 -30 70 -78 -50 -29 -47 2 25 19 14 -12 57 -14 -5 18 -50 29 -59 -49 44 7 42 -22 -49 -64 80 37 -19 22
6132 22 55 43 22 26 27 0 39 -13 -10 43 -11 5 19 -4 36 -22 40 -19 -26 1 -7 36 18 -5 42 -24 -24 4 55 -21 -11 -10 37 10
6166 10 -4 19 46 44 54 -26 7 20 -5 6 -10 41 -20 24 -24 3 43 19 8 16 -70 39 34 -9 7 4 -3 -35 -25 -13 10 23
6198 23 3 9 12 -35 17 37 22 13 -1 13 44 -3 -33 -17 44 -4 -11 -36 -2 17 16 -48 53 5 -37 11 8 -17 3 -24 -30 -30 42 -32
6232 -32 -20 35 -86 -2 -32 12 26 -6 -22 26 29 -25 -10 -14 19 -44 6 -42 -19 -3 55 -21 -5 57 5 9 32 1 -35 30 -33
6263 -33 0 50 -15 7 -26 6 -83 4 66 23 44 -46 -13 -34 -24 6 -24 13 -2 -13 10 -25 3 7 22 17 -25 -46 0 7 47 -16
6295 -16 -29 30 1 96 -9 47 -6 20 42 8 25 19 9 13 48 2 -53 -37 -6 -19 45 9 -27 -44 59 -16 -47 33 -45 -27
6325 -27 -8 -62 -12 39 18 3 3 -15 1 -18 -20 45 31 -29 -16 20 -34 -10 23 -30 -35 -29 18 -31 -1 10 -26 0 31 3 -42 35
6357 35 21 -6 -24 -13 13 27 -49 -3 25 7 -36 -9 -4 26 36 18 -29 17 -17 -41 -15 30 40 12 56 16 14 19 0 -27 7 40
6389 40 44 56 5 10 30 26 -19 -7 -19 17 32 1 2 -21 48 2 60 58 -18 -22 6 44 -9 15 9 16 -7 -23 13 -15 15 -16 9 4 11
6424 11 -3 -12 -7 31 27 24 -10 27 20 -3 42 -11 12 0 33 22 15 6 -2 -4 8 -2 1 -20 -13 -29 -25 -8 7 3 17 3 46 -15 27 -2 9
6461 9 55 15 -23 -16 34 12 35 15 4 -24 3 15 34 30 28 23 17 10 2 -1 -10 17 -71 5 -37 -8 4 7 15 -20 -50 -4 -21 2 23 -17
6497 -17 2 17 -9 -60 -16 -4 30 39 19 9 0 -15 -19 -11 -7 -34 26 8 58 -17 81 42 -20 -5 26 -3 -20 -2 9 19 21 36 -61
6530 -61 -35 -28 5 17 37 -15 -2 19 72 2 -20 56 -8 -19 -27 45 23 4 12 13 45 12 -52 2 8 29 12 -63 33 42 15 -58 -24
6563 -24 4 9 -20 -49 54 19 3 -2 3 -16 -27 -51 17 -23 25 33 30 20 -43 -19 -7 -21 -60 8 6 -1 6 -16 -11 -5 51 1 28 -5 21
6598 21 28 49 6 -12 -13 50 4 19 -15 24 12 -3 -17 -3 -19 4 27 -12 -9 -7 8 -34 -47 -13 91 -11 -6 -7 6 24 -26 -36
6630 -36 29 27 54 -1 14 33 57 34 35 35 9 -64 28 7 27 23 16 38 12 16 -13 -26 -29 26 12 -24 -2 -91 -23 -27 -10 -5 -66 2 -50
6665 -50 -19 58 -12 7 28 33 4 -2 20 -14 40 31 19 -13 11 6 -1 11 49 -29 0 -11 -9 49 -24 -30 46 -10 37 -25 -2 30 -25 -3
6699 -3 -36 -6 -2 -29 -37 6 -31 -17 -9 -32 -28 0 -2 39 -16 -10 1 -26 -8 84 24 21 20 6 -23 11 -38 23 -49 -24 -25 20 10 -6 3 -3
6735 -3 26 5 14 4 -9 -42 21 -40 -52 2 -27 -12 -32 -67 0 -13 44 51 21 -31 -32 18 -4 -16 30 38 60 -18 9 -3 11 0 22
6768 22 -23 65 27 22 28 10 7 -39 -9 -22 9 11 -47 17 -13 -8 -6 -4 -7 32 -12 -10 -16 57 -17 -36 29 2 -22 30 -15 61 46 -21 15
6803 15 -15 6 0 29 5 -8 -1 8 -14 17 -56 53 12 12 12 -32 37 -23 -32 -3 -33 -16 -57 0 -50 31 -18 -2 -42 -19 -12 -55 -1
6836 -1 26 18 -10 -17 50 48 28 3 37 19 62 -12 -25 -10 4 39 45 41 -16 -16 18 18 31 -15 3 -9 -53 -29 21 67 -6 -4 -22 -17 -6
6871 -6 -28 -15 48 -8 -34 -23 -26 4 -15 27 19 34 -15 -50 62 4 9 32 18 17 41 -1 -23 -31 3 38 20 -19 39 5 7 13 -30 -3
6905 -3 -32 -40 -17 7 -16 5 -21 30 4 -8 4 -17 30 24 -59 26 4 5 3 38 17 -16 46 -33 19 75 -38 -5 8 10 38 38 52
6938 52 44 12 56 -24 55 36 13 -13 36 -5 -48 10 -19 -15 2 -10 -30 -34 4 6 -18 -49 -2 8 -35 18 -8 20 52 -45 8 2 78
6971 78 56 -6 -41 6 45 -14 12 21 42 9 39 27 26 18 15 2 17 1 8 1 -39 23 43 -8 -37 -10 -19 -14 14 -20 -16 25 -29 -15 -14
7006 -14 11 -3 -1 5 6 -54 22 -2 27 -1 50 43 31 -53 10 -7 -39 -1 17 58 -28 -28 -14 11 -13 27 -6 -24 -36 3 -4 -45 -32
7039 -32 40 -51 -5 -36 12 50 37 4 13 -5 -53 5 -77 36 -4 -11 -6 3 -11 -51 60 -2 64 -34 6 31 5 -22 -18 -17 -1 5 -54
7072 -54 4 41 32 17 -13 -3 6 8 -55 9 -41 16 -31 -54 -8 0 10 -17 41 3 -46 -11 -5 8 9 1 -17 -11 -4 -25 59 30 20 51 -20
7107 -20 -13 52 -18 20 23 -20 13 -15 -17 3 10 66 -72 38 -27 3 -26 -1 -26 -45 18 -26 -14 -62 4 -50 5 31 57 63 62 59 9
7140 9 40 73 41 -21 63 -7 47 55 13 -3 39 -13 13 -5 1 -68 -36 -11 -6 0 -56 -25 -29 -4 2 -39 -3 -1 -4 8 11 15 13 -19 -50 -54 -6
7177 -6 41 21 6 -21 -31 34 -13 -33 58 27 18 4 0 -20 -14 15 -24 -12 11 -48 23 68 32 3 -21 -29 -42 -39 -7 -43 9 -14 27
7210 27 -25 -10 -18 -14 -36 19 -26 -4 -31 -13 0 -16 50 -20 -15 -27 4 30 46 -24 7 16 -43 -17 40 -1 41 13 -66 55 34 -18
7242 -18 -48 21 22 32 -32 33 3 23 27 -71 6 -32 -2 27 -21 -8 -46 2 -1 45 15 26 13 -26 -6 2 23 50 47 11 13 38 9
7275 9 53 35 -48 17 19 -20 -19 8 26 46 7 43 -1 -25 -16 -14 -14 4 55 -16 -43 -19 -63 -28 -33 17 51 37 69 -3 9 -21 -25 6
7309 6 -28 47 84 29 -28 26 -42 40 -9 41 -43 -9 19 15 40 -26 10 6 -28 -2 23 20 34 -59 8 -16 27 -9 -31 0 16 8 10
7342 10 -56 44 -30 -28 -25 6 -12 61 -21 -8 2 -26 -8 20 -2 21 42 24 54 43 49 34 -6 -65 18 -19 -37 6 14 -19 4 -28
7374 -28 -5 20 21 19 -34 -14 -62 37 32 -23 -17 -19 28 57 47 -45 -26 31 -23 -45 39 22 -25 -12 7 7 9 45 11 15 -6 -25 2 -2 36
7409 36 -11 4 -44 4 8 4 -29 23 -9 1 -21 44 -38 -53 -45 18 6 -70 -13 -10 -10 -8 5 27 -27 -19 15 -81 -15 -22 39 7 47 -17
7443 -17 9 31 26 -10 10 -41 13 -27 -56 -1 4 -1 -29 -14 -41 -34 -7 22 -3 24 -23 20 16 -23 10 -11 -34 37 -17 -46 25 20 -47
7476 -47 1 -21 -32 36 -25 -14 -14 -12 -8 43 -11 -2 26 -5 9 -18 26 14 24 38 14 -24 -2 -29 1 -2 8 37 -18 20 -23 -51 -89
7509 -89 -27 -23 -6 -29 7 -47 -4 -29 -37 41 -14 8 32 -36 -14 41 -50 13 -31 4 37 8 16 36 11 -11 13 28 12 -24 -8 0
7541 0 -8 -34 14 -26 -27 -81 33 -47 22 -11 -34 -50 -15 7 -6 -17 -6 6 22 16 28 -44 25 -12 38 20 -5 12 -78 11 30 80
7573 80 -35 24 -12 -12 -3 -77 44 -87 8 -30 -11 8 36 1 -19 -15 -40 -42 -17 -21 -19 -39 -31 -27 14 -57 4 -3 -19 -7 -19 -4 -28
7606 -28 26 9 -16 -1 0 -11 38 17 11 17 30 59 4 61 82 17 -13 13 -38 13 30 -48 -8 10 -34 1 73 22 7 28 -40 44
7638 44 -31 -2 60 -12 -29 2 -12 -16 40 -29 8 -16 33 -36 -9 9 -1 38 47 -34 -4 -26 9 -16 9 23 20 -5 12 -5 -19 -32
7670 -32 -9 -11 58 -15 -17 -5 0 -5 12 8 -12 11 -33 -34 35 -8 38 -3 30 18 -19 -9 19 11 -32 9 -16 -12 25 -7 -9 -15 -5 -87 -93 0
7706 0 3 -38 -11 4 15 -43 -39 41 16 -21 -41 3 40 -27 5 -35 -6 -25 -8 -19 15 -12 -41 -13 -58 -33 16 68 -23 55 52 4
7738 4 9 -9 -19 3 14 6 10 23 -23 39 22 13 -26 -11 -5 3 -19 0 10 10 10 -20 2 -22 5 9 -37 6 56 4 -22 -13 -49 38 -79
7773 -79 5 24 -3 13 24 8 20 25 -27 -11 -9 31 24 16 -23 -13 -17 29 24 5 9 -19 32 30 32 -10 35 11 -28 58 -5 -50 -22 -35 -51
7808 -51 4 -17 -39 -9 72 5 11 31 -31 30 2 16 42 -9 -21 -16 -3 43 -36 48 60 2 38 14 -6 23 -2 -27 -49 -5 34
7839 34 -24 -3 -63 -6 8 -55 -43 -25 -3 -16 17 -38 -10 -65 -37 -1 -6 2 -13 -19 12 -35 23 -13 49 18 12 32 -26 34 4 -17
7871 -17 61 39 7 17 3 7 -12 -24 -13 -13 -16 7 2 28 -14 -10 26 -43 -56 -31 35 8 -22 -54 -23 48 -28 58 56 -11 -6 41 -32 41
7905 41 -22 58 -15 24 69 49 35 15 9 23 -8 -19 16 -9 11 -4 -18 -38 -61 22 -11 15 47 -51 -28 -45 -15 -35 19 2 -14
7936 -14 46 34 -32 41 19 21 -18 -49 43 45 18 -4 -24 -25 19 32 -8 -5 19 38 3 28 4 2 10 -15 11 -20 17 3 8 35 38 8
7970 8 -20 -12 -8 -31 12 13 -20 -36 -13 8 5 -8 6 -14 18 13 -39 24 -21 45 -25 -16 21 -18 -4 -25 53 23 19 -8 4 5 -14 19 -9
8005 -9 -35 -12 -31 70 12 3 -45 -31 61 -12 -61 -23 14 -30 -7 4 -3 20 -24 -41 32 43 -57 -4 -3 -13 -18 13 16 22 49 28 10
8038 10 -10 8 42 65 4 20 -2 -15 65 6 28 60 4 -16 10 -68 -20 -54 -16 36 14 -1 -25 -13 -27 -48 -9 -25 34 -16
8068 -16 -32 -17 19 53 31 -15 -13 15 19 12 51 16 14 8 1 8 29 -24 -6 5 44 -23 -12 21 11 -24 51 -12 46 -78 9 -11 -58
8101 -58 -30 -9 -19 -18 4 9 -26 12 -64 -1 -13 11 56 16 2 0 4 -16 -16 9 25 -8 35 -19 19 36 7 16 24 3 29 -48 -48 -32
8135 -32 -24 2 38 -37 17 -16 -11 -27 4 28 18 -9 22 14 2 -25 -41 -3 -20 6 -13 -2 -30 -50 -31 14 -13 59 10 39 -9 19
8167 19 43 30 -17 -22 9 4 -18 -25 -22 15 33 -6 -12 -16 8 -7 1 -29 -2 13 -2 9 -27 -2
8191b
$$ Imaginary data points
##PAGE= N=2
##DATA TABLE= (X++(I..I)), XYDATA
0 0 0 0 0 0 0 0 0 0 0 0 0 0 -8 8 -8 16 -16 17 -24 32 -36 40 -51 62 -72 84 -96 112 -131 151 -172 198 -227 254
34 254 -289 324 -367 411 -460 513 -573 637 -709 784 -869 960 -1060 1169 -1289 1420 -1564
51 -1564 1723 -1898 2092 -2310 2554 -2829 3142 -3503 3926 -4425 5028 -5770 6710 -7950 9657
66 9657 -12171 16263 -24305 72173 -294103 -95137 322019 -206874 -109631 298250 -80746
77 -80746 -220539 188862 14568 -120278 134666 3347 -158576 73998 45917 -50860 61293
88 61293 -12216 -78702 52557 -5942 -13795 88720 -68358 -94052 121805 -184 -88575
99 -88575 110865 -3965 -143462 88332 63742 -93514 61466 20035 -126933 77447 76824
110 76824 -117325 50447 71311 -152070 26667 146340 -102893 -40188 105233 -81833
120 -81833 -40674 124747 -38443 -66242 71681 -38715 -44506 100053 -13146 -75147 50157
131 50157 -5101 -39791 65801 -2490 -53774 36975 -15676 -29510 81355 -14307 -82832 61983
143 61983 18465 -74435 62425 41849 -96646 12701 60816 -51109 12370 46882 -66343
154 -66343 -7893 61267 -36842 -8972 53412 -47152 -34002 63145 -4562 -32620 32041 -14339
166 -14339 -28897 39142 2013 -23242 26432 -15025 -31901 44426 12544 -40774 16793 11180
178 11180 -31767 19041 22023 -25663 2206 5110 -20525 22472 16045 -34950 6000 20833 -28773
191 -28773 6668 32027 -26883 -13829 24389 -11724 -2642 24503 -20277 -13811 27968 -10573
203 -10573 -14209 30956 -7898 -30559 23195 12057 -20704 10140 5499 -18562 9115 8140 -12198
216 -12198 10324 1468 -21889 12278 15981 -19314 582 13193 -14999 -780 15176 -8348
228 -8348 -2088 6767 -12082 4241 16123 -14502 -5578 17122 -9347 -8794 18174 -2336 -13158
241 -13158 8775 310 -5276 9906 -4358 -9524 11791 -1311 -12005 12511 3801 -16727 4785
254 4785 10021 -8909 166 5253 -6537 1713 4304 -6233 3762 5234 -10370 806 11223 -6014
268 -6014 -5189 7986 -1162 -4613 4252 415 -1397 1761 -3685 14 6469 -4145 -5024 6613 -89
283 -89 -6446 3700 2914 -4443 -62 1071 -847 2566 -1505 -3786 4824 1557 -6398 2944 5535 -5747
299 -5747 -1937 6098 -688 -2946 2000 105 -244 1320 -1984 233 3444 -3103 -2895 4866 444 -5047
315 -5047 1250 2847 -2439 -1232 1324 355 -162 -1520 -431 2969 -388 -3316 2101 2538 -2785 -636
331 -636 2771 20 -1265 -50 644 1627 -781 -2338 2400 1899 -3930 -74 3950 -2058 -2825 2410
347 2410 416 -1670 270 -550 -40 1270 -1973 -906 3369 -1003 -3401 2823 2239 -3114 -125 2654
363 2654 -567 -1009 526 729 769 -971 -1107 2089 831 -2407 256 1848 -1149 -1160 797 583 -374
380 -374 -1460 -500 2045 -310 -2697 1229 1806 -2543 -411 2766 -613 -1656 738 405 668 468 -1341
397 -1341 457 1750 -1509 -411 2849 -720 -2540 1267 1521 -694 -574 -439 222 375 -1383 585
413 585 1918 -2485 -2095 2802 480 -1998 901 -212 -1414 1515 193 -779 1996 -1270 -2736 3645
429 3645 2010 -3680 935 2155 -2900 422 3180 -1396 -889 362 -1626 1617 2138 -2908 -607 1789
445 1789 -2499 -89 3488 -1605 -2446 880 -484 1042 2005 -2738 -903 2408 -2119 263 4720 -2622
461 -2622 -3776 3579 704 -1345 2972 -1434 -3247 2941 422 -1659 3502 -1553 -5266 3569 2718
476 2718 -3443 1215 523 -4110 1675 2656 -2107 1050 -339 -4157 3106 3627 -3823 386 2120 -3792
492 -3792 1130 4431 -2330 -879 1317 -2856 1879 4183 -3779 -1135 3331 -3566 -429 5746 -2729
507 -2729 -3985 3113 -1097 -1353 4329 -1884 -4035 3036 -385 -2057 4521 -511 -5165 2294 2174 -1712
523 -1712 2256 -47 -3471 1909 1285 -1205 3111 -725 -4846 2976 2983 -3098 1480 1112 -4680 1291
539 1291 3587 -2512 285 933 -4361 1264 4465 -3227 -1192 2718 -3353 -613 5095 -1502 -2806
554 -2806 2320 -1405 -699 4546 -1165 -3533 2796 -155 -2266 4103 695 -4774 1115 2204 -1807
569 -1807 1535 956 -3591 325 1988 -1526 1149 1100 -3849 -176 3339 -1354 -667 1696 -2285 -863
585 -863 3013 -414 -850 1447 -1930 -839 3659 -316 -2270 1923 -431 -1984 2824 937 -2612 678
601 678 155 -1482 2207 421 -2953 1121 767 -2558 1988 1777 -3713 116 2339 -2161 628 2371
617 2371 -3067 -506 3152 -1788 -233 3189 -2469 -1876 3668 -515 -1645 2472 -1312 -1892 2837 -530
633 -530 -1491 2509 -1957 -2499 4104 -371 -3559 3122 -258 -4209 3588 1733 -4437 1944 1604 -4135
649 -4135 2731 3010 -4535 817 3192 -3634 1052 3932 -3671 -737 3364 -2489 298 3444 -3514
664 -3514 -1067 3835 -2753 -1004 4299 -3242 -2873 4672 -1174 -2915 3800 -1355 -3631 3892 200
679 200 -3261 3152 -170 -3823 3451 1438 -3667 2222 1135 -3569 2479 2092 -3544 1626 1607 -3737
695 -3737 2092 2774 -4200 562 2963 -3790 228 3712 -3353 -1060 3326 -2614 -865 3651 -2614
710 -2614 -1712 3765 -1886 -1906 4041 -1296 -2950 3680 -180 -2936 3231 193 -3316 2830 913 -3305
726 -3305 2367 1462 -3652 1446 2104 -3274 752 2270 -2974 99 2238 -2461 -25 2280 -2518 -360
742 -360 2795 -2167 -874 3067 -1759 -1518 3152 -994 -1878 2679 -518 -1927 2592 -195 -2315 2446
758 2446 308 -2506 2067 691 -2780 1628 1111 -2664 1194 1109 -2778 1121 1710 -2978 582 2099
774 2099 -2774 257 2887 -2502 -836 2883 -1637 -852 2922 -1477 -1538 2820 -719 -1488 2641 -643
790 -643 -2236 2450 277 -2120 1807 146 -2394 1561 728 -2112 1167 471 -2301 1235 1190 -2248
806 -2248 743 1230 -2144 656 1703 -1851 223 1559 -1700 295 1939 -1611 -243 1880 -1370
821 -1370 -478 2086 -980 -953 1689 -777 -949 1626 -619 -1139 1409 -559 -1215 1475 -260 -1521 1138
838 1138 100 -1342 1128 390 -1423 776 621 -1196 835 894 -1281 262 1048 -916 149 1118 -808
855 -808 -355 848 -376 -233 692 -480 -386 512 -209 -336 439 -289 -553 340 -1 -249 212 -131 -330 275
875 275 54 -135 283 -88 -343 488 370 -336 212 210 -357 184 482 -271 -189 293 -266 -221 489 -199 -592 263
897 263 96 -490 206 249 -631 -86 358 -257 -51 344 -264 -49 403 -89 -27 470 -230 -115 633 -24 -239
918 -239 351 -23 -328 449 116 -432 148 -12 -358 256 76 -584 -31 162 -359 71 130 -465 -33 214 -114
939 -114 224 132 -393 94 430 -158 138 343 -412 -84 634 49 -232 304 -302 -287 621 39 -516 230 -183
960 -183 -561 511 292 -766 -78 132 -436 233 457 -669 -274 370 -212 257 547 -516 -354 562 -11
979 -11 50 595 -422 -589 583 231 -204 456 -383 -803 609 406 -442 198 -271 -890 448 618 -438
998 -438 15 -274 -739 651 721 -636 66 94 -907 662 1240 -734 -290 512 -673 398 1389 -644
1016 -644 -834 562 -401 100 1228 -553 -1136 476 -83 -140 971 -583 -1328 507 249 -248 879 -405
1034 -405 -1356 529 725 -255 617 -143 -1211 532 946 -151 323 -179 -1112 595 993 -365 166 -58
1052 -58 -1204 445 1263 -607 -291 87 -1089 141 1347 -453 -740 136 -655 76 1295 -169 -862
1069 -862 72 -190 166 1129 -168 -883 125 -24 308 1113 -232 -1116 125 283 150 814 -155 -1211
1087 -1211 -51 545 177 386 -323 -1112 -81 641 262 199 -419 -993 116 766 303 107 -480 -838 296
1106 296 1060 261 -223 -292 -590 184 1122 300 -575 -520 -267 209 851 204 -673 -689 -189 445 686 -46 -825
1127 -825 -488 -75 433 776 -38 -1034 -334 449 303 544 173 -972 -515 878 610 85 59 -675 -614 786
1147 786 855 -175 -365 -478 -465 690 752 -272 -509 -478 -414 751 804 -559 -670 -132 -121 557 918 -433
1167 -433 -858 -11 158 535 754 -337 -846 41 324 544 581 -449 -895 192 438 239 443 -550 -1097
1186 -1097 210 713 3 121 -374 -959 92 850 190 -156 -468 -624 276 816 203 -73 -330 -613 499
1205 499 1001 -104 -247 -95 -549 310 1166 -111 -647 -41 -322 36 922 -59 -897 -144 -21 66 717 3
1225 3 -869 -128 101 41 773 -25 -989 -2 535 -44 645 184 -1058 -127 848 42 134 245 -858 -275 869
1246 869 139 -96 66 -749 -249 846 77 -283 108 -719 -349 963 58 -552 246 -410 -464 1043 288
1265 288 -853 263 34 -469 904 535 -857 33 290 -387 583 518 -876 -85 379 -381 394 478 -939
1284 -939 -221 568 -408 136 552 -883 -362 770 -268 -132 670 -582 -438 816 -64 -251 628 -403
1302 -403 -452 850 34 -412 548 -304 -566 796 113 -621 401 -117 -678 596 212 -680 302 49 -676
1321 -676 484 375 -700 115 253 -534 358 485 -727 98 434 -484 289 689 -550 -50 620 -418
1339 -418 52 647 -533 -286 534 -324 -118 485 -427 -424 516 -226 -319 436 -397 -470 528 -68 -317 399 -180
1360 -180 -411 517 103 -374 390 67 -418 471 303 -384 203 215 -376 239 375 -333 -35 202 -317 17
1380 17 213 -324 -135 145 -183 -2 167 -193 -107 185 -156 -3 256 -111 -124 285 -22 -48 279 -87 -95 283
1402 283 37 -118 191 -15 -205 207 57 -227 83 46 -233 39 182 -204 -18 54 -163 19 124 -136 -12
1423 -12 122 -96 64 214 -63 8 130 -105 32 186 -36 -48 158 -63 -24 148 -91 -181 103 -67 -89 89
1445 89 -94 -183 113 -85 -129 127 -112 -206 147 71 -138 151 44 -145 152 198 -46 164 43 -102 168 188
1467 188 -102 90 0 -133 121 200 -118 -124 43 -163 0 163 -142 -196 24 -63 -52 155 -42 -223 -1 57 157
1490 157 156 -70 -36 64 -22 251 214 -112 -54 235 -23 33 249 -80 -266 128 104 -73 130 -32 -352 53 159
1513 159 -86 35 -24 -281 -54 257 17 -93 -17 -59 -8 298 118 -134 -17 -8 30 273 201 -115 -43 41 35 202
1537 202 92 -172 -143 -2 21 83 135 -207 -209 47 71 28 44 -168 -190 93 211 72 -11 -151 -125 114 160 130 13
1562 13 -167 -71 223 125 20 75 -157 -215 278 203 -192 -14 -101 -242 211 229 -186 -144 -66 -191 155 278 -261
1585 -261 -95 84 -136 132 414 -156 -267 111 15 133 384 -50 -286 88 72 75 149 -155 -194 -48 28 98 147
1608 147 -286 -266 146 -29 -29 297 -267 -372 255 156 -175 226 85 -405 159 388 -93 7 130 -230 102
1629 102 375 2 -67 6 -243 58 315 -145 -149 45 -249 -81 258 -81 -311 -38 -64 -66 195 39 -226 -1
1651 -1 21 49 182 50 -124 13 63 116 233 7 -135 60 130 -10 178 -1 -221 -46 122 -59 11 20 -215
1674 -215 -112 170 47 -49 6 -125 -94 144 65 -86 66 -126 -51 217 79 -133 99 45 -99 279 119 -133
1696 -133 42 136 -221 60 273 -258 -134 257 -211 -117 211 -159 -179 156 39 -136 205 -6 -193 179 73
1717 73 -110 218 -48 -139 304 79 -171 271 83 -246 248 182 -312 102 164 -275 90 185 -343 86 220 -279
1739 -279 27 182 -356 -26 244 -221 -52 256 -286 -27 395 -235 -57 392 -126 -193 450 -78 -194 372
1759 372 -120 -179 348 -52 -250 275 -48 -294 300 -105 -366 291 24 -356 299 -3 -474 244 180 -380 262
1780 262 172 -342 163 274 -296 185 236 -323 125 306 -250 95 351 -309 13 372 -299 -47 397 -371 -119
1801 -119 381 -228 -173 383 -230 -197 405 -129 -264 391 -188 -294 379 -13 -310 349 4 -344 341 88 -368
1822 -368 284 118 -331 270 151 -372 199 135 -408 182 172 -424 133 242 -411 49 306 -414 49 356 -359
1843 -359 -50 428 -281 -95 452 -189 -74 445 -138 -133 428 -73 -206 359 -81 -306 340 -77 -252 286 -5
1864 -5 -370 230 13 -372 195 53 -370 159 134 -371 164 159 -281 151 242 -268 137 258 -229 76 260 -237
1886 -237 6 307 -170 -56 196 -200 -59 237 -147 -128 171 -121 -125 218 -116 -199 170 -154 -162 194 -38 -179
1908 -179 171 -21 -162 238 17 -212 213 112 -187 147 161 -234 98 185 -132 41 186 -161 -35 169 -206
1929 -206 -102 146 -167 -180 236 -70 -126 152 9 -207 146 23 -230 197 58 -166 133 163 -144 89 109
1950 109 -153 37 177 -146 -31 143 -149 -48 153 -70 -102 107 -65 -170 134 1 -124 151 -12 -87 198
1971 198 79 -120 113 78 -134 101 109 -173 113 105 -186 141 157 -188 10 159 -181 72 239 -194 -80 137
1993 137 -127 -17 175 -158 -173 193 -88 -84 197 -186 -180 221 -15 -121 199 -45 -232 234 86 -151 213 26
2015 26 -219 267 226 -212 103 113 -297 91 226 -217 6 138 -292 21 237 -216 -131 123 -185 -46 249
2036 249 -161 -95 224 -130 -40 257 -62 -151 233 -44 -57 242 -11 -133 138 -25 -62 239 -75 -197 67 56
2058 56 -137 58 18 -178 56 146 -107 48 4 -179 42 120 -149 51 63 -98 43 143 37 31 90 -59 17
2081 17 156 -8 -9 34 -25 -48 44 -6 -77 -3 -99 -81 68 60 -75 -7 -17 16 9 34 5 -73 -5 74 40 25 43 -31 41 140
2111 140 26 -17 21 32 -88 48 -28 -129 -27 -6 -37 51 -16 -84 24 -7 -28 15 -29 -53 36 35 -38 142 -13 -42
2137 -42 96 82 -32 52 51 -84 86 103 -100 -9 15 -54 26 69 -59 -42 0 -68 39 59 -118 -71 23 -61 52 108
2163 108 -152 -28 123 -83 -7 112 -36 -45 111 -4 6 150 -19 -38 149 56 -41 137 -47 -124 183 13 -139
2186 -139 71 -2 -163 103 44 -157 -19 -31 -100 78 75 -97 56 -50 -116 161 17 -103 -3 43 -86 140 133
2209 133 -141 -29 114 -39 89 179 -110 -48 65 -51 54 129 -115 -109 24 -38 68 146 -133 -118 125 -3 29
2232 29 157 -115 -113 176 12 -47 131 -47 -217 154 123 -44 65 -17 -144 29 136 -80 11 -35 -176 42 128
2255 128 -55 -51 -4 -114 31 179 -107 -111 51 -8 63 143 -32 -89 6 47 91 119 -23 -45 -23 62 92 66 -51 -113
2281 -113 -24 10 41 50 -82 -173 18 50 -30 18 0 -114 -27 76 25 -48 6 -52 -7 117 71 31 4 -34 45 60 67 32
2309 32 -93 -54 56 29 33 -95 -69 -17 -24 24 22 -97 -78 1 29 3 -10 -74 -51 33 59 63 13 30 -37 55 67 8 -4 25
2339 25 -54 88 121 -12 -7 43 -82 1 129 -28 -65 34 -62 34 91 -79 -57 39 -36 -14 75 -6 -95 78 -26 7 147
2366 147 -66 -56 3 25 -65 100 1 -85 23 -35 5 74 31 -56 11 0 -38 53 35 -61 -15 38 -53 -10 10 4 -69 34
2394 34 11 43 76 -6 50 25 -5 11 -38 -38 19 1 9 31 -11 -81 42 -12 -6 26 -50 -81 0 46 -74 -39 -5 -60 -3 -7 -15 -22
2426 -22 47 -36 30 65 -12 77 52 -52 -1 42 -40 56 40 -76 2 30 -57 6 65 -70 -60 12 -85 -4 33 -56 -37 38 -54
2455 -54 -36 87 -61 -75 79 -23 -5 65 -32 -71 95 60 53 52 42 -21 75 46 -61 -2 49 -55 32 -13 -39 32 -10 -109
2483 -109 30 42 -75 21 7 -81 0 62 -52 -17 67 -80 -20 129 -82 9 52 -10 12 93 -12 -26 61 0 -24 33
2509 33 32 -67 74 5 -16 18 44 -38 2 -15 -15 38 -25 -17 -21 32 50 -22 26 35 54 -1 33 41 27 9 -64 3 -8 -63 -25 62 -30
2542 -30 -63 -12 -11 -14 43 -10 -110 -12 -9 -53 60 61 -40 16 73 -35 -3 21 8 65 73 -14 -2 36 -24 61 50 -37 -35 47 -29
2573 -29 -58 76 -89 -17 34 -53 -79 104 -88 -98 56 -23 -80 86 -49 -116 86 64 -98 27 76 -19 99 64 -70
2598 -70 83 86 -95 32 95 -41 37 30 -104 58 77 -122 45 77 -116 -5 120 -161 -77 87 -82 -26 154 -39
2622 -39 -90 109 -34 -48 167 -36 -84 139 11 -36 120 -27 -93 99 29 -64 88 -13 -186 51 100 -132 74
2645 74 27 -160 40 95 -112 14 81 -119 -15 114 -89 -1 81 -122 58 171 -83 -48 133 -89 -15 122 -93
2668 -93 -128 53 -81 -91 115 -94 -155 82 -72 -93 156 -14 -157 111 11 -106 116 -6 -133 79 88 -19
2690 -19 72 51 -162 30 87 -98 52 61 -146 17 164 -59 -56 17 -120 -69 119 -58 -135 55 -124 -61 106 -35
2714 -35 -75 66 -78 -31 155 37 -118 72 -21 -52 147 11 -105 86 6 -24 150 42 -106 2 30 -73 60
2737 60 45 -169 11 19 -113 74 78 -197 -61 35 -58 36 14 -105 -74 178 7 9 28 -41 3 164 61 -56 70
2762 70 -61 -65 84 15 -91 -5 -36 -96 66 66 -112 -4 -42 -95 76 44 -122 38 2 -86 70 66 -85 -63 71 -43
2788 -43 115 84 -100 -14 12 -21 41 60 -56 -87 37 -39 55 38 -155 -35 82 3 3 25 -25 -45 120 40 33 61 19
2815 19 -75 51 87 32 15 -14 -22 118 65 -69 -2 46 -42 78 -4 -70 -1 -22 -73 10 -24 -29 -47 14 -1 60 60 -72 -32
2844 -32 -57 -1 32 124 -69 29 2 39 70 112 -62 27 34 21 -20 87 -15 -100 38 29 -7 -41 -65 -90 -29 -39 -45 -3 -79
2873 -79 -51 50 -21 -84 8 -7 -61 51 56 -28 45 -34 -21 72 27 -96 -17 20 -58 13 74 -40 -3 42 -62 32 19 -59
2901 -59 -30 46 -16 -11 75 -41 -43 45 -26 -6 35 -43 22 1 20 58 -38 -24 -14 20 13 8 -8 30 -40 9 36 -42 25 -31 -12 69
2933 69 24 -43 16 16 -65 22 2 -55 -29 1 -14 32 18 18 17 -15 45 -4 27 43 -14 -3 0 -32 -3 22 2 2 -27 -13 -58 -15 7
2966 7 -30 32 16 9 -9 43 -12 15 47 16 -63 4 8 -8 87 12 13 73 8 18 28 41 -14 16 -30 -17 62 36 -55 -16 3 -37
2998 -37 -14 -15 -90 -5 -48 -30 51 -1 -26 -45 30 -52 11 50 -40 -25 2 -57 1 34 -27 9 104 -44 22 74 -9 -30 -4 22
3028 22 -60 43 -7 -55 -38 70 -56 75 23 -84 -18 -1 -70 46 -9 -103 67 -8 -42 61 105 -60 -4 76 2 13
3054 13 69 -19 3 13 -28 46 15 -81 -4 46 -78 2 53 -14 24 80 -13 10 53 -38 -5 89 12 1 122 -16 6 77 46
3083 46 -60 62 7 -36 19 -32 21 14 -10 -16 6 17 -63 43 37 -29 29 -6 -96 30 13 2 40 -9 -28 83 81 -41 42
3112 42 75 -47 61 77 -78 -1 17 -23 7 31 19 13 33 -45 -20 47 -14 -44 43 2 -24 56 9 -50 35 6 15 32 9 -4
3142 -4 33 32 22 79 56 23 33 30 -10 56 20 -33 -34 -40 -39 -42 9 17 -23 -26 -48 0 -60 2 -9 16 -41 -45 -47 -12 -23 -30 -12 23 26 14 -7
3179 -7 6 11 28 9 -15 1 -32 35 -7 5 -27 3 -20 -20 -39 31 17 57 -20 -30 -19 15 51 -36 -45 5 9 -27 5 31 -49 -32 70
3212 70 2 -32 14 -6 25 36 -20 7 -2 -21 -22 -9 15 -2 46 -9 -25 50 31 -70 -40 -11 -15 63 97 -27 5 24 34 77 50
3243 50 2 -7 30 -51 17 59 -61 -82 41 -51 -8 30 -103 -27 28 51 -62 7 -43 -60 7 9 9 37 21 -12 40 34 39 -11 33
3274 33 -19 50 33 -33 27 55 -7 54 52 11 2 -27 -15 47 40 -67 -18 45 -3 3 -46 -32 -37 41 2 -79 44 20 -48 41 -5 6
3306 6 0 -29 -50 47 74 -26 -24 19 -76 16 17 29 -29 -59 -48 39 -19 -16 -28 4 -29 8 60 -13 -31 -31 -59 42 36 -31 36 -1 -6
3339 -6 29 39 -5 -40 64 18 0 -26 -42 -33 79 43 13 23 22 -59 15 39 -30 51 35 -38 -1 23 16 -9 -5 -32 -12 20 -15 -17
3371 -17 5 -42 -27 45 5 -8 21 -42 4 -14 -29 -68 -5 -7 -99 2 -20 -47 28 -41 -2 32 16 -45 55 5 13 79 4 -85
3401 -85 69 7 -8 48 71 -44 19 56 -3 6 19 -16 15 -5 11 -36 -12 -44 -31 80 -69 -50 -2 31 -65 20 -37 -56 40
3430 40 -26 -61 -15 26 -26 10 49 -12 38 20 -52 46 30 54 32 28 -50 35 4 -22 19 -17 -48 -25 20 6 17 35 -28 -44 25
3461 25 -23 -18 78 -13 27 36 -18 35 -4 -87 -11 -8 -23 -40 24 -41 -4 46 -56 -54 11 4 -45 49 15 -46 12 -1 -55 35 16 15 5
3494 5 59 3 -34 86 31 58 -13 -10 -28 13 21 -19 54 -3 -25 7 -34 -16 -4 -4 -10 54 12 8 1 -19 -37 -19 -6 14 -59 57 67
3527 67 15 30 4 93 10 39 36 -44 -35 18 66 -4 18 -27 -53 -10 8 21 -37 -4 -29 0 1 60 -23 24 -25 -14 16 18 -26 28
3559 28 -10 22 -6 22 27 14 8 22 46 24 5 10 18 -13 -37 37 -93 -8 7 -33 -19 5 -4 18 15 -13 1 10 -30 -35 -5 1 30 40
3593 40 -16 -7 50 -8 22 0 -7 13 19 6 -29 -29 19 1 -4 29 -13 37 7 9 17 -1 32 -63 25 -7 31 -28 15 45 28 37 29 33 30 -12
3629 -12 -9 10 40 6 -7 14 30 -1 -3 25 26 -33 -31 -15 -14 7 19 -17 20 -21 13 -6 41 -12 -10 72 10 -1 32 8 8 69 -53
3662 -53 39 61 -6 -36 2 17 7 15 36 34 -4 -30 -72 -10 -11 -22 -3 -22 -10 -4 6 0 0 33 -11 -18 35 -15 -9 1 -10 10 -13 -26
3696 -26 11 9 -11 37 43 -28 -46 55 15 -1 -20 -10 -57 23 41 -5 59 4 -10 -42 72 -88 -19 39 -44 -23 41 -35 14 30
3726 30 23 -22 59 -10 7 50 -2 -16 1 -12 -67 -25 29 36 -13 29 -11 32 4 -37 52 11 -27 59 40 -40 -22 -26 -20 7 53 21
3758 21 -11 17 2 -68 3 -22 -47 22 -49 3 45 -26 16 -36 -22 -8 8 4 -28 27 -7 -9 -16 44 2 48 -21 4 63 30 12 49
3790 49 -15 -7 72 16 8 24 -28 -41 22 21 -11 38 -2 -3 -2 8 -32 -45 -77 -36 -30 -37 21 47 19 -18 3 51 3 28 21 -11 -15 -10 -26
3825 -26 55 75 40 -22 -9 -1 37 13 7 18 -18 -24 13 21 6 -39 -47 -41 9 26 -41 -4 5 -41 27 66 3 30 -17 -25 37 25 32 8 4
3860 4 -4 51 8 59 15 16 28 27 -14 -24 3 10 -12 18 3 -15 4 27 11 5 -26 36 -42 27 18 29 -13 35 -13 46 39 -17 -26 -19 -59
3895 -59 -2 28 -67 -57 -17 27 11 29 7 -30 12 4 -77 19 -5 36 4 23 -57 16 32 4 38 30 25 11 26 35 -10 -39 32 -28
3927 -28 -6 3 -60 8 0 -33 -54 -40 4 -33 12 12 -21 18 3 -67 30 32 -22 30 -5 -22 -10 -11 -14 24 18 19 17 -30 -13 42 26 -46 35
3962 35 -26 -38 50 -28 8 7 2 -69 11 6 -15 21 -17 -45 -19 22 17 1 -20 -21 -1 -9 -3 21 -42 20 15 33 -9 29 -15 -1 -1 -30 -20
3997 -20 14 26 -32 30 -44 19 15 -64 -42 -48 -31 -5 29 -13 -8 13 3 -34 -38 14 -30 23 12 -46 -35 32 -45 35 -25 -17 -33 24 13
4030 13 -20 17 18 17 -41 3 29 -34 93 20 49 18 22 69 63 -16 24 36 3 16 41 -10 -22 22 19 -13 62 -11 -25 -14 8 10 4
4063 4 -17 32 10 1 -50 24 11 -2 5 -32 21 19 65 -40 39 52 -6 24 8 53 20 69 7 -6 19 3 -13 38 -24 -20 -22 -3 -35
4096 -35 16 48 -21 0 -28 -31 -29 -5 7 25 -19 24 6 13 -63 -8 54 -17 13 4 -22 54 -6 1 73 39 18 0 38 13 7 -40 45
4129 45 14 12 -4 23 20 11 -35 11 33 7 -1 -4 -66 -54 -34 -89 -14 7 -17 14 -5 18 26 -26 -28 -31 15 -6 -19 57 -32 -2 -2 59 19
4164 19 12 -38 -15 31 1 12 -16 5 -7 19 37 -6 6 30 -40 -25 -26 -5 -11 8 -1 3 -44 4 25 -11 25 -43 -31 34 -8 8 -20
4197 -20 -29 38 -46 -19 40 14 -16 -1 70 -11 26 49 -16 -2 80 -4 -1 8 51 -23 -10 -51 20 -15 15 -25 -16 -33 -30 5 -16 -17 -13 10
4231 10 -7 -12 -18 -8 -3 3 -25 24 40 9 -26 -17 -13 44 -51 24 -28 -32 23 18 16 53 21 -32 16 52 10 -9 -38 15 -6 -3 14 -19 12
4266 12 -36 -4 -23 25 6 -26 34 19 -27 -15 26 -7 72 -29 -49 21 4 10 32 -30 -20 24 27 39 16 -30 -45 5 15 21 38
4297 38 72 0 2 20 10 -2 40 48 -19 39 -4 -37 -8 -24 -39 24 8 -30 26 -25 -43 -66 -36 31 -10 46 -12 26 35 10 12 75
4329 75 8 -25 1 -40 50 -6 -45 26 42 20 -5 -8 13 -26 27 0 11 37 6 -38 -9 15 -62 -3 -18 -1 32 6 -19 -35 10
4360 10 -57 31 26 -62 -22 27 -18 47 -7 -13 18 52 26 44 1 -33 -2 94 37 -17 28 -6 -3 -3 -15 -36 -5 20 1 0 15 1 19
4393 19 24 -27 29 -2 -52 17 -90 12 -29 -55 -34 -16 19 31 46 36 -23 -53 23 37 26 31 -48 51 4 9 52 41 -7 14 68
4424 68 -41 19 -18 -3 -18 5 -10 -19 64 -30 17 -7 14 -9 18 30 2 -32 0 16 28 -6 0 9 21 -10 -31 -23 4 32 -2 -10
4456 -10 32 7 -15 7 28 -34 -18 18 52 -10 -5 -34 30 44 5 31 -44 20 -16 57 2 -66 2 10 -19 13 -41 -13 -49 -22 -33
4487 -33 -33 18 -60 -16 33 -11 4 -15 -22 31 -2 -12 8 2 23 49 46 -44 12 16 42 11 28 -44 11 56 -6 -28 28 -33 -39 -18 -74
4520 -74 -16 -45 5 16 -40 -9 -10 25 21 38 -45 5 17 -6 -21 27 -27 -36 -39 -12 23 -3 18 6 39 -22 -42 -4 14 11 24 42 37
4553 37 25 9 -41 8 -40 39 -37 -19 52 21 6 29 35 -10 -2 3 -9 16 55 8 -6 -19 18 29 -23 10 23 18 -43 -33 -31 -9 -30
4586 -30 9 -3 5 3 6 19 35 -6 8 -32 3 -17 -32 29 17 70 6 9 9 -2 -39 6 3 4 -43 8 17 -9 -34 25 -40 7 38 1
4620 1 -11 24 -44 5 71 -6 -9 29 -28 -34 3 35 52 4 7 -4 27 -37 -9 16 26 -36 4 24 22 -32 -16 -17 -10 32 6 -37 15 -29
4654 -29 5 31 -20 -11 10 -37 2 18 -32 -3 19 14 34 -12 16 -21 29 59 10 55 26 30 56 0 31 31 10 22 -7 16 -56 17
4686 17 30 -25 33 35 3 8 21 28 16 64 -3 4 40 13 8 -19 -28 -36 38 -38 -1 37 11 -10 29 -2 27 4 -9 0 20 14 36 38 17
4721 17 14 73 2 -18 9 21 -34 13 11 -17 14 -10 -8 19 -15 -57 -6 32 2 -23 26 -11 -29 1 -72 -37 -17 -5 34 -22 -21 -22 -12
4754 -12 20 1 5 -15 -16 48 -1 31 40 -41 -9 77 -23 23 3 28 7 -13 26 -30 89 -24 -9 -38 26 9 -21 -19 -3 21 -19
4785 -19 -20 -22 -39 12 -33 9 -48 33 1 2 13 9 13 28 -11 2 50 1 9 14 27 0 0 -4 -14 -20 14 -39 17 -34 -3 -51 3 -19 41
4820 41 19 -75 -43 0 7 7 -17 20 25 -15 -4 -5 6 35 29 -23 -27 38 29 -3 10 38 87 53 18 -43 53 -17 -27 6 -11 27 -23 65
4854 65 -15 12 -1 1 -5 0 -9 5 -29 30 -12 4 35 9 41 18 -56 8 -8 -2 -18 -7 -11 -47 -8 -16 -6 19 6 63 52 -33 -59 -18
4888 -18 45 19 -13 16 48 22 -23 -2 3 -33 -24 -28 -37 -2 -11 8 -52 25 -23 -43 -28 -2 -14 -21 28 63 1 -39 56 8 8 -12 1 -14
4922 -14 -25 -50 5 26 15 30 54 7 13 -5 42 -30 43 -26 -70 -7 -22 57 -35 1 18 -40 6 10 -56 -53 -17 0 6 6 78 -14 10
4955 10 -22 -2 -25 -29 -13 9 34 -27 16 -30 -9 -49 -45 -37 7 -20 20 6 55 22 30 14 21 -26 -3 23 25 -19 3 36 12 2 4 -9
4989 -9 6 -46 -36 48 37 -14 -12 -4 10 -36 -40 29 43 -8 11 -43 1 16 -3 22 -77 -37 14 0 87 6 32 74 49 48 25 42 30
5022 30 20 -12 -32 11 -25 -40 11 -8 23 -53 -11 -11 -43 -9 0 28 2 34 5 -15 -64 -20 29 -16 -35 35 5 -12 -1 21 0
5053 0 1 -15 62 87 28 8 -47 -23 4 7 12 -40 8 -31 3 -23 40 16 -10 -38 -31 -7 -26 -16 1 23 -11 -4 -40 -16 23 61 -11
5086 -11 17 12 -21 4 18 46 -30 1 56 19 4 51 11 -5 33 -4 60 40 23 27 45 -10 15 11 8 10 -11 -44 -6 -38 -9 -19 15
5119 15 17 22 -7 6 14 21 -6 -60 -48 -25 -20 25 18 -18 -43 -17 -62 -19 -8 28 3 31 24 65 -12 18 40 23 -1 15 48 6 -32 34
5153 34 2 28 -1 12 -22 -34 21 -14 -53 -33 -43 -29 26 -19 25 0 -37 23 14 36 16 1 -39 -30 -3 -11 -17 44 -35 33 -25 -36
5185 -36 -3 14 43 32 2 -35 -10 -16 19 3 6 -25 15 -42 -7 17 27 47 1 -11 -52 -51 -20 -8 -13 -51 7 6 52 -13 -8 -15 24 47
5219 47 -25 20 -7 64 -9 -13 38 22 -24 34 -5 -28 13 43 18 2 -18 12 59 -16 27 11 53 -16 5 -5 -54 11 15 42 8
5250 8 -22 10 20 -39 -53 28 -88 19 7 19 22 -12 19 31 -1 -12 25 44 79 -40 42 2 -17 -6 -13 22 33 28 -14 -2 -23
5281 -23 -35 -40 -9 10 -39 16 -6 -66 -46 -34 -72 27 33 -61 30 55 -13 14 27 -39 -13 48 10 42 10 32 25 -3 0 48 -15 11
5313 11 -30 41 45 -21 -14 30 -37 51 -21 -47 14 14 19 -31 -26 -2 19 -64 2 -9 -4 -56 6 20 7 47 27 17 25 -24 -10 -12 39 39 37
5348 37 5 55 41 -38 3 12 24 4 33 12 51 65 14 9 39 3 -51 -39 -40 6 53 7 -9 9 18 10 -6 15 19 -34 -54 16 -28
5381 -28 -53 5 50 10 1 91 50 12 41 13 -8 -7 11 -1 44 -20 10 20 5 12 27 11 44 13 -19 8 -26 41 -26 -10 -29 11
5413 11 -37 -41 -10 -44 -46 -35 -7 0 -19 14 37 0 -10 -11 23 27 -2 -3 57 47 -16 28 44 -29 17 9 38 24 4 -36 -36 55 -5 9
5447 9 -12 22 -56 4 21 -8 37 -9 -10 29 -24 -10 1 27 49 -38 30 -29 -19 31 -17 28 11 -30 16 -49 34 4 8 44 14 -14
5479 -14 10 24 36 25 1 -20 3 -4 -9 -4 -51 18 -8 -12 -35 25 -54 -30 -30 -60 -33 -44 6 -27 -10 -17 -14 -41 16 -1 -54 -43 -9 33
5513 33 9 21 24 28 -14 9 10 41 7 30 84 -64 24 34 8 -14 47 -59 -35 39 -1 -31 -15 -11 -1 -22 27 -15 -3 0 46 45
5545 45 -29 18 -17 -4 -14 -54 3 6 0 7 -1 -11 6 -17 -1 -21 -15 -39 47 -19 -16 1 -41 30 -13 14 18 18 28 -17 -57 11 24 18 -21
5580 -21 -35 -43 -10 13 -8 -20 1 -4 -73 1 6 20 -38 -16 -29 -20 -23 8 -3 -10 34 3 -11 35 20 35 -40 -29 -15 -24 -48 -30 -40 -1
5614 -1 0 -15 21 -2 5 -3 28 16 57 5 35 -9 -28 44 -21 -15 -63 -7 54 -36 7 5 -1 -42 -18 -29 68 16 -19 7 52 -40 -17 13
5648 13 40 9 0 20 -25 -15 18 40 -11 0 -55 19 58 57 27 -27 -65 34 -7 -6 -44 -5 -20 24 -9 26 3 22 21 17 -9 -35 -5
5681 -5 -13 -18 -25 10 -33 -41 4 21 -7 70 25 31 46 -24 58 14 27 35 -12 59 -21 77 21 -43 17 -31 11 -20 6 51 -46 -16 -15 -50
5715 -50 44 -49 -29 4 20 48 -13 -1 35 21 -12 24 -10 -39 -51 19 -14 16 -16 28 6 1 22 25 4 17 45 32 0 -5 -12 14
5747 14 16 -13 44 45 -59 -28 -7 16 25 21 49 -6 -23 5 0 7 6 6 -3 -24 23 -10 -8 34 65 61 36 17 37 -7 -1 -10 34 -3 -3 31 36
5784 36 4 -23 25 0 -7 7 -2 -36 57 14 46 65 20 -25 -2 20 -2 -45 -43 -19 41 27 -35 -4 16 -5 9 -39 -35 52 1 8 3
5817 3 13 -34 -3 44 -36 13 -23 -57 -40 -37 12 -44 -20 -66 -29 -13 -3 30 -23 7 -44 28 13 6 -18 -8 -8 -32 -72 40 -4 -10
5849 -10 15 41 34 -17 -72 16 -46 21 0 -50 20 56 -22 -38 37 -21 2 30 -20 2 14 -26 34 0 32 2 37 10 -16 3 -58
5880 -58 -57 5 -7 -43 -95 -64 -15 -14 -6 -18 20 -30 5 -69 7 7 -16 -31 -74 -5 11 -12 2 22 28 -26 -21 13 -54 49 -22 28 -2
5913 -2 -18 -38 28 -42 -7 20 18 19 -65 14 -11 7 38 -48 -6 -18 -12 -67 -26 20 -9 -5 55 -16 16 11 -48 2 12 -8 28 50 25
5946 25 -4 38 47 -25 27 -10 39 18 -17 -42 14 5 18 11 -6 -40 -7 7 -6 -27 -50 -16 -14 -33 -26 -17 -40 23 39 -35 23 55 -20
5979 -20 -6 82 0 15 -32 0 7 -20 19 46 45 -46 9 -14 50 24 26 13 48 26 -13 -56 -25 -21 -33 -54 -9 -50 -12 -20 -12 5 -14
6012 -14 -2 -4 -12 -15 32 2 23 -10 -13 39 4 27 46 -16 -18 31 6 21 16 57 -1 19 -25 11 15 -9 2 -29 20 -10 13 14 -18 -10 -61
6047 -61 8 -19 -28 2 -5 -16 -40 19 -39 14 28 -32 8 -13 19 46 -26 -11 38 24 -33 -13 -10 13 24 38 -45 -27 -56 -33 4 -35
6079 -35 33 -1 37 41 23 4 3 21 31 -21 -5 -1 12 -5 -37 -11 -17 -43 -2 -42 -40 31 -61 70 -25 26 60 -12 0 8 19 29 4
6112 4 10 24 42 28 7 -20 31 -24 -31 12 42 26 38 1 65 49 20 -21 -8 -17 12 34 48 8 3 -8 35 -59 -18 -35 -21 -6 -21
6145 -21 -38 -2 -17 21 27 21 47 13 0 -23 88 64 -9 -46 -26 65 -34 36 -11 -10 66 -26 -15 -40 32 12 9 -14 -28 -25 -49 -18
6177 -18 5 -34 -21 11 44 -32 -29 38 2 2 -26 -9 -19 -16 -2 -17 32 13 3 -4 23 0 14 15 12 21 -3 -37 40 14 -15 -7 37 24
6211 24 -23 -16 -17 12 -20 -14 -7 2 -7 56 56 -22 -7 36 -12 -93 44 -6 12 -8 -27 2 20 24 -58 18 50 -41 40 48 47 -10 3 0 27
6246 27 27 27 43 0 10 0 -1 60 37 -5 21 48 -40 -6 14 -47 -32 9 5 50 8 15 8 -37 45 -24 21 -45 -29 -46 15 8 -37 -17
6280 -17 33 50 27 28 12 79 -8 20 50 38 14 7 10 -30 10 13 1 13 17 30 31 -22 -18 4 -40 -31 66 -27 12 -12 -29 -10 65 -1
6314 -1 -2 0 -16 -30 38 -5 -42 -20 -10 59 -8 41 -34 17 -4 29 -8 35 -40 5 27 -21 -3 5 21 -34 2 -5 -35 40 -6 -41 72
6347 72 -9 9 -30 -9 -3 -12 -11 27 -4 -10 3 -18 8 -8 38 -12 -10 8 1 12 20 29 46 -28 -7 -4 30 8 -2 -5 1 -13 15 36 -1 -25
6383 -25 42 -4 11 1 17 3 -18 3 14 24 -20 -38 -32 -62 -29 -20 -30 -5 21 13 -37 39 -32 25 7 43 -46 -15 47 34 40 44 8
6416 8 21 21 37 23 30 0 -31 -4 20 30 -28 -40 -53 33 -32 -29 -5 -31 -27 -4 15 -42 0 11 -35 11 -25 0 -5 -6 -40 24 17 -28
6450 -28 7 -13 -42 0 5 34 -7 12 17 18 48 -2 -33 -5 58 -11 24 -1 -2 12 -26 -18 -44 31 -15 -7 -7 -53 10 -7 40 18 19 -19
6484 -19 -2 -4 30 -1 -15 30 45 -41 42 24 41 64 1 44 43 9 -2 33 4 -55 55 27 -22 15 -45 51 -42 54 30 54 -7
6515 -7 -19 49 -10 -37 -52 -18 -15 6 -43 1 -12 17 3 -63 -7 -10 4 -17 11 -15 -3 9 12 26 7 26 9 71 35 29 56 -13 42
6548 42 49 41 21 -11 13 27 27 -11 -47 18 -11 -12 -25 -7 2 4 16 -13 -53 2 -21 -30 -20 4 13 38 -50 20 63 46 18 -5 -13 -6 -13 1
6584 1 25 6 -36 -6 25 -22 -1 23 15 -27 14 -3 21 24 -5 14 16 7 -68 16 -43 -10 -3 19 -1 6 -6 -3 -10 -29 11 41 -10 3 -26
6619 -26 18 -2 27 -1 -22 16 -12 22 6 -40 63 -3 14 39 -6 5 4 -13 -15 37 9 27 -3 -19 28 -20 -4 -24 -55 17 18
6650 18 -55 6 -14 -5 -28 14 15 41 36 -3 49 31 62 14 -34 -7 18 -30 69 -5 36 2 -5 -5 65 32 -22 -73 9 -12 -26 -79 -12
6683 -12 14 1 -48 -1 47 -7 20 33 7 -7 -22 -13 25 -31 3 -3 -33 -51 43 -19 68 18 -50 -26 3 7 4 -56 -37 27 3 -13
6715 -13 -34 17 0 43 41 -7 -6 -16 9 -13 40 -25 26 -1 3 3 0 37 25 4 -4 -45 -4 6 -6 0 -33 9 13 -37 -45 -17 -71 -46 -16
6750 -16 34 6 23 -30 -37 25 18 43 36 -28 -11 25 -12 -47 24 -2 -67 -48 -1 5 -5 -12 -8 10 -3 -18 -28 43 -9 2 4 -39 -4 26
6784 26 -6 -10 -13 1 37 30 -2 57 44 19 18 -33 -8 15 -50 19 40 11 13 -36 18 19 -29 -46 16 -14 -4 -77 -36 2 -20 -11 12 -5
6818 -5 -11 -1 34 14 36 18 -21 22 15 -14 2 -1 46 6 33 63 -4 9 -5 -45 -21 10 -62 -31 -50 -25 17 -19 -8 16 60 21
6850 21 15 16 13 52 -23 64 -17 -17 -11 18 -11 5 22 26 -3 9 -46 -16 9 -35 12 7 -7 -8 -9 -10 33 -10 55 -11 32 12 59 20 16 44
6886 44 31 95 7 -79 -45 -47 -42 23 9 5 -3 -38 -2 -4 25 3 -24 6 52 12 -44 42 3 -16 5 -50 51 -7 15 -42 35 -11
6918 -11 4 38 -39 -14 20 25 16 -65 26 -24 -13 33 -15 -6 39 33 -9 -27 14 34 -43 -25 -3 13 -14 -27 -18 -14 -64 -26 -40 13 35
6951 35 -15 12 -16 -31 10 7 64 5 -27 -16 84 5 27 -27 7 -24 5 -16 7 13 9 24 6 68 -31 -27 -10 -9 70 10 19 55 -7
6984 -7 37 -20 -50 3 12 -64 -5 -26 26 -9 -17 -3 18 -16 -16 53 -19 3 28 13 4 34 16 -19 54 13 -6 -19 -35 51 -4 -32 10
7017 10 7 32 -7 8 9 -8 -17 4 21 24 -41 -11 8 -20 -9 -25 2 -21 0 12 -11 -8 -45 -3 12 14 42 -1 39 21 43 14 16 18
7051 18 -36 46 35 -10 14 13 3 -9 -14 27 15 -28 -29 17 -87 44 6 -21 -21 -41 -7 19 -91 -36 -52 24 6 -22 -30 9 1 3
7083 3 -11 -10 -17 27 -7 34 39 16 -1 -19 -9 -11 -16 -23 19 -53 4 -22 14 65 23 52 -35 30 -14 -42 8 -42 -20 -35 16 30 32 30 -27
7118 -27 19 -62 35 -16 34 7 13 22 -2 2 25 15 -15 56 -7 -25 3 32 30 -17 -7 29 68 8 8 -50 -3 5 -7 4 22 11 54
7151 54 -32 -5 9 -31 -43 -1 8 -5 -77 -27 16 28 18 15 -22 -45 -8 15 25 -6 -59 -49 1 -1 6 17 24 38 -38 -9 -32 16 -34
7184 -34 -29 13 30 23 10 3 -36 23 -1 9 0 16 19 6 28 -14 13 5 24 43 -5 -65 10 10 -25 57 74 -55 -3 36 -6 -20 46
7217 46 -19 -12 24 33 28 -30 -28 14 19 -35 -11 -35 -25 -14 -19 -54 28 39 -26 38 -40 15 3 24 35 -28 -10 -18 -7 24 36 7 23 17
7251 17 38 59 -5 37 43 -12 22 14 -57 26 -42 16 19 22 -25 42 74 2 19 43 -15 12 -3 -39 9 -59 -12 -5 -16 -14 -16 58 -22 13
7285 13 48 -22 -39 -29 -5 9 61 60 -47 -22 -6 -35 -42 42 -2 -5 37 -17 -5 -34 0 -25 8 -7 22 38 -49 12 -7 13 14 -2
7317 -2 43 -7 22 4 42 -47 -9 -36 -6 -8 16 -17 -54 0 -25 -10 -59 10 -3 -11 21 -28 6 24 75 33 -7 21 -37 27 -2 -15
7349 -15 35 -46 4 29 5 -18 -41 19 19 4 -9 -22 28 -5 -22 -3 -46 -22 33 -12 15 -28 12 -1 24 -35 20 -22 -21 8 20
7380 20 27 -17 24 -5 23 17 37 30 -30 -13 13 34 0 15 14 36 -23 -6 12 4 -29 67 38 -14 9 9 -22 37 -37 -31 3 -12 -18 29
7414 29 -12 -18 15 14 16 54 4 -48 9 -45 -5 3 -33 4 25 25 22 -24 48 -12 29 -60 21 -2 16 41 28 16 -46 -21 -10 -9 -56 -11
7448 -11 7 -35 -50 30 -14 13 19 25 -12 -33 -42 -36 45 -3 30 20 13 -45 4 11 -31 5 -32 -43 56 15 24 18 29 -20 17 -29 2 25
7482 25 -17 11 -15 -19 -11 9 54 -40 -51 -31 -62 -30 -25 -15 -29 -35 -18 -18 -44 10 40 -2 5 -19 -47 36 37 10 -16 35 -19 58 -27 -22
7516 -22 55 64 76 38 -13 -20 25 -2 -10 5 19 23 -28 -17 5 32 -20 2 23 3 7 19 6 52 39 25 28 19 23 -26 -24 6 6 16 -43
7551 -43 -13 -4 7 63 7 -9 15 9 -31 -8 18 21 -11 24 55 61 3 -44 13 -48 -12 12 -9 38 25 8 -30 17 41 50 27 -4 3
7584 3 11 -33 10 0 -16 3 32 -17 -47 -2 -25 -19 6 4 27 8 -22 -10 1 31 2 -7 9 26 -34 31 -12 37 -2 25 -34 -34 4
7617 4 55 -32 -6 -26 14 7 47 -26 32 -43 -10 -18 2 -10 -39 3 -1 18 -8 5 -16 6 22 21 -10 6 22 23 62 26 -20 -21 -15 31
7651 31 -32 33 32 14 6 19 -15 13 -9 -4 -35 -60 -47 -6 -13 11 4 27 -22 25 -22 -16 66 37 19 -16 -14 -27 -13 21 -20 -25 1 17
7685 17 12 -23 10 31 -9 -17 36 -60 7 -3 -24 34 1 1 4 -9 -9 -2 3 -14 -58 -12 -37 -41 -1 -27 27 -6 -8 6 -30 -18 27 6 -17
7720 -17 2 -28 19 -4 -4 -15 17 20 -34 -7 -7 -24 -23 -27 -19 -2 -28 -14 -21 -24 -29 -2 6 -46 22 -18 26 2 6 -4 -25 -7 -7 -44 2 -12
7756 -12 8 -7 -2 13 15 -59 -32 -26 -11 -10 -1 20 -28 22 -5 25 29 -41 -65 26 -13 39 -25 -16 0 -20 -50 -15 0 -5 -29 4 -7 0 -11
7791 -11 27 -46 27 7 -37 9 41 -13 11 -9 4 6 -21 5 8 14 3 6 -22 24 25 23 48 -11 34 5 -48 -34 32 14 -54 14 -3
7824 -3 18 -18 -3 28 -6 14 30 42 11 -66 20 -28 -22 25 -13 -31 12 2 -12 42 25 17 35 30 11 2 -9 -5 -40 -39 26 7 -44 17
7858 17 22 7 6 -9 -50 -4 -29 9 -17 0 -2 19 15 15 -13 22 1 -39 -10 -20 7 4 -27 -48 -23 -50 25 25 40 -6 13 -24 -32 4
7892 4 -2 -1 50 29 0 -30 4 42 8 44 0 -21 24 -19 19 -27 -26 20 5 13 17 17 22 -47 42 18 -13 12 -15 3 23 15 -8 25 -7
7927 -7 16 -3 -24 5 42 21 -12 -20 -11 -27 -37 26 37 9 -14 0 24 -2 29 15 -43 -29 26 35 9 29 -44 -47 -30 -32 38 1 -64
7960 -64 4 31 -5 3 -48 -36 -42 -14 -4 -22 22 16 -26 -2 6 27 10 20 -22 -4 13 6 -7 -25 14 -17 18 8 10 -29 -41 43 -22
7993 -22 17 4 -32 32 -43 26 -26 2 -4 24 -9 -24 30 21 -44 -2 -4 28 -42 -36 21 -13 80 56 54 -62 -13 -44 -4 34 -49 39
8025 39 -17 7 33 -50 5 21 32 12 61 23 27 46 -48 -4 24 3 14 22 -11 -51 7 35 -16 -46 -14 4 28 -19 23 29 36 -37
8057 -37 -9 -11 -8 22 -19 -27 34 -11 -9 66 -18 42 13 -2 4 27 -18 -28 -71 5 1 40 -55 -5 19 -47 40 -29 -38 -2 -25 23 29 7
8091 7 -23 14 58 27 56 -59 14 27 -5 -6 9 -16 37 -35 -6 -5 14 30 -48 -2 20 -28 36 17 9 -2 22 -23 -33 -9 -75 -20
8123 -20 -31 -3 14 8 -16 -12 -11 6 -23 42 -39 1 0 -17 -35 -39 -23 1 -9 3 5 5 -12 -52 -82 7 -5 -20 13 -20 -8 11 -78 10
8157 10 -32 14 -10 1 -29 -13 -19 -1 -4 -19 -1 -35 16 -15 -72 -23 -9 29 41 19 -5 -35 36 -14 -1 17 41 9 23 -3 67
8188 67 42 49 49
8191D9
##END NTUPLES=NMR FID
##END=
