##TITLE=1H_LR-758-R5-DX2
 CDCl3
 8 sc, 
 4.9.2023
##JCAMPDX= 6.0         $$ Bruker NMR JCAMP-DX V2.0
##DATA TYPE= NMR FID
##DATA CLASS= NTUPLES
##ORIGIN= UXNMR, Bruker Analytische Messtechnik GmbH
##OWNER= root
$$ XWIN-NMR		Version 3.5
$$ Mon Sep  4 14:44:24 2023 Russian Standard Time (UT+4h)  she@DPX200
##.OBSERVE FREQUENCY= 200.13135
##.OBSERVE NUCLEUS= ^1H
##.DELAY= (6, 6)
##.ACQUISITION MODE= SIMULTANEOUS
##.ACQUISITION SCHEME= undefined
##.AVERAGES= 8
##.DIGITISER RES= 18
##SPECTROMETER/DATA SYSTEM= spect
##.PULSE SEQUENCE= zg30
##.SOLVENT NAME= CDCl3
##.SHIFT REFERENCE= (INTERNAL, CDCl3, 0, 15.7039)
##AUDIT TRAIL= $$ (NUMBER, WHEN, WHO, WHERE, WHAT)
$$ ##TITLE= Audit trail, XWIN-NMR		Version 3.5
$$ ##JCAMPDX= 5.01
$$ ##ORIGIN= Bruker BioSpin GmbH
$$ ##OWNER= she
$$ F:/spectra/data/she/nmr/H-F/1/audita.txt
$$ ##AUDIT TRAIL=  $$ (NUMBER, WHEN, WHO, WHERE, WHAT)
(   1,<2023-09-04 14:41:44.28 +0400>,<she>,<DPX200>,
      <created by zg, POWCHK disabled, PULCHK disabled
       configuration hash MD5:
       00 E9 B6 7A A2 85 ED C7 34 08 36 98 17 FE 4E 26
       data hash MD5: 16K
       52 69 03 86 96 AA CA 83 EE 55 B6 2C CD AC 03 28>)
$$ ##END=
$$ 
$$ hash MD5
$$ 0D A9 FF 44 DE 5E BD 8A 53 8F EE B6 80 9F 6A 3F
##$RELAX= 
##$RELAX= 
##$RELAX= 
##$RELAX= 
##$RELAX= 
##$RELAX= 
$$ Bruker specific parameters
$$ --------------------------
##$DU= <F:/spectra>
##$EXPNO= 1
##$NAME= <H-F>
##$PROCNO= 1
##$TYPE= <nmr>
##$USER= <she>
##$AMP= (0..31)
100 100 100 100 100 100 100 100 100 100 100 100 100 100 100 100 100 100 
100 100 100 100 100 100 100 100 100 100 100 100 100 100 
##$AQSEQ= 0
##$AQ_mod= 1
##$AUNM= <au_zg>
##$AUTOPOS= <>
##$BF1= 200.13
##$BF2= 200.13
##$BF3= 200.13
##$BF4= 200.13
##$BF5= 200.13
##$BF6= 200.13
##$BF7= 200.13
##$BF8= 200.13
##$BYTORDA= 1
##$CFDGTYP= 0
##$CFRGTYP= 5
##$CHEMSTR= <none>
##$CNST= (0..31)
1 1 145 1 1 1 1 1 1 1 1 1 1 1 1 1 1 1 1 1 1 1 1 1 1 1 1 1 1 1 1 1 
##$CPDPRG= <>
##$CPDPRG1= <>
##$CPDPRG2= <>
##$CPDPRG3= <>
##$CPDPRG4= <mlev>
##$CPDPRG5= <mlev>
##$CPDPRG6= <mlev>
##$CPDPRG7= <mlev>
##$CPDPRG8= <mlev>
##$CPDPRGB= <>
##$CPDPRGT= <>
##$D= (0..31)
0 1.2 0 0 0 0 0 0 0 0.06 0 0.03 0 0 0 0 0.0002 0 0 0 0 0 0 0 0 0 0 0 0 
0 0 0 
##$DATE= 1693824103
##$DBL= (0..7)
120 120 120 120 120 120 120 120 
##$DBP= (0..7)
150 150 150 150 150 150 150 150 
##$DBP07= 0
##$DBPNAM0= <>
##$DBPNAM1= <>
##$DBPNAM2= <>
##$DBPNAM3= <>
##$DBPNAM4= <>
##$DBPNAM5= <>
##$DBPNAM6= <>
##$DBPNAM7= <>
##$DBPOAL= (0..7)
0.5 0.5 0.5 0.5 0.5 0.5 0.5 0.5 
##$DBPOFFS= (0..7)
0 0 0 0 0 0 0 0 
##$DE= 6
##$DECBNUC= <off>
##$DECIM= 32
##$DECNUC= <off>
##$DECSTAT= 4
##$DIGMOD= 1
##$DIGTYP= 9
##$DL= (0..7)
0 120 120 120 120 120 120 120 
##$DP= (0..7)
150 150 150 150 150 150 150 150 
##$DP07= 0
##$DPNAME0= <>
##$DPNAME1= <>
##$DPNAME2= <>
##$DPNAME3= <>
##$DPNAME4= <>
##$DPNAME5= <>
##$DPNAME6= <>
##$DPNAME7= <>
##$DPOAL= (0..7)
0.5 0.5 0.5 0.5 0.5 0.5 0.5 0.5 
##$DPOFFS= (0..7)
0 0 0 0 0 0 0 0 
##$DQDMODE= 0
##$DR= 18
##$DS= 0
##$DSLIST= <SSSSSSSSSSSSSSS>
$$ [...]
##$SUBNAM2= <"">
##$SUBNAM3= <"">
##$SUBNAM4= <"">
##$SUBNAM5= <"">
##$SUBNAM6= <"">
##$SUBNAM7= <"">
##$SUBNAM8= <"">
##$SUBNAM9= <"">
##$SW= 18.05172834244
##$SWIBOX= (0..15)
0 0 2 0 0 0 0 0 0 0 0 0 0 0 0 0 
##$SW_h= 3612.71676300578
##$TD= 16384
##$TD0= 1
##$TE= 0
##$TE2= 300
##$TE3= 300
##$TEG= 300
##$TL= (0..7)
0 120 120 120 120 120 120 120 
##$TP= (0..7)
150 150 150 150 150 150 150 150 
##$TP07= 0
##$TPNAME0= <>
##$TPNAME1= <>
##$TPNAME2= <>
##$TPNAME3= <>
##$TPNAME4= <>
##$TPNAME5= <>
##$TPNAME6= <>
##$TPNAME7= <>
##$TPOAL= (0..7)
0.5 0.5 0.5 0.5 0.5 0.5 0.5 0.5 
##$TPOFFS= (0..7)
0 0 0 0 0 0 0 0 
##$TUNHIN= 0
##$TUNHOUT= 0
##$TUNXOUT= 0
##$USERA1= <user>
##$USERA2= <user>
##$USERA3= <user>
##$USERA4= <user>
##$USERA5= <user>
##$V9= 5
##$VALIST= <valist>
##$VCLIST= <CCCCCCCCCCCCCCC>
##$VD= 0
##$VDLIST= <DDDDDDDDDDDDDDD>
##$VPLIST= <PPPPPPPPPPPPPPP>
##$VTLIST= <TTTTTTTTTTTTTTT>
##$WBST= 1024
##$WBSW= 4
##$XGAIN= (0..3)
0 0 0 0 
##$XL= 0
##$YL= 0
##$YMAX_a= 373447
##$YMIN_a= -418960
##$ZGOPTNS= <>
##$ZL1= 120
##$ZL2= 120
##$ZL3= 120
##$ZL4= 120
##$ABSF1= 10
##$ABSF2= 0
##$ABSG= 5
##$ABSL= 3
##$ALPHA= 0
##$AQORDER= 0
##$ASSFAC= 0
##$ASSFACI= 0
##$ASSFACX= 0
##$ASSWID= 0
##$AUNMP= <proc_1d>
##$AZFE= 0.1
##$AZFW= 0.1
##$BCFW= 1
##$BC_mod= 2
##$BYTORDP= 1
##$COROFFS= 0
##$CY= 11.3945322036743
##$DATMOD= 1
##$DC= 2
##$DFILT= <>
##$DTYPP= 0
##$F1P= 15.7292609196834
##$F2P= 12.9074282941183
##$FCOR= 0.5
##$FTSIZE= 0
##$FT_mod= 4
##$GAMMA= 1
##$GB= 0.15
##$INTBC= 1
##$INTSCL= 1
##$ISEN= 128
##$LB= 0.24
##$LEV0= 0
##$LPBIN= 0
##$MAXI= 10000
##$MC2= 0
##$MEAN= 0
##$ME_mod= 0
##$MI= 1.114404
##$NCOEF= 0
##$NC_proc= 0
##$NLEV= 6
##$NOISF1= 3.799351
##$NOISF2= 2.8
##$NSP= 1
##$NTH_PI= 0
##$NZP= 0
##$OFFSET= 15.70392
##$PC= 1
##$PHC0= -21206.91
##$PHC1= 12.05272
##$PH_mod= 1
##$PKNL= yes
##$PPARMOD= 0
##$PSCAL= 0
##$PSIGN= 0
##$REVERSE= no
##$SF= 200.130013532006
##$SI= 16384
##$SIGF1= 3
##$SIGF2= 2
##$SINO= 400
##$SIOLD= 16384
##$SREGLST= <1H.CDCl3>
##$SSB= 0
##$STSI= 0
##$STSR= 0
##$SW_p= 3612.71676300578
##$SYMM= 0
##$S_DEV= 0
##$TDeff= 0
##$TDoff= 0
##$TI= <>
##$TILT= no
##$TM1= 0
##$TM2= 0
##$TOPLEV= 0
##$USERP1= <user>
##$USERP2= <user>
##$USERP3= <user>
##$USERP4= <user>
##$USERP5= <user>
##$WDW= 1
##$XDIM= 8192
##$YMAX_p= 0
##$YMIN_p= 0
$$ End of Bruker specific parameters
$$ ---------------------------------
##NTUPLES= NMR FID
##VAR_NAME=  TIME,          FID/REAL,        FID/IMAG
##SYMBOL=    X,             R,               I
##VAR_TYPE=  INDEPENDENT,   DEPENDENT,       DEPENDENT
##VAR_FORM=  AFFN,          ASDF,            ASDF
##VAR_DIM=   8192,          8192,            8192
##UNITS=     SECONDS,       ARBITRARY UNITS, ARBITRARY UNITS
##FACTOR=    0.0002768,     1,               1
##FIRST=     0,             0,               0
##LAST=      2.2672688,     0,               0
##MIN=       0,             -418960,         0
##MAX=       2.2672688,     373447,          0
$$ Real data points
##PAGE= N=1
##DATA TABLE= (X++(R..R)), XYDATA
0 0 0 0 0 0 0 0 0 0 0 0 -8 8 -8 8 -16 16 -24 24 -32 40 -48 56 -64 80 -94 109 -126 144 -166 192 -216 248
32 248 -280 317 -357 403 -452 502 -562 626 -696 771 -857 947 -1046 1154 -1273 1405 -1547
49 -1547 1705 -1876 2066 -2280 2518 -2786 3086 -3431 3829 -4296 4847 -5519 6347 -7405 8808
64 8808 -10749 13632 -18325 27222 -49685 215482 253507 -418960 90052 246783 -300559
75 -300559 -8458 325377 -189762 -126227 192972 -96041 -80585 207903 -53573 -139473 79730
86 79730 3522 -20041 77420 -57098 -27538 52676 -82381 29634 145924 -123147 -86601
97 -86601 136910 -42233 -53997 135214 -63385 -102625 119201 -28152 -69295 151692 -47909
108 -47909 -161786 137030 48232 -130846 97309 33401 -158575 76813 86241 -120908 58584
119 58584 70542 -162410 26993 149197 -96422 -40411 92694 -68110 -31021 92473 -28516
130 -28516 -22923 39026 -68261 3350 100100 -54293 -45308 67092 -44860 -27762 90798
141 90798 -33335 -52639 66949 -40998 -47981 114081 -11533 -112329 66809 38820 -81199
152 -81199 46005 47104 -79388 7039 42054 -41498 30264 35745 -77442 1974 67699 -38277
164 -38277 -14021 47734 -34676 -24866 40940 -8659 -3362 26075 -43674 -15179 60920 -14446
176 -14446 -37687 36815 -5195 -35915 30127 12253 -19715 12615 -16062 -19059 45686 1861
188 1861 -45220 24637 16694 -37562 16944 27058 -27698 226 9521 -21573 23725 21605 -45022
201 -45022 457 40023 -26998 -14470 37775 -11168 -26108 17208 1345 -2685 15570 -20295
213 -20295 -13597 31731 -5084 -24649 23331 6024 -26594 8070 13233 -6164 5423 -8546
225 -8546 -12635 24679 3937 -27682 14251 16893 -25481 -327 21511 -8076 -5746 2312 -8812
238 -8812 11975 10044 -23934 1393 23212 -16775 -12522 22503 -403 -15782 4476 1928 1958
251 1958 7217 -13237 -4988 20518 -5286 -17842 15733 9402 -17161 -960 10438 182 -686
264 -686 -5666 -3562 13213 127 -16517 7434 13170 -13285 -7303 12042 2649 -6564 -3846 484
278 484 8097 367 -12804 3329 13469 -8734 -10055 11387 5725 -8749 -3334 4230 5375 -169
292 -169 -9096 900 12557 -4481 -12308 8895 9341 -10365 -5784 8002 3888 -4262 -5443 1180
306 1180 8072 -1938 -10768 4434 10567 -7656 -8685 8384 6292 -6649 -5259 4189 6473 -2553
320 -2553 -8099 3645 9677 -5331 -8875 7322 7441 -6718 -5780 5058 5854 -3333 -7342 3037
334 3037 8721 -4848 -9334 6345 7699 -7193 -6178 5506 4925 -3537 -6063 2175 8035 -2918
348 -2918 -9485 5235 9500 -6903 -7323 7320 5585 -5163 -4553 3287 5820 -2059 -7557 3021
362 3021 8806 -4874 -8569 5982 7088 -5914 -6094 4140 5606 -3375 -6802 3176 7462 -4569
376 -4569 -7780 5427 6928 -5214 -6048 3995 6000 -2555 -6412 2853 7728 -3868 -7755 5785
390 5785 7317 -5987 -5949 4890 5303 -2908 -5677 1816 6514 -2770 -7660 4382 7305 -6029 -6912
405 -6912 5383 5743 -3746 -5881 1955 6478 -2194 -7104 4312 7140 -6152 -5978 6480 5170 -3919
420 -3919 -4686 1344 5966 -79 -7386 2114 8346 -5607 -7830 7622 5856 -6600 -4433 2784 3958
435 3958 -105 -5494 -21 7078 -3318 -8165 6563 7328 -7093 -5527 4431 4531 -535 -4685 -409
450 -409 6533 -1829 -7541 6265 7524 -8131 -5546 6150 3877 -1315 -3796 -2282 5495 1109 -8111
465 -8111 3574 8644 -8626 -7476 8907 4570 -4824 -3044 -771 3627 2775 -6041 428 8266 -5815
480 -5815 -7959 9173 5984 -6636 -3337 1347 3330 2915 -5157 -1777 7914 -3475 -8872 8335
494 8335 6988 -8883 -4097 3914 2028 1581 -3414 -3685 6401 -110 -9264 6035 9073 -9341 -5958
509 -5958 7193 2607 -1296 -1263 -3031 3581 2818 -6847 2228 9314 -6852 -8275 7699 5399 -3755
524 -3755 -3110 -1116 3073 2438 -5572 700 7606 -6222 -8030 8336 5361 -5854 -2668 200 1794
539 1794 3835 -3787 -2848 7330 -2067 -9222 7363 8437 -8096 -4890 4641 2073 661 -1487 -3114
554 -3114 4046 1098 -7403 3495 8907 -7116 -7621 6368 4009 -2876 -1721 -1367 1686 2117 -4633
569 -4633 243 7727 -4134 -8788 6268 7031 -4997 -3563 1994 1613 917 -2066 -729 5086 -1488
584 -1488 -7612 4415 8000 -5358 -5672 3670 2479 -926 -1457 -1133 2928 397 -6352 1896 8206
599 8206 -4536 -7647 4949 4497 -3186 -1777 678 1747 735 -4075 597 7317 -2989 -7937 5229
614 5229 5832 -4614 -2092 2210 355 697 -1943 -1575 5608 -440 -8700 3335 8103 -5376 -4844
629 -4844 4059 1137 -1416 -767 -1095 3649 560 -7593 2432 8885 -5346 -6044 5906 1547 -2969
644 -2969 1382 -933 633 3170 -5411 -1258 9708 -2801 -9793 5925 5444 -5765 -751 2291
658 2291 -1052 1200 -2084 -2172 6688 -692 -9392 4393 7305 -6011 -2432 3958 -926 254 359
673 359 -2711 4379 2053 -8609 1985 9572 -5221 -5914 5880 1346 -2975 700 -727 1398 1960
688 1960 -5804 -65 8284 -3649 -7155 5418 2852 -4246 346 560 -16 2297 -3777 -2078 7884
703 7884 -1030 -8635 4895 5884 -5717 -1369 3701 -585 266 -904 -2302 5002 1293 -7969 2024
718 2024 7450 -5136 -4154 5172 393 -2733 273 -976 1843 2388 -5650 -993 7590 -2255 -6565
733 -6565 4682 3538 -4419 -768 2084 803 951 -2917 -1483 5964 -107 -6728 3081 5153 -4551
748 -4551 -2226 3473 381 -840 -1279 -1630 3795 1254 -6453 930 6509 -3746 -4479 4262 1558 -2595
764 -2595 -383 -300 1868 1834 -4655 -497 6851 -2146 -6145 4531 3619 -4136 -619 1735 -32 1159
780 1159 -1976 -2054 4976 305 -6949 2407 5911 -4340 -3271 3404 615 -1138 -604 -1139 2650 1149
796 1149 -5186 704 6210 -2807 -4590 3550 2231 -1964 -616 -31 1635 1353 -3897 -391 5785 -1685
812 -1685 -5582 3365 3351 -3209 -1199 1258 677 634 -2500 -1279 4548 -212 -5659 2049 4537 -3118
828 -3118 -2535 2436 1212 -669 -1533 -520 3429 472 -4715 1052 4955 -2282 -3412 2663 1814 -1641
844 -1641 -1342 298 2158 459 -3708 -211 4395 -1073 -4270 1868 3055 -2253 -2223 1405 2069 -601
860 -601 -2696 187 3420 -355 -3590 1089 3322 -1419 -2673 1557 2558 -989 -2638 676 3069
875 3069 -475 -3282 715 3108 -1197 -2836 1265 2423 -1331 -2613 696 2613 -547 -3053 271
890 271 3153 -568 -3197 1113 3147 -1404 -2727 1564 2568 -1054 -2231 703 2471 -144 -2724
905 -2724 295 3064 -688 -3091 1229 2907 -1492 -2622 1068 2297 -720 -2482 171 2594 -410
920 -410 -3042 739 3007 -1363 -2836 1414 2480 -1018 -2233 538 2394 -89 -2431 484 2849
935 2849 -840 -2753 1282 2683 -1189 -2486 705 2413 -237 -2577 91 2603 -680 -2798 1100
950 1100 2530 -1514 -2495 1130 2282 -470 -2160 -105 2377 50 -2602 586 2935 -1271 -2837
965 -2837 1741 2704 -1130 -2086 470 1847 219 -1970 -49 2418 -679 -3007 1251 2987 -1481 -2676
981 -2676 774 1896 -58 -1714 -378 1962 -139 -2809 1046 3378 -1514 -3050 1383 2442 -358
996 -358 -1419 -181 1487 254 -2120 673 3053 -1489 -3303 1602 2687 -838 -1571 -359 995 708
1012 708 -1657 -295 2761 -1033 -3792 1770 3529 -1719 -2442 639 1133 383 -687 -398 1673 -327
1028 -327 -2945 1402 3635 -1585 -2930 911 1755 208 -885 -636 1086 35 -2378 975 3281 -1746
1044 -1746 -3368 1287 2243 -325 -1297 -650 909 387 -1778 560 2950 -1440 -3406 1706 2880 -859
1060 -859 -1481 -48 776 558 -897 136 2118 -875 -3114 1366 3283 -854 -2583 1 1425 272
1076 272 -1062 5 1328 -1039 -2492 1468 3030 -1196 -2788 293 1921 367 -948 -189 929
1091 929 -526 -1501 1310 2639 -1130 -2959 504 2670 437 -1771 -449 1076 -377 -1284 1244 1970
1107 1970 -1647 -2910 919 2862 -101 -2214 -432 1131 -10 -612 796 1095 -1326 -2125 1070 2936
1123 2936 -36 -2740 -544 2071 533 -1051 426 1022 -1266 -1805 1457 2742 -942 -3171 39
1138 39 2361 80 -1169 156 206 -1005 -667 1105 1798 -699 -3009 -171 3093 502 -2116 -82
1154 -82 969 -658 -467 1348 1401 -1002 -2479 334 3175 375 -2638 -248 1469 -615 -494 1261
1170 1261 561 -1360 -1755 574 2621 176 -2790 -687 1833 103 -837 735 567 -1205 -1264 1010
1186 1010 2473 -181 -2985 -301 2507 294 -1290 584 592 -1210 -773 1404 1714 -641 -2605 -199
1202 -199 2467 382 -1669 -46 649 -783 -547 1084 1309 -690 -2295 -73 2826 494 -2296 -109
1218 -109 1409 -658 -631 1396 903 -1167 -1568 476 2313 363 -2205 -500 1545 -180 -866 890
1234 890 639 -1143 -1263 499 1942 212 -2439 -638 2126 125 -1438 785 880 -1404 -905 1166
1250 1166 1470 -181 -1950 -458 2225 459 -1670 393 1063 -1081 -699 1167 925 -466 -1632 -494
1266 -494 2065 673 -2232 -200 1678 -955 -1181 1383 835 -1169 -1109 124 1552 633 -1897 -432
1282 -432 1825 -313 -1247 1251 903 -1078 -720 499 1292 535 -1758 -705 2074 24 -1835 855
1298 855 1099 -1427 -781 859 757 -83 -1407 -635 1771 289 -1936 475 1479 -1143 -840 1084 739
1315 739 -293 -925 -355 1644 576 -1899 189 1842 -904 -1161 1204 716 -615 -768 -171 1179 488
1332 488 -1814 -203 1839 -655 -1619 1147 914 -1001 -626 208 875 413 -1389 -441 1827 -175 -1715
1349 -1715 914 1271 -1097 -779 643 810 91 -1104 -410 1509 55 -1741 519 1398 -1023 -1037 858
1366 858 732 -334 -916 -308 1197 351 -1622 13 1609 -634 -1297 944 981 -665 -827 326 1040
1383 1040 145 -1198 -26 1420 -261 -1254 613 1137 -601 -949 362 1043 -127 -1323 -59 1347
1399 1347 -209 -1429 484 1103 -669 -976 522 837 -152 -972 -83 1268 137 -1371 193 1437
1415 1437 -454 -1184 715 1095 -486 -904 208 1022 -5 -1130 63 1156 -321 -1145 348 970
1431 970 -495 -1059 193 938 -116 -1198 62 1210 -213 -1250 476 1119 -473 -953 475 959
1447 959 -195 -974 81 1206 -78 -1201 456 1142 -565 -1035 471 903 -286 -963 -50 979 -23
1464 -23 -1205 98 1092 -477 -1197 524 1033 -480 -1061 256 999 -9 -949 53 1077 -220 -1020
1481 -1020 507 1071 -406 -1049 251 1120 -130 -981 28 908 -194 -874 326 831 -398 -1040 211
1498 211 1119 -45 -1263 -65 1182 -134 -1038 457 906 -627 -811 562 967 -113 -927 -99 1008
1515 1008 288 -904 -57 1007 -377 -1133 597 1170 -596 -1157 259 888 -4 -761 -134 586 -124 -817
1533 -817 344 1119 -450 -1245 306 1204 12 -846 -52 679 55 -628 256 1049 -364 -1268 462 1315
1551 1315 -232 -991 -16 670 -62 -642 101 709 -402 -1068 357 1141 -245 -1116 -52 820 264 -640
1569 -640 -99 820 -137 -1098 513 1394 -495 -1228 315 844 -14 -454 -72 482 -9 -815 244 1214 -401
1588 -401 -1305 294 1025 -59 -698 -179 450 122 -737 165 1135 -365 -1331 348 1221 -144 -798 -64
1606 -64 626 94 -510 155 979 -333 -1177 560 1168 -395 -720 -10 363 279 -397 -300 670 1 -1213 237
1626 237 1427 -424 -1247 294 782 -68 -370 39 427 -115 -761 257 1156 -207 -1085 197 893 -16
1644 -16 -526 -63 446 15 -694 93 961 -269 -1198 194 1075 -163 -846 -67 465 -81 -526 162 757
1663 757 -182 -914 156 1069 -37 -874 -7 740 -25 -506 81 682 -80 -851 143 1054 -21 -1064 85
1682 85 814 -157 -667 155 463 -160 -701 -14 828 -7 -1037 -46 953 -142 -740 264 542 -164 -411
1701 -411 10 659 302 -892 -195 1232 36 -1138 292 773 -463 -464 264 303 9 -585 -267 871 115
1720 115 -1157 37 863 -281 -616 172 294 22 -441 -321 859 354 -1240 15 1333 -372 -791
1737 -791 487 377 -214 -111 -168 378 402 -1005 -285 1234 -144 -1094 467 543 -391 -146 -17 162 378
1756 378 -652 -451 1156 106 -1262 329 938 -461 -314 195 156 290 -382 -418 1024 274 -1305 204
1774 204 1125 -593 -523 395 37 -8 -117 -519 594 445 -1221 -110 1193 -366 -971 507 320 -219
1792 -219 -61 -259 364 553 -898 -268 1258 -169 -1109 560 597 -444 -8 -22 129 519 -595 -588 1123
1811 1123 109 -1220 398 764 -633 -283 206 -3 274 -350 -623 859 400 -1235 158 1071 -549
1828 -549 -498 509 149 -24 -41 -419 631 538 -1007 -75 1217 -405 -798 550 289 -260 -91 -279 239
1847 239 565 -815 -471 1140 -95 -1153 555 651 -503 -194 78 89 414 -427 -500 916 263 -1032
1865 -1032 266 942 -474 -443 375 133 145 -302 -463 624 411 -934 -30 975 -377 -709 346 375
1883 375 -104 -184 -221 392 335 -710 -203 944 -99 -788 287 518 -193 -266 -58 343 329 -544 -285 870
1903 870 -7 -861 251 660 -316 -391 60 175 110 -383 -304 614 181 -898 48 822 -262 -588 256 312
1923 312 6 -220 -157 407 271 -633 -150 868 24 -809 211 582 -184 -303 45 262 105 -380 -288 624
1943 624 193 -745 -69 705 -156 -576 212 308 -128 -294 -116 415 287 -625 -198 710 57 -627 211 552
1963 552 -253 -322 162 242 179 -369 -295 580 153 -702 18 640 -239 -480 184 274 -5 -368 -326 482 240 -682
1985 -682 -86 754 -242 -585 281 328 -118 -184 -230 353 460 -531 -306 746 -9 -786 364 530 -351 -255 -89
2006 -89 163 317 -418 -454 598 113 -759 221 643 -409 -401 229 139 142 -165 -466 482 354 -659 42 788
2027 788 -283 -531 367 275 -45 -157 -308 248 403 -547 -185 688 -177 -759 306 396 -194 -304 -198 226
2047 226 389 -418 -236 556 -14 -641 322 573 -231 -267 -3 281 274 -288 -328 473 93 -624 148 551 -243
2068 -243 -493 128 296 33 -318 -252 266 137 -496 -44 539 -141 -517 125 473 -25 -356 -90 341 103
2088 103 -346 -70 453 63 -411 88 536 31 -422 -31 407 35 -362 -50 304 33 -399 -79 440 53
2108 53 -531 -64 494 -60 -415 31 336 11 -291 -24 336 104 -446 -95 599 38 -519 65 424 -30
2128 -30 -244 -40 209 77 -358 -170 534 15 -561 41 427 -107 -299 -7 109 93 -198 -189 383 151 -600
2149 -600 60 595 -34 -422 65 259 62 -158 -172 286 84 -516 -5 564 -169 -485 112 272 41 -171
2169 -171 -183 105 206 -449 -130 555 -25 -635 115 439 -43 -186 -24 121 157 -191 -57 467 -10 -547 50
2190 50 545 -18 -297 -68 86 86 -122 -149 305 26 -546 -18 524 15 -409 -114 181 109 -186 -117 322 -89
2212 -89 -467 104 566 -39 -437 -33 249 183 -38 -155 135 64 -387 67 511 -75 -513 -70 344 172 -284
2233 -284 -182 152 55 -323 68 464 -233 -547 150 397 21 -202 -119 94 165 -96 -4 349 13 -453 80
2254 80 560 89 -369 -211 263 134 -194 -103 273 -71 -493 116 440 -31 -454 -83 213 159 -167 -72 187
2275 187 -32 -314 118 383 -26 -394 -130 294 265 -201 -176 239 54 -301 110 442 -141 -421 5 403 99
2296 99 -267 -139 177 -10 -150 16 332 -135 -383 14 372 147 -291 -231 214 189 -191 66 337 -34 -377
2317 -377 55 455 73 -303 -88 255 63 -165 -25 168 -100 -259 9 341 72 -384 -123 278 121 -257
2337 -257 -81 177 -15 -198 7 314 99 -327 -102 380 175 -293 74 281 -37 -176 114 185 33 -279
2357 -279 -144 351 192 -438 -114 277 -91 -278 78 204 -51 -169 -118 258 189 -371 -175 369 74 -303 94
2378 94 265 -100 -151 -34 231 161 -224 -163 313 63 -325 53 218 -57 -226 -21 189 158 -244 -165 303 46
2400 46 -339 20 288 -149 -224 104 190 128 -210 -161 289 94 -285 -28 334 -11 -218 40 183 2 -223 -137
2422 -137 233 54 -319 -84 295 -21 -280 81 207 3 -146 -122 198 128 -235 -58 328 -2 -313 34 280
2443 280 -12 -155 14 161 118 -241 -25 288 15 -263 7 245 -71 -221 -116 193 55 -256 -97 270
2463 270 13 -348 27 200 -13 -215 -17 205 104 -125 -64 291 82 -263 -23 255 66 -184 39 225
2483 225 95 -245 -73 211 54 -298 -36 224 36 -248 -82 102 34 -216 -70 192 56 -255 14 253
2503 253 6 -262 -17 263 -2 -128 -30 228 38 -188 -7 248 70 -252 -80 264 59 -288 -20 130
2523 130 -21 -174 -26 123 46 -230 -121 190 75 -221 -4 247 -14 -220 80 156 44 -107 -73 148 147 -225
2545 -225 -136 296 -5 -300 109 215 -111 -154 2 72 35 -151 -180 244 52 -303 39 279 -110 -222 48 78
2567 78 176 -78 -178 271 152 -285 29 383 -168 -170 176 112 -43 -43 -212 91 213 -293 -158 394 -172 -378
2589 -378 185 153 -181 -18 -128 66 261 -176 -253 364 34 -455 196 300 -206 -94 95 46 195 -61 -307
2610 -307 271 152 -365 114 335 -270 -158 138 60 70 15 -283 110 227 -341 -55 392 -214 -297 274 101
2631 101 -41 33 -181 13 357 -142 -224 387 -84 -362 251 240 -202 -86 -38 -3 262 -97 -311 229 129 -342
2653 -342 154 302 -254 -211 67 10 160 4 -326 136 243 -298 51 367 -217 -255 192 123 69 15 -252 46
2675 46 323 -202 -104 373 -193 -380 308 163 -170 -25 -169 -32 278 -86 -235 218 -32 -358 184 364 -205
2696 -205 -143 50 30 300 80 -201 112 113 -293 112 441 -221 -263 72 124 119 65 -304 -1 139 -199 15 337
2719 337 -155 -356 146 137 86 -65 -252 -53 236 -95 -55 264 -90 -328 172 346 -18 -66 -147 4 292 6
2741 6 -183 191 28 -320 84 341 -93 -259 -65 19 192 2 -229 17 59 -301 60 373 -132 -388 7
2762 7 148 117 94 -180 -79 171 -110 -82 332 -53 -394 73 231 45 -80 -150 -73 140 -48 -84 183 -73 -364
2785 -364 70 339 -44 -180 -120 -20 141 52 -96 94 79 -322 45 358 12 -246 -8 147 109 64 -84 -17
2807 -17 62 -100 -8 261 -69 -326 -41 137 18 -16 -124 -17 91 -88 -21 180 -28 -315 41 266 43 -129
2829 -129 -41 40 94 16 -4 131 1 -286 36 262 19 -148 -50 6 55 39 -171 47 35 -205 -1 288 -30
2852 -30 -216 -60 80 79 -56 -64 73 69 -70 26 202 -33 -174 -41 118 62 -29 -71 77 21 -116 -41 146 -61
2876 -61 -226 -80 170 94 -135 -85 78 46 -85 10 184 -59 -197 25 128 129 -75 -154 121 104 -104 -41 170
2899 170 -27 -150 29 104 -21 -136 -110 72 69 -104 -65 64 -29 -168 59 167 -4 -108 -92 108 163 -90 -131
2922 -131 153 -5 -162 70 150 7 -94 -12 125 95 -48 -198 143 56 -142 9 206 -167 -147 36 74 63
2944 63 -99 -81 137 98 -125 8 208 -18 -131 38 102 43 -25 -58 171 93 -138 -48 132 -76 -131 90 57 1
2968 1 -41 -93 67 65 -142 -74 165 -38 -171 14 103 -3 -50 -71 54 34 -124 -56 185 48 -118 93 114 5
2992 5 -30 -45 10 126 -112 -72 174 16 -240 78 149 -74 -62 -47 37 104 -47 -133 107 64 -240 33 124 -48 -64
3017 -64 -9 20 92 17 -68 127 145 -167 54 221 -81 -88 54 -5 77 -6 -120 73 84 -121 -91 222 -22 -186 56
3042 56 19 -38 -11 -88 27 142 -58 -132 224 75 -207 81 170 -15 10 9 -25 120 -96 -128 190 27 -225 41
3066 41 187 -81 -53 -4 -59 42 1 -125 67 160 -204 -91 254 -5 -131 41 38 -17 -30 -33 22 108 -40 -89 193
3091 193 64 -155 23 106 22 -57 26 -24 64 -127 -101 113 -11 -162 10 144 -67 -92 18 65 66 -80 -112 137
3115 137 64 -115 -32 168 -16 -114 -19 55 37 -30 -60 79 68 -106 -35 168 -56 -143 47 87 -89 -13 -63 34 99
3140 99 -124 -67 91 -2 -153 80 143 -26 -94 10 58 40 -40 -52 50 98 -113 -39 146 -27 -156 4 123 22
3164 22 -30 -17 27 60 -60 2 95 -8 -102 -31 162 84 -77 -58 11 95 30 -55 55 9 -78 2 171 17 -98 -54
3190 -54 79 35 -44 -85 -16 11 -124 -51 100 -19 -179 -45 94 59 -59 -33 -4 23 -62 9 106 16 -117 -38 157
3215 157 46 -118 -25 32 41 -38 -3 38 -5 -122 -14 138 9 -97 -55 31 -13 23 -43 -31 19 -62 -24 199 78 -129
3241 -129 12 67 3 -27 -16 11 42 -30 -30 147 41 -176 11 150 52 -37 41 -60 33 -4 -21 86 46 -148 -31
3266 -31 135 46 -163 -22 18 0 32 -42 49 62 -132 -42 205 84 -66 -43 49 44 56 11 -32 10 -88 -91 136 85 -172
3293 -172 -75 71 12 32 -24 -31 -25 -14 -37 133 119 -154 -72 191 121 -61 12 -29 -1 -7 38 14 123 -121 -80 177 48
3320 48 -137 22 -7 -24 15 -31 -58 2 -93 -77 154 110 -130 -35 113 22 28 47 -29 1 -17 -84 126 160 -126 -101 87
3347 87 36 -19 69 -28 -70 61 -3 35 59 -98 -146 181 90 -129 45 13 -40 55 9 9 55 -86 -110 132 132 -142 -15
3374 -15 141 -19 33 79 -17 32 -37 -119 92 156 -142 -66 56 -37 -29 41 -22 -7 56 -150 89 157 -112 -121 122 12
3400 12 -71 41 5 -66 79 -3 23 118 -98 -152 150 68 -93 54 85 -97 -10 52 26 82 -32 -146 84 103 -109
3425 -109 -8 85 -52 -64 66 27 20 -53 -55 101 164 -120 -80 121 43 -22 63 -25 -32 26 -23 69 96 -88 -98 123 27
3452 27 -70 22 -7 -112 -19 -30 58 41 -57 -99 42 91 -89 -29 89 -29 -70 -1 71 57 -35 -104 148 100 -99 -80 16
3479 16 -11 -81 13 13 -33 -5 -62 28 94 -55 -56 101 48 -109 70 47 6 4 20 38 130 0 -63 123 51 -47 -29 100
3507 100 -9 -44 16 32 9 30 -58 39 127 -94 -24 50 0 -98 -17 67 -43 -36 -72 29 113 -37 -23 78 19 -128 29
3534 29 71 -4 -7 -22 28 101 -28 -95 100 39 -93 -5 163 35 -66 9 43 44 -14 -95 -9 32 -45 -47 51 48 -73 61
3562 61 62 51 17 -60 29 54 -16 -50 39 122 -54 -40 85 -43 -12 36 12 47 -27 -12 65 44 -66 -46 76 -8 -25 0
3590 0 -3 50 31 -1 27 78 -57 -67 66 29 -74 8 109 -6 35 -70 -1 61 -85 -108 74 82 -62 -68 18 -25 -45 -14
3618 -14 -22 26 20 -56 4 81 -23 -84 55 -15 -76 -4 52 27 -19 12 47 107 -26 -57 109 -23 -57 9 6 -9 53 -72 29
3647 29 82 14 -100 27 81 -75 -18 25 -38 23 26 12 43 19 -48 41 80 -15 13 162 -43 -14 32 11 -36 2 -78 5
3675 5 54 4 -88 47 8 -69 9 29 -14 -24 14 -52 47 -8 -95 111 5 -118 -39 56 -56 -48 5 7 63 -17 -104 29 77
3704 77 -105 6 94 -8 -66 22 -77 45 66 -60 8 73 -78 -66 108 27 -59 -6 35 21 55 -21 -31 68 -33 -33 76
3731 76 39 -72 -3 34 29 41 -4 -77 70 -43 -75 54 51 -97 -45 89 9 -55 -30 -39 22 -14 -69 28 42 -108 7 134
3759 134 22 -35 107 3 13 43 -36 46 51 -12 -51 132 8 -87 12 -62 9 10 -72 -110 67 -19 -73 27 11 -90 -11
3786 -11 21 -7 8 -30 7 50 -1 -75 21 38 -39 -25 16 -17 -26 3 -27 77 9 -57 -24 49 3 -64 70 -5 -41 -38 24 -20
3816 -20 3 5 27 56 -8 -71 40 29 38 -1 22 15 -20 36 -19 72 -42 -38 53 107 -70 -28 63 7 5 -4 37 -2 -62 -37 22 78
3848 78 -23 -58 41 18 0 -10 5 76 -7 -20 14 23 -14 -3 74 22 -37 -51 54 17 -41 -13 -10 16 33 17 19 32 -46 -29 43
3879 43 73 -9 29 36 25 12 55 8 27 54 1 67 52 -3 -75 34 54 2 -25 7 19 -36 -6 51 21 -22 -49 96 61 -51
3909 -51 -23 44 -5 44 21 70 3 -64 11 -10 46 -2 7 79 89 60 -5 10 49 -22 -55 42 25 -25 -69 11 -8 -56 10 30 -28
3940 -28 20 -28 53 77 -59 -38 50 25 -48 21 40 24 -8 36 -39 27 -4 19 53 58 -24 -40 24 47 46 -91 -17 37 -6 -48
3970 -48 42 15 -34 3 24 113 36 -11 87 30 -40 -40 68 29 -18 -29 13 1 -11 45 -31 39 0 -20 1 23 -11 -26 2 -17
4000 -17 3 -48 -12 -27 -52 9 27 -23 -14 23 57 34 30 25 -38 13 31 -31 12 24 -3 -36 54 68 -12 -31 -6 17 19 -29 0 40
4032 40 -10 -21 -17 26 -25 -17 -35 -6 62 -13 42 43 25 -42 33 29 -21 -45 -30 24 3 -43 -4 60 -6 -33 72 5 -48 -39 28 46
4064 46 19 -27 18 34 -9 -15 66 4 -72 -25 0 9 -6 -37 90 -2 2 -7 22 87 16 -41 4 43 0 9 -7 5 21 -40 3 20
4096 20 -54 4 -21 37 -33 -29 16 -11 32 -14 -2 25 24 -8 29 67 -13 -2 2 62 29 -20 51 -1 13 -1 -6 26 -38 -17 -18 -7 -17
4129 -17 -52 56 -7 -38 2 -67 -2 -10 -49 -15 23 17 -57 39 70 80 15 17 64 -39 -46 -3 15 16 -34 -6 37 22 -12 -25 51 -8
4161 -8 -30 6 -12 -23 -68 42 -16 7 -43 9 24 -1 8 23 27 0 -39 44 28 13 20 0 13 -3 -5 18 69 51 -1 1 9 3 -50 -35
4195 -35 -5 -6 -7 14 -6 -19 25 32 -9 22 -57 -65 50 8 -52 -14 52 -58 -1 18 58 -47 -20 -18 20 22 -47 -23 82 -9 -13 51
4227 51 1 7 -32 -36 23 37 -18 9 31 30 -8 57 34 -48 23 30 8 -16 -29 8 88 -2 -61 -13 8 -88 -47 28 -14 -27 -19 -71 21
4260 21 -23 -17 63 13 18 -30 29 50 -25 -31 36 45 32 -33 -10 34 12 -5 80 51 -24 -53 1 20 8 2 -16 17 -4 -21 58 49 -43
4293 -43 -51 24 21 -4 15 -25 32 6 -25 43 75 -60 -31 1 24 -20 22 -7 13 59 -31 1 64 -61 -81 47 8 -8 -25 -36
4323 -36 -40 55 -18 -64 41 -4 -78 29 55 -96 -57 -15 4 54 22 -74 31 36 -68 60 64 -49 3 41 -16 52 31 -50
4351 -50 33 -13 -57 -15 34 -36 -43 61 -3 -30 16 13 -8 29 -7 -53 84 -43 15 59 16 -42 -2 -25 29 -35 -26 -18 20 12 -63
4382 -63 51 23 -79 -53 10 -20 55 -21 -54 40 30 -70 66 29 -3 10 35 40 11 -5 -20 10 41 -6 -21 86 -35 -5
4410 -5 28 11 -46 21 -71 7 72 -11 -45 -38 -15 -55 22 -42 -13 7 -17 -4 65 -33 19 41 -23 -8 29 43 -58 -19 4 16 32
4441 32 36 -72 5 53 10 -12 -36 28 15 42 -13 -40 17 18 13 2 8 68 51 -37 45 31 16 8 41 33 0 5 -17 15 77 -64 -12
4474 -12 -10 30 1 26 -8 -17 -6 4 24 32 14 -31 35 34 -29 43 -4 -11 54 22 44 17 -7 -55 29 -9 -4 7 31 1 10 -11 -3 -21
4508 -21 -19 -43 -7 23 -23 -11 -22 2 -13 -5 43 0 -59 -2 -1 4 59 -9 -10 7 32 -2 40 74 -19 0 5 -1 8 -25 -31 9 48 -38 2
4543 2 38 -33 -27 -5 -12 -42 -6 30 7 12 5 43 75 30 -32 38 -23 -10 5 18 22 13 23 -36 30 -33 43 -11 11 -59 4 39 32 9
4577 9 22 -46 21 -11 -38 -36 25 -18 4 28 22 13 26 7 -4 3 6 -25 49 35 -2 26 -47 -47 -24 15 -19 48 -31 5 58 19 -54 7
4611 7 37 -18 18 -12 -41 -5 19 -8 6 41 -22 -56 21 -11 -8 48 3 -21 30 3 32 8 -9 -44 23 -23 -62 13 -60 -71 -6
4642 -6 7 -66 6 7 -24 38 20 -96 -62 22 4 19 32 -1 18 1 -40 39 39 -54 13 29 -14 -26 49 34 -12 9 -20 14 53
4673 53 -14 -47 46 -13 -34 68 -11 -87 58 23 -15 48 39 -40 59 14 -60 -45 52 -8 62 43 -48 6 16 -57 29 11 9 43
4703 43 9 -5 -11 25 -25 3 -25 1 -7 51 -47 -43 13 -17 -20 10 -16 -27 -41 0 -23 13 -22 -26 10 1 -31 36 16 -18 -14 -15 -9 0 -53
4738 -53 -18 18 40 -39 -27 1 -66 -25 45 28 -13 37 -53 8 -29 -35 -6 -7 6 -4 -30 -26 40 12 -45 -12 11 52 22 29 -29 -30 80
4771 80 18 33 7 21 -28 13 16 -7 39 -52 -31 34 46 20 24 33 15 41 8 -70 25 -31 -27 40 11 26 -7 -10 -19 45 -45 14 -19
4804 -19 -15 -24 17 -8 9 33 -1 12 7 -52 -60 29 1 -61 2 23 -59 20 -11 36 18 4 -29 25 12 -10 50 48 3 -26 35 21 8
4837 8 32 9 13 61 -50 -20 52 -52 -15 27 5 15 31 10 -27 21 -30 21 68 -27 -2 62 -3 -22 61 2 -15 31 6 -48
4867 -48 34 -32 -76 23 7 6 -3 17 42 13 -32 36 9 -13 -2 7 -43 -54 26 33 34 -3 -35 -18 34 -4 -85 20 41 -17 8 22
4899 22 -7 18 22 13 -28 3 3 4 37 -60 73 46 4 47 -31 -4 -7 15 -23 2 -1 -4 16 35 24 -4 -20 30 -41 9 -70 5 2 -22
4933 -22 -10 6 -39 -30 -27 -35 6 -53 26 6 20 -2 -16 -53 33 4 29 -27 8 18 -22 -5 31 -9 -11 32 8 -1 -33 -15 74 -39
4965 -39 -43 -28 13 -15 -85 20 -8 30 36 13 41 39 -7 47 8 8 -25 39 -38 27 33 13 33 -48 -13 2 -13 -15 -60 -9 10 -51 3
4998 3 41 11 8 6 6 48 57 -33 10 15 -21 26 -17 26 -2 0 16 33 -19 -2 27 28 -14 -1 11 1 -13 19 -33 44 35 -3 -24 -26 39
5033 39 -19 1 -2 23 2 29 -26 -1 -7 34 35 18 -41 -16 11 -56 21 53 -48 0 -44 6 34 18 -17 -34 54 -36 25 -16 -10 6
5065 6 35 -6 -35 46 -26 32 10 -10 -32 4 -11 23 19 -50 25 11 42 19 14 12 -44 65 -9 -77 -12 -27 -20 -2 -5 -17 22 -3 -7
5098 -7 -1 4 31 -39 15 -28 -2 75 5 2 20 20 22 36 0 46 42 29 -11 -19 -2 6 -29 -38 -55 0 32 -6 -18 -34 14 7 13 9 10 -11 12
5135 12 19 -4 -13 66 -23 -19 -30 6 17 7 49 -29 -11 54 -50 -62 22 -38 56 36 50 51 9 26 -43 -6 -22 -29 60 19 -9 40
5167 40 -5 -3 36 26 13 29 7 33 18 9 -17 60 55 -11 32 30 -7 43 -10 -35 14 6 3 6 56 2 9 -2 13 -24 2 -2 -50 15 -4
5202 -4 15 -6 -8 28 16 -33 -12 52 13 20 72 -33 33 52 -20 6 -34 -7 -25 -40 -64 20 -2 -13 -17 10 -20 10 -25 -9 -6 40
5234 40 7 10 -16 -6 -16 -8 60 -8 3 26 51 -5 14 40 -26 35 -15 -10 29 7 10 63 35 -8 24 -9 -8 -8 -18 32 18 -37 36
5267 36 10 12 30 -46 26 -17 30 -21 -10 -7 12 -39 14 64 -19 -4 52 -60 4 14 -1 -8 -7 -34 8 17 9 -3 5 25 6 -30 -16
5300 -16 -3 -41 -52 26 -2 -48 2 -8 -19 -1 -22 31 -14 11 -1 4 -25 -22 24 -34 35 -16 16 31 7 -56 41 -19 -1 -5 -32 46
5332 46 -21 56 -10 33 10 37 10 -57 56 -12 -48 -15 2 37 0 12 2 -7 -5 -7 -8 -34 -21 1 -19 -112 -3 -8 -22 -37 -35 28
5364 28 45 -38 0 6 -26 -7 53 8 53 -7 -54 15 33 -51 -18 8 2 57 1 -8 33 -52 13 23 24 17 -17 32 -2 30 30 -20 14
5397 14 23 47 -49 -42 -65 -10 12 -15 -36 32 -86 0 -39 27 -25 30 -52 9 44 35 24 100 -26 51 14 -5 12 -58 22 32 30
5428 30 -43 -26 7 -6 53 -29 -24 24 6 -34 3 30 34 9 0 -1 -15 -5 -49 21 -42 -35 -20 21 -71 -32 17 32 -16 16 35 26 -35
5461 -35 -27 -34 58 -43 -43 -43 -7 7 5 -10 -24 0 -42 -18 17 -19 -69 -4 -58 52 16 -11 -27 9 -28 11 30 2 -2 52 -18 -65
5493 -65 28 22 2 28 -8 -4 38 63 -52 33 15 -23 21 18 47 19 -1 -10 -14 -100 6 32 -11 -24 30 -27 -13 -10 8 0 48 11 -22
5526 -22 -16 47 -24 28 -21 17 -31 28 -35 -21 -22 -22 40 -41 -53 -19 -11 4 21 16 -21 15 44 -20 21 6 -51 -36 19 4 -32 11 48
5559 48 -34 -2 -16 -6 16 -34 -39 36 40 11 -14 -6 -10 4 -18 5 -28 -20 -21 16 30 -44 -33 12 30 -13 50 32 41 -11 -50 -2 44 30
5593 30 -4 -37 -6 -9 -3 -38 4 -19 10 -40 10 -4 -18 -59 -26 30 -51 -9 48 -11 -61 -34 14 -55 -35 8 -38 -47 -74 28 11
5624 11 34 17 36 -19 29 -15 15 21 21 15 41 16 15 -17 -4 24 19 -8 55 -28 -5 18 -17 -9 14 33 49 5 17 38 45 17 3 42
5658 42 -20 53 -35 -8 22 8 -19 46 -13 -19 15 -21 4 15 1 -71 -1 5 9 -2 21 1 -25 29 17 -21 -1 -12 -33 16 31 3
5690 3 23 -34 15 15 -14 9 16 31 -3 10 20 -30 -17 -42 37 10 -3 -28 -65 -36 -41 -6 -4 -16 30 68 1 -65 -6 17 13 69 1
5723 1 29 -18 -41 -69 -7 -16 24 -16 -1 -10 14 -7 48 38 37 -16 33 10 24 5 3 59 34 -17 -21 30 -30 -4 -42 -52 8 -5 -7 8
5757 8 0 -23 0 44 -11 -30 -43 -17 10 33 41 39 26 12 17 -5 25 2 -71 7 -16 -13 -44 52 12 21 38 4 26 -11 33 -27 -10 -13
5791 -13 16 65 -24 17 9 -8 20 -9 -14 -2 49 -2 59 38 -43 0 -54 -1 23 8 -9 -15 35 21 -5 10 2 37 8 31 -10 16
5823 16 -36 -1 -5 4 -20 23 -8 9 55 -22 -7 -37 21 -30 3 4 33 -47 -24 -5 49 21 10 25 57 13 29 31 11 61 -34 -27 -9
5856 -9 -9 -18 1 1 1 -8 5 16 -30 -37 35 25 23 52 31 23 31 -27 7 26 -26 28 -8 -6 0 -55 4 78 34 -23 5 -4 -7 -31 17 -10 17
5893 17 -15 11 -5 13 35 -12 37 -11 34 -53 -10 30 0 -64 -13 23 52 4 12 -5 -7 3 47 43 -9 -7 -60 -40 4 27 -23 -8
5925 -8 -20 9 -7 -36 8 -52 11 -6 -18 -34 -48 -25 -1 4 5 -49 14 28 -16 -29 25 -20 -28 -30 -48 12 3 -18 -49 -3 -21 -28 -59 -20
5959 -20 -15 38 -13 17 22 33 -41 17 -10 -62 -17 -6 9 -8 54 11 5 0 5 -36 21 21 -31 -10 -53 -38 -5 -10 -19 -21 -1 -49 7 24 -3
5994 -3 28 -60 9 -21 -26 -23 60 -52 6 32 19 14 1 -39 16 19 -42 7 36 -14 26 24 8 -66 44 16 18 -11 36 -15 14 26 -31
6027 -31 3 31 -74 2 -9 -39 -32 -30 -18 -25 21 -20 -26 13 22 58 -19 -19 -48 27 0 -26 -28 47 -34 -4 -36 -3 35 11 -38 36 35 -27
6061 -27 7 -17 7 -40 6 -42 0 40 -14 -22 32 -32 -68 49 -9 -10 60 -31 33 31 -17 10 14 -32 -27 -13 -53 5 -33 37 -13 27
6093 27 11 -21 0 -9 2 48 51 -27 57 2 12 17 -42 8 -18 8 -38 26 33 -26 11 35 19 8 43 6 16 7 -2 -73 17 -27 -39
6126 -39 -7 -26 25 27 -27 38 -13 -2 8 40 4 10 0 56 27 -3 48 11 17 0 70 -9 32 -13 17 -20 19 -7 5 50 38 6
6158 6 12 7 36 -13 35 36 -21 -31 27 60 0 -19 -31 -15 7 -4 10 -25 66 -34 -1 -15 -57 -18 12 14 12 0 -44 38 1 -10 14
6191 14 62 -26 -20 35 9 31 22 -45 -6 21 7 -42 18 -10 -16 46 13 -20 14 -39 -78 -2 18 -25 43 54 -44 -15 -20 -56 14 -71
6223 -71 -1 31 -21 -11 -2 65 -25 -6 19 -33 10 38 36 20 -39 -63 9 48 29 -45 5 -8 -41 -21 19 -40 6 22 14 -11 0 -64
6255 -64 15 -22 -55 -51 14 -38 13 -2 33 17 -24 16 -17 41 -43 12 -41 -46 -11 35 -6 13 27 39 -2 -2 -27 38 8 31 -26 -17
6287 -17 14 13 42 -28 6 3 -16 8 -10 -8 -23 1 -12 19 -31 39 -32 0 -39 -59 1 37 -27 3 45 -21 -26 -34 -42 11 48 -18 -12 17
6321 17 3 -32 27 22 38 11 -35 31 46 -15 25 26 -18 -7 21 -9 -39 -10 -24 -34 -67 -39 22 31 25 -12 23 51 -19 -53 7 65
6353 65 37 26 -8 17 -26 1 4 36 49 -28 -8 -9 37 10 31 -12 0 -9 -25 15 -48 -36 0 20 -21 -4 32 1 -6 58 -64 -24
6385 -24 -6 -20 -39 -20 -23 -36 0 8 -33 14 -2 -10 14 -26 -35 -16 -48 32 10 19 56 60 -1 40 46 -22 49 34 24 -40 -33 -40 11 2 24
6420 24 -17 -15 33 -20 11 14 -27 -1 -46 -5 24 62 6 39 -7 -2 12 -7 -2 -4 -43 13 16 63 0 -57 9 -19 10 27 13 -29 47
6453 47 -25 -7 -6 -3 -50 22 62 -2 -34 17 -7 12 -2 -37 30 22 21 -9 -10 -19 -43 -37 -50 -33 3 -46 -26 -14 20 0 -27 -20 -5 11
6487 11 -2 -6 44 5 -64 16 33 1 -16 26 -34 -9 63 -39 79 27 5 29 -20 -2 34 27 -14 -21 -2 19 -11 10 -22 5 4
6518 4 -47 16 34 13 14 1 42 3 -9 -9 2 14 -25 39 17 36 -31 18 59 30 -49 10 -8 12 -35 -60 -14 -19 26 26 6 -20 -6
6551 -6 29 44 -33 46 12 -2 33 10 -32 -1 -12 18 83 -13 -16 5 28 0 44 19 -12 -22 39 30 6 36 68 -26 7 -23 0 17
6583 17 23 -3 21 -26 15 28 14 -39 -20 31 -16 48 10 25 3 30 39 -34 -4 -26 47 36 9 47 -18 12 -9 11 48 72 -43
6614 -43 -32 65 15 18 4 5 37 34 11 -14 70 -67 -19 -6 44 -58 -20 25 -6 -48 -13 -19 69 31 -6 48 -33 38 -9 -11 8 10
6646 10 23 -10 -9 79 -26 14 14 15 -8 -10 8 7 39 -16 11 25 50 -33 41 -11 -10 34 -20 0 31 -19 -19 -33 -20 -11 -6 -26 51 0
6680 0 -11 15 4 4 24 -11 12 6 -30 32 27 30 -32 6 35 14 10 -13 16 -40 -3 20 -5 -20 29 24 -7 -30 -23 12 -29 14 -4 -20
6714 -20 -16 -33 14 48 48 -38 -1 50 17 7 5 7 -22 1 0 -15 -5 1 31 16 -33 26 20 -39 15 -6 20 -14 29 -22 -8 9 1 -23
6748 -23 -1 -4 67 -2 5 13 -4 4 31 75 16 1 -5 -5 11 19 37 -15 25 -1 -8 13 -9 -37 -59 -10 16 25 13 -5 -20 -14 1 -15 18
6783 18 20 -1 1 -14 -4 -1 -23 28 50 -24 -41 -37 19 -38 -19 18 -63 6 -12 -21 8 16 -43 12 -2 -36 -14 41 2 5 31 32 -27 9
6817 9 14 -34 25 16 28 -9 10 -4 -12 8 -16 -9 -17 -13 19 -9 -24 10 -13 -24 -35 -29 -18 32 -18 -24 -23 42 -46 47 61 -27 3 -37 -5
6852 -5 -1 -14 -15 -17 -22 -30 2 0 -31 -37 -17 26 -33 6 34 17 -13 -60 22 7 28 30 9 -2 -34 -10 13 18 -1 5 36 -24 36 13 -5 -7
6888 -7 -5 12 6 -22 10 19 41 3 32 29 67 67 -14 -12 22 38 -32 23 49 45 0 -25 47 23 -24 22 54 6 -14 16 11 -9 20 22 62
6923 62 -36 -22 -13 -50 9 2 -5 18 2 -19 -58 25 19 -34 30 33 -13 24 -10 10 45 -13 3 -22 30 62 11 4 -6 -16 19 -29 -71
6956 -71 -33 4 26 -2 1 9 -5 -34 17 26 9 -22 -14 32 32 45 0 19 -21 7 -45 -33 35 -26 -62 50 -28 9 -44 -38 1 7 32
6989 32 -37 -12 38 -11 -51 69 -23 19 -36 29 -18 19 16 -21 -9 2 12 -13 -4 3 -7 25 36 9 -19 -16 -15 -6 -11 26 13 -56 -77
7022 -77 -8 26 -11 -18 -22 -20 20 -22 45 5 -21 -7 4 41 -26 6 -18 36 92 40 31 64 40 52 -76 35 23 -29 -12 -24 7
7053 7 -23 13 -32 27 80 -5 27 7 -59 6 38 -23 6 -41 40 65 24 6 -30 -12 -11 47 -14 37 -2 -5 -52 10 3 -38 12 52
7085 52 -21 -8 -16 -5 -41 -9 -17 37 19 -54 24 16 38 -24 9 -13 19 0 13 63 7 -5 50 -16 -27 28 -42 49 6 -34 0 7
7117 7 -31 8 29 -10 -19 -7 -34 21 25 41 9 -6 5 30 29 -24 -9 37 -22 50 1 -4 -10 27 33 49 -16 31 41 7 33 69 21 -59
7151 -59 23 -30 58 -6 37 -3 8 -75 -17 32 21 -5 -8 36 -55 8 6 -14 30 30 -69 0 28 8 24 -28 0 18 -37 30 -32 -6
7183 -6 37 -42 -46 -31 7 19 1 -75 14 8 3 12 -8 -3 14 -48 40 12 -17 58 -36 51 -2 6 31 6 -24 19 4 22 -13 -27 66 -3
7217 -3 32 -38 23 -11 117 -14 13 41 -57 9 -26 -5 12 10 22 18 20 38 -28 9 1 -15 -11 -2 -21 20 24 -14 -31 10 58 41 -1
7250 -1 -27 2 -17 -26 -16 35 3 -7 -5 27 10 29 -51 -46 -24 1 29 9 36 -49 26 -15 38 -32 -11 33 24 20 14 18 -24 9 -35 -38 10
7285 10 8 47 -32 55 -9 -39 -67 7 54 39 -4 31 11 -6 24 -1 -15 46 6 -39 -15 23 28 41 12 8 -21 -3 -23 -4 16 -12
7317 -12 16 19 -31 18 35 23 34 -8 -15 32 -4 -38 2 -22 -20 -32 -50 -24 11 -54 26 11 4 18 -8 13 -8 -3 32 -39 14 59 -3
7350 -3 1 -16 21 15 7 44 59 -5 45 29 22 -31 -51 20 20 50 -1 -7 46 -19 6 -26 -11 -5 -32 41 8 1 -16 -36 7 10 51 8 -32
7385 -32 -28 -10 -6 -17 -37 40 16 42 -2 -14 -20 -27 26 -46 7 12 30 -10 8 -34 -9 -10 26 35 -32 -18 -49 37 10 3 11 24 -19 -17 19
7420 19 44 7 -34 -15 -1 -11 25 -23 -13 -24 27 3 -43 15 -16 -44 19 -14 -53 -41 -9 -31 -3 -18 10 -62 -28 -21 -26 16 26
7451 26 2 15 -9 -7 -20 7 24 8 -19 54 -8 -2 -28 53 -26 -25 19 57 -45 -18 -18 28 12 38 -7 18 14 -36 -35 -24 -27 -16 14
7484 14 17 -22 17 60 21 31 -33 -10 -7 44 -22 3 29 8 35 2 -10 -26 -46 -21 -6 4 -16 -2 31 36 21 43 8 2 30 -23
7516 -23 -8 19 28 23 4 -8 -22 1 -10 3 54 -8 -16 82 18 5 -42 54 -19 -31 -26 7 -37 -29 -33 59 -35 17 64 -1 40 15 28
7549 28 13 -30 17 25 15 -22 -24 -2 4 41 16 11 21 -50 18 10 -6 21 18 -14 -14 2 25 15 -41 -18 -6 32 -21 39 11 -7 2 -27
7583 -27 11 6 13 13 21 39 27 -24 -9 -17 -12 -15 9 4 -7 -54 51 -4 0 14 -9 -84 30 13 48 14 -4 12 25 19 36 -29 -5 56
7617 56 13 -39 -12 2 -75 41 -45 -32 13 -6 9 26 37 -36 -10 -17 17 0 8 -11 33 -10 -12 -27 12 12 -2 23 -24 -66 67
7648 67 0 4 -7 54 -19 19 37 3 18 12 5 32 -54 36 -31 -32 -16 -47 10 -12 -13 -9 -23 10 -51 2 24 21 11 -39 -9 -1 -24 -3
7682 -3 -3 -35 6 44 11 58 11 -29 -61 -2 57 -15 -46 -4 78 -14 16 7 -83 -28 -9 4 -6 -28 -17 35 36 -10 -4 -30 -6 -4 -23
7715 -23 -4 18 22 38 -16 -33 -42 7 -6 -73 8 51 -20 -10 16 27 4 14 19 16 45 14 -22 -33 55 -5 8 27 6 7 7 -32 -64
7748 -64 -8 23 35 14 4 12 -6 -95 -38 -9 7 38 -51 12 20 -16 -34 -40 -5 -53 -30 37 37 -21 -40 14 -18 -21 -25 5 57 -17 48
7781 48 29 17 13 22 15 -1 -72 -14 63 -28 -19 -41 -41 16 -36 -2 -18 -13 -31 -21 2 -65 -67 5 -54 0 -62 -5 -32 32 36 28 -61 4 66
7816 66 -12 20 -22 23 -35 18 17 3 53 44 -51 -15 -20 -19 53 13 20 -18 -8 -15 -3 -5 -6 8 8 44 -25 6 -21 -4 -18 -29 15 -25 -9
7851 -9 8 32 -7 -11 7 7 25 22 -18 12 28 -6 0 -12 -28 4 -31 -39 20 4 -17 -25 33 -11 9 -17 49 5 19 38 3 -11 19 -1
7885 -1 60 -13 -16 19 -16 15 10 0 -13 30 -25 25 -13 30 -12 28 -16 11 -17 14 -37 -12 22 -6 1 -21 -4 -5 -54 4 -5 -51 -20
7918 -20 -23 -40 -57 -14 3 -14 -40 -23 -25 -20 11 -52 30 12 10 -4 -40 12 -3 8 25 32 31 -3 28 -43 43 12 26 5 -17 -28 27
7951 27 -1 26 39 4 11 -9 -25 -61 16 -29 2 21 -16 16 7 12 48 18 -6 9 34 52 23 -19 -5 -31 50 43 11 -13 -17 27 -41
7984 -41 -3 26 -20 27 9 34 -24 -52 -52 -33 15 33 39 30 -16 20 24 18 -25 -15 -2 11 -26 21 38 9 -4 23 2 -49 12 44 -36
8017 -36 -4 -33 -3 21 -24 7 33 -26 30 22 14 29 59 38 -56 30 5 21 -34 57 10 6 18 1 -14 -31 -20 7 3 -10 -33 16
8049 16 -24 36 19 -13 16 -1 2 67 6 -5 36 -9 18 14 5 15 31 6 -1 -7 17 13 38 43 32 18 -20 22 -52 -17 -2 6 -32 -37 -17
8084 -17 32 13 -28 6 -23 -45 -49 -8 -31 -17 -38 -18 -57 18 9 -1 -45 35 51 -70 -3 11 -21 -8 -16 -22 5 31 12 36 21 20
8116 20 -31 8 18 36 35 17 -23 9 37 -10 21 -23 -14 23 -19 19 -27 1 -19 -71 -11 20 19 -52 -6 33 18 6 2 -37 2 77
8148 77 17 -42 -38 25 -23 -28 -15 6 40 -27 25 -8 21 37 34 31 -91 21 -26 4 12 -8 5 -7 15 -46 5 -21 -8 8 15 9 -12
8181 -12 49 -12 2 -15 -23 -4 28 42 -24 37
8191C7
$$ Imaginary data points
##PAGE= N=2
##DATA TABLE= (X++(I..I)), XYDATA
0 0 0 0 0 0 0 0 0 0 0 0 0 8 -8 8 -12 16 -16 24 -28 32 -40 48 -56 70 -80 96 -112 128 -148 171 -196 227 -258
33 -258 291 -329 370 -417 470 -525 583 -653 725 -805 894 -989 1092 -1204 1331 -1466 1617
50 1617 -1780 1960 -2160 2382 -2629 2905 -3219 3575 -3987 4468 -5035 5720 -6564 7634 -9039
65 -9039 10978 -13823 18451 -27498 80694 -340048 -107706 373447 -228624 -119438 335817
76 335817 -101558 -248539 219239 3795 -142118 170314 9302 -194841 83781 69126
86 69126 -55812 49079 -22456 -69046 68175 -28301 -17660 125656 -80763 -131970 143908
97 143908 24129 -104554 100401 -5876 -135766 104451 44169 -106312 98999 14212
107 14212 -174170 102158 116708 -147208 28485 89845 -144165 25762 137331 -110909
117 -110909 -16396 105694 -122693 -23354 171032 -69768 -101957 103865 -20715 -65903 93495
128 93495 -2934 -66209 41513 -25517 -22098 95435 -30805 -81462 67783 -31 -52558
139 -52558 77758 -2856 -81848 56280 8508 -64195 84659 20802 -124200 42350 81369
150 81369 -80860 6329 68698 -72140 -20304 68040 -29031 -6720 43658 -60187 -19142
161 -19142 80015 -22251 -43455 47512 -13745 -39157 44533 7932 -25744 21014 -21492 -23817
173 -23817 57790 1307 -53520 28022 16384 -39748 21519 25653 -29675 1214 2912 -19279
185 -19279 33337 12611 -50134 11359 33246 -33986 1321 35185 -26269 -14150 21900 -12788
197 -12788 7093 24982 -36922 -12195 46219 -14285 -28433 35405 402 -34374 17387 14150
209 14150 -12036 9089 -9141 -17376 28027 5190 -30709 15179 15600 -27592 2346 21304 -9485
222 -9485 -3582 -263 -11146 17500 10233 -28120 5052 23911 -21266 -8205 25725 -5209 -14162
235 -14162 7084 -2372 4692 11522 -18893 -5499 25273 -9610 -18847 21140 5334 -20759 3752
248 3752 8770 -2642 3617 -7853 -7744 17726 253 -20496 11080 13948 -17681 -4475 14766
261 14766 -293 -5178 -2121 -2229 9867 3011 -15356 3765 15715 -10824 -10232 13605 4532 -9673
275 -9673 -2615 3117 5585 527 -10925 764 13471 -6429 -12357 10377 7557 -10800 -4185 6479
289 6479 3860 -1842 -7106 72 11244 -2223 -12735 7143 11286 -9932 -7180 9834 4625 -6000
303 -6000 -4216 2464 6742 -1132 -9668 2914 10918 -6370 -9941 8158 7257 -8015 -5788 5251
317 5251 5487 -3272 -7424 2787 9043 -4435 -9454 6565 8298 -7035 -6268 6145 5833 -3889 -6295
332 -6295 3119 8211 -3621 -9141 5729 8757 -7039 -6888 6521 5218 -4646 -5530 2458 6828 -2481
347 -2481 -9118 3785 9569 -6413 -8637 7271 6270 -6384 -4836 4287 5158 -2259 -6522 2522
361 2522 8557 -3715 -8693 5698 8034 -5992 -6387 5182 5702 -3659 -6202 3071 7102 -3927
375 -3927 -7865 4881 7248 -5714 -6651 4556 5705 -3395 -6229 2476 7089 -3236 -7861 4951
389 4951 7785 -5997 -6430 5806 5705 -3758 -5157 2357 6259 -1868 -7056 3585 7621 -5384 -7239
404 -7239 5885 6223 -4777 -5928 2507 5994 -1977 -7020 2866 7064 -5499 -6752 6579 5476
418 5476 -5467 -4720 2621 5272 -222 -6547 923 8153 -3649 -8044 7161 7090 -7374 -5032 4963
433 4963 4092 -1160 -4625 -484 6258 -1485 -7950 4986 7738 -7487 -6657 5929 4755 -2547 -4461
448 -4461 -541 5526 -276 -7174 4115 7841 -7607 -6513 7830 4736 -3614 -3386 -806 4571 2427
463 2427 -6777 962 8699 -6368 -8365 9357 5934 -7405 -3702 1719 2873 2225 -4939 -1879 7230
478 7230 -3292 -8520 8006 7055 -8572 -4506 4202 3033 1408 -3840 -2922 6795 -313 -8606 6439
493 6439 8416 -9269 -5424 6932 2763 -943 -2380 -3372 4735 2216 -8240 2986 9370 -8478
507 -8478 -7938 8828 3989 -4546 -1633 -1377 2051 3616 -5220 -578 8539 -4743 -9085 8080 7075
522 7075 -5954 -3831 1277 2843 2497 -4047 -1251 6785 -3509 -8197 7781 6813 -7825 -4054 2978
537 2978 1756 2157 -2685 -4117 5471 502 -8720 4931 9179 -8393 -6872 6857 3311 -1729 -1270
552 -1270 -2321 2560 2729 -5601 1284 8632 -5529 -8479 7349 5952 -4851 -2635 493 1267 2142
567 2142 -3017 -1430 6166 -2364 -8823 5381 8128 -6126 -5403 3494 2288 -306 -1504 -1167 3453
582 3453 -48 -6419 3180 8330 -5000 -6933 4903 4100 -2242 -1577 -280 1957 1041 -4563 635
597 635 7566 -3447 -8426 4922 6040 -4430 -3067 1751 1253 233 -2791 -418 5773 -1807 -7986
612 -7986 4389 7301 -5225 -3883 3712 1009 -467 -620 -1342 3807 978 -7438 1964 8998 -4686
627 -4686 -6734 5036 2662 -2936 -598 -222 1703 1080 -5881 606 8618 -4200 -8043 6012 3735
642 3735 -4761 357 925 -851 2586 -2732 -2545 8006 -486 -10212 4817 8052 -6291 -2736 4367
657 4367 -687 -305 -69 -2152 4364 953 -8682 2480 8768 -5763 -5025 5239 247 -2041 1082
672 1082 -1968 1760 2828 -6744 -247 9752 -3779 -8060 6139 3627 -4570 364 1169 -37 1887
687 1887 -3498 -1341 7570 -1737 -8236 4877 5064 -5295 -966 2399 -817 1088 -1746 -2789 5911
702 5911 615 -8868 3069 7611 -5777 -3570 5106 16 -1726 370 -1528 2936 2296 -6661 315
717 315 8284 -3723 -5932 5645 2123 -4192 370 741 450 1969 -3848 -2068 6826 -613 -7617
732 -7617 3611 5063 -5073 -1990 3391 361 -490 -1721 -1532 4578 1022 -6551 1697 6350 -3994
747 -3994 -3528 4457 1097 -2141 -473 -530 2495 1857 -5209 -424 6740 -2519 -5789 4180 2846 -3808
763 -3808 -754 1013 710 1247 -3285 -1551 5894 -658 -6849 3528 5105 -4621 -1920 3235 38
778 38 -10 -521 -1814 3598 1559 -6203 1137 6818 -3544 -4695 4170 1773 -2468 -360 -275 1304 1347
795 1347 -4153 -578 5883 -1982 -5756 3377 3289 -3051 -1202 991 858 1006 -2624 -1012 5171 -531
811 -531 -5854 2818 4668 -3428 -2017 2417 717 -126 -1341 -1217 3594 624 -5425 1090 5244 -2899
827 -2899 -3666 2797 1603 -1643 -1278 -179 2351 664 -4287 207 5048 -1719 -4192 2745 2655 -2220
843 -2220 -1271 1032 1736 342 -2891 -429 4212 -316 -4488 1604 3669 -2181 -2578 1791 1940 -1086
859 -1086 -2396 185 2974 -296 -3674 664 3465 -1370 -2950 1571 2567 -1241 -2472 883 2968
874 2968 -458 -3144 662 3330 -884 -2937 1332 2764 -1308 -2488 996 2541 -710 -2950 306
889 306 3013 -471 -3297 704 3067 -1428 -2933 1545 2565 -1419 -2399 915 2357 -300 -2461 265
905 265 2989 -412 -3012 1118 3165 -1301 -2680 1443 2472 -800 -2307 335 2530 -268 -2951
920 -2951 483 3017 -1138 -2975 1339 2545 -1442 -2492 743 2221 -384 -2481 240 2705 -643
935 -643 -2797 1136 2811 -1184 -2495 1034 2531 -376 -2423 199 2633 -328 -2719 910 2698
950 2698 -1377 -2574 1329 2309 -881 -2277 -27 2192 127 -2538 165 2750 -950 -2960 1523
965 1523 2833 -1483 -2355 885 2033 3 -1755 -120 2240 -138 -2652 1095 3093 -1423 -2855
980 -2855 1176 2252 -418 -1789 -304 1733 123 -2456 502 3024 -1502 -3353 1495 2753 -941
995 -941 -1862 -26 1342 378 -1693 181 2731 -1072 -3265 1789 3195 -1246 -2057 263 1229 730 -1191
1012 -1191 -641 2160 -366 -3415 1476 3710 -1863 -3141 1139 1530 -78 -800 -624 1020 105 -2324
1028 -2324 820 3410 -1588 -3376 1432 2482 -237 -1135 -437 924 513 -1584 543 2948 -1416 -3422
1044 -3422 1620 2910 -867 -1774 -354 854 542 -1262 -68 2254 -1176 -3388 1619 3191 -1380
1059 -1380 -2278 333 1067 418 -674 -291 1477 -385 -2597 1252 3390 -1159 -2942 552 1995 274
1075 274 -1075 -148 1129 -566 -1952 1322 2829 -1509 -3077 737 2361 56 -1462 -401 746
1090 746 -188 -1195 967 2128 -1307 -2932 878 3008 132 -2210 -503 1410 206 -1021 878
1105 878 1621 -1522 -2437 1350 2968 -547 -2617 -360 1550 283 -841 320 716 -1259 -1677 1289
1121 1289 2541 -599 -2973 -338 2483 658 -1456 -51 1006 -809 -1237 1523 2391 -1230 -3022
1136 -3022 484 2871 144 -1810 -11 602 -572 -300 1039 1119 -1035 -2571 169 3133 341 -2796
1152 -2796 -467 1454 -207 -589 1049 862 -1215 -1920 766 3039 144 -2975 -263 2182 -46 -796
1168 -796 1055 471 -1375 -1057 1130 2202 -153 -2821 -590 2332 352 -1330 216 400 -1125 -832
1184 -832 1108 1835 -624 -2937 -191 2845 444 -1917 133 857 -926 -494 1495 1292 -1014 -2130
1200 -2130 310 2662 467 -2090 -299 1088 -405 -441 982 762 -1041 -1901 282 2601 280 -2723
1216 -2723 -450 1786 -312 -991 1073 669 -1384 -1206 867 2062 59 -2345 -429 2029 288 -1127
1232 -1127 619 696 -1086 -843 954 1644 -110 -2309 -588 2368 373 -1892 227 1037 -1234 -880
1248 -880 1365 1055 -752 -1776 -216 2158 577 -1952 -75 1374 -726 -759 1323 803 -890 -1190
1264 -1190 23 1904 777 -2192 -517 1974 -413 -1413 1284 884 -1418 -962 616 1272 254 -1861
1280 -1861 -641 1856 37 -1582 781 1035 -1313 -772 877 1002 164 -1496 -607 2014 479 -1945
1296 -1945 507 1522 -1211 -918 1221 769 -442 -1114 -467 1571 535 -2050 -2 1678 -974 -1264
1312 -1264 1159 672 -802 -831 -161 1289 528 -1772 -216 1942 -550 -1470 1158 1020 -910 -632 318
1329 318 985 496 -1516 -423 1934 -280 -1779 974 1211 -1163 -802 595 617 63 -1142 -580 1569
1346 1569 147 -1874 512 1494 -1082 -1015 945 848 -275 -917 -224 1415 337 -1640 232 1604 -852
1363 -852 -1166 935 859 -619 -759 15 1059 337 -1506 -178 1641 -353 -1533 795 1076 -900 -948
1380 -948 477 911 -53 -1166 -147 1404 -31 -1349 506 1224 -570 -958 521 988 -185 -1110 -7
1397 -7 1351 -9 -1437 237 1307 -626 -1082 584 835 -414 -986 -60 1092 94 -1354 -51 1412
1414 1412 -387 -1357 600 1174 -593 -946 489 1024 -130 -1046 112 1263 -142 -1180 419 1121
1430 1121 -447 -1017 382 965 -168 -1180 -31 1188 -231 -1322 275 1149 -535 -1073 486 926
1446 926 -265 -969 166 1145 -115 -1220 287 1202 -432 -1047 614 943 -388 -891 153 1023 75
1463 75 -1057 -5 1195 -314 -1203 474 1091 -571 -1085 287 966 -118 -1060 -60 982 -177 -1043
1480 -1043 399 1066 -475 -1078 404 1128 -150 -1019 79 1051 -103 -814 261 910 -361 -936 310
1497 310 1100 -103 -1263 -107 1183 -53 -1097 262 888 -590 -919 617 871 -428 -942 23 970
1514 970 220 -934 -100 1002 -153 -1061 491 1224 -588 -1222 385 1060 -100 -794 -124 694 -28 -755
1532 -755 184 965 -468 -1254 356 1253 -212 -1031 -92 729 106 -625 97 874 -297 -1099 491 1361
1550 1361 -267 -1164 154 880 95 -508 31 633 -187 -872 385 1177 -413 -1244 88 878 102 -771
1568 -771 -333 594 -92 -1004 324 1297 -634 -1367 505 1080 -170 -605 -11 422 126 -541 218 1057 -337
1587 -337 -1296 399 1229 -144 -819 -90 481 134 -569 -85 835 -302 -1279 308 1305 -285 -1018 -16
1605 -16 647 94 -544 -20 788 -241 -1109 568 1272 -423 -970 256 653 234 -238 -296 493 213 -986
1624 -986 140 1438 -305 -1436 312 1020 -193 -615 10 341 -99 -626 167 971 -236 -1185 189
1641 189 1054 -12 -676 -34 451 117 -522 38 888 -156 -1118 248 1169 -115 -991 24 663 -122
1659 -122 -533 75 579 -239 -886 162 985 -156 -1042 6 829 21 -559 43 670 -49 -674 146 1018
1678 1018 -57 -1018 121 1029 -61 -716 166 563 -133 -503 111 706 0 -998 -67 1002 -77 -987
1696 -987 169 596 -252 -435 67 431 113 -774 -264 1121 145 -1150 144 1014 -358 -555 473 423
1714 423 -90 -361 -165 807 200 -989 -79 1043 -237 -794 283 346 -118 -400 -191 584 323 -1133 -187
1733 -187 1315 -214 -1081 526 554 -420 -150 90 277 412 -670 -376 1225 151 -1229 335 876 -439
1751 -439 -343 239 138 230 -402 -445 961 262 -1371 107 1134 -464 -651 420 132 -20 -172 -436 679
1770 679 396 -1233 82 1353 -403 -847 547 278 -140 74 -228 340 529 -940 -352 1292 -123
1787 -123 -1236 478 562 -474 -146 -36 74 436 -642 -501 1135 56 -1240 437 839 -604 -224
1804 -224 293 113 310 -236 -569 941 414 -1266 234 1111 -538 -503 528 74 -16 -155 -514 574 593
1823 593 -1125 -117 1172 -429 -842 568 294 -295 -50 -257 320 554 -831 -344 1258 -123 -996
1840 -996 589 535 -434 -62 21 89 531 -517 -603 1056 232 -1173 339 877 -624 -434 342 71 153 -302
1860 -302 -562 680 405 -1054 -35 992 -405 -632 460 276 -101 -94 -275 424 488 -757 -246 1025
1878 1025 -144 -848 415 495 -316 -234 -72 267 328 -526 -361 807 35 -937 280 658 -329 -355 54 247
1898 247 209 -412 -256 738 159 -886 151 774 -280 -482 259 256 83 -218 -258 463 251 -759 -109 852
1918 852 -182 -728 234 422 -165 -252 -111 269 254 -475 -192 790 56 -771 195 681 -240 -476 160 307
1938 307 93 -251 -188 526 212 -670 -83 792 -125 -722 224 430 -215 -338 -79 313 179 -551 -302 659
1958 659 88 -774 140 648 -226 -389 304 298 68 -296 -184 494 321 -625 -44 740 -141 -536 229 400 -86
1979 -86 -303 -194 375 289 -626 -206 711 -151 -703 256 409 -256 -271 -96 231 351 -403 -327 744 179 -719
2000 -719 233 689 -353 -315 250 209 179 -223 -423 459 325 -788 42 745 -348 -547 364 196 5 -194
2020 -194 -397 321 491 -613 -225 783 -174 -661 429 430 -238 -184 -101 258 418 -434 -305 584 -34 -705
2040 -705 271 611 -280 -370 -8 213 235 -315 -405 431 135 -701 133 577 -251 -417 105 325 141 -252 -285
2061 -285 407 301 -539 -1 600 -133 -497 219 458 -4 -303 -212 356 282 -410 -158 500 -58 -585 111 458
2082 458 -123 -434 -58 347 102 -357 -121 376 32 -421 92 533 15 -449 20 507 62 -415 -50 354
2102 354 75 -333 -13 413 24 -557 -103 522 7 -409 -14 320 -2 -331 -35 265 89 -429 -132 578
2122 578 85 -559 59 437 -59 -274 51 252 115 -226 -125 478 134 -668 29 624 -69 -443 102 189
2142 189 27 -167 -165 249 131 -500 -57 610 -59 -533 27 373 -33 -176 -143 243 214 -334 -46 598 -75
2163 -75 -526 141 416 -26 -147 -146 123 280 -298 -190 493 6 -697 117 508 -169 -328 -54 170 190 -185
2184 -185 -180 354 47 -505 65 550 -36 -354 10 198 92 -97 -92 224 104 -423 -33 595 -23 -506 -86
2205 -86 342 103 -268 -118 206 -21 -458 52 542 -154 -509 21 344 74 -90 -139 158 169 -282 -7 459
2226 459 -34 -522 23 527 119 -300 -188 182 140 -267 -14 399 -140 -541 152 493 -61 -300 -130 74
2246 74 163 -121 -178 198 -7 -418 44 507 32 -435 -99 340 198 -135 -74 280 11 -336 104 485 -89
2267 -89 -506 10 360 153 -213 -149 189 31 -270 99 375 -94 -450 -57 361 211 -202 -211 234 159 -287 64
2289 64 413 -101 -475 97 434 52 -292 -153 137 106 -184 -13 229 -112 -393 60 415 59 -285 -177 251
2310 251 173 -208 -53 315 -46 -321 127 451 12 -399 -81 343 126 -191 -26 186 -44 -174 87 358
2330 358 37 -382 -124 339 91 -287 -96 184 -58 -188 16 169 -28 -360 -109 371 131 -370 -37 281
2350 281 29 -182 111 171 -54 -230 -44 364 219 -333 -108 372 51 -283 85 183 -75 -179 -96 196 129
2371 129 -333 -264 316 132 -389 23 274 -129 -270 28 215 37 -182 -125 303 103 -260 52 337 -31 -238
2392 -238 48 210 71 -205 -108 336 101 -283 -58 321 -150 -275 124 167 66 -241 -132 241 146 -296 -72
2413 -72 336 -125 -215 107 206 -14 -150 -93 193 164 -239 -115 322 9 -293 42 215 -14 -181 -71 153 144
2435 144 -207 -102 300 12 -276 65 177 -36 -192 -19 190 124 -111 -73 304 60 -275 -28 265 3 -174
2456 -174 -14 178 30 -187 -136 282 96 -283 10 280 -68 -283 -3 165 77 -192 -119 175 83 -233 -24
2477 -24 329 29 -241 -26 234 22 -221 -31 271 31 -222 -13 310 60 -202 -33 162 11 -153 -66 201
2498 201 -5 -304 -28 226 -18 -299 -6 242 -12 -202 4 191 56 -179 9 232 97 -232 -34 252
2518 252 84 -228 -5 249 23 -252 -9 102 35 -148 -59 206 113 -312 -126 290 -52 -278 -12 188 -53
2539 -53 -156 -112 188 133 -226 -125 272 66 -282 51 305 -91 -114 61 142 71 -157 -188 218 121 -309 48 325
2562 325 -98 -216 59 86 2 -79 -143 160 146 -261 -35 336 -66 -259 204 138 -76 3 -88 79 226 -220 -236
2585 -236 287 13 -347 139 273 -206 -107 18 -8 155 -79 -306 235 179 -436 104 335 -198 -213 108 59 90
2607 90 -22 -228 180 288 -267 -46 369 -153 -211 209 105 -75 -41 -175 87 350 -243 -181 307 -112 -414
2628 -414 247 172 -197 -2 -154 -32 263 -96 -289 331 136 -331 191 378 -271 -157 128 1 245 43
2648 43 -350 151 319 -298 89 462 -268 -281 237 152 40 0 -362 48 262 -244 -166 340 -195 -329 265 280
2670 280 -76 7 -116 -15 380 -125 -211 285 -102 -398 260 344 -214 -144 -75 -36 318 0 -334 150 62 -340
2692 -340 135 402 -238 -254 85 85 140 45 -225 21 181 -279 73 388 -203 -325 194 197 60 29 -218 -27 210
2715 210 -59 -93 273 -94 -351 118 263 -109 -162 -187 -14 201 -15 -216 122 -80 -309 207 323 -130 -160
2736 -160 -52 27 282 125 -254 94 139 -260 142 414 -168 -305 58 130 126 44 -218 -76 128 -123 0 329
2758 329 -180 -413 70 246 21 -54 -156 -98 149 4 -55 227 -2 -378 133 342 16 -166 -67 -21 173 47
2780 47 -86 113 -3 -294 22 336 -112 -203 -56 43 83 -2 -73 -4 52 -203 62 334 -82 -332 -4 222 132
2803 132 21 -153 -38 116 -62 -34 308 8 -342 42 261 45 -43 -101 -70 108 42 -21 83 -26 -320 -11
2825 -11 336 35 -213 -77 67 88 11 -77 93 31 -210 91 298 -37 -216 -9 92 113 38 -120 28 39 -171
2848 -171 7 298 -71 -313 -75 152 49 -60 -86 62 50 -135 15 181 0 -220 27 252 75 -72 -74
2869 -74 65 90 -44 -11 147 -40 -196 -67 186 49 -145 -112 99 60 -104 -34 109 -64 -137 12 155 -8
2891 -8 -115 -79 105 126 -129 -79 152 -41 -174 84 195 20 -106 -73 162 140 -107 -65 132 40 -120 81 151
2914 151 -22 -167 -17 29 141 -70 -179 137 60 -187 22 109 -143 -108 -5 128 68 -41 -105 100 98 -118 61
2937 61 210 -49 -135 36 90 33 -75 -78 106 129 -141 -62 150 -3 -164 39 37 17 -65 -89 93 106 -99 -28 210
2962 210 6 -128 41 142 14 -22 -92 64 119 -84 -97 152 48 -221 24 162 -25 -41 -76 35 120 -153
2984 -153 -79 155 4 -222 31 140 -58 -63 7 51 151 -13 -132 189 41 -196 15 243 5 -83 -11 12 102
3007 102 -18 -124 73 65 -178 29 171 -62 -201 -16 63 23 -31 -101 34 74 -189 -68 229 -24 -200 21
3029 21 119 34 2 -52 71 200 -103 -70 218 -18 -220 51 142 -110 -24 2 27 24 -33 -149 111 25 -247 8 186
3054 186 -9 -99 44 -11 87 -51 -96 137 91 -239 0 203 -84 -105 33 41 69 27 -74 32 87 -140 -73 238
3078 238 -67 -229 43 109 -85 11 -9 3 60 -54 -137 116 61 -190 15 112 -4 -93 -1 40 99 -83 -102 91
3102 91 24 -173 -60 130 -32 -138 -4 19 59 40 -136 55 28 -108 -46 143 31 -107 29 49 35 -36 -85 72
3126 72 154 -112 -99 161 41 -152 -48 109 40 -77 -27 -29 63 -49 -117 75 33 -103 -55 92 -36 -121 9 47
3150 47 71 -24 -48 25 76 -37 -62 192 16 -141 2 98 50 -69 -6 70 11 11 -59 94 -15 -133 26 131 -29
3175 -29 -165 -81 72 84 -87 -61 41 -17 -124 -54 94 -10 -143 -88 109 46 -48 -19 -15 17 -54 -2 117 24 -144
3200 -144 -5 134 19 -78 -28 -11 90 9 3 33 10 -180 -40 187 7 -97 -81 42 38 21 -43 6 38 -91 1
3225 1 149 32 -126 12 77 51 40 -64 -1 28 -92 -72 135 59 -218 -71 101 74 -40 -18 4 26 -33 -8 107
3250 107 84 -134 -8 184 40 -19 -11 -18 29 16 25 16 13 -150 -69 141 75 -139 -25 28 -6 -3 0 -38 25 -87 -18 168
3278 168 55 -140 -40 69 1 52 -5 -59 11 -23 -83 167 112 -154 -46 114 19 -14 33 -69 26 70 -47 63
3302 63 20 -129 -112 162 97 -140 -2 -10 0 -16 20 -61 21 -87 -95 240 116 -147 -53 90 59 20 24 -39 -8 -13 -48 118
3330 118 142 -178 -107 125 24 3 15 22 -33 -38 -36 85 100 -100 -151 147 41 -78 74 41 -42 52 9 15 49 -125 -151
3357 -151 157 106 -125 -11 50 -56 -18 2 -61 15 -18 -126 144 149 -121 -96 115 -23 -27 52 -44 1 7 -74 101 216
3383 216 -104 -62 142 19 0 92 -7 -94 45 33 20 77 -126 -159 111 41 -107 18 41 -32 -8 24 -37 -8 -58 -114
3409 -114 106 94 -122 10 87 -49 16 99 -22 39 -12 -60 127 116 -122 -85 120 -16 -69 87 11 -6 -22 -87 41
3434 41 144 -52 -108 88 19 -59 50 31 -69 24 25 32 85 -35 -116 93 115 -88 -20 59 2 -19 -11 11 58 -84 -94
3461 -94 56 77 -123 -70 78 -17 -1 73 -1 45 -2 -107 84 131 -105 -98 88 -35 -78 -41 40 -40 -44 -48 10 95 -52
3488 -52 -92 38 46 -68 -28 30 -35 -31 5 1 16 -21 -63 -13 118 -92 -9 103 -24 -32 94 103 51 -41 -38 124 115 -8 -69
3517 -69 113 6 -123 0 -11 -38 -35 -48 -18 88 -52 -95 41 9 -151 -34 58 -11 -76 9 37 57 36 -90 60
3542 60 143 -65 15 124 22 -91 15 21 36 31 -70 -19 111 -29 -46 41 -16 -43 -32 62 -5 -58 -19 7 32 -12 -102
3569 -102 7 40 -61 -54 119 3 -36 34 29 42 -51 -91 73 71 -76 -46 106 41 19 24 -18 -35 -29 -9 15 83 -43 -4
3597 -4 100 1 -59 -35 65 -10 6 -2 -26 86 16 -97 105 80 -96 -88 47 -20 -86 3 25 18 -18 -69 36 78 -56 -83
3625 -83 81 21 -35 -14 52 -55 -38 -14 13 70 -19 -25 71 75 -59 76 115 -39 -61 -19 49 45 -52 -55 -20 25 -44 -65 13 14
3655 14 -60 30 -32 0 57 -74 6 83 -49 -57 85 0 -48 8 34 0 17 -50 -49 120 -33 -36 54 92 -48 26 57 -65
3683 -65 46 -2 -61 48 14 -143 38 57 -72 -14 20 -52 -46 43 -18 51 -31 -67 -26 85 -84 8 4 -43 -10 72 10 -28
3711 -28 72 -31 -29 83 -74 -89 100 11 -40 5 34 10 -25 -62 -44 56 19 -65 119 14 -101 -7 96 -15 -50
3736 -50 31 -101 36 59 -64 29 44 -116 -83 98 -26 -106 20 -49 25 57 -109 35 84 -65 -47 105 45 -68
3760 -68 5 38 -3 46 -8 -15 88 -35 -78 32 64 -75 -1 96 -23 67 17 -50 23 -45 -73 59 18 -138 -10 43 -11
3787 -11 -53 -78 13 38 33 -76 5 89 -46 -53 105 60 6 60 20 40 71 -49 17 58 -18 -79 15 90 20 50 -11 -47 27
3816 27 -70 -2 13 -87 -79 33 26 -103 -47 48 32 32 -38 -24 -24 14 9 41 54 -48 22 32 32 -36 4 44 34 -54 -73 58 49
3847 49 8 -24 39 53 -17 5 61 17 32 -16 31 20 -6 -88 24 15 -1 -12 -18 40 -15 -20 16 62 -4 -32 -31 21 -50 -15 31 58
3879 58 -50 -36 16 23 -11 -41 15 -1 12 -129 13 43 -61 -74 13 29 -53 5 -26 3 -15 -12 -18 -7 -19 -36 81 57 -75
3908 -75 -76 4 8 48 -89 -51 28 -84 -76 35 79 -76 -11 -15 -43 -16 45 -13 -9 23 -11 31 35 -63 -14 46 46 -25 5 -15 36 19
3940 19 -74 64 31 -18 -46 -2 13 -36 -9 24 0 -65 -47 -22 9 -61 -62 11 -10 -15 -12 -55 17 32 -6 9 111 -23 -18 47 19
3971 19 -5 -15 12 -4 21 -3 19 8 18 -74 79 10 -24 -44 -29 9 -35 26 10 2 -53 -81 80 61 -42 13 -15 14 3
4000 3 -4 -2 -52 -25 -98 -11 65 -69 -34 9 44 13 -51 -19 22 61 -24 55 8 -87 -24 -4 58 -14 1 35 65 59 -20 4 43 -14
4032 -14 -31 12 -35 -15 -50 -5 3 -38 -114 -18 19 -28 7 27 31 -57 26 -6 12 7 -75 30 55 5 -11 33 2 16 -45 -9 6
4063 6 45 14 16 0 40 -46 24 13 -18 -55 10 30 -16 -42 -21 7 -28 -44 -11 13 -37 -51 67 36 -37 -13 6 29 -20 -20 42
4094 42 45 5 -21 54 -1 -24 40 -18 -10 18 5 8 3 -1 -67 29 -19 -52 -103 3 69 -8 5 44 35 0 -59 1 44 -19 0 34 13
4127 13 -7 18 -24 11 -62 -15 1 6 23 -39 16 37 -6 -27 23 36 -21 -57 25 14 5 -35 29 25 23 18 20 65 -28 -11 -2 38 10 20
4161 20 45 -4 -32 27 29 0 -32 0 7 -40 10 -36 14 -19 16 15 23 52 23 -21 -16 24 0 1 55 62 -16 58 53 -3 -18 -13 0 61 33
4196 33 5 72 -5 -25 4 -51 6 -2 -59 15 45 3 -46 28 -60 -24 -36 20 42 2 -10 14 51 27 52 11 40 44 10 21 33
4227 33 -86 8 18 11 47 24 -27 24 2 -79 22 16 -52 6 28 13 21 -32 -10 75 43 -42 38 19 -108 -1 98 12 -18 8
4257 8 -14 16 18 -23 -63 64 -27 -11 25 10 -24 2 3 27 9 -44 25 16 -49 -36 56 17 -39 -11 15 13 -1 -13 5 47 8 -64
4289 -64 11 2 -76 -28 47 -9 -6 -34 -42 -22 -20 -39 18 48 -54 -54 24 -9 -28 48 -70 -25 27 -43 19 3 -2 -12 45 33 -43 45
4321 45 40 -27 42 44 -85 21 -29 -77 61 23 -78 17 1 -33 3 32 -53 -3 64 -57 38 7 -46 -13 59 -66 -3 56
4349 56 -21 38 21 -69 14 56 -30 -66 31 24 -56 45 18 -3 16 -13 -16 67 15 -43 42 -4 -20 30 26 -18 27 -6 -23 35 -20
4380 -20 -63 40 82 -57 -42 43 -25 -5 15 -36 16 23 -30 33 17 -66 -40 54 10 69 34 -2 -19 -4 -74 -21 48 -24 -27 85
4410 85 28 -53 -28 -31 -30 -1 30 -44 16 -38 -34 33 -6 -44 -34 6 13 52 20 -35 63 -27 -16 22 18 -43 3 34 20 57 3 -25 -29
4443 -29 17 14 46 60 -6 -7 31 30 23 -62 -33 -13 -51 -59 2 39 -23 -50 13 -32 -44 -10 -9 -41 10 -27 -32 38 -22 -18 -49 10 -1 -34
4477 -34 16 56 27 15 -23 28 -8 -7 -18 40 -26 -1 28 -9 8 47 -47 22 -69 -3 29 13 -14 -53 50 49 -39 -62 56 12
4507 12 13 -23 17 1 4 -2 23 34 -9 -5 -15 14 15 -16 23 -13 -27 -28 4 -3 -61 2 6 0 -13 -9 10 51 51 3 13 -5 6 -39 -27 59
4543 59 -41 -1 52 -8 -32 12 -10 -8 -28 -9 -31 -19 -18 -59 -33 -2 -44 -2 15 -19 -5 -18 4 86 25 -28 14 -26 -38 22 43
4574 43 29 -14 -10 -3 -8 17 -100 8 47 -51 -36 27 -8 -45 -34 -20 -31 -45 2 -79 -36 22 -64 31 -4 -69 18 65 14 -58 23
4605 23 -27 30 20 -33 -15 19 -35 -72 32 12 -35 6 -24 21 30 -72 -12 52 2 -1 35 -10 -54 -2 60 -35 21 -13 -47 12
4635 12 -18 -18 48 79 -37 22 72 -64 1 6 -15 74 16 31 9 53 -27 -54 57 30 1 46 -19 12 39 -28 -4 132 -9
4664 -9 -46 57 6 -30 5 -20 -40 42 -41 -33 83 19 -85 -11 -3 -18 -19 -3 -8 23 -18 -46 27 -28 -57 11 13 -51 -19 -2 18 43
4696 43 10 6 34 42 19 46 30 -9 -22 78 25 -27 18 63 36 41 -23 17 12 9 -27 4 -30 -23 -27 -71 -2 43 -20 -16 69 23 -99
4729 -99 -19 5 -54 -11 29 -43 14 -4 -8 36 33 -20 37 15 -2 3 6 -21 -3 -43 26 -16 48 19 -12 -21 6 -52 25 -18 14 33 28
4762 28 14 15 -27 -55 3 -12 -2 5 -18 -34 -17 -46 5 -43 23 -75 49 -50 -31 44 26 -58 -15 -21 19 32 9 30 19 27 -29 6
4794 6 -3 -41 -8 -42 40 -3 -23 8 88 -40 1 -67 -1 -15 -12 17 -24 -9 6 -8 41 29 -18 -17 9 2 19 6 -13 -15 29 21 41
4827 41 31 0 32 22 6 -21 62 19 -42 -4 50 -13 -18 -17 20 42 5 -36 55 16 -54 -2 -63 -11 54 -11 -4 45 -32 -9 9 56
4859 56 -3 30 -50 -12 39 18 24 56 -22 21 24 29 8 37 38 0 40 -18 -40 88 7 -73 -23 15 -55 17 -9 16 14 16 -18 35 20
4892 20 23 68 7 -47 -33 8 35 10 16 -20 17 -35 -35 27 34 8 0 41 -21 39 -23 15 18 40 28 -2 41 -13 -47 -40 29 17 -33 26
4926 26 54 -12 -51 -70 -16 22 -3 -24 -16 -20 4 1 14 -19 2 18 46 -10 7 24 -29 64 22 1 73 13 9 3 71 -3 -24 57 -5
4959 -5 9 -1 32 -14 -1 -29 -28 8 -76 -57 7 -3 -33 -6 -56 -3 -9 -28 -14 51 -7 -39 18 47 -24 -1 30 0 21 15 25 29 57
4992 57 -17 82 40 -51 46 22 -1 29 18 15 13 -2 -35 -6 25 -11 22 -4 19 -11 7 -28 37 36 -49 -54 22 -48 -3 12 12 -26 -15
5025 -15 -10 26 -45 -37 -17 17 37 -54 -8 -12 -35 23 -32 -60 27 -31 -74 -21 4 -44 -4 33 -24 -17 16 -4 -11 24 28 82 -15 -40 -29
5058 -29 37 -18 -21 -19 18 -50 10 -34 -6 -16 -54 -29 -39 -21 -24 -21 -3 3 7 -19 3 62 42 -43 20 9 -41 13 7 -50 -30 86 -32
5091 -32 12 -6 -6 46 -4 -13 -35 38 -44 -22 6 -36 -9 24 -28 -30 -12 -52 -9 35 5 -38 22 -24 6 1 10 24 82 -3 -25 7 7
5124 7 -1 -38 -4 -43 19 15 50 46 -2 -3 17 68 -69 -21 34 -85 -84 44 -48 -5 13 -16 -14 -20 4 -53 38 11 6 35 -10 35 0
5157 0 44 2 35 21 4 21 18 -56 60 30 -16 8 -30 21 21 61 -39 47 -30 20 19 -11 18 23 -17 0 3 -8 -13 6 5 -14 2
5190 2 -16 1 -8 -84 -21 13 -25 23 25 56 -44 -71 37 12 -28 6 12 27 12 -17 12 -5 -12 -2 10 -24 11 -19 26 -9 -7 -18
5222 -18 -36 9 -10 -53 31 -22 -26 36 42 -42 -10 7 -26 1 -42 -20 1 0 -24 -53 49 9 2 54 8 -1 61 -19 -2 54 33 32 -2
5255 -2 -57 -29 -9 39 -51 16 -18 -27 -3 -55 -19 -2 6 28 39 43 -4 -10 -4 -4 -15 -20 -24 3 -31 8 21 33 -36 6 18 -2 -24 15 -25
5290 -25 9 39 -42 -19 5 -2 2 45 15 8 28 31 14 -32 13 -5 15 -15 -24 23 18 -1 -48 -18 15 11 -28 18 -2 -32 -48 2 -32 13
5324 13 25 -34 25 49 -21 8 25 -1 5 -22 -37 9 -26 -12 40 -49 9 19 20 26 -13 -33 12 41 69 -8 -4 22 7 -13 -41 -7
5356 -7 -37 48 -15 21 -14 -47 24 -7 -54 10 -47 28 43 -23 30 -37 -24 15 68 47 51 -3 33 30 -14 -11 32 23 26 -2 21 32 -63
5389 -63 -99 33 64 -10 4 -9 -21 6 46 27 32 29 -56 -12 4 46 46 -42 -12 55 9 -27 17 46 22 30 62 -3 19 21 9 4 27
5422 27 25 -21 -3 8 34 24 3 45 -6 45 55 -11 29 -31 -48 -5 36 7 -83 -2 28 1 0 29 14 -40 -47 -56 -34 -22 27 10
5454 10 66 19 9 6 30 -26 4 15 31 -4 14 -2 68 39 16 33 25 -1 -24 30 39 -32 12 -27 26 40 20 0 10 -24 -31 7
5486 7 0 -23 18 -9 -19 7 27 -31 35 54 9 62 -8 57 1 32 -13 14 10 -13 -13 -7 21 25 -26 -20 -24 53 -6 -18 25 23 3 -32 -6
5521 -6 -3 6 20 -16 15 32 -37 -5 14 -13 22 -4 3 82 25 9 -34 85 -14 3 9 -20 -14 46 8 26 13 26 31 25 -34 11 -1 52
5555 52 50 -11 9 -66 -31 15 -12 21 -9 -40 7 39 25 -26 -30 -1 -39 46 -22 22 -13 -21 16 4 -33 -64 -36 1 -9 27 -50 41
5587 41 49 13 -3 -40 -15 32 26 48 10 -38 13 87 17 -4 29 26 -32 -18 -25 41 8 32 7 -26 8 -6 -28 -34 13 -44 -39 -1 0 0
5621 0 -44 -18 4 39 37 40 40 -16 -8 19 27 -9 25 -18 12 9 -27 24 -3 24 13 -17 2 14 -4 18 -65 0 -24 -18 -12 18 -6 -3 23
5656 23 -32 -35 28 -13 -9 0 -28 -20 -14 28 48 -21 -20 0 28 12 -7 -51 18 44 -60 34 -53 16 -31 24 81 -32 41 34 20 29 17
5689 17 17 29 17 15 27 17 1 -11 -12 15 -22 -38 17 14 -22 30 -13 19 49 15 -29 26 -60 -26 22 35 -1 19 -30 -73 39 28
5721 28 -33 8 101 -36 -65 34 13 36 -14 -23 -33 5 -39 -3 -6 4 -3 7 -61 -57 38 -26 15 16 31 -15 -34 0 -28 -15 -4 -43
5753 -43 -36 -13 11 -18 7 29 19 -12 9 -3 48 17 45 16 16 17 0 -23 17 -7 -6 -2 -42 48 1 33 -14 -58 -13 5 -20 -51 3
5786 3 9 -5 -7 -6 44 63 -85 -6 18 -19 -9 14 -10 -10 10 16 12 24 37 -35 43 56 -32 13 45 18 16 16 25 18 -18 12 24 -33 -23
5821 -23 -4 10 -16 -10 -23 5 10 -5 -4 -46 16 22 52 39 -61 27 7 9 -34 -17 -3 19 38 42 23 2 -21 -29 57 3 -6 -12 -9 10 -9
5856 -9 14 -10 31 13 -38 -11 13 -10 -4 3 24 4 19 -61 27 -41 -36 17 -13 -21 32 5 -1 11 4 -6 12 -13 -2 70 -36 -34 -4 -6
5890 -6 38 15 -1 -10 -4 -17 -22 -34 43 19 63 29 8 8 27 9 16 -16 -34 -33 -9 10 -62 -12 -4 -31 15 -25 -5 25 -70 -11 -10 36 -16
5925 -16 -29 18 0 13 31 -24 32 -32 -1 6 -45 -19 29 -1 -2 47 28 17 0 2 -27 -12 55 -28 54 -2 1 37 -6 39 -65 -10
5957 -10 -4 4 40 -16 -19 10 -24 -32 30 -5 5 -8 40 13 -6 21 -23 13 -23 -23 74 19 50 31 -31 28 32 38 -44 43 29 -18 22 -4
5991 -4 -41 -62 -53 -2 1 20 -27 -23 -8 3 3 -6 -37 -62 34 75 19 -55 51 -12 -27 2 -3 12 13 -30 -33 -29 -22 32 -34 -11 -34 33 13
6026 13 15 0 -47 -24 31 -9 -33 27 -8 30 17 -12 10 -61 11 9 -2 14 -11 -33 -6 -2 -53 20 -18 83 2 -11 -20 12 -24 13
6058 13 -1 16 -6 70 8 15 17 -17 28 9 13 -10 -31 -13 -8 -34 -7 -9 7 -14 3 18 -23 6 0 17 -29 -30 1 -1 -25 -50 -57 -13 -20
6093 -20 -40 26 39 1 -42 -12 -48 0 37 1 23 -27 -57 -35 -13 32 19 8 -49 36 1 63 -14 -1 -22 3 15 9 16 -7 7
6124 7 -22 0 -9 -49 18 -12 -40 -35 -38 28 21 43 -5 -18 -4 30 4 -12 -24 -43 -10 -9 59 73 20 -45 13 -50 29 8 -3 -78 17
6157 17 -22 -3 78 -4 39 51 -4 -40 -47 -5 26 14 -56 -17 27 50 -11 12 -5 6 68 -37 -14 3 55 4 44 7 8 16 -18
6188 -18 10 9 44 21 -3 16 -15 -9 13 49 -14 -16 -7 -2 35 -5 -29 36 -46 8 -4 0 26 -13 -39 -9 -32 11 -10 8 19 18 8 -78
6222 -78 4 0 1 -21 33 47 8 -6 14 1 -42 21 67 10 -8 -21 -26 31 -3 24 -12 43 2 40 -13 2 39 -16 -44 -23 13 17
6254 17 -25 19 11 32 -24 -16 18 -6 -47 3 25 9 6 17 -41 41 2 -42 61 45 -35 18 47 16 53 25 21 -25 3 17 -21 -41
6286 -41 8 22 -14 19 -18 -39 -20 0 17 -15 -18 -2 12 -22 1 -5 -37 5 27 -12 -18 49 -42 -8 50 36 46 -2 19 12 21 25 30 28
6320 28 49 -18 38 26 -12 -22 -20 -29 14 -28 -49 43 27 -28 -25 34 -33 39 -2 -14 7 30 15 -4 20 -14 -36 14 -10 -10 -27 12
6352 12 -7 -12 -12 -7 24 -23 -21 11 58 -21 54 -14 39 -16 -38 -29 6 23 0 17 0 17 -16 6 -41 14 45 10 -1 45 -31 -15 17
6385 17 11 2 17 -7 -30 2 -25 -28 -2 -2 4 23 -28 41 6 23 -2 -29 1 42 3 -106 38 11 25 -78 -22 -29 -50 -5 -33 38
6417 38 23 32 -13 -37 -50 -24 -28 60 19 46 21 28 32 -36 -33 -18 17 -32 -22 61 -28 24 127 33 66 13 23 -10 6 -31 -6 2 26
6450 26 -73 27 -13 10 53 32 -29 12 28 58 -3 10 22 38 -3 -26 -37 -48 22 -23 -13 9 28 46 1 10 35 18 -31 -8
6480 -8 8 -21 60 6 -36 -27 41 -36 -14 38 31 -2 17 17 14 22 -28 -3 60 3 11 32 20 -25 -18 -10 -49 -52 31 -15 13 -27 5 2 -17 24
6516 24 -13 -23 -4 -14 15 8 20 31 -18 -11 0 -6 31 22 29 -5 21 -27 -41 9 20 -35 7 -63 -8 -1 -24 25 25 23 -42 -16 -38 46
6550 46 56 1 -33 -32 -15 12 -8 -59 7 -23 -31 -12 -16 -2 0 18 35 24 49 -17 8 -60 -1 47 6 -23 27 7 0 49 -11 -3 -13
6583 -13 -6 -33 -19 -27 32 5 7 24 60 -4 -21 -41 23 2 -41 -6 -20 -16 -9 0 -7 -26 54 34 3 -17 -35 26 35 -11 14 51 37 51
6617 51 -15 39 -46 23 80 -35 47 5 -65 -20 18 -6 -42 -32 -21 -7 -18 -44 -16 -19 -27 5 -34 -5 -10 -26 16 -50 -37 -5 -4 18
6649 18 -4 -7 50 -59 -48 10 -22 23 9 19 5 -15 -42 -11 2 27 5 0 29 -20 -2 -33 7 11 -59 -6 -52 -90 -8 -2 -13 -40
6681 -40 -25 -9 26 28 3 -64 52 39 7 -28 18 17 18 -4 24 -54 30 -18 48 8 -5 0 10 33 20 50 25 1 -18 -10 -12 21 29
6714 29 -34 18 56 -21 -35 58 -29 -4 -49 39 -22 16 6 -13 -13 31 -43 -52 3 -20 -18 -10 -35 13 -10 21 37 15 27 5 -34 3
6746 3 31 6 1 0 3 -29 8 4 -17 2 -10 -35 0 28 3 -48 12 -57 -6 -37 30 -7 17 -31 -37 -8 -32 0 -17 -25 -2 -23 43 4
6780 4 10 15 28 17 -8 24 46 42 -13 16 45 51 -29 -1 -9 -3 -1 9 -51 -8 -76 6 -2 -42 -12 33 33 25 14 0 -6 -32 -21 -25 4 -44 -18
6817 -18 -32 25 4 -37 4 50 22 10 63 4 34 15 -31 -1 -21 48 -1 9 55 58 6 14 30 7 5 -16 -12 -40 -43 -18 -36 -9 -52
6850 -52 26 -28 -20 33 24 15 21 -57 14 27 -10 -16 -9 15 -10 0 0 28 -3 -72 -16 -9 -3 50 12 15 31 25 -1 67 -3 -10 -21 -35 -18 10
6886 10 -23 12 -49 -39 -43 20 -4 -1 -15 -15 -34 18 11 -20 22 -5 11 -2 -13 -22 71 11 -31 -37 24 7 -33 20 77 24 -26 -5 -11 -13
6920 -13 25 -16 -16 -59 -8 -32 28 -41 13 -18 -3 -19 14 -14 -6 22 12 17 -14 -34 -40 56 -29 4 -56 -61 5 21 6 -28 -7 24 -3
6953 -3 49 21 52 34 -25 9 -5 2 -4 -44 -12 -31 -26 -38 3 1 -27 -34 -22 -22 7 2 -48 -8 -22 6 -35 4 7 26 13 59 29 57 24
6988 24 41 -4 29 18 -12 52 4 73 -29 25 33 30 -44 -56 -29 16 34 -34 -13 7 -1 26 28 -3 -31 -22 8 9 13 -28 40 -33 8
7021 8 -2 -5 -47 58 3 -83 54 23 -10 37 10 -1 28 32 29 -15 -3 4 -51 11 38 41 20 -11 -26 20 2 -8 107 -43 -9
7052 -9 43 -4 37 46 -21 -26 -15 -36 2 -5 -21 -48 26 -17 -26 -25 3 -5 15 13 1 -6 42 24 29 26 19 34 -15 3 8 37 21 39 -8 -45 33
7089 33 5 12 -18 -39 -24 -76 24 -6 -15 -15 -3 29 40 -5 -50 -37 -19 -22 15 -40 9 -28 1 3 1 35 3 28 -27 12 55 -6 -1
7122 -1 -29 -32 21 43 -34 26 37 32 -4 6 9 56 -57 17 -1 32 17 -44 -41 2 6 -61 -36 -18 -15 30 -24 11 -28 -64 -1 -16 12
7155 12 -35 55 16 -20 15 -43 -8 64 -29 21 -7 -28 -4 -4 -8 -7 49 18 0 -22 19 43 36 11 -18 14 38 -23 -43 -3 -14 -21 0
7188 0 22 -20 -57 16 3 49 -44 -18 -29 -52 32 -38 -10 -17 6 16 0 4 -18 24 44 -37 35 6 1 -2 27 43 25 -16 59 -8 25
7221 25 30 14 -15 47 3 -7 18 -52 -15 15 15 -63 -11 35 -44 12 18 58 3 22 67 23 -5 -13 -37 -22 31 21 -3 19 4 -28
7253 -28 4 5 -13 20 16 27 35 -7 24 -9 29 18 -20 12 -36 -32 27 -6 23 -35 -15 15 -20 -18 14 -28 -17 0 -26 -20 -8 40 -46
7286 -46 -37 22 66 50 -9 8 -27 26 -9 16 -19 55 3 0 -30 70 49 3 14 27 -3 13 -8 14 7 13 -34 -34 36 -43 -20 0
7318 0 1 -15 -10 9 -36 27 36 2 8 -17 11 -7 31 -6 -8 15 10 45 30 1 -29 -17 -18 -10 -12 4 12 11 -40 57 -12 9 2 -12 6 26 31
7355 31 -38 -40 3 34 20 7 -12 5 -52 5 -5 39 50 -4 20 48 23 -47 -2 -39 17 -17 35 -30 45 22 31 6 -8 50 51 -6
7387 -6 27 2 -2 -11 -16 -20 5 -39 -26 -15 56 -45 -3 -2 -13 -2 -48 15 2 -33 24 -56 -36 -67 6 -14 57 36 27 -10 13 46 -29
7420 -29 -3 2 25 10 66 7 66 1 61 57 16 40 1 0 43 11 -20 77 12 37 34 -2 -12 0 4 -17 -21 -7 28 -20 -13 26 -42 -41
7454 -41 8 63 18 49 39 48 -11 -3 40 -12 21 -5 -1 16 -6 34 49 -1 7 -60 36 -5 41 -25 -24 -30 -19 -7 -10 46 17 -23 -45 -26
7488 -26 -32 22 -53 22 -35 -5 -19 -31 -34 -41 -32 -4 -3 26 -1 25 87 42 24 8 -51 -12 29 -9 1 59 23 -10 36 16 15 64 49
7521 49 18 46 26 -13 -34 -24 -45 32 -6 -39 -20 -56 -3 -53 8 36 14 15 -12 -9 -22 5 36 -10 10 -1 -74 16 18 6 -11 16
7553 16 -10 39 15 60 46 0 10 0 -39 15 35 14 3 -8 80 -22 -4 31 -12 27 -29 -32 -86 -17 -14 -23 -40 -53 -4 3 -1 35
7585 35 36 9 -18 -9 74 3 16 -45 40 -20 28 30 -35 -24 36 23 -4 40 30 -66 36 22 -25 51 -9 25 -44 -37 -27 54 -40 -36
7617 -36 -28 -53 -25 23 37 0 -5 -34 -67 11 17 9 17 31 -40 8 -17 15 27 17 -36 -53 -16 -4 10 18 -14 41 -31 -21 29 -19 8
7650 8 27 23 -33 28 2 22 50 11 10 12 -4 -18 -37 52 -15 -139 -26 -28 -50 -18 -19 23 -9 36 -41 14 3 14 -40 22 26 32 -14
7683 -14 46 40 19 71 20 -30 14 12 22 -13 -41 7 35 56 8 10 -23 23 -14 45 11 44 19 22 -11 24 9 -13 -23 -26 -3 11 -9
7716 -9 -11 0 -24 22 27 10 -5 4 25 25 7 11 -14 17 -21 25 29 11 -34 1 24 -9 36 -51 8 19 7 -9 1 -33 6 -13 -46 -11
7750 -11 31 -1 10 1 59 16 -22 31 -6 12 2 33 28 -8 -19 21 -15 -9 35 -31 -15 36 -8 -35 -18 10 52 23 35 0 -21 5
7782 5 -23 27 -22 -26 -64 -56 20 16 -17 13 -23 -27 -6 -4 14 -86 2 40 27 29 -5 4 -26 -40 -7 -18 0 -10 -8 -1 52 29 11 24 -33
7817 -33 32 2 2 -49 -5 27 42 -9 20 -1 -32 -6 -63 22 50 -22 -30 -25 -24 -3 -8 -13 8 -27 14 9 -25 31 -7 -28 38 23 17 -4
7851 -4 -18 -2 48 20 -10 46 -31 32 -21 59 -8 10 15 1 4 -20 -3 -8 3 -26 19 9 -11 2 7 -4 -21 9 -24 -6 -13 43 -24
7884 -24 -60 -52 36 34 8 22 63 32 5 16 4 -13 5 27 4 26 60 16 10 36 5 -6 -14 -37 2 -1 9 40 -49 1 -54 -8 -6
7917 -6 19 -22 37 -5 -19 -3 -42 -17 4 69 31 46 -17 -2 42 45 30 5 49 -8 -6 -28 27 -21 -3 50 23 52 50 14 -22 5
7949 5 9 15 -25 0 -51 -57 8 3 -32 -25 -9 -25 3 29 43 -11 -25 38 40 -9 1 -6 46 -6 26 22 -44 81 25 25 28 -31 -16 12 16 61
7985 61 18 -21 42 -51 10 -39 -15 -11 14 -15 -49 -40 -46 -12 -10 45 -25 4 2 -50 2 19 16 21 -9 8 -21 -11 -3 -7 18 -54 2 72 15
8020 15 25 13 -63 53 13 76 -16 29 -24 -54 4 -6 44 16 20 31 15 25 5 18 -53 6 11 -28 2 25 6 -24 -3 -7 -32
8051 -32 -19 20 -24 49 -52 58 23 -2 13 -12 24 -12 61 52 -52 34 -73 16 -20 10 45 2 65 18 -46 -52 8 19 20 3
8081 3 -20 -20 15 0 -7 16 -44 -37 -14 21 -70 -18 -3 -2 -30 20 -14 31 -31 -8 19 -21 -2 8 -42 -24 2 40 10 -15 87 27
8113 27 40 -9 3 -6 5 18 -28 10 -66 39 -4 -5 4 3 39 -10 4 62 28 -12 8 14 -4 -24 -14 -47 21 -11 48 19 34 46
8145 46 20 -74 47 -28 17 -8 72 17 -19 0 23 34 -22 -13 -24 -18 -42 22 -41 25 -23 -20 -55 33 -35 -56 49 -81 20 -63
8175 -63 -7 28 -53 40 -21 29 -37 -66 -28 -32 16 63 51 11 -3 41
8191D1
##END NTUPLES=NMR FID
##END=
