##TITLE=1H_LR-758-R5-DX1
 CDCl3
 8 sc, 
 31.8.2023
##JCAMPDX= 6.0         $$ Bruker NMR JCAMP-DX V2.0
##DATA TYPE= NMR FID
##DATA CLASS= NTUPLES
##ORIGIN= UXNMR, Bruker Analytische Messtechnik GmbH
##OWNER= root
$$ XWIN-NMR		Version 3.5
$$ Thu Aug 31 15:26:47 2023 Russian Standard Time (UT+4h)  she@DPX200
##.OBSERVE FREQUENCY= 200.13135
##.OBSERVE NUCLEUS= ^1H
##.DELAY= (6, 6)
##.ACQUISITION MODE= SIMULTANEOUS
##.ACQUISITION SCHEME= undefined
##.AVERAGES= 8
##.DIGITISER RES= 18
##SPECTROMETER/DATA SYSTEM= spect
##.PULSE SEQUENCE= zg30
##.SOLVENT NAME= CDCl3
##.SHIFT REFERENCE= (INTERNAL, CDCl3, 0, 15.7039)
##AUDIT TRAIL= $$ (NUMBER, WHEN, WHO, WHERE, WHAT)
$$ ##TITLE= Audit trail, XWIN-NMR		Version 3.5
$$ ##JCAMPDX= 5.01
$$ ##ORIGIN= Bruker BioSpin GmbH
$$ ##OWNER= she
$$ F:/spectra/data/she/nmr/H-F/1/audita.txt
$$ ##AUDIT TRAIL=  $$ (NUMBER, WHEN, WHO, WHERE, WHAT)
(   1,<2023-08-31 15:25:44.28 +0400>,<she>,<DPX200>,
      <created by zg, POWCHK disabled, PULCHK disabled
       configuration hash MD5:
       00 E9 B6 7A A2 85 ED C7 34 08 36 98 17 FE 4E 26
       data hash MD5: 16K
       E6 69 FE 4F 0F 3A CE FD 72 3A 9F EF BB 74 67 42>)
$$ ##END=
$$ 
$$ hash MD5
$$ DE F1 15 4E 62 2A 02 C5 BE 68 8D 34 93 DB 52 1F
##$RELAX= 
##$RELAX= 
##$RELAX= 
##$RELAX= 
##$RELAX= 
##$RELAX= 
$$ Bruker specific parameters
$$ --------------------------
##$DU= <F:/spectra>
##$EXPNO= 1
##$NAME= <H-F>
##$PROCNO= 1
##$TYPE= <nmr>
##$USER= <she>
##$AMP= (0..31)
100 100 100 100 100 100 100 100 100 100 100 100 100 100 100 100 100 100 
100 100 100 100 100 100 100 100 100 100 100 100 100 100 
##$AQSEQ= 0
##$AQ_mod= 1
##$AUNM= <au_zg>
##$AUTOPOS= <>
##$BF1= 200.13
##$BF2= 200.13
##$BF3= 200.13
##$BF4= 200.13
##$BF5= 200.13
##$BF6= 200.13
##$BF7= 200.13
##$BF8= 200.13
##$BYTORDA= 1
##$CFDGTYP= 0
##$CFRGTYP= 5
##$CHEMSTR= <none>
##$CNST= (0..31)
1 1 145 1 1 1 1 1 1 1 1 1 1 1 1 1 1 1 1 1 1 1 1 1 1 1 1 1 1 1 1 1 
##$CPDPRG= <>
##$CPDPRG1= <>
##$CPDPRG2= <>
##$CPDPRG3= <>
##$CPDPRG4= <mlev>
##$CPDPRG5= <mlev>
##$CPDPRG6= <mlev>
##$CPDPRG7= <mlev>
##$CPDPRG8= <mlev>
##$CPDPRGB= <>
##$CPDPRGT= <>
##$D= (0..31)
0 1.2 0 0 0 0 0 0 0 0.06 0 0.03 0 0 0 0 0.0002 0 0 0 0 0 0 0 0 0 0 0 0 
0 0 0 
##$DATE= 1693481143
##$DBL= (0..7)
120 120 120 120 120 120 120 120 
##$DBP= (0..7)
150 150 150 150 150 150 150 150 
##$DBP07= 0
##$DBPNAM0= <>
##$DBPNAM1= <>
##$DBPNAM2= <>
##$DBPNAM3= <>
##$DBPNAM4= <>
##$DBPNAM5= <>
##$DBPNAM6= <>
##$DBPNAM7= <>
##$DBPOAL= (0..7)
0.5 0.5 0.5 0.5 0.5 0.5 0.5 0.5 
##$DBPOFFS= (0..7)
0 0 0 0 0 0 0 0 
##$DE= 6
##$DECBNUC= <off>
##$DECIM= 32
##$DECNUC= <off>
##$DECSTAT= 4
##$DIGMOD= 1
##$DIGTYP= 9
##$DL= (0..7)
0 120 120 120 120 120 120 120 
##$DP= (0..7)
150 150 150 150 150 150 150 150 
##$DP07= 0
##$DPNAME0= <>
##$DPNAME1= <>
##$DPNAME2= <>
##$DPNAME3= <>
##$DPNAME4= <>
##$DPNAME5= <>
##$DPNAME6= <>
##$DPNAME7= <>
##$DPOAL= (0..7)
0.5 0.5 0.5 0.5 0.5 0.5 0.5 0.5 
##$DPOFFS= (0..7)
0 0 0 0 0 0 0 0 
##$DQDMODE= 0
##$DR= 18
##$DS= 0
##$DSLIST= <SSSSSSSSSSSSSSS>
$$ [...]
##$SUBNAM2= <"">
##$SUBNAM3= <"">
##$SUBNAM4= <"">
##$SUBNAM5= <"">
##$SUBNAM6= <"">
##$SUBNAM7= <"">
##$SUBNAM8= <"">
##$SUBNAM9= <"">
##$SW= 18.05172834244
##$SWIBOX= (0..15)
0 0 2 0 0 0 0 0 0 0 0 0 0 0 0 0 
##$SW_h= 3612.71676300578
##$TD= 16384
##$TD0= 1
##$TE= 0
##$TE2= 300
##$TE3= 300
##$TEG= 300
##$TL= (0..7)
0 120 120 120 120 120 120 120 
##$TP= (0..7)
150 150 150 150 150 150 150 150 
##$TP07= 0
##$TPNAME0= <>
##$TPNAME1= <>
##$TPNAME2= <>
##$TPNAME3= <>
##$TPNAME4= <>
##$TPNAME5= <>
##$TPNAME6= <>
##$TPNAME7= <>
##$TPOAL= (0..7)
0.5 0.5 0.5 0.5 0.5 0.5 0.5 0.5 
##$TPOFFS= (0..7)
0 0 0 0 0 0 0 0 
##$TUNHIN= 0
##$TUNHOUT= 0
##$TUNXOUT= 0
##$USERA1= <user>
##$USERA2= <user>
##$USERA3= <user>
##$USERA4= <user>
##$USERA5= <user>
##$V9= 5
##$VALIST= <valist>
##$VCLIST= <CCCCCCCCCCCCCCC>
##$VD= 0
##$VDLIST= <DDDDDDDDDDDDDDD>
##$VPLIST= <PPPPPPPPPPPPPPP>
##$VTLIST= <TTTTTTTTTTTTTTT>
##$WBST= 1024
##$WBSW= 4
##$XGAIN= (0..3)
0 0 0 0 
##$XL= 0
##$YL= 0
##$YMAX_a= 281902
##$YMIN_a= -314365
##$ZGOPTNS= <>
##$ZL1= 120
##$ZL2= 120
##$ZL3= 120
##$ZL4= 120
##$ABSF1= 10
##$ABSF2= 0
##$ABSG= 5
##$ABSL= 3
##$ALPHA= 0
##$AQORDER= 0
##$ASSFAC= 0
##$ASSFACI= 0
##$ASSFACX= 0
##$ASSWID= 0
##$AUNMP= <proc_1d>
##$AZFE= 0.1
##$AZFW= 0.1
##$BCFW= 1
##$BC_mod= 2
##$BYTORDP= 1
##$COROFFS= 0
##$CY= 11.3945322036743
##$DATMOD= 1
##$DC= 2
##$DFILT= <>
##$DTYPP= 0
##$F1P= 15.7292609196834
##$F2P= 12.9074282941183
##$FCOR= 0.5
##$FTSIZE= 0
##$FT_mod= 4
##$GAMMA= 1
##$GB= 0.15
##$INTBC= 1
##$INTSCL= 1
##$ISEN= 128
##$LB= 0.24
##$LEV0= 0
##$LPBIN= 0
##$MAXI= 10000
##$MC2= 0
##$MEAN= 0
##$ME_mod= 0
##$MI= 1.114404
##$NCOEF= 0
##$NC_proc= 0
##$NLEV= 6
##$NOISF1= 3.799351
##$NOISF2= 2.8
##$NSP= 1
##$NTH_PI= 0
##$NZP= 0
##$OFFSET= 15.70392
##$PC= 1
##$PHC0= -21206.65
##$PHC1= 12.05272
##$PH_mod= 1
##$PKNL= yes
##$PPARMOD= 0
##$PSCAL= 0
##$PSIGN= 0
##$REVERSE= no
##$SF= 200.130013532006
##$SI= 16384
##$SIGF1= 3
##$SIGF2= 2
##$SINO= 400
##$SIOLD= 16384
##$SREGLST= <1H.CDCl3>
##$SSB= 0
##$STSI= 0
##$STSR= 0
##$SW_p= 3612.71676300578
##$SYMM= 0
##$S_DEV= 0
##$TDeff= 0
##$TDoff= 0
##$TI= <>
##$TILT= no
##$TM1= 0
##$TM2= 0
##$TOPLEV= 0
##$USERP1= <user>
##$USERP2= <user>
##$USERP3= <user>
##$USERP4= <user>
##$USERP5= <user>
##$WDW= 1
##$XDIM= 8192
##$YMAX_p= 0
##$YMIN_p= 0
$$ End of Bruker specific parameters
$$ ---------------------------------
##NTUPLES= NMR FID
##VAR_NAME=  TIME,          FID/REAL,        FID/IMAG
##SYMBOL=    X,             R,               I
##VAR_TYPE=  INDEPENDENT,   DEPENDENT,       DEPENDENT
##VAR_FORM=  AFFN,          ASDF,            ASDF
##VAR_DIM=   8192,          8192,            8192
##UNITS=     SECONDS,       ARBITRARY UNITS, ARBITRARY UNITS
##FACTOR=    0.0002768,     1,               1
##FIRST=     0,             0,               0
##LAST=      2.2672688,     0,               0
##MIN=       0,             -314365,         0
##MAX=       2.2672688,     281902,          0
$$ Real data points
##PAGE= N=1
##DATA TABLE= (X++(R..R)), XYDATA
0 0 0 0 0 0 0 0 0 0 0 0 0 8 -8 8 -8 16 -16 24 -24 32 -32 40 -48 56 -72 80 -96 109 -125 144 -160 184 -208
33 -208 237 -267 301 -336 376 -421 469 -520 580 -640 709 -783 864 -954 1050 -1158 1275 -1403
51 -1403 1547 -1707 1883 -2081 2309 -2566 2863 -3214 3627 -4128 4748 -5542 6589 -8043 10199
66 10199 -13713 20374 -37190 161323 189531 -314365 69522 188228 -229334 -12516 250666
77 250666 -134299 -104963 136795 -58585 -54616 139003 -44173 -85049 62926 -19803 -18825
88 -18825 82571 -39893 -46203 39984 -36244 16673 84604 -82652 -39756 92516 -57957
99 -57957 -31793 129347 -55547 -104867 100942 4953 -69744 91107 -12415 -101731 78035
110 78035 17988 -76945 90380 7616 -135675 74162 79076 -111358 32460 78841 -113806
121 -113806 -7983 106479 -47504 -26810 51807 -52822 -11011 69663 -32715 -15601 43851
132 43851 -53671 -13987 78147 -26708 -36467 43714 -32004 -21508 67560 -21949 -39943 50241
144 50241 -29620 -41077 83336 -2468 -81562 47945 25559 -65993 38783 45203 -65393
155 -65393 -4112 40082 -26693 10835 27508 -43283 -315 34913 -29565 5315 40482 -41285
167 -41285 -23375 46991 -6046 -20712 25506 -12463 -21405 24833 -915 -9226 20339 -20453
179 -20453 -21609 37326 1852 -29900 21385 4093 -30871 17975 19219 -19764 2845 2187 -15720
192 -15720 19865 9365 -26622 12885 13890 -31738 10329 33443 -27219 -15413 26751 -7962
204 -7962 -11360 19462 -5858 -12547 10822 -6394 -2263 19408 -13496 -17486 22098 832 -18843
217 -18843 15748 6309 -20502 4758 10971 -5782 3691 -2078 -9384 12470 2562 -14688 12762
230 12762 7807 -22536 4777 20255 -12865 -7416 11841 -5044 -3818 7388 -4322 319 4533
243 4533 -11999 2143 15965 -12035 -10374 16330 -1890 -13452 10646 5698 -10638 686 3803
256 3803 -722 3915 -3773 -4511 9642 -993 -10373 9635 6545 -13670 9 11561 -4300 -5626
270 -5626 4102 771 -1332 -1178 -1634 4726 635 -9270 2658 9334 -7253 -5877 8894 508 -7608
285 -7608 2675 4782 -1909 -2543 -567 3452 3009 -5510 -1553 8228 -1882 -8182 6311 5995 -8236
300 -8236 -2407 7241 -298 -4836 527 2547 245 -3110 -1836 4678 1123 -7129 549 7337 -3393
315 -3393 -5910 5232 3419 -5320 -1384 4652 1304 -3458 -1651 4002 2377 -4881 -1158 6431 -632
330 -632 -6348 2853 5186 -3976 -3434 3523 2064 -2950 -2581 2476 2949 -3967 -3473 5396 1941 -6899
346 -6899 171 6412 -2665 -4695 3691 2944 -2896 -1802 2190 2713 -1418 -3355 2834 3989 -4279 -2705
362 -2705 5922 794 -5984 1027 4910 -1958 -3860 1619 2898 -1857 -3573 1904 3614 -3517 -3640
377 -3640 4401 2160 -4820 -654 4256 -366 -3369 641 3455 -46 -3850 401 4916 -1065 -4588
392 -4588 3092 3816 -4387 -1856 4912 624 -4267 -486 3077 665 -2887 -1094 3150 -180 -4538
407 -4538 1547 4563 -3284 -3967 3354 2278 -2569 -1031 1684 1102 -1938 -1712 3870 2585 -5379 -1293
423 -1293 6211 -773 -4567 3425 2354 -4272 -735 3171 866 -1328 -2591 170 3462 -1823 -3170
438 -3170 4097 621 -6359 1423 5655 -2418 -3359 1589 930 -214 -407 461 2448 -1916 -4319 4597
454 4597 4680 -5494 -1646 4695 -1825 -2213 3795 513 -2509 -1079 -730 3107 2430 -5328 -1238 4943
470 4943 -3182 -2850 6380 -457 -6891 1686 3651 -809 -20 -1306 -745 2319 -1630 -432 5639 -2295
486 -2295 -6739 4941 4486 -4524 255 2536 -3020 -270 2065 197 1521 -2472 -4510 4929 3109
501 3109 -6197 1050 4078 -5813 -1281 6587 -1054 -3525 717 -866 1331 2746 -3019 -2 3138
516 3138 -4335 -625 7520 -1503 -6045 2892 2185 -1913 1503 564 -1360 -151 -2015 1511 5031 -4022
532 -4022 -5052 5029 916 -4584 3480 1998 -5545 -192 3156 -109 985 -1484 -3300 3522 1764
547 1764 -3946 2999 2845 -6527 -18 6922 -1541 -3250 2095 -737 -864 2330 -604 -79 867 -3978
563 -3978 127 5975 -2286 -4980 3453 858 -4009 2466 2803 -3395 -1579 1068 911 1902 -1251 -2711
579 -2711 2509 829 -3117 2853 3093 -4865 -1484 4640 30 -1836 960 -574 -520 802 -685 1216
595 1216 1194 -4099 -807 4903 -1181 -3696 2598 517 -3314 1405 2181 -1180 -661 -1073 221 3262
611 3262 -1240 -2854 3530 518 -4440 3078 3912 -4548 -1249 3549 -958 -586 1463 -1467 95 756
627 756 -2449 1841 2812 -4781 -1228 4697 -1945 -2403 3390 -1080 -2650 2221 -127 -244 2326 -3218
643 -3218 -1462 5590 -1647 -3948 5363 210 -5925 3771 3760 -4332 208 1885 -2259 1619 944 -2804
659 -2804 2254 342 -4743 3296 3623 -5850 -314 4349 -3443 -935 3902 -2417 -1324 2355 -2285
674 -2285 890 3770 -4307 -1450 5684 -2395 -3045 5459 -545 -4716 3189 1739 -2270 1497 -679
689 -679 -1668 3034 -1103 -2589 4168 -817 -5302 3895 2629 -5057 1034 2737 -3402 443 2206 -2343
705 -2343 1108 1142 -3629 2302 3287 -4722 166 4793 -3563 -1837 4863 -1345 -2651 2773 -676 -1274
721 -1274 2549 -1848 -1371 3590 -2020 -3059 4504 6 -4867 2683 2145 -3857 692 2210 -2027 199
737 199 765 -1555 1931 661 -3247 2016 2512 -3838 381 3973 -2671 -1636 3303 -783 -1447 1706
753 1706 -997 -411 1871 -2120 -681 3346 -2180 -2553 3904 -303 -3761 2422 1355 -2810 989 783
769 783 -1634 1605 101 -2092 2657 645 -3771 2408 2989 -4009 -49 3651 -2197 -1193 2863 -989
785 -989 -1139 1378 -1256 195 2055 -2614 -978 3259 -1749 -2283 3259 -297 -3192 1703 1105 -1507
801 -1507 799 -217 -961 1814 -529 -1564 2797 34 -3231 2246 2120 -2892 369 2113 -1656 -185
817 -185 1286 -832 455 370 -1932 1120 1552 -2674 -97 2514 -1917 -1402 2321 -240 -1509 759
833 759 -100 -161 741 -975 151 1786 -1556 -997 2753 -182 -2270 1639 1113 -1819 310 1152 -631
850 -631 -179 -84 -368 883 -104 -1459 884 800 -1784 -79 1736 -810 -1337 813 634 -526 -302 311
868 311 418 -302 -660 827 1002 -1035 -589 1275 248 -930 380 833 -496 -586 459 639 -226 -793
886 -793 -42 825 -364 -1002 578 753 -1338 -548 1443 9 -1423 305 900 -500 -373 514 393 -218
904 -218 -365 247 1012 -183 -920 769 868 -1004 -264 1185 -248 -1033 364 587 -350 -507 -84 349 17
923 17 -840 62 896 -736 -957 1108 588 -1151 -173 872 -103 -415 274 513 5 -555 184 1146 -175
942 -175 -1069 617 906 -727 -188 859 -235 -793 101 453 98 -489 -719 448 466 -914 -167 1031
960 1031 -794 -1149 1187 810 -1089 -217 689 -139 -32 335 165 104 -430 -349 1161 604 -1312 -82 977
979 977 -632 -384 1118 -169 -1143 27 406 270 49 -798 -271 660 -430 -182 1251 -493 -1624 740
997 740 1131 -409 12 19 -364 341 224 274 857 -824 -1443 1547 1160 -1321 73 716 -1444 -136 1640
1016 1640 -235 -909 -229 -599 612 1012 -1059 -419 564 -1072 15 2054 -385 -1656 445 516 82
1033 82 900 -208 -724 216 -241 481 1620 -769 -1792 946 701 -503 690 49 -1411 -121 548
1050 548 301 595 -1011 -1539 1073 711 -1049 719 381 -2052 93 1956 -45 -635 -39 -515 273
1067 273 1005 -58 118 -11 -1212 454 1899 -335 -1075 143 -252 -110 982 215 -745 -627 -592 674
1085 674 1303 -709 -1247 342 -56 -224 1119 362 -1419 -676 762 939 452 -590 -712 226 189 323
1103 323 1156 -287 -1684 83 1410 309 -302 -195 -746 -388 730 695 10 -964 -1072 340 1183 132
1121 132 -630 -395 -503 -46 1001 754 -569 -1014 -371 937 1132 -182 -672 14 -239 7 1477 689
1139 689 -1753 -921 983 525 -8 295 -647 -1113 181 951 542 -313 -1254 -608 959 622 -182 117 -580
1158 -580 -1133 770 1599 -56 -828 -410 -151 757 971 -41 -394 -475 -549 861 1385 -515 -1256 -101 160
1177 160 291 744 -147 -1016 -679 40 1004 836 -988 -1121 422 259 85 935 -72 -1488 -238 1178
1195 1178 718 80 -536 -685 255 483 398 682 -607 -1414 510 1269 -42 -298 -231 -933 -96 1041 197
1214 197 -277 -596 -1009 325 1314 -218 -778 41 -480 -189 1287 533 -914 -495 -4 516 1011 -125
1232 -125 -715 121 -213 -122 1407 257 -1729 -239 881 -161 262 344 -980 -622 392 234 561 -141
1250 -141 -1291 -113 986 -178 24 586 -975 -567 1184 391 -157 188 -759 -204 1213 50 -463
1267 -463 658 -598 -913 1385 655 -1153 -62 144 -652 581 494 -676 -114 -277 -535 1014 460 -1312
1285 -1312 179 621 -857 458 955 -892 -451 672 -145 359 625 -917 -143 852 -508 83 981
1302 981 -912 -824 982 -32 -467 440 -537 -531 620 -241 -240 671 -723 -805 1112 121 -876 674 150 -839
1322 -839 629 540 -469 302 -51 -517 873 302 -830 534 343 -933 460 908 -807 -262 404 -463
1340 -463 72 352 -600 -61 211 -656 183 746 -824 -414 743 -259 -312 627 -153 -356 408 -30 101
1359 101 541 -495 -262 800 -167 -426 675 -30 -804 415 385 -432 22 74 -316 224 73 -389 212
1378 212 32 -618 238 508 -472 -196 423 -143 -116 254 59 -15 30 -179 264 296 -391 -63 450 -196 -153 453
1400 453 -39 -280 85 97 -5 5 -311 -89 242 -172 -273 363 -51 -456 250 326 -277 -103 241 -62 17
1421 17 45 97 202 -52 -256 374 230 -369 70 380 -225 -191 242 -40 -152 -121 -62 24 8 -249 11 134 -346
1444 -346 -153 346 -48 -285 101 94 19 111 24 60 161 -151 65 452 -180 -322 279 210 -274 115 229 -281
1466 -281 -166 100 6 71 -211 -255 169 95 -285 73 120 -463 -114 418 17 -257 -26 6 91 112 103 117 -51 -213
1490 -213 182 316 -114 -124 70 -87 52 169 -109 -95 -119 -255 147 367 -357 -435 259 -51 -317 328 109
1511 109 -532 -137 339 91 23 -3 -220 69 213 81 158 101 -319 -90 484 202 -280 -38 -81 -191 146 253
1533 253 -89 -290 -226 28 271 17 -300 -87 -49 -192 209 330 -256 -444 122 251 168 190 -30 -225 -39
1554 -39 154 363 153 -339 -263 142 205 67 26 -259 -289 15 95 161 27 -505 -387 394 107 -184 171 -160
1576 -160 -489 170 521 -47 -148 -100 -114 306 353 -16 45 -170 -351 340 628 -248 -350 149 -111 23 412
1597 412 -64 -458 -190 -121 153 155 -306 -381 6 -75 98 338 -233 -348 24 14 266 404 -352 -334 354 74
1619 74 -128 618 0 -727 167 534 -202 28 123 -443 -96 307 104 -31 -150 -425 92 306 -213 -89 70
1640 70 -392 -110 504 80 -228 -84 -121 124 380 81 -165 17 -116 20 410 146 -318 -152 137 57 128
1661 128 -14 -163 -156 -132 84 324 -81 -443 -15 197 -122 70 148 -292 -250 244 231 11 -40 -157 -26 208
1683 208 74 47 130 -132 -202 330 100 -191 -6 -37 -227 207 46 -269 -2 -61 -311 271 263 -521 -125 385
1705 385 -278 -57 450 -153 -307 281 86 -33 194 -67 -54 266 -21 -17 363 -238 -238 379 -63 -298 245 -142
1727 -142 -348 286 26 -381 216 -24 -475 317 251 -562 41 290 -383 141 325 -271 8 300 -200 219
1747 219 274 -418 127 531 -404 -3 535 -421 -275 521 -122 -275 289 -276 -197 409 -145 -251 312 -322 -395
1768 -395 505 -109 -475 393 -13 -293 480 114 -407 341 23 -391 531 190 -539 364 315 -458 240 303 -480
1789 -480 61 267 -363 135 206 -537 88 356 -585 96 521 -555 -134 534 -313 -139 499 -329 -180 521
1809 521 -260 -145 544 -298 -249 668 -169 -359 591 -50 -464 410 25 -412 348 -62 -456 364 -2 -457
1829 -457 397 81 -636 345 195 -517 199 267 -487 254 338 -467 246 388 -514 141 520 -489 -10 580
1849 580 -378 -107 491 -335 -237 338 -266 -203 431 -296 -267 520 -370 -382 476 -208 -494 476 4 -446 384
1870 384 113 -329 364 130 -357 404 181 -428 295 312 -459 177 282 -338 52 221 -312 -27 245 -272
1890 -272 0 223 -425 -30 312 -277 -133 293 -220 -167 335 -116 -95 236 -180 -42 397 -111 -171 348 -61
1911 -61 -256 408 54 -308 202 150 -246 185 52 -347 136 105 -307 90 150 -376 -12 288 -287 -87 333
1932 333 -168 -118 278 -140 -145 256 -120 -140 267 -42 -204 291 58 -267 122 178 -131 -15 166 -260 -49 152
1954 152 -205 -2 133 -276 -97 253 -134 -93 250 -82 -157 215 3 -158 121 7 -80 228 19 -113 208
1975 208 -25 -243 228 59 -268 76 58 -320 89 158 -251 16 22 -264 85 233 -328 -153 268 -281 -71
1996 -71 324 -174 -172 320 -59 -44 311 -120 -128 212 -64 -102 424 -112 -291 333 27 -307 273 -45 -379 233
2018 233 90 -195 198 -14 -510 166 204 -432 99 220 -454 30 384 -229 -38 207 -190 -20 315 -146
2038 -146 -10 222 -211 4 428 -67 -112 196 -98 -157 264 -56 -225 99 -152 -139 264 -143 -299 122 -22
2059 -22 -184 259 53 -249 97 124 -37 157 34 -260 82 155 -70 169 86 -215 77 286 -71 -15 100 -125
2081 -125 -2 111 -47 -84 -13 -104 -48 123 -49 -77 27 -43 -44 79 32 -78 -17 85 8 69 70 -26 -28 15 88 93 68
2108 68 -32 -131 20 42 -56 -93 -35 -93 -142 36 5 -93 -69 -66 -24 57 -68 -39 56 -47 12 155 -46 -128 99 25 -12
2135 -12 150 15 -89 174 70 -16 200 -30 -211 85 98 -158 -22 40 -203 -11 63 -70 -8 -102 -186 101 133
2158 133 -212 34 30 -208 101 205 -130 -69 181 -47 22 165 -121 -69 165 -100 36 184 -124 -168 157 -19
2180 -19 -27 151 -174 -146 71 -36 -75 149 -157 -210 194 83 -123 87 -9 -149 100 117 21 2 -57 -139 113 77
2204 77 -91 92 -81 -241 221 171 -181 31 28 -255 105 220 -160 -133 -21 -176 77 256 -139 -143 83 -42
2226 -42 108 245 -98 -59 75 -101 121 292 -241 -215 207 -44 -94 300 -111 -362 144 96 -57 102 -90 -277
2248 -277 51 34 -105 71 -96 -275 156 236 -84 91 -24 -223 92 253 -14 -47 67 -99 116 293 -13
2269 -13 -97 21 -46 60 188 -55 -140 -114 -116 71 81 -106 -141 -70 -77 30 189 -63 -229 -31 31 71 126 7 -148
2294 -148 7 95 181 98 -59 -159 -2 133 83 65 -69 -148 10 56 102 -33 -72 -176 -42 22 -2 -27 -87 -175 -1
2319 -1 117 69 -68 -145 -37 43 100 72 -42 -108 14 121 98 95 -73 -98 25 37 121 68 -7 -133 14 108 -11 37
2345 37 -54 -139 -6 67 71 -18 -6 -178 18 118 -26 -18 60 -69 16 167 23 5 -28 -26 -20 169 -13 -90 19 -65 -71
2372 -71 117 -25 -186 -25 15 -55 43 -10 -151 -31 -58 -10 64 67 -112 10 48 47 86 52 -40 -44 72 81 93 38 -26 11
2400 11 27 -38 0 -50 -33 -46 -7 -21 21 -44 -67 1 -6 -77 21 8 -101 -2 23 2 25 55 -39 76 65 -5 99 51 -56
2429 -56 -14 61 -44 54 40 -78 -2 -6 -59 -21 11 -130 -7 22 -135 8 65 -99 -52 64 -96 8 81 -39 -52
2454 -52 120 21 22 73 -80 -5 127 -31 -68 93 24 -103 138 27 -89 62 -41 -77 79 21 -118 75 4 -124
2478 -124 82 66 -111 -28 36 -130 93 56 -85 45 6 -66 57 163 -91 39 77 -27 9 56 -103 21 -29
2501 -29 -50 -23 109 -67 -29 36 -143 -21 33 -59 -57 73 67 -27 69 31 -69 12 -5 -7 47 3 -12 42 55 -50 -6 41
2529 41 -31 -24 -48 9 -29 24 19 -72 -72 -19 -90 -105 4 -112 -94 72 -48 -15 64 10 -33 34 45 -40 87 22 -13 70 56
2558 56 -18 25 90 -120 59 70 -60 -9 37 -135 -45 106 -152 -46 32 -108 -42 76 -104 -66 84 -127 -55 140
2582 140 -34 -74 125 -14 -85 179 -31 -131 132 1 -108 109 37 -127 64 60 -95 71 44 -164 45 78
2604 78 -153 56 56 -250 28 122 -162 36 125 -162 64 171 -97 -38 132 -167 -1 223 -159 -72 124 -94
2626 -94 -47 261 -105 -179 147 -60 -130 154 -53 -199 172 -7 -140 169 -15 -230 150 93 -139 157 84 -260
2648 -260 72 189 -134 68 94 -256 79 212 -104 -5 112 -192 21 252 -118 -103 36 -181 -86 243 -83
2669 -83 -98 126 -169 -35 289 -46 -222 158 -25 -39 330 20 -225 122 41 -41 297 47 -259 94 76 -85
2691 -85 184 85 -323 88 146 -143 112 75 -343 -34 117 -143 94 71 -362 -61 200 -48 -47 103 -260 -92
2713 -92 297 33 -81 107 -149 -87 293 53 -122 78 -159 -88 293 25 -196 43 -80 -136 231 100 -268
2734 -268 -30 -28 -164 158 150 -286 -8 93 -103 152 138 -278 -101 131 -35 141 159 -244 -102 162 6 73
2756 73 79 -220 -175 226 20 -40 57 -209 -186 186 87 -73 57 -132 -150 151 81 -55 2 -48 -119 192 90 -111
2780 -111 -40 -16 -72 196 155 -133 -98 12 -95 71 118 -143 -197 -8 -43 76 79 -137 -115 38 -6 99 115 -178
2804 -178 -115 94 91 38 126 -114 -126 131 93 19 50 -101 -153 114 100 30 0 -101 -69 96 87 -46 -72 -162 -132 102
2830 102 82 -120 -61 -54 -121 61 127 -55 -52 5 -82 106 165 -127 -22 10 10 158 87 -86 -48 43 20 93 122 -110 -62
2857 -62 47 -32 19 65 -119 -94 23 -14 18 72 -150 -154 65 62 -13 43 -77 -64 96 92 30 2 -92 -88 122 28 -42 30
2885 30 -46 -83 125 65 -50 -24 -36 -133 81 21 -121 -54 -44 -96 61 95 -84 -16 -1 -37 65 120 -97 -2 -3 -54 44
2912 44 87 -44 -53 80 -37 -2 90 -73 -59 47 -19 28 21 -101 -126 23 53 -45 33 -26 -50 10 27 17 65 17 -20 34
2940 34 60 49 68 -25 -5 60 96 25 -2 -2 -52 29 26 -31 -36 -56 -22 -89 -8 -31 -37 -30 -26 3 -28 -20 23 -49 7 35 33 -1 34 -34
2974 -34 -26 130 32 33 65 -23 -24 30 -12 -47 64 -73 -53 57 -74 -52 39 -4 -59 18 -16 -139 0 -38 -83 68 -6 -79
3002 -79 57 21 -111 81 77 -91 32 64 -124 39 110 -135 -2 64 -102 35 118 -85 -26 -12 -63 6 43 -77
3026 -77 -60 87 -88 3 131 -44 -78 55 -18 -54 90 13 -77 71 33 -12 126 74 -111 82 48 -5 39 -4 -115
3051 -115 27 53 -79 30 -16 -88 55 82 -56 2 27 -102 -3 117 -95 -33 43 -103 8 142 20 -10 42 2
3075 2 -3 155 -10 -61 41 -4 -110 40 31 -140 21 -60 -50 41 -23 -111 -47 6 -23 22 67 -100 41 28 -19 94 35
3102 35 -15 118 38 -52 39 68 -39 33 80 -38 50 40 -58 4 51 -34 -32 -7 -65 -77 70 -66 -62 56 -10 -59 34 -51
3130 -51 -62 22 -22 -64 6 -16 -7 31 41 14 77 45 -11 74 36 -3 5 8 -52 -20 50 -39 -35 -70 -79 -6 33 -55 -4 -53 -76 10 21
3163 21 -27 -3 17 7 70 17 -10 -14 -34 30 51 7 17 -43 -22 19 -1 -4 -21 -29 -23 21 -13 -45 -47 -6 35 14 -3 3 -50 -8 -20
3196 -20 51 91 -65 -3 5 -14 23 55 18 -17 67 33 -14 -1 -131 -43 -47 -47 -58 15 -75 -56 7 47 -1 77 -63 -38 2 9 -1
3227 -1 -38 -38 -70 106 45 -29 31 0 -51 94 106 -89 -48 40 -33 69 49 -136 -50 -2 -86 24 89 -83 -87 45 -56
3254 -56 52 91 -85 -91 64 10 2 21 -64 -99 113 24 -8 125 -18 -99 61 123 6 34 -21 -105 93 80 -43 -25
3280 -25 9 -53 107 86 -8 -57 -13 -80 28 110 -65 -64 2 19 98 119 -58 -67 30 -39 31 110 -50 -61 48 -42 -36 52 -75
3309 -75 -144 36 61 -21 38 15 -197 32 70 -56 26 -37 -75 19 99 28 -11 28 -84 16 119 -39 31 22 -88 -34
3335 -34 94 1 -54 4 0 -22 78 -36 -125 -44 -20 -82 -19 19 -107 5 6 -25 88 15 -117 -32 31 9 15 65 -60 12
3363 12 45 15 33 53 -115 -4 92 48 30 9 -116 -10 93 -40 -100 9 -118 -40 87 -48 -25 -29 -65 -38 93
3388 93 13 -58 -22 -43 -83 72 63 -67 -3 28 -17 76 36 -118 15 30 -52 78 68 -60 -19 50 -70 48 53 -118 -38
3415 -38 61 -122 -7 68 -103 -15 96 -6 -32 95 -59 -57 44 23 53 61 -18 -59 111 -26 -65 32 -43 -6 44 62
3441 62 -74 1 -33 -79 47 27 -92 93 -42 -69 17 60 -29 22 70 -87 67 11 -19 -13 33 -67 58 45 -96 -49
3467 -49 72 -40 -31 31 -76 -15 5 7 -114 38 -20 -51 59 2 -16 29 -11 -26 38 8 -7 21 0 20 63 82 -46 44
3495 44 19 -15 -55 35 -35 -11 28 -22 -6 16 -41 -69 -43 -5 -28 10 -22 -44 24 -51 5 23 -24 -33 -28 6 13 39 -13 4 50 -16
3527 -16 -9 26 0 -16 -9 9 7 77 14 -62 19 43 42 -7 -23 -21 -23 49 -5 -34 18 -9 29 65 -11 -13 26 -27 -26 11 56 -11 7 47
3561 47 -22 -27 -27 -33 45 11 10 -5 -3 -20 -38 -38 21 -4 -7 25 -5 -22 -4 -22 -5 -37 22 25 9 -31 15 -59 -55 -12 9 15 18 12 -21 58
3597 58 8 -18 0 -52 -40 -51 9 16 -7 5 -53 -19 7 -36 -16 -1 -44 -33 -3 7 -19 -7 -71 12 39 27 -14 -14 11 -37 -7
3628 -7 24 -14 32 -39 -39 1 -34 -49 -64 -47 -58 -23 -14 -62 -50 -48 -30 -20 31 -29 -12 27 -37 19 80 8 38 57 -13 -21 91 -15
3660 -15 -36 55 -52 -48 12 23 -29 43 -11 -11 44 13 -71 -14 -13 7 5 -10 -82 8 -17 -22 -39 18 -51 -17 -6 -7 26 44 -60 -24
3692 -24 61 7 13 41 -75 -76 14 -5 -33 24 13 -46 72 22 -8 -15 -16 -62 51 17 -16 58 18 -54 121 8 -19 18 18 -30
3722 -30 61 15 -77 -42 -20 -31 -7 74 -43 -32 -11 -33 -71 -16 -42 -5 7 -12 -11 88 -1 3 35 40 34 81 13 3 48 26 -17 38
3754 38 31 -61 8 20 -26 -2 1 -32 -1 56 10 -56 -54 -77 14 -16 -40 -17 13 -38 -8 52 1 15 18 20 59 55 -42 20 20 -21 -70 34
3788 34 -10 -28 59 19 -37 40 17 -31 21 45 -15 33 -26 -31 -4 -21 -8 31 11 -24 -54 48 4 -4 25 -11 -45 -44 -20 -2 11
3819 11 27 27 7 -29 55 44 -34 62 47 13 23 -14 0 46 38 -5 28 1 -25 7 27 -20 -73 -18 -21 26 -17 -3 -6 5 32 -21
3851 -21 -15 4 -16 -3 -38 -29 67 -10 6 -10 -2 -19 36 -29 -60 32 -43 -65 -17 -2 21 -25 38 -3 23 -46 55 31 -27 24 37
3882 37 27 -55 34 -16 -14 17 -13 -13 -19 -21 -15 -16 18 54 -1 -15 -49 -10 7 -10 19 17 -44 -49 6 65 34 -18 -8 7 60 -18 14 -35
3916 -35 34 -12 20 76 28 8 -31 -26 18 -15 -37 -33 -38 -17 -28 30 -54 -21 -40 -26 -16 -4 -7 -22 -21 8 25 25 20 -5 -29 -8 7 -7
3950 -7 81 2 56 -15 53 -26 6 -32 -87 28 9 -40 25 -40 -29 -38 -1 -39 45 5 -29 16 29 -83 -19 -10 -68 -9 -33 -36 -16
3981 -16 4 3 2 -18 -71 -9 -11 -39 -18 29 -20 -22 -13 -2 9 6 -81 -24 6 -62 12 -24 -35 -19 24 -14 -7 10 0 -6 27 8 -27 6
4015 6 -58 -37 49 -4 2 -20 -18 -66 48 34 -98 17 39 -23 -8 12 6 -22 44 -4 -5 63 17 27 44 -37 2 75 -37 20 76
4046 76 -26 12 4 11 1 43 9 -35 -4 -40 -17 3 -59 -7 -6 -59 9 47 -26 -48 30 0 15 -17 -8 -6 18 72 -24 -17 43 8 -19
4079 -19 61 -31 43 42 -51 27 -13 -96 -5 34 -15 14 -15 -29 -42 -7 -46 -32 -20 -5 -45 -14 53 16 -53 -13 -23 -9 12 -43 40
4110 40 -38 -46 30 6 -38 16 29 -12 31 -10 -23 39 -26 14 -14 -23 -28 50 -6 -37 17 -23 -4 -6 -35 -4 -8 12 31 -57 -37 -21 41
4143 41 -2 13 0 29 -1 21 18 -23 -27 38 -32 -81 -17 0 8 -29 5 6 -15 30 39 2 1 -4 26 -19 24 14 50 38 -24 -4 11 6
4177 6 0 9 7 -9 -11 25 -18 -25 24 -29 -1 24 -11 49 -46 -43 -31 -16 -22 -16 27 18 -78 20 -57 -6 -12 61 -12 -33 -45 -9 17 17 -19 -21 2
4214 2 -25 15 -4 -7 51 16 -81 -36 -23 2 35 -2 -50 2 11 -18 3 2 45 52 16 17 -18 38 -48 41 22 -21 -30 43 2 23 8 2
4248 2 -10 -5 4 -16 20 -47 11 21 -63 -16 38 3 -46 -10 3 -31 3 -5 -11 27 -9 22 -27 20 -57 10 48 -62 55 -11 -65 -1
4280 -1 -46 24 -18 -17 -23 43 67 -28 36 0 3 49 29 -38 -4 24 6 40 53 -23 21 57 4 24 32 51 3 1 0 -8 21 13 25 -23 10
4315 10 -69 47 -35 -104 14 -24 -14 -89 38 -47 -13 29 45 8 15 -26 10 49 -13 -11 90 23 -41 36 7 6 10 -18 -12 87 6
4346 6 -43 -14 -16 -13 92 9 -8 19 -21 -28 12 39 -78 38 -40 -107 31 45 -35 2 -16 -44 42 28 -43 66 28 3 -14 -18
4376 -18 -38 8 41 -5 -13 15 -68 7 40 18 -9 89 -24 8 47 15 1 23 33 -53 19 28 -20 33 36 -31 34 17 -52 -46 59
4407 59 -59 36 15 -44 -20 -18 -51 9 4 -57 -10 29 -25 9 34 4 30 38 23 -14 2 -6 -18 38 8 14 -1 -14 -29 50 -15 -13 1
4440 1 -33 -30 8 9 -41 -48 -3 -44 -7 42 -34 -19 8 -25 -4 -11 -22 14 10 34 63 9 27 43 35 9 58 13 -62 -8 30 -8 -59 -12
4474 -12 36 -46 -41 51 -7 31 -33 -68 23 -54 -36 -66 -2 -9 -18 45 6 -7 -23 10 20 26 28 17 11 27 -1 -16 -19 -8 -37 69 2
4507 2 -23 23 -14 -11 -8 8 -4 51 18 -23 1 -14 -9 9 1 -57 -17 11 -1 -27 17 30 56 7 -31 -30 -6 -3 23 3 -43 15 -11 -68
4541 -68 16 -3 -32 34 13 6 -23 3 -23 8 13 51 -6 36 20 -14 27 -6 -26 28 7 0 1 -3 25 -24 -21 -44 27 31 -45 0 13 -34
4575 -34 -51 33 -13 -43 38 -8 -13 32 5 -5 -27 23 -7 -10 13 75 -13 -28 13 12 21 -35 50 -52 -25 4 -19 -31 65 8 -25 66
4607 66 34 -20 34 22 -14 -27 31 -30 -35 32 -6 17 48 -18 28 52 -14 0 62 41 29 64 24 11 4 21 12 52 -26 -45 24 45
4639 45 -29 39 -23 -29 5 36 -31 -6 44 -7 22 23 -56 -6 25 -18 29 -1 -23 -29 -6 -13 -26 17 -10 -7 30 -1 -19 -21 -53 -8 54
4672 54 19 -25 61 -14 -37 -46 -8 19 -19 -11 -77 7 34 27 12 7 -27 53 -25 -30 -12 4 -19 -12 35 -79 38 29 -21 21 20 13 19 15 0
4707 0 0 52 -7 -21 15 10 -29 -49 21 -45 4 -51 29 63 8 83 10 32 61 36 9 12 21 -14 -23 55 -25 -47 4 -36 -24 20 -29
4740 -29 -33 -7 -50 -51 14 -17 -9 -39 -20 20 -14 42 -38 49 36 -4 23 6 -14 42 -1 -31 45 32 7 18 56 13 37 29 -59 4
4772 4 -40 -3 -13 25 -29 29 6 -25 -42 0 -22 -5 -8 -20 -34 -2 -50 -22 23 10 -33 14 46 0 28 5 -11 17 5 -35 5
4803 5 53 -43 -22 67 -22 49 25 7 76 35 60 10 -57 -15 -36 23 -49 -15 -69 -49 -2 -16 2 -22 4 2 -15 4 -63 2 -8
4834 -8 -7 4 -23 -19 16 -15 -45 63 57 1 -9 37 3 2 11 -8 -2 29 -20 -15 20 24 12 8 -48 -54 -12 14 -36 -30 -58 -74 33 -24 -45
4869 -45 -10 -19 -23 -59 -4 -15 41 -34 -50 12 34 -3 -1 31 -28 8 9 34 -3 -16 31 7 9 -13 0 40 45 51 -22 -32 -15 -13 -19 -11 47
4904 47 1 -48 -49 5 37 9 16 18 -45 -15 -53 84 10 14 15 -1 -13 13 3 -37 33 -22 -2 4 2 34 -8 27 16 58 -6 -33 25
4937 25 4 -35 -9 -34 -45 11 -34 -39 13 -55 -9 26 -10 -44 -13 -23 29 -39 -2 -39 38 30 -47 17 39 -11 30 16 -11 -6 1 7 58
4970 58 46 -12 20 -7 31 4 16 2 37 -19 -15 6 -29 9 -10 19 -56 45 -35 38 7 -12 -10 -14 -19 -69 -16 -42 0 -44 8 -27
5002 -27 18 31 -34 41 -1 -85 -21 6 -21 -6 9 -19 -10 44 -3 8 3 56 2 6 3 -21 -10 9 -25 23 -35 -40 -25 2 -17 58 13
5035 13 21 20 -54 -20 -23 9 -21 0 -22 7 25 31 -20 -3 48 24 34 0 -9 -51 33 30 -13 22 -56 35 1 51 -27 44 51 -5 62 -43
5069 -43 50 18 -50 29 -12 -32 -63 64 -61 -75 17 19 -39 -6 11 -67 0 -10 8 12 19 -4 -8 -58 -40 45 37 -46 43 -10 -7 16
5101 16 38 54 48 46 32 11 5 65 8 -29 18 -35 11 -22 -75 27 -2 1 -20 -1 -20 -24 -19 -27 16 8 -24 -27 -18 -7 46 -65 -21 39
5135 39 48 27 15 -17 18 20 17 -16 -37 37 3 28 -14 3 42 -5 -28 -22 28 -7 -2 -13 1 -31 -13 24 -31 -56 -42 -5 34 28 -5
5168 -5 -38 -11 -1 -8 -20 5 -51 -9 -15 10 26 -34 30 -4 -7 19 10 2 16 11 -21 36 21 -26 15 41 -9 -45 -6 -10 -45 1 6 3 42
5203 42 -25 -22 -38 -25 -46 -36 9 -35 -13 -7 11 26 -9 -29 11 -28 37 -11 -14 -52 35 44 -15 17 8 0 9 37 -15 -48 12 4 3 8 -29
5238 -29 29 47 -49 -5 2 -27 -21 -15 -4 -12 -20 4 0 27 -4 2 2 30 -2 -23 -22 -23 -39 28 21 -10 -2 24 47 38 20 15 44 -23 -9 12 30
5275 30 13 14 -7 9 51 22 -17 -28 -26 23 -62 -32 -5 -3 32 -37 -5 -25 3 74 18 39 -33 -71 -13 4 1 -33 23 46 -35 2
5307 2 27 12 -3 -14 14 16 68 -19 22 -36 20 40 -10 14 -22 -65 30 -18 30 -39 -2 -15 -1 20 6 -2 1 48 41 22 1 -15 26
5340 26 -20 -5 -3 -29 12 -36 17 15 2 23 -7 -7 1 9 13 57 2 36 93 -43 -49 -6 12 39 -20 -37 -15 8 -21 -36 -8 -42 5
5373 5 -18 40 19 -51 -25 -14 -11 -69 -9 -65 -21 -32 -8 -4 -55 -41 6 47 -24 -23 3 -15 19 25 -20 5 25 12 -5 28 -28 30 -13
5406 -13 6 27 -21 10 4 25 -30 38 23 -33 -71 12 23 -28 4 -9 -44 -22 9 -9 -16 15 -10 -3 25 58 12 -26 -2 27 -4 14
5438 14 4 10 19 -25 -1 22 47 48 81 -25 -31 -9 2 24 33 -5 23 15 -89 -3 -12 -38 -36 -36 -16 -9 -44 -3 -51 -16 -14 3 -39 -12 -7
5473 -7 27 3 -43 56 -24 -18 34 2 73 52 5 47 23 5 26 45 32 -23 -33 -20 -32 17 -14 13 -24 12 -38 3 34 -17 -3
5504 -3 56 39 -7 -30 -19 -13 0 17 3 -62 38 -41 27 36 -44 -41 6 27 28 20 4 -2 -4 13 26 -18 -28 3 51 12 24 58 -22 17
5538 17 3 2 -30 -41 35 -26 -19 -21 23 29 -39 30 14 2 -4 -8 -54 -39 37 19 32 -39 -33 -38 23 19 30 -14 26 33 -20 7 -42 18 29
5573 29 29 -29 14 -22 2 -19 -9 20 16 -4 5 59 -47 -65 8 -13 -40 -30 -56 34 27 51 2 -7 -18 -4 2 46 -63 -26 40 -40
5605 -40 11 34 19 52 59 15 66 28 -15 4 -37 20 -43 -3 29 43 -43 32 3 -97 2 -1 5 36 4 -34 -52 -16 -18 -6 -12 43
5637 43 4 21 14 29 8 11 -10 25 6 14 -26 18 -5 15 8 40 36 16 32 18 15 -9 -6 10 -9 -46 54 41 16 31 32 -37 51 -8
5671 -8 66 -43 -52 6 4 26 -6 -39 -29 -41 -29 -18 9 6 14 31 8 18 -10 15 -18 17 36 -35 31 54 14 9 -73 -16 10 48 9
5704 9 17 37 -36 -6 30 -69 -4 -3 -50 15 -48 3 -18 -65 75 -28 1 13 0 -29 -45 -1 6 26 9 22 -5 20 16 7 0 16 22
5737 22 9 -3 -15 23 5 -14 -7 -7 46 -14 -10 -5 -35 -30 31 -21 -4 -26 -32 11 7 -1 -25 -52 11 26 -39 28 -10 1 -51 18 -28 -49
5771 -49 27 -2 -39 5 24 47 21 42 39 13 8 -17 18 7 68 -7 0 26 6 -6 24 -44 60 7 -69 6 -5 -36 1 0 -9 -39
5803 -39 19 5 26 39 16 -12 27 -18 5 -8 -44 50 23 -11 13 8 22 -22 12 -34 33 80 -25 26 -16 -28 15 -5 -70 22
5833 22 -20 18 -28 22 22 -13 -18 -30 -22 -10 -63 -60 7 -5 34 -19 17 23 15 1 -51 11 56 -9 26 -6 -22 43 51 -9 7 -16 71 20
5867 20 5 18 54 37 12 38 -4 -48 12 8 -29 -32 4 6 -74 13 -38 4 45 19 -10 -3 -29 24 25 26 -63 9 4 -15 -31 3 -15 14
5901 14 42 34 -3 -11 28 -20 20 24 -10 9 -23 13 0 61 -30 35 -61 13 3 53 11 -15 21 -48 25 -22 -30 -2 19 31 -13 -14 2
5934 2 1 2 -40 -39 0 -18 -14 -25 20 50 4 58 70 -35 -4 30 -9 -10 0 55 13 -3 18 -3 -33 -42 -36 -2 -43 23 -46 -18 8 -25
5968 -25 -14 -28 -6 -13 -29 -40 15 -12 23 41 -21 -27 -21 -16 23 28 2 35 -16 36 -12 -6 5 -1 14 30 -23 -10 -35 -50 -16 51 18 -29
6002 -29 26 31 8 -2 56 -6 -8 -11 -24 -38 14 -15 63 -16 2 -18 61 -62 0 -7 27 -11 -48 45 -44 21 -24 -1 -29 -18 14 20
6034 20 12 -23 -2 15 19 -17 -5 -26 -21 16 14 32 10 -4 16 -36 -32 -38 25 -74 -17 7 -26 -57 -10 -9 -10 27 -6 -60 -49 -15 -68 0
6068 0 -37 -36 36 7 26 7 13 -23 -14 15 3 0 14 30 -25 27 3 18 7 20 -18 -7 -26 24 -19 -7 -3 -18 -8 -21 26 -42 -68
6101 -68 -22 10 8 -49 2 5 -19 -23 -15 -21 14 12 74 -14 37 -6 39 -23 -8 35 -10 -12 0 -45 10 36 40 -9 -5 13 -20 -8 -19 18 28
6136 28 4 -32 -2 -33 -16 -9 -7 9 24 14 -9 -10 -11 -34 1 9 -16 19 -19 -22 -55 18 -7 34 60 2 -32 5 79 11 10 53 30 37
6170 37 27 -51 29 -5 19 1 5 -5 -19 19 14 46 -28 -9 -84 23 -36 -8 -22 14 -17 5 -3 4 -8 -24 -22 15 -66 1 -22 -2
6202 -2 26 24 41 8 -24 12 -24 -39 -18 -41 -22 -27 -2 20 18 -15 24 -4 -5 59 4 -63 24 24 11 -23 11 9 6 -43 -8 -33 -28 -5 7
6237 7 -36 -17 -39 27 8 20 -40 -23 2 -23 34 10 6 40 7 40 -13 34 23 -55 29 -57 26 -44 -28 -44 -23 31 -40 32 -4
6268 -4 -47 -2 -11 -32 -24 0 7 -21 -30 -16 -38 -18 -18 26 -7 33 -19 65 21 -20 6 -40 5 -7 22 -24 -22 23 -56 -6 -15 -28 -36 -44 -9
6303 -9 14 -44 12 -13 -11 -37 -43 2 17 -36 -36 22 -52 -33 4 -42 6 -5 19 13 -43 -38 -1 -1 1 41 37 -16 31 -13 7 30 -10 14 -26
6338 -26 14 17 -33 -30 18 -62 -12 17 -52 10 42 -83 12 -42 -47 3 34 8 12 66 -11 24 26 -12 38 10 30 53 7 -2 19 54 54
6371 54 -12 10 58 8 -8 29 -21 -20 3 -30 -46 -2 -18 14 20 3 -19 7 -62 -24 19 17 -75 47 -20 4 -7 -48 -47 -12 -37 -7
6403 -7 -21 -48 -11 3 7 -22 25 -28 19 37 11 34 -21 12 4 -4 4 -7 -38 5 -44 -49 -1 -30 9 -45 -17 3 -51 -9 -42 -41 -24 -44
6437 -44 -17 -27 -6 -22 18 -22 -10 -28 42 4 -42 20 45 51 1 22 19 7 -31 -28 56 7 15 -17 -30 44 15 26 34 40 14 -36 -21
6470 -21 -3 -3 12 44 11 -89 -47 21 24 -13 -18 30 -15 -85 -30 -11 0 -56 -50 -15 5 -24 -20 11 0 1 -14 5 61 30 -12 37 24
6503 24 -2 -12 30 2 -32 -7 30 8 -45 -5 -36 -20 -41 11 -61 -34 10 -17 -35 21 -15 -11 -14 -9 8 -6 -28 -18 25 5 24 -3
6535 -3 16 -11 -34 8 58 57 -5 -33 55 15 -1 -87 35 37 -20 42 16 -9 51 -6 31 64 9 37 18 45 4 -34 -28 19 -48 29
6567 29 20 23 27 7 -28 -9 -13 -7 -12 18 10 16 12 -17 2 36 -75 28 13 -6 41 4 -8 -8 39 40 -61 25 19 5 -2 -51 18 -14 6
6602 6 -40 -6 4 34 -18 -22 0 27 16 8 -3 -71 -4 25 -10 -29 -13 -13 -21 -24 11 -1 41 42 19 17 15 -19 5 49 45 -12 33 30 23 56
6638 56 -31 -37 -25 32 -36 -22 40 17 21 -42 25 -35 12 -17 2 -70 24 -2 -7 24 33 16 13 7 47 -10 27 4 -6 -60 -24 17 30
6671 30 -15 -7 -63 -6 -1 -52 -20 13 -8 38 -14 -9 48 -11 -56 -11 -24 11 -30 -54 67 20 -24 -35 31 2 -51 17 4 -24 1
6702 1 13 1 10 7 16 -17 -6 -29 22 32 18 91 42 2 60 2 29 -13 6 -8 19 31 -11 15 -27 -47 6 -7 65 -37 5 10
6734 10 -16 13 -2 -18 -75 -68 -2 -14 -36 -14 -2 25 -14 -18 -14 5 27 30 -18 37 46 -10 30 -4 2 -12 4 -23 -20 32 -9 5 -41 13
6768 13 -13 -24 1 -9 -22 19 19 -17 -27 -35 -91 27 -11 18 -22 -19 1 1 -7 -1 29 -2 83 -27 38 -26 -17 9 40 9 -18 -6 -12
6801 -12 -7 -7 62 -65 -38 16 -39 -21 31 14 24 -12 -25 -29 9 -31 -36 -19 13 5 0 26 26 -11 64 24 -29 -23 -20 -18 28 -63 12 -24 10
6836 10 72 6 7 30 56 -29 -24 -21 -42 37 -32 -18 -1 0 27 -13 30 -28 -5 21 13 -107 -50 50 5 -61 -17 -1 -17 -33 25 2
6868 2 11 -6 -7 13 -4 -10 0 -40 -1 -38 -8 2 -13 16 -9 58 41 61 73 25 -31 -4 16 -27 9 -44 36 31 27 -5 -46 15 -13
6901 -13 14 30 -22 -11 9 -2 13 -4 -64 -30 10 -13 -24 28 -9 -17 25 40 8 8 47 -13 22 12 -19 24 12 12 1 3 2 -22 -28
6934 -28 32 25 21 0 -50 1 14 2 -1 36 -14 14 47 -13 -34 12 -2 19 -1 36 12 -25 4 16 -46 -34 1 31 -21 -9 6 8
6966 8 -4 10 3 -7 34 28 -12 39 -7 -33 10 28 -38 -30 -36 -52 6 -43 -7 -28 -25 -33 -4 -19 -8 -46 -7 -28 14 -51 3 15 -61 -20
7000 -20 -36 -7 -40 28 14 7 -15 9 -16 30 14 27 -23 -36 -15 5 3 -34 2 19 11 -5 19 -49 -68 -27 -35 -48 -1 9 -19 -16 5
7033 5 -12 -27 -48 -3 7 -11 17 -46 -20 6 6 -55 -59 38 29 91 1 -3 18 -13 -1 40 22 86 -3 -14 0 -18 8 -34 -6 -14 2
7066 2 -33 -52 32 -28 -15 -22 -37 0 14 -11 -15 -14 5 6 -37 2 -32 39 22 22 -9 9 -12 22 41 -41 38 31 43 20 5 -28 -2 21
7100 21 21 -15 -18 31 -4 17 10 -23 51 1 -59 -15 -12 -51 -40 -4 0 4 -1 -30 -9 -5 11 -5 -34 25 -29 13 -25 32 2 -4 48 -32 4
7135 4 31 23 3 10 -22 53 -6 -9 -44 -27 -34 -25 7 8 -27 21 -9 27 -8 -11 11 -52 -4 -24 -16 -19 -7 -3 -17 49 -26 4 -46 4 41 -10
7171 -10 56 25 32 14 10 -2 34 -7 8 8 40 -45 -50 -46 28 -20 -14 6 -14 -32 5 16 0 -47 -11 -76 9 -20 21 -1 -7 -17 18 -26
7205 -26 -60 -2 10 -8 -36 0 7 -15 5 20 -27 17 -7 -23 27 24 50 8 50 8 -7 -19 -39 -38 3 2 30 5 -33 -38 -33 -45 -4
7238 -4 -11 -25 -13 -22 20 -34 -22 -6 3 -10 29 -18 -52 -20 25 -21 11 -20 70 -17 -21 -2 5 20 -7 19 -11 14 24 -8 22 37 -6
7271 -6 -28 28 -16 -29 27 -12 49 -8 46 8 4 5 -48 29 -54 -76 -23 -35 -10 7 -28 -55 -4 26 -31 -15 41 17 -35 51 -24 20
7303 20 -12 46 21 21 -22 -23 -47 -2 2 11 48 66 22 19 26 19 15 -32 35 25 7 -65 -60 -41 -36 -6 -34 -35 45 15 41 -21 8 -12 10 20
7339 20 3 80 -12 16 45 24 6 39 14 7 38 -18 2 0 -30 -36 39 -6 12 -40 -29 -13 -2 16 -4 -6 -20 9 -27 -46 21 4
7371 4 -4 -5 -13 1 -23 2 10 -15 -23 9 14 12 -14 -38 -18 -20 -31 -4 4 16 7 9 25 38 1 -13 -6 19 56 -16 9 -41 -30 -14 31 -25 1
7408 1 -11 28 28 -51 -38 -4 16 8 -22 15 18 -14 -44 29 29 13 56 55 -32 -4 21 10 -6 29 18 28 17 -27 -18 8 -69 19 -41 25
7442 25 -14 -25 -9 17 21 -81 13 -65 -18 3 -3 -36 -27 -47 -18 39 -7 4 -24 -22 19 28 12 -23 -10 -39 1 -37 37 9 -14 -13 5
7475 5 49 -15 -70 41 -36 -22 -14 30 4 -2 39 38 20 37 -63 6 3 -28 -68 -40 29 16 -13 -55 2 -24 -16 -42 -23 42 -37 31
7507 31 -17 11 16 -34 -17 -12 35 19 60 17 22 -22 26 -30 -27 13 1 -15 -11 5 -43 28 -1 41 6 -4 -59 -1 13 11 16 33 -16 -45
7541 -45 -33 11 7 7 38 -17 -18 -9 -25 0 -52 -26 34 49 -2 38 33 56 -31 -8 39 -10 16 14 6 -37 -1 19 14 -19 7 -27 6 -20
7575 -20 1 38 46 -3 -6 -53 -13 17 -16 -2 -36 -30 -25 -9 -4 10 1 27 -15 27 17 6 -6 -48 36 17 -24 1 42 19 63 -23 33
7608 33 -37 -10 -33 25 32 -25 -13 57 30 11 7 2 -13 -65 -47 -29 -32 7 4 2 17 29 -50 -3 19 2 -10 40 31 -5 -13 -8 -34 -4 16
7643 16 2 62 25 16 50 -17 30 8 15 38 26 3 -35 -11 -25 40 -34 -48 30 -8 -34 -21 47 28 -21 -9 59 11 11 -4 -25 -16
7675 -16 10 26 24 5 10 -19 29 15 39 48 23 -52 -13 62 -7 -33 -39 15 -26 58 -21 39 27 -48 15 8 11 -15 23 -4 26 14 13 -2
7709 -2 20 -16 43 4 -22 1 21 -9 -22 8 -1 -39 28 -28 -21 -8 37 -7 42 -28 -26 31 -14 -23 64 37 -33 7 -38 38 17 19 15 3
7743 3 -3 -23 -11 -24 -14 -34 -61 -3 -39 -13 -46 -45 1 -50 10 17 26 -12 -18 -14 -32 3 50 1 -12 -4 9 -25 -6 11 13 44 13 -20 -36
7778 -36 -53 -10 -48 18 12 -37 5 -29 -42 -32 -18 -27 -16 22 4 -23 26 25 -49 -8 -21 -27 -15 16 -45 -23 -29 -34 15 43 25 1 32
7811 32 0 11 22 -18 29 24 -13 22 -4 43 60 5 5 17 -63 -7 -6 33 11 -4 34 -2 -60 45 -32 -4 2 -15 11 -55 -14 -77
7843 -77 9 16 13 13 5 -22 22 -2 -52 -1 -12 34 41 15 -8 38 36 -47 53 16 -18 14 -25 -24 -16 -15 -35 24 -36 -33 -23 -20 -25 -8 -56 -57
7879 -57 15 -11 -16 -21 18 59 17 -14 13 -17 34 -28 -33 36 18 28 -18 -7 -15 13 -7 -18 -77 -22 11 60 7 43 -9 -66 0 -62
7911 -62 31 -9 -2 16 -27 -52 -19 11 -16 -26 12 -79 -23 -25 37 0 -49 6 -42 16 -9 10 27 41 61 16 -1 29 8 21 10
7942 10 7 -25 -7 29 41 1 36 28 6 19 39 -3 -15 -20 8 38 -41 51 -39 -16 -46 -64 -15 31 3 -42 -19 -1 -48 61 48
7973 48 42 -21 -24 -6 -50 -15 -27 46 -2 -10 29 8 -5 -24 15 -48 -45 62 -17 -13 5 -6 11 -4 -21 32 -52 -38 43 -25 -20 -46 -16
8006 -16 18 13 38 -3 -2 57 -13 -37 14 -15 27 -30 50 44 9 38 33 10 50 0 -19 7 1 40 37 -32 -13 -16 50 17 20 34 -34 23
8040 23 -12 -31 -16 7 30 -60 -28 -10 -7 -55 40 -54 -38 26 -25 -1 15 -18 -33 -7 0 0 3 -22 -14 25 -61 8 -46 -24 52 40 -2
8073 -2 -34 0 14 -52 -28 2 -35 -4 -13 -9 6 -24 11 22 -27 -9 -21 -55 -9 50 -17 15 3 -52 -31 -34 -18 18 20 -8 1 -57 22
8106 22 -10 -15 -19 -2 -44 -25 -2 8 -8 -43 -11 -1 -12 -28 23 -44 -40 1 -45 13 10 -12 2 -18 -6 21 -41 -6 66 -24 7 -60
8138 -60 18 -37 22 -25 76 54 14 30 42 -20 -50 -6 2 -24 -18 4 -22 24 74 8 59 28 -1 -2 11 27 -11 -2 -12 -31 -40 -12
8170 -12 -26 3 66 -60 -28 34 55 21 41 -59 8 -16 49 -18 -68 -4 45 39 -29 22 -14
8191a4
$$ Imaginary data points
##PAGE= N=2
##DATA TABLE= (X++(I..I)), XYDATA
0 0 0 0 0 0 0 0 0 0 0 0 0 0 -8 8 -8 8 -16 16 -24 24 -32 40 -43 52 -64 72 -84 96 -112 128 -148 170 -192 219
34 219 -246 277 -315 353 -394 440 -489 544 -606 671 -742 821 -907 1000 -1103 1214 -1338
51 -1338 1473 -1624 1790 -1976 2184 -2418 2689 -2997 3360 -3785 4300 -4935 5741 -6797 8255
66 8255 -10400 13888 -20715 61193 -254110 -79404 281902 -174197 -94148 257157 -68663
77 -68663 -194688 156249 14823 -99527 112508 2209 -127847 66170 30673 -45410 60235
88 60235 -13270 -77153 49361 4362 -16319 68943 -52698 -74138 97480 -7574 -68910
99 -68910 102496 -12317 -129824 87708 60426 -94051 49939 31926 -109430 51944 68900
110 68900 -86979 39242 48352 -125308 35716 118716 -101376 -25370 102612 -82442 -45318
121 -45318 121528 -25360 -72244 56351 -18274 -35107 71131 -13311 -48941 43876 -21329
132 -21329 -32534 74561 -7020 -63852 40373 2237 -36667 57364 668 -61162 40192
143 40192 7264 -50760 61840 21947 -90625 26909 57747 -62155 8496 59492 -59124
154 -59124 -25699 57899 -14662 -15316 31057 -31781 -16308 44356 -15949 -16628 38719 -25690 -34671
167 -34671 49083 9119 -36247 18690 3385 -26167 22629 11672 -19946 12292 -5491 -23825
179 -23825 31578 13411 -36959 10321 17716 -29018 8439 27033 -22152 -8661 12410 -11563
191 -11563 9481 14976 -25892 843 22606 -23712 -1884 35535 -20318 -25959 29683 3628
203 3628 -19940 16273 2227 -17905 10471 3627 -7966 14513 -5689 -20766 19066 9986 -22307
216 -22307 8075 12808 -20420 -295 16922 -6957 -3663 2538 -8286 7594 7508 -14810 4958
229 4958 12451 -18752 -1362 23323 -9520 -14281 13896 691 -8048 7999 -598 -4402 5640
242 5640 -6412 -1981 15279 -7383 -14526 14959 4168 -16124 6921 9544 -12087 -2115 7514
255 7514 -1673 326 -1244 -5197 7064 2462 -10603 5632 9209 -12217 -3089 13651 -2316 -8496
269 -8496 4946 2911 -2725 -161 -318 2692 1568 -7296 696 9709 -5231 -8220 8242 2915 -8909
284 -8909 1195 6021 -2935 -3566 616 2505 2034 -4362 -2657 7125 223 -8364 4395 7530 -7357
299 -7357 -3966 8334 1053 -5896 890 3655 -142 -2527 -1133 3709 1651 -6107 -658 7318 -2219
314 -2219 -7099 4252 4474 -5708 -2479 4855 980 -4058 -1490 3482 2168 -4277 -1785 5818 493
329 493 -6382 2077 6162 -3341 -4053 4096 2785 -3098 -2010 2652 2762 -3109 -3443 4576 2752 -6436
345 -6436 -1092 6595 -1737 -5878 3093 3556 -3635 -2375 2378 2078 -1667 -2987 1976 3888 -3393 -3284
361 -3284 5413 1993 -5939 406 5777 -1423 -4143 2061 3443 -1627 -3182 1817 3584 -2729 -3844
376 -3844 3853 2846 -4946 -1648 4353 -134 -3985 413 3172 -452 -3718 16 4416 -479 -4837
391 -4837 2094 4428 -3632 -2566 5025 1369 -4511 -213 3828 662 -2726 -873 2989 630 -3908
406 -3908 814 4559 -2736 -4569 3346 2936 -3209 -1720 1814 684 -1781 -1564 2678 2272 -4707 -2130
422 -2130 6170 479 -5518 2345 3627 -3891 -1173 4135 771 -2035 -1479 642 3333 -688 -3539
437 -3539 2909 1971 -5540 377 6197 -2444 -4840 2013 1802 -1093 -491 -94 1026 -1111 -3590 3240
453 3240 4807 -5270 -3366 5531 21 -3378 3398 1340 -3406 -324 1136 2133 2038 -4270 -2166 5555
469 5555 -799 -4144 5049 991 -7271 1224 5392 -1674 -1903 -516 -1045 1892 -252 -1825 3658 -927
485 -927 -6691 3875 6095 -4981 -2024 3862 -1828 -1021 3221 107 -238 -993 -3233 3900 4475 -5825
501 -5825 -1275 5446 -3770 -2782 6636 -266 -5636 1050 1026 36 2148 -2560 -2061 3294 -2276 -2112 6346
518 6346 -546 -7281 2500 4407 -2437 116 1397 -1715 100 166 812 3896 -2670 -5455 4775 3391
534 3391 -5115 1404 3303 -5125 -1083 4686 -393 -1234 -661 -2849 2422 2886 -4061 372 3520 -5160
550 -5160 -1465 7309 -918 -5314 2165 1229 -1401 2184 163 -1410 1101 -1745 -431 5486 -1127
565 -1127 -5940 3067 3003 -3995 964 3384 -3488 -2352 2330 922 354 -1085 -2862 1710 1986 -2984
581 -2984 928 3214 -4167 -2355 5153 832 -3237 727 609 -711 1234 61 114 1234 -2611 -1071
597 -1071 4854 -45 -4622 1935 2077 -3263 561 2767 -1817 -1557 -33 89 2141 -653 -3517 2327
613 2327 1862 -4257 1351 4506 -4056 -2636 4443 151 -1979 1637 -488 -707 1641 -1255 535 2996
629 2996 -3434 -2246 5149 -366 -3913 2909 453 -3550 1883 1199 -1763 1340 -1634 -2451 4651 36
645 36 -5296 3604 2252 -6083 2112 5277 -4430 -1655 3557 -1366 168 2118 -2518 670 2061 -3749
661 -3749 1543 4643 -4955 -2195 5520 -1816 -2883 3935 -1166 -3061 2677 -785 -1150 3323 -2864
676 -2864 -3044 5347 -427 -4767 4310 1323 -5454 2342 3528 -3016 274 1070 -1892 2268 718 -3100
692 -3100 2877 1221 -5118 2483 4295 -4886 -874 4085 -2656 -1231 3106 -1908 -818 1926 -2775
707 -2775 358 3797 -3890 -1832 5123 -1985 -3554 4718 208 -3981 2501 1105 -2179 2025 -56
722 -56 -2212 3104 -140 -3636 3559 1731 -5049 1440 3720 -3673 -749 3167 -1811 -1105 1549 -1291
738 -1291 334 1285 -2947 503 3182 -3183 -1151 4270 -1667 -2902 3351 520 -2482 1642 322
753 322 -1123 1808 -717 -1394 3053 -660 -3193 3221 1234 -4161 1459 2655 -3041 -242 1855 -1729
769 -1729 349 1000 -2310 1123 1539 -3508 848 3677 -3464 -1588 4157 -1150 -2444 3015 57 -2042
785 -2042 1610 -21 -645 1991 -1377 -1686 3221 -333 -2961 2689 890 -3595 1126 2075 -1967 -127
801 -127 641 -1293 1055 255 -1998 1731 874 -3281 1234 2950 -2730 -815 2814 -1126 -1039 1829 -372
818 -372 -390 985 -1160 396 2052 -1938 -894 2748 -1093 -2102 2289 359 -2149 585 545 -719
834 -719 459 -576 -525 1414 -932 -1579 2280 443 -2695 1056 1815 -1789 -287 1682 -447 -552 508
851 508 -41 589 304 -1238 505 1239 -1369 -466 1824 -518 -1643 764 846 -803 -495 212 132 -368
869 -368 -659 453 755 -1011 -828 1259 475 -1087 171 1014 -387 -621 630 669 -186 -624 159 901
887 901 -18 -880 505 885 -974 -664 1377 198 -1552 76 1016 -529 -775 440 174 -502 -360 157
905 157 634 -188 -911 542 1051 -799 -491 1314 99 -1038 550 904 -344 -421 155 441 176 -617
923 -617 -118 857 -421 -1029 815 657 -1325 -491 947 -107 -762 97 372 -152 -535 84 871 -83 -1099
942 -1099 455 1111 -577 -486 958 41 -778 365 713 11 -446 -438 448 633 -731 -467 921 -393 -1243
961 -1243 928 885 -1334 -695 764 -58 -387 286 -38 -165 -262 -248 873 585 -1202 -324 1357 -164 -587
980 -587 1031 118 -1071 179 904 162 -100 -624 -317 732 -104 -542 815 -280 -1665 541 1332 -714
998 -714 -654 118 -313 166 370 -80 316 -508 -1142 1286 1522 -1485 -477 1174 -744 -310 1776 -53
1016 -53 -1339 67 140 414 922 -950 -919 812 -371 -387 1617 -338 -2126 364 1049 -308 188 -286
1034 -286 -1041 241 338 109 1000 -557 -1814 1014 1489 -688 68 356 -1066 63 1196 184 34
1051 34 -701 -1254 1074 1223 -1199 -177 548 -1552 -271 2045 -215 -1521 -31 -106 113 931 -228
1068 -228 -599 18 -640 328 1861 -331 -1529 348 554 0 809 161 -953 -312 127 724 1031 -761
1086 -761 -1490 514 671 -355 556 196 -1575 -582 1112 682 -202 -891 -714 411 549 146 531 -365
1104 -365 -1521 295 1825 272 -823 -282 -182 21 945 592 -396 -865 -581 693 1203 -201 -1062 -422
1122 -422 -11 166 806 274 -974 -1063 -6 974 738 -551 -1013 69 330 131 980 450 -1635 -773 1553
1141 1553 954 -438 -37 -369 -763 506 1137 183 -693 -1001 -247 1148 689 -707 -378 -323 -690 623
1159 623 1386 -525 -1319 -206 331 610 666 -381 -752 -161 -17 809 1169 -713 -1424 278 856 344 388
1178 388 -230 -912 -280 562 847 420 -1125 -1201 637 719 -201 274 -220 -1408 -20 1387 440 -611 -746
1197 -746 -437 470 728 140 157 -521 -1076 690 1632 -164 -791 -40 -276 155 1111 192 -800 -450 -388 417
1217 417 1228 -344 -1268 -45 72 -190 909 279 -1280 -637 412 526 610 -293 -979 127 375 -24
1235 -24 958 312 -1558 -205 1429 80 -172 343 -779 -431 827 447 -12 -178 -1059 -137 1228 -153
1253 -153 -677 324 -649 -717 1103 505 -846 -162 -283 -247 1064 202 -883 372 -29 -744 1182 940
1271 940 -1309 -259 781 -280 345 687 -731 -302 306 -267 661 469 -1376 -272 945 -576 -113
1288 -113 927 -854 -891 782 118 -138 436 -690 -420 1004 -138 -334 952 -446 -955 1099 490
1305 490 -729 309 32 -580 626 172 -454 471 -326 -905 967 376 -1145 243 427 -951 210
1322 210 650 -629 -124 201 -499 481 481 -861 143 657 -728 127 1106 -632 -535 748 -45 -203 536
1341 536 -370 -260 465 -368 -185 766 -662 -777 762 -22 -648 403 -44 -565 282 118 -214 344 -356
1360 -356 -436 739 139 -620 508 335 -658 299 679 -423 -154 321 -178 166 278 -393 24 207 -508
1379 -508 47 513 -430 -429 364 -56 -282 130 -43 -128 15 -163 107 267 -386 -91 566 -42 -255 395 167
1400 167 -326 189 261 -56 0 -41 -101 313 -51 -318 280 47 -452 96 333 -333 -285 209 -33 -146 14 -21
1422 -21 76 -7 -213 192 253 -339 -74 366 -75 -237 301 136 -158 66 114 80 83 -174 -7 194 -190 -190 224
1445 224 2 -414 28 99 -119 -92 -73 -61 44 -183 -49 295 -44 -415 251 390 -250 90 343 -173 -125 262
1467 262 113 -3 -74 -166 210 238 -249 -40 220 -346 -192 415 -12 -427 -125 81 29 14 -81 -42 -43 -158 91
1490 91 328 -107 -240 175 59 65 219 -21 -111 36 -27 200 377 -278 -467 293 191 -384 105 144 -520 -181
1512 -181 356 23 -203 -85 -236 -23 204 19 -112 14 -243 -122 571 197 -367 -7 177 -8 194 333
1532 333 -56 -244 -78 164 299 -33 -370 -118 92 -97 43 235 -326 -506 128 306 -36 -65 -187 -228 7
1553 7 223 226 55 -274 -276 312 350 37 -7 -133 -122 226 277 58 43 -366 -294 479 296 -266 -43 10 -417 157
1577 157 504 -152 -445 -49 -25 114 281 -158 -170 -38 -138 245 586 -319 -429 249 167 -2 375 57 -379
1598 -379 -23 209 140 173 -261 -326 125 103 25 141 -241 -439 85 140 79 205 -326 -442 371 303 -232 246 79
1621 79 -653 153 762 -159 -200 207 -170 -56 401 89 -167 -111 -223 113 388 -158 -289 30 -221 -106 389
1642 389 30 -486 -130 12 -39 277 -54 -350 13 88 12 327 111 -331 -111 301 168 139 18 -137 -79 112
1664 112 163 227 -78 -416 15 274 -84 -78 62 -255 -341 249 210 -167 -67 -117 -98 148 17 -74 39 -68 -148
1687 -148 316 215 -239 -2 134 -72 138 223 -186 -7 176 -168 125 313 -420 -225 381 -119 -327 332
1707 332 -82 -523 153 170 -248 54 -41 -143 224 -6 -112 223 -1 -294 364 241 -337 189 170 -258 252
1728 252 252 -373 138 196 -433 172 354 -550 -200 415 -354 -168 373 -309 -240 356 -145 -99 334 -368 -149 579
1750 579 -242 -223 608 -157 -439 584 125 -382 311 43 -304 384 54 -337 310 -29 -449 427 92 -622
1770 -622 216 165 -497 193 218 -450 98 207 -432 254 386 -541 143 495 -448 83 495 -389 -90 512 -248
1791 -248 0 389 -325 -105 510 -387 -179 519 -387 -419 558 -169 -460 424 -181 -455 417 -75 -346 462
1811 462 -114 -468 582 91 -514 418 154 -573 379 348 -413 211 222 -414 297 275 -489 204 295 -500 146
1832 146 458 -566 -94 405 -474 -20 408 -432 -105 439 -419 -91 593 -344 -286 654 -212 -373 556 -22
1852 -22 -352 455 18 -324 420 -31 -302 433 -52 -512 449 129 -575 279 248 -510 164 260 -484 120 257
1873 257 -437 151 257 -426 62 386 -357 -59 450 -228 -80 386 -178 -88 381 -157 -111 345 -224 -147 390
1894 390 -174 -310 249 -100 -210 296 -28 -309 178 -17 -190 274 -27 -329 265 71 -301 237 192 -368
1914 -368 160 260 -236 127 180 -256 40 298 -237 14 282 -272 -112 302 -192 -224 252 -89 -216 214 -6
1935 -6 -188 146 -97 -253 174 64 -361 197 169 -299 143 299 -213 -29 256 -148 -74 315 -14 -78 220 -53
1957 -53 -106 263 -46 -227 222 -7 -280 126 113 -232 26 -35 -174 77 30 -162 124 64 -243 212 198 -286
1979 -286 44 249 -199 17 272 -125 -65 247 -163 14 339 -233 -152 301 -143 -224 288 -106 -382 238 32
2000 32 -191 191 -90 -291 227 61 -256 275 20 -369 311 202 -319 213 176 -357 175 310 -219 83 166
2021 166 -371 79 362 -385 -111 229 -296 -203 366 -217 -276 159 -93 -150 327 -94 -228 239 -84 -127 368
2042 368 -20 -249 200 92 -169 291 95 -276 135 5 -105 208 -6 -356 110 128 -195 157 6 -315
2062 -315 -14 199 -154 16 -15 -269 34 162 -92 26 147 -241 -65 256 26 -92 159 12 -41 180 43
2083 43 -28 20 -27 -80 155 12 -176 -33 -25 -84 61 29 -145 -130 -20 36 22 59 -55 -45 24 30 90 -24 21 -1 88
2110 88 148 19 -60 64 39 -7 70 41 -73 -14 5 53 63 -71 -117 3 -31 -30 157 -90 -159 89 63 -63 41 25
2136 25 -118 57 127 -61 65 94 -117 73 166 -123 -54 83 -44 10 134 -88 -56 70 -84 59 119 -213 -57
2159 -57 94 -197 -54 208 -163 -141 167 39 -81 133 -69 -117 209 15 -54 224 -62 -174 203 111 -48 96
2181 96 -23 -156 124 100 -113 79 -22 -248 47 187 -212 -3 -11 -217 49 143 -39 -25 -39 -92 155 150 -108
2204 -108 16 71 -114 164 341 -137 -96 67 -92 73 277 -130 -199 102 -80 50 188 -266 -266 125 -37 -31
2226 -31 169 -125 -192 140 17 9 184 -145 -271 225 111 -89 202 -12 -316 159 217 -48 -13 6 -237 98
2248 98 201 -112 19 -33 -219 78 210 -88 -184 8 -186 12 210 -104 -208 16 -31 11 185 -93 -170 21
2270 21 43 62 212 61 -126 -21 100 117 143 -83 -201 14 37 11 121 -76 -220 63 101 -14 -9 -109 -229
2293 -229 -73 112 88 17 -79 -114 6 162 91 29 -83 -108 55 166 78 -34 -32 -58 77 182 -28 -83 -53 -75 -13
2318 -13 174 68 -161 -103 -52 48 88 17 -109 -109 -41 91 106 38 -69 -78 59 112 24 62 -21 -86 42 178 2 -52
2344 -52 2 -95 30 92 -11 -42 3 -96 -2 154 -40 -117 -4 -49 10 137 -17 -81 42 -27 10 110 -11 -94 87
2369 87 75 23 119 112 -84 38 78 -23 100 80 -67 -46 9 -62 24 18 -112 -66 50 -3 43 18 -46 -38 34 13 32 -12
2397 -12 -88 28 63 -20 83 43 -42 25 63 16 27 -40 -32 48 38 -44 42 61 -97 16 74 -74 -71 30 -41 -2 44 -28
2425 -28 60 73 -98 49 126 -4 -16 106 -61 59 102 0 -8 72 -44 52 99 -69 -47 114 -101 -80 118 -11
2449 -11 -129 102 -29 -59 39 -29 -69 72 -10 -98 128 33 -74 123 34 -108 118 116 -103 100 37 -43 131 98 -64
2474 -64 18 17 -159 38 79 -77 -21 -22 -104 -18 80 -133 -9 106 -79 -4 121 -49 -8 86 -72 -61 113 -37 28
2499 28 103 30 6 106 -1 -45 92 20 -45 74 21 -106 17 19 -90 -35 35 -69 14 26 -32 -38 -8 3 0 86 -4 17
2527 17 80 -2 -63 56 6 -8 -16 33 21 -42 87 44 -50 15 -29 -70 28 55 -47 67 -24 -95 -8 34 -106 6 45 -47
2555 -47 29 77 -59 -7 40 -30 -15 144 -59 -3 121 -9 22 171 11 -60 50 18 -9 97 -70 -172 62 -45
2579 -45 -97 139 -50 -169 60 55 -128 72 24 -142 116 101 -99 91 139 -142 74 212 -97 -12 115 -92 67
2602 67 190 -99 -19 115 -183 -11 151 -137 -76 157 -138 -110 204 -114 -132 137 -38 -83 200 -109 -161 155
2624 155 30 -115 213 -21 -170 210 105 -101 127 36 -257 128 143 -123 120 54 -246 69 169 -225 5
2645 5 78 -222 4 235 -183 -76 140 -197 -11 231 -89 -84 184 -143 -83 319 13 -100 165 -45 -33 273
2667 273 -21 -222 76 -32 -122 205 3 -276 75 63 -144 158 19 -323 87 170 -139 96 41 -312 47
2688 47 261 -118 97 102 -324 16 283 -72 29 83 -221 -29 321 -98 -111 118 -176 -114 318 -47 -195 84
2710 84 -100 -121 263 56 -252 74 -62 -101 253 77 -210 25 76 -85 299 153 -263 -54 71 -41 206
2731 206 126 -295 -35 105 -72 115 85 -318 -148 136 -34 30 40 -267 -113 178 28 62 55 -149 -97 261 12
2754 12 -98 133 -139 -133 274 185 -117 25 -50 -134 254 133 -175 -11 -64 -103 233 179 -188 -76 11 -94 178
2777 178 86 -225 -102 68 -30 89 91 -150 -98 91 48 109 158 -140 -144 91 114 57 99 -83 -111 104 73 17 58 -69
2803 -69 -154 117 107 -31 37 -98 -171 86 94 -56 -37 -10 -140 92 155 -40 -5 -20 -55 129 182 -72 -15 20 -63 110
2829 110 75 -99 -59 47 -30 100 119 -133 -160 -36 -22 75 95 -96 -68 47 11 16 79 -135 -64 115 3 52 85
2854 85 -71 -81 90 40 -25 67 -82 -98 103 92 -78 -22 -63 -91 52 99 -61 13 -79 -37 40 46 -44 -20 -25 -51 157
2881 157 102 -92 30 40 -48 70 138 -78 2 70 -10 85 107 -58 -41 74 -20 7 109 -51 -134 57 -1 -11 36
2906 36 -83 -107 67 30 2 65 -88 -57 102 27 15 49 -50 -14 44 61 -4 77 -48 -50 66 91 8 16 -51 -49 52 23
2934 23 25 -28 -46 -70 84 62 -32 -36 31 -27 -10 59 5 4 -54 -5 59 60 40 -21 -24 -52 61 6 -34 5 -48 62 -5 3 -28 3
2966 3 -57 -61 25 8 -18 6 -54 -31 36 12 -26 14 -22 -1 120 42 2 59 17 16 118 54 -59 33 28 -67 38 35 -59 -32 26
2997 26 -87 -14 30 -86 -51 64 -127 30 92 -5 -15 95 -44 22 63 -8 -73 90 -35 -28 143 -49 -100 98 25
3022 25 -2 77 -16 -58 54 4 -54 55 -73 -135 110 22 -125 40 24 -104 32 48 -93 51 14 -34 41 88 -32
3047 -32 15 40 -58 23 135 -47 14 48 -71 -10 39 14 -2 28 -69 -68 92 -57 -93 46 -80 11 80 9 -71 55 -23
3074 -23 -116 95 -7 -93 35 -41 -11 81 12 -88 29 102 -25 19 18 -9 -17 44 -103 -18 -43 -90 -14 38 -13 -36 -9 -27
3102 -27 13 29 -15 -11 76 -72 -17 57 -12 -21 -19 7 3 79 -37 -29 92 -5 3 30 -24 -23 46 -24 -64 28 8 -91 30 44 -89
3133 -89 16 -12 -38 -1 84 3 15 31 12 27 70 -2 -6 76 -26 8 80 -23 -14 43 -13 -16 41 -67 -4 -27 45 17 -7 -36
3163 -36 -75 18 16 -11 -21 19 -15 10 62 25 14 -33 16 59 55 40 -13 3 40 42 23 28 -88 -51 -42 34 21 14 -67 -3 47 -16 -7
3196 -7 67 -43 -3 39 16 28 3 -14 2 20 13 4 50 -27 -37 89 108 24 29 -44 -39 75 76 -32 -27 -26 -72 87 8 -48 -24 12
3228 12 -81 -15 61 -88 -50 52 -58 37 82 -61 -48 50 1 59 112 -83 -64 68 -18 -1 67 -88 -108 89 41 -74
3254 -74 45 -82 -129 81 14 -89 1 -85 -86 91 61 -40 46 -17 -75 45 134 -51 31 0 -56 51 175 -23 -4
3279 -4 -6 -75 25 116 -83 -110 6 -51 18 101 -92 -136 -5 22 8 35 -93 -94 76 74 -9 84 -51 -120 66 62 6 126
3307 126 60 -87 -1 105 11 69 -5 -65 85 122 -51 -23 -13 -75 1 106 -38 -105 -17 -74 36 126 -30 -86 26
3332 26 -12 22 134 7 -83 -7 113 7 91 30 -99 5 86 35 66 26 -114 -19 72 11 29 29 -91 -27 88 -36
3358 -36 -52 11 -80 -66 111 4 -28 46 -38 -20 136 22 -37 75 -46 -7 140 19 -36 40 -32 -35 39 0 -73 -20 11
3385 11 -56 58 25 -123 35 -6 -94 53 99 -134 36 71 -20 38 46 -121 -13 83 12 -13 65 -63 -62 90 -26 -15
3411 -15 40 -141 -4 62 -12 -44 65 -101 -80 55 -20 -48 58 -34 -137 74 84 -81 8 14 -116 114 51 -88 25
3436 25 30 -90 86 80 -36 63 26 -46 35 42 -13 -29 37 -37 29 70 -61 -34 27 -29 40 27 -12 -77 67 -28 58 36 -30
3465 -30 -32 50 1 -42 53 1 -57 50 14 -49 7 -6 -68 62 51 -34 32 14 -76 15 68 -42 32 11 -40 67 65 -20 5
3494 5 9 -41 -24 86 -50 -42 9 36 32 65 8 -54 34 71 -15 21 -32 -45 44 -20 3 14 43 -64 32 34 -13 -1 9 -55 50
3525 50 -19 -26 26 -23 -34 55 53 -44 -22 28 19 -44 71 27 -30 30 -6 -28 21 33 -23 7 -37 -19 9 8 -60 -3 -17 8 22 -23
3557 -23 -33 -32 -24 33 48 18 9 -4 -10 -2 57 59 16 -16 55 49 12 15 34 29 21 34 31 53 -25 -38 -13 -30 -18 5 4 -51 -33 -14 18 62
3593 62 -30 -51 60 5 -8 53 53 -18 -5 71 28 17 -27 -26 -38 79 41 18 46 -32 -59 -27 -39 -44 -4 30 22 58 36 18 -4
3624 -4 -9 3 -18 -6 -22 -4 -16 -11 14 31 -11 23 -14 -44 -13 -18 -11 -48 24 -44 -29 39 -19 -46 9 30 -10 55 12 -19 55 -16 28
3657 28 69 -20 -11 15 38 9 42 29 -12 24 35 -68 -7 22 -39 7 15 -39 18 20 -9 -13 9 8 8 13 -45 -43 55 -24 -25 55 1 -44
3691 -44 44 18 -31 54 -20 -41 38 75 -28 39 53 1 33 35 -38 0 -13 12 -20 7 -30 -50 16 -43 30 81 -14 9 20 -22
3721 -22 30 33 19 -29 34 -23 10 66 -12 5 86 46 -33 46 17 -36 1 -12 1 59 1 -87 37 42 3 26 -27 -83 -4 11 -62
3752 -62 -13 45 -58 -8 27 -85 -9 17 -31 -16 67 13 11 30 -42 23 31 -22 -34 17 -31 1 6 23 -10 30 -38 -11 7 29 -40
3783 -40 8 0 -33 10 -2 -4 16 -41 -13 1 -8 13 -5 -19 -61 24 -9 -31 12 -11 -54 23 -31 -45 -3 19 -62 -34 12 -29 -75 -5
3815 -5 -3 -13 39 -10 -8 20 -23 27 2 -25 47 36 11 -23 33 14 22 -24 -3 5 10 -27 -22 -5 -8 14 14 -18 2 47 48 -12 42 17 18 48
3851 48 16 18 26 -48 16 24 -8 20 13 24 13 33 30 4 29 4 -32 16 -52 13 -51 11 -7 -30 -9 -47 12 -8 -16 9 3 34 -7 -66
3885 -66 -5 -16 39 20 -16 37 -48 4 26 26 29 0 31 -8 68 -6 -4 -41 -40 -13 19 9 -1 -11 -14 -20 35 -2 -10 66 -10 -21 33 43
3919 43 17 -12 -5 26 26 -15 45 25 -7 0 5 14 -8 -37 -20 -22 -44 -6 -9 -42 -14 27 61 4 40 7 -2 17 21 -3 -17 -25 5 44 -6
3954 -6 -21 31 38 -12 81 15 -4 13 -30 -35 47 -58 1 0 34 -38 -19 -15 -89 -31 9 23 74 -19 -17 51 19 -11 -1 48 -43 -4 48
3987 48 13 -9 31 -21 -55 -24 -9 29 26 -36 -16 4 -22 -23 -3 -34 36 22 23 -33 -13 2 -60 -1 -9 -7 34 29 -14 47 -30 -55 -29
4020 -29 60 -7 -2 51 -34 35 20 -49 -3 0 39 -11 29 3 -25 -8 -25 6 27 -36 -12 26 -86 45 38 24 30 49 -3 -3 49 -25
4052 -25 -41 23 5 -13 40 3 0 24 -21 -54 38 -9 -90 0 -4 -35 47 12 -23 17 15 -30 14 32 -16 19 26 14 17 26 14 -36 30
4085 30 -5 -15 106 18 -8 21 52 2 7 29 -57 65 -27 -27 -44 -31 -10 -9 -23 -19 8 -16 1 -37 6 46 2 23 -19 57 -26
4116 -26 6 62 25 -23 52 -36 4 4 -15 15 -43 21 -45 11 -39 51 44 -4 -52 38 12 -3 -16 25 32 -12 -7 5 -9 -2 18 1 5
4149 5 5 40 38 40 -24 14 -15 11 -26 20 -9 -6 -2 10 58 -5 -27 0 20 37 6 25 12 -59 -38 14 -13 -32 16 -25 0 -17 38
4182 38 11 35 -4 3 33 58 4 31 11 29 40 50 -75 12 1 10 -39 6 -41 26 -8 1 2 28 60 28 96 3 -25 17 -16 -26
4214 -26 16 84 0 10 -33 -39 33 -27 -32 -39 37 18 4 91 -3 0 28 -13 -3 -18 21 -34 17 5 19 -1 -23 -45 -1 -22 7 4 1
4247 1 9 -24 60 15 61 2 -52 31 0 -43 -19 -24 -16 45 21 -53 16 -21 -53 19 -18 -50 -4 60 -30 48 20 -42 -57 25 6 13 36
4280 36 33 -5 3 -2 8 32 -21 -1 24 -81 -9 4 -14 -3 20 -20 -37 -2 -43 -4 19 -2 -8 32 30 -43 13 53 -36 26 46 -30
4312 -30 12 80 4 -23 22 -9 -14 29 -32 -25 32 -48 -13 -8 1 -43 23 -2 9 57 25 -26 4 -17 -58 67 3 20 31 -22 -9 15
4344 15 38 -28 -19 56 -21 -1 28 -30 54 36 -55 -8 36 -7 41 0 -61 17 57 -61 18 52 42 7 32 1 14 34 -4 18
4374 18 18 -71 27 63 5 -51 5 20 -77 22 42 -48 -49 -12 -32 39 13 -31 -15 24 -15 24 29 -78 9 81 -90 -7 -1 2 -10 108
4406 108 -7 10 16 -12 -31 34 6 -10 36 -24 -17 57 -27 -27 58 -37 -14 4 10 4 -8 3 -24 41 -8 -8 70 40 -44 0 16 57
4438 57 -9 12 -19 -3 29 -38 41 24 -30 -26 -33 -29 -3 47 -17 -44 23 18 36 -15 6 -12 25 22 31 -41 19 48 47 -9 -19 50 56 2
4472 2 -11 -43 -14 46 -4 17 -53 59 15 30 -31 -57 -9 -2 -33 -26 5 2 -10 11 8 14 33 45 7 63 1 -19 25 16 -57 8 16 3
4506 3 22 46 -9 5 -8 -39 -5 -21 -6 -36 25 -1 -11 -29 -1 -49 17 -36 56 -27 2 -57 -2 -25 -41 50 -14 19 0 -44 -29
4537 -29 8 -29 13 39 -1 -16 -26 -2 -48 33 14 19 -57 -16 -19 -14 2 3 -17 -25 33 -32 33 0 -41 24 30 -19 11 15 -9 -4 1 -36 -37
4572 -37 24 -4 27 -7 -4 51 3 9 16 17 46 -12 3 -18 -33 65 -10 -19 -13 23 16 53 -17 -20 -7 25 -28 -42 14 20 17 55 -88 -32 14
4607 14 -3 46 16 -21 5 -26 1 6 17 -38 8 12 -58 11 -29 -27 -33 -25 4 -9 57 54 -14 38 26 -10 54 2 -62 42 42 -24 7
4640 7 46 -112 -4 7 -14 -29 35 -24 -6 49 -47 11 6 -46 -3 3 -31 46 50 -8 -3 80 41 42 73 -4 10 90 23 -28 40 8
4672 8 10 12 25 43 6 -1 0 7 -8 27 43 38 -22 -22 36 -52 50 7 -62 43 -26 -11 -46 42 10 3 -21 -6 39 -43 -25 -5 26 -12
4706 -12 10 11 -26 28 42 -44 -1 33 -5 5 62 20 -35 -15 31 -22 -17 -46 -36 4 46 -2 39 11 -54 18 39 -48 0 25 -4
4737 -4 -40 5 -49 33 41 21 0 7 -13 0 13 -43 -7 16 -44 7 -16 -8 54 -3 -1 -25 36 13 7 2 -64 -11 -7 0 48 54 -18 15 -12
4772 -12 -10 50 -10 21 22 60 -14 20 19 -31 15 11 -29 -17 0 -47 39 6 50 -4 18 13 -54 30 32 -39 13 -13 -11 0 21 -16 -15 56
4806 56 29 -14 -59 -6 11 16 -24 -31 33 5 27 -12 3 -39 -18 63 -14 68 -15 38 -15 25 40 9 2 -16 -6 -18 21 29 -15 -34
4838 -34 -4 23 10 17 44 24 78 27 -21 37 -13 -29 0 1 -5 16 -6 -2 10 -51 -38 34 -2 -16 -71 1 -26 -42 3 -58 56 27
4870 27 -38 -14 -19 0 4 50 30 -12 -14 -1 40 19 -18 19 0 26 -14 13 -21 0 19 -13 -8 -5 -38 40 -2 8 -5 -38 -28 25 0
4903 0 -7 -8 10 4 -8 6 -9 -39 -5 8 15 9 42 -27 -9 28 7 5 -14 33 -13 15 -50 -11 -27 1 21 -17 -54 7 -34 -9 -9 23
4937 23 -21 -14 11 -56 10 -36 -11 26 29 -21 -6 -4 21 42 -58 -36 21 24 48 31 24 -15 -23 26 17 -68 90 -2 -50 -9 16 34 -30
4970 -30 65 -1 -19 -20 15 -12 -20 -29 33 44 60 -14 0 -5 10 -4 30 20 13 48 23 -66 52 32 -3 -26 17 16 21 46 -35 13 39
5003 39 11 0 -17 22 -37 -39 28 -35 -13 17 -53 4 41 56 35 -4 8 -6 -9 -2 -29 -13 -2 -6 7 -47 5 -52 -8 0 7 4 14 -4
5037 -4 -3 -19 -8 -7 15 30 29 -14 66 15 29 53 -17 32 -23 13 7 67 3 19 11 34 -20 14 42 -15 74 24 -26 34 22 6 7 -54
5071 -54 0 17 27 23 5 -36 20 -14 13 -45 5 21 -65 21 -7 0 -8 15 16 -34 43 5 9 -1 13 10 57 -39 14 -19 -4 55 13
5104 13 12 58 35 -13 27 5 6 -3 7 14 62 -9 22 37 12 -1 -14 -7 5 -25 -29 -4 24 45 -5 20 -37 4 -17 -31 -4 -57 26
5137 26 -29 11 12 31 -31 39 -10 -27 16 -26 6 32 27 -60 39 -29 68 -16 1 42 18 21 11 -41 -17 16 -40 -9 -3 -4 -11 -1 4 -16
5171 -16 18 13 -3 -20 -22 28 67 27 1 20 0 29 6 15 6 22 5 -39 -3 30 26 -22 -21 -8 2 1 -32 -28 39 -79 -13 -48 7 -19
5205 -19 -13 -10 32 45 13 4 -22 27 0 45 -39 43 24 10 5 2 26 22 3 -5 35 26 -28 -28 1 -20 -2 33 -49 3 11 9 5 -18 7 1 35
5242 35 4 15 -7 -7 -24 13 -40 47 9 -20 -5 26 -51 -14 66 11 -20 -64 37 25 -18 13 4 39 -43 7 27 -48 68 18
5272 18 -5 -33 -18 -22 -100 15 -12 32 -14 -31 -3 -3 -10 28 14 39 16 -7 11 14 5 -34 9 -5 34 -5 -8 47 -29 7 -2 28 48
5305 48 38 -15 -58 26 -19 -1 26 -6 30 -33 6 24 68 25 -35 -21 5 -11 21 -18 -15 -47 -40 -41 30 -36 -5 21 30 -30 23 58
5337 58 -50 -4 -13 54 21 -18 44 57 27 20 3 -15 -6 -30 30 -25 -29 -52 -17 26 2 4 13 4 34 -37 7 9 -35 -24 31 24 48 9
5371 9 1 -12 -3 39 50 26 -32 57 -4 -13 -19 3 20 12 20 23 35 32 -2 -25 -20 7 -7 -28 14 24 -34 -13 20 22 56 -17 15 12 47 -23
5407 -23 0 -17 -9 14 -13 -19 -1 -22 17 -37 0 31 29 72 -11 -20 0 -53 25 56 -31 -3 -21 -18 -23 21 -18 7 9 6 12 37 -61 -26 -14
5442 -14 14 -18 3 13 6 -47 -34 -32 -44 -11 3 -21 4 -6 12 31 -25 27 24 -8 -20 11 -38 -30 64 -32 0 -23 20 7 -22 11
5474 11 16 43 -7 -2 31 3 -20 21 -34 -27 13 -19 -16 13 42 -2 -27 9 10 -45 2 5 39 22 4 50 -6 10 13 -18 4 17 6 26
5508 26 -63 4 -3 4 34 -55 -24 31 49 -25 61 6 39 38 4 33 48 33 11 2 28 -1 14 -6 22 -9 -3 -66 28 -1 -7 40 0
5541 0 18 9 -28 -21 -7 0 -35 45 11 -35 -10 -6 -5 -13 -24 -37 38 21 13 -1 -11 -6 15 39 11 1 7 -21 -35 -15 40 -48 -36 30 -11
5576 -11 48 3 9 -26 -18 -18 5 39 9 -47 3 -65 -26 21 0 15 8 26 -13 54 14 33 24 -20 -4 50 -17 24 -41 61 35 36 53
5609 53 -2 -3 31 -64 -39 -36 -55 2 5 36 -26 -6 17 -19 6 -42 12 73 16 22 -4 14 24 96 -20 8 -21 -14 0 -24 27 7
5641 7 -19 -34 -16 24 -7 -29 -17 35 22 50 -19 60 -25 -29 6 -34 20 13 4 -34 47 -7 31 5 -6 -11 20 -45 -18 14 -27 24 -3
5674 -3 -30 15 3 -42 2 -44 2 -7 -23 3 9 14 -35 25 -33 39 13 -5 -14 38 -21 26 19 15 29 7 23 0 50 -5 29 -12 -43 4
5708 4 -36 -15 -49 -77 12 11 -22 -10 -12 -41 -36 -16 35 2 37 -23 -9 19 27 -40 4 30 23 30 8 -3 -19 -7 -7 -4 29 26 1 23 -6
5743 -6 0 3 -13 -36 -44 -25 -25 -35 -5 -78 -20 -51 22 -17 -34 -4 23 36 21 1 -16 -15 -18 -23 -21 15 25 44 46 69 24 35 63 -7 30
5778 30 -1 18 1 -19 -11 -15 22 -3 -10 -7 -7 9 -2 -39 44 13 21 -50 15 9 0 -78 -6 -3 -31 23 4 38 -17 34 -57 -6 20 -34 -6
5813 -6 35 -4 0 -9 34 -7 -24 26 26 -20 13 4 -14 18 -7 -12 28 1 -18 -9 49 -22 -91 18 -25 10 -27 -16 -39 -2 -15 -57 20
5846 20 -8 23 -47 -45 -1 15 50 35 -4 -18 -20 2 23 19 -16 9 -8 21 27 -48 27 -10 53 2 -2 -11 26 -8 16 -16 35 -7 -39
5879 -39 14 -35 17 -25 35 -17 14 -20 -19 -30 -56 16 -13 -27 -71 63 18 -47 10 -21 -38 -19 32 20 -69 -12 22 -17 13 42
5909 42 -4 -25 0 29 -31 -18 -15 10 -31 35 -39 20 9 -21 20 -38 37 -8 -43 -39 -30 -87 -39 6 27 -30 -2 -32 -40 21 55 3
5941 3 14 50 31 83 30 26 73 4 22 11 22 41 -26 -22 15 9 19 3 6 -35 2 29 20 40 -4 -1 -46 -19 -39 46 14 9 -12 20
5975 20 -22 16 -3 -12 33 -27 1 -35 20 -31 0 18 64 49 11 66 58 4 12 -22 21 -10 -39 1 -19 60 39 16 -28 -22 -52 -26
6007 -26 23 -7 5 -50 19 -9 -1 29 -23 -28 7 0 38 -30 34 -38 39 19 -52 52 9 11 -5 42 64 -21 -40 15 18 10 -17 -16 -34
6040 -34 6 -20 -6 -32 0 37 -40 11 23 11 36 8 5 31 18 38 37 -4 36 47 27 3 -10 21 -31 -21 18 22 8 24 9 44
6072 44 59 41 24 4 41 -21 43 32 -29 28 -15 20 13 -37 -19 12 -38 0 25 -25 20 -32 23 0 -6 -33 -17 -30 21 -24 30
6103 30 35 32 29 -24 24 -7 39 4 0 17 4 13 22 50 35 19 2 -19 -57 -16 -72 13 -23 -41 -2 -26 2 6 -19 7 4 -12 25 -34
6137 -34 -20 -14 3 1 -6 -7 20 9 16 22 19 -22 26 22 14 63 58 -22 14 23 2 -5 74 3 7 17 6 -23 37 30 -12 -5 -16 -10 11 -30 -18 36
6175 36 -6 -26 32 -31 -22 -33 12 40 -3 -33 -45 1 40 31 30 27 13 19 33 -17 -17 10 -18 10 25 54 -14 8 36 -15 50 -25 -12
6208 -12 -49 21 -11 -4 3 46 -8 -4 1 -22 -6 -2 -45 49 40 28 13 -38 -6 46 36 -31 36 21 43 -10 25 -40 21 -15 50 55 -11 -3
6242 -3 -19 3 17 -27 -20 -18 2 -34 29 26 19 -1 4 41 -13 -35 -11 16 -11 -20 -61 26 -63 -11 20 -35 -15 -21 10 7 24 -10 5 23 21
6277 21 -14 -16 -4 10 -25 -18 51 62 15 -10 43 -9 -27 -12 52 -13 -14 -8 62 38 -2 19 6 10 -9 -5 -3 1 -4 -15 5 -37 56 -24 9
6312 9 -2 -1 -20 -67 -2 -7 -1 15 -15 1 13 15 9 47 -3 -21 43 -11 -12 17 37 7 -60 0 -23 12 9 -54 -30 -13 -7 -4 -15 5 22
6347 22 31 18 7 43 -12 14 10 -2 8 22 -45 30 -33 49 -28 22 -46 35 50 -16 0 15 -12 -36 51 54 40 12 -5 -18 29 27
6379 27 2 -26 28 28 14 30 -18 22 24 -9 -36 32 59 46 5 -48 23 33 42 -27 7 7 -44 -28 19 -48 26 48 25 5 49 -16
6411 -16 -4 0 -9 -9 -11 -26 48 43 11 22 -43 18 -18 13 -3 -50 -39 -26 5 -21 -3 -16 5 5 -4 -2 55 -11 69 49 -51 26 64 36
6445 36 28 -35 1 29 23 -59 -9 -55 -30 -10 15 -34 -6 12 -47 24 42 3 -39 1 28 31 41 -71 0 18 -10 -43 4 -51 7
6476 7 -3 -45 20 -7 -2 10 -20 54 -7 27 21 -42 -23 -8 55 8 3 37 44 31 -13 -51 25 55 -44 49 8 -25 0 10 42 20 14
6509 14 -16 -1 -37 -30 24 11 37 6 -18 55 19 -33 17 51 10 1 -34 3 58 43 15 6 48 1 -14 3 26 11 3 54 -11 -25
6541 -25 29 48 82 -48 3 -28 -8 -3 -27 -20 50 16 -4 51 30 -56 -11 0 15 21 3 28 49 -47 39 -25 32 -5 31 4 -12
6572 -12 39 8 1 -5 -24 -43 14 -12 6 2 -19 37 7 -20 -10 -39 -25 13 15 -40 -61 -4 22 78 -10 12 -11 -21 14 -31 -20 2
6604 2 11 -40 11 -53 7 10 -11 -22 12 -9 -32 29 16 44 -24 1 18 -20 -11 -4 -24 6 -3 -7 -3 5 47 31 -18 24 -2 -36 -6 18 -19
6639 -19 -11 26 10 -9 -5 -48 -5 -10 -7 1 42 -12 -4 -11 -20 -11 -8 -44 -45 -50 -6 -28 11 33 -16 20 -12 -12 9 14 30 5 8 -11 31 -8 -21 4
6677 4 11 -10 -37 -7 -19 5 3 43 -15 -34 19 -34 -33 -30 -34 8 9 7 31 -31 13 9 7 24 72 -36 40 70 -26 -63 8 29 -49 1 1
6712 1 55 -22 4 -44 46 39 18 30 8 -24 -15 29 -23 27 23 -5 -38 34 -15 -6 27 47 -31 34 -25 -1 19 -71 -53 -37 42 16 -74
6745 -74 12 -5 26 -4 5 42 -18 -50 -13 16 -30 3 35 -43 34 17 11 4 -47 40 -7 1 -12 18 -51 -37 13 -15 12 -31 -13 -51
6777 -51 -14 15 17 -10 22 -49 -21 4 -9 -14 15 10 -15 -19 -5 17 -28 49 9 9 16 0 43 16 -21 15 -20 -6 2 18 18 -40 27 12
6811 12 -7 -35 -79 -28 -18 11 37 -9 -5 -20 -1 -39 -11 -17 15 -43 15 27 48 7 -12 23 0 -66 6 -28 -26 -8 1 21 -5 -28
6843 -28 -15 35 5 -17 -51 10 25 -16 4 -16 -21 -12 10 17 32 10 -7 44 52 -12 -13 -25 29 57 15 -19 -41 -1 12 26 -17 10 26
6876 26 -26 51 28 -47 5 -40 27 2 40 -12 -12 -4 32 73 -37 -52 23 23 1 -22 63 -6 -44 59 43 -14 -10 8 60 -36 -24
6907 -24 -14 2 -4 12 -47 -28 -2 -38 19 17 -4 37 31 -1 -48 27 -30 -12 -25 23 -28 -44 29 -41 -20 16 -34 47 -8 -3 -28 23
6939 23 -1 -50 -25 -10 -41 -24 -20 18 12 -26 2 -11 49 -10 23 8 -15 24 5 9 -38 -29 -10 -51 -4 37 11 -18 1 3 29 -4 -13
6972 -13 -38 -28 -29 -4 -18 -18 24 18 -27 5 8 -16 14 18 -25 -8 -3 6 21 29 -14 38 1 41 -34 25 23 43 -53 -16 -29 -9 5 24 -8
7007 -8 35 2 32 0 34 5 -3 -47 4 -37 2 8 4 -52 44 -6 -22 16 18 47 -7 -6 9 44 44 -25 -24 -21 -12 4 -5 13 16 -6 43 -3
7043 -3 35 -63 -25 23 23 60 42 22 -12 23 -12 34 -10 18 28 -36 0 -24 -37 -24 -5 -23 26 -2 -19 10 -24 -14 -23 7 -22 38
7075 38 -3 -3 32 -38 2 -3 -30 -12 35 -18 -34 14 -13 -24 -31 17 16 65 5 17 -22 7 -6 -3 3 -7 14 -1 12 34 51 -11 -21
7108 -21 -4 21 11 22 -42 -32 -18 -1 -11 8 15 3 13 4 16 -26 31 4 -15 27 -9 22 16 1 15 13 -17 7 6 24 -15 7 -24
7141 -24 11 23 -16 38 15 3 -16 -8 27 -1 22 -4 -43 1 -36 -32 -13 -58 -36 19 -50 -20 -39 -21 18 47 -9 -65 15 -39 2
7172 2 10 2 -10 -29 63 51 -16 10 42 13 -5 -31 42 -28 -29 5 27 -18 3 -56 6 -7 10 5 14 -75 11 3 24 -13 9 51 33 -17
7206 -17 12 10 -19 40 44 -9 9 -3 -8 -29 -20 5 -6 15 8 27 -28 26 -3 -2 37 47 5 -16 -22 17 22 -39 -36 0 12 42 2 13 -15
7241 -15 26 -13 -30 10 -42 1 49 5 -45 38 -27 24 49 0 35 -4 10 6 -31 -35 20 22 -38 5 -53 5 0 1 4 -32 -22 23 -1
7274 -1 33 31 6 -29 -13 53 -32 -36 43 -29 -32 -12 6 37 30 -33 25 20 14 7 5 32 -16 0 16 14 22 2 -1 27 -1 2 -1 -21 40 77 35
7311 35 -6 -30 -11 8 -30 -19 40 12 20 -51 -11 -21 13 43 -6 -18 -9 -32 14 28 -20 1 52 -11 32 -8 6 4 -20 -2 16 62
7343 62 53 13 17 -4 -12 10 -22 34 11 -9 2 43 -24 -9 -22 14 2 -49 -26 56 -35 7 -8 -6 3 6 -14 -4 8 -14 -9 -10 -16 -26 -59
7378 -59 20 -15 -25 6 32 42 -8 7 46 -18 -16 -1 29 10 -29 39 8 3 -20 83 -55 -10 17 -31 17 42 -15 -18 -23 13 -8
7409 -8 6 7 30 47 25 9 33 -3 49 -15 3 -19 37 -6 13 -4 -36 46 9 -1 31 -8 -11 -47 37 55 -5 -59 -13 57 8 -4
7441 -4 -27 40 -40 -26 -3 -11 26 -36 31 10 -2 -19 -42 -15 9 -28 -23 22 29 9 0 55 -25 -6 -36 27 -7 35 44 51 30 -65 -8 28
7475 28 19 -2 -15 -29 19 13 -36 -10 4 26 37 -1 -14 -8 -67 -26 -45 35 32 -19 -10 45 -37 -5 -46 -46 -13 15 23 5 17 -2 -34 7
7509 7 3 14 -11 -32 17 -7 5 17 64 -4 22 26 35 -21 23 2 41 -25 24 37 2 -20 -13 23 -22 6 20 -36 -20 13 -30 43 -3
7542 -3 -5 -41 -2 -10 8 -16 28 -20 -8 -38 19 -20 30 7 -36 38 -33 31 24 29 19 69 -50 3 -81 -22 -41 -27 43 23 -4 6
7574 6 12 56 -25 11 -38 -17 -21 -46 -14 -4 8 -63 -55 1 52 -31 26 8 -20 -8 38 3 -5 7 -37 7 -4 12 25 -8 13 -18 -19
7607 -19 23 53 9 -43 34 31 -6 38 -4 -5 -22 35 -49 18 -35 -26 -10 -11 -1 21 -4 -28 -13 -15 1 31 17 13 17 37 32 -18 3 92
7641 92 40 0 8 9 16 6 -7 -8 17 -8 13 49 21 -13 5 0 -26 22 -13 10 -10 -19 -37 0 -51 9 30 -2 -8 -10 46 -11 57 33
7675 33 -49 24 -20 -45 28 12 54 30 11 24 54 -11 11 17 -8 37 33 -10 -35 -42 -17 1 -38 48 9 19 1 33 -2 -21 9 -6
7707 -6 2 14 -42 12 43 -37 -30 -22 38 -5 48 -24 -28 -6 -9 2 -9 5 48 13 4 -14 10 -17 17 -7 57 18 -19 -28 -39 -16 5 -10
7741 -10 -37 -25 -14 -50 1 -11 18 -14 28 -23 -45 -34 -14 45 -59 13 12 52 39 1 4 74 41 -8 1 19 13 12 -21 26 25 -11 0
7774 0 33 -1 -7 7 4 -2 -70 -31 25 -26 -6 -17 25 -8 24 4 -4 17 -32 -5 41 8 1 53 17 -31 32 20 -20 -6 33 25 -16 -44
7808 -44 7 15 38 9 -1 -11 38 13 60 -18 -37 56 47 24 11 -7 -23 1 -13 -28 -10 -34 -46 -48 30 35 22 -37 10 5 -27 5 -26
7841 -26 2 40 -14 16 -19 31 -23 -7 -28 -13 -4 -59 -33 20 -53 41 15 31 -39 -20 14 -39 -28 -63 24 9 6 -4 11 -13 32
7872 32 -12 14 20 12 13 39 22 -22 -13 12 -69 55 27 6 27 -13 -16 38 42 -13 56 -7 4 21 52 -56 54 4 -8 67 49 -46
7904 -46 20 -24 23 -3 12 23 -5 -3 -12 -22 -2 -38 13 39 7 -4 1 23 -54 17 -12 34 61 -17 20 35 -53 22 29 21 -80 27
7936 27 -2 12 2 -54 41 2 -9 2 -16 -1 47 -2 -16 3 31 -4 32 -10 4 7 -61 -57 -12 -70 10 57 0 30 49 -35 21
7967 21 6 -14 -17 -60 57 42 -3 2 41 8 12 67 43 27 -22 -33 49 14 1 -2 19 -7 0 -8 22 25 5 4 42 -21 4 -78 21 9
8001 9 -73 -5 -22 -35 -1 56 -33 20 -27 2 -16 20 51 1 21 68 11 18 -8 -3 44 22 -8 75 -5 -8 -9 -15 -15 -26 12 38 25 30
8035 30 15 -35 9 -28 -20 -48 -2 -28 5 21 52 39 13 14 8 -8 -1 -12 20 -39 -17 -35 -6 22 6 19 -8 -2 15 -16 62 42 75
8068 75 17 -18 -8 -4 1 -43 19 -41 16 -4 29 -8 -84 8 39 13 23 41 6 33 -2 19 -21 19 25 9 -5 -59 -16 9 21 30
8100 30 56 -4 15 -6 -11 18 -2 69 14 -3 -4 -7 2 -12 15 -35 14 -1 -7 20 -62 1 14 -27 -29 -39 -21 0 -16 -20 -26 -32 16 27 -15
8135 -15 -21 24 28 6 12 -42 -21 3 29 42 3 -23 28 30 -31 -28 -23 13 29 37 -2 -2 -59 -30 19 15 -27 9 -4 -9 -2 -51 -27 -56 28 -32
8171 -32 -24 -54 15 18 -13 30 -10 -6 -43 -37 13 -8 -5 62 54 37 47 -30 7 -41
8191d1
##END NTUPLES=NMR FID
##END=
