##TITLE=1H_LR-758-R5-4PB1
 CDCl3
 8 sc, 
 5.9.2023
##JCAMPDX= 6.0         $$ Bruker NMR JCAMP-DX V2.0
##DATA TYPE= NMR FID
##DATA CLASS= NTUPLES
##ORIGIN= UXNMR, Bruker Analytische Messtechnik GmbH
##OWNER= root
$$ XWIN-NMR		Version 3.5
$$ Tue Sep  5 14:38:29 2023 Russian Standard Time (UT+4h)  she@DPX200
##.OBSERVE FREQUENCY= 200.13135
##.OBSERVE NUCLEUS= ^1H
##.DELAY= (6, 6)
##.ACQUISITION MODE= SIMULTANEOUS
##.ACQUISITION SCHEME= undefined
##.AVERAGES= 8
##.DIGITISER RES= 18
##SPECTROMETER/DATA SYSTEM= spect
##.PULSE SEQUENCE= zg30
##.SOLVENT NAME= CDCl3
##.SHIFT REFERENCE= (INTERNAL, CDCl3, 0, 15.7039)
##AUDIT TRAIL= $$ (NUMBER, WHEN, WHO, WHERE, WHAT)
$$ ##TITLE= Audit trail, XWIN-NMR		Version 3.5
$$ ##JCAMPDX= 5.01
$$ ##ORIGIN= Bruker BioSpin GmbH
$$ ##OWNER= she
$$ F:/spectra/data/she/nmr/H-F/1/audita.txt
$$ ##AUDIT TRAIL=  $$ (NUMBER, WHEN, WHO, WHERE, WHAT)
(   1,<2023-09-05 14:36:39.57 +0400>,<she>,<DPX200>,
      <created by zg, POWCHK disabled, PULCHK disabled
       configuration hash MD5:
       00 E9 B6 7A A2 85 ED C7 34 08 36 98 17 FE 4E 26
       data hash MD5: 16K
       95 05 35 66 FC BC 94 E8 C4 A4 85 E4 C8 8D EC 48>)
$$ ##END=
$$ 
$$ hash MD5
$$ 21 CA B0 CD 10 D9 C9 E4 F7 71 FA CD 3C 96 26 51
##$RELAX= 
##$RELAX= 
##$RELAX= 
##$RELAX= 
##$RELAX= 
##$RELAX= 
$$ Bruker specific parameters
$$ --------------------------
##$DU= <F:/spectra>
##$EXPNO= 1
##$NAME= <H-F>
##$PROCNO= 1
##$TYPE= <nmr>
##$USER= <she>
##$AMP= (0..31)
100 100 100 100 100 100 100 100 100 100 100 100 100 100 100 100 100 100 
100 100 100 100 100 100 100 100 100 100 100 100 100 100 
##$AQSEQ= 0
##$AQ_mod= 1
##$AUNM= <au_zg>
##$AUTOPOS= <>
##$BF1= 200.13
##$BF2= 200.13
##$BF3= 200.13
##$BF4= 200.13
##$BF5= 200.13
##$BF6= 200.13
##$BF7= 200.13
##$BF8= 200.13
##$BYTORDA= 1
##$CFDGTYP= 0
##$CFRGTYP= 5
##$CHEMSTR= <none>
##$CNST= (0..31)
1 1 145 1 1 1 1 1 1 1 1 1 1 1 1 1 1 1 1 1 1 1 1 1 1 1 1 1 1 1 1 1 
##$CPDPRG= <>
##$CPDPRG1= <>
##$CPDPRG2= <>
##$CPDPRG3= <>
##$CPDPRG4= <mlev>
##$CPDPRG5= <mlev>
##$CPDPRG6= <mlev>
##$CPDPRG7= <mlev>
##$CPDPRG8= <mlev>
##$CPDPRGB= <>
##$CPDPRGT= <>
##$D= (0..31)
0 1.2 0 0 0 0 0 0 0 0.06 0 0.03 0 0 0 0 0.0002 0 0 0 0 0 0 0 0 0 0 0 0 
0 0 0 
##$DATE= 1693910198
##$DBL= (0..7)
120 120 120 120 120 120 120 120 
##$DBP= (0..7)
150 150 150 150 150 150 150 150 
##$DBP07= 0
##$DBPNAM0= <>
##$DBPNAM1= <>
##$DBPNAM2= <>
##$DBPNAM3= <>
##$DBPNAM4= <>
##$DBPNAM5= <>
##$DBPNAM6= <>
##$DBPNAM7= <>
##$DBPOAL= (0..7)
0.5 0.5 0.5 0.5 0.5 0.5 0.5 0.5 
##$DBPOFFS= (0..7)
0 0 0 0 0 0 0 0 
##$DE= 6
##$DECBNUC= <off>
##$DECIM= 32
##$DECNUC= <off>
##$DECSTAT= 4
##$DIGMOD= 1
##$DIGTYP= 9
##$DL= (0..7)
0 120 120 120 120 120 120 120 
##$DP= (0..7)
150 150 150 150 150 150 150 150 
##$DP07= 0
##$DPNAME0= <>
##$DPNAME1= <>
##$DPNAME2= <>
##$DPNAME3= <>
##$DPNAME4= <>
##$DPNAME5= <>
##$DPNAME6= <>
##$DPNAME7= <>
##$DPOAL= (0..7)
0.5 0.5 0.5 0.5 0.5 0.5 0.5 0.5 
##$DPOFFS= (0..7)
0 0 0 0 0 0 0 0 
##$DQDMODE= 0
##$DR= 18
##$DS= 0
##$DSLIST= <SSSSSSSSSSSSSSS>
$$ [...]
##$SUBNAM2= <"">
##$SUBNAM3= <"">
##$SUBNAM4= <"">
##$SUBNAM5= <"">
##$SUBNAM6= <"">
##$SUBNAM7= <"">
##$SUBNAM8= <"">
##$SUBNAM9= <"">
##$SW= 18.05172834244
##$SWIBOX= (0..15)
0 0 2 0 0 0 0 0 0 0 0 0 0 0 0 0 
##$SW_h= 3612.71676300578
##$TD= 16384
##$TD0= 1
##$TE= 0
##$TE2= 300
##$TE3= 300
##$TEG= 300
##$TL= (0..7)
0 120 120 120 120 120 120 120 
##$TP= (0..7)
150 150 150 150 150 150 150 150 
##$TP07= 0
##$TPNAME0= <>
##$TPNAME1= <>
##$TPNAME2= <>
##$TPNAME3= <>
##$TPNAME4= <>
##$TPNAME5= <>
##$TPNAME6= <>
##$TPNAME7= <>
##$TPOAL= (0..7)
0.5 0.5 0.5 0.5 0.5 0.5 0.5 0.5 
##$TPOFFS= (0..7)
0 0 0 0 0 0 0 0 
##$TUNHIN= 0
##$TUNHOUT= 0
##$TUNXOUT= 0
##$USERA1= <user>
##$USERA2= <user>
##$USERA3= <user>
##$USERA4= <user>
##$USERA5= <user>
##$V9= 5
##$VALIST= <valist>
##$VCLIST= <CCCCCCCCCCCCCCC>
##$VD= 0
##$VDLIST= <DDDDDDDDDDDDDDD>
##$VPLIST= <PPPPPPPPPPPPPPP>
##$VTLIST= <TTTTTTTTTTTTTTT>
##$WBST= 1024
##$WBSW= 4
##$XGAIN= (0..3)
0 0 0 0 
##$XL= 0
##$YL= 0
##$YMAX_a= 307387
##$YMIN_a= -340894
##$ZGOPTNS= <>
##$ZL1= 120
##$ZL2= 120
##$ZL3= 120
##$ZL4= 120
##$ABSF1= 10
##$ABSF2= 0
##$ABSG= 5
##$ABSL= 3
##$ALPHA= 0
##$AQORDER= 0
##$ASSFAC= 0
##$ASSFACI= 0
##$ASSFACX= 0
##$ASSWID= 0
##$AUNMP= <proc_1d>
##$AZFE= 0.1
##$AZFW= 0.1
##$BCFW= 1
##$BC_mod= 2
##$BYTORDP= 1
##$COROFFS= 0
##$CY= 11.3945322036743
##$DATMOD= 1
##$DC= 2
##$DFILT= <>
##$DTYPP= 0
##$F1P= 15.7292609196834
##$F2P= 12.9074282941183
##$FCOR= 0.5
##$FTSIZE= 0
##$FT_mod= 4
##$GAMMA= 1
##$GB= 0.15
##$INTBC= 1
##$INTSCL= 1
##$ISEN= 128
##$LB= 0.24
##$LEV0= 0
##$LPBIN= 0
##$MAXI= 10000
##$MC2= 0
##$MEAN= 0
##$ME_mod= 0
##$MI= 1.114404
##$NCOEF= 0
##$NC_proc= 0
##$NLEV= 6
##$NOISF1= 3.799351
##$NOISF2= 2.8
##$NSP= 1
##$NTH_PI= 0
##$NZP= 0
##$OFFSET= 15.70392
##$PC= 1
##$PHC0= -21202.82
##$PHC1= 7.65271
##$PH_mod= 1
##$PKNL= yes
##$PPARMOD= 0
##$PSCAL= 0
##$PSIGN= 0
##$REVERSE= no
##$SF= 200.130013532006
##$SI= 16384
##$SIGF1= 3
##$SIGF2= 2
##$SINO= 400
##$SIOLD= 16384
##$SREGLST= <1H.CDCl3>
##$SSB= 0
##$STSI= 0
##$STSR= 0
##$SW_p= 3612.71676300578
##$SYMM= 0
##$S_DEV= 0
##$TDeff= 0
##$TDoff= 0
##$TI= <>
##$TILT= no
##$TM1= 0
##$TM2= 0
##$TOPLEV= 0
##$USERP1= <user>
##$USERP2= <user>
##$USERP3= <user>
##$USERP4= <user>
##$USERP5= <user>
##$WDW= 1
##$XDIM= 8192
##$YMAX_p= 0
##$YMIN_p= 0
$$ End of Bruker specific parameters
$$ ---------------------------------
##NTUPLES= NMR FID
##VAR_NAME=  TIME,          FID/REAL,        FID/IMAG
##SYMBOL=    X,             R,               I
##VAR_TYPE=  INDEPENDENT,   DEPENDENT,       DEPENDENT
##VAR_FORM=  AFFN,          ASDF,            ASDF
##VAR_DIM=   8192,          8192,            8192
##UNITS=     SECONDS,       ARBITRARY UNITS, ARBITRARY UNITS
##FACTOR=    0.0002768,     1,               1
##FIRST=     0,             0,               0
##LAST=      2.2672688,     0,               0
##MIN=       0,             -340894,         0
##MAX=       2.2672688,     307387,          0
$$ Real data points
##PAGE= N=1
##DATA TABLE= (X++(R..R)), XYDATA
0@%%%%%%%%%%%Qj6J6j6K4l2M0m8N6p2Q8j04J20j37J61j92K21k53K88l28L76m28
33b28M84n45O14o90P73q61R62j074J194j323J462j618J788j972K173k394K637
50A382k903L200l529L894m304M764n287N890o591P418q411R628j1160J3157j5875
65h727J9795k5956L7020o2576K16558L5141n52149M06357J35929m50009K29175
76a9442K91613m17241L1470K78493k16598k0694K03932j93266j9798J86742j24012
87a8801l1948J35040j37068p106J59497j07402m5026J07602j03807K0629J39087
98A10697j49555l2445J59344j37733j9659K21745j58753j41371K41549n4315j62237
109a22733K08879k3438k08501J82619O2787j95295J09948N8763j82554J14675
$$ y = [0, 0, 0, 0, 0, 0, 0, 0, 0, 0, 0, 0, 8, -8, 8, -8, 16, -16, 24, -24, 32, -40, 48, -56, 64, -73, 88, -104, 117, -136, 152, -176, 200, -228, 256, -289, 325, -365, 408, -453, 509, -565, 629, -694, 768, -850, 938, -1034, 1139, -1255, 1382, -1521, 1679, -1850, 2044, -2260, 2504, -2783, 3107, -3484, 3934, -4477, 5151, -6009, 7148, -8727, 11068, -14888, 22132, -40444, 176114, 211255, -340894, 65463, 201392, -248617, -19442, 272171, -145070, -113600, 164893, -51705, -72399, 131533, -61733, -81531, 105211, -18801, -50749, 84291, -52777, -59883, 99614, -7788, -52814, 54788, -49019, -28390, 110697, -38858, -71303, 88041, -49692, -69351, 152394, -6359, -147730, 93819, 39504, -122733, 86146, 62708, -145793, 36826, 99613, -95682, 14266, 73029, -109525, 5150]
119E150J08002j91162M3966J21292j49679L3802J35768j49467k8818J38574p7934
130a0506k1147J03274r7802l5718J20735o1877l6528J04103q1241n5356J39019
141F6956m2009r4059J06106j7685q9081J08775Q431j11252P1300L0460q7117O8018
153A8843K8959j11883N3335O9898r4304K5391O8194j00381K600J02429o5824l7902
165d0645P6660m1435l3725P8602k4335n2344N3293r040l4617N3668j3930n0995
177c8843M9934P831m3962L9317L651n2373L8375K3924m8639J9689J7960m4414
189b7550K8517L2353n1137Q221L4102m4125Q910M5560m8057j3569N3213k6468
201c0k0004M7103k4527l3237M7233m351l6018L3692l73l4246L5063J0510m0278
$$ y = [5150, 113152, -78010, -34044, 87248, -62431, -28629, 107139, -42328, -71146, 67428, -10506, -31653, 71621, -26181, -61899, 58836, -3041, -39569, 64534, -16707, -72063, 66956, 24947, -69112, 36994, 19309, -69772, 39003, 47434, -63818, 7482, 37942, -49175, 18843, 47802, -64081, -10746, 59152, -35152, -9761, 58433, -41948, -39348, 63081, -2743, -40645, 36015, -5420, -39145, 39457, 15122, -37222, 16071, 7031, -27586, 26082, 12152, -38843, 11091, 18922, -25040, 14277, 17928, -34445, 3930, 27854, -20785, -1096, 16864, -27550, 967, 33320, -17817, -9596, 24506, -19619, -10709, 34851, -13206, -26775, 26438, -30, -20034, 27069, 2542, -30695, 16538, 12187, -23831, 9861, 9488, -24758, 10305, 20815, -19463]
214a9463J8953J4787l2360J8263J9247l5062P520K4699k3701M855J9609k7739
226a0392J28K5073k0107k524K2029k1347l743K9003j7606j3055K4901j4016j4054
239a5710K8342q678k0853K5030n31k0413K1308O67k5465J7395R128k2352J2462
252C30J0896k1851R394J5671k0402J023J4591j6448J71J7238j3035m542J5853
265H889q660n745J3435q217q412J2885l362p328J1286k733q065J0700j206r574
279f107Q115p5r122R014K659r788O805M112r894M830M990j0617K649P542q388
294c275J056Q334p457j485Q376o117m066P889l720m565Q021j436n435O392l2o114
310c634M526R24n833L725K574m671K586K896m483J386K554m227P01K719l288P98
$$ y = [-19463, -510, 14277, -18083, 180, 19427, -15635, -8115, 16584, -7117, -2262, 17347, -10392, -10264, 14809, -5298, -7822, 14207, -7140, -10883, 18120, 514, -12541, 12360, -1656, -15710, 12632, 3954, -16899, 8131, 7600, -12813, 8495, 9162, -16303, 1092, 10220, -12132, 330, 11226, -10625, -1231, 14440, -5962, -4939, 9652, -6796, -6625, 10613, -2422, -6964, 8889, 229, -5516, 7919, -298, -8710, 4175, 813, -6515, 4771, 2038, -6027, 4673, 3467, -6107, 2008, 1933, -7189, 1825, 4484, -5304, 1501, 5613, -4281, 549, 5539, -5078, -2429, 5113, -3275, -2219, 6115, -1342, -2827, 5549, -568, -4634, 3255, -465, -5030, 2991, 1555, -3880, 2512, 2480, -3634, 892, 1816, -4017, -292, 2282, -2389, 197, 3093, -1390, -4, 2550, -1677, -976, 1743, -1545, -747]
326g47L218l136L54K961l393o29L160k985q46L800k429j093M040k030k273L790
342A762j693k832L928n50l308L830N40l545L036Q85m086K063J913l612J286K207
358A824k894R18K349k703j32J764k064K18J795k117J84J953j647K94J622k557
374a193N1K455k103k39K432k280l45L310j836j610K778j619j334L583j360k686
390a996L209l13k354L077n75l540K889J149l143K085M89l436K507J942l558J173
406c95J455l189K129K527m045M23K621k991J198L142m262k23M105k927l32L628
422B864m157j314N500k466k595M442k481k690N752j286m909M069k68l561N084
437A984K00n775L769K052m469L299J248o013K816L715m333J797K283n273K463
$$ y = [-747, 2471, -665, -311, 2650, -743, -1372, 1788, -1197, -2043, 1757, -672, -1765, 2275, 245, -2028, 1762, 69, -2763, 1165, 615, -2693, 1137, 1677, -1868, 1168, 2053, -2033, 30, 1943, -1669, -383, 1824, -1070, -152, 2197, -506, -638, 1126, -938, -720, 1075, -1042, -858, 1095, -552, -258, 1364, -1193, -1142, 1313, -790, -1029, 1403, -877, -1222, 2088, 252, -1358, 1420, -199, -1533, 2050, 690, -1996, 1213, 900, -1454, 1623, 1048, -2492, 397, 1546, -1597, 488, 977, -2459, 48, 1990, -1568, -395, 1060, -2129, 0, 2527, -1518, -1095, 1526, -1465, -267, 2875, -1387, -1610, 2495, -432, -764, 2864, -1293, -2607, 2893, 427, -2168, 2274, -207, -2897, 2855, 1569, -3340, 729, 461, -3100, 1984, 2184, -3591, 178, 2230, -2239, 1060, 2308, -3705, -889, 2826, -1507, 290, 2573, -2700, -237]
452b37M168n515L47L584n294J765O168o201j585O193m381j421O811n254m038P345
468B455j960l394O695l085n549P459m45o163N670k59o272O696K118p222M004K012
484B760o288M792K370p846L362M172o341L752M372q882J467O884o792J42O295
499D219p348n35Q554n266k380P136n992l084R478m210n895Q646j925o173Q568
514C793k90q380N877J836o427M921J272o759M907K587o220M334J874q321M233
529g63N159p579J688N219o665R95O371n442q18M377n184R62N913o159p68P167
545D473n755j902Q831n331n973Q900j223o489P098j15p133N948K151o520L893
560H53J303o875M881M031p436K234M617o708J640O401o368k079O059l419j070
$$ y = [-237, 3931, -1584, -1237, 2347, -2947, -1182, 4986, -1215, -2800, 3393, -988, -2409, 4402, -852, -4890, 2455, 495, -2899, 3796, 711, -4838, 2621, 2176, -3987, 1683, 1424, -4848, 1848, 3966, -3256, 748, 2760, -3528, 1264, 3634, -4212, -850, 3322, -3019, 733, 5105, -3777, -2310, 4574, -2218, -2076, 4219, -3129, -3664, 4890, -376, -2756, 4380, -1612, -4696, 4782, 572, -5323, 3323, 1398, -4775, 3793, 3503, -4877, 1000, 2836, -3591, 1330, 2602, -4157, 750, 3337, -2883, 1451, 3325, -4996, -763, 4396, -3183, -1495, 3724, -2941, -1946, 4425, -1017, -1835, 2542, -2642, -1680, 4233, -1926, -2694, 4473, -1282, -3184, 5647, 316, -5657, 3243, 2020, -4469, 2629, 2514, -4619, 1329, 3480, -3040, 853, 2156, -4719, 162, 4193, -3243, -1009, 3608, -3100, -1460, 4941, -1427, -3506, 2553, -866, -1936]
575a936N809m178k858N969k330k759N670l195n008P119O06o106M425J004n963
590c731M252L299o322J157K890m074K917L226o199O70M616m449R85M895o462j659
606c989P569k765l051N397l419l834P154o30n418M365o19m444O410O56p346L776
622a88K781n713M153K903q128J980N977n166O46M053o587L94P322m602k164N109
638B770m793j072P937l837m885N962j912l011O993k568o194O093K77m444N671
653B987j496o895O747K327o931M420J285q022N737N382q867J484N330p053K386
668a179P096p940j902P420m548j032P009o049l539Q252k289l956O084l582m735
683d890Q126n89o334N238n78n266O970Q77p864M076K417n729M952K454q249K849
$$ y = [-1936, 3873, -305, -3163, 2806, 476, -2283, 3387, 192, -4816, 2303, 2909, -3197, 1228, 2232, -3731, 521, 3820, -2502, -1345, 1545, -2529, 388, 3614, -2585, -1915, 2701, -1748, -763, 4132, -2330, -3989, 3580, 815, -2236, 3161, -258, -4092, 3062, 2432, -2986, 1379, 760, -3684, 2726, 3382, -3964, -188, 2593, -3120, 1033, 3936, -4192, -2212, 3765, -1401, -755, 3298, -3289, -2895, 4427, -175, -2339, 2770, -2023, -3095, 4842, 1005, -3880, 2082, 170, -2841, 4152, 1584, -4610, 1483, 1760, -2684, 2987, 1491, -5404, 1343, 3670, -3261, 1159, 2444, -5578, 159, 5541, -3326, -1842, 3488, -3565, -1179, 5917, -2023, -3925, 3495, -1053, -2085, 4924, -1125, -4664, 3588, 1299, -2657, 3427, -155, -4890, 3236, 2647, -3687, 1551, 973, -4293, 2677, 3554, -4310, -234, 2183, -3546, 1406, 3860, -4389, -1540]
699a540N334n740J555M037o993R03O626m668j149M477m662j99O265m323k637N004
715B290l290j332O401l757m362O249j185l848N490j533n742N596J723n415L498
730G83R58n343M010L011n651J542K728m423K264L721n314R3M211l589K46L798
746C045m407j013M916k535j571L849k915j926M876j493l293L543r02k615M016
761A575j68l779K708P34k767K673K88l544K420J513k860J805R45l552J994K280
777B265l457P28K065l066R38K930l094n37K668k154l08K856k503j224L183j287
793Cj211K661j538j851L060m21k202K317l81k084K665M73k823J597P70k337J721
810D19J079k775R12J695k018O86J362k300Q3J937j555j64J575j706j15K095j304
$$ y = [-1540, 3794, -1946, -391, 3646, -3347, -2444, 4182, -486, -1635, 2842, -1820, -2019, 4246, -77, -2714, 2290, -1000, -2332, 4069, 312, -4050, 2199, 1014, -2834, 2656, 1123, -4619, 977, 2700, -2715, 783, 1741, -3602, 408, 3419, -2232, -690, 2038, -2385, -121, 3600, -1714, -1621, 2590, -999, -753, 3045, -1362, -2375, 2541, 6, -1565, 2284, -631, -2557, 2319, 826, -2467, 1076, 174, -2441, 1575, 1407, -2372, 336, 1070, -1697, 976, 1264, -2280, 140, 1653, -1207, 598, 1543, -2009, -15, 2265, -1192, -464, 1601, -1465, -527, 2403, -691, -1228, 1440, -714, -1022, 1834, -669, -1893, 1290, 3, -1208, 1453, -85, -1936, 1124, 703, -1499, 818, 437, -1647, 1018, 1491, -1332, 265, 1035, -1302, 419, 1498, -1277, -365, 1330, -688, -2, 1360, -940, -857, 1080, -475, -639, 936, -770, -885, 1210, -94]
827i4o95J590j176o19K102p92j423J794l28j210J764n9j922J165O76j449R94N71
845H89j732N78J192j199mQ46j191l7J353o35o06P44m02k97R48k29p63M23J15k07
865b14N89n5p15L09M42k83J90N2o97K47N50j78k19L5l75K10N71l12n42K22l1q7
887b91O18j80q02M54M48m27L18J17r90M32J034o70k81N85o64J3J178n18r92P42
907A24R8n01Q74k33j125O30N63n65L38j62r29P96P42r20J19K37q45P79Q63j227
927c44l20R23n75L80Q83j303m49J436l85k96P97j041o30J674mj189N94k72o43
946g64J446J01j564M75L60o50J110J20j809P03J157r67M18N24j702L99J824r84
964A97n89Q24r98R0J956j060j438J209m8n82J481o42j883J340J021j024M69j93
$$ y = [-94, -789, 801, -375, -994, 1108, 316, -1107, 687, 359, -851, 913, 854, -1068, 97, 773, -676, 318, 889, -843, -265, 927, -272, -276, 570, -621, -658, 695, 60, -546, 198, -204, -501, 447, 218, -545, -122, -7, -214, 375, 320, -395, -86, 356, 73, 263, 315, -382, -135, 415, 237, 18, 53, -322, -112, 459, 147, -395, -173, -204, -291, 327, 147, -655, -201, 247, -180, 138, 255, -735, -303, 731, 61, -220, 365, -299, -286, 892, 374, -618, 124, 222, -279, 595, 362, -763, -133, 430, -135, 203, 41, -888, -92, 650, -270, -151, 86, -759, 20, 883, -344, -664, 259, -316, 64, 947, -356, -805, 631, 246, -50, 747, -294, -924, 750, 746, -443, 151, -121, -764, 682, 783, -781, -306, 54, -596, 514, 634, -1175, -472, 685, -282, 136, 660, -1042, -643, 1181, 197, -392, 432, -566, -476, 1480, 420, -1018, 191, 143, -439, 1042, 400, -1483, -143, 878, -146, 323, 130]
982A30j416J032J271j185j15J73r13J218J153j645n14R86n76N72J048j606p44
999a131J630k0j97N84j561m49K039r4j229P57p28p96K274J70k312M01O85o65J185
1018E43M09k065J41J513l63K39L4j830O35J956q33n63N31j268M46K192j065j595
1036i43P25n9K06J443j056j671J082N75j43P95j075j631J587J213j053k9k48r39
1054a221J392J195j309p60K53p5J198P18j738p27J090K91L50K67j587n97J615
1071C55O33o00l08q98j05J739K79j337m11L9J47J250K74j791m84J185N33J10k12
1090C98j204k59J467O86o75p01m63K25J469L65j645n58O22L23O90J90j621n46
1108a237J430N95l85l25j104P4J653K4q19o0q60K71K180m67k172O81O48m41J358
$$ y = [130, -1286, -254, 1017, -168, -283, -110, -1023, 195, 1348, -297, -811, 175, -401, 171, 1219, -387, -1131, 499, 479, 282, 866, -695, -1144, 895, 801, -428, 329, -399, -1195, 1079, 1249, -1063, -662, 23, -642, 543, 952, -1113, -972, 541, 178, 417, 451, -1379, -744, 1212, 379, -184, 347, -921, -475, 1717, 652, -943, -218, -277, -71, 1372, 316, -1355, -273, 302, 159, 954, -121, -1752, -165, 1048, -5, -34, -282, -1221, 171, 1366, 57, -703, -450, -525, 673, 1391, -347, -1074, 16, 307, 657, 924, -663, -1260, 355, 988, 388, 80, -818, -923, 816, 1095, -242, -653, -614, -467, 783, 1057, -734, -1218, -33, 500, 610, 398, -806, -1065, 402, 1088, 413, -288, -751, -526, 943, 1308, -337, -895, -273, 50, 740, 930, -691, -1237, 193, 788, 403, 78, -1026, -952, 701, 725, -94, -154, -1014, -743, 1437, 970, -1202, -521, 127, -314, 1044]
1127A044P0k511M72J825m36J02j37j751Q10J863j045m73K90j425Q55K214j662
1144A05j347J289n50K09J838j620j697J953J85n68J387j325j801K467Q58j810
1160d27P69l15j438K080R89k224J98M13r59J766O01k581K99J383r57P99P83k498
1178a319J13K198q37k38O22j760L44K201r60r15R26j144J63K230j218j546J343
1195B03k20k79J601r68j658J420L50n05R03r93j288J762N27j170N76l92j191J742
1213D20O57j677K56L42q15J408M48j869L55R07q08Q70M91j945L81J518r65L9P40
1232G53j523N7J840q88p81P97p47j51J553o33j113Q08m7k94J056n04j064Q57K30
1251B06l21N95m08q35Q70M38n69K21j56n56P47M17p33L1m6k83O74J72q31J21K29
$$ y = [1044, 1114, -1397, -925, 900, 464, 566, 429, -1322, -512, 1351, 306, -167, 123, -1302, -447, 1767, 105, -1242, 47, -503, -294, 1544, -76, -1773, 180, 365, -203, 1184, -141, -1942, 525, 1383, -427, 342, 27, -1411, 669, 1658, -566, -368, 45, -914, 852, 1453, -1128, -829, 554, -403, 396, 1179, -1319, -1206, 992, 155, -83, 539, -1221, -877, 1324, 364, -551, 375, -769, -606, 1624, 406, -1140, 203, -17, -296, 1305, 337, -1321, 99, 449, -56, 847, -146, -1434, 328, 855, -315, 261, -131, -1322, 420, 1077, -600, -344, -2, -817, 591, 1039, -830, -475, 432, -376, 494, 985, -960, -579, 939, -26, 13, 753, -770, -713, 1127, 239, -542, 255, -492, -643, 910, 277, -836, -28, -75, -369, 687, 183, -881, -24, 206, -115, 480, 72, -763, 107, 545, -24, 197, 41, -515, 232, 649, -84, -53, -99, -382, 292, 464, -367, -246, -17]
1272a7k45M74J09q16J10M79j21J17K5n17J80N14k21L0j0m30L85M69m91J3J61m47
1294b49K77N66o22k26M65l32k3O22m65n02N70Kl73M53j39n01M76K69m49J53J04
1315G6l67K12L79l65o7K51j77O9K71k06j50J91p1o4J94j85j43K33m7j02J47j31
1337e2j61K15N4k62K04kk15K01J77k33lJ89k27O6K59j31k21K30O4p7Op3n4P2q
1362A8N5M0k35P7J44j55p8J97j69j13K07Qj05J00l0q4J79p3q4K19j93j38M59r4
1386A52l48L13P6m32L38K05n05J45K91m02J85K80n56J07M36n12N7N02o14j07P33
1407C44l46l36N71k19m68P23o1m91L69J06m25L73L26o55J86K46l21J43K68m61
1427a28K7K24j23P8qk85J45J46j88J00L0l52K09L42l02J6M6k48K43L16l47O2J03
$$ y = [-17, -262, 212, 321, -495, -385, 94, -27, 90, 115, -402, -222, 292, 71, 101, 91, -339, 46, 515, 24, 37, 198, -249, 28, 594, -28, -254, 211, -121, -144, 478, 13, -489, 81, 83, -290, 163, 24, -477, -1, 268, -181, -28, 76, -291, -79, 300, -65, -132, 119, -58, 11, 282, 76, -74, 117, 46, -18, 176, -9, -152, 81, 34, -68, 79, -52, -213, 2, 56, -206, -2, -4, -219, -18, 159, -74, -77, 112, -115, -49, 210, 79, -142, 88, 152, 75, 81, 8, -46, 26, 18, 73, 113, -122, -45, 99, -56, -134, 63, -106, -219, -12, -4, -109, -9, -39, -123, 56, -17, -101, 118, -75, -213, 246, 152, -196, 117, 193, -239, 99, 304, -201, -56, 235, -167, 18, 298, -258, -151, 285, -227, -170, 332, -282, -389, 344, -2, -338, 233, 14, -454, 269, 208, -283, 86, 192, -233, 140, 466, -189, -3, 243, -78, 65, 333, -128, -101, 123, 0, 78, 70, -215, -70, 76, -112, -12, 18, -334, -125, 217, -85, -69, -23, -271, -28, 288, -59, 3, 106]
1450A06m10M09M13n79j61N41l31j69O09m04n19N62J91l94K30j62l18M39K27m25
1470a45O8J6l22M46L19m62j94K13J02J38N5k72j45MK94K83k85l78J98J78o1J70
1492B20p6o35L23N14k02j61n3l08K35N71l46m09J45k8J79M53k94n89K20M35j0
1513A84P2k61k86J52M56k4j41l67p5M50J91k28k64r7k4L90L01n00l03J08K41K42
1535B17k3m23j71K92K34J53j71l84o4N65J22k62j64j22R7M41M8m10k34Q5K90K72
1557C88j96m69k7K83J66L7j22m85Q0N69jk50j54j88J89N10j42l58m7O9K06M47
1579E05l70m56K36K87q3J76k21n41M17L29j49j39p5l32N04L00m39k07J61k13L11
1600AL94n38k52L92K8L1K42m91j63N61o2j62K29l86j48O52Jm56R9L7k12M99l5
$$ y = [106, -304, 105, 518, -61, -222, 319, -12, -181, 428, 24, -495, 67, 258, -136, 94, -68, -386, 53, 280, -145, -77, -61, -383, 63, 382, -80, -274, -61, 41, 179, 234, -38, -183, -179, 115, 398, 113, -265, -67, 111, 50, 220, 144, -491, -168, 346, 144, -17, -70, -378, -143, 428, 82, -327, -182, -210, -31, 422, 128, -461, -241, 194, 184, 256, -5, -291, -139, 317, 293, 152, -215, -290, 160, 351, 123, -141, -238, -262, 128, 429, -71, -374, -266, -25, 217, 194, -229, -400, -108, 126, 279, 108, -276, -340, 225, 347, 85, -79, -201, -104, 337, 385, -25, -259, -174, 116, 388, 192, -277, -304, -21, 145, 182, 60, -425, -345, 224, 223, -27, -181, -369, -180, 330, 188, -170, -217, -148, 58, 505, 135, -321, -85, 202, 119, 295, 74, -467, -50, 279, 130, -9, -84, -416, 88, 388, -51, -258, -97, -310, 1, 395, -143, -395, -3, 25, 56, 298, -193, -356, 205, 143, -19, 210, -176, -324, 328, 329, -127, -28, 9, -203, 296, 261]
1623B61n32J30J17n7L22j00n50K24L60k38Q9L1m35K21L97k23r5P9k03K61L13m07
1645c5o4K18k28K22K49m92rL44k32j8K72m42q7N23j06l98L54j81j89M75k7l60
1667b11J54N7r8K72r8k69K11J32k36K65p2l03K70J58j93QL8k73L22mk08O7k5j27
1691a63K06N7l58J50J63k30K39j2l13J27K26j48J54o7k74L70Q9l06J49Q9l50L03
1713A01K04m47Q8K13k85J70K37n22R0K89k68P2L12n20K6M94l22j47L68k65j40
1734b52N80k86k90M18j64j11M67k86l76M77k1l42N45k94m63N46J2l53L73j24m11
1755c55N22P7n70L62j2l88M90K36q02K90M16n28K56M33p09O3N90l51n3L13m35
1776a55PN42m16p5L96m81p4P07m13l97N01j94j89N31k42n02N70J9m22M87j16n34
$$ y = [261, -271, -141, -24, -81, 241, 141, -409, -185, 175, -63, 26, 57, -378, -157, 240, 17, -78, 1, -202, 59, 372, -35, -99, 119, -109, 113, 362, -130, -139, 205, -27, -45, 227, -215, -302, 221, 115, -283, 71, -110, -299, 176, 149, -211, -57, 0, -98, 174, 76, -193, 18, 150, -86, 179, 107, -196, 74, 232, 39, 47, 85, -188, 134, 130, -78, -11, -36, -163, 43, 100, -258, -108, 55, -175, 64, 52, -261, -134, 92, -56, 98, 31, -243, 127, 216, -90, 59, 148, -202, 101, 305, -142, -54, 159, -126, 44, 281, -241, -151, 138, -130, -58, 254, -266, -240, 254, -68, -215, 153, -112, -252, 328, 42, -248, 170, 6, -105, 362, 76, -300, 177, 156, -186, 359, 65, -398, 148, 160, -193, 180, 56, -355, 167, 244, -326, 36, 24, -364, 126, 362, -440, -150, 266, -262, -6, 427, -282, -219, 371, 20, -33, 280, -155, -148, 394, -22, -97, 299, -182, -256, 451, 38, -359, 142, -52, -241, 290, 48, -454, 116, 135, -287, 200, 84, -450]
1798d50N47J77n61M04P8n56M11M04n99L6M08m51J66L58m58q8M07l27N5K81l80
1819a38j34N04k36k06L47k76j82N33j41m15M23j21j82M06K1m76L21J05l18L21
1839A56R9m99J76L24l17K2K14l64R9L06k53o3J64j16j16L84k36j99K24p0j26K86
1861I5Ol22J20K02j29L2O2j39K6K51j48J3Jj70J04J51j85l3J87j72n6K57j31k30
1885b08K65p8j43K93j81j36K19oj90K29M4l20K98R0l40J72K31l62P8L16l70K3
1907g6K65k44m0L47l12r0K93j48j39L03k36j39L55j22k63L43J2l57L48N3m14K65
1929DJ19k98K47J12k94J73K11l70J70J74m03J95K43m15M7L49l15j09L81k37k13
1950b29L73j59j77K65q9k26L45p8k63L32n7k49L74o2l23K51J34l43L20R5m84L20
$$ y = [-450, 97, 274, -287, 117, 195, -361, 50, 454, -145, -109, 299, -152, 14, 372, -86, -174, 233, -94, -39, 242, -138, -272, 232, -4, -210, 137, -139, -321, 212, 71, -344, 79, -42, -224, 182, 203, -273, 48, 153, -165, 156, 255, -244, -68, 256, -61, -39, 175, -189, -90, 216, -37, -100, 64, -52, -168, 216, -20, -219, 5, -65, -191, 95, 101, -221, -101, 101, -28, 4, 66, -73, -47, 204, 56, 69, 70, -100, 4, 155, -30, -63, 124, -48, -104, 153, 22, -208, 57, -21, -164, 129, -52, -188, 31, 25, -165, 64, 108, -212, 86, 176, -164, 8, 239, -123, -45, 271, -99, -76, 189, -55, -95, 252, -60, -150, 143, -5, -144, 159, -77, -216, 139, 17, -246, 97, 109, -248, 100, 153, -261, 4, 123, -175, 72, 184, -110, 63, 274, -96, 74, 248, -155, 40, 283, -132, -85, 264, -51, -160, 221, -16, -229, 144, -15, -192, 73, -16, -242, 103, 25, -238, 94, 37, -212, 162, 100, -223, 28, 162, -181, 139, 234, -250, 70]
1972G0J46l70K93O6m49J98L77n10Q3K29l18P4L35l41q6K55j72l0L81l39p9L46
1994A59k10q4M44l80k42N66r3k93L05j21l69N48q9k27J95j14k45M48rm72K46J21
2016H4l00L01J57o32K40L37k81J33Q1l77J19M11k35k9P6l36J90M41l49j97K90
2037A24k33J40L76m27k17L23j26QK71l42k70M55K5k09K66l12k76N69J22l68Q7
2058a4j11q0M20J13m43P4M5j72M51l2n00J73K06j17K13p7m57J69K83q9kN9m48
2081c36K67L61l09j16J42k89J75N15m12l28K79M3O0K83l21l10L51Q3m9J27k79
2102f3k36N13O4l32J24j54j87M26J06l78m0L6n4L81o0l76N4J65j23L39o6n14K05
2125a70L99j95K7M0l75J51L76j38j27K8j88J95L12l17k08J53n6O6L00l30l25L79
$$ y = [70, 216, -154, 139, 205, -244, -46, 331, -179, -96, 133, -185, -111, 224, -117, -203, 52, -120, -150, 231, -108, -187, 159, -51, -135, 309, -71, -313, 253, 160, -133, 172, 51, -318, 230, 141, -86, 109, -5, -250, 198, 189, -283, -37, 84, -216, 85, 242, -390, -150, 187, -94, 39, 120, -257, -138, 273, 38, 9, 85, -251, -61, 380, 31, -166, 124, -109, 31, 407, -20, -237, 86, -40, -32, 239, -103, -373, 82, 107, -102, 164, -148, -424, 145, 267, -101, -14, -125, -205, 215, 328, -115, -41, 4, -168, 283, 251, -249, -76, 130, 13, 226, 149, -308, -139, 144, 55, 53, 112, -336, -69, 292, -17, -133, 9, -280, -105, 410, -2, -330, -51, -8, 52, 335, 14, -296, 55, 138, 89, 216, -63, -299, 214, 278, -54, 70, -84, -271, 155, 261, -117, -157, -121, -175, 206, 146, -230, -176, -11, -134, 205, 139, -375, -170, 229, 34, 61, 101, -274, -123, 253, 115, -12, 16, -172, 23, 335, 18, -190, -37, -93, -27, 273, -57, -382, -3]
2147cQ9r5J01k22j55K96J06j28R4k31r6M87N8m40J13O1j17K96Q7m75o5K73N2Q4
2171A70k6l41J3K81q2m1j3j69Q2L02p3k79P1N1M1J30o5j67j1R0J63J13l39q6K04
2196A9R7j7N7k25r4K12J44j80o9q8N2J85j0j50on5N9K41j04k96J29J25K8O6r2
2221B8j79N6J98O3j02j17m6J74J46j17j10k2p5J91R8j54j55L2P2J21n2j24m0P9
2245c5P1J27j23k43N0K26p3J0j1j14M3J88j3m4m0o8J5K13j12j06K3j6J01N4j27
2270dj24R6K5J05k7j79m5J55J8k4M3j50n4K39k1j46P9k0k2J44N6k20O4O4m4J26
2296A34m6j95J02R8j65L2J15j75oK65j59r0O9l4o8K15j05q9J17l2j4J40m5k61
2320a97K80M6k23J46M6j93J17K07l02J5J95j31k2J73k02q8J85n5p8J86k04m0K91
$$ y = [-3, 86, -9, 92, -130, -285, 11, 117, -11, 83, -148, -244, 243, 301, -139, -26, 35, -82, 214, 301, -174, -239, 34, 86, 170, 144, -197, -184, 97, 15, -26, -39, -208, -126, 176, 103, -176, -105, -54, -13, 117, 52, -115, -126, -36, 127, 240, -99, -185, 19, 116, 99, 156, -69, -163, 49, 193, 13, -56, -144, -92, 93, 83, -67, -73, -128, -69, 172, 68, -228, -99, 26, 54, 120, 28, -151, -95, 103, 166, 64, -53, -99, 75, 221, 104, -6, -28, -103, 88, 186, 32, -123, -91, -19, 102, 50, -74, -114, -35, 36, 163, 40, -203, -153, 73, 0, 10, -1, -115, -72, 116, 103, 59, 19, -49, -34, 179, 67, -39, -16, -32, 69, 123, -4, -128, -32, -7, 98, 71, -108, -153, 2, 20, -4, 39, -111, -165, 74, 53, -93, -14, -34, -56, 88, 144, -76, -12, 52, 8, 134, 88, -107, -5, 93, -72, -40, 75, -100, -106, 159, 0, -90, -21, -55, -123, 92, -13, -102, 15, -17, -31, 109, 64, -197, 83, 129, -94, 52, 98, -95, 22, 229, -73, -58, 137, 6, -16, 157, -45, -133, 52, -3, -81, 105, -99, -139, 152]
2343A52j41j79J57q5j00K64m3k10K72j8j33J39Mk36J97Q8k12J57R9k71J07J61
2365A69k97P3J82k42O6K22k97k7K63j85p1L29k81j20L53j79j36L12j52j98L92
2386A76j34j94L32j30k06K49K0l33L05O6k77K55Jl65K34J56k76R5R6k47J94J22
2408A39l19J54J49k44O6K23k08r7L06k57qK96k85o9L87k44j10L30k04k03L68n8
2430A12l00K64k3k63K39L8k75J78J41l03J34J44k90R7K03j38k5K58k90K4K08j47
2452a4k5J59j57K0K27l08K7J72j20l9J52j03j73L03j22j24J88n5j89J74L3j64
2474a38K59j06j54J43L5j09J05J6j46P5J30j08J1P1o2rR2j1j63J17K6j12Q0m9
2498gj16J21lq7J30pj28N3P4j26K6J22j30MJ04lo1K9L0J9M3q1o1J33o4n7J63j30
$$ y = [152, 11, -168, -11, -96, -196, 68, 25, -185, 87, 69, -64, 75, 79, -157, 40, 128, -84, 73, 172, -99, 8, 169, -128, -55, 127, -115, -49, 173, -124, -151, 112, -73, -144, 185, -96, -216, 137, -42, -178, 134, -18, -216, 176, 42, -152, 180, 50, -156, 93, 113, -220, 85, 151, -126, 129, 130, -235, -1, 155, -121, -26, 70, -177, 17, 139, -180, -26, 123, -121, -55, 168, -40, -137, 169, -88, -96, 200, -85, -154, 233, -11, -121, 209, 5, -198, 170, 112, -188, 76, 53, -210, 29, 67, -208, -30, 111, -192, -58, 86, -204, -107, 96, -42, -67, 191, -99, -75, 133, -14, -39, 120, -37, -17, 210, -98, -71, 101, -19, -58, 94, -9, -182, 121, -1, -125, 63, 8, -181, -7, 26, -138, 121, 15, -139, 4, 39, -70, 35, 51, -95, -20, 110, 2, 13, 84, 22, 13, 105, 94, -69, 48, 74, -38, 42, -7, -123, -2, -5, -92, 38, 31, -97, -44, 30, -96, -70, 52, -78, -74, 30, 27, -34, -5, 25, 44, 87, 6, -55, 78, 14, -43, 120, -10]
2526a0j16J84J0j10P6Lj08P2J21k13R8k4j24J64O0j97K7J33j70J67J25k64k3K46
2550A27j06o0J98j45j10J58jo4Q5r9r3K10rk66J70J3j56K01M9k67M0Q8m3R5L6
2575E1k25J28J68p7k6O2k02O0K22j15q0N8n5J5K28k07j55J99o0m8K44k47k01K73
2599A0N0j36J44r4j89L05M3j66N8l9j74K75J28k67m1J68q0J81J3l34M8J60PL8
2623A08Q1l44MK84j13j7N3k09j3L32q5j83O5m6K4K31j39j71O2L6j2K76k11k60
2647b47K32J64j25L5n7k12J58L07k30l4o5j15K67R7k74J3M5n6J24J65l38r3K82
2670D3Oj5J00k24LJ94m8Ml0j18k1L16J9k98J24j55J4K26K4l16M3Q8N6R6j19j96
2696a84P0J67n5N1m2k05J49K12k08J2P8j11N5J97r5k04J25n6R9J49j81k46K15
$$ y = [-10, -126, 58, 68, -42, 34, 37, -71, 1, 122, -91, 7, -17, -141, 23, 83, -114, -87, 46, -124, 43, 168, -96, -119, 127, 21, -39, 159, 14, -96, 62, 61, -3, 82, -17, -110, 100, 91, -175, -5, 8, -148, 53, 102, -165, -125, -37, -80, 15, 51, -174, -46, 122, 45, 19, 81, -121, -61, 161, 46, -34, 24, -31, -16, 212, 5, -150, 49, -11, -59, 185, -62, -263, 10, 60, -76, 68, -26, -215, 90, 133, -33, 25, -14, -188, 87, 215, -52, -93, 75, -5, 176, 189, -145, -97, 63, 70, 108, 189, -155, -151, 133, 20, 3, 56, -153, -166, 166, 81, -102, -37, -83, -59, 172, 33, -138, -76, -40, -52, 224, 13, -247, -15, 149, 24, 59, 2, -210, -52, 255, 25, -9, -74, -189, 78, 175, -99, -86, -41, -97, 27, 192, -146, -239, 43, 49, 34, 134, -90, -87, 107, 59, 63, 33, -85, -106, 210, 229, -69, 55, -100, -86, 140, 164, -152, -109, -21, 35, 131, 12, -184, -114, 53, -2, 49, 7, -198, -49, 163, -45, -33, 45, -66, -11, 186, 91, -113, 12, -44, 55, 204, 23, -223, -8]
2719hQ2n5N1j26j50K68R7k24l9N9j01J38J47k61J3R2n4Q8J08j95j8J91j17O8Q4
2744A38k09p7L16p9j01K6m4n6J98pj56J0K1p3J87qk81P1J87j20O4kk40K49P7j21
2770c0L9O5j72N2K09j62p9J44j34mL06k50j07K17r6n9J47q9j83K40N2k27J40N7
2794G6k29K03K1k13J37N4j83K03J29l48J42J25j01K9J20k34k5K47j73n5J74j98
2816i9l0K51q7j37J32n4r0K36q4j78J66n0q9J73J8j97J49L7j64J23Q0k22J06J47
2840A37j76k3J29j75Q1J71j61j7J47j47L8R1j51j9P9J6j57J60k4j71J75N5j59
2863a01Q6R0j64R2P0j27O2N1p8L3Q8j21m7J21rp9J70j25j78J62P1j58J35oj33
2888i5J56Nj58J11K5j51R6J04j63%J13j35R0J05j79K9J70j48QJ08q1q1J75j34
$$ y = [-8, 74, 19, 70, -56, -206, 62, 159, -65, -104, -45, -146, -8, 139, -122, -109, -17, -71, 17, 125, -70, -88, 103, -14, 54, 138, -71, -148, 168, 89, -12, 14, -30, -86, 112, 105, -51, -41, -20, -93, 94, 86, -195, -124, 63, -57, 7, 5, -235, 14, 91, -30, 9, 74, -98, -46, 163, 1, -78, 66, -68, -72, 234, -16, -123, 94, -2, -61, 86, -3, -186, 54, 106, -121, 19, 76, -153, 50, 71, -142, -5, 49, -134, 69, 198, -150, -8, 117, 16, 45, 165, -69, -94, 153, -20, -75, 99, -99, -129, 122, 35, -102, 30, -24, -114, 122, 38, -140, 26, -24, -113, 60, 78, -119, 30, 67, -97, 26, 106, -116, -10, 137, -39, -62, 67, -108, -27, 144, -17, -34, 113, -34, 4, 95, -56, -75, 4, 20, -137, 23, -1, -172, 3, 58, -101, -15, 75, -89, 3, 73, -54, 8, 59, -19, 14, 102, -19, -66, 55, 46, -33, 137, 12, -166, -4, 67, -91, 44, 38, -95, 61, 66, -92, 19, 44, -107, -11, 93, -70, -70, 43, -92, -2, 103, -76, -47, 123, -25, -17, 91, 10, -71, 104, -30]
2912c0j03K65j52j42L00m2k55J59Q8k04J42R0k59J26J10k58J62J65l10R6K05k84
2934a31O6K52k56K4J69j15m8J67j91j4K51k01j42K70p1j83K53p9k03K36Pk48K47
2957F0Jk64K33O8k67K56l7k24K81M5k79J32J65k81J50R8k40kK41j72k5J73j50
2980c8q3J72j15p0K34j93m4K31r8j11K19j16j27K15q3j21K13kj41J27lj55R9J11
3004A21j75N5Q0j70N5J65j70m7J00l3j0R4j16j0Q4l5J3J6m8l6J18%j39J13n5p4
3030a04K02Mj40J00r9m8J16M7j64P3N5m9M1J2r8J8Q7m0l1J06j22j6P3Rp2P1k0
3057A1q6J17k3p8P2L2j10J34j6j70R8J5LRlp1j7J01o2L1L8j08M5Q6p2o8J04J7
3085B9m3qM2n6l1O8j0n8J01q7N9K4m5M3m0L5j2K7j2l4pN4J8l4m7m2Q2k0j7k2J5
$$ y = [-30, -133, 132, -20, -162, 138, 96, -159, 0, 88, -116, 26, 116, -143, -17, 93, -165, -3, 162, -148, -52, 153, -131, -65, 187, -69, -45, 124, 9, -39, 128, -63, -77, 174, -27, -169, 101, 30, -153, 100, 21, -182, 54, 61, -187, 60, 61, -203, 30, 98, -169, 87, 50, -174, 107, 152, -127, 5, 170, -111, 39, 137, -103, -105, 136, -36, -61, 112, -38, -121, 51, -64, -134, 100, -93, -137, 94, -4, -115, 104, -12, -139, 76, -7, -128, 85, 83, -58, 69, 66, -89, 10, 121, -54, 1, 81, -89, -34, 131, -39, -86, 14, -19, -29, 65, -51, -61, 23, -12, 1, 17, -31, -67, 51, 51, -88, 25, -30, -104, 98, 102, -38, 62, -37, -85, 31, 78, -86, -13, 42, -7, 34, 46, -52, -34, 53, 13, -18, 88, -34, -50, 23, 32, -40, 31, 11, -75, 42, 19, -59, 13, 45, -65, 69, 53, -117, -19, -4, -1, 8, 5, -66, -83, 18, -44, -13, 25, -83, -38, 48, -24, -92, 12, 29, -14, -22, 20, -36, -67, 1, -9, -67, 34, -53, 6, 30, -15, 28, -12, 23, 11, 38, 26, -8, -15, 39, 57, 23, -24, -66, 16, -4, -21, -43, -28]
3116b8pkM0k3oJ11j31M6L0q5OO5m4j5J04l1o7R5Nr5N3L2n3j4M8q7K2N1q2M5J1
3147fm9K8P7q3%L5r2L9R9m2j0MKk4R8r1k8Q8p0O4Ro3k0J03k2j03L7L8n9J28o7
3178B0j12M4K1m6J29n9o9J36K6q7L9Mr1M1M9n8L9j4j27J14O2p2KJ4J3L3%o4J2
3207arm0J8M9m5l9J12p2L1L2q6J0M6J4k4Q1l2l8N2q2m9R1n0M2O3j09k3J51p5m9
3237c1P5p8n4J05m%j5k7k8Q9j6o0L6po7P2O1j36J06l4o4J17K3j20qJ40o4M0n5
3266dl0M6P0j05M7J5n8LJ02j31rP4o8O8O2j12pL0o3K1P3r1L4J00Mq2J6J9p3N7
3296HN5n3j6K1m8J05k4o5m6L2j4L7J3j01O3R3q0K0P9j10k5J19n5k6L4j4nJ6m6
3325c3J1J06j23J5O8n8n4J01m3l8R1m2l5P0l1n9L1K4q2O4M1n1j9L9%ON9j41N7
$$ y = [-28, -35, -37, 3, -20, -26, 85, -46, 0, 30, -55, -49, 16, -28, -43, 61, 30, -37, 58, 63, -32, 21, 53, 0, -14, 34, -53, -31, 20, -62, -17, -6, -55, -27, 50, -33, -33, 2, -90, -51, 48, 6, -4, 0, 2, -22, 76, -15, -43, 45, -25, 39, 48, -15, -35, 68, 46, -57, -20, 18, -41, 87, 20, -92, -48, -27, -73, 56, -3, -72, 64, 90, 3, 42, 46, -45, -4, 45, -13, 26, 12, -115, -1, 61, -11, -9, 5, 18, 51, 51, -13, -1, -10, -50, -32, 17, -28, -67, 45, -27, 4, 36, -50, -40, 6, 20, -4, 77, 45, 7, 59, -23, -72, 19, -31, 11, 74, -35, -58, 93, 18, -31, 44, -34, -88, 17, 13, 13, -2, -29, -57, 32, 16, -44, -8, -15, -82, -10, 51, -85, 21, -13, -77, 40, 63, -57, -65, 75, 11, 51, -4, -34, 12, 82, -23, 24, 39, -19, -16, 86, -45, -54, 20, -48, 20, 82, -30, -37, -7, -70, -49, 24, -67, -33, 67, 71, -11, 5, 24, -49, 8, 63, 10, -6, 15, -33, 72, 48, -17, -63, -31, -45, -8, 5, -96, -33, 60, -20, 0, 79, -31, -56, 63, 8, -18, 16, 2, -3, 13, -33, -22, 84, -39, -24, 44, -14, -68, 33, -10, -48, 43, 1, -34, 36, 5, -54, -23, 1, -81, -17, 24, -27, -46, -7, -7, -1, 58, -83, -26]
3354b6Q2q1N0M2j22N5R2j04m7Q9o5J9N0m1k2J2L0l2O3j0j19R6K5o0P0Rj45J05
3382A5L7q1PK9l6O1Oo3K9N1q6J13j6j24N8P8p0NP0j73J0J58q4k4L8p4jQ8Kp4M2
3413il7oN9l6l2L3K0JO9k0r4N8J3o3M2k8LJ4O0l9j8P0q0L1L7j07jM6J5nM2q4m8
3446i4J88j10PRp0O5M9n5J4K8j37R7M3l6q0N5N1n2N5J4o4P1n5q0R9Jp1jO1l0R
3477a9K7k1k3M6l0P2m4m4M6k2J2%j4m8N0J6j4k6O5q8O9N6j00oj3J8M6pq4R1J0
3508B1l8L9m7l9M0J12n4l1N2o7o0P6M0o0K3qj1J4no5N6L2l7M6l1l9N5Kp2N6J5
3539A5j11O8J5L1n0J6J1N5J0n6K3jm6L2M5o5j4O0k7j4N7l5m9Q7m8m4L4l5lQ4j03
3570e8O3%j0o9J25m7o5P3N1m8J3or4P8M1n8NK1j2K9K5Rq2K6p8L4O0j05P3M3m9
$$ y = [-26, 56, -25, 25, 67, -55, 0, 92, -12, -59, 30, -35, -16, 34, -7, -29, -17, 13, -19, 44, 34, -85, 11, 36, -24, 46, 55, -90, 15, 52, -29, -22, 7, -29, 32, 38, -25, 4, 55, -31, 82, 66, -58, 0, 78, 8, 13, 83, -90, -80, 78, -6, -30, 8, -66, -67, 21, 23, -51, -9, -46, -52, 7, -29, -61, -28, -8, -7, 62, 42, -52, 6, 19, -44, -2, -30, -27, -13, 47, 8, -10, 60, -20, 11, 48, -59, -60, -14, 1, -4, 38, -46, -94, 94, -16, -9, 0, -70, -5, 44, -11, 3, 31, -106, -9, 34, -2, -82, -27, 24, -28, 27, 41, -23, 48, -7, -87, 12, 13, -58, -59, 2, -28, -19, 8, -13, -36, 10, -20, 52, 8, -36, 10, -12, 0, 0, -14, -62, -12, 4, -10, -36, 29, -59, 10, 66, -34, -40, -53, -35, 11, 4, -80, 11, 21, -17, 22, -25, -64, -24, 88, 34, 3, 55, -12, -72, 4, 44, -16, 7, -1, -12, 2, -3, -68, -12, 20, -17, 29, -2, -41, 14, 16, -56, 0, 15, -96, -28, -13, 18, -32, -16, -5, 50, 60, 4, 27, 26, -20, 12, 57, -8, -22, 38, 11, -3, 54, 19, -30, 57, 9, -35, -1, -36, -39, 45, -58, 5, 5, -5, -74, 51, 4, -61, 12, 63, 15, 28, 22, -72, 6, 47, -11, -6, 15, 3, 32, 57, 66, -16, 10, -68, -34, 26, -79, -6, 37, -12]
3601a2J2O6o6n1N8J7m7L9j7m4P4k9r4Q3J4jM8k4k1k9N1l0l0L4o6LN1lJ9O4q4k1
3633c6O4k9ML4j19M2R5Mj35J47p8k3N9M8j04J0M1L1Jl3j9j6J2m9O0o9K9NJ02m9
3663B9j9p7k2Q7R6r6k5MJ7M%j3n3J06l0J9l9J0n4J61o6Lj9k6k9R4k1j0o6J4J6
3694emJ9o9J2N6Pm5R2o2m7O7L8r7J1M2%km0K2m5Q4o4Q6J3q6m1N7J9l0p2L2L3O0
3727D1P9j38k4OK9O1n4j9k2P4j4J9p0L8l4M2K0on2KM6J3q4J6L0p1O9M2m7n1M5
3758a4m9O0J0%o0J1M5Nj3kq7O2Q8q4J7K6l2N9o4QmmQ3m4N4q0pJ12r5rOJn0K3L0
3793BJ4j9m7K2n0P5j6L2m5O3k8L1mp7J08m0l4R1l3n0J16j06kQ7n4j4O7r2o5O1
3823gK6j70J95j6j01M3M2j30J40m5o7J13M5n8k8Km0L3L0NmM6o0JL9Nq2R1p7K2
$$ y = [-12, 0, 66, 0, -51, 7, 24, -23, 16, -1, -45, 29, 0, -94, -11, 3, 2, 50, 26, 5, -24, 27, -3, -33, 1, -65, -62, -11, -14, 5, 69, -15, -36, 28, -1, 3, 37, -82, -40, 55, 59, -76, 71, -7, -30, 29, 77, -27, -17, 24, 55, 56, 23, 4, -12, 0, -49, 11, -58, -29, -24, 78, 29, 10, -67, -89, -2, 94, -2, -27, -23, -6, -2, -2, -15, -68, 38, 8, 27, -12, -2, -56, 105, 39, 42, 23, -3, -32, 62, 41, 31, -35, -21, -5, -9, 10, -59, -47, 9, 16, -29, 63, 1, -46, 21, 59, -38, -27, 15, 15, 13, -27, -5, -50, 34, -30, 56, 69, -17, -58, -1, 18, -12, -84, -52, -19, 41, 120, -18, -42, -36, -7, 54, 0, -19, -41, 33, 19, 38, -32, 6, -28, 14, 34, 28, -24, -22, 24, 37, -47, -31, -1, -72, -3, 39, -8, -59, -14, -63, -3, 7, 7, -53, -42, 3, 8, -5, -7, -94, -32, 56, -28, -11, 15, -17, 42, -22, -14, -18, -22, 61, 17, 71, -9, -16, 96, 1, -8, -2, -1, -51, -28, 2, 16, -3, -50, -28, -78, -3, -19, 13, -32, 31, 3, 34, 30, -47, 61, 21, -13, 78, 45, -5, 111, 5, 3, 90, 36, 22, 89, -3, -68, -7, 19, -151, 44, 28, -73, -30, 12, -118, 22, -23, -90, 23, 68, 10, -18, -16, -56, -23, 7, 12, 8, 54, -6, -5, 34, 39, -43, 48, -29, -7]
3853gM2j9q7J45p5k5J30p1p7P2lq3M8J3l7R8k9r6J01K9j33O9l0l6O4N7q4K4P0
3882G0j39O3K5m4L9j7l1J7J01j11O1n1j9J6P4o2n0P1K3n5M7m3rR5n8p8O5k8jO9
3912D0Jk3k8pNk8M4Om9K9m7OR5p2k5K3K2jL7qm0J9O0l5l0KoM2l0R5j60N9J1k5
3946a8P9l4l2L4q1MK6N1k7l5K0J4n5Q2l8L2m9J9m8P7k6j3L0k3lJ04j05m1K9N2
3976B5J3m2J5p1J14m7k5jP2r0M8%j08J45J2j02M5L6l0l4J02r1l0J17r4m9J53j00
4004a7k0O1o3JN5l1r3J45j4j09J04J2q9Q7o8PJ2L3q6L2O9m7j6Q0p7R0K0j43K8
4033c7M4Pm2J35j02k8L3j7JK5J4k5k1ll3O7k1m1P2J1j06R0m2k5M8Om4M5L0j32
4063i1R0O2p4k0L4J7o3R8l2p5J25p5K7mm9pL9K9l3P2p3k0K4Kk0P1rp0M6J6m9j0
$$ y = [-7, 35, 16, -71, 74, -1, -26, 104, 33, -44, 28, 25, -58, -10, 3, -34, 64, 35, -61, 40, 69, -64, 5, -25, -61, 3, 60, -24, 0, 70, -69, -6, 19, -25, 14, -3, -34, -17, 84, -27, 34, -17, -36, -20, 54, -8, -58, 13, 36, -19, 28, -15, -24, 71, 13, -65, 0, -28, -29, 40, 41, 18, -10, -17, -12, -40, 4, 10, -39, -10, -57, -51, 44, -28, -53, -30, -8, -9, 28, 20, -20, -1, 59, 24, -6, -4, -10, 32, 2, 97, -63, -4, 7, -18, 61, 27, -5, 29, -52, -48, -22, 29, 2, -33, -13, 1, -54, 28, -10, 22, -27, -8, -56, 21, -5, -18, 12, -11, -14, 90, -15, -56, -27, 25, 38, -4, 11, -60, 54, 7, -18, -19, 53, -37, 11, 11, -97, 48, 60, -42, 3, 39, 9, -25, 77, -14, -44, 73, -21, -70, 83, -17, -37, 24, -39, -38, 17, -14, -107, 38, 24, -85, 19, 31, -58, 29, -39, -32, -20, 13, -73, -41, 28, -19, -35, 45, -32, 58, 78, -65, -37, 7, 14, -28, 107, 5, -23, 10, -7, -6, 19, 33, 8, -13, -16, -49, 18, -3, -44, 28, 39, -67, 23, -19, -44, 4, 10, -34, 11, 41, -91, -1, 61, -13, -33, 1, 18, -45, 53, 21, -54, 71, -4, 23, 19, -30, -37, 2, 31, -2, 70, -3, -23, 1, 3, -17, 54, 45, -25, 21, 37, -12, -22]
4095b2J03j26M2QPr1J41p4Onm6J4O4L7p0R6o0n2J6mJ6l2RJ5jKK5k0k2n2Q0M2o9
4128b3O5l8j8m8L7j1N9K2j5n0J0RK4J2m2m7oL7nL5o6N4N1l9q5J01Kr5K5O6rK7
4160C9L0l1l6j0N1l0Qn%K3l6k0%NqJ6qmnM9oq8L5n6O0M1K0Jm4j2J4Mn1J8J5j4
4196c5L1LM2j5n3j6N8j0M8n9rN1q6N8kN9q2M3l6m7L6O1j5j8Nm9M5lK3m9jl2O2
4229HM2o8qL8n0N9Qn2j0L2j3K3M5j06KK7P9j31O6Lm6J05o8j6P4k8J9J4j9j8J0
4260B1j7jJ4l5L2j3l7j1K7N5k9n5N1PMj0o5N8J4m9l5O5J7J0%Ro1Q2m2o0K2N0j6
4293BJ2L0q2N9L3r3P7j4j0J2l2m1L8j8Mj3P6m8rP0o1l2N8k0n0J03J7n1j8J9k9
4324a1L5k3J0k9L2l5k3P1k8L2lm3L9l8j5P8j7Jp2L9m3M5qJ4J6l3L6m3Qn0O6OK
$$ y = [-22, 81, -45, -3, 5, 12, -79, 62, -12, -6, -11, -57, -43, 21, 58, -12, 84, 24, -28, -12, -16, 0, -32, -23, -8, -9, -7, 18, -2, -24, -76, 4, 46, -23, 42, 4, -14, -62, -25, -36, 23, 45, 30, -20, -10, -1, 23, 35, -7, -54, -60, -23, -28, 7, -59, -5, 46, 7, -78, 23, 25, -70, -45, 21, 12, 39, 69, 38, 2, -8, 43, 13, 21, 16, 16, 39, 3, -17, -17, -12, -20, -4, -12, -16, -21, 28, 22, -66, -31, -87, -27, 14, 34, 35, -9, -21, -7, -3, -54, -36, -21, -35, -4, -1, 41, 26, -27, -43, 15, 5, 53, -6, -15, 36, -50, 8, 6, 65, -17, 26, -10, -57, -21, 40, 25, 7, 12, -37, 8, 5, 28, -21, -22, -54, 8, 50, -18, -26, 12, -38, 21, 29, -23, -33, -1, -14, 9, 54, -52, -50, -23, 56, -75, -9, -6, -52, 53, -15, -31, 43, 15, 34, 48, 29, 11, 21, 4, 3, 17, -18, 14, 1, -36, -47, -20, 35, 6, -49, 2, 9, 13, 3, -62, -4, 10, -39, -74, -9, 8, 18, 18, 27, -34, 48, 6, -54, -32, 18, 2, 14, 44, -38, 21, 54, -39, 38, 24, 14, 26, -6, -47, -9, -27, -23, -36, 40, -8, -17, 53, -8, -40, 18, -2, -52, 51, 68, 17, -1, 18, -11, 24, 1, 11, -18, 14, -21, -44, 27, -1, 31, 28, -15, 24, -14, -29, 49, 32, 33, -39, 0, -43, 2, -6, 8, 24, -9, 27, -16, -8, -58, 8, 14, 16]
4357A6nK7m4pJ6L4n5N5j5%l3N3m4J0p1K9J12j07l1M0N5p1N2L0r5L7l5N2j0J9J0
4388B4k7K3k7PL1m8K7K0m8J2L1l2M5m5n7O1j2J8Pk2MKM0q1R5No8J4k4j1N6k1n1
4421e2N5L4J0l3K9Lj9On6OM6n3j8Q6k1p%l2k4N3l7NM0j8L1l6K5j07R0P5j27J27
4453H1l9o4N0j9%L4l2m9J4M0l8L8k0nJ2J7n4pP9q5K9J2j2JP8r9K8L8q2N2L2n1
4485b1K1L7p3L9Ok5kK0j2M0l6K7n4N3K1J2l0j3l4L6K3m3J0M7o3RN2m6pQ4o5n8
4517d5Q8o0L0j2pK4p0KN6l3L6Ok2LJ4J2qm4N0j0L6q3Q9n7L9q3P0p8J00o1lM0J4
4550C3k8k1M6r0P5qQk6k0j3L0K0oJrL5k6J6J1l2k3M0K7o0PKj5K1Qj4J2l4J03l1
4584C9l1m3Q6o2K0k2L6j7J7p0J3L1m2P4j6j4j1N7j5l3nKj6J8J5m4L1K5q2N3rJ4
$$ y = [16, 11, 38, -6, -13, 3, 37, -18, 37, 22, 22, -11, 42, -2, 8, -63, -34, 78, -29, -60, -20, 35, -36, 16, 46, -49, -12, -47, 5, -5, 14, 24, -3, 20, -7, 0, 31, -17, 10, 30, -18, -6, 25, -7, 38, -7, -64, -3, -15, 3, 10, -12, -8, -6, 34, -47, 48, 53, -15, -1, -25, -36, 20, -1, -52, 3, 37, 47, 14, 43, 46, 27, 33, -23, -17, 29, -24, -42, 44, 23, 16, 16, -16, -40, 13, -24, -19, 21, 3, 34, -2, 23, -84, 6, 81, -46, 81, 42, -22, 28, 9, 9, 43, 11, -38, -24, 16, -22, 16, -4, -9, 3, 20, -34, -41, 38, -47, -18, -6, -18, -17, 61, -38, -10, 28, -54, -2, 30, -21, 0, 37, -36, 3, 9, -16, -18, 2, -10, 30, -6, 21, -33, 20, 41, 53, 23, 10, -24, 12, 35, -8, 2, 49, -14, -5, 47, 1, -6, 78, 13, -45, 43, -17, 13, 1, -6, 18, -52, -50, 6, -27, 9, 15, -7, -4, 10, 22, 14, -30, 20, 10, 46, -37, 52, -5, 34, -49, 21, -57, 43, -18, -21, 19, 33, 5, -16, 30, -60, 15, 7, 15, -11, -31, -44, -14, 6, 0, 1, -8, 27, 1, 17, 28, -4, -27, 13, 40, -20, -13, -11, -26, -5, 3, -11, 1, -33, 70, 39, 8, -35, 51, -11, 9, -13, 23, 6, 23, -47, -34, -3, -45, 29, 13, -1, -12, 45, 30, -3, -8, -6, -22, -4, 11, -33, -2, 23, -59, -6, -15, -1]
4616aj5J5m0N0M5m7Mk4N7K3m8oNl1O1o0Noj8P4m3l3Q5m1K9o9J9k0L1LPJ5j9n4
4650d7L9L3Lj5n6K6J8J2j9nKK7m5O8r5R0p9J8%N8m7L4l2K8k9l3mJ5O4j7j4mJm
4684iJ4J2j0QJl5K2N5q2J3N0n6J3k7mn1R4j4l2J3K9m6P0pq9L8O2m5J7k2J5J8j0
4717Elqj2M8l8O5p8lL0k3lJ9j7k1M7ll4j8L7l4M5l9O1j9m2NL8K0k2L5j7%o4N5
4751A2L2n6Jj1P2o3m3L5K3J2j9K9l7J4K3j1J8mK7m2l5L3k3j2N6k0o0M1m2K2N4
4782B6m9M7m8k2N9OL6k8k6K8m2l2N1nrJm2K0J3J5J7km0L3J9Lm5k0M4L1j6Om8L2
4816A3K2p6K6K5k6n5O7k8J2kk2L4L9n3K5LJ2m4NJ9J0J9J0j7j0rk0P3k6j1K3ql7
4849gJ6J0k5j1k4K8K5k2k0l9O4j8pL8m4L2L2j7l5O4k0n2M4K6n1o9O7M8j9m5M8
$$ y = [-1, -16, -1, -41, 9, 54, 7, 11, -13, 44, 67, 19, 13, 18, -13, 48, -12, -7, -13, -31, 43, 0, -33, 52, 11, 40, -29, -10, -30, 1, 4, 11, 26, 7, -47, -8, 25, 28, 13, -43, -17, 1, 13, -6, -11, -9, 18, -27, 41, -54, 36, -43, -25, -25, 33, -14, 20, -12, 16, -13, -46, -50, -35, 29, 12, -2, -6, -5, -9, 5, 17, 7, 15, 16, -19, 3, 58, -24, -11, 39, -17, -4, -31, -35, -86, 8, -6, -38, -25, 4, -42, 28, 21, -68, -30, 32, -13, 4, -18, -3, 15, 5, 2, -6, -18, 30, -8, 57, -21, -24, 6, -17, -20, -1, -18, -39, 8, 5, -29, -47, -10, -44, 1, -38, 23, 4, -38, -33, 5, 25, 3, 38, 21, 21, -43, 12, 44, -12, -11, -22, 50, -13, -56, -21, 2, 14, -5, 24, -13, 1, 24, 13, 31, 27, 54, 12, -23, 10, -13, -25, 31, 11, -49, -8, -50, -28, 26, -23, 24, -24, -46, 13, 19, 55, 27, 1, 29, -13, -45, 6, 1, -8, -7, -49, -29, -16, -1, 16, 14, -26, 7, 26, 29, -16, -36, 8, 39, 23, 29, -19, 13, 35, -41, -15, 10, -16, -71, -4, -32, -20, -22, -44, -10, 29, -24, 1, 4, 16, -28, -23, -4, 6, 25, 35, 18, 8, -1, -21, 52, 26, 15, 38, 30, -7, 9, 19, -6, -17, -41, -13, 12, -10, -30, -69, -5, -23, -30, 8, -36, -4, 28, 11, -24, 40, 20, -32, 12, 38, -13, -82, -15, 33, 14, -31, 17]
4880A7j1L1p7R1lk3jm0J1J7k4M0ko4m9R4j8j8J7K4%l0P7o9rK9K0n4j1j2L8K5k7
4913a1kL0n3J9L4%j2l9j0N8l1O4j05M8j6L2j0j6j%O2k9L1q5J8N1J5j9jl7Nj6N1
4946B5nk2k6J6K4o1N5o7M7k4L8j2%KJP3n9j8K9p0R8j3r9J16m8J8K3m2k3L8k0j8
4978b4J3k1l7R9K5o2K9l0m4J9Q8n7K1j4J3Orl7L2m8K1k9P4l9jK7lL6j1j4K2n2
5010gP5q7QNqK5J6l6L6j6rK6j5l8K3L0o7j0PJ6K5Q1l8q0J5j4j5M1K0J9J7l2K1
5043C4l7j6L2%J4m3Mk5P0ok2k7K5J5k3rJ1J9mk7j6NK3rnMmK3K9n3Mj3K7m9O1l7
5079b5J1Oj3M1k5l3N0l3L8N0j00Qj7M4J4m9M0m9K2M5l5N9p2kJ8k4N6r9P8k7N1
5110B8j3k5j1l5J1P4rJ2p1K8JlPl8Q3Jm8M7q4L9L2q9L5PJ9MM5k0K5m2k1n6Q7k3
$$ y = [17, 6, 37, -40, 51, 48, 25, 24, -16, -5, 12, -12, 28, 26, -38, -87, 7, -11, -29, -12, 12, 12, -18, 59, -10, -19, 10, 30, -24, -35, -47, -9, 16, -11, -13, 17, -36, -17, 17, 17, 5, -34, -44, 14, -17, 47, -58, -10, -26, 6, -4, -20, -21, -21, 41, 12, 43, -42, -24, 27, 42, 23, 22, -15, -10, -26, 25, 20, -2, -28, -12, 12, -49, 6, -61, -14, -38, 0, -12, -12, -10, -9, 64, 5, -13, 16, -54, 44, 31, -68, 48, 0, 18, 41, -1, -24, 14, -6, -24, -11, -32, -69, 30, 55, -7, 22, -8, -52, -33, 55, -2, 19, 5, 18, 24, 15, -22, 10, -38, -17, -46, 28, -11, -12, 15, 12, 48, 37, 23, 45, -7, 68, -19, -11, -6, -14, 11, 27, -9, 27, 11, 2, 28, 13, -25, -2, 28, -39, -49, -42, -26, -1, 80, 42, -38, -23, -37, -52, -11, 9, 28, 45, 13, 34, -3, -19, 13, 13, 27, -16, -12, -37, 33, 27, 5, -22, 3, 18, -5, -14, -3, 16, 12, -15, -31, -26, -3, -12, -17, -13, -17, 6, 35, -18, -14, -27, 0, -49, 12, -25, -14, -8, -21, 20, -5, -38, 12, -21, 17, 67, -33, -25, -42, 2, 16, -33, 7, -42, -20, 25, -10, 49, -23, -25, -7, -31, 25, -74, 4, -23, 28, 15, -10, -21, -56, -45, 29, 20, 32, -39, -11, -10, -13, -6, -44, 39, 40, -8, 39, -45, -6, 26, -63, -28, -21, -2, 2, 47, 27, 52, 10, -11, -67, 20, -3]
5144cqK4K7o5j5R8j04M6nL8lk8pm9P0l3NN6m9L7q5Q4Oo3P0o8M2op7Q4j9k2J6J8
5178A2k2J1N0p7Q4n4l1M0j6j9K0J5J8o7N9k9k2kL7oj8L3n2M7l2L0l6%K9j5M0o6
5210c9K2m1N6Rj6k6R3o5k5K4K7l4K7J4n8N4J0l2kK4%l0QK7k1kJ1knm5N9Rj00O3
5244fJ1K5q0J1Pj8M6kMl2K2o6O3Qj2K3k7k5K5Q8k4j2J2j1Mk5j9L5m4M6l5K3l7
5277b2RL3k2n7P7m5j2P0n3mlj1K3J0M6r3K9N3o8L2k2oJ0J5kjL1k6K3J9l2Pok2
5311b0l7N7l9L9K1K4q8P4k4Lk8%j7M4j5K%j4k7P0m1JK0q1Q8j7M9l2n4J7Kj4L0
5344gl5M2L3n5PpK9m5P8Kk0l4k6K7Q2l6k4L5m2oJ0M1q7M9RJ2n6k7L6M6n2j0J1
5377b0L0Rn6K9n8N6J10j11j5N3n2k6Q3m9N7o7KN7j1Jl8J3K1l3J6Qj1qN2jnp4m
$$ y = [-3, -11, 13, 40, -25, -40, 58, -46, 0, -5, 33, 30, 2, -5, -54, 16, -17, -12, 44, -5, 32, -53, 31, 37, -26, 44, -24, 18, 12, -65, 19, 0, -22, -6, 12, -10, 1, 51, -26, 58, 4, -27, 13, -3, -22, -2, 13, 31, -36, 23, -6, -28, -30, 7, 1, -17, 16, -36, 11, -21, 9, -27, -27, 2, -13, 27, -39, -17, -58, -2, 7, -9, -35, 58, -7, -32, -8, 19, -15, 12, 26, -32, 22, 32, 0, -2, 22, 22, -8, 0, 27, 6, 4, 15, 13, 8, -37, 22, 31, -69, -6, 5, 30, -50, -39, -32, -50, -4, -6, -2, -34, -12, -78, -15, -7, -19, 4, -23, -48, -23, 65, 41, 29, 41, 30, 34, 9, -10, 25, -19, 27, -8, 15, -22, -13, 20, -2, -59, 18, -27, -39, 31, -22, -26, -29, -40, -17, -7, 39, -54, -25, 28, -40, -8, -30, -36, -26, -11, -13, -14, 17, -9, 14, 33, 1, 8, 2, -20, -57, 0, -39, 0, 21, 45, -43, 31, 7, 10, -18, -18, -35, 9, -6, -4, -4, -18, -45, 25, -16, -15, 5, -76, 12, -5, 44, 12, -42, -25, -23, -37, -7, -42, 0, 33, -22, -15, -22, 7, -38, 40, 42, 22, -12, -38, -11, 71, 35, 11, 46, 4, -2, 8, 49, -38, 11, 20, 32, -24, -51, -15, 31, -21, -31, -20, 10, 19, -37, -8, -66, -10, 100, -11, -26, 27, -25, -51, 32, -17, 40, -27, -25, 32, 21, 22, -16, -3, 18, -15, 1, 9, -2, -10, 42, 41, 36, -38, -42]
5410d2O1l1l9L9Kk1M3j8K2k4k1K0j9M7kNn2M0J3n3L3qlRK4l0j1K5pJ9m3N9m5K
5444fm5P4p8PN4L9p4J8L8m8nRl9J06m6n5Q2n4OkL2m1N7k3j5pL0Ll2PK5k5J7K1
5478C0o6L6k8k9N6Rk1K8kj8L1rn5K2kM0J9n4LL8qn6J7nK1K6n4K4J3J7n1QPm3O7
5513A1Lk8L3n7O1k1Q2o4j5K5QPl3Lj5O8o5p%m4K8K3jn4N5J2n1j0O7j2L6n1L4n5
5547b7M3n1P7l9J1m3K5OJj7L1ROn9KN9l4KK8J1m6K8J8m8l2L0n6Q3l8RJ3j4L4m
5581A8Ml9K1l3M8q4P5n2L1M6k9J7o6M0pNo4P2J2J0m1N8m1nk6N4n7O8k6rJ3k7O8
5614E4k4j5j7J2J8roO2j13K3M1l1k2K0N3j28P8Mj1j2P4n3K7qn9M5l6K7O7l3ok0
5646BL2j9j7qK0M4m5l1N6km3K2o8N1m2N3l8l1J19m0m7L8K5l6qo0Q7Pj1j8Rj7m9
$$ y = [-42, 19, -12, -51, -12, -10, -31, 12, -6, 16, -8, -29, -9, -28, 19, 17, 22, -30, 10, 23, -30, 3, -5, -8, 1, 25, -5, -16, 9, 2, 21, -22, 37, -8, -6, -51, 23, -55, -48, 6, 45, -29, -11, 27, -21, -26, -17, -56, 50, 4, -51, 31, -23, -17, -19, 13, -28, 29, 6, -9, -16, 14, 17, -15, -8, 17, -8, 9, 30, -36, 0, -28, -57, -1, 8, -13, 15, 13, -5, 26, 17, -38, -16, -18, 22, 41, -13, -10, 28, 20, -36, -19, -24, -3, 23, -31, -7, 6, 23, -28, -20, -13, -56, 11, 14, -14, 19, -38, 23, 2, 84, 20, 5, 30, 38, 45, 12, 15, 0, 68, 3, -4, -4, -48, -20, 3, 2, -52, 3, 15, -36, -46, 21, 9, 45, -6, 28, -27, 16, -35, 42, 3, 14, -29, -4, 2, 3, -14, 17, 26, 32, -27, -25, 34, 0, 2, 30, 41, -5, 23, 41, -7, -39, -9, -65, 18, -20, -11, 2, -12, 22, 18, 22, -17, 4, -29, 19, -65, 10, -42, -11, 35, 6, 23, -43, -3, -10, -5, -69, 3, 15, 25, -16, 42, 1, -4, -30, 24, -33, 35, 9, 0, 13, -14, 54, 30, 15, -2, 10, 28, 19, 13, 75, -38, -15, 26, -5, -27, -7, 46, -82, -4, 0, -11, -23, 51, -2, 25, 17, -42, 3, -33, -6, 61, 28, 22, 2, 34, 15, -2, -10, 10, 54, 9, -22, 34, 32, -11, 11, -57, -6, -48, 5, -33, -64, 55, 15, -32, 6, 31, -5, -13, -73, 14, 21, 10, -8, 1, -16, -65]
5679f5PM3J0j8Oj6J1J7MML3m3M1l0m6P6Omk8nl1O2k4k9Pj9QN8m6l7K0L2NJ3Po4
5715c5K1J4KJ1L2o6J3J2Pk3L6po9M2K2p7M9j7J2K9n1%RO7m4N3m0JL5p3N0jM3n9
5749bj1jMj1K6l3L6K5n0N1o5JJL1Pj3J0j4Jj0M8ql3P8p0j0K2Ql0K2j5Rj9O0l9
5784FlJ5jK1no2k5K7K1J8jOol2K2j4L9jk2l3M5J8J3m4k5L2Oq8M2K8m7J43j14L4
5818A3j9J1n3Q2Nj0Nj5jL3j8n1K3L5r0R2qn6K4L4n5M4K0n6K9J2n5k5J6P0l5j5
5850a4R9j28O8m3N0k6O0r6M7k4pK5K0oj4Rj2o3Q5m6k2J04m5o%j0Pj7j0K4lJ2M
5883B2j3o1O5k8rKL4J7J1p7O6n1J2Qk7L8K2m3jQ7l0k5k1lk7N8om0R4r7j1M5k3
5916a2J1L1m1NL8lp1N9o0O4nRm5m0Q6J3j1j5l7N2j7J8l4N7o5l4Q2p4O7j0m6M3
$$ y = [-65, -58, -15, -5, -23, -17, -33, -22, -5, -1, 3, 36, -7, 34, 4, -42, 34, 40, 36, 8, 3, -28, 34, 10, -19, -12, -31, -23, 35, -11, -48, -28, 4, 9, 22, 29, -35, -14, 0, 2, 13, 45, -21, -8, 4, 11, -12, 24, 17, -52, -10, 12, -65, -16, -33, -21, 8, -43, -43, -34, 33, -11, 42, 2, 3, 38, -35, 15, 14, 57, -2, -13, -14, -10, -21, 5, -28, 8, 33, -17, 34, -31, -30, -29, 2, 9, -4, 6, -8, -7, -17, 31, 23, -10, 68, -2, -12, 10, 18, -12, 10, -5, 4, -15, 45, 6, 3, 18, 17, 38, 33, -29, -54, -27, -6, 12, 11, 17, 11, -21, 1, -13, 26, 25, 3, -30, 15, 33, 46, 2, -23, 9, 15, -73, -31, -3, -50, 93, -21, 13, -6, 5, -48, 34, 39, 29, 34, 19, 18, 51, 33, -18, 5, 40, -50, 42, 34, -22, 2, 36, -19, 25, 45, -11, 18, 30, -25, -50, -34, 36, 1, -14, 85, -43, 25, -18, 32, 6, 66, -30, 17, -7, -14, 11, 31, 25, 11, 20, 8, -55, 30, -16, -38, 66, 21, 15, 15, 5, 12, -5, -15, 9, 6, 18, 22, 9, -52, 13, -15, -24, -22, 12, 29, 40, -37, 29, -22, -10, -2, -29, 9, 31, -12, -13, 74, 44, 19, -2, -5, -32, 26, 20, -20, 74, -23, -34, 11, -12, -1, 30, -11, -6, 32, 29, -42, 17, -43, 21, 16, 25, -20, -60, 26, 39, 28, 13, -24, 28, 11, 29, -5, 52, -13, -47, 35, -39, 28, 18, -28, 15]
5948A5MQk4m3K9L4M7o4J3o7J1M4J6kj0k6k0J3%kk6L9rl5K7Q3j06P0Kk7K3mm0k4
5982e1N0O5m9j0k1k8Q7n8M5m4lL0J3Kq4R1j0rJ3l1L8J0M7j42M1K0pj9LRn0J02
6014E0l6m1j3k9R9Jm4K9m8LMM5m1J3N8o0j2MJJ2%K0K6n2Rj1mk9O0Ml9K4Rj5O0
6049E7n3k7%K4nQm7M8lk1QJ9m4%K6l8jP7Jm6k4P0j5NK1k7K1k7J1j9J7j9j8L1r0
6084h0M5K6j2j2N2L5q9m5Q0K8J4m6k8K1lj6nO3K2l0ql3L0j4Pj1o8N4PJnR3q2R
6118@J6j3j3MOk8M5j2m1O1o4O1k2oj1%K5J5qK5j8k8L1m6j7K6K2J8j2o6J1P2m4
6151a1j1M1o8M3J9L6m7j7k6OO9l6k7K7jj5L3JK6k7om4M3N4n9mpj9j8N3mrj1j2
6185b8j1Q1q3L3Rk9J3L6k3k8O0Nk3L3nn9K6K2k7K2M9o3m1L4qj9Q3o0J2M7k1l9
$$ y = [15, 19, 27, 3, -40, -11, 23, 70, 6, 19, -48, -37, 7, 23, 21, 11, -15, -35, -22, -22, -24, -50, -11, -20, -55, -28, 55, -51, 19, 21, -6, 17, 13, -27, -51, -1, 64, 15, 5, -16, -44, 43, -15, 30, -14, -17, 13, 26, 28, -56, 35, 25, 16, 29, -2, 36, 46, 93, -49, -8, 12, 5, -14, -11, -2, -52, 50, 14, -27, -40, -69, 30, 31, -13, 16, -32, -29, -25, 20, -21, -8, 50, -10, -22, -18, -17, -5, -5, 15, 41, -11, -2, -13, -17, -46, 14, 18, -21, 3, 12, -3, 57, 4, -23, -23, 1, -4, 4, -43, 5, 2, -19, -11, 8, -36, -36, -10, -48, -49, 28, 29, -17, -41, 29, 14, 19, 40, 13, 34, 7, 18, -1, 16, -3, -21, 10, -80, -35, -9, -21, -33, 19, 54, -35, -80, 0, 28, 42, -4, -32, -11, -14, -30, -35, 28, 50, 20, 12, -21, 9, -5, 2, -9, -77, -23, -16, -15, -20, 73, -9, 0, 16, 3, -10, -6, 0, -28, 17, 5, -36, 25, -39, 22, 0, -6, -17, -17, 8, 23, 15, 40, 22, -6, 25, -21, -38, -12, 10, 28, 16, -50, -39, 33, -11, -22, 19, -49, -6, 13, 49, 2, -15, -41, -35, 34, -2, -29, -2, -3, -18, 15, 16, 42, 15, 9, -35, 8, 62, 3, -1, -8, -27, -45, 8, 4, -5, -16, -28, -39, 42, -41, -8, 1, -28, -15, 21, -2, -30, 30, 35, 12, 45, 40, -19, 7, 29, 2, 24, 73, 10, -31, 3, -5, -24, 59, -1, 11, 58, 37, -2]
6217bk4k1M3J0k6jK5k7j6N9K4m8LJ0l6J9Oj7k2j2J3P5L0n9K9n9l4R1n9Jj5M9j4
6250ej1J7l4J4k5L4NL8Om5L6J2j04QQ0r6Q8l8J3JP1r4N9n6k2RM1k7k4RL9j6L6
6283A9o1oM7kj2qN5k3M7q1J3QJ3rK1k6j5O4j06M5L5k3jN0n8oLk1mN9l3%m3K0k
6318d1K5K6k2K4K1m5M4l2K5p5N8j3Ojj3K5j4K5J9n7K7n5N8j2J2l0j0K6L3n7qP5
6350D4k5k2K0m7L1m6O8p7J0N0m2O6NJ5ql5J4j6L2j4k4K3m6M1k7J4N5o4K9ql0M4
6382C0o0N6l3oO3k4o8N4j5J0j1l6M7k2K4ppj4lM5J7no5NM6j3J8j02N4K3k3K7p8
6415g3J01o3N3Jmk3%K9k8j6J4rR%rPJ7k1J7l4O7k2j0l6M1j4j1l1O5p9N5l5L2J6
6449Fn0K6k3N9j1j7L3k1k0L1J0l9L7k4J7Lm2%N7k8k1O3l1Pn2L0J4Ro2PMmL0J2
$$ y = [-2, -26, -47, -4, 6, -20, -21, 4, -23, -39, 20, 44, -4, -1, 9, -27, -8, -2, -19, -41, -53, -40, 35, 65, 6, 35, -24, -58, 33, -26, -25, -40, 9, -5, -16, 1, -33, -19, -44, -10, -5, 33, 39, -6, 30, 42, -62, -54, 26, -70, 18, -20, -7, -6, 65, -29, 30, -26, -48, -39, 2, -25, -49, -40, -1, -17, 19, -42, -48, -1, -3, -15, -23, 32, 9, 56, -25, -12, -4, 9, 0, 21, -5, -20, 44, -62, -17, 18, -5, -6, 44, -14, -20, -17, -38, -42, 17, -16, -16, -59, -39, -41, -16, 10, -12, 12, 33, -12, 32, 0, 25, -50, 8, -5, 1, 0, -13, 12, -2, 23, 42, -15, 12, -43, 15, 3, 15, -15, -25, 1, 34, -23, -31, 44, 19, -3, 17, -30, 1, -45, 23, -54, -44, 6, -36, 30, 35, 50, 42, 7, 21, 5, 37, 23, -1, 22, -24, 17, -10, 4, 59, -5, 24, 16, -14, 30, -30, 26, -7, -13, 50, 26, -42, 12, -3, 7, -4, -40, 7, -15, 9, 2, -5, -19, -22, 23, 40, 35, -30, -25, 21, 8, 26, -76, -22, 1, -22, 5, -73, 28, -35, 18, 19, 15, -8, -8, 21, -7, -23, -9, -18, -9, -9, -18, -11, 6, -15, 2, -32, 35, 13, 3, -33, 8, -6, -17, -48, 17, -62, -7, -42, -10, 6, -44, -18, -41, 18, 7, -10, 23, 2, -18, 13, 23, -16, 21, -3, 14, 17, -25, -25, 32, 4, -17, 46, 15, 22, -30, 0, 14, 23, -39, -32, -28, -32, -2, 10]
6483A0J2k2j6K2QNkj0oK2l8k5N7q0N6m6nk0O5J6k8l2L8M1%oJ2j6k8LK5K7q1k5
6517f7J21Klo9L5n6J02q0K2NK8o5oK5j2M1l5M1J4m7P0m2kk9J4k9L4PL2n2ML3k2
6550A4LL5m2k6O9l3m5O0o5L9jj1k9LO0Lj7J6l6J2m3L2K3l7j7JJ5mK6j5o1L6K9
6583fM6q9M7l7RJ1L9RJ0r8O3Ro5O0K7k1mp0M5j6K8Rl0%K2qj5M0q1M1k1K0MJ5m
6618a1jm1P3KoL2j8k2jJ4N6n6k6no3O2L2k3k1JL2pJ5qqk6N4l9l0J6O0l0k3j9P8
6653D3m4%Pll4J1K6l7K2QJ8n8J01p1nK2l5J8k2M7k0J3J7o7J2L4jJ6l1j5M2m2K4
6686dk3oJ4O3o6mM1k6K1J7J7r5K5M1m3K7l8L3PLNl2M7M3o5J0l1l7K6K1j0J9k2
6719b2J5J8qM4j6l0Kk%K6m5K3K5n8k7O2k7J8K9o2L7j2L3p6N5l9M0J4p2M3OL1m1
$$ y = [10, 22, 0, -16, 6, 14, 19, 17, 7, 1, 23, -15, -40, 17, -63, -7, -53, -58, -78, -13, 3, -25, -57, -19, 22, 22, 16, 28, 12, -16, -13, 12, 39, -42, -67, 54, 56, 53, -16, 19, -37, 65, -15, 7, 12, 40, -25, -31, -6, -18, 23, -12, 29, 43, -4, 66, 24, 22, -7, 7, -22, 12, 19, 51, -1, 3, 36, 14, 17, 52, 10, -16, 53, 20, -25, 35, -30, 9, 8, -3, -32, -29, 31, 34, 17, 33, -3, 9, -34, -2, 21, -16, -33, -32, -17, -21, 5, -10, -71, -35, -6, 40, -49, -2, -39, -30, -19, 20, 29, 39, -59, 4, 13, -52, 8, 35, 14, 10, -60, -15, -31, -3, 6, -24, -24, -2, -10, -25, 15, -66, -25, -46, -26, -22, -7, -11, -12, -53, 20, 22, 16, 48, 30, 8, 7, 21, 77, 21, -5, -10, -73, -11, 21, -2, -23, -22, 10, 3, 18, 10, 2, -24, 30, -9, -39, -23, 37, 7, -16, -35, 43, -1, -1, 6, 3, -31, -20, 6, -31, -9, -1, 17, -41, 60, -11, -16, 6, -29, -11, -33, 14, -6, 7, 24, -43, -31, 3, 2, 18, -13, -28, 14, -28, -4, -27, -33, -19, 44, -22, -26, 15, -11, 10, 27, 44, -51, -26, 15, -28, -1, -39, -6, 1, 4, 9, -23, 24, 67, 2, 12, -19, -56, -30, -9, -19, 0, -22, -7, 11, 3, 47, 31, 1, 3, 1, 1, 27, -18, 5, 30, -28, -55, 7, -20, -2, 27, -35, 2, -10, 23, -53, 2, -37, 3, 17, -55, -12, -6, 25, -16]
6752a6M4k1m3O7l3j7K9n4J1L2o2N5N1m2j3M9kl9Om3M3Nnj4K3L2o5K6M4o5K5J6
6784B4k7NL2k2J0Nl5J3nk3L9l5k3J3P1j09M4P2l8Rl2l9Q5K6n4l3NK6m0O5k7j4
6816a2J7oKN2p2N7j7m1MmK7J8m7N5q8K8O3m3J1J9q0N7J2K1J0r4j7N8K2o1Q1J8
6848E0o6L9Nk9K3l6j7M8J4l3o3L3N0K1Qk7j9k5K4j9M6k9%%j2j7M2L0l9J7n6P5
6880C8p5j4K2L3k2j9K6K6j5j5M6k6k1J0NRK8m7NPj8J04r2K3Orj3Lo1K5pJ0L7m3
6914c4O1l0L8o2J9j1qM2l3NM6j1o6LPJ5L2pM0j9l6K7Lql1M7j0rKk1M2p7R6o5L6
6949B3k9J3K5l5m7L8j3L0j7J2l3L9L4m9M2j03M5l7J00m8N7m3l6LL6j8ROrL9l9
6980eqlN1n3j4L0J3l3M0o0K7J7j9J4K7n1K3q9P7K1k2M7j9K1Rq1J7OoO2k6j9M5
$$ y = [-16, 28, 7, -36, 31, -2, -19, 10, -44, -33, -1, -63, -8, 43, 1, -12, 37, 35, -4, 2, -41, 2, 7, 2, -12, 11, 43, -22, 4, 48, -17, 8, 24, -3, 2, 34, 12, 22, 27, -8, 5, 0, -23, 16, -19, -42, -29, 42, -67, -23, 49, 11, 20, -12, -51, 34, 60, 6, -27, -22, 4, -36, 29, 2, -12, 5, -1, 1, 53, -19, 38, 21, -20, -16, -20, 7, 25, -22, 33, -55, -27, 36, -7, 4, 23, -57, 0, 12, 33, 43, -51, -68, -10, 12, -49, 32, 50, -16, 23, 28, -1, 22, -14, -31, 17, 31, -2, -65, -32, 18, 39, 47, 20, 1, -24, 0, -19, 27, -2, -2, -2, -14, -31, 11, 41, 2, 19, -37, 38, -37, -51, -29, 4, -18, -37, -11, 15, 0, -15, 31, 5, -16, -6, -1, 8, 36, -11, -6, 1, -17, 87, -5, 18, 24, 15, 2, 5, -56, -31, -38, -28, 9, -34, 27, -3, 35, -27, -8, -19, -27, 15, -18, -13, 33, 22, -44, -41, -34, -19, 13, 6, 46, 27, -9, 18, 21, 13, -18, 29, 19, 10, 12, -9, 33, -44, 52, -13, 23, -6, 7, 32, -3, -50, -12, -25, 5, -12, 0, -33, 6, 40, -9, 33, -70, -25, -62, 38, -10, 47, 4, -32, -29, 7, -11, -2, 4, -5, 34, -5, -13, -16, 35, -18, -32, -2, 11, -22, 18, -42, -15, 2, -17, -3, 24, -27, -4, -93, -16, 5, -17, 30, 11, 32, 41, -40, -23, -17, -23, 39, 13, -6, 39]
7013C9o6M9k2J9m5QL6k2jnl1N0l7mO4L7r5L9qJ2j7m2OK1mnKPK6l9J2j2k5L4O2
7048D3k2o5L8J1J9j5j3m0L8qpP5l3l1O3q4N7j1k9K2ON0o2j3K7ml2K2lJk4O6k9
7081A3mj2j1N2J8l4m1J7p%j6K3M2j14P4P7r5m3J2J4pJ23o6K0ml0K9qn1M4l1K9
7113A3jJ3M4n7k1K1mM1o0MK7J7o3j6J1j9L8jPK8m7j4M0l3P5k2%k1j4j1j1n0Q0
7146fk5L0k4O7k2o4K5K4lK4j2l3j8M8n6L4J5l8O0j5J2n3M9L2j04Q8l7J1k8N3p2
7177c8L5J8ll6M6j5j9j1m0Q4k7Okk3j5N8j4JJ9p1J9M7j7ok6J6M5m3jo%N0k5j7
7211a1Jj3k1P3o4rN6l2l6N3K3k9J7k1L3k7l6K2K1J4p1M4L3K8JPo8l5P8k3l3P5
7243E0o4NJ5Qk4J9l6O1m9K8j6k4M7p9M2K8k6K1Pk0Kj8J2l1K0J4O0k0p1J8pK1K9
$$ y = [39, -27, 22, 0, 19, -26, -18, 18, -4, -5, -10, -41, 9, -28, -32, 32, 69, -26, 13, 5, 17, 0, -42, -36, -15, -19, -24, -22, -15, 11, -28, -16, -28, -53, -19, 43, 21, -44, -6, 5, 24, 9, -4, -44, -6, -14, -21, 54, 21, -10, 53, -31, 26, 15, -14, 8, 14, 64, 2, -11, 16, 12, -20, 2, -1, 0, -24, 42, 13, 9, -3, -14, 38, 56, 22, -19, -2, -9, -9, -25, -2, 40, -74, 0, 77, -18, -61, -49, -35, -42, 81, 15, 35, 31, 1, 30, 22, -29, 15, -16, 13, 12, 25, 69, 12, -9, 12, 8, 49, -11, -7, 20, 37, -26, -42, -31, -50, -12, -13, -6, 22, -25, -39, 1, -32, 43, 21, 21, 0, -14, -25, -36, -86, -6, -31, -1, -25, 42, 20, -44, -19, 5, 2, 26, 14, -19, -37, 11, -45, -11, 4, -34, 26, 11, 23, -30, 19, 51, -53, 35, -2, 9, -19, 34, -38, -3, 15, 12, -24, 22, 7, -12, -23, -63, 21, -6, 0, -2, -25, -40, 18, 4, 5, 24, -47, -28, 19, 2, -4, -30, -14, 31, -12, -13, -19, -19, 31, 6, -11, -10, -23, -44, 29, -35, -44, 12, -20, -56, -3, 20, -9, 8, -13, 20, -7, -43, -21, 0, 14, -57, -13, 20, 48, 49, 56, -12, -47, 31, 8, -25, 50, -14, -9, 6, 14, -10, 9, -27, 34, -15, 13, -3, -27, 20, -59, -17, 11, -15, 6, 13, -7, -5, -23, -11, -42, -22, -8, 52, 32, -39, -21, -28, -7, 22]
7276B2K0o7O2J3r8P3J1j1m9R1m9k8M0n4OP9m8k3J2n5M4L4p0L7L3m9O6o7J8O6j17
7307e8M9J5m3J4%K8MK2q7N2J7rM%J5m4mK6L3l9jL4k6k7j4K4NkkN9k2p6KM3J0m2
7343d0J2k3K8qJ1J8l6J4L4m3M6Pj5l6J4J3J9j1K5p3M5%M1j5Pj5omj2l2L2j5J6
7376bJ5qJ3k6N%jL1J3n7%m1Q1p0K5qN1oj9j7M3l6M2Jl5NK1J8m9oJ4j4MJ5kLnJ0
7414Ho0M8MK7j0K0q4P3%j4j1kk5nP6m3oj8Q2p1Rl0J9JN2r0J5L9m2J8M0m6Q5p4
7448a5mR9n7K8o8K2L4j0j4rk0J6k6JO6rl6k7K7j4NL0j2l4L9k6OJ4l0M5o0M8%m0
7482c1Q2j08KO9o3P6n0O5Ll4l4j5O0K9o1nL7lj0J0L7o0K3l5l1J4L2l5M9j2K2k1
7514BJ1k1j1RKj0M0j7m2j3K0k0Q4n1J1K5l4kj8L0k4K1R6j26O5n5n9R3j9L1RRl9
$$ y = [22, 42, -25, 37, 50, -48, 25, 36, 25, -24, 67, 18, -10, 30, -24, -18, 61, 13, -10, 2, -53, -9, 25, -45, -8, 25, -24, 42, -25, -7, 59, -58, -9, 6, -37, -23, -23, 5, 9, 31, -56, -4, 13, 4, 8, 8, 23, -21, -25, 1, 34, -5, -6, 28, 2, -25, -39, -15, -10, -12, -14, 45, 23, -53, -51, -8, 2, -40, -28, -51, -23, -31, -20, -2, -38, -24, 10, -33, 13, 20, 5, -31, -17, -4, 15, 4, 29, -44, 1, 1, 42, 27, 34, 19, 13, 9, -3, -35, -3, -18, -2, 13, 5, 18, -8, -3, -3, -4, 27, 40, -17, -17, -58, 23, -47, -22, -30, 21, 15, -4, -21, 22, -14, 28, 29, -6, -1, 20, 38, -11, -17, -3, -17, -13, 2, 0, 3, -2, 8, -52, -4, 0, 27, 17, 37, -47, 26, 26, 12, 1, -1, -26, -31, 45, 2, -4, -22, 60, -11, -2, -32, -13, -12, 40, -50, -35, 4, -38, -20, 20, -26, 59, -15, -19, 80, 23, 51, -17, 5, 39, 29, 15, 6, -14, 2, -24, -23, 43, 34, -2, -29, -2, -16, -11, 19, 7, -27, 12, -14, -8, 6, -24, 21, -39, 9, 9, -31, 51, -57, -55, 14, -49, 27, -23, 42, 45, 11, -23, -38, 22, 51, -10, -15, 22, 19, 9, 19, 56, -4, 19, -16, -47, -33, -1, -36, 13, 1, 23, 2, 13, -8, -19, -10, -8, -18, 22, 5, -37, -50, -30, -50, 34, -17, -6, 19, -15, -17, -35, -5, -29, -8, 88, -38, 27, -28, -87, 6, -13, 18, 27, 36, -3]
7547ck8KJ6Rn0N7k1M5n8L2k7l1M1K0LJ5J6l4j4O3n2qJ3j6pJ7K1m6R0k3m9k6L4
7580Ak0j7M0OLk0k7N5rJ2K0k5M3j01K8J8l5J9l7N9Lo4P3%k7k8jM5ko3O2K4p2M8
7614A1Nm3O2m7L8m6J4l8L9PJ0K8J6m1j1no5N6l2K7K4k9j6PJ1J0M0o6Lk8L3N5J3
7647D2n0j1O2o6J9jJ8J1k6l3K9L5k9OK0k8L7pm1j9J6J6m3M7qpNJ5m1J2M5l6M1
7680C0m2o4O0j2M3n5M3Pn6N7M3o8J9k3nj8N3oq2J63q2K6k9l1l0P5L7j00O6j8O1
7711F2l1k9j1L1l6J5L0k9rJ4k3L7k2l4J3K5j03J04m2Q1r9N4l3P8j16N0j9L2J6
7740Fm7M9j1LlPK8k5OL2l6J4j4Km2NK9J6o0L3K2l7qKM8l4nk8N3L7o7M4ml0K4j1
7776bQk8k7J6P6n4KM0k5K2l8Pj0M7jl7Pj1LnoK2L7l3MK7n7J3J8j0l9jK2M0o4K2
$$ y = [-3, -31, -29, -13, -4, -54, 3, -18, 27, -31, 1, -26, -57, -16, 4, 7, 22, 38, 4, -10, 53, 1, -7, 6, -10, -17, 0, 21, -25, 65, 42, -7, -33, 1, -19, -36, 4, 10, 13, -7, -34, 21, 12, 24, 44, 19, 62, -39, -11, 7, -28, -9, -46, 13, 16, -48, 25, 25, -2, -30, -31, 14, 12, -51, 11, 35, -37, 11, 16, -27, 35, -12, 26, -20, -6, -44, -5, 2, 12, 40, 56, 15, 4, -1, -66, -10, -42, -15, 9, -20, -36, -29, -18, -8, 32, -34, -31, -59, -26, 29, 42, -8, -19, 43, -23, -4, -5, 13, 24, -2, -35, -6, 29, 0, 6, 26, -2, 35, 28, -13, -32, -16, 0, -43, 4, -4, -11, -6, 9, -32, -20, 25, -11, 30, -12, -76, -16, -28, 15, -40, 3, 10, -46, 11, 54, -14, 5, -18, -23, -41, 12, 6, -76, 87, 5, 31, 2, -29, -59, 16, 53, -47, 19, 1, 62, 31, 2, -9, 22, -14, 1, 31, 2, -7, 7, -16, 21, -1, -35, -22, 3, -100, 4, -38, 43, -56, -2, -35, 43, -73, -23, -42, -10, 6, -41, 8, -3, 0, -3, 4, 32, 7, 13, 45, 9, 23, 9, 11, -31, -26, 3, 19, -41, -8, 14, -23, -31, -29, 19, -15, -20, -48, 5, 42, -25, 19, 15, -15, 9, -2, 6, -22, -49, -33, 43, -11, -9, 31, 6, 28, -10, -3, -13, 34, 33, -4, 3, -8, -5, -10, -16, 6, 43, 10, 14, 41, -16, -3, 15, 5, -34, -35, -13, 27, -37, -15]
7812a5l5K1M0l9J1PJ4J0K1l6lOl8K6nk6M3j8NJj4O2p2N3n5J8J2L4l0N4l1p0O3
7845A4Lj0L4m1l4N6J5p7M0lJ9m5L6k4K6rN9p2l3K9n4L8M8j5j7qN6l2N5rj8K6j06
7878e3R0n2L9qk2RNk1L1J5o2Q9p7L2m1N0j5l8R5j16M0%J5j8J3nJ6j5J3Rn3M5m2
7911c2O6j3j5NK0n7N1nj0j8LJ5p8J02j3p5K1P1k0J9l1n3k4Q6j0JJ9mRj2J9j2n5
7944c0N0n7%K7l0L0P%j1J08r6N9n3j9N4o2J3MM5j7j1K3qo8O0J8Qn6k5N1k2K9n4
7977c3M3k3QLK0mmM5r7O4j3K0l8m2Q8j7p5P6k6K0ol9L0k8N2l6J0J9M7m2J8o9J3
8010a6N2Kn2L5L5j8rj7k1K2j8l2J5O4p4KP2o7m6J04n0J6L9j8k6j3P9r3P6p4N8
8041B7p2N5n6M1M9l1K2j0m5N0oOl7%j7J3J1lj7j6M0n5LN9lmO4o0oL6l2q5L2L2
$$ y = [-15, -50, -29, 11, -28, -17, -10, 4, 14, 35, -1, -4, 2, -36, -10, -15, -41, 2, -16, -11, -10, -24, 38, -34, 19, -36, -18, -6, 28, -2, 52, 21, -49, 14, 17, 7, 41, 0, -34, 22, 37, -40, 0, -3, 16, -29, 7, -17, 9, 0, 59, -13, -46, -17, -71, -33, 15, 0, -17, -25, 31, -1, 54, 45, 27, 53, -53, 37, -15, 24, 16, -6, 3, 8, -13, 18, 33, -29, 60, -17, 15, -26, 24, 9, -29, 66, -50, -10, -10, 5, -13, 0, -5, 11, -4, 9, 18, -35, 10, -32, 34, 21, 6, 11, 31, -26, 25, 20, 10, -8, -5, 10, -68, 34, 21, -54, -33, 38, 18, 37, 6, -47, -71, 15, 5, 6, 25, 21, 30, 18, 37, 25, -30, 20, -37, -37, -10, -40, -10, -3, -3, -14, 94, -2, 57, 4, -15, 39, -23, -10, -6, 39, 22, 11, 34, 26, -42, 18, 36, 44, -12, -37, 14, -8, 21, -33, 10, -13, -5, -2, 18, 14, 10, 55, -42, 22, 9, 29, -9, -51, 37, 20, -55, 21, -5, 15, 9, -30, 0, -28, 24, -12, -2, 17, 64, 22, 40, -29, -16, 36, 38, -14, 21, 56, 38, 29, 12, -9, 13, -5, -37, -22, 42, -32, -30, 42, -25, -71, 33, -17, -1, 38, 20, -6, -19, 60, -33, 43, -31, 27, -45, 10, -46, -5, 44, 13, 35, 25, -20, 30, 24, 30, -7, -7, -24, -11, 0, -3, -20, -36, 4, -51, -48, 11, 8, 4, 68, 8, 2, 38, 6, -79, -47, -15]
8075a5rL8mk8L4nJ1jj2K3m6M6l4m3K9rR0r5OL4Ll2L7j8l%J4n3J1O2k4K4NK1p0
8110a3M4l7m0O3J7j03PQ1rK3l5rP8q5KJ00o9QnJ5l6M3o9J9K9n5N3k1j0O4lk6k6
8143eM0K0l6j8MQlk8N3n8L1J9l9L1p9K9L9nk5J8m0L8N0r7Q8j0k4J6NK2j00N1l2
8176c7K1O2p1J2L0l0K2o1P4L8r2Kk7K6L9
$$ y = [-15, -24, 14, 10, -18, 16, 11, 22, 21, 9, 32, -14, 32, -2, -45, -16, -25, 65, -30, -24, 10, 13, -19, 18, 0, -3, -3, 11, -42, -31, 31, 7, 31, 36, 57, -13, 31, -6, -46, 17, 34, -69, -62, 19, 10, 33, -2, -11, 67, -18, -16, 84, 15, 23, 18, 33, -3, 40, -29, -10, 19, -36, 17, -4, -14, 50, 47, 21, -5, 35, 55, 19, 1, 5, 13, 10, -18, 35, -23, 8, 27, -12, 19, -60, -31, 8, 3, -22, -4, -44, -6, 44, -53, 35, 25, 1, 17, 22, 44, -56, -5, -37, -16, 46, -25, -13, 17, -13, 9, -52, 22, 60, -32, -30, -57, -31, 8]
8191H
$$ Imaginary data points
##PAGE= N=2
##DATA TABLE= (X++(I..I)), XYDATA
0@%%%%%%%%%%%%qJ6j6K0k8L2m0N6o4P2q8J04j24J48j73K00k31K68l08L51l99M55
34B43n17N82o55P35q23R22j029J144j271J410j561J726j906K104k323K562k821
51a478L105l420L770m159M595n086N642o281P023p895Q939j0211J1806j3877J6679
66I152k0704K7029l8755R3620l35245J79560L92730m95412P4030L82314l45228
77g6909j34471L95097j53051j47753K26761j07050j30821K19649o8220j12964
87h9732J51371n6967q2867J70012o5714j15723J23108l3013n2837J44129r3941
98b174j00150J72555n4279j04924J99312p3250k00857K18725M8710k23326J45163
109B5505P4514k29779J17248J50110k09550K9111J38606j67151L0086J60791j70051
$$ y = [0, 0, 0, 0, 0, 0, 0, 0, 0, 0, 0, 0, 0, -8, 8, -8, 12, -16, 16, -24, 32, -32, 40, -48, 56, -68, 80, -93, 107, -124, 144, -164, 187, -212, 243, -274, 308, -347, 388, -435, 487, -542, 602, -669, 741, -820, 906, -1000, 1104, -1219, 1343, -1478, 1627, -1793, 1977, -2182, 2413, -2673, 2969, -3312, 3711, -4184, 4755, -5456, 6350, -7527, 9152, -11552, 15477, -23278, 70342, -264903, -85343, 307387, -188025, -113995, 268319, -76909, -211380, 183717, 30666, -117087, 109674, 2624, -128197, 91452, 23232, -89732, 61639, 4672, -78195, 91817, 26103, -89620, 33488, 475, -52362, 91767, -2174, -102324, 70231, 15952, -88972, 110340, 37090, -163767, 54958, 103668, -119658, 25505, 100019, -129760, -12512, 137598, -71952, -42841, 95765, -71386, -41300, 119491, -50560]
120e0560l1571J76137j07186m6377J56861j06874r1660J59490l0704q5767J06460
131D8249m2855p6972J23986j6876r1563R1715k5434q9400J23953R915j27147Q3077
143A0648M0764j09944O9403N1966j22956L6777P9254q8230K2473O5378j00616
154d5083J2946J00245q2382k4804Q9386o9494l4988J12087l8139p5555P9270l959
166A9530o0447O7300K825p3135M4445K3086m8865L7107J2228n8529L5613L1548
178C2706n3875J7137K6127n1118K0600M3451m8041j471L7013l7274M683M2403
190C2341m4653j3370M8607k7896j3211N0017l1686l3427N4862p977m0369M1105
202A4343k193m3476M0572J5840m6379K0976J8766l8546J9618K4677m1554N623
$$ y = [-50560, -82131, 94006, -13180, -59557, 97304, -9570, -101230, 58260, 27556, -58211, 48249, 5394, -71578, 52408, 35532, -56031, 35684, 10250, -79150, 44803, 54718, -72429, 10648, 51412, -58532, 10871, 62837, -60119, -23342, 55912, -32318, -9845, 55533, -45083, -32137, 68108, -14274, -39078, 50308, -19186, -54174, 57913, 19774, -55781, 23489, 19530, -40917, 26383, 29208, -43927, 518, 23604, -25261, 11846, 24074, -34455, 1158, 32706, -21169, -4032, 22095, -29023, -8423, 35028, -13013, -14484, 22529, -14745, -10062, 32341, -12312, -25682, 22925, -4971, -18182, 31835, 149, -33278, 21584, 13607, -26762, 14343, 12150, -31326, 9246, 25086, -21293, -317, 18449, -20097, -479, 24198, -17356, -11733]
214a1733L0871k8633K419K8380l0458o637L2935j8019j0575K4867j8062j0379
226a5024L0101j1578j5672K3386j1057j4856K8132p327k2956K4235j97k1682K3321
239H826K397k7926J8409J0916k5050J2805J2084k5703R622J8809k2791J499J8030
252A1927j9358l32K1369j6151p421J9634j0223q207J8286q025j1903J6414k195
265C815j1329J2873j502j2219J1494K076j1667Q166K519j0639Q086M096j1237
278e468N173M940j0179M732O357j0444K641Q183q991P00Q308q737j563R669o376
293a055l543R485m417m940R163k533o922P387l80p133O320J652p060M767L146
308C937o738K522L480o174J235M318m756M81M614l714n06L978l340j338L654k511
$$ y = [-11733, 19138, -9495, -7076, 21304, -9154, -15791, 17144, -875, -11450, 13417, -4645, -15024, 15077, 3499, -12173, 11213, 156, -14700, 13432, 6105, -16851, 7384, 7187, -14495, 8826, 11223, -16703, 1706, 12622, -12428, 377, 12461, -13242, -3620, 15189, -7602, -6103, 11927, -7431, -7763, 13606, -2545, -9966, 9668, -555, -8762, 9524, 1499, -10404, 6010, 3815, -7514, 5359, 3857, -8362, 3132, 5208, -6459, 1707, 4226, -6413, 1673, 5769, -5468, -295, 4645, -5534, -802, 5555, -4889, -2248, 5935, -3056, -2356, 5952, -2785, -4348, 5321, -1055, -4598, 4887, 470, -4470, 4693, 2160, -4762, 2625, 2245, -4888, 1432, 3084, -3976, 791, 3937, -2801, -279, 3201, -2973, -1738, 2580, -2176, -1695, 2919, -795, -1301, 2677, -663, -2001, 1653, -858]
324h58j187L914j786j217L765k019k122L418j780k492L671q71k521L827j78l409
340a845L265J0m030K727J022m124K628K460l779J592K588l948L70K984l341m35
356a856L313k107k30L260j909j299K409j548j199K031j363r14K637p35p12J921
372A699j718j234K352j473j654K537q72j281L470o49k801K458l25k646K711M4
388F18l247K938J708k884K011R49m011J562K393l533O04K299k805J394L117l454
404c41p59K492k790P8L227l238r53M058j698p95L359l373k124M505j582k374M029
421A721j784k445N472o55m702L523j65m099M578R48n638L247K746m335K769J842
437C023o342J631M319m432R09L417n024R25N402m289j334L599m037J75N645m190
$$ y = [-858, -2045, 1869, 83, -1134, 2631, 612, -1510, 1908, 128, -2364, 1307, 436, -2085, 1742, 1564, -1845, 1420, 1430, -2600, 127, 1149, -2975, -347, 2113, -1666, -74, 2514, -1434, -1064, 1920, -1421, -1856, 1457, -650, -880, 2380, 471, -828, 1581, 33, -1166, 865, -498, -1412, 1225, 490, -222, 1699, -19, -1253, 1099, -374, -2028, 509, -363, -1644, 1826, 1177, -1624, 834, 509, -2137, 574, 618, -2629, 309, 2017, -867, 1144, 2093, -1918, -356, 2037, -1496, -892, 1407, -1398, -4, 3113, -341, -1100, 1392, -1398, -1320, 1907, -1331, -2284, 1774, 76, -719, 2640, -733, -2857, 1648, 66, -2308, 1721, -63, -2508, 2964, 2309, -2393, 1130, 965, -3134, 1444, 2392, -3246, 1, 2747, -1588, 1181, 3023, -3319, -1688, 2631, -1801, -892, 2525, -2499, -1574, 3828, -461, -1795, 1804, -2233, -2058, 3587, -603]
453f03k018N369l188j257O192m520m461O822j320m069O449k052o083O874R87o332
469c210M718J84o853O008L042p503L499L181o902L810M550p906J230N308n613
484b457J717N101p133L80O789n572m07O100p009j422Q946m629l759P206m410l948
500d507Q878k700o151P050j924n712Q603o68q605P013K114q314O012L294r233
515d850L639N586o870J833M247o745K093N391o234R88M650o937J187P460o640
530a202k083P064m752k266P398l742m012N715k660k074O300m013l868P396k486
545G15n081Q137j715q195P804K441q399M698L435p836L623N210p050J062M289
560C138o134J942N952o869r78O735m876j648P316m649m763O842r13l928N197j673
$$ y = [-603, -2621, 2748, -440, -1697, 4495, -25, -4486, 2336, 1016, -3053, 3396, 1344, -4739, 2135, 3122, -3210, 1508, 1692, -5161, 847, 3889, -3614, -115, 3066, -3836, -26, 4524, -3382, -2152, 3156, -2457, -740, 4361, -2772, -2392, 4397, -1175, -1582, 4518, -2491, -3913, 5033, 404, -3355, 3851, -559, -4507, 4371, 1671, -4480, 2570, 646, -5066, 3537, 2869, -5736, 1277, 3391, -4923, 1089, 4383, -4850, -1211, 4375, -2495, -662, 3585, -3160, -1067, 4324, -1910, -922, 3728, -3209, -2022, 5438, -1202, -3285, 3779, -973, -3239, 4159, 417, -3595, 2120, -540, -2614, 3686, -327, -4195, 3201, 715, -4366, 3771, 2056, -6139, 1665, 4106, -4293, 405, 3840, -3996, -373, 4837, -2213, -1151, 3138, -2996, -1054, 4898, -1971, -2949, 3786, -1090, -2738, 4578, -71, -4834, 2008, 1095, -2833, 2364, 691]
576F91m702N731M55m926M445k67o090N664L154p203K273M055n681J921M988o057
592a549j192M978l014O0M167n017j359O035k860k289N113m225l707P679l77n809
608c366M607n7n039N732J639p037K715K719m766L982K987p452J682N656n409O72
624g35M603o828m59P832l883k898N260m174k187P630k912n358N412j356l333P148
640C762j464p113N449J469n053M982K85p358N039L796n876L117J678p177M419
655d5N127p673J092M779o866K507P436q113k312P713m813j637P836n708n017Q690
671B996j373m767O433k834n919P933O97o797M883K34n957O668K278q116L113L284
687B756n994M210L487q216J797N803n547J251M537p400J33P516m822k009N554
$$ y = [691, -4011, 1720, 2175, -2751, 1694, 1427, -4663, 1001, 4155, -3048, -775, 3280, -2401, -480, 4508, -1549, -2741, 2237, -777, -717, 3450, -1567, -2926, 3109, 249, -2040, 3073, -1152, -4859, 2820, 2443, -3366, 1241, 1184, -3855, 1877, 3516, -3521, -806, 1913, -2853, 1129, 4116, -3336, -1654, 4002, -1407, -735, 3868, -2960, -3419, 4413, 530, -2368, 2892, -1282, -3469, 4161, 1249, -4109, 1303, -53, -3386, 3762, 2298, -4815, 634, 2103, -2950, 2032, 2317, -5041, -2, 3794, -2082, 1035, 2713, -4464, -45, 5082, -2591, -1499, 3280, -3586, -1079, 6357, -1756, -4068, 3645, -1168, -2805, 5031, -677, -5694, 2996, 1623, -3144, 3289, 455, -5464, 2469, 3166, -3631, 1252, 1486, -4471, 2197, 4475, -3641, -528, 2756, -3238, 972, 4459, -3757, -1960, 3843, -1704, -453, 4084, -3316, -3183, 4333, -489, -2498, 3056]
702C056m814j712P619l222m365N205k006k635O248k252m893N237l07l629N405
717B935j349n984N490J822n643L830J311o334L931M029o122R44L548m982J674
732i00M680n431p52M757l387k87M559m340j959N377k034k127M181k468k751N156
748B274q56l635L520o91l135M352J67m473K834J130l467K754J316m485J763K490
764A858l120J185J699l565J118K852k989K11K174k891N96L235k913r28L118k071
780d31o98L376k304j874L329r16j734K794j246k310L112n7k555K278k07k583K710
797F84P57l068J570R80k568J803J520l069P25K021k206N74J950k591j39K488j560
814a29m59J916j634p48K388j062j166J722r84r08K131o60j516J628m01j250J856
$$ y = [3056, -1758, -3470, 4149, 927, -3438, 1767, -239, -2874, 3374, 1122, -3771, 1466, 1159, -2470, 2935, 1586, -4398, 1092, 2914, -2729, 1101, 2412, -3922, 9, 4038, -2084, -1140, 2408, -2574, -900, 3780, -1651, -2403, 2354, -1033, -1320, 3239, -1101, -3060, 2317, 283, -1844, 2337, -131, -2882, 2274, 1418, -2217, 1303, 612, -2523, 1829, 1996, -2477, 357, 1487, -1980, 774, 2090, -2395, -632, 1858, -1262, -77, 1622, -1943, -825, 2027, -962, -751, 1423, -1468, -872, 2363, -550, -1478, 1640, -431, -1129, 2247, -57, -1931, 1398, 482, -1252, 1542, 296, -2014, 1098, 1041, -1514, 764, 557, -2026, 684, 1441, -1627, -57, 923, -1645, 158, 1678, -1391, -666, 1355, -851, -277, 1673, -918, -1057, 1431, -129, -588, 1328, -306, -1054, 1334, 272, -894, 828, -156, -1064, 1067, 407, -1109, 519, 118, -1132, 724]
831G24j56j940J365O88j608J215O40j999P01J364j448K22J165j469Q1J537q68
848B14o30J027p35n25J342k98j017P43J54o31O89nr70L24M63m32L25Q0o80K34
868c28P28l55j77J55m22J27P61j91l91J89p3N4M70k57o94K83K41j16L84o5q64
889e41L37O91n59n3K31p42J78J113n71p00P19k22l10J097l44j246P10O83o26M90
909C35J51j109N29R17p37j56K16p36N87Q86r28l75O58n57K25R33j142o67J199
928B29j97l18R82j001p51J536M4r89P29l94p80J509M88j622L96N43q20R21M89
947I94j742K36J027o38M70M26j682K40J593q86n04Q37j199k6J974p09j413J113
965A11j89m81J587o28j807J333Q13j009R35k7j875J053J566j303k49M18r94O54
$$ y = [724, 568, -1372, -7, 681, -927, 288, 928, -1071, -370, 994, -454, -232, 933, -536, -455, 1082, 214, -416, 611, -124, -649, 693, 395, -622, 121, 275, -356, 333, 328, -642, -318, 145, -287, 38, 118, -562, -328, 400, 45, -132, 23, -399, -272, 489, 298, -93, 96, 23, 77, 547, 290, -404, -121, 120, 4, 388, 323, -541, -204, 487, -72, -125, 106, -636, -458, 655, 84, -616, 103, -119, -429, 668, 324, -922, -212, 471, -155, 335, 486, -623, -94, 823, 86, -70, 146, -590, -3, 883, -45, -420, 238, -319, -94, 839, -303, -970, 229, 32, -286, 696, -305, -1056, 480, 524, -465, 264, -130, -910, 599, 1087, -535, -139, 404, -416, 505, 994, -748, -512, 515, -123, 347, 773, -909, -669, 924, 38, -466, 371, -828, -854, 1120, 411, -1002, 111, -78, -559, 1028, 400, -1407, -74, 739, -270, 665, 638, -1237, -184, 1382, 79, -170, 248, -746, -92]
983i2J438j305p17P19m92N08J122j617q76J487pk56Q66j199r81J850L22j008M46
1002B08o83o14K002K98j862M48K71q18J654N63k516J00J683p00K18O57j903r6
1020a090K006m17o31K28j193K74K092p45j422P85l32k8J891p98k049R28R17l14
1038A02Q79p16j689J202J264o94N4m86j309J388J556j486p10M85n33Q37J235j532
1056a53j098R42L07L88N49j558p33J572M79l28K1j126m47J819N85j122m82j64
1074e49J23J426J76j685l24O40L43O19l0j640k84J502N48n95m95o23o4J488M70
1093A046j175p23J71N07J070Q1j624m16J179M43J4J3j226m75J659P08r89n52m81
1112g70K45J498J3j434j38J32Q7J516k56k405M85J591n22L51K92k115L15K382
$$ y = [-92, 1346, 41, -676, 43, -449, 59, 1181, -436, -1312, 175, 168, -88, 778, -421, -1402, 448, 770, -238, 208, -475, -1089, 913, 1211, -651, -203, 68, -750, 904, 1467, -1049, -949, 734, 34, 252, 909, -994, -1090, 916, 499, -132, 96, -1097, -823, 1269, 524, -898, -113, -445, -473, 1418, 620, -1429, -501, 416, 102, 981, 265, -1424, -222, 1042, 348, 402, -84, -1393, -5, 1551, 65, -645, -160, -693, 144, 1379, -153, -1251, -309, -2, 386, 935, -623, -1356, 216, 695, 367, 388, -738, -1185, 634, 1219, 97, -385, -549, -426, 1000, 1176, -509, -833, -193, 150, 769, 739, -901, -1185, 317, 865, 270, -225, -848, -912, 576, 1046, -129, -852, -681, -174, 896, 977, -647, -1063, 116, 559, 573, 586, -640, -1115, 544, 1252, 263, -289, -770, -525, 973, 986, -448, -586, -454, -367, 1149, 893, -1512, -1027, 564, 42, 393, 685, -1430, -1115, 1267]
1130A267n31q95J85j065N45K090j021j286P57m94K85J935j428j907J569L42m73
1147a25J267j099j917J963J007j454O90l93j778K077J421k235k4P73j220J451
1163D04J285k328m16J454n99P25R22k399k14K209p87k95J031j880m03K585n34
1180G60j384Q76q87k35K199p74j719J128j47m23J881p17k096J385P58r15J037
1197G27l23j774J318J113j092K94j50j314J517J030j717J26L98j035J206J013
1213A337j898k88J125o74O75P48j867n6J542o81RP78j658NJ932o69p86R25q45
1232c46l87J844m26j499R37n3n18J288k99j529Q31N87n99O01j79j187P46P43p00
1251a45K17o2q27P72P07q37n3K49m97O45N18p87k30M81k38L48L31q62k9N89k24
$$ y = [1267, 736, -159, 26, -1039, -494, 1596, 575, -711, 46, -448, -163, 1772, 344, -1563, 6, 348, -125, 1142, 43, -1874, 89, 1096, -358, 332, -61, -1839, 238, 1659, -576, -600, 173, -1047, 404, 1689, -639, -1055, 399, -200, 525, 1447, -952, -1166, 1043, 256, -39, 992, -888, -1291, 1294, 760, -624, 252, -635, -870, 1329, 555, -1164, -36, -183, -606, 1275, 558, -1538, -153, 605, -310, 727, 404, -1370, -52, 1061, -31, 263, 113, -1201, 316, 1346, -371, -245, 153, -882, 324, 1337, -561, -849, 276, -398, 277, 1025, -842, -898, 644, -37, -28, 750, -908, -903, 1029, 360, -426, 499, -346, -733, 1111, 685, -814, 123, 70, -448, 840, 541, -988, -157, 430, -169, 432, 253, -934, -188, 555, -145, 72, 10, -817, -45, 662, -175, -228, 21, -476, 169, 687, -100, -330, 151, -87, 261, 592, -270, -299, 290, 66]
1272F6J18J97p23l8O52j92j29J67m65Q6N60k96j82J47l04J70N32l94k15K83j61
1293a21N1N59m83m18O30j05k01N42k89o17N33K80m89K44P1n10K69M32n10kK17
1314H3k93K8M24l97j34L47j04q4K85j44k13K71ro2J45n4j89K49Pj22J8Q1k93J88
1338B8R7j51j0R2j96N0K26j93j73K70j61qK11j06k00K38P3j42N3N7r2J00Pp9J48
1363A39j45KJ56l5j48K33j81j68K56N9k41J06r0o0J22n4j17J94j73j29M29m3m21
1386c09K82K35l91R4L84m82O9M38l17kL33l85r5N20l30j85N12l73l88P84k48n73
1408d27N63N3o15M83K07o33K15L51m29J61L97n56J8M29k61m6L09k71j22L71j10
1429H7n9J16k25Q8K65k87k1J40l08O1L50j91j90J60j35P2K59l22p7K59k55J24
$$ y = [66, 184, 381, -342, -380, 272, 80, -49, 118, -347, -261, 299, 3, -179, -32, -336, -166, 366, -28, -243, 40, -121, -70, 489, 6, -412, 218, 113, -88, 454, 165, -452, 81, 361, -128, 116, 187, -323, -54, 378, -132, -134, 83, -210, -182, 242, -155, -289, 58, -46, -130, 155, 11, -202, 69, 60, -2, 143, 89, -100, 149, 156, 34, 52, 133, -160, 28, 125, -26, -36, 56, -140, -90, 136, -57, -230, 40, -121, -129, 82, -24, -224, 14, 87, -55, -2, 55, -37, 63, 70, -9, 139, -6, -4, 152, 117, -31, 202, 21, -147, 109, 168, -73, 33, -57, -117, 5, -49, -166, 28, -145, -274, 155, 112, -309, -27, 208, -183, -89, 295, -187, -118, 320, 3, 1, 334, -51, -146, 374, 44, -141, 371, -2, -390, 394, 146, -427, 136, 189, -426, 57, 264, -369, -154, 197, -232, -71, 326, -230, -212, 217, -44, -90, 219, -52, -174, 197, 87, 28, 144, -81, 7, 272, -15, -36, 104, -204, -143, 207, 16, -174, -14, -149, -77, 182, -140, -217, 42, -213, -89]
1451h9N51n75l16O75q4l30M99j82o61O45L64n15Q9L1m05M11K73m56j14J76j28
1472a41J61L50n56k45M00J19k4j6k40n0J76K33J18k69m09K94L58j35rK5m19J90
1494h9O37l35l93J66p8Q0M62l46n63L38J36j4K04j82o05L29N65j88j78q2k41K52
1516a25M60j32k95j77N8M40K27l97l16J24J01L24J46m64l32L03L07K1j50l69j05
1537c51L85K45j21l26k03O6N57L3m20j96J22J96L31k6m69j55L21K45P3j37m59
1558b89O0M55P7j72j02l02J11M99Om90q1P0J44L34j84n49J57J89Q2K30j81n38
1580d74K93M86j56q0r0l29K70N65l56j83j5j31L08L89m61l70L80p1Q8K99m49l79
1602d66N07J51j53M6k96j83N65J16n06J64l8k35O04J65o51Q9K80k28L26M7o32
$$ y = [-89, 462, -113, -429, 246, 162, -168, 331, 149, -512, 133, 497, -18, 71, 102, -303, 108, 381, -75, -189, -13, -141, 20, 370, -186, -431, -31, 88, 64, 48, -192, -242, -66, 167, 285, 16, -393, -99, 259, 124, 115, 140, -279, -89, 548, 213, -180, -14, -92, -12, 450, 104, -459, -121, 15, 1, 205, 23, -582, -253, 312, 124, -54, -136, -377, -125, 335, 203, -92, -269, -211, 229, 456, 59, -257, -133, -32, 292, 438, -26, -358, -55, 252, 273, 123, -246, -351, 34, 279, 158, -168, -371, -305, 252, 285, -135, -331, -209, -13, 318, 292, -177, -332, -11, 234, 307, 170, -289, -229, 226, 303, 131, 29, -273, -162, 337, 343, -147, -228, -158, -14, 320, 136, -413, -256, -67, 15, 245, 64, -474, -181, 305, 149, 69, -21, -350, -80, 485, 129, -54, -69, -200, 108, 497, 36, -334, 46, -25, 63, 362, -87, -466, 41, 192, 39, 85, -211, -394, 171, 287, -219, -55, -93, -328, 276, 441, -210, -121, 159, -69, 257, 304, -328]
1623c28R2M84k28R9O4m80J18N36l02j41J42l39J22M55l17k22K03j18J46K69l07
1644e2k65M04q2L7K73m28j91N79j63j40K84k55l07N68k8m33K23L7k29L01J13m55
1666b09P9J90j87K10j1l75K22J78k04R4N2l49K03L61l12l9J20j19J48J81l12L3
1688d6J57j31J16J40m31L7L22j73mJ48l12N4K87j76n4L9j97K15J98l72N8K71l02
1711a56J10L64m09o4L70k46k2L27l70j00M96k10k31L19k52j82N94j87m51L70p2
1732bl52N46j31m30M02Q0k95L50n2n39M81J09l45L20K2n47M92L08n31J55J53m36
1754b42L84K58o05J35L67n57K86L93p27K0O62m89j36N36m73k22P39k61l38L93
1774A23j88j91N97k12m20M97j61k69O35k32n53N19J16m58M95p7o36M86L14n74
$$ y = [-328, -236, 248, 20, 119, 183, -297, -179, 357, 55, -86, 56, -283, -161, 294, -23, -245, -42, -160, -14, 255, -52, -317, 87, 5, 42, 315, -113, -304, 275, 112, -28, 256, 1, -306, 262, 234, -199, 24, 61, -168, 133, 246, -209, -130, 60, -127, 83, 72, -303, -81, 97, -107, -13, 39, -310, -107, 254, -58, -97, 23, -96, 52, 233, -79, -46, 111, -20, 96, 236, -195, -158, 164, -9, -13, 135, -177, -123, 164, -12, -66, -27, -224, -9, 189, -183, -125, 146, -156, -46, 318, -91, -155, 215, -31, -53, 274, -96, -196, 300, 90, -141, 178, -74, -256, 338, 151, -300, 70, -2, -354, 192, 61, -369, 33, 113, -182, 168, 116, -423, 58, 167, -178, 142, 164, -383, 109, 417, -114, 41, 194, -242, 142, 400, -205, -70, 297, -260, 26, 419, -308, -288, 374, -115, -251, 285, -188, -410, 329, 68, -270, 123, -65, -256, 341, 129, -291, 206, 45, -224, 411, 179, -374, 145, 261, -197, 298, 221, -415, 71, 385, -189]
1794a89K45P9n63M67K82n21J0M31m94J54M70n45j24N45l09q1M15l63j87N53k43
1815C2j70M15l34j74N18j05m08L47r5k33L70M9m90K31J70l64K93J43m99J98L24
1836B18l47P2K83l97n0N28k73j73K33j23j62M56j73k51K48j07m3K33m8l04J96
1857A6P5j52J24M2l55P6L07j94q5J71j79M4J91j08p7J26m7k5K39j98p0K35j09
1880D7j10K18n2k45K23mj77J98rl04J99J89l21R5J64l30J17K84l41k6L38k55l1
1903a33L04k57j33L79j17j74L11j24k28L33n7k39L04p0k54K73O3k87J24J91m40
1924b31J60K91l80J0L12l16Q8K53l86O5K57l00R3K26l04OM48k98k37M80j85k87
1946b35M46r7l32L66P6m28L03l9k55K70Q5m31K93J32m08L14Q9m38J80L31m10J69
$$ y = [-189, 56, 135, -428, 39, 321, -200, -190, 241, -253, -99, 371, -174, -298, 247, -62, -143, 272, -91, -278, 275, 32, -138, 277, -57, -231, 287, 182, -226, 121, 26, -207, 163, 212, -278, -47, 123, -241, 52, 195, -304, -106, 218, -129, -57, 226, -171, -221, 307, 34, -139, 94, -29, -191, 265, 92, -159, 89, -18, -61, 172, 124, -180, 16, 91, -61, 63, 105, -250, -174, 133, -61, -146, 25, -154, -110, 81, -27, -104, 22, -25, -50, 189, -9, -79, 156, 47, -63, 155, 103, -142, 81, 77, -100, 98, 89, -215, -16, 173, -148, -53, 111, -219, -102, 182, -159, -185, 153, -102, -133, 171, -86, -219, 160, 43, -131, 180, 56, -172, 161, 104, -135, 169, 99, -155, 118, 181, -106, 18, 209, -231, -71, 220, -160, -150, 162, -154, -66, 187, -199, -134, 123, -177, -84, 142, -162, -156, 292, -6, -243, 237, 52, -235, 211, 114, -218, 148, 224, -204, 99, 60, -195, 75, 160, -271, 22, 154, -254, 60, 149, -289, -109, 222, -188, -19]
1968a9K12l91O9M01l47Q3K58m50J53M05m54r9L80k15j53M33k36l04L30m2j09K47
1990A52k65j23L56l9k70L70k40k81M85N5m07K25O9l36M09J31m94J17K10k34K61
2011A51J41n25J57L52l31N0K17m85L5N42k64k21K35k20J9N11l56j53J73k11J30
2032e3M28l89l20L59k6r7M11k70l50M05J01j39K10k95k60M70N4l23J66p8k81M42
2054A65J53n18R9N7j07K36J81n67M9L11j20K25N3m62J4M56r6p8R1l34O6M40j19
2077A95k15N1k34J44M35k66k83K33j42K0M13l37m08L22K13j70J59j56l35M02J65
2098B06j66P3k27j95N36J31m17O7j4j28L33J53m87k0K05n7J90Qm66J01L45j64
2120GQ2R7n49J30N20j66l05J93j62L9L95j52k86N9P8P1K30j99l44K74J07j24K50
$$ y = [-19, 193, -198, -129, 272, -75, 8, 266, -184, -31, 374, -80, -179, 201, -14, -167, 266, 30, -274, 56, 14, -95, 152, -113, -236, 120, 81, -189, 181, -59, -340, 145, 200, -207, 18, 87, -249, 160, 291, -203, -86, 124, -110, 151, 292, -233, -76, 276, -55, -5, 212, -273, -238, 304, 40, -181, 54, -166, -147, 364, 8, -145, 28, -183, -53, 375, -14, -334, 25, -1, -98, 313, 43, -307, 98, 199, 60, 270, -25, -285, 185, 239, -84, 82, 4, -277, 165, 318, -200, -101, -44, -151, 85, 266, -301, -252, 59, -61, 164, 217, -245, -231, 225, 129, 51, 142, -192, -126, 314, 195, -20, 31, -203, -59, 376, 110, -173, 60, -82, -62, 351, 14, -394, -72, 141, -29, 130, -26, -361, 41, 206, 40, 113, -114, -309, 227, 358, -59, 8, -6, -134, 199, 352, -135, -155, 50, -7, 183, 191, -275, -174, 171, 7, 89, 186, -363, -233, 287, 121, -184, 9, -153, -114, 281, 129, -157, -98, -20, 51, 281, 82, -262, 12, 119, -5, 245]
2143B45k51l00L23J71j87J4o5j95L30J67l30K9q5m2L43P3n23Q5K34q1Q8J86l88
2166a59r2L46J00j42K4k10N4L50j28k28J17j31L5L00j15l33M6J91k8J34j35j95
2188a99P3J45J18j5l03m2K66J00j85Q9j06p6J97J99k26j68R2J22J10%k69nQ4L6
2212C7J83j09k79j1K54o6ok0j44K9K26O8j36j42l4J99J36j45j49N5jJ45R6k01
2236a5j59J59R8J06j32j84O0J00l1P1%k52N3K55j01n1N1j51N6J81r8j51N3L9O4
2261B1J24j13j56J20R3K0Om6j65O0J59nj26j49Q0J06J9q5K7j07J6J75Rk36MJ80
2287C1q0R6O8j89N2N5n1P4M5j73K5K34j35q9J56j36m1K74j04j97J43oq2J12p6
2312Fj18J11R7j82J46nk76J98J94l41P1J79j82M6K18j72r8K14p9q9J68j14r2J92
$$ y = [245, -6, -306, 17, 188, 1, 15, -50, -245, 85, 252, -78, -49, -134, -176, 167, 240, -283, -198, 36, -45, 43, 229, -159, -251, 95, 195, 53, 77, -133, -79, 271, 143, -85, 32, -99, -64, 236, 121, -212, -166, 25, -3, 131, -4, -199, -126, 19, 137, 122, -181, -223, 43, 143, -42, 47, -59, -135, 62, 261, 35, -133, -41, 81, 191, 191, -78, -83, 1, 37, 220, 111, -168, -179, 75, 9, 3, -17, -161, -132, 94, 162, 26, -116, -150, 49, 185, 40, -109, -54, -55, 90, 186, -15, -174, -15, 83, 189, 57, -127, -67, 33, 2, 73, 73, -179, -126, 129, 28, -23, 28, -123, -67, 114, 16, -135, -82, -43, 21, 145, 32, -124, -4, 89, 109, 115, 69, -96, -36, 123, 118, -8, -157, -77, 29, 48, -37, -10, -117, -101, 74, 83, -153, -149, 31, -49, 47, 115, -74, -22, 33, -18, 56, 101, -72, -47, 187, 52, -37, 119, -17, -58, 216, 112, -85, 58, 52, -30, 82, 6, -112, -1, 96, -86, 60, 55, -221, -23, 171, -170, -99, 80, -102, -56, 162, -10, -108, 106, 27, -62, 106, -8, -100, 92]
2336I2l5p6J00m8j46K06jk26J77L8k12J59J2k52K21O2k05J49M8k19J31J81j96
2359d0MJ69l06J51K47k92k7L14k37o9K59j85j58K95j14j51K95j25k11K63rk37
2381a64K62m1k75L21K8l42K58O0k67K06R5l07J86J56l00J34J75l23J29K66l80
2402a23P7K26l09PL37k29j47L02k29j01L54k53j57L91j94j69M10k22j84L60m0
2423A07k79K72J5k92L22L9l52K31Q7k63J86J11k77M9K51k99N4J82k32l2K46k03
2445g7n1K13j41k3J99j56j16K10r4p8K10j04j20K64j14j50K34k2k25K26R9k71
2467h7J51N5k20R8P9j35N7O9j76J30O8j88K7J41j77%J70p0j21J91n1q1J26j6p4
2492c4N8K7j03R2N4j27K6Q4r0O3N0j94J3J65o4j35J05m6k4O2Q3j04L4nl4N4M9
$$ y = [92, 57, -19, 81, 33, -113, 93, 92, -134, 43, 81, -131, 28, 40, -212, 9, 71, -134, 15, 63, -156, -25, 156, -40, -36, 133, -173, -22, 225, -67, -94, 220, -17, -86, 173, -12, -170, 125, 11, -140, 155, 30, -181, 82, 73, -164, 98, 57, -218, 103, 131, -211, 47, 107, -160, 46, 141, -166, 20, 176, -124, 10, 185, -138, -9, 257, -123, -46, 180, -129, -122, 215, -14, -161, 141, -88, -189, 165, -88, -245, 146, -48, -217, 193, -29, -213, 147, 107, -172, 100, 115, -177, 145, 184, -168, 63, 150, -113, 73, 184, -93, -44, 207, -92, -38, 144, -88, -120, 126, -77, -128, 85, -56, -79, 120, -36, -152, 58, -36, -114, 96, -8, -128, 136, 22, -128, 106, 84, -141, 85, 184, -87, 64, 119, -101, -3, 76, -59, -2, 67, -109, 21, 89, -99, -72, 69, -108, -108, 62, -8, -129, 62, 11, -70, 56, 40, -34, 24, 51, -52, 40, 94, -33, -7, 77, -13, 50, 100, -94, -81, 84, 20, -115, -10, -56, -80, -18, 65, -39, -5, -10, -44, 10, 59]
2519E9o3K7p1N6J00q6j55J77P9j90Q3P9j46O7R2j50m2M5m9J31M4j39q9K03j01
2544c9J4J71k14j27K47k4j26J72n1j57K24J02k54O8M7j30J39O6j67j4J20p8LQ0
2568G2j38j7J55p0n0P5j44O1J73j08j23J19j42K6K86j45j71J74m2N3J62j75j58
2591a27J81P0j53J62j09k13K82O1j52J0m8j72K72P1k18oR0j06J40J54l18J7J66
2614E4q5N6J43l05m4K64J5j6j3k28M1L48q8j86M9m8p8L16n3k60M7N8NJ07o1k97
2640b59J77J36m5J14j02k78K58K37k16n2P9j98J07K77j87r9j0QK34K1k14j23J59
2663B4K9k0J31k55j87L30J23j22m3j52k8K45J3r1Oj35k3L77o2l18J12J29q0J21
2687A24nk16J5J80j7Kl9k42J39K88k02p8L0j75J30K40j80j38J01L5QJ84j37k95
$$ y = [59, -4, 23, -48, 8, 108, 22, -133, 44, 123, -67, 16, 95, -51, 16, 108, -42, -84, -39, -88, 43, 87, -52, -141, 62, -39, -25, 146, -68, -195, 52, 28, -98, 74, 23, -134, 90, 192, -62, 6, 53, -77, 62, 128, -39, -53, 67, -11, -8, 72, -66, -83, 72, 2, -48, 27, -117, -56, 117, 9, -114, 5, -137, -111, 175, 30, -141, 33, -9, 44, 206, 31, -127, 54, 124, -29, 133, 24, -189, 93, 154, 2, 12, -36, -208, 64, 135, -83, -89, 1, -105, 35, 189, -129, -112, 54, -31, 25, 168, -137, -181, 83, 98, 82, 69, -159, -118, 230, 142, -44, 5, -43, -121, 195, 142, -118, -71, -13, -8, 99, 38, -259, -82, 54, 9, 123, 21, -257, 1, 238, 22, -30, 49, -149, -42, 235, 48, -51, -61, -53, 181, 202, -12, -135, 24, 53, 33, 164, -91, -278, 52, 175, 53, 10, -142, -170, 75, 88, -3, 3, -132, -155, 222, 160, -158, -46, 83, 3, 124, 119, -97, -82, 98, 81, 83, 44, -198, -59, 229, 27, -51, -21, -196, -66, 174, -6, -144, -43, -8, 0, 184, 47, -248]
2711b48J70J89r3J41j28k20K25J05j43M6l8j52J92J97k52j34J54o5R9R4j68j57
2733a86J71J7nM0j36n6K49rj24N5m6r8K22O7k30N0J0r2K49o7j57J8J25o5Q2k0
2759F4k11J23J53j14j4P8j86K5K53j58p5R8o5JJ94j88j08J69l5p8K37j41j50J66
2783C8Q0k07J59L1k82K83J00l20J12J18k48J71J35k98M9J77j91P7J85l18o0K92
2805H3r0j4R5j67nK22o9j70J99r5j12K66q9j99J87J9j44J61K3k35J19J20j75J11
2829D1N7k75J86R9k01N3J01j64KK33j56n5J82j51k8J73q9p0O0L3j6M5k1j15J54
2854G8Rj23R6jj70J46O2j25oP9j68Q7R9j42o9K25p6l8J19r8j02J51K0j07R5%j26
2881h5J21L8j98J49O1j86O8J71k47R2Q5j19N6N5j00m2J51p3q2J73j00j37K25j29
$$ y = [-248, -78, 111, 18, 159, 31, -189, 36, 141, -2, 44, 6, -146, 46, 243, -9, -143, 11, -54, 45, 139, -29, -186, -15, 2, -3, 37, -99, -155, 94, 85, -39, 16, -30, -128, 94, 161, -69, -19, -9, -101, 148, 81, -76, -58, 67, 2, 84, 64, -147, -24, 129, 15, 1, 79, -107, -82, 171, 13, -62, 36, -29, -28, 166, -22, -130, 39, 4, -74, 163, 22, -128, 38, 118, -89, 70, 101, -181, 102, 202, -118, -6, 112, -136, 35, 170, -128, -79, 98, -93, -16, 169, -149, -209, 83, -7, -21, 74, -93, -98, 124, 55, -115, 84, -11, -123, 143, 54, -145, 42, 61, -83, 78, 101, -134, -15, 105, -70, 41, 98, -177, 9, 108, -93, -40, 61, -103, -101, 132, -24, -79, 103, -48, -76, 97, 8, -62, -2, 31, 15, 60, 39, -76, 78, 87, -36, 60, 59, -111, 35, 97, -28, -34, 45, -123, -36, 63, -79, -148, 77, 1, -37, 82, -16, -118, 33, 53, -54, 41, 41, -85, 36, 74, -124, 25, 86, -100, -32, 139, -108, -16, 69, -50, 6, 61, -39, -81, 70, -3, -85, 88, -12, -149, 76, -53]
2905e3q3K14k6j27J48Rk25K40M1k55K29k0k06M9J99k34J23J41l06N6J93j90M2
2928d1K13k67m5K47j52j05K87j08j88K91j50q5K40j31p2K08m9k28J97N5k20K05
2950A02L0k56J91L9k28J26Q0k25J32J42k92J31J15k20J05J40k10k2K12j68k8K26
2972A22j70p5K26p4j60K67j28j51K97j18j54K64p0j21J08j4j80J85N0j95P8Q3
2994G0j49Q9L0j43P8O7j19M5J26j61j8J76j00l8J56j04r6J43qj18J95j41JM3L3
3019E7q6O3j3o5O8N4j22K1L0j34J61M3j51K0Q1j00J02M8j61R5M1r0nJ23r2n4J08
3046D2k5k3nL9r0J13Pj68O8J2l7J06j0r8j8R1j5l1M9n2M5Q1r7pO7o5J3J65r4q6
3076b3K7j6M9m8J3n5N1N9o2%M0p1L0J5K5j34J08ooN7o2o9P8OJ0Jk2m0M7O3q5N9
$$ y = [-53, -136, 78, 52, -75, 73, 82, -143, 97, 138, -117, 112, 92, -114, -65, 134, -100, 23, 164, -142, -86, 107, -83, -41, 172, -95, -140, 107, -45, -150, 137, 29, -159, 132, -18, -103, 137, 6, -66, 142, 93, -135, 62, 117, -103, 102, 132, -124, 67, 106, -122, 4, 84, -141, -9, 133, -159, -28, 87, -133, -28, 112, -98, -120, 92, -76, -104, 122, -48, -123, 103, 29, -131, 136, 8, -143, 154, 36, -118, 146, 76, -45, 63, 49, -131, 54, 104, -91, -13, 70, -79, 10, 40, -103, -25, 42, -77, -32, 94, -67, -85, 91, -9, -47, 109, 5, -91, 52, 44, -74, 121, -20, -19, 24, 57, -29, 34, 21, -44, 24, 78, -44, -23, 7, -127, 34, 77, -74, -54, 27, -73, 29, 77, -84, 11, 52, -38, -43, 80, -12, -66, 42, 17, -6, -11, 28, -62, 51, 58, -110, -42, -30, -67, 39, 29, -69, -87, 4, -11, -42, 7, -45, 0, 81, -16, -23, 44, -21, -8, 157, 63, -23, 4, -12, 37, -11, 2, -53, -2, 57, -5, -5, 35, -36, -6, 9, 34, -100, 8, 2, -4, 53, -9, -78, 0, 6, 16, 17, -5, -45, 2, 65, -20, 39]
3108C9k6nK9L6p3MKJj6O8j31NR4l0l5j7P2q6R2J5j99J73o5JJ51q6p7N0N1n9J7
3139eP8q9m6J85j08K6km2L4L3o9J3k0N4r2R2l4p3Q8j3l4O8j13QQ4K0r5Q1m2n4
3169f7J56l1r6J9N2o9R9qp9K8J8j2n2R8j25J8J12m3m2L3o4O1L7n1l8M7l4K1J09
3198I7j23nM6Rl4J18j57N5P7pqjo1o0J26n6l5K5n6QN6m3k1M8l9QJ10m7q0N3k8
3229b5%P5q1l7J14Lj17J27rj02Q0K8q7N8m9J5J01m7j28P9ll0K8K7r6K2P2m2L6
3258A2mo7L9K6Mlnq3O7R9j21J1N6l5j1J34j12p8J25m5J3N9j18n1J07Np0P1n2j05
3288a32J33N7j02J8N2p6N5O0q8J7M6p6K5N8r3kQ7q3M6J0q2M0Q3j1j08Kj4kP1q
3318a7k6O8m9n8J54r8m2O3M4q5P9qq7J00L2j09N1P7j48P4L6q3K4N6q1M0L4r1K1
$$ y = [39, 13, 8, 37, 73, 0, 4, 6, 7, -9, 59, -72, -67, 27, -3, -38, -55, 17, -69, 23, 38, -161, 12, -53, -52, 99, 13, -64, -14, 37, -22, -5, 73, -16, -62, 123, 15, 41, 39, -3, 31, 64, -5, 8, -12, 42, -50, 42, 8, -65, 23, 10, -24, 44, -69, -61, 23, 43, -52, 29, -13, -67, 89, 58, -38, -19, 33, -36, 63, 55, -24, 4, 22, 10, -42, 56, -69, -51, 61, 18, -24, 9, -55, 6, 43, -8, -46, 1, -33, -12, 97, -26, -31, 15, 24, -10, 108, -49, 6, 83, 76, 68, 67, 6, -54, 72, 16, -19, 6, -50, -42, 14, -29, -50, -2, -41, -33, 77, 30, -50, 3, -25, -25, 50, -31, -68, 46, 49, -68, 59, 50, -52, 28, 56, -31, 27, -22, -7, 94, 47, -81, -2, -5, -35, -7, 20, -76, -54, 18, -24, 12, 8, -59, -20, 6, 10, 7, 2, -81, -14, 85, -36, -25, 31, -4, -15, 119, 7, -71, 54, 9, 22, 81, -37, -88, 19, 24, -46, 25, -27, -132, 1, 58, -44, -26, 26, -50, 5, 65, -23, -6, 40, -36, -11, 47, -46, -48, 39, -44, 2, 12, -70, -30, 53, 42, -66, -64, -78, -80, -9, -17, -43, 25, -24, -82, 72, -26, -68, -5, 39, -46, 33, 25, -62, 38, 70, -39, 12, 89, -59, 15, 51, -32, -8, 48, -33, 7, 41, -50, -29]
3347b9P4r2nQ7p5j8R5r5j5Q2n6L6O8n7m8N9M9r8J16m2n3N3P3j30L9J5l8K8J4q5
3377d8Q6k4j12P8P7o8o2P9j14J04L7j26K1J18po2M6l4%L5j3j1Q0m5k1P4n9q7L8
3406b0J5m5Q1k8k5J0M3p6R9k0j47P6P5j07Q6J4j19N3J14j50N8j3k3N4O0j04L6
3433cO1p7K1M1p6mO3l8M3K0o7o7O8Pl2N7l7J3k1N8p1Mm1P6R9j05l5M8m5k7J48
3464H1j9q3J7P1q2L6kq1K6N1j7QJ6p5O0L9j11N5j0n1N0PqjO5m0m3J16r4k6J19
3495G4o5M1Lq2kQ6o1M6j1n2j6Q1l1j5k9nlR0p9j6L3J1l5Q2m9l6P9q1N4K3kp8N9
3528A4K4n7RO0o0M2J4p1M4K3r5M5M8n3L3Qk3LN6r0l7J26j8o3J7j8m5J58j07k3
3558c6R0o4lO6o0l3O8j3r0J35j2p2M9K2j42J46m1o6N4JLl0N2o9K9O7m4o2Q3r2
$$ y = [-29, 45, -47, -52, 35, -40, -58, 37, -58, -73, 9, -47, -11, 57, 0, -48, 11, 60, -38, 78, 36, -17, 36, 109, -21, 18, 33, -5, 23, 37, -48, 38, 14, -98, -20, 57, -11, -73, 6, -108, -4, 33, -93, -72, 46, 39, -23, 23, -11, -11, 24, 11, 0, 80, 35, 14, 88, 29, -58, -20, -5, -50, 31, 3, -22, -12, 31, -45, 54, 34, -113, -37, 38, -69, 17, 31, -88, -35, 79, -71, -13, -26, -49, 5, 65, -39, -3, 58, -19, 2, 43, -33, -37, 26, -12, 31, 51, -16, -83, -15, -8, -40, 17, -20, -7, -28, 30, -41, -37, -78, -2, 97, -8, -43, 5, -40, -67, 81, 62, -21, -4, 67, -15, 21, 19, -62, -36, 15, -2, 6, 22, -53, 7, 46, -65, -10, -20, -71, -21, -14, -22, -23, 42, 2, -41, 75, -19, -45, 74, 9, 50, 53, -29, -31, 55, -6, 40, 29, -23, -39, 42, 11, -4, -33, -38, -41, 49, -30, -46, -13, -2, -37, 45, -4, -40, 39, -42, 12, 35, 33, -45, 14, 38, -19, -10, 50, -10, 32, 46, -25, 19, 42, -53, -8, 40, -13, 20, 28, 5, 8, 64, -26, -63, 63, 45, -18, -1, -19, -64, 94, -13, -36, 54, -10, -13, 53, -7, -40, 28, 15, -75, 60, 48, -24, 25, 47, -95, 51, 10, -56, -2, -1, 2, -28, 24, -45, -16, 51, 7, -55, 28, -64]
3588f4L8R7o9j5L7k4l4L4No0N0k2J2L7L9r5L3K9n5K8nn2mJ21j27N3J6M6l7K3r9
3619f4M1N2l8N0K8j09k4J25Pn3nj1o7J14J6j26K6J5ML8l1k5JQqO5n3k7J1J02p3
3650a1K0j4K0KN6r2L5j9n9R2ol5j5P4k0O5Mr0o3J00rj0k5k8l3Q6o0l9Q4j4K0m
3682A2J0o4nM9j7J4J8o1kO5O2k7rl8m5P1jNp1MN6%Ol1ll7K2M4m4PjjL4%oj9N9
3719E6j1M8n6m5nL5J6n5kNj5M1J2%o8L3lrN5j7m1j6Q8j8m8L5l9L7l9K7M9k1j5
3752A4RK3k9PNL5m4LL1j10P7L7p1L0l7Pk4N3j2n2QM6pL9q0qR4l5j6J3L9r1P1P2
3786I7q2l1KKM2K7j21oQ5j4j0M1l2LK6n6l2O4j8p8J26j4m0N7o1kK8J9r5Q1k8Q
3818a2N1j9r9Q2P2j23J6P4m7nM3p5L5J9o2OQ4p1K9K3o3MQ5Pq0M6J4l4J0j3L0N4
$$ y = [-64, -26, 71, 2, -13, 24, 0, -34, 0, 5, -55, -5, -27, -15, 22, 61, -34, -1, 28, -27, 1, -4, -56, -60, 61, -66, -13, 3, 49, 12, 35, -64, -23, 29, -9, 41, 69, -40, -64, 61, 68, 15, 10, -1, -68, 46, 62, -64, -38, -23, -19, 19, -12, -37, -36, -28, -36, 29, -24, -51, -40, 62, -11, 9, -5, 15, 17, 73, -19, 16, -3, -62, 30, 24, -11, -26, 48, 28, 93, 97, 7, -56, 44, 35, 25, 0, -28, -61, 25, -35, -74, 10, -4, 16, 12, 22, -42, -47, 2, -15, -1, 17, -44, -46, 19, 81, 54, 45, 7, -38, 33, 32, 37, -34, -30, 26, 26, 32, 1, -2, -39, -17, 27, -17, -10, -11, -12, 22, 22, 16, -3, 56, 45, 93, 37, -8, -13, 22, 38, -17, -19, -14, -29, 12, 24, 24, -44, -11, -14, -23, 32, 15, -26, -42, 46, 28, -20, 15, -24, 13, -26, 1, 50, 29, 14, 23, 46, 17, 24, 29, 64, 20, 23, 54, -56, 21, 58, -13, 17, -20, -13, -37, 16, 4, -48, -40, 6, -1, 38, -42, -50, 44, 9, -7, 6, 45, -46, 25, 97, 15, -16, -14, -12, 30, 57, -64, -70, 15, 1, -9, 32, 0, 3, 29, -27, -59, 5, -13, -91, 35, 21, -19, 38, -23, -25, 3, 22, -73, 8, -20, -12, 39, 20, -79, 3, 75, -48, -32, 42, -5, -10, 33, -42, -7, 12, -50, -44, 40, -31, -2, 21, -42, -38, 47, 54, -26, 20, 34, 0, 10, -3, 27, 81]
3850H1n1oO5l9j06K6M6o9LN6o7N6L7p9M9J1q0J16m9p0N2N1j33O0Q2p5J6L6l2J3
3880@N5o3k3J15o3lM7j01k1O3K7o1L8N6j19O2n7K6K4Rl9k4M6m0K8J2n2J19m2r2
3910g3O8M9m6%P2p8jM7lK0o3n0N7mOJ5j8k7N8p8R0k3K2j8n7L8ll4M3K6j9k5k1
3943c0LK4JpPK0j4l8PN6L5n4no8N6K5m0m5J02k8j7ON3j14O6L8m9K1L2o9M5Pl6
3976a0J7O3o0k2R4p4J9j2J3Kj2n1L0K0k6rL3k3j8J2Pj5N6n2m5L5N9r3R5k0j0j7
4008a4K9o4P3pq0P3L1q0M2P0r9k4O8r4O2O5q9j0R0m6k6P1r5j7J46r1J8j2j7JM6
4039B0K7n6K8k0J7L4Pp7P9l2jk1Q8p9p9J12q6L2Lm7j6J14q9N9pm5N4J1Om7O0j1
4071C8Mnpq8J03m3k3k5P7rnk3k4N6n9N5p6J21m1J1Op9J1M2Lr7J51n2n0P7o1k7
$$ y = [81, 30, 24, 89, 50, -56, -30, 16, -53, -50, 6, -61, -5, 32, -47, 2, 13, -67, 49, 0, -70, -18, 33, -100, -40, 42, -33, -17, 19, -13, 0, 55, -8, -31, 84, 21, 18, 65, -36, -57, 6, 33, -28, 10, 66, -53, 9, -48, -22, 2, 11, -28, -52, -6, -46, -18, -6, -58, 61, 19, -73, -5, 44, -2, -2, 70, -8, -9, 38, 35, 55, -8, -58, -1, -5, 1, 16, -2, -29, 29, -49, 41, 18, 40, 22, -35, 3, 0, -34, 9, 35, 16, -9, -30, -27, -3, -2, -9, -2, 18, 4, -34, -27, 29, 64, 10, 5, -63, -7, 18, -22, -67, 35, 7, -10, -4, 49, -65, 1, 39, -10, 11, 43, -26, 19, 26, -10, 7, 70, 10, -12, 82, 8, 27, 15, 28, 30, 18, -33, -3, 17, -9, -18, 15, -8, -26, -14, -7, -22, 34, -18, -63, -28, 31, -62, 33, 13, 3, -14, 15, -49, 24, 17, -63, 10, 41, -39, 3, 73, -26, -50, 18, -76, -14, 51, -38, -48, 42, -4, -30, 41, -54, -71, 75, -16, 2, -10, -27, -26, 20, 47, -9, 19, -1, 16, 50, 57, -20, 59, 27, 26, 5, 93, 14, -65, 47, -39, -7, -4, -51, -67, 47, -42, 17, 10, -35, 19, 30, 36, -11, 49, 38, 42, 37, 30, -58, 45, 2, -21, -46, 31, 22, 17, -6, -30, 26, -33, 22, -54, 67, 26, 37, 43, -36, -25, 17, 20, -77, 74, 22, -28, 49, -12, -39]
4103c9J13j03Qk5RN3rL4j07R4J2k8mj0k4K8l9L0%N0p4N1l2l4J0M4n6P3J6r1K2
4134b8Q7o5j1M8j8L7n4M6n0lM7p3K8L0Lq3Q1M9r2J9k6j2M7m7N2K0r6R0o0lN4o6
4166d9Q9l1N3p3m1P5k9P1o0m5J1J9lJ2k8M1J9Ql6j6j8M2J2Kl8K0k7M4p8L4jJ5
4198fJ2m9N5k5j1K0m3N2K8m9k6O3J5o1N0J1q1O5pj8K8n2J3lR4q0kL6n4J3J2nM
4231aL0k9jM6k5J3l0jQok3mJ9N8q1MK0j5J6K7o7O4k8L8J1l7o9O1Mj7MN3r9O9L1
4266D3o4O8J8o0l3N3J9r8O1K5o9N6k0m0R1m1l4P3j26Q2j8J5k8M9pn3N7m0K0n0
4296e1L1Jk8M0pj2R1n0mK4j1o6R0k7l3L4o5MP4lp2P2l5ol4O2lj8L5o5LJ3OoM3
4331B7k4j6Lo0M0J4l8L7P2l5l3mO%OOK6k2m5L0K0l9Q9q4K8PJ5k4j0rL8k6l2K1
$$ y = [-39, 74, -29, -21, -46, -37, 16, 7, 41, -66, 28, 40, 12, 8, -2, -26, 2, -37, -7, -7, 43, -31, 20, -12, -46, -36, 8, -48, 25, 41, -50, -28, 59, -6, -17, 31, 13, 50, -4, 42, -8, -11, 36, -37, -9, 21, 24, -59, 22, 71, -21, -2, -28, -40, 7, -40, 12, 32, -64, 26, -34, -37, 17, -49, 40, 9, 62, -11, -52, 23, -6, 65, 5, -40, -29, -10, -13, -1, -29, 12, 31, 39, 3, -13, -31, 11, 23, 25, -13, 7, -20, 24, -54, -20, -21, -6, 6, -43, 12, -13, -24, -4, -47, 5, 33, -16, -42, 21, 36, -25, 25, 36, -45, 20, 13, -5, 23, -29, -16, -19, 75, -5, -7, 29, -25, -12, 0, -5, -1, 29, 0, -1, 45, 20, 33, 3, 2, 10, 4, -19, -23, -4, 54, -27, -23, -3, -18, -2, 25, -42, 22, -6, 32, 43, 6, -63, -2, 2, -15, -11, 42, -57, 12, 43, -21, 47, 65, 5, -28, 25, 44, -54, 7, 32, -37, 19, -1, -41, 50, 9, -25, 48, -78, 4, -14, 1, -27, 22, 15, -38, 19, -21, -1, -51, -20, -19, -47, -7, -14, -26, 65, 15, 11, 35, 24, -42, 48, 21, -12, 22, -43, -39, 35, 32, -40, 32, -3, -9, -43, 19, 16, -2, 33, -32, -29, -16, -10, -16, 27, 3, -13, -10, -70, -30, -16, -54, -17, 55, 20, -13, -17, -11, -11, -5, 1, 27, 5, -40, -10, 10, -29, 60, -24, 4, 11, 26, 2, -8, -17, 21, -5, -37, -16]
4365a6jP9p4j1M9j0K0j5jm0m1Q2m9O9j2n4J5J8J1j6N4k6p1M2L4ok8lL0J4l4M6
4397E5Qm4LK7p9K8M7k5k8J7l2K7L5m7m0J07j18N1K3Kl4J0k3O4m3k4J8L6m3O1n2
4428a3p8J61j2k7m6N3n2M5Koo4P7L5q6K2N4j17N2Rl3L8J7l9j3M4k6k7N4m9P1m3
4459Crk9L8l1j6N6oj8K8J0m7N8J2m3mjl8M1O9j00N3L2o9L0mm8L8M6o1J4jj7K0
4492FL7q3Q4j3o2L4M2n2l1M7Jm5J9j1k5O2L1n3M5j6m7RQ1p7rN8o3Nj7Q3jk4j9
4525dl6R0l0lLj5j2Q0k9l4JN9q0L0q0PN7k7LPMKL3J2l3mMl7K9PJ3k0%K9j5l9J7
4562a1K9J7mJ6j6m1K4k9k3N0lm6R3l8J7o5J2O1p4j1J2Rj7K4QJ3ql4M3L1p0O1n1
4595b1RM1l9K8J9l8RqL8J7l8q1Q7Oj0QJ3ql9L8q6N2J3%jK9n3M7j3rJ6n8K9L8L
$$ y = [-16, -17, 62, -12, -23, 26, 16, 36, 21, 20, -20, -61, 21, -28, 41, 29, -25, -10, 8, 19, 3, 57, 31, -40, 2, 36, 30, 2, -1, 29, 43, 9, 55, 63, 19, 22, 49, -30, -2, 45, 20, -8, 9, -23, 4, 39, -8, -48, 59, -59, -8, 15, 17, -17, -7, -30, 34, -9, -33, -15, 21, -22, 39, -13, -91, 70, 58, 31, -15, 38, -14, 31, 33, 27, -37, 40, 75, -11, 11, 65, -52, 0, 9, -24, 14, 31, -8, -21, 23, -3, -30, 24, -25, 46, 3, -6, -35, 3, -28, -44, 12, 6, -12, 16, 26, -21, 37, 49, 6, 2, 1, -37, 4, 73, -27, 26, 58, -11, 19, 15, -33, 5, 51, -10, 4, 3, -14, 6, 43, -40, 44, 31, -31, 3, 45, -7, -38, 9, 10, -35, -16, -27, -52, 10, 41, -12, 33, 17, -30, -21, 60, -17, -26, 32, -31, -26, -43, 40, 39, 15, -4, -40, 50, 20, 17, 20, 5, -7, 73, 44, 10, 11, 70, -10, 20, -60, -53, 4, -23, -20, -13, -9, -7, 26, 38, 5, 1, 5, -32, -3, 4, 17, -3, -3, 26, 11, -28, -11, 18, 35, 31, 47, 31, -10, 14, -15, -38, 12, 9, -37, 56, 18, 35, -30, -18, 43, -31, -42, -30, -21, -38, -14, -6, 7, -1, -35, 8, 39, -31, 30, -21, -12, 29, -10, 18, 37, -1, 8, 0, 38, 55, 17, -64, 23, 29, 19, 27, 40, 32, -7, 31, -55, -3, 10, 10, 9, 38, -15, 32, 19, 10, 26, -32, -3, 35, 38]
4630C8o3J0L2m0L0Rj0N9p6l1P1o3K6J3PnL2m0M7j01K2O3k4J2M3k1l3L6k6K3m9
4661iN6n6M5p2lL8j9K8j1M9jm7pm2K7K4Oj1k7l0O8O5p6O0rl4m5L0l2%O7j7OL6
4695E7j9m0Ll0Q6j8l1Jm7K6N7k2o5K0M7p6P2j8k6L2Pj6k7L0k1K8N1p5jK7n2M2
4727BkPl7RM6q6O7L4m9j8j3N1L3l8k3N3Rm2mKM8p8K3J7O2o9J2l0j4oP4n9J4m6
4761e1J00k2ol7O2o5%MO0o4L0k3j6J8pL1J1m4J9%N1o2RJ5Pk3LK0L0Pj9k7K9j5
4795B5L7m1k6oj5rkk5R0l0pJ6k4N5k7pl5M6jpol2QN2j4J4k5J3K9l0%RMnn9N4l1
4832a2n4J22q6L9l5K2k0lM8ol3J6QKN2o4K7j4l6J2O4m1mOK0l6J6m3N7rrJJjQL1
4868D6Rn0oM5l0QK6l1j1m0Q6ko1l0N7L0n7K2L0k8k2O6o5J1J0J3l3K0rJRj0j0K1
$$ y = [38, -25, -15, 17, -23, 7, 16, 6, 65, -11, -42, 29, -34, -8, 5, 12, 7, 39, -1, 46, -55, -33, 30, 6, 18, 61, 40, 7, 43, 17, 40, -9, 47, -9, 36, -36, -39, -1, -20, 8, -3, 46, 45, -2, -9, -51, -24, 0, 6, -5, -32, -62, 6, 71, -5, 55, 46, 12, -33, -3, -35, -35, 32, 15, 21, 57, 38, -2, 1, -29, 57, 39, 8, 9, -38, -12, 45, 23, -42, -22, 25, -51, 21, 3, -23, 9, 16, 0, -27, 3, -18, 10, 61, -14, -15, 12, -40, 2, 0, 7, -30, -21, 25, -61, 6, 40, -9, -27, -40, 11, 44, 6, -17, 36, 45, 3, -1, 1, 49, -29, -6, 11, 73, 4, 16, -14, -28, -34, 40, -19, -5, -51, 49, 27, 21, -16, 46, -19, -19, -15, 45, -19, 11, -12, -28, -10, -17, 14, 25, -19, 0, 0, 51, -11, -2, 13, 20, -3, 0, 20, 50, 57, 38, 11, 40, 25, 62, 21, -5, -11, -26, -35, -37, -62, 28, -2, -9, 7, -17, 38, 11, 4, -31, 15, 14, 7, 1, -31, -23, 29, 15, 29, 4, 17, 46, 16, 16, 25, 29, 24, -35, 19, -12, -66, 56, -30, 9, -26, -4, -24, -27, 21, 15, -18, -2, 6, 8, 60, -4, 23, 9, -27, -15, 49, 8, 4, 10, 30, -6, 10, -33, 24, 15, 6, 7, 8, 7, 15, 46, 55, 5, -1, 44, 14, 22, 48, 17, 6, -34, 52, 50, -11, -41, 16, 46, -11, 11, 41, 13, -9, 57, -8, 3, 13, 26, -7, 13, 4, 5, 14, 4, -6, 15]
4902A5l3K5j5Qk9R2p3K7k9K4K2m4M2n9L4K1j7j4PK7m2M9j8J4q5K4M4Pm6N7l6k9
4934c0N1K5k0j4l6M9n7M6J8l7L6J3o8M1m8K5QNlQM2o5Q1q7K5K8Ll5K6qj10J25
4966C7ml4L9k6m2J0M9n6J5L2k3j1pL0rLj5j7J05p7p2J37l0qm3KK9j2j4OJ1L4K
4999D1k4lj9M0l6m7R0k3j6J3nl7L0oJ4OKM5l7j8j8j7N6m2pO8n8J4j2l1N9J5o3
5032b6j5N2Rk5O1k9m9M0k1Oj7K9J0J7k7J2M5l3n4N5n5L3k7J6oK4l5j5M4j4O8j00
5064b7L2n1M7N5r1nqM7j6L9pJ1p0P2Mn3J9rpM0m4L3l7L0%J9Oo3k2O3k6O1l4j8
5098a0mOk6j0J12n7jJ6jK0l8K7n5Q0r4J4J4L4l0QK1j0MJ7q8k8J09j7kK5l5kO3
5131F2o9M4l0l3oK2L2m1K3j3K4JnN5q0j9L3l5O8k3J4n2j1P7p1J4O2ko0NM8j0j7
$$ y = [15, -18, 7, -8, 0, -29, 63, -10, 17, -12, 12, 34, -10, 32, -27, 7, 28, 11, -3, 4, 31, -11, 38, 20, 34, -51, -27, 17, 24, -22, 35, -1, -30, 21, 46, 26, 12, -24, 25, -32, 14, 32, -5, 31, 44, -24, 17, -31, -6, 2, 7, 4, 12, 54, -11, 70, -17, 8, 36, 39, 4, 30, 22, -88, 37, 33, -1, 38, 12, -30, -20, 29, -27, -12, 20, -3, -14, -21, 9, 0, 3, -12, -29, 76, -1, -73, 64, 34, 26, -17, -15, 14, 2, -12, -6, 5, 39, 41, 17, 14, -5, 35, -1, -48, 42, 19, 3, 16, 11, -26, 4, -2, 12, 18, 20, 65, 28, 10, -8, -25, 31, -11, -18, 50, -8, 6, -6, -37, 22, 37, -26, -41, 11, 20, -5, 56, 27, -22, 18, -3, 3, -14, 15, 25, 42, 15, 27, 72, 39, -15, 40, -15, 18, -9, 7, 1, 25, -10, -25, 19, 5, 73, -27, 5, -46, 1, 56, -35, -40, -48, -1, -17, 22, 15, 26, -44, 28, 32, -21, -2, -11, -18, 22, -22, 11, -26, 4, 4, 23, 29, -34, -56, 7, -19, 42, 8, -10, -14, -8, -34, -44, 68, 11, 10, 26, 25, 45, 7, 34, -21, 59, -35, -21, -7, 27, -3, 5, 26, 16, 20, 37, -51, -79, 30, 13, 11, 36, 1, -1, 62, -7, 37, 7, -26, -32, -10, 22, -19, 4, -9, 15, 16, 11, 66, -14, -33, 0, -35, 33, 10, 24, -28, -39, 38, -33, -19, 43, 41, -19, -14, 34, 24, 7]
5164GK8L7nrm7K3mj4J7Rk2k0pk0N0N6r5k6M8L8l3LM1p5N7m6K8oL2o2L2l2j5O4
5198C2n5j9K2%j0L3kJ2PnrMnj5m2N6l2QM8qk9LN0n1Oj2j0N5l4Nm1pL1L4m6K3o
5235iqK6O7p4j4k0P5p1M1j2l4l5J0K0O4kk9n6R5n3OJ9k5mL0m9mO3r9Q1J8l4j6
5268c3O3m4n2N3PK3J0m3jJ0Rm3O7k1m7P2m5K6j1Mj6M7J9k9Kl7J3J6P7j14l4N3
5300Aj8K7l6P0j8K8p7L3J3k7k1J5K6jj0M2r2O7m0LK7l3l2O9Oq9Q7J7p3N2O2j03
5332b5P4p8L5m2M5J5j7j4K4l5J4l4k0Q1k6%Jrk3M0mmK4l2K9j1RoK0k0m1N8Pn9
5366b4M5Rrm2L3Mj7l1P0p5RQ0k7ok1K2m6qK1J7KJ6l4J2oj1lJP2j7l8K1n0O3k4
5401Hk8L8%J4o2N5n8MN0J0p0qO6l4P1q3J7j3O0n9l3J20p8M5KJ0l5j7K2NL5p5K0
$$ y = [7, 35, 72, 67, 58, 11, 34, 30, 16, 33, 42, 20, 0, -7, -27, 23, 79, -16, -42, 6, 44, 11, 14, 55, -20, 37, -9, 19, 13, 45, -17, 15, -17, -32, 32, -23, -42, -20, -20, -30, 3, 1, 13, 20, 15, 6, 10, 5, -10, -52, 4, -28, -20, 28, 20, -9, -6, 44, -7, -1, -13, -23, 32, -2, 3, -38, -45, -14, 20, -26, -3, -9, -17, 9, 76, 2, -12, -32, 43, -28, 13, 1, -33, -68, -58, -38, 26, 24, -5, -61, 34, -19, -13, 6, -19, -23, 7, -42, -46, 17, -82, -1, 17, -17, -33, 30, -14, -66, -13, -6, 17, 27, -16, -17, -7, 2, -41, 26, 5, -42, 30, -15, 11, 0, 4, -12, 35, 54, 25, 27, -10, 3, 19, 96, -18, -52, 1, -17, 10, -26, 44, 26, 54, -23, 10, 23, -4, -25, -10, 16, 15, 5, 47, -45, 22, -18, -15, 12, -21, -53, 16, 22, -67, 20, 37, -36, 16, 78, -25, 49, -29, 6, -36, 9, 24, 7, -7, 17, -18, -4, -38, -58, 23, -3, -3, -2, -11, -34, 6, 2, -2, 22, -10, 19, 8, 17, 11, 31, 11, -30, 28, 35, -24, 21, 30, 21, -21, 12, 16, -1, -32, 38, -37, -28, 52, 25, 19, -2, 20, -26, -34, -13, 4, 6, 22, -12, 0, -6, -17, -20, -19, 53, 36, -2, 19, -31, 32, 8, -20, 18, 18, 32, -30, 25, -33, -29, 21, 31, -39, -47, 19, -15, 56, -27, -10, -23, 37, -22, -55, 65, -13, 32, 34, 44, 9, -8, 14, 19, 54, -21, -1]
5434a%J9n1M7J7m7l5P8m0M6Kn3K0L8n2j9L5j1P0l2J6l5K1k6K0o9M4J3qk2K1J0
5466A6l1L0j1K6p7M4qJ1N3m3k8J4qJ7kM8j1l7pJ9k5j4PM6m2O3rn9qP5j04N5k0
$$ y = [-1, -1, 18, -33, 14, 31, -16, -51, 27, -13, 33, 35, -18, 2, 40, -12, -31, 4, -7, 63, 31, 47, 12, 33, 7, 27, -42, 2, 15, 7, -15, 6, 16, -15, 15, 4, 30, -47, -3, -11, 0, 53, 10, -18, -4, -12, 5, 3, 51, 40, 3, -4, 15, -10, -24, -17, 29, -13, 50, 41, -18, -26, 49, -55, 0, -20]
$$ [...]
8191c
##END NTUPLES=NMR FID
##END=
