##TITLE=1H_LR-758-R5-4PB-C3
 CDCl3
 8 sc, 
 8.9.2023
##JCAMPDX= 6.0         $$ Bruker NMR JCAMP-DX V2.0
##DATA TYPE= NMR FID
##DATA CLASS= NTUPLES
##ORIGIN= UXNMR, Bruker Analytische Messtechnik GmbH
##OWNER= root
$$ XWIN-NMR		Version 3.5
$$ Fri Sep  8 16:09:39 2023 Russian Standard Time (UT+4h)  she@DPX200
##.OBSERVE FREQUENCY= 200.13135
##.OBSERVE NUCLEUS= ^1H
##.DELAY= (6, 6)
##.ACQUISITION MODE= SIMULTANEOUS
##.ACQUISITION SCHEME= undefined
##.AVERAGES= 8
##.DIGITISER RES= 18
##SPECTROMETER/DATA SYSTEM= spect
##.PULSE SEQUENCE= zg30
##.SOLVENT NAME= CDCl3
##.SHIFT REFERENCE= (INTERNAL, CDCl3, 0, 15.7039)
##AUDIT TRAIL= $$ (NUMBER, WHEN, WHO, WHERE, WHAT)
$$ ##TITLE= Audit trail, XWIN-NMR		Version 3.5
$$ ##JCAMPDX= 5.01
$$ ##ORIGIN= Bruker BioSpin GmbH
$$ ##OWNER= she
$$ F:/spectra/data/she/nmr/H-F/1/audita.txt
$$ ##AUDIT TRAIL=  $$ (NUMBER, WHEN, WHO, WHERE, WHAT)
(   1,<2023-09-08 16:07:33.75 +0400>,<she>,<DPX200>,
      <created by zg, POWCHK disabled, PULCHK disabled
       configuration hash MD5:
       00 E9 B6 7A A2 85 ED C7 34 08 36 98 17 FE 4E 26
       data hash MD5: 16K
       7C 63 87 58 5F 21 75 86 CB 61 27 29 AD 99 63 34>)
$$ ##END=
$$ 
$$ hash MD5
$$ EC 46 9E 4D 25 5D 1C C7 B1 2F 51 6B 3A CB 54 EC
##$RELAX= 
##$RELAX= 
##$RELAX= 
##$RELAX= 
##$RELAX= 
##$RELAX= 
$$ Bruker specific parameters
$$ --------------------------
##$DU= <F:/spectra>
##$EXPNO= 1
##$NAME= <H-F>
##$PROCNO= 1
##$TYPE= <nmr>
##$USER= <she>
##$AMP= (0..31)
100 100 100 100 100 100 100 100 100 100 100 100 100 100 100 100 100 100 
100 100 100 100 100 100 100 100 100 100 100 100 100 100 
##$AQSEQ= 0
##$AQ_mod= 1
##$AUNM= <au_zg>
##$AUTOPOS= <>
##$BF1= 200.13
##$BF2= 200.13
##$BF3= 200.13
##$BF4= 200.13
##$BF5= 200.13
##$BF6= 200.13
##$BF7= 200.13
##$BF8= 200.13
##$BYTORDA= 1
##$CFDGTYP= 0
##$CFRGTYP= 5
##$CHEMSTR= <none>
##$CNST= (0..31)
1 1 145 1 1 1 1 1 1 1 1 1 1 1 1 1 1 1 1 1 1 1 1 1 1 1 1 1 1 1 1 1 
##$CPDPRG= <>
##$CPDPRG1= <>
##$CPDPRG2= <>
##$CPDPRG3= <>
##$CPDPRG4= <mlev>
##$CPDPRG5= <mlev>
##$CPDPRG6= <mlev>
##$CPDPRG7= <mlev>
##$CPDPRG8= <mlev>
##$CPDPRGB= <>
##$CPDPRGT= <>
##$D= (0..31)
0 1.2 0 0 0 0 0 0 0 0.06 0 0.03 0 0 0 0 0.0002 0 0 0 0 0 0 0 0 0 0 0 0 
0 0 0 
##$DATE= 1694174853
##$DBL= (0..7)
120 120 120 120 120 120 120 120 
##$DBP= (0..7)
150 150 150 150 150 150 150 150 
##$DBP07= 0
##$DBPNAM0= <>
##$DBPNAM1= <>
##$DBPNAM2= <>
##$DBPNAM3= <>
##$DBPNAM4= <>
##$DBPNAM5= <>
##$DBPNAM6= <>
##$DBPNAM7= <>
##$DBPOAL= (0..7)
0.5 0.5 0.5 0.5 0.5 0.5 0.5 0.5 
##$DBPOFFS= (0..7)
0 0 0 0 0 0 0 0 
##$DE= 6
##$DECBNUC= <off>
##$DECIM= 32
##$DECNUC= <off>
##$DECSTAT= 4
##$DIGMOD= 1
##$DIGTYP= 9
##$DL= (0..7)
0 120 120 120 120 120 120 120 
##$DP= (0..7)
150 150 150 150 150 150 150 150 
##$DP07= 0
##$DPNAME0= <>
##$DPNAME1= <>
##$DPNAME2= <>
##$DPNAME3= <>
##$DPNAME4= <>
##$DPNAME5= <>
##$DPNAME6= <>
##$DPNAME7= <>
##$DPOAL= (0..7)
0.5 0.5 0.5 0.5 0.5 0.5 0.5 0.5 
##$DPOFFS= (0..7)
0 0 0 0 0 0 0 0 
##$DQDMODE= 0
##$DR= 18
##$DS= 0
##$DSLIST= <SSSSSSSSSSSSSSS>
$$ [...]
##$SUBNAM2= <"">
##$SUBNAM3= <"">
##$SUBNAM4= <"">
##$SUBNAM5= <"">
##$SUBNAM6= <"">
##$SUBNAM7= <"">
##$SUBNAM8= <"">
##$SUBNAM9= <"">
##$SW= 18.05172834244
##$SWIBOX= (0..15)
0 0 2 0 0 0 0 0 0 0 0 0 0 0 0 0 
##$SW_h= 3612.71676300578
##$TD= 16384
##$TD0= 1
##$TE= 0
##$TE2= 300
##$TE3= 300
##$TEG= 300
##$TL= (0..7)
0 120 120 120 120 120 120 120 
##$TP= (0..7)
150 150 150 150 150 150 150 150 
##$TP07= 0
##$TPNAME0= <>
##$TPNAME1= <>
##$TPNAME2= <>
##$TPNAME3= <>
##$TPNAME4= <>
##$TPNAME5= <>
##$TPNAME6= <>
##$TPNAME7= <>
##$TPOAL= (0..7)
0.5 0.5 0.5 0.5 0.5 0.5 0.5 0.5 
##$TPOFFS= (0..7)
0 0 0 0 0 0 0 0 
##$TUNHIN= 0
##$TUNHOUT= 0
##$TUNXOUT= 0
##$USERA1= <user>
##$USERA2= <user>
##$USERA3= <user>
##$USERA4= <user>
##$USERA5= <user>
##$V9= 5
##$VALIST= <valist>
##$VCLIST= <CCCCCCCCCCCCCCC>
##$VD= 0
##$VDLIST= <DDDDDDDDDDDDDDD>
##$VPLIST= <PPPPPPPPPPPPPPP>
##$VTLIST= <TTTTTTTTTTTTTTT>
##$WBST= 1024
##$WBSW= 4
##$XGAIN= (0..3)
0 0 0 0 
##$XL= 0
##$YL= 0
##$YMAX_a= 262792
##$YMIN_a= -290101
##$ZGOPTNS= <>
##$ZL1= 120
##$ZL2= 120
##$ZL3= 120
##$ZL4= 120
##$ABSF1= 10
##$ABSF2= 0
##$ABSG= 5
##$ABSL= 3
##$ALPHA= 0
##$AQORDER= 0
##$ASSFAC= 0
##$ASSFACI= 0
##$ASSFACX= 0
##$ASSWID= 0
##$AUNMP= <proc_1d>
##$AZFE= 0.1
##$AZFW= 0.1
##$BCFW= 1
##$BC_mod= 2
##$BYTORDP= 1
##$COROFFS= 0
##$CY= 11.3945322036743
##$DATMOD= 1
##$DC= 2
##$DFILT= <>
##$DTYPP= 0
##$F1P= 15.7292609196834
##$F2P= 12.9074282941183
##$FCOR= 0.5
##$FTSIZE= 0
##$FT_mod= 4
##$GAMMA= 1
##$GB= 0.15
##$INTBC= 1
##$INTSCL= 1
##$ISEN= 128
##$LB= 0.24
##$LEV0= 0
##$LPBIN= 0
##$MAXI= 10000
##$MC2= 0
##$MEAN= 0
##$ME_mod= 0
##$MI= 1.114404
##$NCOEF= 0
##$NC_proc= 0
##$NLEV= 6
##$NOISF1= 3.799351
##$NOISF2= 2.8
##$NSP= 1
##$NTH_PI= 0
##$NZP= 0
##$OFFSET= 15.70392
##$PC= 1
##$PHC0= -21556.02
##$PHC1= -0.3472881
##$PH_mod= 1
##$PKNL= yes
##$PPARMOD= 0
##$PSCAL= 0
##$PSIGN= 0
##$REVERSE= no
##$SF= 200.130013532006
##$SI= 16384
##$SIGF1= 3
##$SIGF2= 2
##$SINO= 400
##$SIOLD= 16384
##$SREGLST= <1H.CDCl3>
##$SSB= 0
##$STSI= 0
##$STSR= 0
##$SW_p= 3612.71676300578
##$SYMM= 0
##$S_DEV= 0
##$TDeff= 0
##$TDoff= 0
##$TI= <>
##$TILT= no
##$TM1= 0
##$TM2= 0
##$TOPLEV= 0
##$USERP1= <user>
##$USERP2= <user>
##$USERP3= <user>
##$USERP4= <user>
##$USERP5= <user>
##$WDW= 1
##$XDIM= 8192
##$YMAX_p= 0
##$YMIN_p= 0
$$ End of Bruker specific parameters
$$ ---------------------------------
##NTUPLES= NMR FID
##VAR_NAME=  TIME,          FID/REAL,        FID/IMAG
##SYMBOL=    X,             R,               I
##VAR_TYPE=  INDEPENDENT,   DEPENDENT,       DEPENDENT
##VAR_FORM=  AFFN,          ASDF,            ASDF
##VAR_DIM=   8192,          8192,            8192
##UNITS=     SECONDS,       ARBITRARY UNITS, ARBITRARY UNITS
##FACTOR=    0.0002768,     1,               1
##FIRST=     0,             0,               0
##LAST=      2.2672688,     0,               0
##MIN=       0,             -290101,         0
##MAX=       2.2672688,     262792,          0
$$ Real data points
##PAGE= N=1
##DATA TABLE= (X++(R..R)), XYDATA
0 0 0 0 0 0 0 0 0 0 0 0 0 8 -8 8 -8 13 -16 16 -24 24 -32 40 -48 56 -64 72 -88 96 -112 128 -149 168 -192
33 -192 216 -244 272 -308 342 -381 427 -476 525 -581 645 -712 787 -867 955 -1053 1160 -1277
51 -1277 1408 -1554 1714 -1895 2103 -2336 2605 -2924 3302 -3756 4321 -5044 5998 -7322 9288
66 9288 -12493 18572 -33936 147466 175854 -290101 55267 178286 -198474 -14495 223808
77 223808 -128905 -105228 134922 -31867 -48583 106738 -62752 -72147 91936 -9549 -38135
88 -38135 69171 -51614 -56944 85987 4490 -40109 36977 -47282 -20476 93823 -32755
99 -32755 -53366 76058 -48938 -59399 133571 -9318 -132795 82340 42783 -101311 70669
110 70669 52096 -127595 25406 87762 -72634 10736 53833 -93495 9956 98467 -66253
121 -66253 -28750 70027 -58995 -22311 98297 -35167 -64395 57678 -7232 -28332 59687
132 59687 -22527 -53392 51244 914 -31561 52750 -19499 -63470 61173 24928 -59866 29831
144 29831 15118 -60512 36060 44320 -56163 1360 29977 -40768 19779 43294 -55556 -10394
156 -10394 49988 -31237 -7868 51150 -38308 -35050 57409 -918 -36561 31020 -4493 -34317
168 -34317 35818 14046 -35037 11778 6515 -22790 25218 12020 -36243 8075 18029 -21457
180 -21457 12301 16138 -32453 1069 26282 -15962 -531 15609 -24335 -297 29470 -16466
192 -16466 -10459 21688 -16948 -9147 33706 -10359 -25933 23616 1181 -19872 23076 2878
204 2878 -29528 14508 14927 -19838 8186 9214 -23557 6923 19418 -17553 -2164 13505 -15283
217 -15283 351 19603 -13047 -9156 14456 -6575 -3939 15445 -8783 -10011 14582 -2373 -6966
230 -6966 12858 -6213 -11752 15405 1038 -12554 10674 101 -13789 12334 5826 -15772 5521
243 5521 6674 -12826 6214 9250 -14391 634 11195 -9577 -276 10420 -10094 -3441 12581
256 12581 -5067 -5226 9525 -4367 -5741 10296 -1141 -7534 6633 111 -5891 6592 888
269 888 -7284 4071 2172 -5372 3565 1459 -6301 2817 3010 -5227 1914 2552 -5500 1872 4325 -4972
285 -4972 247 4310 -4321 -102 5253 -3724 -1753 5247 -2165 -2262 4966 -1519 -3493 4266 -66 -3836
301 -3836 3156 614 -3870 2397 1590 -3722 1084 1823 -3131 455 1928 -2601 -76 2181 -1709 -305
317 -305 1944 -1301 -423 1777 -955 -349 1821 -750 -378 1849 -803 -627 1739 -766 -1057 1676 -576
334 -576 -1322 1665 -386 -1758 1501 -25 -2030 1194 284 -2158 1137 1020 -2072 670 1406 -1697
350 -1697 399 1672 -1584 -130 1924 -817 -333 1592 -775 -478 1681 -317 -719 940 -507 -413
366 -413 1070 -596 -862 651 -572 -417 1085 -975 -1103 1190 -384 -856 1196 -752 -1380 1726 412
383 412 -1256 1147 119 -1402 1707 949 -1817 675 1013 -1184 1244 1330 -2063 -68 1412 -1076
399 -1076 182 1006 -2037 -333 1848 -932 -467 825 -1922 -447 2284 -1122 -1299 1363 -1047 -320
415 -320 2705 -936 -2006 1931 -32 -1023 2637 -570 -2704 2331 1242 -1864 1620 156 -3095 1864
431 1864 2095 -2664 238 921 -2613 1326 2409 -3131 -824 1870 -1834 526 2603 -2946 -1324 2878
447 2878 -877 -126 2320 -2645 -1199 3823 -756 -1333 2645 -2187 -1863 4704 -356 -3452 2764 -465
463 -465 -2935 4081 500 -4861 1857 1390 -3201 2860 1289 -5259 1551 3188 -3529 1204 2383 -4799
479 -4799 719 4601 -2933 -415 3000 -3432 314 4758 -3105 -1566 3785 -2902 -725 5559 -3057
494 -3057 -3634 4766 -1205 -2990 4844 -1677 -5015 4569 646 -4146 3873 -181 -5696 4321 2644
509 2644 -5723 2352 2748 -5538 2197 4900 -4866 -492 4019 -3198 380 4040 -3696 -871 3909
524 3909 -2704 -78 4320 -4102 -2361 5162 -1786 -2694 4122 -1837 -3620 4137 -54 -3012 2684
539 2684 -1300 -2719 4448 -358 -4035 3823 131 -4681 4738 2548 -6207 1850 3956 -4235 1196
554 1196 4033 -4537 -855 4192 -2393 -292 3319 -3870 -1394 4871 -2149 -2526 3841 -2385 -3320 5034
570 5034 200 -4395 2413 501 -3075 3308 1100 -4221 1686 1827 -2808 2754 2103 -5044 804 4274
586 4274 -2857 -177 3104 -3599 -1134 4642 -1175 -2137 2029 -2109 -1061 4109 -1522 -3161 2666
601 2666 -1007 -2011 4476 -621 -5097 2873 1996 -3125 2600 1141 -4909 1912 3975 -2892 524
616 524 1905 -4103 1305 4813 -3420 -1637 3141 -2803 -338 4987 -2944 -3737 3714 -535 -1817 3886
632 3886 -2104 -4381 4047 1028 -3002 2835 -863 -4422 4281 2577 -4285 1394 1065 -3781 3398
647 3398 3324 -4844 150 2674 -2870 2236 3200 -5504 -481 4433 -2868 176 3778 -5191 -1853 6307
663 6307 -2015 -3064 3878 -2889 -3106 6268 -166 -5025 3149 91 -3292 4856 768 -5777 2416
678 2416 2409 -3104 3023 1504 -5510 1829 4077 -3361 752 2097 -4685 1107 4832 -3491 -1288 2854
694 2854 -3419 5 4929 -3418 -3066 3770 -1359 -1470 4322 -2081 -3872 3931 693 -2387 2812 -976
710 -976 -3361 3750 1412 -3083 1984 94 -3247 3454 1922 -4342 1014 1946 -3259 1844 2718 -4407
726 -4407 -425 3465 -2260 -221 2647 -3294 -1226 3860 -1292 -1603 2471 -1750 -1444 3843 -533 -2768
742 -2768 2271 -187 -1800 3030 138 -3160 1891 1122 -2051 1751 518 -3229 1346 1978 -2414 434
758 434 1226 -2643 562 2376 -2235 -685 1522 -1653 122 2233 -1794 -1004 2024 -872 -337 2077
774 2077 -1446 -1281 2495 -231 -1237 1876 -630 -1564 2250 327 -2025 1125 86 -1699 1659 583
790 583 -2287 694 810 -1670 977 901 -2310 293 1590 -1490 180 1300 -1742 -105 2091 -988
806 -988 -595 1536 -953 -436 2045 -618 -1156 1341 -275 -747 1561 -299 -1456 997 88 -992 1001
823 1001 -227 -1538 900 402 -1166 746 192 -1567 779 1017 -1263 257 836 -1122 348 1435
839 1435 -915 -365 1041 -554 -153 1231 -548 -729 996 -24 -526 808 -318 -1028 555 310 -663
856 -663 248 -39 -724 373 451 -504 -106 92 -415 308 550 -362 -270 314 9 220 489 -249 -287 339 262
877 262 75 214 -324 -352 351 247 -191 -89 -321 -329 404 309 -570 -303 66 -250 168 425 -616 -478 482
898 482 198 -139 356 -223 -556 704 701 -390 26 172 -302 482 650 -540 -429 327 18 223 262 -750
918 -750 -473 501 14 -169 118 -663 -354 814 120 -518 -18 -301 -177 889 154 -773 223 305 -55 753
938 753 138 -976 210 833 -116 147 53 -847 202 874 -328 -401 -31 -653 217 986 -698 -880 411
957 411 -104 -55 845 -606 -1158 709 609 -439 385 -267 -922 888 1102 -681 -179 316 -533 647 1176
976 1176 -912 -876 690 115 83 585 -831 -912 759 413 -211 25 -846 -611 1149 446 -796 -90 -284
995 -284 -297 1225 502 -1229 -227 481 69 939 316 -1468 53 1204 -153 232 233 -1496 -11 1746
1013 1746 -193 -1012 209 -576 -144 1458 -249 -1554 59 214 147 1046 -585 -1450 660 917 -126
1030 -126 437 -347 -1323 902 1526 -480 -402 -112 -602 956 1243 -984 -807 195 -27 766 816 -1428 -1095
1049 -1095 819 362 55 183 -1271 -899 1212 740 -459 -306 -766 -251 1516 599 -1099 -432 31 273
1067 273 1256 317 -1423 -401 804 529 557 -308 -1423 -128 1307 327 -360 -503 -972 114 1456 115
1085 115 -1244 -600 32 439 896 -98 -1305 -353 872 706 272 -454 -1147 205 1454 465 -596 -378
1103 -378 -460 319 1438 191 -1279 -512 377 590 668 -488 -1373 15 790 237 217 -611 -1495 633 1584
1122 1584 -377 -680 -54 -703 480 1708 -522 -1368 241 255 543 1092 -893 -1307 837 628 69 624
1140 624 -989 -1382 1285 1046 -875 -118 -475 -1028 1333 1084 -1458 -535 294 -600 1099 969 -1769 -647
1158 -647 1247 -3 353 690 -1478 -523 1684 196 -355 283 -1149 -187 1912 -89 -1136 281 -488
1175 -488 -280 1685 -207 -1763 343 373 -190 901 -405 -1666 642 842 -402 485 -273 -1377 995
1192 995 1362 -835 -109 211 -831 839 1321 -1007 -585 488 -218 628 830 -1173 -667 798 -67 47
1210 47 480 -1205 -697 1168 103 -444 147 -834 -292 1224 -30 -779 296 -393 -112 1415 -82 -1194
1228 -1194 508 288 -282 1001 35 -1317 427 835 -380 272 5 -1087 293 943 -524 -352 66
1245 66 -637 221 777 -540 -554 224 -173 215 591 -454 -527 507 183 78 415 -390 -351 616 293 -175
1265 -175 118 -289 -250 551 248 -364 -70 -156 -197 386 4 -563 -145 14 -59 296 39 -491 -23 263 8
1286 8 150 -49 -314 160 324 50 125 -59 -235 320 362 -262 4 99 -308 171 368 -348 -226 197 -198 -111
1308 -111 333 -228 -425 247 43 -272 120 -103 -387 226 216 -220 110 176 -217 133 366 -201 -48 253 -76
1329 -76 92 246 -157 -108 186 -85 -50 127 -147 -253 109 -92 -163 140 -130 -322 127 47 -257 111 -18 -267
1351 -267 133 233 -153 -4 207 -82 89 274 -22 -11 114 20 88 146 -113 -10 81 -113 8 130 -198 -215
1373 -215 100 -108 -89 -4 -134 -99 71 -175 25 111 -269 -3 331 -83 -88 302 -68 -124 324 83 -184 189
1395 189 -37 -157 322 -30 -335 191 -26 -338 236 93 -557 56 279 -414 57 336 -422 -116 454 -224
1415 -224 -162 391 -186 -184 492 25 -314 281 88 -213 304 165 -216 15 38 4 150 -43 -223 66 -42 -115
1437 -115 153 -127 -360 66 124 -94 29 -135 -229 164 127 -23 198 -98 -300 399 314 -334 99 177 -241 265
1459 265 470 -316 -293 225 -54 1 261 -328 -306 233 41 -154 79 -315 -380 286 247 -286 -143 -61 -134 233
1481 233 300 -125 -224 -28 229 363 -2 -222 47 8 189 404 -53 -445 -70 249 34 103 -146 -475 52
1502 52 396 -94 -172 -132 -438 86 534 -139 -497 3 54 211 338 -55 -438 -54 342 305 131 -213 -291 223
1524 223 356 36 -46 -300 -259 282 413 -172 -303 -142 -10 295 223 -313 -355 29 162 299 104 -441 -306
1545 -306 315 286 65 27 -312 -141 431 286 -153 -161 -218 12 467 92 -390 -142 -75 61 396 6 -642 -154
1567 -154 277 -27 55 -131 -510 -11 444 -20 -77 -98 -314 251 534 -82 -282 128 -74 167 501 -214 -341
1588 -341 141 138 171 269 -347 -448 320 209 -190 20 -201 -409 305 272 -316 -164 -47 -191 305 202 -427 -83
1610 -83 197 -75 341 230 -471 -49 474 -15 42 160 -342 -44 501 -12 -166 106 -256 -62 416 -153 -403
1631 -403 81 -77 -75 329 -250 -383 164 120 -62 121 -173 -241 282 146 -47 94 -90 -145 420 193 -264 111
1653 111 36 -199 278 195 -396 -42 277 -174 45 126 -321 -132 274 -106 -133 -18 -234 27 218 -123 -83 121
1675 121 -115 82 231 -55 -148 137 84 49 188 -86 -104 134 19 31 60 -224 -55 229 -26 -85 39 -101
1697 -101 -59 197 -87 -137 -9 -67 91 184 -219 -133 224 -51 -22 307 -157 -151 361 83 -125 116 -24 -131 332
1720 332 69 -231 81 -87 -200 273 18 -445 140 97 -275 210 65 -412 95 220 -241 85 97 -346 202
1741 202 357 -296 47 279 -218 116 454 -271 -112 280 -166 28 343 -351 -195 410 -142 -197 292 -352
1761 -352 -284 510 -113 -371 283 -43 -426 431 128 -464 148 98 -252 328 120 -418 189 236 -249 273 152
1782 152 -419 149 387 -295 37 159 -381 33 398 -383 -153 247 -353 -10 324 -343 -335 404 -119 -121 411
1803 411 -188 -299 404 96 -205 206 -54 -227 383 173 -241 134 -24 -224 270 160 -384 74 210 -277
1823 -277 120 211 -440 -57 249 -162 -14 230 -322 -91 367 -101 -141 257 -87 -153 361 59 -235 230 119
1844 119 -129 235 21 -266 86 133 -139 158 49 -280 48 146 -164 -4 26 -238 -69 163 -72 -132 89
1865 89 -59 42 151 2 -111 92 26 -14 185 -44 -176 143 78 -66 101 -48 -129 105 124 -158 18 -12
1887 -12 -198 8 73 -226 -68 86 -153 -47 203 -178 -183 273 -30 -115 234 26 -157 237 145 -123 131 79
1909 79 -133 128 169 -186 61 152 -241 84 140 -278 -52 144 -214 -72 163 -200 -131 219 -45 -140 178 -167
1931 -167 -80 211 -76 -149 204 -12 -133 325 37 -247 227 185 -269 156 173 -263 34 221 -240 -13 109
1952 109 -166 20 120 -234 0 188 -228 -16 209 -225 -50 310 -161 -137 278 -106 -107 309 -16 -176 228
1973 228 -25 -106 334 -46 -283 230 105 -236 176 37 -361 160 151 -152 19 -20 -288 147 162 -265 -5 129
1995 129 -246 146 316 -265 -90 249 -110 23 301 -245 -144 252 8 26 223 -286 -154 311 15 -197
2015 -197 175 -155 -266 367 6 -381 -32 -13 -116 283 48 -413 27 93 -56 178 61 -377 92 301 5
2036 5 124 25 -306 122 348 -65 -42 61 -147 151 291 -219 -164 121 -147 56 240 -280 -305 187 -4 -8 149
2059 149 -225 -246 287 177 -92 97 -167 -184 358 211 -196 26 -79 -103 270 113 -242 -14 76 -27 228
2080 228 -34 -398 16 133 -82 145 -57 -392 36 355 -62 -130 -13 -232 70 352 -20 -208 12 -52 216
2101 216 297 -185 -221 146 99 82 202 -207 -258 164 191 9 -10 -259 -158 292 74 -142 -38 -207 -116 295 163
2124 163 -358 -74 98 -32 177 109 -246 -110 179 95 137 -65 -335 45 249 -17 -53 -25 -270 21 351 -43
2146 -43 -220 -80 -97 94 194 -179 -163 -7 14 146 195 -306 -253 215 146 -65 82 -68 -186 194 287 -106 -70
2169 -70 -3 -1 236 149 -175 -122 38 -26 129 21 -297 -165 148 126 -56 -59 -146 -44 102 76 -38 -182 -115 189
2193 189 184 -104 -81 -9 5 152 229 -76 -228 9 128 128 22 -122 -110 19 73 49 -41 -245 -95 131 50 -99
2217 -99 -124 -88 -35 122 24 -121 -142 5 147 116 -29 -161 31 65 76 110 -43 -167 41 117 44 -33 -183 -55
2241 -55 54 20 28 -74 -133 -46 200 23 -170 -79 0 -5 131 38 -158 -8 79 103 77 -34 -173 18 166 47 25
2266 25 -34 -52 -23 150 66 -79 -101 -17 89 27 -114 -49 4 -33 30 110 -154 -127 103 -17 -56 44 -73 -53 109
2291 109 45 50 13 -67 20 155 65 -120 22 49 -83 145 125 -159 -69 85 -64 -12 46 -133 -95 54 -55 -82 46
2316 46 -57 -13 163 -46 -196 184 5 -95 101 63 -178 132 96 -66 65 63 -124 64 166 -57 -44 59
2338 59 -117 -16 63 -117 -33 127 -65 -131 113 -155 -74 105 -29 -99 103 -32 -76 163 -22 -148 116 26 -115
2361 -115 161 71 -173 104 81 -166 60 36 -186 94 107 -161 -34 64 -190 12 145 -148 -50 200 -123 -17
2383 -17 210 -111 -121 226 -13 -76 207 -8 -67 177 -14 -110 142 -43 -173 156 35 -215 108 57 -212 54
2405 54 42 -260 14 122 -188 50 84 -222 9 138 -208 36 133 -168 10 264 -98 -68 178 -110 -72 214
2427 214 -115 -105 173 11 -120 194 -80 -217 117 -39 -194 105 -14 -194 149 128 -190 47 28 -130 85
2448 85 73 -93 28 97 -121 33 124 -108 10 135 -73 17 157 -78 0 178 -73 -73 112 -30 -116 107 -68
2471 -68 -90 71 -79 -96 85 -38 -121 97 -16 -106 46 54 -114 2 100 -77 19 102 -79 -11 93 -3 -18 92
2495 92 -29 -22 71 -47 -42 48 -142 -130 122 40 -127 8 64 -52 -12 28 -25 -14 54 -46 66 -8 -71 55 84 41
2521 41 19 41 -46 65 110 -23 -52 -15 -55 -78 88 -35 -81 0 -21 -23 91 -43 -77 62 102 -95 117 68 -145 71
2547 71 140 -91 -50 58 -76 26 120 -82 -77 43 9 3 98 -104 -97 106 3 -46 40 -104 -133 66 45 -76 -28 -66
2573 -66 -75 163 56 -167 -32 -30 -51 132 79 -129 9 127 46 65 60 -122 8 111 -3 17 46 -120 -14 159
2597 159 -3 -134 5 -71 39 196 -80 -131 60 -42 -17 170 -110 -231 163 113 -6 71 -42 -136 96 193
2619 193 -99 -21 -69 -79 191 135 -192 -84 51 -83 56 114 -166 -184 83 11 8 -7 -171 -86 112 50 -45 27 -182
2644 -182 -103 217 24 -156 -11 -20 -33 229 93 -149 -14 -2 16 137 -61 -180 28 83 -14 63 18 -300 36
2667 36 179 -62 -114 -37 -99 105 174 -58 -80 1 -29 80 162 -134 -118 98 26 36 125 -113 -149 148 97 -46 14
2692 14 -95 -117 220 99 -166 -5 -42 -96 128 129 -185 -71 87 -12 114 85 -128 -36 179 26 22 53 -106 -36
2716 -36 227 2 -139 49 -89 -34 149 -72 -190 33 15 -76 74 -45 -161 64 70 -3 -5 24 -188 47 167
2739 167 -69 -62 -42 -81 87 179 -22 -44 72 -21 -6 138 -126 -121 102 43 -41 124 -101 -157 128 24 -115 3
2763 3 -42 -141 98 60 -121 -23 10 -91 59 69 -140 10 113 -41 67 117 -170 -26 199 -21 -17 155 -120 -79
2787 -79 158 -59 -111 41 -26 -105 133 -43 -187 51 65 -125 74 38 -152 85 159 -55 39 65 -130 80 129
2810 129 -87 13 94 -146 1 154 -121 -65 139 -67 -40 124 -60 -129 121 -10 -103 91 -43 -113 95 -18
2832 -18 -147 67 8 -69 78 122 -92 47 57 -50 36 117 -40 18 115 -14 -13 89 -50 13 97 -60 -65 47 -102
2857 -102 -81 131 -38 -114 18 33 -61 87 -33 -109 12 65 -84 97 62 -120 69 192 7 0 83 -40 -13 126
2881 126 20 -42 73 -20 -72 54 -33 -111 22 25 -102 59 -43 -76 56 51 -52 27 5 -56 60 36 -95 35 71
2906 71 -99 -24 90 -97 -56 120 -83 -60 114 -44 -120 172 -19 -115 55 17 -122 85 32 -118 24 23 -118
2929 -118 55 62 -110 46 75 -75 34 97 -148 24 149 -75 3 100 -118 -22 141 -70 -88 154 -88 -77 150
2952 150 -32 -122 97 -39 -87 72 1 -157 63 47 -125 74 71 -176 74 126 -127 43 122 -123 66 128 -125
2975 -125 11 87 -69 -27 133 -99 -68 142 -23 -49 88 -79 -122 49 -11 -124 49 -22 -113 87 -11 -65 28 69
2999 69 -40 96 67 -67 20 79 -29 67 24 -81 -27 84 -22 11 75 -56 20 14 48 1 88 -51 -32 89 -40
3024 -40 -64 62 4 -44 51 8 -86 2 63 -16 96 12 -82 42 19 -14 69 -32 16 37 64 -68 -26 -3 1 -5 24 -16 -51
3053 -51 10 11 16 40 -25 -71 17 35 -20 10 -2 -52 9 39 -31 -17 -6 -12 12 -26 3 -45 37 -34 7 -18 -22 -45 51 40 -9 -49
3085 -49 -16 -30 43 1 -29 -26 -10 30 -31 -4 -1 -4 -1 49 3 26 -5 -28 -22 28 11 -27 19 -26 13 -4 -46 16 15 -13 -50 23 -39
3118 -39 5 39 27 -73 7 -46 -65 36 15 -24 67 -9 -11 116 -13 -17 59 30 -33 2 25 -21 -15 42 -41 15 -44 6 -1 6 -20
3149 -20 25 -4 -20 -33 0 -74 -35 25 -14 -6 14 -4 -4 71 23 25 75 1 -17 54 23 -36 51 14 -12 45 36 -93 5 18 4 9
3181 9 29 -71 -9 75 -27 7 -8 -34 -46 15 -80 -83 7 11 80 29 21 -30 31 -11 42 -28 -68 -24 51 -6 -44 36 -39 38 89
3212 89 11 -29 -9 -49 15 49 -23 -38 2 12 17 24 14 -13 21 -29 0 39 -14 -20 40 -12 -11 -3 22 -39 70 38 28 -18 12 21 23
3245 23 3 -34 -4 -45 -10 47 11 -26 22 27 1 48 -36 -97 3 32 11 37 5 -43 26 23 30 -9 17 -43 -31 8 -84 -67 -16
3276 -16 -18 0 17 -52 -47 52 -40 -51 55 -34 11 21 19 -78 65 34 18 57 3 -58 51 54 -16 10 -6 -32 -10 69 30 -30 28
3307 28 -42 -19 12 7 -2 2 -58 41 41 -74 -42 9 -25 17 13 -37 -80 31 20 -37 49 -27 1 -10 4 -53 31 25 -11 84 17 -12
3339 -12 55 20 -15 52 -8 -28 15 37 -33 15 10 0 -19 12 -39 0 64 -43 20 54 6 -61 64 4 -40 49 -30 -70 -18 44
3369 44 -16 32 3 -75 71 11 -85 -1 -35 -65 48 54 -68 -5 47 -25 49 49 -56 -17 110 13 -1 58 5 -13 52 32 -38
3398 -38 44 -78 -58 56 -14 -96 -2 11 -52 20 -35 -6 12 -11 -2 83 25 -37 51 29 -44 28 31 -24 65 59 -38 -17 60 12 76
3429 76 30 -25 -6 73 -45 32 67 -26 -14 -14 5 18 34 -40 -10 -6 -6 -96 -48 -49 12 48 4 -34 -27 2 23 34 -5 -10 57 -4 -4
3462 -4 87 25 -49 80 65 -6 23 21 -78 41 49 -3 35 -23 -73 -12 27 -43 -17 25 -27 50 -10 -47 -27 -10 41 18 38 -21 -30
3493 -30 -12 4 -3 55 -32 19 21 17 -38 19 -39 -41 -28 -44 -60 4 2 -19 42 -29 1 -22 26 2 21 17 -61 -33 27 -18 3 2 -68 26
3527 26 -23 -27 -20 6 16 -22 18 -66 -47 -83 -73 -57 -10 -51 -8 6 17 19 43 -24 3 -6 41 11 -13 -25 20 25 -4 -11 -4 -31 7 20
3561 20 7 -41 23 -33 -13 28 -5 -44 -5 -32 -6 18 22 -53 -9 25 -19 39 -5 -69 -10 3 -23 -3 -11 -13 -49 6 -5 43 14 -15
3593 -15 31 1 -23 30 41 40 10 50 -12 -25 59 35 -54 27 23 -62 18 11 -35 -4 33 -27 26 42 -16 -44 -27 12 40 56 -28 -25
3625 -25 -29 17 6 -1 -43 -54 34 23 -3 -40 -11 -32 28 15 -46 -2 26 -39 29 9 -48 86 89 19 -7 -15 -14 20 35 16 -21 -8
3657 -8 -91 7 33 -14 10 16 -14 34 -30 -56 -43 0 14 -24 0 -9 8 -16 7 36 31 4 -30 22 12 0 -6 18 23 -7 33 -48 -10
3690 -10 -12 17 28 -43 -22 -16 2 -4 13 42 19 -15 -1 -1 -36 -21 -20 25 11 13 -42 7 33 -6 -3 -34 -14 51 -7 38 -2 -38 -22 26
3724 26 19 -4 25 19 -10 -17 68 -47 -1 -7 -22 23 -25 14 -36 17 -54 21 -51 -55 -16 -26 21 -24 -15 -85 13 -12 -37 -27 -75 -20 -7
3757 -7 12 -45 1 22 7 41 9 -28 -57 -26 14 15 -27 -10 -19 17 -17 -29 -25 -22 18 52 -9 -38 22 -35 7 31 -21 0 -18 -49 -43
3790 -43 -47 -39 -3 12 2 -15 85 -38 -43 18 -15 -77 40 26 -27 -8 13 19 -30 16 -4 65 16 -46 50 21 -30 -4 -5 -53 -33
3821 -33 -23 -6 28 49 -65 15 -44 -14 19 57 -81 -57 13 -45 -67 26 17 -35 32 3 -89 35 -7 -17 5 27 -39 36 3
3850 3 -67 63 -7 -23 26 50 -44 -27 11 -17 18 2 -37 -19 55 11 4 77 -83 -47 -8 -72 -17 -5 -28 26 27 66 -4 44 5
3881 5 -29 34 3 -19 4 -48 25 55 5 -8 -30 -22 -6 10 33 -25 -15 10 -81 22 18 -19 -24 32 -22 7 0 -18 -38 37 51 11
3913 11 -22 -22 -39 -18 8 -13 50 -31 11 -16 -37 -19 6 0 -13 5 -29 -26 26 7 -23 53 -11 43 35 -13 60 -19 -47 38 39 39 8
3946 8 33 -18 -2 39 9 7 -22 -47 25 -7 -8 -20 -3 -28 41 36 -6 -16 -20 -2 -10 47 -6 6 -4 -30 -39 31 -33 -17 -18 24 53 28
3980 28 -18 -24 26 -11 -46 9 6 -13 -22 -13 -1 -32 4 -17 84 -47 -53 15 -24 -72 25 -13 23 33 44 16 30 68 -35 -3 -11 -18
4012 -18 -39 9 -12 -10 28 -43 -30 22 -29 1 -2 -64 -4 32 -8 -42 59 -20 -3 50 -12 -36 36 2 -1 9 28 -33 -56 -24 -12
4043 -12 25 5 -53 -5 24 -56 -23 69 -36 -83 14 -21 -37 22 -28 36 34 -25 -23 23 17 -8 16 -1 -62 25 67 12 36 22 -3
4074 -3 11 0 -69 22 16 -48 -21 31 -34 2 48 -16 -35 -22 27 -65 53 7 -51 -24 9 13 77 27 1 28 19 -1 -50 24 -29 24
4106 24 -21 -82 12 10 -27 12 -6 -13 -88 26 -27 -12 1 -1 12 -8 -27 -27 -22 -35 31 -5 18 18 -40 7 -16 28 8 15 16 -12 -12 -21 -2
4141 -2 3 19 0 -18 -36 10 -29 -12 -38 1 37 4 -11 24 47 0 -25 -26 49 -5 10 2 4 -32 4 -5 -50 37 -6 -9 25 -37 18 31
4175 31 -34 -16 -31 23 17 -7 -51 -2 28 -6 -50 2 17 25 -26 -23 -7 -44 -45 -15 32 18 -40 -14 42 27 -12 4 14 -25 0 -51
4207 -51 -9 -1 -107 28 -26 -14 -9 -29 -16 32 30 -37 32 -35 -25 -22 -1 18 -1 -17 20 -8 7 18 34 -51 -18 -4 -45 1 28
4238 28 -4 25 26 39 48 24 -70 -18 51 -41 17 -19 42 -15 9 -22 -28 -11 31 -30 48 18 -9 29 -17 28 19 12 -30 7 41 55 -22
4271 -22 13 6 9 -1 -26 -21 64 -15 32 -40 -27 25 -14 31 1 -42 -10 -12 -3 -41 9 -38 -48 -13 15 0 -46 33 -15 -77 -25 15 9
4304 9 16 3 3 -21 16 -16 -1 51 -22 -37 18 29 -19 -32 -48 19 15 -11 -40 73 -11 -29 -9 7 -20 13 -9 -41 1 34 1 9
4336 9 -20 22 40 -36 -99 -11 -66 -24 25 -30 -5 -13 38 13 -29 40 -5 21 65 39 8 9 10 -11 23 -37 -38 46 -39 17 21 -1 5 -19
4370 -19 -50 21 8 -58 -27 71 8 16 44 3 -19 -20 45 -20 23 -26 22 -11 -13 3 9 71 4 11 23 -21 24 34 -43 39 -20 1 2
4403 2 7 34 -6 -13 -5 16 -37 24 -71 24 8 26 27 -12 0 25 57 -37 -26 7 3 -23 17 -42 3 -22 50 38 23 -14 46 -9 -6 -10
4437 -10 65 9 0 2 6 -6 -26 -42 -21 14 -20 54 29 -20 8 9 -6 -31 55 -26 16 21 -43 44 39 3 -41 0 -17 -17 36 5 -16 58
4471 58 -5 54 9 -7 -43 -31 -19 -26 -7 38 26 24 -18 7 -54 -37 19 -57 10 14 34 -15 -18 51 -22 0 -37 28 -19 -6 -38 -32 -11
4504 -11 -8 -5 -33 -46 -21 3 -41 28 -42 41 40 17 2 32 -7 19 52 -8 -22 34 25 22 12 1 5 30 -7 -3 -38 28 40 -15 -20 -16 13
4539 13 45 -45 2 20 -21 1 -9 -7 30 27 42 8 -21 12 -1 7 -66 -58 -28 -6 -11 31 -40 -31 -18 12 39 4 18 21 -7 21 -26 26
4573 26 37 -23 16 6 -26 -40 -40 27 -1 37 -10 25 23 -22 20 47 0 -17 8 -54 44 -20 -23 17 -66 -53 3 30 -32 -15 69 -3
4605 -3 53 -31 -8 17 0 36 -53 -19 -15 -24 1 29 -19 -21 4 -21 -10 -7 -44 -25 43 -9 4 -23 0 -32 -5 -14 21 -25 -2 -16 40
4638 40 -38 24 -31 8 -38 15 27 9 -2 -19 3 -42 -1 -34 3 -12 11 -36 45 -9 -17 -39 4 0 19 -43 -8 -11 11 -9 0 45
4670 45 -4 -28 7 20 35 10 -24 24 -11 -36 4 -34 9 -27 10 32 -29 32 19 -6 -5 12 -35 -50 43 -30 2 15 58 -6 30
4701 30 -60 -6 14 -10 -20 -23 -14 -13 -13 16 3 59 38 18 22 -57 -13 -16 38 -2 13 -46 -59 -10 0 28 52 -55 -24 14 -17 -47 31
4734 31 9 5 46 -2 -16 -12 23 40 -16 18 -58 75 17 -43 -26 21 -4 28 32 37 9 54 -10 -7 21 -22 -4 -59 -8 -15 18 -11 -17
4767 -17 0 11 -4 34 7 18 -30 21 75 -27 -6 -30 -5 24 -33 4 4 38 2 7 50 -12 -49 -70 -45 -24 54 -2 49 -61
4797 -61 -15 -34 28 -9 5 -18 0 14 8 53 -33 23 21 50 8 -5 16 26 23 -56 -25 -43 -5 5 -23 -25 -5 36 27 0 22 34 -26
4830 -26 8 6 2 -6 32 1 27 -21 -12 7 0 26 -31 -40 0 -57 -15 18 6 4 33 -28 78 -26 9 -4 51 -55 -40 -2 -19 23
4862 23 11 -14 19 1 -10 7 33 -18 -15 -4 20 -21 -25 -4 -40 -4 -17 3 45 6 -17 13 12 -16 -18 -26 -3 21 -14 9 28 29 -81
4895 -81 9 10 -14 17 25 14 61 -45 -23 -16 -46 1 37 -1 -10 -9 -12 35 -12 -8 -34 19 30 -17 0 -26 -48 20 15 50 -20 -11 23 -37
4929 -37 12 36 4 -15 11 -53 30 -14 -19 -7 -23 38 -4 -7 19 27 -16 22 -1 45 -20 36 41 -75 14 47 -58 34 -24 -42 26
4960 26 2 -27 -39 30 -28 11 30 -20 3 26 -35 9 11 44 -13 22 -42 -14 1 -16 -50 32 66 7 7 -27 -33 16 -12 61 29 -12
4992 -12 9 -3 25 18 31 50 -9 -27 -9 29 -11 31 -37 23 23 24 -26 0 -30 -34 -21 -28 18 -2 7 -19 84 -55 9 78 12 15 -12
5025 -12 16 1 -15 -28 37 3 -31 3 0 2 -8 33 30 4 26 42 -10 -21 -18 -10 4 -33 -65 -3 18 -20 -3 -19 -16 18 -10 -6 -33 15
5059 15 27 -8 1 -12 -28 62 7 -41 -5 -1 -21 36 17 16 -15 29 -14 -25 4 -36 -29 8 -15 -1 -5 -1 20 23 20 35 33 -29 3 -13 28
5094 28 -49 32 -19 -33 15 -34 -48 -47 -32 22 -24 -48 -11 10 -1 -16 -6 -16 -1 -30 -70 22 26 15 20 2 -8 10 26 -1 36 15
5126 15 -3 4 -17 7 28 -2 25 10 -56 48 0 -22 30 10 10 -2 -56 16 -72 50 -13 -36 -13 12 -34 24 43 11 2 13 -21
5157 -21 -58 53 3 12 -9 -2 16 32 8 61 -42 -12 4 7 4 -62 -19 -7 25 24 7 -8 -21 -68 -45 3 -36 -44 10 -12 -11 21 -3
5190 -3 -18 34 -37 38 10 -7 13 76 14 20 -24 8 -70 16 23 -41 -62 -8 -14 35 34 -33 -39 -15 17 -17 7 9 -6 13 6 4 55 -16 -43
5225 -43 16 -52 38 30 -19 33 61 -45 -48 37 1 -25 -13 29 4 -15 -16 -1 22 -12 16 10 -49 -40 -43 -30 -4 34 -5 -70 -53 44 15
5258 15 -14 -22 39 -44 36 -1 10 23 5 -23 -30 11 -12 -53 -7 -22 16 -12 24 40 49 22 41 -51 -42 -1 22 -31 -21 11 0 -3 -21
5291 -21 -25 -25 -1 39 9 30 -42 -15 -4 -26 18 36 24 -41 16 11 7 9 -2 7 -17 21 25 -3 19 -66 20 78 30 45 -15 52 57 -9
5325 -9 -20 14 -8 -39 -28 -9 -26 -23 -37 -10 -55 8 24 61 31 -6 -68 49 18 -22 38 -18 -36 -15 -1 1 10 38 -8 44 -18 -18
5357 -18 -22 47 7 -4 -24 -8 -38 16 9 2 5 -2 7 -42 19 -59 18 -5 -8 -27 11 11 4 -6 -49 -30 11 -19 1 -52 -77 -4 5 7 4 -11
5393 -11 8 23 9 -4 -9 -50 29 1 28 -3 -50 23 15 27 4 14 36 1 48 23 16 -40 0 -10 20 -23 26 7 -14 -17 -9 15 -6
5426 -6 23 -55 -44 -28 -25 -18 -7 16 -5 21 -42 -28 12 4 -32 50 16 3 66 4 17 42 10 -12 4 -12 18 17 23 7 -8 -37 -2
5459 -2 -22 -4 2 -42 -63 -35 -24 31 15 -2 -39 -7 30 10 -1 -24 -4 0 22 0 44 27 -16 -1 4 -8 -45 -25 68 0 26 -24
5491 -24 -24 0 -17 23 30 4 -20 30 -23 51 -3 0 33 50 13 4 -1 9 27 2 9 -37 -14 -11 -23 -6 -54 12 -46 -23 -26 40 14 -10
5525 -10 19 6 5 43 13 -10 -34 1 -26 38 -31 -15 -32 7 -30 14 -39 4 -6 -5 -14 22 53 1 14 -13 8 5 5 -9 16 -11 -52
5558 -52 -21 30 20 -39 22 61 -37 -43 -13 -19 -15 13 19 6 13 -57 -12 -1 28 26 -34 5 17 78 -19 9 -25 -30 2 -12 -24 31 0 1
5592 1 -36 77 2 30 18 -32 4 -11 -57 7 47 37 -51 17 20 -25 35 34 -7 46 3 -21 34 -3 18 36 -1 -51 31 -32 15
5623 15 -8 24 17 -10 19 -9 -14 -6 -43 -4 1 8 -24 -48 27 30 30 -22 19 30 -18 8 15 15 2 27 1 53 -53 -10 -26 -21 5 -63 45
5658 45 -30 -31 -10 -11 30 -12 -23 -27 -9 12 -3 -47 15 -41 -65 49 -9 1 13 -31 -30 -2 -3 -16 7 7 -22 22 -66 -19 -10 -22 -25 47
5692 47 11 -1 -20 -14 -43 -11 74 -28 4 11 13 18 14 -41 -19 -5 -29 -7 42 -9 21 25 16 1 1 -7 21 33 -70 -2 9 -35 38 -25
5726 -25 32 5 -13 43 19 20 48 -36 68 22 -21 72 5 -10 -31 -8 33 35 15 7 -20 29 19 -9 17 13 -45 30 -11 39 -42 -31
5758 -31 -47 -35 -20 -20 -23 14 11 -26 -7 49 -23 32 42 -74 -26 -3 -17 -4 17 17 2 6 22 45 22 -28 23 4 1 44 34 10 -1
5791 -1 5 -38 46 -33 -5 2 -8 -4 -43 11 -7 1 -14 -48 -35 21 -18 -16 -7 48 -29 35 -1 -15 36 18 10 50 -9 -34 49 -8 -3 2 1 -6
5827 -6 46 1 -5 20 23 5 19 37 -24 -33 5 -11 -15 20 30 12 33 20 48 -18 50 -32 -1 -3 -8 14 -23 -42 -33 9 -11 -9 -12 29 -34
5862 -34 30 30 18 28 16 -4 62 45 -12 35 -16 90 -22 1 -46 28 -33 -71 5 -22 -3 10 -28 21 20 37 -28 -5 2 -5 10
5893 10 -1 -40 -63 29 -8 9 -10 15 -3 -7 -20 -26 12 14 -60 1 -18 20 1 -36 12 39 20 -19 3 -4 -65 -1 -10 -57 -14 -11 -41
5926 -41 -7 6 -9 8 17 -6 21 -35 -24 -23 -10 3 26 -10 12 -2 -20 7 -8 35 -26 7 22 -26 -9 -4 -5 10 29 9 -35 -11
5958 -11 -21 22 36 -14 -67 12 2 -12 12 -3 -15 10 -21 -21 63 -7 -6 -9 7 -16 13 -14 -18 0 3 -27 2 3 -37 -2 -2 -31 -3 30
5992 30 10 -20 2 -5 -51 0 18 5 55 9 27 14 -12 -40 2 6 -51 17 14 -29 27 -24 -6 38 -12 2 -32 -12 -19 29 10 -68
6024 -68 -14 -15 -27 -18 -32 -27 13 -28 -43 -1 50 -3 -19 21 7 -56 -18 4 4 16 -17 -33 -8 16 14 -19 -24 0 20 -18 -34 -28 -1 -27
6058 -27 -3 -40 11 -11 28 14 17 -15 15 -5 -27 -10 -15 15 28 12 -1 -10 -16 25 48 5 -13 -29 46 -23 0 48 1 11 41 38 56
6091 56 4 -39 26 8 -44 1 -25 -22 18 3 -9 -7 7 28 14 -39 19 8 -25 14 -24 -19 -68 -21 -25 27 -35 -7 48 -7 18 -13
6123 -13 -45 8 15 5 21 3 3 14 -24 21 -47 -33 2 39 5 -28 1 17 2 6 34 7 -37 -25 3 2 -30 6 11 3 -22 -26 24 -6
6157 -6 -55 -3 11 15 -11 50 -26 -7 68 -19 25 4 -2 -5 6 -32 19 42 -26 -7 38 20 39 10 -9 -38 66 -14 11 22 -16 -25
6189 -25 25 -45 -67 -8 -7 41 -16 58 -1 11 20 11 -26 -3 -27 -6 16 -42 -11 -47 24 -53 -12 40 -30 -25 -14 -31 66 -30 -40 16
6221 16 8 -61 32 -15 -62 48 31 -4 -34 38 0 6 -11 23 -26 4 -46 62 27 -14 -6 18 -33 -23 -20 25 27 -34 -32 -6 -18 4
6253 4 37 31 15 -2 -15 -12 -1 -15 -9 -8 20 34 14 60 -11 8 14 -13 -4 2 -49 -42 -23 10 60 -16 -18 43 12 -22 -47 45 0 -45 -4
6288 -4 -5 -17 13 35 28 -6 74 -34 20 56 31 -9 -12 4 -41 37 -11 10 57 -32 20 13 29 -43 -16 12 -14 -10 -9 13 -30 12 -18
6321 -18 15 4 6 14 17 -10 -58 -46 -26 27 55 -15 2 -16 20 13 26 35 31 64 16 -50 14 -23 48 -23 -7 22 69 17 13 24 -20 22
6355 22 -11 32 17 52 19 18 5 20 -55 5 -24 6 -18 31 23 40 27 -33 24 45 -8 46 -18 35 -48 -33 -21 5 16 30 -2
6386 -2 -33 7 6 5 -19 -14 42 -16 34 -24 -29 20 -31 -43 -56 -31 -14 -15 19 24 -39 41 -2 -6 22 3 0 24 -27 70 -16 -15 12 6 55 1
6422 1 24 0 6 -29 9 -9 -49 5 -15 13 37 -20 -9 -31 0 -44 -57 13 6 61 34 28 -5 -15 2 -16 46 9 -39 24 19 10 -36
6455 -36 12 -20 -26 5 -33 29 54 64 -14 0 24 0 -33 9 -41 -25 16 -44 -11 -43 -24 44 -30 -41 -12 14 -23 -11 -15 43 -5
6486 -5 33 -17 -13 -23 -62 -7 62 -18 18 12 9 -16 -44 -6 2 32 -85 -43 29 14 44 -17 -46 24 -5 -20 -17 50 30 44 10 -1 19
6519 19 33 -12 -19 -11 -4 -33 -23 -10 12 -25 31 -11 -33 -51 7 -9 0 25 23 27 -20 -44 15 -21 12 43 -13 -34 39 17 -48 2 9 -7
6553 -7 0 35 -20 -47 2 -33 9 20 -29 35 -9 -1 36 0 27 27 34 -33 -65 49 10 -9 32 -4 -33 -11 -9 18 -19 -11 -32 28 5
6586 5 -4 -13 9 -23 23 -30 12 18 -7 -28 53 -4 -51 12 25 3 -8 -26 2 6 48 36 -19 21 -5 4 6 -4 -9 62 -28 41 1 17
6620 17 14 40 -12 -14 28 31 4 -25 44 0 -23 28 -30 -18 40 26 -33 23 29 40 -34 -20 -26 -16 -14 -3 2 -11 -3 -6 18 -31 5 -7 18
6655 18 6 4 -6 6 -20 -14 1 -1 -28 24 36 -28 36 20 -29 -8 45 7 -7 -5 16 -37 17 27 14 12 -23 -23 -17 -30 4 -7 21 36
6689 36 50 41 17 19 29 -45 -35 41 -21 -4 -23 -1 19 -52 4 -6 -8 -62 18 37 26 30 55 -42 -8 -5 -43 -37 -11 -27 50 -29 32
6722 32 -6 11 44 13 -16 -1 -48 47 32 -8 3 12 -25 11 -11 -39 13 16 -38 6 20 8 4 -17 22 -23 34 49 -15 3 -47 5
6754 5 25 45 23 -14 -25 56 13 -24 -41 -16 -1 -19 -16 11 -39 11 58 -27 9 39 -36 7 12 -9 12 17 -10 -57 26 18 18 2 -10
6787 -10 33 11 31 3 12 -9 -9 -55 19 -19 11 -39 -26 38 23 -16 -5 53 2 13 32 -34 18 15 10 -6 58 13 -14 -36 28 -36
6819 -36 -5 -31 -5 -12 -21 -12 -7 24 -7 -4 -37 37 6 52 -18 -3 -4 -13 46 11 14 10 16 -2 57 -10 10 -50 20 -14 -52 36 -28 78 -49
6854 -49 -25 -46 -32 1 12 29 -27 -20 -14 39 -13 -34 19 -72 -17 17 -19 3 35 5 0 3 13 -7 -19 -20 2 11 -8 8 47 -6 29
6887 29 31 3 2 45 -12 -21 40 -19 16 -16 24 13 -14 52 -14 17 25 -38 16 -28 -71 -20 11 42 57 3 18 -27 -19 45 21 34 -33
6920 -33 7 1 12 42 9 28 3 -4 0 -32 -9 -35 23 45 25 -40 1 43 -2 -2 -43 38 8 -17 -8 8 -40 15 31 -60 -45 -59 22
6953 22 -6 11 1 14 -69 -6 -39 14 -21 -29 -5 -6 26 17 11 66 32 9 16 20 55 1 1 -14 -50 -12 45 6 -39 30 4 -12 -16 9
6987 9 -40 -12 51 25 -37 -8 -9 -34 -12 32 39 48 -10 13 33 -20 27 -10 0 9 37 -27 27 60 -35 6 7 -6 -31 -46 -31 -35 3 6
7021 6 52 -8 4 20 -3 -12 15 19 -48 -7 -29 0 30 -13 25 -12 -15 0 4 -7 -26 -1 14 -32 58 6 11 20 55 3 9 2 -8 41 6
7056 6 -16 50 -19 17 -11 3 -4 27 -12 -13 14 -10 -31 -4 -8 -47 18 -15 7 -4 -17 -10 -58 -37 -16 -17 -21 -32 -20 -2 20 3 -46 5
7090 5 15 -1 72 -29 -10 27 20 -8 20 4 -8 -11 -71 -3 -34 -37 9 0 -19 -45 32 -1 15 -20 -43 -21 -1 58 5 30 26 -4 -11
7123 -11 -36 -21 -16 14 34 12 4 -40 3 -10 -4 28 1 30 104 17 -38 -5 -39 -92 -23 0 -30 -27 5 -50 13 -3 -30 22 11 6 16
7156 16 9 0 36 -62 33 -8 -19 -29 0 39 24 27 59 -2 14 38 15 -35 12 8 -54 -3 14 19 48 -40 -8 46 -17 -23 -3 5 0 35
7190 35 -5 -34 3 -4 -21 1 66 -52 -4 -33 101 -2 21 -32 -30 -2 -36 -10 5 21 -37 -20 7 -10 16 26 -11 29 11 29
7220 29 -17 -5 -9 2 23 11 -35 28 10 21 7 -8 -44 -20 -12 -9 10 18 -13 8 28 -32 4 -81 -6 -27 14 -26 -53 -14 -7 -9 -7 5
7254 5 33 16 -29 19 11 -19 76 45 61 19 21 -14 21 35 -12 4 -45 -28 -9 -24 -6 7 -56 27 25 -26 20 -28 9 41 -32 11
7286 11 -31 6 -15 28 1 -32 8 -9 20 -13 6 -19 -33 -44 -68 -10 6 42 -11 -27 3 -2 -20 -20 68 -9 24 -4 45 8 -21
7317 -21 32 -56 25 14 -23 9 15 24 54 -26 26 -11 -6 52 13 18 52 -21 -32 19 -19 41 2 13 54 -16 -10 -15 -6 21 50 21 48 -21
7351 -21 9 -18 -9 12 -64 24 5 50 -7 -53 -7 -33 34 -38 -8 -11 -44 -1 27 -13 -34 13 -24 18 17 -7 -24 -4 14 0 -17 45
7383 45 -22 -21 6 -31 26 16 10 30 -41 31 -23 -17 -26 20 59 14 -5 9 -10 -3 -23 -22 38 4 -48 -9 -28 -3 -1 -31 -15 -25 8 14
7417 14 2 -33 -7 16 30 7 10 43 29 3 13 17 5 -81 -19 23 -11 40 -24 0 4 -27 -17 -31 -43 44 -11 20 -28 -81 -17 23
7449 23 -25 -6 20 0 54 -5 28 3 -16 58 -44 9 -32 -8 10 28 52 -23 -5 -10 -43 33 -15 1 -33 27 -6 26 9 29
7479 29 -20 -47 -30 -11 16 -19 54 22 -11 15 9 -59 2 -18 20 -42 -38 -17 4 17 -44 -6 -17 -35 3 -43 24 43 -3 22 -45
7510 -45 -40 34 9 -61 -9 23 -3 -37 -8 13 0 2 -5 -5 -4 -9 -19 25 -51 11 -11 -37 -17 -24 30 -35 47 -32 3 7 18 -3 -27 -38
7544 -38 31 29 -19 24 46 -1 11 31 1 -7 10 -14 16 27 62 -37 -42 14 -28 33 3 -35 49 -6 -69 5 -17 20 -22 0 -38 32
7576 32 42 -17 8 -31 25 -10 -13 -56 -32 -6 -21 0 -1 49 -20 -24 11 50 12 7 -34 0 25 -34 31 2 6 -28 -10 11 -16 29 -2
7609 -2 40 -53 38 -15 16 -61 -37 -2 -1 -36 26 -3 33 25 -2 -25 -15 10 -15 2 -4 -28 30 23 8 30 -6 57 12 48 15 41 23
7642 23 19 -9 32 22 -2 2 10 -15 29 5 -15 3 -27 -10 0 7 -9 16 -30 -45 33 50 -31 -27 -37 36 -8 -19 -7 8 22 41 -6
7675 -6 -9 -20 -34 21 -2 19 30 -6 -15 -44 -8 -2 58 9 -56 -39 33 -1 -1 -40 14 -22 -10 23 2 -23 -10 -33 -9 -25 -18 -16 22 -53
7709 -53 28 -23 -9 -32 -8 17 7 -13 -8 31 -47 7 -8 -28 -2 7 1 12 -18 -16 -49 -26 -18 -7 6 6 1 4 -18 -44 5 18 22 -40 -15
7744 -15 -12 13 11 -4 -16 -17 -10 0 -3 -22 -53 -35 11 -21 -33 21 48 11 35 -13 32 21 -10 -31 -37 -4 -7 -31 -20 6 0 36 -6 -70
7778 -70 -39 11 83 -10 -40 -8 -8 11 6 -39 -63 9 -10 1 22 21 -6 -10 -18 20 21 -1 -10 13 -32 60 38 11 -5 11 40 22 -36 53
7812 53 -34 9 -4 24 -33 44 8 25 22 -43 -37 -38 -5 -21 -13 26 7 -3 -3 -20 1 -43 17 -17 -6 30 46 -8 5 8 24 16 -14 -28
7846 -28 -7 28 30 -73 -15 -13 -10 17 48 34 24 53 -17 -21 -9 -23 26 60 -18 27 -29 25 -8 -2 32 17 7 10 30 -62 -7 -16 -37
7879 -37 -19 1 0 40 -41 17 16 -52 -39 -4 -21 23 36 -36 31 19 -4 -8 15 6 13 28 15 -44 -7 -8 -30 -33 -15 45 -11 44 -23 17
7913 17 -13 -52 -44 -6 -12 -41 36 -14 -18 -6 5 16 -28 17 -7 -35 42 -11 -34 -3 -27 -43 -9 55 40 -6 -24 56 -45 6 7 25
7945 25 -12 -22 36 44 7 20 -17 -33 -38 18 23 7 45 -22 -25 -4 19 -27 -19 9 -2 -50 -5 -51 -12 26 6 47 47 12 34 -21 6
7978 6 -17 -4 -9 -33 -16 -19 3 16 2 14 -23 10 -52 14 45 -6 -10 10 -53 -16 -14 1 -1 14 15 -45 20 43 0 0 19 2 7 1 -35
8013 -35 -13 62 -3 -10 -45 7 -6 22 45 -21 33 -14 -34 46 27 5 33 -3 -32 28 5 -9 -5 35 14 10 1 -26 1 7 60 -34 -11
8046 -11 -19 10 44 -5 20 30 33 -21 -8 -8 -17 54 -33 1 -7 -26 -21 44 22 -42 -1 34 9 -54 44 45 9 5 3 -35 37 6 -34 27 -7
8081 -7 23 6 -6 14 30 32 18 7 21 63 -10 -11 -35 -9 21 -22 -75 33 11 37 14 21 -2 35 11 -27 0 -50 12 39 -50 -6
8113 -6 -28 -49 16 3 16 -44 1 7 7 -31 -5 15 17 -52 40 22 3 19 36 50 49 -23 -14 12 -35 4 9 -3 -13 30 -23 -35 -8 40
8147 40 18 -25 -75 10 -73 58 42 30 -22 -41 5 17 -3 -68 -29 20 -73 -7 6 -7 -5 -15 -7 -3 -1 18 47 3 28 -12 -5 -37
8179 -37 -25 -32 29 -18 -41 -15 -11 8 -3 17 -20 1
8191A
$$ Imaginary data points
##PAGE= N=2
##DATA TABLE= (X++(I..I)), XYDATA
0 0 0 0 0 0 0 0 0 0 0 0 0 0 -8 8 -8 8 -16 16 -16 24 -31 32 -40 48 -56 64 -78 88 -104 120 -136 156 -177 201
34 201 -227 256 -288 324 -362 404 -449 501 -557 617 -683 755 -833 919 -1013 1116 -1229 1353
52 1353 -1490 1645 -1815 2007 -2223 2469 -2754 3085 -3478 3952 -4535 5276 -6253 7594 -9575
67 -9575 12798 -19134 56744 -232694 -77648 262792 -148785 -91868 225223 -64331 -179549
78 -179549 152359 30252 -97029 79981 -9450 -102922 91226 30598 -72902 44914 -7635
89 -7635 -72960 79754 31522 -71846 20480 -3238 -36943 80340 -4560 -84102 59520 6344
101 6344 -76040 99455 29386 -145461 49530 96512 -100566 16881 84165 -109736 -12870
112 -12870 119252 -56233 -41644 71047 -59325 -24947 106901 -42991 -70552 75493 -17879
123 -17879 -51026 87292 -8848 -89789 52697 29644 -48368 39456 3006 -64075 42333
134 42333 30722 -47086 29507 8128 -64405 44823 49461 -66510 3326 41215 -50445 12190
146 12190 57935 -51872 -23118 48020 -24441 -6023 47004 -42225 -30516 57964 -11831 -32102
158 -32102 45260 -16984 -47201 52630 17977 -51402 18425 16901 -36095 23678 26619 -39391
170 -39391 67 23316 -19815 10840 19845 -34286 -1994 30318 -16566 -2888 20996 -25307
182 -25307 -8464 32279 -10250 -15141 17651 -13719 -9436 29996 -8943 -22527 21071 -3645
194 -3645 -17355 27811 -528 -32664 18989 15065 -23611 12631 12697 -28908 6960 24565 -18987
207 -18987 -3097 16263 -17757 -1101 23804 -13931 -11908 17073 -7865 -7433 19279 -7860 -16021
220 -16021 15190 872 -10534 12311 -2991 -14392 13147 4243 -12062 8879 721 -13620
232 -13620 12235 7361 -15316 5660 7341 -13366 7073 11127 -15394 -10 12430 -10332 -340
245 -340 12124 -11596 -4856 13997 -6032 -6551 10860 -5963 -7990 12338 -1218 -9792 8157
258 8157 338 -8370 8306 2422 -9836 4604 4208 -6854 4074 4116 -7423 2183 5419 -5204
272 -5204 1001 3868 -5547 789 5139 -4602 -631 4236 -4373 -644 5193 -4126 -2548 4895 -2806
287 -2806 -2571 5217 -2072 -3969 4934 -224 -4131 4044 599 -4427 3500 2139 -4188 2128 2625 -3737
303 -3737 1165 3021 -3349 -127 3054 -2350 -694 2727 -1839 -1285 2374 -1139 -1557 1815 -901 -1534
319 -1534 1638 -512 -1395 1459 -303 -1211 1552 -11 -1184 1646 72 -1441 1594 451 -1464 1489
335 1489 750 -1681 1201 1084 -1890 644 1175 -1968 291 1585 -1965 -338 1792 -1507 -762 1626
351 1626 -1322 -1221 1784 -503 -1194 1419 -152 -969 1484 144 -1186 922 270 -557 1145 224 -836
368 -836 922 274 -597 945 -363 -1287 1124 321 -1180 821 -56 -1624 1098 798 -1928 159 611
385 611 -1573 822 1304 -1927 -66 1643 -1013 258 1587 -1683 -596 2251 -324 -530 1341 -1104
401 -1104 -605 2260 -280 -1294 1037 -770 -809 2118 -583 -2230 1160 -94 -1174 1942 -467 -2819
417 -2819 1442 1015 -1711 1385 205 -2904 1688 2283 -2153 394 1337 -2415 1109 3035 -2371 -858
433 -858 2214 -1471 329 2916 -2527 -1850 2635 -829 -950 2286 -2137 -2306 3137 62 -1893 1671
449 1671 -1544 -2202 3419 235 -2875 2002 -318 -2388 4029 1051 -4410 1884 1917 -3039 2682 2174
465 2174 -4807 945 3586 -2874 811 2504 -4613 26 4609 -2894 -1225 3177 -3513 -1105 5042
480 5042 -2258 -2981 3254 -1850 -1562 4692 -1844 -3566 3982 -601 -2458 4854 -1088 -5001 4633 1533
496 1533 -4185 3536 767 -5412 3494 3169 -4848 1708 2201 -5446 2322 4419 -5741 -353 4460
511 4460 -4527 -402 5601 -4097 -2949 4912 -1579 -1986 4151 -2340 -2724 4472 -825 -2053 4241 -2004
527 -2004 -3559 5243 400 -4301 3401 457 -4204 3517 1934 -4108 1470 793 -3334 2998 1244
542 1244 -4956 2123 2278 -4832 2391 3881 -6114 -428 5530 -3364 -1324 4740 -3055 -2446 5121 -700
558 -700 -2352 3407 -1916 -2466 4976 -310 -4013 3421 167 -3991 4012 1842 -5247 1120 2542 -3243
574 -3243 1479 2144 -4460 200 3328 -2610 341 2704 -4255 -716 5232 -1844 -2336 3366 -1808 -2210
590 -2210 4773 119 -3585 2013 163 -1683 3512 -221 -4029 2313 1246 -2663 2906 783 -5398
605 -5398 1700 3757 -3483 102 2224 -4256 290 4887 -2711 -1937 2791 -2550 -351 5059 -2490
620 -2490 -3473 3876 -503 -1773 4566 -1269 -4831 3753 1788 -3081 2534 -119 -4605 3331 2954 -4057
636 -4057 840 1015 -4245 2648 3712 -4896 -749 3044 -2987 1208 3979 -4607 -1773 4322 -1654
651 -1654 -188 3652 -4063 -1941 5734 -1145 -2326 3856 -2848 -3138 6388 30 -5178 3262 11
666 11 -3953 4968 1438 -6347 1767 2685 -3733 2569 2146 -6006 834 4468 -3234 369 2721 -4731
682 -4731 311 5476 -2767 -1645 3245 -2934 -402 5457 -2411 -3251 3683 -1196 -1649 4610 -1943 -4526
698 -4526 3912 835 -3052 3104 -467 -4738 3226 2320 -3683 1174 735 -3566 2632 2702 -3761 464
714 464 1886 -2869 1957 2984 -4252 -356 3676 -2266 125 3431 -3417 -1654 4378 -1060 -2055 2714
730 2714 -1818 -2199 3885 -157 -3186 2004 -252 -2376 3009 357 -3799 1519 1404 -2293 1784 1074
746 1074 -3445 1020 2468 -2081 502 1622 -2683 606 3019 -1990 -750 2081 -1639 -313 2778
761 2778 -1583 -1708 2011 -636 -894 2076 -1169 -1926 2048 -71 -1435 1577 -721 -1995 2123 578
777 578 -2016 1225 388 -1758 1784 1244 -2285 556 1243 -1446 998 1423 -2125 133 1871 -1314
793 -1314 59 1394 -1942 -432 2035 -1114 -910 1465 -1167 -885 2061 -610 -1605 1302 -302 -1089
809 -1089 1744 -44 -1646 1236 551 -1114 1169 415 -1519 890 1012 -1019 601 518 -1351 562
825 562 1035 -1225 26 651 -1323 192 1290 -1236 -524 1032 -910 -369 1322 -743 -1007 1091 -68
842 -68 -599 1026 -153 -1066 900 532 -648 568 228 -847 606 754 -634 -7 362 -574 206 647
860 647 -545 -449 200 -282 26 420 -443 -553 297 23 -82 223 -316 -453 406 363 -50 82 -164 -116 485
881 485 402 -224 -70 50 -98 457 438 -487 -332 341 16 -5 262 -570 -639 490 240 -446 60 -131 -580
902 -580 466 563 -720 -414 347 -111 216 604 -369 -450 602 318 -2 259 -413 -297 727 267 -408 92
922 92 -299 -341 768 199 -837 -92 13 -220 530 37 -1056 -38 551 -206 217 129 -947 55 1060
941 1060 -108 -297 244 -427 180 1084 -216 -637 232 -67 134 926 -486 -1029 514 391 -320 455 -372
960 -372 -1228 555 866 -683 -273 -5 -760 609 1121 -869 -703 547 -164 240 1052 -786 -1014 1036
978 1036 680 -189 401 -473 -753 944 731 -602 -205 -338 -393 1080 424 -1262 -407 176 -260 731 317
997 317 -1467 -493 942 103 218 92 -1256 -83 1527 -72 -446 335 -826 -23 1928 -13 -1456
1014 -1456 345 257 -143 1126 -56 -1648 211 943 -75 356 -434 -1535 500 1232 -547 -396 -223
1031 -223 -1048 657 1543 -780 -1043 249 -57 697 1092 -1008 -1064 733 485 416 643 -1139 -1008 1310
1049 1310 832 -462 -70 -744 -692 1334 820 -1060 -630 -226 -102 1173 336 -1487 -595 590 296 689
1067 689 63 -1409 -317 1294 583 -64 -369 -977 219 1594 339 -803 -406 -303 360 1364 -80
1084 -80 -1501 -438 644 495 402 -398 -1304 -283 1090 526 -333 -711 -804 308 1387 160 -1079 -396
1102 -396 148 408 1063 50 -1357 -302 1038 642 252 -481 -1106 258 1244 153 -338 -516 -1003 629
1120 629 1587 -625 -1361 89 -116 243 1256 -599 -1762 363 870 180 467 -712 -1310 970 1200
1137 1200 -362 40 -474 -988 1347 1424 -1136 -565 230 -485 979 1175 -1588 -947 917 -138 385 778
1155 778 -1643 -1030 1587 245 -569 359 -1047 -711 1778 417 -1155 155 -405 -227 1761 145 -1616
1172 -1616 347 493 -281 1290 115 -1858 342 1216 -321 357 -158 -1483 510 1342 -680 -240 39
1189 39 -1137 583 1462 -1052 -911 514 -475 317 1217 -931 -1015 901 281 143 697 -991 -784 1214
1207 1214 389 -401 365 -684 -603 1325 361 -905 3 -319 -384 1106 69 -1166 96 159 -321 900
1225 900 -4 -1371 315 803 -430 375 207 -1171 287 1252 -340 -210 330 -695 214 1182 -410
1242 -410 -646 353 -202 73 819 -483 -771 452 114 -83 377 -471 -651 569 294 -332 59 -276 -425
1261 -425 562 430 -354 -11 26 -134 575 305 -422 -25 240 15 386 192 -511 -37 366 -25 81 2 -395
1282 -395 -63 299 -15 -168 -105 -307 88 275 -140 -154 -31 -204 171 406 -163 -172 214 -13 82 402 -166 -278
1304 -278 331 97 -140 289 -22 -434 222 235 -307 77 14 -384 73 247 -332 -209 170 -283 -33 272 -194
1325 -194 -221 140 -3 -73 205 -52 -159 234 113 -26 168 17 -142 182 79 -182 113 81 -215 129 136 -285
1347 -285 -29 106 -268 -26 247 -190 -161 177 -99 -127 221 -17 -112 152 34 0 216 -56 25 222 33 -21
1369 -21 184 -19 -149 175 57 -132 24 -50 -92 20 -101 -127 13 -221 -129 219 -62 -241 166 17 -271 273
1391 273 141 -265 176 156 -159 244 185 -244 173 245 -258 204 315 -435 33 448 -306 -142 321 -364 -316
1412 -316 422 -159 -404 185 -144 -357 311 108 -431 97 150 -218 107 246 -307 24 245 30 137 81 -149
1433 -149 118 194 -36 186 15 -255 92 206 -39 -83 -64 -205 141 105 -210 -24 -73 -311 196 286 -424 -151
1455 -151 282 -180 27 407 -257 -359 341 158 -40 155 -158 -243 308 250 -250 34 -148 -321 355 291 -362
1476 -362 -226 75 -56 138 117 -270 -355 -8 220 268 -107 -298 11 175 126 264 -118 -393 128 430 50
1497 50 -68 -89 -291 197 464 -144 -318 -85 -130 60 403 -161 -629 7 264 -22 118 -174 -489 53 347
1518 347 207 -93 -313 -238 326 400 -68 -110 -109 -78 402 457 -229 -362 36 192 286 173 -363 -356 152 199 66 -65
1542 -65 -476 -266 354 259 -202 -261 -206 -77 407 232 -336 -290 13 142 439 79 -441 -71 266 175 265 2
1564 2 -530 -29 477 144 -93 -109 -347 49 501 -15 -382 -113 -225 79 445 -200 -527 50 50 41 297 -135
1586 -135 -467 261 365 -24 135 -186 -365 386 438 -212 -24 -9 -275 367 438 -399 -240 109 -107 156 162 -485
1608 -485 -241 296 -35 30 71 -407 -205 464 77 -171 112 -230 -74 492 40 -289 127 -4 7 409 -24
1629 -24 -377 135 176 -86 232 -93 -430 120 217 -179 -21 -106 -302 171 204 -243 -78 -5 -152 281 233 -331
1651 -331 -29 229 -97 274 269 -337 -22 373 -43 -69 173 -195 -132 369 -61 -209 53 -99 -63 165 -158 -260
1673 -260 49 -94 -38 173 -136 -228 122 103 -58 107 -82 -91 216 117 -13 124 -81 -48 284 24 -170 55
1695 55 42 -20 130 -70 -174 -15 5 -24 111 -205 -162 128 -41 -203 174 -123 -303 304 160 -278 18 63
1717 63 -233 259 192 -304 140 195 -180 214 156 -373 79 326 -254 78 160 -404 40 333 -250 -176 118 -285
1739 -285 -7 370 -284 -226 296 -164 -83 422 -201 -293 391 16 -161 320 -187 -247 412 46 -258 288 -73
1760 -73 -330 458 123 -530 215 117 -410 264 181 -535 -20 269 -304 129 189 -428 35 403 -218 9 298
1781 298 -337 59 497 -181 -134 256 -212 -39 510 -170 -255 351 -80 -201 355 -238 -417 406 25 -354 287
1802 287 -92 -451 267 183 -419 93 116 -321 246 246 -341 -13 260 -158 218 302 -350 -2 388 -154 -9 321
1824 321 -274 -112 336 -157 -175 183 -184 -189 314 -123 -323 153 -27 -295 263 91 -348 82 208 -166 161
1845 161 96 -210 37 205 -47 22 161 -157 100 273 -107 -64 122 -130 -79 231 -67 -174 61 -10 -78 107
1867 107 -29 -166 60 34 -56 87 -38 -168 97 116 -91 17 66 -117 58 211 -70 -20 131 -105 28 163
1889 163 -97 -78 198 -57 -117 164 -93 -188 238 53 -209 131 60 -278 57 151 -219 29 136 -159 32 217
1911 217 -176 -16 219 -76 -31 253 -105 -110 234 -53 -119 227 -89 -245 208 -6 -268 151 -11 -187 98
1932 98 7 -269 167 28 -227 178 82 -309 84 244 -274 95 297 -167 1 310 -193 -34 196 -106 18
1953 18 177 -136 -134 191 -159 -158 212 -145 -191 266 -95 -286 188 -29 -245 184 8 -281 115 71 -209 221
1975 221 74 -307 158 247 -214 142 162 -281 160 309 -160 -77 71 -116 49 236 -265 -130 137 -196 23
1996 23 258 -322 -199 296 -16 -76 253 -129 -231 294 88 -154 154 -144 -149 379 94 -257 137 10 -215
2017 -215 277 216 -399 1 206 -101 128 94 -384 -15 230 -94 54 59 -377 17 308 -115 -92 45 -162 11
2039 11 371 -63 -184 85 -57 122 343 -128 -241 205 72 -26 213 -280 -304 225 147 -132 44 -204 -245 230
2061 230 187 -246 -51 -140 -210 292 239 -294 -61 126 -4 242 178 -303 -50 289 82 165 48 -292 43 349
2083 349 -44 -67 34 -293 22 403 -55 -262 -17 -106 0 274 -104 -353 39 79 116 193 -202 -332 207 200
2105 200 -8 113 -104 -236 249 269 -49 -26 -126 -138 267 215 -219 -74 -20 -69 255 114 -451 -146 177 -14
2127 -14 -4 36 -264 -138 253 140 -55 -108 -247 74 329 -35 -154 -1 -60 136 305 4 -234 22 126 108
2149 108 154 -181 -217 76 117 65 68 -216 -236 217 158 -148 -29 -39 -147 131 219 -147 -173 15 122 214 41 -237
2173 -237 -73 146 54 110 54 -178 -132 294 98 -178 -130 -96 0 117 112 -106 -211 -35 171 140 -146 -180 -24 -18
2197 -18 94 124 -85 -168 61 200 88 -29 -117 -14 144 124 -35 -70 -105 15 216 64 -131 -144 -53 71 141
2220 141 -36 -154 -110 -12 89 79 -89 -166 29 74 67 46 -70 -99 85 182 83 -91 -63 52 170 72 -76 -51 -62
2245 -62 -32 198 70 -163 -97 72 -1 14 14 -151 -71 80 22 -34 -41 -161 -50 181 70 -106 -26 -24 30 150 36
2270 36 -46 -6 46 136 77 -62 -49 118 15 22 71 -73 -182 113 44 -74 -30 -23 -118 90 60 -99 28 -17 -18 95
2296 95 40 -208 22 175 -60 60 130 -89 -49 108 -5 -6 92 -62 -73 76 8 -159 69 -48 -94 156 -2
2319 -2 -182 92 21 -110 13 67 -173 -4 183 -108 -53 108 -65 61 99 -88 -49 68 -39 -43 98 -81 -124
2342 -124 131 -43 -123 84 -36 -127 120 -11 -210 61 6 -142 106 62 -150 82 64 -156 64 172 -148 63
2364 63 152 -127 -29 176 -142 47 207 -80 -60 155 -86 -82 259 -131 -143 162 -73 -166 158 -53 -215 177 -21
2387 -21 -177 127 -59 -180 110 61 -191 93 78 -169 96 156 -179 64 115 -135 72 132 -176 -11 135 -143
2409 -143 -31 133 -149 -28 147 -113 -83 152 -122 -93 195 -95 -70 183 -30 -214 199 33 -179 184 62
2430 62 -158 137 68 -192 86 132 -170 39 84 -172 22 107 -163 -59 79 -137 -35 85 -109 -46 97 -76
2452 -76 9 117 -150 26 151 -39 -73 129 -50 -36 174 14 -112 82 62 -144 152 8 -151 88 -9 -163
2474 -163 58 -2 -192 12 27 -151 -1 86 -98 -68 88 -119 -49 80 -19 -36 123 9 -10 91 20 4 143
2497 143 -11 -84 88 9 -65 102 30 -117 21 9 -47 -48 42 -120 -62 29 -51 -48 -14 -22 23 65 -39 -36 87 -96 -61
2524 -61 53 27 -53 43 5 0 132 35 -62 81 31 -31 77 -51 -143 49 128 -75 20 -7 -165 27 153 -86 -140
2549 -140 47 -24 -28 138 -88 -78 88 38 -106 124 -91 -53 111 86 -11 -2 -22 -85 117 93 -47 -69 46 -38 132
2574 132 59 -221 -51 14 -19 78 59 -106 -69 150 11 -48 47 -135 20 191 43 -13 64 -35 -12 214 -14 -202
2598 -202 34 -41 -91 158 -45 -204 42 10 -66 65 -105 -220 92 199 -67 -61 -99 -129 144 130 -83 -66 9 18
2622 18 168 163 -148 -117 118 15 84 108 -160 -110 183 63 -63 59 -190 -66 166 31 -94 -25 -96 -101 200 35
2646 35 -222 3 62 -50 141 67 -163 -55 147 81 76 -40 -148 116 242 0 -65 -14 -128 7 277 -18 -149
2669 -149 -1 -51 27 184 -112 -189 18 34 41 110 -143 -168 107 144 -95 -7 -33 -117 163 187 -108 -20 -40 -4 195
2694 195 108 -140 -36 85 -50 147 94 -199 -91 163 -39 -44 9 -185 -71 149 17 -127 -13 -104 -13 220
2716 220 50 -159 6 -2 -30 165 89 -155 62 141 -86 31 -55 -149 64 123 -39 -35 -15 -105 33 169 -119 -133
2740 -133 18 -36 -14 146 -95 -165 37 61 -26 95 15 -174 124 69 -70 35 -9 -89 74 109 -190 -10 73 -126
2764 -126 106 99 -238 -92 80 -62 -88 21 -172 -90 136 -48 -25 56 -108 -24 145 21 -103 82 -34 -87 159
2787 159 48 -164 71 73 -101 146 74 -189 10 137 -94 -23 84 -175 19 126 -99 -135 78 -73 -17 149
2809 149 -92 -50 96 -24 -24 125 -50 -193 150 89 -87 128 8 -114 124 71 -121 27 19 -131 74 115 -129
2832 -129 10 69 -85 48 96 -144 -63 84 -16 -27 72 -136 -43 67 -44 -45 97 -38 -7 114 1 -109 29
2855 29 49 -99 90 -7 -156 8 91 -61 4 43 -89 -46 83 -72 -45 46 -36 48 113 -52 -41 65 -12 3 99
2880 99 -14 -93 62 73 -17 26 86 -76 12 67 -100 -18 37 -25 27 53 -81 -8 58 -65 -45 114 -71 -78 58 -22
2906 -22 -45 115 -42 -70 84 12 -57 130 36 -73 154 65 -79 39 103 -75 77 134 -90 -7 73 -164 -45 105
2930 105 -160 -74 69 -44 -55 77 -67 -71 134 -50 -125 147 -45 -76 160 -48 -53 132 95 -47 119 5 -116
2953 -116 73 86 -130 92 90 -154 -6 64 -112 55 106 -127 6 141 -90 -86 99 -134 -29 92 -89 -100 59
2976 59 -49 -77 95 -49 -122 123 12 -82 126 20 -142 95 59 -84 48 -30 -87 24 100 -95 -25 49 -82
2999 -82 51 38 -81 -48 83 -102 -12 75 -67 -37 101 53 -99 44 -12 -32 113 2 -56 84 -34 -34 45 9 1
3024 1 18 -13 -101 31 16 -92 -17 46 -47 20 -21 -68 27 67 0 5 46 -38 1 81 30 -65 31 18 25 3 6 -52 61 -8 -45
3055 -45 29 -53 -62 0 30 -77 -7 -8 -27 5 24 -50 -3 20 1 15 33 -12 -27 50 33 19 4 -44 -4 69 21 4 -6 -7 -37
3086 -37 -1 -14 -19 -29 1 -34 6 -4 -31 3 -4 -6 46 -92 20 -20 26 36 -17 -35 5 16 -21 -11 -14 42 28 24 28 -10 20 14 37
3119 37 8 18 49 14 22 41 -36 -13 32 51 -10 99 12 -33 3 79 -32 -21 41 -75 20 45 4 -3 -7 66 13 -13 33 -49
3149 -49 35 -23 11 -1 -20 -82 95 6 -83 42 -13 -21 71 -38 -27 95 47 -24 55 -18 0 -10 59 -17 23 53 -43 22 53
3178 53 -28 14 -11 -82 46 42 -52 -62 19 -72 25 27 -23 -56 44 59 -11 5 0 -17 16 36 53 20 29 31 61 63 68 39 -51 -20 35
3211 35 -25 -88 -6 -16 -7 17 -30 -34 15 0 -22 -22 -38 -15 -28 45 -46 -38 -19 -49 -2 1 8 -12 -39 -22 89 19 -1 26 49 20 94
3244 94 20 -14 -11 -21 -17 -14 -8 -49 -2 8 25 -8 -62 -37 4 32 22 -18 -7 -29 38 36 -59 -30 65 18 -15 13 -59 -31 38 -4 -49
3277 -49 4 -5 -27 39 -5 -27 -37 -36 6 38 -24 -67 23 50 -12 19 -32 19 29 35 2 -31 35 -82 41 39 38 -58 49 26 -21
3308 -21 70 17 -38 24 -9 -67 51 -9 -91 39 -3 -65 26 -13 -67 49 49 -57 -46 34 -60 66 80 -11 23 31 -49 74
3336 74 29 -52 61 15 -28 -29 33 -29 -9 33 13 -77 8 -34 -43 63 -29 -67 -15 35 -39 11 10 -106 -7 10 -51 26 -2 15
3366 15 84 39 -20 -42 42 -33 38 71 -4 15 33 -39 20 68 -35 -51 22 2 -29 37 -50 -25 52 -1 -48 45 -64 -53 82
3395 82 26 -78 55 -57 -41 39 -14 -36 9 47 -52 41 38 -57 -60 57 -3 19 -10 -20 -19 50 -55 -40 27 -59 -19 104 -58
3424 -58 34 58 4 13 16 -22 13 20 76 3 93 -25 -27 79 -2 -36 5 -38 38 17 24 -17 -40 37 15 25 -4 -65 -7 -11 -40 45
3456 45 12 -79 21 17 21 44 -17 -39 80 56 48 6 -32 -76 -12 23 -70 -25 50 -2 -35 2 -70 -36 9 -11 -44 18 -31 -2 14
3487 14 -27 37 11 -66 -39 31 2 -70 24 -3 -17 15 50 -31 -20 -12 -12 19 32 -39 65 -46 -23 11 -45 -43 -17 10 -9 -10 -23
3518 -23 -49 -18 -7 -45 -3 28 -16 12 24 -14 -37 2 3 -35 18 -56 18 47 -46 21 1 -13 -8 46 37 -8 11 -1 27 -49 15 28
3550 28 12 -5 -78 63 40 -15 14 -46 10 63 23 -48 38 1 -41 45 -24 -66 -53 17 -31 -25 -13 -79 -58 26 -9 -54 -15 -25
3580 -25 -21 37 -51 -40 45 33 -31 13 -30 -26 19 26 -37 6 20 -5 -19 41 9 -104 -12 -46 -4 12 -6 44 22 19 42 -31 2 -17
3612 -17 -30 35 -24 -14 -82 -26 36 -21 21 -9 2 6 33 7 -49 -11 8 -14 72 15 -69 18 12 -9 17 -17 -18 -12 -3 -29 6 -5 -26
3645 -26 1 1 15 30 4 -35 -13 63 3 -9 18 -49 38 26 -33 -69 13 10 -5 -25 59 -31 56 30 -29 -4 0 -40 39 49 3 6
3677 6 21 46 90 45 4 0 23 19 -39 21 -12 17 14 31 -40 -15 -5 -45 15 1 -22 -20 -9 14 51 -8 23 33 9 14 13 -22 4 -18
3711 -18 28 4 -19 18 -44 4 6 23 29 -3 -22 27 -2 -38 -5 0 -2 -3 1 -56 -13 51 49 27 27 -52 -11 17 -22 -22 -8 26 -16 -5 0
3746 0 63 -28 1 26 50 5 18 8 -44 24 11 -8 19 1 -11 49 36 -16 7 -22 20 36 -31 -32 -14 -16 -33 11 0 -58 -22 42
3778 42 -17 -34 1 9 -8 36 14 -2 13 -54 -28 11 17 -13 13 42 -36 -24 -10 -56 23 66 -13 56 30 -19 2 50 -11 -9 -5 5
3810 5 -44 18 -6 -13 40 -45 -10 -6 -9 -26 28 18 36 60 -32 -26 35 -21 -29 1 -28 -55 63 20 -92 50 16 -14 48 31 -77
3841 -77 -48 50 -41 3 72 -35 59 -17 -45 -16 18 -44 -38 80 15 -27 34 -14 4 30 -80 -27 45 10 -3 51 -2 -58 54
3870 54 -52 -17 5 30 -12 63 24 -8 52 15 -72 19 11 -61 14 21 -23 10 50 -29 16 -66 -66 -19 15 33 66 -29 -20 -2 -1 7 -4
3903 -4 25 1 -56 -6 -63 -23 41 -34 -24 12 -11 -31 82 23 -20 -5 72 5 75 -3 -49 -12 97 31 -20 7 -23 -15 -15 6 -37
3934 -37 2 5 -11 -15 -1 -2 -38 9 -3 -60 16 -33 -55 -34 42 -4 -32 22 1 24 -26 -19 -22 -12 -63 23 16 -4 -22 -27 5 7 26 0
3968 0 16 23 -9 -3 42 -21 24 73 -32 -36 21 11 2 18 -29 -35 20 -1 2 60 51 -33 -4 14 -59 -15 59 -27 13 4 -6 16 38 -79
4002 -79 -8 34 44 -20 46 41 -62 31 26 -24 22 13 -42 66 18 -39 32 -3 11 41 -66 -16 14 -33 -34 -15 26 -25 -24 55 -42
4033 -42 -29 53 -15 32 2 -28 -54 45 1 -13 62 -33 -35 4 10 -41 55 -39 -1 59 -7 32 84 50 -20 48 36 3 19 -4 -59
4064 -59 10 8 -40 12 53 -44 -40 44 -20 -12 -22 -26 -14 32 11 23 -19 -54 6 17 9 -76 9 -33 -49 -2 17 17 23 13 24 54 47 28
4098 28 18 45 -8 -21 58 -35 -9 37 -13 -33 8 17 -42 11 37 -11 0 -33 -27 13 27 -46 43 -21 12 28 -30 -29 43 27 12 -15
4130 -15 -15 -44 19 -30 -23 30 5 -25 51 7 -6 26 58 39 -4 -26 27 30 46 18 4 15 -25 1 -13 0 22 -7 -11 -56 6 -41
4162 -41 3 -14 13 -12 9 17 10 8 7 -1 9 53 17 5 -33 31 -20 12 20 4 -10 10 2 44 -7 -32 49 9 18 -24 -57 -38 -16 -66
4196 -66 -34 30 -15 29 19 8 12 8 11 24 16 -21 -15 -13 -40 51 55 -6 41 28 -26 -27 10 -82 -17 45 28 -18 36 -31 31 30 26 -73 -22
4231 -22 62 -5 -41 -64 -22 -4 -16 29 9 -35 -60 -12 14 -6 -28 11 23 34 -34 -9 -9 8 13 -3 40 6 91 -5 -21 23 11
4262 11 -14 9 38 22 -11 18 -16 -16 45 24 42 5 39 18 10 21 -33 41 3 -4 58 -46 -21 -34 10 1 31 -25 -15 -9 23 -55
4294 -55 -25 4 -52 -22 80 18 -9 83 17 8 40 7 37 38 33 13 42 -4 -20 27 13 -27 29 -19 -24 40 -8 -18 3 15 -18 50
4326 50 -47 -23 10 -29 10 0 -8 -4 -25 -59 12 -8 -5 49 15 16 7 -21 10 10 -2 18 -4 33 -7 -49 -22 -20 7 -56 20 -14 -58 38
4360 38 -30 2 21 -18 7 -74 35 17 38 10 20 -7 -29 0 -25 -14 -63 19 -27 0 -3 1 -44 11 -2 -2 14 0 3 -2 13 -16
4392 -16 38 -26 18 16 42 42 37 -4 0 0 -10 -50 -29 -25 -53 25 -16 -60 -8 66 23 1 -18 -11 6 26 -31 -4 -27 -11 6 0 15 -29
4426 -29 27 -13 -33 31 -45 -34 -7 -3 -1 9 -1 41 3 14 17 -8 20 -2 -18 -27 -7 -16 35 -11 5 -9 -26 -8 28 12 12 -2 -29
4459 -29 9 -15 15 27 25 43 25 34 -2 2 36 23 35 87 40 -25 13 -13 -13 26 17 -20 20 33 -35 38 57 -28 -7 -15 -28 -34 -45 -9
4493 -9 14 -13 -57 4 -38 11 -22 -61 61 -26 -31 18 -13 19 -60 1 -84 -5 48 0 -23 -16 -7 -5 31 15 23 13 3 10 -25 32 -22
4526 -22 -28 65 5 3 -6 28 7 1 53 -4 15 -33 -9 -43 -7 -47 7 -14 -7 5 -32 -27 -36 -7 -3 45 12 -24 14 -21 93 2 4 27
4560 27 -9 -4 -13 -19 -3 -35 -37 -1 24 -42 43 16 -27 -13 22 28 -34 -18 -7 -9 -20 -4 -51 -2 22 -39 -30 38 -9 55 7 16 -15 3
4594 3 -21 14 48 0 32 40 15 22 35 -37 43 9 -48 -24 -10 -32 -19 61 25 -22 -24 -20 -42 4 -42 -1 -20 13 -4 8 2 16 12 6
4628 6 -22 42 13 -18 -22 0 -46 -18 -110 -4 -34 13 -1 -34 45 -8 10 -32 21 0 7 3 1 -21 42 27 34 15 15 36 15 3 16
4661 16 -12 16 -26 7 43 -61 -64 -36 30 15 3 -12 7 45 0 -18 -33 16 2 -11 -6 27 16 9 -20 54 26 16 42 14 -33
4692 -33 0 42 -13 -16 -20 0 20 2 -38 -20 -36 -20 -37 11 -2 -22 -30 -24 -35 33 -66 -9 -12 20 33 -11 2 25 21 -5 73 15 8 10
4726 10 15 18 -39 -35 36 3 44 -3 -31 -16 12 4 13 18 -36 -39 29 -21 22 -32 14 -31 15 -9 -14 65 9 65 -20 30 -8 -40 19 -33
4760 -33 63 1 -26 -13 -55 -53 -5 -36 -25 4 11 -37 44 16 -38 -19 -32 -47 -10 12 21 -55 -30 -21 39 -56 29 4 -31 -35 -69 -2 -7
4793 -7 -22 4 10 42 -17 5 29 7 -9 -16 2 -30 -11 50 -5 -18 6 -2 31 -111 54 -23 44 -4 -13 36 -19 1 13 27 -23 -32
4825 -32 -41 -33 -33 -10 -32 -31 19 -7 -61 -16 -24 26 -17 20 -42 -58 26 25 28 15 14 -36 -26 25 9 50 14 0 -5 47 30 7 0 -7 -39 4
4861 4 -5 11 -1 2 -5 16 -39 -56 -41 8 3 -4 13 -63 8 5 -33 14 22 2 -7 62 11 -10 35 -27 -56 24 -6 -75 -11 -40 -11 36 69
4896 69 -32 36 -26 12 18 -13 -17 -8 51 11 -4 6 4 35 -5 -56 24 -25 -26 38 22 -42 -19 -4 -83 -21 2 -25 10 -12 -14 -29 -7
4929 -7 -25 42 23 -35 39 38 26 3 9 23 36 37 35 -9 86 21 -28 11 -13 5 -2 -42 -70 55 39 -62 -42 -3 -74 -35 62 -29
4961 -29 5 -7 23 -22 8 12 -5 -9 -19 -41 50 -2 -11 24 -15 11 23 -27 -23 35 35 -25 -28 -18 -17 26 19 41 30 38 43 -5 9 -50 39
4996 39 -21 4 -47 2 -65 -24 -30 -50 38 10 11 0 -7 -40 -33 -12 10 -4 104 -3 -28 38 -3 13 45 6 -9 21 -28 -27 7 -47
5028 -47 28 -7 13 -28 -58 25 49 -18 17 39 7 50 -58 -12 23 -52 -79 -35 -29 1 22 -26 -3 25 39 1 -19 -35 9 34
5058 34 -15 -27 44 11 9 44 38 10 -4 39 18 3 -60 12 30 -15 -12 -14 -12 -28 -66 -17 -5 -7 -2 -60 -38 21 2 -20 -25 -17 -24 -4 -6 -6
5094 -6 36 -11 25 -16 -11 22 18 25 41 3 -4 16 -5 -32 -7 -21 49 14 9 45 -22 16 -40 51 -18 -5 -15 8 36 34 10 -58 -30 -15
5128 -15 -38 18 -14 -23 -21 -25 -16 22 31 -18 -33 -8 3 -21 -7 -23 28 -21 -11 -26 -2 27 -28 -8 -44 -41 55 -35 -22 -45 3 6 -65 -45
5162 -45 1 -19 -53 -16 -21 -38 8 15 -29 -72 28 -14 -32 32 -22 -42 -14 -7 -13 -43 26 35 -38 24 13 54 5 -50 12 24 1 2 21
5195 21 19 -8 -39 -6 -43 20 10 26 5 -7 -54 -45 -15 11 -23 -16 -17 -31 14 -38 42 -42 35 47 21 19 8 -2 13 -30 3 0 -3 11
5229 11 -14 46 8 39 8 7 -35 9 -15 -17 -1 47 38 -8 8 -58 3 -19 -12 -48 -14 6 -18 -29 -7 19 40 34 -63 -17 11 -25 30
5262 30 3 -18 32 47 -60 65 44 48 -4 -4 -3 4 6 -6 8 11 8 8 28 12 -42 23 0 -66 -6 -26 -26 8 -26 -32 64 10 -29 14
5296 14 -14 -21 9 -3 -57 -6 -14 -36 -14 -6 21 9 62 -1 34 -21 -24 -72 -14 -3 -17 26 -2 5 52 -21 8 41 -57 36 -41 15 -8
5329 -8 -24 -27 -29 -28 -7 -20 1 -21 -31 22 38 -34 9 -23 -27 -11 -36 -30 -11 60 -64 4 2 -40 -14 -8 23 14 20 -55 -25 54 44 -14 -43
5364 -43 6 30 18 -5 -31 24 68 9 -29 -48 -84 -34 -57 -40 -23 8 -21 -11 -7 -17 -56 30 -30 -33 -10 -23 -11 5 15 -7 1 2
5396 2 -5 4 16 -29 -48 74 -4 11 30 -7 20 19 20 42 7 7 -31 15 -9 -1 27 -6 25 -35 -54 32 -15 -40 -70 3 -28 -62 -16
5429 -16 -2 -22 -22 -20 -41 -16 15 1 21 71 3 15 40 -28 -10 56 -22 -48 12 21 -33 62 19 17 0 -20 -2 -13 9 4 40 18 -70
5462 -70 -52 28 62 -28 -31 -60 33 -28 2 10 -2 7 18 42 -42 -24 32 12 -15 8 15 -5 27 -28 -33 -4 -11 -35 -58 -4 -39 -8 -13 28
5496 28 11 15 -72 -8 -21 -10 9 -25 -26 -2 -51 -19 -40 14 28 -13 14 -4 -41 -2 27 18 8 31 -35 -24 11 -7 38 -16 -29 3
5528 3 7 -20 68 -38 -37 10 -10 -6 28 13 24 -26 -41 -15 -38 -16 -22 3 29 -52 -16 8 -18 -42 13 -11 -46 -5 -40 -16 37 51
5560 51 32 -4 11 -36 20 10 -74 32 -7 -58 -30 -1 -22 -42 3 -56 37 6 -43 -26 39 6 18 48 -22 -51 54 -15 13
5589 13 -19 -14 -3 -1 -66 5 37 4 -8 -2 -23 54 3 -29 -5 -7 31 -36 -33 34 9 27 45 -34 26 49 -9 -25 56 -34 41 22 -15
5622 -15 49 -7 -10 14 51 -9 52 -3 4 9 18 -6 -33 -9 22 8 -2 -24 -34 10 4 -42 37 14 -45 23 38 7 52 18 -11 8 -7
5655 -7 -9 -68 25 10 15 -39 5 33 -1 -52 -11 32 -8 -19 2 -20 17 13 4 -27 30 -53 -21 -13 17 -8 13 -26 -37 -54 -8 -27 -9
5688 -9 22 -18 -25 -14 36 24 16 -16 -28 42 37 65 18 13 -33 32 -36 -4 42 1 1 29 -8 6 32 -9 -56 4 -19 -34 18 -2 -24
5721 -24 46 46 -36 11 40 -2 -23 -25 49 20 19 11 -40 -34 -35 26 10 -24 -14 -11 -24 60 -14 -8 -13 -5 45 -13 37 -31 9 -31 -35 -13 -35 -7
5757 -7 18 27 -10 -30 -37 -72 -31 -25 -12 -39 -43 -11 6 -39 4 13 18 -6 -6 1 5 71 -2 16 0 29 -18 8 -13 -6 23 -3 44 -31 -40 3
5793 3 7 -87 -9 -26 -57 24 -3 -40 7 -3 42 -9 -43 -38 -20 -9 6 -2 37 67 7 13 8 -50 -9 0 54 71 -18 2 -18 27 -40 9
5827 9 65 -10 2 -42 48 15 -21 -13 -32 -22 -1 -60 43 35 -22 15 -4 36 11 5 7 -7 -45 41 5 -35 -5 -6 -25 -11 -7 -2 29 17
5861 17 17 50 22 0 -9 -15 0 25 23 -11 -28 -18 7 -21 -50 28 -51 -25 27 7 -18 -3 -25 -29 -23 -25 1 6 -40 -33 -15 23 -23 -6 75
5896 75 -11 6 10 -65 0 -12 -25 10 -8 -18 -22 41 11 -9 -19 -9 -40 39 -28 33 14 -22 -26 -31 -22 -74 0 46 -14 0 40 -34 -7
5929 -7 36 -18 15 -4 -36 -19 -9 -47 2 56 -38 0 3 -52 9 -5 16 4 42 -4 8 15 6 45 6 2 -35 52 -13 -18 99 -23
5961 -23 -46 5 -34 10 -19 -30 -25 -8 21 -7 20 10 10 -36 -1 -4 1 49 -26 57 63 16 -37 31 30 -28 17 -32 -11 56 59 16 -4 -5
5995 -5 27 34 22 -6 -39 9 -43 21 17 -22 49 5 20 -1 2 10 -28 4 -38 -27 -24 -44 25 24 -49 -24 56 19 -5 26 8 -56 43 -20
6029 -20 8 9 -13 22 36 13 42 -17 -5 -4 41 0 -24 19 -12 -22 -15 -22 -31 22 31 10 -33 -6 -34 38 53 -9 -15 10 14 -36 32 -2
6063 -2 21 26 -14 26 37 -2 44 20 21 49 -4 2 0 35 -1 22 33 8 -25 22 46 -10 -53 -22 13 -39 -35 13 51 2 11 -28 4 25
6097 25 2 -28 15 -12 -24 -5 -41 48 27 -43 -17 33 7 17 -30 -43 6 28 -14 -18 21 1 -5 -42 19 11 -27 28 -14 1 27 4
6129 4 -48 19 -13 35 -20 2 5 12 -57 -4 14 29 -20 39 22 -35 25 -5 -16 -2 13 31 -14 63 -33 20 45 -10 18 -11 22 -4
6161 -4 37 40 -35 -4 -39 -17 9 -14 2 -8 1 22 37 -15 -29 13 -22 -22 -8 -61 -29 -20 -15 -26 24 0 18 -33 -18 -3 -5 23 4 10
6195 10 -29 17 34 4 3 6 24 -4 -2 47 -36 27 -12 -40 -43 20 -44 24 7 -22 61 -46 -3 -27 -11 1 -6 4 -36 -42 -4 44 -29
6228 -29 -9 25 20 72 -14 -14 -16 23 -32 -9 23 28 21 -3 59 27 4 53 1 39 -37 -34 9 59 -30 -1 -23 -9 34 -3 -9 32 -27 -13
6262 -13 -22 2 -34 58 -12 -14 -5 52 -14 30 64 33 0 31 -13 -16 7 -40 21 -21 8 25 -45 -22 9 9 49 33 29 9 21 -46 25
6295 25 16 12 -20 14 -19 24 -58 4 27 -13 -25 -13 -7 -3 19 1 -32 12 -51 48 22 -8 22 19 -14 -34 46 -11 13 26 -21 -6 7
6328 7 19 46 -16 60 -31 54 64 -45 -6 35 -36 8 -35 -13 10 -9 -18 -31 13 -35 -37 -57 -15 -55 12 24 -8 22 56 2 17
6359 17 -49 -10 19 44 20 69 -17 6 37 -9 24 4 -7 -14 40 34 23 62 -33 -38 -3 8 9 -25 -11 -32 11 -28 -19 2 36 -18 -66
6392 -66 62 -37 -1 24 -32 35 2 31 -22 9 -30 -13 -37 -11 -5 -43 12 8 3 8 3 -43 -15 23 -2 -26 24 -31 9 22 19 35 36
6425 36 36 1 4 -29 7 -13 -11 16 -10 30 9 22 -17 6 0 -25 -55 -1 -34 9 21 24 21 0 16 -46 10 -17 -17 20 16 -3 17 -42
6459 -42 30 49 28 31 21 -10 -19 20 -25 -36 -28 0 -42 -12 -55 -1 -16 8 6 -75 0 25 -40 -19 -11 -26 -30 -30 -20 -18 24 19 24 37 27
6494 27 30 16 -21 50 4 26 -20 -3 4 -45 -1 8 2 3 16 -25 63 29 -16 0 -6 -27 -14 -20 -8 13 -38 -2 -3 -20 -41 -5 -40 -6
6528 -6 9 -23 34 0 19 -19 31 21 18 -5 -10 3 -40 22 37 -13 -8 -2 -38 -6 -1 0 -19 -33 -35 -43 3 -1 -9 2 -16 14 -65 -1 12 -35
6564 -35 -6 -10 -39 12 52 -42 -9 28 -16 -57 -13 -8 -9 -20 45 22 10 3 0 55 -15 -20 12 1 -20 -12 -16 -6 15 13 25 19 -73 -22 -31 -10
6600 -10 -44 38 -12 -16 7 30 3 -33 -31 12 -26 -27 -5 27 17 0 -21 42 -13 -35 1 13 -40 11 28 1 35 16 -35 -7 -8 -20
6632 -20 -9 -32 -21 -19 -8 -53 -71 2 74 10 2 -55 -22 0 -58 -56 -45 -7 0 14 44 30 9 -6 5 56 -22 -22 0 -38 -10 32 20
6665 20 -17 -12 -15 -39 -4 18 12 1 -1 36 -8 -21 -30 -15 -21 -22 20 53 7 -19 0 -18 -20 -20 -31 -27 65 -16 26 -43 12 -10 23 41 -28
6700 -28 -35 16 7 20 17 -15 14 28 12 56 22 4 -19 1 5 -6 -31 12 -44 35 -27 -16 -1 -35 21 12 -34 -20 -34 14 -17 -24 5
6733 5 -16 -12 -6 -56 -7 12 -42 -21 35 22 9 49 -4 56 6 33 14 2 38 -26 -7 7 13 -8 -9 12 -31 3 -22 -34 13 -33 -22
6766 -22 -49 2 -41 -22 -49 -46 -12 -10 -21 -30 9 -17 -20 23 15 6 -15 16 6 5 9 -1 -28 -10 -1 11 -2 -20 -33 -4 -35 7 -36 9 48
6801 48 -34 -37 -53 18 22 22 -5 -22 0 50 -25 39 -16 2 29 -30 -43 22 6 -30 -37 -16 -12 -30 49 -76 21 18 -31 -23 36 41 -14 16
6835 16 42 31 3 -17 17 -3 -38 -2 20 2 3 3 12 -17 20 -31 -44 17 34 5 1 -36 -40 2 -30 -11 -45 41 -21 -9 -28 30 29
6868 29 15 -23 -9 3 -4 70 -8 20 0 4 11 -2 7 4 -16 -14 -17 -50 28 -42 -44 37 -60 -2 1 51 16 -38 0 -90 -61 -15 -50 1 -40
6903 -40 -46 2 11 -2 -19 -9 -31 9 -9 1 21 -65 -39 10 25 -35 -10 46 -35 -14 6 51 -12 69 43 28 32 -9 -36 -38 22 -11
6935 -11 -20 -15 -6 -12 25 -45 -21 -20 -27 -8 55 -21 26 -33 -17 3 34 -8 -28 -11 34 15 64 12 4 25 -19 -3 -48 8 -8 -4 6 37
6969 37 0 27 -18 -17 10 19 -32 -33 -36 24 -7 -54 -5 -43 27 27 -57 -34 19 8 3 -35 35 7 -4 26 -22 -22 -43 1 0 13 1 9 11
7004 11 -6 -68 10 -6 11 -2 -17 -21 -9 -1 -42 -7 1 12 -12 13 23 -44 -25 47 -37 -41 -46 8 25 44 5 -49 -9 9 16 11 69 25
7038 25 30 31 26 24 -23 -26 -1 45 -48 36 23 50 -11 -49 27 -44 18 7 -3 -13 13 -33 -23 -24 -18 -58 53 -13 -19 -15 13 -29 -33 19 -15
7073 -15 11 -28 16 -2 -31 -56 -8 31 -19 -6 2 17 16 -18 -19 -52 -6 -4 32 -9 29 -48 4 -49 -27 -28 -16 7 -32 -7 -6 -8 23 -48
7107 -48 -29 -13 -43 -41 -18 -30 16 -10 -33 22 -5 -33 77 17 -7 -11 -47 4 25 -23 5 -17 9 -21 10 -13 -14 -1 -11 -41 41
7138 41 10 -13 44 -7 8 4 21 -9 1 -41 -47 -17 4 -50 7 8 -32 53 13 -5 17 -29 -61 37 0 1 33 18 -60 -37 24 28 -9
7171 -9 -6 6 62 -17 7 37 30 31 23 42 -37 41 44 -47 -7 45 -4 -32 -2 -19 -52 15 -8 -69 -30 27 -71 52 12 -18 -33 8 -27
7204 -27 63 40 17 -11 -3 12 49 -34 2 10 62 -18 20 23 -27 31 3 -7 1 -10 -3 -48 28 -3 -4 -1 45 -37 -19 26 -32 60 -24 -4
7238 -4 33 52 -56 -31 -47 -53 13 10 -8 -12 35 33 0 10 -3 0 29 0 -28 1 21 13 16 23 -15 16 -10 5 19 -5 -16 -18 -25 -54 2
7273 2 -6 -56 -30 0 -12 43 16 -4 -14 -13 -10 21 -24 26 0 53 18 20 3 2 -32 31 -28 -45 1 7 -12 0 -38 19 -3 -53 -9 6
7307 6 33 -42 -20 3 26 14 0 -28 6 -38 -24 39 0 -11 18 13 5 -11 13 10 34 -24 -10 -18 41 21 27 -47 -37 -44 -60 9 0 1 -14
7342 -14 -6 7 9 -27 -7 -24 -6 17 -14 -19 -59 -25 44 27 5 -22 7 -29 -49 -28 26 -1 -14 -3 -30 8 39 71 41 13 14 28
7374 28 31 -15 -3 4 18 16 -24 60 37 6 -57 -26 -12 -15 -5 10 18 9 -4 21 -44 20 19 -29 -10 0 -26 -17 -61 -12 -21 -59 35 -19 37
7409 37 -52 -56 8 4 -10 33 -9 -11 46 3 73 76 -4 21 0 -5 -55 4 52 -39 5 -6 12 34 -17 1 -5 -12 -12 28 39 -13 -44 -15
7443 -15 2 25 23 -8 26 10 -9 -40 6 -18 3 32 -14 14 -8 24 -14 -6 32 50 27 72 -26 29 9 -12 -31 -1 -35 25 28 20
7475 20 25 -28 9 -35 -8 21 16 -25 -4 -53 -23 -18 -5 13 2 4 5 10 39 12 21 -31 36 12 20 -26 33 -17 -41 54 -16 -15 45 3 4
7510 4 31 -24 -23 2 41 7 36 -2 1 -4 -4 -19 -40 76 -48 38 39 11 -24 -6 28 -20 -26 -29 24 16 -80 -29 -16 45 39 27 -24 -11
7544 -11 1 27 -22 40 39 28 -41 19 -43 21 5 11 -14 -19 -5 -35 46 -6 17 -22 18 11 22 -8 2 6 -11 -2 -35 3 -53 29 -31
7577 -31 -13 -27 -28 9 21 21 14 15 9 -4 37 44 6 39 34 7 -7 7 -13 -24 33 26 1 -18 -9 -2 -25 -49 7 1 -2 -17 -30 -23 -7 4 -4
7614 -4 -33 44 26 4 -36 -28 -30 1 24 19 -5 -19 -50 40 -19 -9 7 6 17 -11 -5 -23 48 -36 -33 -2 30 -18 35 -36 -10 13 4 -41
7648 -41 -16 15 -55 -13 15 -19 3 -14 -7 -14 28 -21 66 -8 -16 -12 8 -8 -9 -34 13 3 -23 -5 -41 12 39 43 11 48 -5 41 -19
7681 -19 7 -9 -19 27 24 -42 39 -70 44 -34 -20 -38 -18 -27 -96 -19 4 -80 8 -10 -42 7 25 38 -7 46 -32 -5 -38 -16
7711 -16 67 31 57 16 12 -69 13 8 23 13 10 -58 42 -4 -22 11 -2 49 23 -26 -42 17 -34 -27 -1 -1 35 20 26 -11 19 -40 -30
7744 -30 -58 -12 -18 -6 16 20 -19 -36 -5 -30 35 -23 -4 42 60 -11 -18 -22 32 32 17 -8 22 38 15 12 -12 -44 -1 -18 -20 -69 17 27
7778 27 -44 59 67 -3 22 3 -8 40 -50 -1 -4 26 -27 -46 38 -36 -39 -45 -7 33 17 14 32 -1 -4 16 -13 -2 18 54 -7 -45 -6
7811 -6 -7 -5 12 -15 2 4 15 8 41 -10 -42 -13 -42 40 22 27 -47 28 -6 -18 19 -25 25 -22 65 4 1 6 -34 -1 10 35 -1 2 28
7846 28 9 40 62 -12 -27 9 18 5 13 23 -31 -6 -23 -16 11 29 21 0 -10 3 7 68 43 14 10 2 14 -19 11 50 0 -4 42 -14
7880 -14 -29 -28 46 0 22 -12 -5 48 -18 -9 -51 -51 -61 -20 -30 35 25 -51 20 42 15 -38 -20 20 -24 38 25 -11 -22 -11 -33 19
7912 19 1 -4 31 64 30 -42 -69 4 -4 -44 28 -17 1 19 19 65 -58 13 -11 -62 17 25 -38 -22 15 2 29 2 -8 10 -4 -8
7944 -8 -33 4 35 2 -43 -10 24 15 34 10 -38 16 -42 31 24 -37 -5 14 -52 18 -18 -4 -4 -49 -21 4 22 -21 2 18 -14 18
7976 18 25 24 18 5 19 1 -63 15 40 -36 1 -13 -30 -30 -40 -34 -55 2 -28 1 27 -13 -23 -4 -52 -40 -44 6 6 -30 -1 3 20 29 44
8011 44 8 -34 8 27 -43 6 24 1 -44 40 24 -1 40 -6 -21 17 -42 39 30 7 -3 -40 -22 19 -21 -28 -25 1 -43 -10 -1 2 0
8044 0 8 20 -23 13 -25 -19 68 -9 7 -64 17 15 -6 -37 -31 10 30 38 31 -2 -89 61 -7 3 -51 -3 9 -19 62 15 4 17 -47
8077 -47 -41 46 44 -28 -10 34 30 14 22 25 2 -20 32 9 2 31 -6 -18 19 11 41 57 11 28 39 15 -13 35 -5 70 -37 -23 29
8110 29 11 36 -2 -6 -45 23 11 34 -18 -28 -8 19 -32 -23 -1 -2 9 78 63 -9 -47 26 3 -12 42 2 17 27 3 -27 4 48
8142 48 54 26 -32 -15 3 18 -19 11 -17 -53 56 25 -59 1 15 -18 -14 -20 -20 36 -7 -18 -16 -52 -46 -4 9 6 47 -61 22 25 16 32
8176 32 -15 29 2 -1 35 -21 -35 30 -5 -17 25 8 -27 -9 29
8191B9
##END NTUPLES=NMR FID
##END=
