##TITLE=1H_LR-758-R5-4PB-C2
 CCl4
 8 sc, 
 7.9.2023
##JCAMPDX= 6.0         $$ Bruker NMR JCAMP-DX V2.0
##DATA TYPE= NMR FID
##DATA CLASS= NTUPLES
##ORIGIN= UXNMR, Bruker Analytische Messtechnik GmbH
##OWNER= root
$$ XWIN-NMR		Version 3.5
$$ Thu Sep  7 16:22:48 2023 Russian Standard Time (UT+4h)  she@DPX200
##.OBSERVE FREQUENCY= 200.13135
##.OBSERVE NUCLEUS= ^1H
##.DELAY= (6, 6)
##.ACQUISITION MODE= SIMULTANEOUS
##.ACQUISITION SCHEME= undefined
##.AVERAGES= 8
##.DIGITISER RES= 18
##SPECTROMETER/DATA SYSTEM= spect
##.PULSE SEQUENCE= zg30
##.SOLVENT NAME= DMSO
##.SHIFT REFERENCE= (INTERNAL, DMSO, 0, 15.7039)
##AUDIT TRAIL= $$ (NUMBER, WHEN, WHO, WHERE, WHAT)
$$ ##TITLE= Audit trail, XWIN-NMR		Version 3.5
$$ ##JCAMPDX= 5.01
$$ ##ORIGIN= Bruker BioSpin GmbH
$$ ##OWNER= she
$$ F:/spectra/data/she/nmr/H-F/1/audita.txt
$$ ##AUDIT TRAIL=  $$ (NUMBER, WHEN, WHO, WHERE, WHAT)
(   1,<2023-09-07 16:21:25.64 +0400>,<she>,<DPX200>,
      <created by zg, POWCHK disabled, PULCHK disabled
       configuration hash MD5:
       00 E9 B6 7A A2 85 ED C7 34 08 36 98 17 FE 4E 26
       data hash MD5: 16K
       9D 47 12 47 AF 17 B3 A7 CF 49 BE CE 65 6A CB 7A>)
$$ ##END=
$$ 
$$ hash MD5
$$ 16 DB 6E 02 5A 11 91 3D 60 0F DB 48 4B F5 CA 42
##$RELAX= 
##$RELAX= 
##$RELAX= 
##$RELAX= 
##$RELAX= 
##$RELAX= 
$$ Bruker specific parameters
$$ --------------------------
##$DU= <F:/spectra>
##$EXPNO= 1
##$NAME= <H-F>
##$PROCNO= 1
##$TYPE= <nmr>
##$USER= <she>
##$AMP= (0..31)
100 100 100 100 100 100 100 100 100 100 100 100 100 100 100 100 100 100 
100 100 100 100 100 100 100 100 100 100 100 100 100 100 
##$AQSEQ= 0
##$AQ_mod= 1
##$AUNM= <au_zg>
##$AUTOPOS= <>
##$BF1= 200.13
##$BF2= 200.13
##$BF3= 200.13
##$BF4= 200.13
##$BF5= 200.13
##$BF6= 200.13
##$BF7= 200.13
##$BF8= 200.13
##$BYTORDA= 1
##$CFDGTYP= 0
##$CFRGTYP= 5
##$CHEMSTR= <none>
##$CNST= (0..31)
1 1 145 1 1 1 1 1 1 1 1 1 1 1 1 1 1 1 1 1 1 1 1 1 1 1 1 1 1 1 1 1 
##$CPDPRG= <>
##$CPDPRG1= <>
##$CPDPRG2= <>
##$CPDPRG3= <>
##$CPDPRG4= <mlev>
##$CPDPRG5= <mlev>
##$CPDPRG6= <mlev>
##$CPDPRG7= <mlev>
##$CPDPRG8= <mlev>
##$CPDPRGB= <>
##$CPDPRGT= <>
##$D= (0..31)
0 1.2 0 0 0 0 0 0 0 0.06 0 0.03 0 0 0 0 0.0002 0 0 0 0 0 0 0 0 0 0 0 0 
0 0 0 
##$DATE= 1694089285
##$DBL= (0..7)
120 120 120 120 120 120 120 120 
##$DBP= (0..7)
150 150 150 150 150 150 150 150 
##$DBP07= 0
##$DBPNAM0= <>
##$DBPNAM1= <>
##$DBPNAM2= <>
##$DBPNAM3= <>
##$DBPNAM4= <>
##$DBPNAM5= <>
##$DBPNAM6= <>
##$DBPNAM7= <>
##$DBPOAL= (0..7)
0.5 0.5 0.5 0.5 0.5 0.5 0.5 0.5 
##$DBPOFFS= (0..7)
0 0 0 0 0 0 0 0 
##$DE= 6
##$DECBNUC= <off>
##$DECIM= 32
##$DECNUC= <off>
##$DECSTAT= 4
##$DIGMOD= 1
##$DIGTYP= 9
##$DL= (0..7)
0 120 120 120 120 120 120 120 
##$DP= (0..7)
150 150 150 150 150 150 150 150 
##$DP07= 0
##$DPNAME0= <>
##$DPNAME1= <>
##$DPNAME2= <>
##$DPNAME3= <>
##$DPNAME4= <>
##$DPNAME5= <>
##$DPNAME6= <>
##$DPNAME7= <>
##$DPOAL= (0..7)
0.5 0.5 0.5 0.5 0.5 0.5 0.5 0.5 
##$DPOFFS= (0..7)
0 0 0 0 0 0 0 0 
##$DQDMODE= 0
##$DR= 18
##$DS= 0
##$DSLIST= <SSSSSSSSSSSSSSS>
$$ [...]
##$SUBNAM2= <"">
##$SUBNAM3= <"">
##$SUBNAM4= <"">
##$SUBNAM5= <"">
##$SUBNAM6= <"">
##$SUBNAM7= <"">
##$SUBNAM8= <"">
##$SUBNAM9= <"">
##$SW= 18.05172834244
##$SWIBOX= (0..15)
0 0 2 0 0 0 0 0 0 0 0 0 0 0 0 0 
##$SW_h= 3612.71676300578
##$TD= 16384
##$TD0= 1
##$TE= 0
##$TE2= 300
##$TE3= 300
##$TEG= 300
##$TL= (0..7)
0 120 120 120 120 120 120 120 
##$TP= (0..7)
150 150 150 150 150 150 150 150 
##$TP07= 0
##$TPNAME0= <>
##$TPNAME1= <>
##$TPNAME2= <>
##$TPNAME3= <>
##$TPNAME4= <>
##$TPNAME5= <>
##$TPNAME6= <>
##$TPNAME7= <>
##$TPOAL= (0..7)
0.5 0.5 0.5 0.5 0.5 0.5 0.5 0.5 
##$TPOFFS= (0..7)
0 0 0 0 0 0 0 0 
##$TUNHIN= 0
##$TUNHOUT= 0
##$TUNXOUT= 0
##$USERA1= <user>
##$USERA2= <user>
##$USERA3= <user>
##$USERA4= <user>
##$USERA5= <user>
##$V9= 5
##$VALIST= <valist>
##$VCLIST= <CCCCCCCCCCCCCCC>
##$VD= 0
##$VDLIST= <DDDDDDDDDDDDDDD>
##$VPLIST= <PPPPPPPPPPPPPPP>
##$VTLIST= <TTTTTTTTTTTTTTT>
##$WBST= 1024
##$WBSW= 4
##$XGAIN= (0..3)
0 0 0 0 
##$XL= 0
##$YL= 0
##$YMAX_a= 616074
##$YMIN_a= -656673
##$ZGOPTNS= <>
##$ZL1= 120
##$ZL2= 120
##$ZL3= 120
##$ZL4= 120
##$ABSF1= 10
##$ABSF2= 0
##$ABSG= 5
##$ABSL= 3
##$ALPHA= 0
##$AQORDER= 0
##$ASSFAC= 0
##$ASSFACI= 0
##$ASSFACX= 0
##$ASSWID= 0
##$AUNMP= <proc_1d>
##$AZFE= 0.1
##$AZFW= 0.1
##$BCFW= 1
##$BC_mod= 2
##$BYTORDP= 1
##$COROFFS= 0
##$CY= 11.3945322036743
##$DATMOD= 1
##$DC= 2
##$DFILT= <>
##$DTYPP= 0
##$F1P= 15.7292609196834
##$F2P= 12.9074282941183
##$FCOR= 0.5
##$FTSIZE= 0
##$FT_mod= 4
##$GAMMA= 1
##$GB= 0.15
##$INTBC= 1
##$INTSCL= 1
##$ISEN= 128
##$LB= 0.24
##$LEV0= 0
##$LPBIN= 0
##$MAXI= 10000
##$MC2= 0
##$MEAN= 0
##$ME_mod= 0
##$MI= 1.114404
##$NCOEF= 0
##$NC_proc= 0
##$NLEV= 6
##$NOISF1= 3.799351
##$NOISF2= 2.8
##$NSP= 1
##$NTH_PI= 0
##$NZP= 0
##$OFFSET= 15.70392
##$PC= 1
##$PHC0= -21409.38
##$PHC1= 15.45271
##$PH_mod= 1
##$PKNL= yes
##$PPARMOD= 0
##$PSCAL= 0
##$PSIGN= 0
##$REVERSE= no
##$SF= 200.130013532006
##$SI= 16384
##$SIGF1= 3
##$SIGF2= 2
##$SINO= 400
##$SIOLD= 16384
##$SREGLST= <1H.CDCl3>
##$SSB= 0
##$STSI= 0
##$STSR= 0
##$SW_p= 3612.71676300578
##$SYMM= 0
##$S_DEV= 0
##$TDeff= 0
##$TDoff= 0
##$TI= <>
##$TILT= no
##$TM1= 0
##$TM2= 0
##$TOPLEV= 0
##$USERP1= <user>
##$USERP2= <user>
##$USERP3= <user>
##$USERP4= <user>
##$USERP5= <user>
##$WDW= 1
##$XDIM= 8192
##$YMAX_p= 0
##$YMIN_p= 0
$$ End of Bruker specific parameters
$$ ---------------------------------
##NTUPLES= NMR FID
##VAR_NAME=  TIME,          FID/REAL,        FID/IMAG
##SYMBOL=    X,             R,               I
##VAR_TYPE=  INDEPENDENT,   DEPENDENT,       DEPENDENT
##VAR_FORM=  AFFN,          ASDF,            ASDF
##VAR_DIM=   8192,          8192,            8192
##UNITS=     SECONDS,       ARBITRARY UNITS, ARBITRARY UNITS
##FACTOR=    0.0002768,     1,               1
##FIRST=     0,             0,               0
##LAST=      2.2672688,     0,               0
##MIN=       0,             -656673,         0
##MAX=       2.2672688,     616074,          0
$$ Real data points
##PAGE= N=1
##DATA TABLE= (X++(R..R)), XYDATA
0@%%%%%%%qJ6k4M0n6Q0j10J42j76K16k72L37m10M97o00P20q55J007j178J372j595
$$ 0 0 0 0 0 0 0 0 -8 8 -16 24 -32 48 -62 80 -96 120 -152 185 -225 272 -328 392 -463 544 -634 738 -857
28h57J845k122K431k776L161l587M056m573N142n768O455p206Q023q914R887j0949
$$ -857 988 -1134 1297 -1479 1682 -1905 2151 -2422 2720 -3048 3407 -3799 4224 -4690 5197 -5752
44e752J2109j3371J4747j6251J7893j9688K1656k3822K6211k8856L1799l5092
$$ -5752 6357 -7014 7733 -8518 9375 -10313 11343 -12479 13732 -15124 16675 -18417
56a8417L8802m3015M7842n3441O0024o7886P7472q9449J04900j25697J55411k02077
$$ -18417 20385 -22630 25212 -28229 31795 -36091 41381 -48068 56832 -68865 86546 -115531
68a15531K90279o75924Q67353l89172k16909O37120r12143J131001j252421J147419
$$ -115531 174748 -501176 366177 -22995 -239904 397216 -514927 616074 -636347 511072
78E11072p87537L36771k0401r1181J28096k40627M20491n26948M75742l43901
$$ 511072 -276465 60306 39905 -51276 76820 -163807 256684 -270264 205478 -138423
88a38423K72581k97898L06146j81039m2737K05871k10448J40788j58082L05373
$$ -138423 134158 -163740 142406 -38633 -81370 124501 -85947 54841 -103241 202132
98B02132m63429M96318m08840L16112k80392K25717l5863k81696N71860o83215
$$ 202132 -261297 235021 -173819 142293 -138099 87618 51755 -229941 341919 -341296
108c41296O16937m95758M08211l15982J34280J32236l64584M52996m16974L76969
$$ -341296 275641 -220117 188094 -127888 6392 138628 -225956 227040 -189934 187035
118A87035m07060M47354l83955J92165K6526j62788K16301k73422L78464m66351
$$ 187035 -220025 227329 -156626 35539 62065 -100723 115578 -157844 220620 -245731
128b45731M38367k87088J14331k1299L440K7762j27603K50575l08306K79691k31309
$$ -245731 192636 -94452 19879 -1420 2020 29782 -97821 152754 -155552 124139 -107170
139a07170K29724k54245K20703q5680r4487K19841k52835K46281k64551K98653
$$ -107170 122554 -131691 89012 3332 -91155 128686 -124149 122132 -142419 156234
149A56234k79855J74261l3558o1067Q8351j04780J66474k58500L07887k68529
$$ 156234 -123621 50640 17082 -43985 44366 -60414 106060 -152440 155447 -113082
159a13082J73500r0005M1102J2429j08115K20709k82490K57094j76531J06455
$$ -113082 60418 -29587 11515 23944 -84171 136538 -145952 111142 -65389 41066
169D1066p4294M8744J0705r5101J50636j46660J12798r9987J19947j34517J02903
$$ 41066 -33228 15516 26221 -68880 81756 -64904 47894 -52093 67854 -66663 36240
180C6240l0265l6859O4021o6852Q4399j25761J55796j40556Q7747l7290J5243
$$ 36240 5975 -30884 33137 -33715 50684 -75077 80719 -59837 27910 -9380 5863
191E863p298j8899P3332j27761J45891j25481R8223q5524P4327l7256k8366R4487
$$ 5863 -1435 -20334 52998 -74763 71128 -54353 43870 -41654 32673 -4583 -32949 61538
203F1538j28558J25063j09081J02132r7441P1062j7025m0454P2842p8321P8150
$$ 61538 -67020 58043 -51038 51094 -46347 24715 7690 -32764 40078 -38243 39907
214C9907q8527J01116r4328O0279j6121j3843K5340l5149N7202q2078Q9874p4147
$$ 39907 -48620 52496 -41832 18447 2326 -11517 13823 -21326 35876 -46202 43672 -30475
226c0475M8278l1009K4870j6237p231L9848o1694O4946n9331N8267o2137N7483
$$ -30475 17803 -13206 11664 -4573 -11804 28044 -33650 31296 -28035 30232 -31905 25578
238B5578l5787L087K5118m0160M7481n7251O9181p2898N9799l4410R918O236j8063
$$ 25578 -10209 -7122 17996 -22164 25317 -31934 37247 -35651 24148 -10262 -344 5892 -12171
251a2171L4121n2925O4568o2008M8143l2117K0091r505n734K5770m1922M6897
$$ -12171 21950 -30975 33593 -28415 19728 -12389 7702 -1803 -7537 18233 -23689 23208
263B3208m2664L6517l2084K6018j5075l37J4794k3273K5421k5590K7519k8613
$$ 23208 -19456 17061 -15023 10995 -4080 -4417 10377 -12896 12525 -13065 14454 -14159
275a4159K4710j6157P331j111l507Q125j4286K1022k4958K4532k0639J6701j3041
$$ -14159 10551 -5606 1725 614 -2893 5232 -9054 11968 -12990 11542 -9097 7604 -5437
288e437O955J607j0548J7830k1985K3075k1711J9471j5676Q806l20p494J2921
$$ -5437 1518 3125 -7423 10407 -11578 11497 -10214 9257 -6419 2387 2067 -5427 7494
301G494j6772J9011j9292J7919j4416Q438j446m125Q235j1665J3863j4303J2930
$$ 7494 -9278 9733 -9559 8360 -6056 2382 936 -3189 5046 -6619 7244 -7059 5871
314E871j0208P121l100k46K249m700P242q218P814p651P147n640L809k304L64
$$ 5871 -4337 2784 -316 -562 1687 -3013 4229 -3989 3825 -3826 3321 -2319 1490 -814 -450
329d50J614l589N018o151P437q062P574o399N180k825mL137o261Q411r639J0224
$$ -450 1164 -2425 2593 -3558 3879 -4183 3391 -3008 2172 -653 -657 2480 -3781 4630 -5009 5215
345E215r460P837n139J128K634n531P561r247J0254r906P769m535J522N97k264
$$ 5215 -4245 3592 -1547 -419 2215 -3316 4245 -5002 5252 -4654 3115 -1420 102 699 -1565
360a565M424p124Q654q192O193m255L439k767J351J389l881N018m736M241n476
$$ -1565 2859 -4265 4389 -3803 2390 -1865 1574 -1193 158 1547 -2334 2684 -2052 2189 -3287
375c287P339p332N070k344P34R8j753M944q803J0942r806O915n039M352k611j927
$$ -3287 4052 -3280 1790 -554 180 278 -1475 3469 -5334 5608 -4198 2717 -2322 2030 -581 -2508
391b508P100r877R535p982P838q534Q440n088j277N889o851P263r084J1448j2295
$$ -2508 4592 -5285 4250 -3732 4106 -4428 4012 -1076 -2353 3536 -3315 3948 -5136 6312 -5983
406e983R639m519n5J643j532M000r260J2872j2310R146o845O510o648L857L017
$$ -5983 3656 -863 -918 725 -807 3193 -6067 6805 -5505 3641 -3204 3306 -3342 515 3532
421C532r702J1806j0144R598j1935J3826j0849M076K518n900O485q065J2759j7398
$$ 3532 -6170 5636 -4508 5090 -6845 6981 -3868 208 2726 -3174 3311 -4754 8005 -9393
435i393J6977j1224M411j237O37K064q362J4883j6848J3381r257Q325r810Q552
$$ -9393 7584 -3640 771 -466 171 2235 -6127 8756 -8092 5289 -3968 4357 -5453 3099
449C099j588o815J1311j1167J0589j3353J7517j7425J1411k948k398L668n219
$$ 3099 1511 -5304 6007 -5160 5429 -7924 9593 -7832 3579 631 -1767 1901 -3318
462c318J0609j7770K0949j7929J2125r018Q797o552j154J1977j9355J9864j7100
$$ -3318 7291 -10479 10470 -7459 4666 -4352 4445 -2107 -3261 8716 -10639 9225 -7875
475g875J6262j7234J5410q136k144R008j0249J0418j3086J8182k1324J8314j1267
$$ -7875 8387 -8847 6563 -1573 -3717 5291 -4958 5460 -7626 10556 -10768 7546 -3721
488c721N940l653J118N238j4436K1059k1747J8483j5650J4792j3135O706L789
$$ -3721 2219 -1434 -316 4922 -9514 11545 -10202 8281 -7369 7423 -5712 994 4783
501D783j3197J6971j7649J9520k2865K3494j7332O787K899q386J1137j5003K0858
$$ 4783 -8414 8557 -9092 10428 -12437 11057 -6275 512 3411 -4975 6162 -8841 12017
514A2017k4132K1089j4132Q133m979K120L934j2690J9426k0800J8196j5199J3684
$$ 12017 -12115 8974 -5158 2975 -2004 116 4050 -8640 10786 -10014 8182 -7017 6667
527F667j1237M383M808j1033J2256j1028J1209j3522J5061j3085P854l109J168
$$ 6667 -4570 -187 4621 -6412 5844 -5184 6025 -7497 7564 -5521 2333 -776 392
540C92Q50o241J3705j8597J7963j3523R854q113N812m52o677J1404j1928J0637
$$ 392 1242 -4999 8706 -9891 8072 -5451 4403 -3710 2102 1650 -5027 6377 -5551 5086
554E086j2084J6146j7433J2537m203k916P332j0737J5817k1453K2286j6050O865
$$ 5086 -6998 9148 -8285 4252 49 -2867 4465 -6272 9545 -11908 10378 -5672 1193
567A193j35k702N105j0003J5685j8227J5661j1289R367r642P905k05j0181J7170
$$ 1193 1058 -1644 3461 -6542 9143 -9084 6577 -4712 4655 -4987 2918 2713 -7468 9702
581I702j8428J6452j5712J6620j4693O328M769j2026J2742j1639J4257j9364K0901
$$ 9702 -8726 7726 -7986 8634 -6059 269 5038 -6988 5754 -5885 8372 -10992 9909
594I909j5085N602R07k600M433j0513J8942k3146J9412j2119P846q108P554p31
$$ 9909 -5176 426 1333 -1267 3166 -7347 11595 -11551 7861 -4258 3588 -4520 3034 2303
608B303r794J7057j8012J5972j6524J9826k0433J3377n09j0310J3989j3877J6614
$$ 2303 -7491 9566 -8446 7526 -8998 10828 -9605 3772 3263 -7047 6942 -6935 9679
621I679k2976K5869j9917R101q20j330J547o344J6341k4709K4214j7653J2831
$$ 9679 -13297 12572 -7345 1756 936 -394 1153 -5191 11150 -13559 10655 -6998 5833
634E833j2658J2535n729p191J8277k0647J6413j4300J7451k0965J7395o607l553
$$ 5833 -6825 5710 -19 -7210 11067 -9580 6833 -7467 9984 -10981 6414 -193 -3746
647c746O688n231P602j6139K4997k6007J8443j0228P655q301M087P469j9361K3763
$$ -3746 2942 -2289 5313 -10826 14171 -11836 6607 -3621 4034 -4267 -180 7289 -12072 11691
661A1691k0343J6281j7445K0958j8557P480O165j3924J4630j4908J9916k6513
$$ 11691 -8652 7629 -9816 11142 -7415 65 6230 -7694 6936 -7972 11944 -14569
673a4569K6847j7912N448J744k613M120j1539K1716k6358K1838j3908J0456j1750
$$ -14569 12278 -5634 -186 1558 -1055 3065 -8474 13242 -13116 8722 -5186 5270 -6480
686f480J0783k347j0386J8673j8999J6167j6540K0802k2052J4886k532p095R922
$$ -6480 4303 1956 -8430 10243 -8756 7411 -9129 11673 -10379 4507 1975 -5120 4802
699D802r928J3494k1019K5430k1152J1273l582J985j929k948J2116j8912J8944
$$ 4802 -5126 8368 -12651 12779 -8373 2900 -682 1303 -626 -3574 8542 -10370 8574
712H574j3886J0757j2693J4427j0556J062Q124j1421J0592j1670J6814k1317J9301
$$ 8574 -5312 5445 -7248 7179 -3377 -2315 5809 -5612 4980 -6690 10124 -11193 8108
725H108j0830K184J795l202O427j3066J9842k1173J6295j0064P111o165K730M795
$$ 8108 -2722 -538 1257 -1945 4482 -8584 11258 -9915 6380 -3684 3427 -2738 -8 4787
739D787j3210J6932j5270J2452j2034J3300j1427M893L192q221R104r827J2326
$$ 4787 -8423 8509 -6761 5691 -6343 6957 -4470 423 3615 -4606 4498 -5329 6997
752F997j5485J6259j2192N695o83j790L424p483J2500j4938J3718r741O443n324
$$ 6997 -8488 7771 -4421 1274 591 -1199 2225 -5258 7242 -7696 6022 -3719 2724 -2600
766b600M592q98n136R549j0779R833r176R869r951P332k572k500N409o099P338
$$ -2600 1992 1094 -4042 5507 -5272 4561 -4615 5254 -4697 2635 63 -2437 2972 -3127 4211
781D211r737J1420j0656P416l692J282J19k339N635r175J0501r004P273n926M993
$$ 4211 -5526 5894 -4762 2654 -1038 244 363 -1976 3659 -5516 4985 -4019 3254 -2672 2321
796B321l543K2M459p251P741p590P761q137P534m565M57K524l940M832o387Q025
$$ 2321 -1222 -1200 3259 -3992 3749 -3841 3920 -4217 3317 -1248 -791 1733 -2207 2625 -3762 4263
812D263q278O770l757J220j01j235L264n474P134o960N389l916L456k884P68K123
$$ 4263 -4015 2755 -1002 218 117 -1118 2146 -3328 3806 -3154 2235 -1681 1775 -1109 -341 1782
828A782l946M530m345M101m708M885l609J351P84j742J723k664M485n388M696
$$ 1782 -2164 2366 -1979 2122 -2586 2299 -1310 41 825 -917 806 -1858 2627 -2761 1935
843A935l329J774r07O40R92l149M451m672L587k484K103j628N20J573l154L542
$$ 1935 -1394 380 -527 113 1105 -2044 2407 -2265 1322 -1162 941 -687 -167 1406 -1748 1794
859A794k622K422k959K679j364o94J934k374J967j902K776k937J514N86j985J610
$$ 1794 -828 1594 -1365 1314 -50 -744 1190 -1184 783 -1119 1657 -1280 234 820 -1165 445
875D45r58J298k025K148p15p87J275j130L96l49J388k084J529r3o91M18L53k81
$$ 445 -513 785 -1240 908 193 -594 681 -449 -53 -402 986 -1098 431 338 -353 65 418 137
893A37j025J867j467L16K44M69j586J520M5j746K157j470J485k629L448k833O71
$$ 137 -888 979 -488 -172 72 541 -1045 475 520 -1226 931 -539 946 -1683 1765 -1068 -397
910c97J556k406J977j724K675l834L550j714l45Q76K40k11k098M127m356L111
$$ -397 1159 -1247 730 -994 1681 -2153 1397 -317 -662 214 454 243 -1855 2272 -2084 1027
926A027j450Q14j054R94J129l742M462k963Q37r37K137k355J114J368k365J327
$$ 1027 -423 391 -663 331 1460 -2282 2180 -783 54 -883 1254 -1101 13 1381 -984 343
942C43k00O60k944M147k772M80Q17k69j173P00J632l384K894o80k22j488L793
$$ 343 143 803 -2141 2006 -766 -286 531 262 -911 -211 1421 -1963 931 251 29 -1459 2334
959B334l378j08L140k926J031o95K762n124M468j238j282J342J98n03j543M332
$$ 2334 -1044 -1152 1988 -938 93 -602 2160 -2964 1504 266 -1016 326 524 21 -1522 2810
975B810m792K070L66Q2k127K888n19l107M056j818o26j44L183m307K458P09k004
$$ 2810 -1982 88 454 536 -1591 1297 778 -2329 1727 -91 -717 -861 2322 -1985 473 1182 -822
992h22L03J497m74k973N183l708K19J180M13k377J862J400l820K829k5p36j949
$$ -822 -519 978 504 -2469 2714 -994 -775 405 818 -1559 303 1703 -2117 712 687 -49 -1998
1009a998M459l735j4K797j987o59J673J264m515M269j071j113k57L428m006M60
$$ -1998 2461 -1274 -1288 1509 -478 -1137 536 1800 -2715 1554 483 -630 -887 2541 -1465 -1005
1025a005L909n055K747o67J580m211M512r47l983N221j844j427N54L011m111J890
$$ -1005 2904 -2151 596 -71 1509 -2702 1810 863 -3120 2101 257 -1170 -616 2395 -1716 174
1041A74J331k188q23L293j506l287N887l635m25J513J229l479J924J947m038K162
$$ 174 1505 -683 -1506 1787 281 -3006 2881 -754 -1179 334 1563 -1916 8 1955 -2083 79
1057G9J517j735k248N758n473J243K299j345j401J102L309o985N656r15k603J542
$$ 79 1596 -139 -2387 3371 -2102 -859 1440 95 -1306 -204 3105 -3880 1776 861 -1742 -200
1073b00K341l349j11L756l557K50J532J153n533O402k506k187L265j093o15j154
$$ -200 2141 -1208 -1319 2437 -1120 -870 662 1815 -3718 2684 178 -2009 1256 163 -452 -1606
1089a606M866n840K488J552j680j509L551j074l716O066l689n5k05L120m515J828
$$ -1606 3260 -2580 -92 1460 -220 -1729 1822 748 -2968 3098 -591 -646 -851 2269 -2246 -418
1105d18L377n600L214M44m57l158N547l703n46K427m73k220K188J521n021M461
$$ -418 2959 -2641 573 1017 560 -2598 2949 -754 -1300 1127 654 -1566 622 2143 -2878 1583
1121A583q73j271j036M388m478O13L012l006N45M50K274o157P063l767j94J185
$$ 1583 710 -561 -1597 2791 -1687 -1074 1938 -1068 -523 -73 2201 -3956 3107 -660 -854 331
1137C31O90j320j520N762p280M386j181J195l202L913r73l794N785l748J365k024
$$ 331 1021 -299 -1819 3943 -3337 1049 -132 1063 -2139 1774 801 -2993 2792 -956 409 -1615
1153a615M514n497L570K92k345P84P49M69m216O793n898K946r07J851l022J621
$$ -1615 2899 -2598 972 1264 -1081 -297 452 921 -3295 3498 -2400 546 -361 1490 -1532 89
1169H9K114n264N034k816J696l529N802n136K105Q68j639R56j341M278p403P326
$$ 89 2203 -3061 1973 -843 853 -2676 3126 -2010 95 963 -676 280 -1061 3217 -4186 3140
1185C140m490J842j252J707j481n87L900n283M656l770M267o132O515l963p6L010
$$ 3140 -1350 492 -760 947 -534 -1121 2779 -2504 2152 -1618 2649 -3483 3032 -931 -1007 2003
1201B003l826L658m948P315q185O050k555M16p0oJ783m581O699o811N194l715
$$ 2003 -1823 1835 -3113 4202 -3983 2067 -488 -72 -142 -148 1635 -2946 3753 -3058 2136 -1579
1217a579L681l982K123J355m205M896m052L776m558N239m788K977r78N3Q9r03
$$ -1579 2102 -1880 243 1598 -2607 2289 -1763 2013 -2545 2694 -2094 883 -95 -42 47 -856
1233h56L419o038O957o136M525l487L331k507K8K900m748M990m260M424n599N873
$$ -856 2563 -3475 3482 -2654 1871 -1616 1715 -792 -764 2136 -2612 2378 -1882 2542 -3057 2816
1249B816m192J395P42j793K877m627O249o940O116m274K347j496J129O21l524
$$ 2816 -1376 19 761 -1032 1845 -2782 3467 -3473 2643 -1631 716 -780 349 970 -2554
1264b554N681n900N285m924N318m977K860Lk481L791m393M740n468N890m762K887
$$ -2554 3127 -2773 2512 -2412 2906 -2071 789 792 -1689 2102 -2291 2449 -3019 2871 -1891 996
1280I96j102j75P31j681L570m454M638l903K845k804K527j201r91K450l222L202
$$ 996 -106 -281 450 -1231 2339 -2115 2523 -1380 1465 -1339 1188 -13 -1004 1446 -1776 1426
1296A426k868L109l451K972j437K68M6k02O25j980L106l139K783k319J842j815
$$ 1426 -1442 1667 -1784 1188 -249 19 65 -137 488 -1492 1614 -1525 1258 -1061 781 -1034
1312a034J223K88j503K280k295J985j884K053j651R05o4o70P04p04J043j743J996
$$ -1034 189 477 -1026 1254 -1041 944 -940 1113 -538 367 303 -367 337 -367 676 -1067 929
1329I29j649J248j315J232l83l57O98r91R69r09J374j942J821j168M78l6m1M31
$$ 929 -720 528 -787 445 62 -295 403 -588 381 -528 846 -1096 725 -443 35 -1 -42 389
1347C89j096J629j811J690j075O45o74L39O55j406J391p88L76l50M46o72K7N37
$$ 389 -707 922 -889 801 -274 371 -303 36 691 -715 676 -112 264 -86 360 -312 -285 252
1365B52m11j98O64l80Q9Q0J17m40NO68j000J073j072J016r90R86l19o79J421j829
$$ 252 -159 -357 307 -73 16 96 213 -227 -222 446 -554 519 -553 463 -527 459 140 -539 882 -947
1385i47J575j471J644j592Q34R1m82Q71j135J591k314K722k299J149m51K51M63
$$ -947 628 -843 801 -791 43 134 -348 523 -612 979 -1335 1387 -912 237 -214 37 500
1402E00j521K449k895K391j613J177r07M95L72r79J352j712J632j682J864j565
$$ 500 -1021 1428 -1467 924 -689 488 -419 76 448 -531 821 -891 741 -941 923 -642
1418f42J049m02l97O84j016J626k103K038j452J060r58J004n18l14J161j655J622
$$ -642 407 5 -392 292 -724 902 -1201 837 -615 445 -513 491 -27 -341 820 -835 787
1435G87j570J750k054J888r20j42M81o16J252k099K622k285J587j418J272p89
$$ 787 -783 967 -1087 801 -119 -261 220 -396 856 -1243 1379 -906 681 -737 535 -254
1451b54J78R71k274L020k797K571k840K413j564R3J186j425J696k273L063l733
$$ -254 -76 895 -1379 1641 -1156 1415 -1425 988 -576 -483 703 -722 974 -1299 1764 -1969
1467a969L371k050P81N6q86J851l034L842l614K750j861J210o96k31K104l470
$$ -1969 1402 -648 133 189 -697 1154 -1880 1962 -1652 1098 -763 447 -249 -480 1624 -1846
1483a846L438k695K126k347K531j566l93J657j657J173j591K788l178K722j317
$$ -1846 1592 -1103 1023 -1324 1207 -359 -752 905 -752 421 -1170 1618 -1560 1162 -155
1498a55O9l81Q85k24j387L233l562K528j725J876k407J720M48k638L143k353K014
$$ -155 -86 -467 418 194 -1193 2040 -1522 1006 -719 1157 -1250 470 918 -1720 1423 -930 1084
1515A084k608L469k940J013P83j345Q02q46K043l545L736k158O29j15O06q16q12
$$ 1084 -1524 1945 -995 18 801 -544 258 -588 1455 -2090 1646 -512 117 2 608 -208 -1020
1532a020K697k958K228j436J622k633K934j177j203K198j863J329k280L904l889
$$ -1020 1677 -1281 947 -489 1133 -1500 1434 257 -946 1252 -611 718 -1562 2342 -1547
1547a547J738P9p88P09m15J432l363M122k891J009m16J003j342L77J908l182K248
$$ -1547 191 270 -518 191 -224 1208 -2155 1967 -924 85 -331 672 -670 -293 1615 -1567 681
1564F81q12O01j557K326j628J34J147j168J08l76K081l466L205j061o43K32L87
$$ 681 -131 470 -1087 1239 -389 -255 892 -276 -168 -544 1537 -1929 1276 215 -428 -196 191
1581A91L64k044L162k503R79O6L12j508J350J68j498J356l95J11o28J929k766
$$ 191 555 -1489 1673 -830 149 215 527 -981 369 537 -961 395 0 111 -517 1412 -1354
1598a354J665j9n27p3L65N60k124K596j604P14o08J415j507K73J083j740J342
$$ -1354 311 292 -235 -308 57 617 -1507 1089 -515 199 -409 1006 -501 -228 855 -885 457
1615D57n08N98j775K572j530OM91l75l9j07J603k492J883q03M32q91J432j131
$$ 457 -51 547 -1228 1344 -186 -180 311 -64 -103 -210 1393 -1099 784 -19 413 -478 954 -177
1633a77m30J854k125J275o73J197k196K263j007l27M09m7L26j252K215k103J181
$$ -177 -607 1247 -878 397 -276 921 -1275 988 -19 -346 63 16 342 -910 1305 -798 383
1650C83n44L33p22P39L81j458J791j281O08q76J575j644K03Q71r33P76j97K70
$$ 383 -161 172 -550 189 570 -888 903 -378 230 -646 929 -715 -512 359 -574 202 5 275
1668B75r94J750j576Q79l09K78m56k03J202j683J464p65O27j059J050k17n29R72
$$ 275 -719 1031 -545 334 25 303 -153 -356 846 -837 627 -138 489 -570 480 263 -266 706
1686G06j101P99j084J654k185J666l29m05P45r13Q90j508J932j287M32k03K45
$$ 706 -395 404 -680 974 -1211 455 126 -279 466 -447 443 -1065 867 -420 12 -191 54
1703E4m02M38L34j076J120r20Q69j014J247j237N29M10p91P02n49M88p74J146
$$ 54 -348 90 424 -652 468 -452 417 -597 650 -587 -58 352 -439 263 -286 202 -572 574
1721E74q12N19n95P87o38J30M22p53P65r65R91r12J121q73J6N81q56R09r76J600
$$ 574 -238 281 -314 473 -165 -35 387 -366 399 -566 425 -487 634 -239 -223 358 -498 411 -565 1035
1741A035j715J394j006L12K7k90P85j451J837j811J600j356N95O5l39R22j229
$$ 1035 -680 714 -292 20 47 -243 542 -909 928 -883 717 -639 -44 21 -318 604 -625
1758f25J202j351J263r50J047r40L33K30o87R29j244J600j736J159p80Q83k25
$$ -625 577 -774 489 -461 586 -354 -21 209 -478 451 -793 807 -929 230 -550 333 108
1775A08j27K09l26O25j060J060q78R18r18M88o4l38P81j261J502j371J093p81
$$ 108 -19 190 -136 489 -571 489 -389 529 -389 99 35 -303 478 -783 719 -652 441 -340
1793c40Q53n99l7N40p77J024j064J091j521J567j387Q64l5n20O46j264J929j525
$$ -340 513 -86 -123 417 -360 664 -400 691 -830 737 -650 214 179 -341 305 -959 970 -555
1811e55J237r60M39k76k14N96r27J400j226P31o75R54n58%K37m93N81l73N68q93
$$ -555 682 -278 161 -115 -329 267 -660 740 -486 245 -430 524 -34 -34 203 -290 291 -82 486 -407
1831d07P85j002O05o8L53o41P1O26q20P86o98P52p80J000n25K8L05n05L55p90
$$ -407 378 -624 -19 -87 266 -375 -304 322 -498 288 -410 342 -438 562 37 65 370 -135 220 -570
1851e70J212j359J073n38L83k56K08kr32J505j343J076j114J368r66J15P02j051
$$ -570 642 -717 356 -182 201 -55 153 151 -781 724 -619 457 -657 711 -255 -140 562 -489
1869d89J089j165J246j481J307p03J76Q1l1K30n48R40j283J351r87M91p24N77
$$ -489 600 -565 681 -800 507 -196 -20 61 30 260 -288 652 -631 720 -267 224 -500 77
1887G7N8q08J374j382Q41p00J122j043L49J56k46L17k12P16j260J756j390O64
$$ 77 135 -673 701 -681 160 -540 582 -461 -112 44 -202 115 -97 619 -641 1115 -275 389
1905C89m94L95l80o1Q62j593J366q50Q36j196J131o28o8N42o53N47o89J593j953
$$ 389 -105 290 -90 -151 711 -882 484 -366 470 -726 405 -223 -291 251 -402 145 -544 1049 -904
1924i04J254o66N13l61N5M87r20J230j319J244j161J038j379J117R3j020J220
$$ -904 350 -316 197 -164 -109 378 -542 688 -631 613 -548 490 -889 228 321 -699 521
1941E21j187J127j532K239j673N79r0m18O60p13J605k105J577j251J144q83Q63
$$ 521 -666 461 -1071 1168 -505 74 -16 -434 226 -487 1118 -987 590 -661 483 -400 463
1958D63o08l63J228j388J387j349J497j707J304l84k30N97r22J015j027J495j682
$$ 463 -145 -508 720 -668 719 -630 867 -840 464 80 -150 447 -475 540 -487 1008 -674
1975f74Q21k21J45l59J02O84j296J472q34O61j111J136r18N90o4l18K62k41P91
$$ -674 147 -74 71 -288 -186 498 -798 674 -160 501 -610 526 -392 198 134 -184 78 -163 628
1994F28j370J484j185R57q97Q54n64n23R79j197J423j172J315j445J068m95K6
$$ 628 -742 742 -443 514 -383 471 -93 -616 363 -834 589 -583 732 -713 355 -140 -114
2011a14L31n98P17j322J777j482J023n68M18j87l14R08j335J278r14P47p70J037
$$ -114 217 -381 336 -986 791 -691 332 -236 182 -5 -319 589 -746 532 -382 365 -405 632
2029F32q46J49K27l11L09m93Q64j157J121o47L11j46m5J37n65J077r16P21p09
$$ 632 -214 -65 162 -149 160 -333 531 -626 495 -152 159 13 -32 105 -460 617 -299 422 -287
2048b87M28o29O67k71j64M43M0J56o77O83r49P38k10o4j60K52R4l63O84n26J49
$$ -287 141 -488 179 -92 -256 187 227 383 -294 389 -560 178 -32 -96 -256 -4 90 -273 411 -115 34
2069C4j29L21p15L34LL99k62j37N23q41Q33o01J8L29J8j64j30L62n38J53M11m38
$$ 34 -95 226 -489 -155 -152 247 -15 -152 371 -470 363 -238 -220 109 127 -37 -167 195 -343 -190 221 -217
2091b17K33K80j08m19L67J89m63L54m41J28k58O81p18J52M52l40P2K3L48q12M72
$$ -217 16 296 188 -231 136 325 -138 216 -225 -97 -355 326 -392 -240 212 -128 -56 -33 315 -497 -25
2112b5K20o97O48J19l31J36L15o38M8L68J89p69L97J28m98Q17n38o7L10N45q21
$$ -25 195 -502 146 265 -66 70 385 -253 -205 163 352 -417 -20 108 -390 427 -111 -178 132 677 -144
2133a44J08L57l59m5q5L32o46J024o44j76M88j60k25J76M99j031O43k2l11J44
$$ -144 -36 321 -38 -83 -168 164 -482 542 -102 -278 210 50 -175 1 500 -531 112 90 -221 -77
2153g7M16k91m60R05n10J22m8L20p89N86K25r81O76K10k10n14Q11q62K34N22j09
$$ -77 339 48 -412 493 -17 105 57 377 -412 174 399 -582 94 304 94 -420 391 -471 -237 285 176
2174A76o14N72J16q71R30l19j68J20M72n59n2M41l59j97M59K05j039J216m21n54
$$ 176 -438 134 250 -621 309 -10 -178 -58 414 -145 -197 244 -115 -312 147 352 -687 529 108 -446
2194d46L73J27k35j4M63n98L03N5J71m46N08k55o46R65m78J27rN02q89O60K59
$$ -446 -73 54 -181 -195 268 -330 -27 28 199 -247 261 6 -640 325 -153 -26 -35 467 -422 238 497
2215D97o90K38L43m61k12P79o04l60O55n4n29K75M87q57O97p3n55J84O53n18j91
$$ 497 -193 45 388 -73 -285 494 -110 -470 185 131 -398 -123 364 -493 204 131 -424 -240 413 -105 -296
2236b96Q57p49p7M10J06p19N21N9k29k23P14p67M06O03q12K02M27p99q4P70o8
$$ -296 561 -188 -265 145 251 -468 53 112 -117 -340 374 -393 13 616 -196 6 433 -366 -450 320 252
2257B52l92K72r0k26K54L33o90K40N29p41J51N75m92l24O49j43n37O54rp41N38
$$ 252 -140 132 42 -184 70 403 -287 -47 482 -259 -108 467 -25 -349 300 157 -380 274 265 -476 62
2278F2j7N6l86J044j102J20L78j65j85N08j01o32P49l11k56L55J23m25J82M25
$$ 62 45 101 -285 759 -343 -223 155 -10 -195 313 212 -420 329 18 -238 117 240 -185 -3 422
2298D22r63K34L74jk46L67l0m39J73K09q2J79om34L25J50l10l32O23m42J73L61
$$ 422 -541 -307 67 66 -180 187 157 -282 -109 100 18 197 191 -243 82 232 -78 -410 213 -229 -56 305
2320C05m93K18k18M73l25M8J08k57L03j42n7l23O26n95L73k42M17k93J90J6l93
$$ 305 -188 30 -188 285 -40 8 116 -141 162 20 -37 -360 266 -329 44 -198 219 -74 116 132 -261
2341b61M40l0J0l82N87j107J170n45J09P1r5L5m25Q46q20N07o20R37q27N15K3
$$ -261 179 149 159 -223 364 -743 427 -118 -9 62 -33 2 -423 423 -397 110 -510 427 -400 115 138
2362A38r5K93m02J21p43J323j276P30J7k89J05J15K6n93P56l66K19l22N94n37
$$ 138 43 336 -66 55 -688 635 -641 89 106 -183 -78 37 63 -530 226 -140 79 -243 351 -186
2382a86K39J61m90N39n13N31j023J308j092P66j11k29J15j90N60r70R10p61Q01
$$ -186 53 214 -276 263 -250 281 -742 566 -526 240 129 -100 15 -175 385 -585 325 -436 365
2401C65p33O60n15n4P53q46M05m44N93p66J143o03JM40n29M03n60O79p76P51n73
$$ 365 -368 292 -223 -277 476 -370 35 -409 184 -582 561 -42 -41 399 -130 273 -287 392 -384 367 -206
2422b06N47p28L54K02n59M97l57L90m29P52o83p6K61k21L72l06N35q15Q34p25
$$ -206 341 -387 -33 169 -390 107 -250 140 -289 463 -220 -296 -35 -256 116 -190 345 -470 364 -361
2442c61M60j57K28%n79R65r65O43m57L76n45O32nm92M21m76N87o63P70n79L32
$$ -361 99 -58 170 170 -409 556 -409 234 -223 153 -392 240 235 -257 164 -312 275 -388 382 -197 135
2463A35R7n45M24l30N61q29N63l30L10L4l25M55l72O79p32K6L01O5m49L90l80
$$ 135 232 -313 111 -219 342 -487 76 -254 56 90 -235 220 -152 527 -205 -179 122 187 -262 128 -252
2484b52k8M45k33J79n83N58m5j10L95p94P75m62L51n28L99j50Ok06J40K61j29
$$ -252 -280 165 -68 111 -472 86 41 -69 326 -468 307 -155 196 -332 67 -83 -77 -283 -143 118 -11
2505a1L39q71N54o6N18m33J72l75k38P60n03J31J97Q3l04J85Ro30O77m46O54r59
$$ -11 328 -543 11 -55 463 30 202 -173 -411 349 -154 -23 174 257 -47 138 147 -483 194 -252 402 -557
2527e57R00p65K00M23k52L99n98P66j078J089q27K54J6L46k97k98P69j058P48
$$ -557 343 -422 -222 201 -51 348 -250 516 -562 527 -300 -46 -30 316 19 -279 490 -568 180
2546A80o13P38q99J016m23p6N72m72J66n56J006j264J040j84m50J38J38N68j384
$$ 180 -433 305 -594 422 -1 -77 495 23 189 -367 639 -625 415 231 -219 -81 57 625 -759
2565g59J533q95K32l27L85k77j88N73j046J049n04N55q27R80o53k09P76n46J32
$$ -759 774 -121 111 -216 169 -108 -296 277 -769 280 -224 331 -496 484 -169 -378 398 -148 -16
2584a6k92Q62j085P03l12j06K48qJ06q32J522j224O86l99L26m96K73N48r36O88
$$ -16 -308 554 -531 172 -140 -246 2 -6 100 -732 790 -434 252 -147 179 -317 -44 504 -432 256
2604B56l54J57o07J003j151Q06J41m39K13m32P46j003J147q73L56o6L37l39l15
$$ 256 -98 59 -548 455 -696 110 251 -188 25 -407 339 -664 483 -390 -34 -100 237 -102 -417
2623d17R82j123P62m2L55p90P32m19m01Q29n92M33o82Q16p84L14K34n53J70K09
$$ -417 565 -558 204 162 517 -273 459 40 -361 468 -124 309 -373 443 -341 -27 207 -346 -176 33
2643C3k0n63R55p06M39k66L01k87k26Q75r49N86l14L19m29P49q61L23J17j71K62
$$ 33 13 -550 405 -301 138 -128 173 -114 -340 535 -414 172 -142 177 -252 497 -364 -41 76 -95 167
2664A67n31Q88j179Q86l41p7j15L76J2o64J013p28N41l05K5O4K37p7n44M84l62
$$ 167 -364 524 -655 231 -110 -187 -302 74 86 -578 435 -293 248 -57 -32 32 269 192 -352 132 -230
2685b30N56o89J026r95K67M00l51J31k40L20n30P16q31P06m53L05l69K16L18n41
$$ -230 326 -363 663 -332 -65 335 -16 115 -125 195 -335 381 -450 256 -197 108 -261 -45 273 -268
2705b68M27M8K10q36J035j108N14l09K07J87j82M33p51P25k92P7m29O22m40J46
$$ -268 159 207 417 -419 616 -492 22 -287 -80 107 -75 358 -393 332 40 117 -312 310 -130 16
2725A6K13l45J45k31P56j317J124m37r3K54j64J75n07P22p09R02p78M44k68J80
$$ 16 229 -116 29 -202 554 -763 361 -76 -169 85 -79 96 -411 311 -398 504 -274 170 -98 82
2745H2J70n55O27n57L94p45J127q12L42J70l74J88l67M80n50O92n84K26j77L83
$$ 82 252 -303 324 -233 161 -584 543 -269 73 243 -131 57 -310 170 -380 312 -272 -46 -223 160
2765A60l93K3J95j98L52m42N25o46P02l42K1K93m90K97l16O76q14P33m45J04k09
$$ 160 -233 -210 -15 -213 139 -303 222 -424 278 -64 -43 250 -240 57 -259 417 -397 336 -109 -5 -214
2786b14K45K65o78O25l69N43o13N34m33M25l13l27M21m53M16l22N03o00K40j55
$$ -214 31 296 -382 243 -126 417 -196 338 -95 330 17 -310 111 -342 74 -248 255 -345 -105 -260
2806b60K49j30k46P01n93L28j41J82n8K8O2m16P02n75M75l99K95n22J15M71m39
$$ -260 -11 -141 -387 314 -279 49 -92 90 32 60 122 -294 408 -167 308 -91 204 -318 -203 268 -171
2827a71L50j04l0r8K38k43K24k92J72J8k3K89m48L13l42K74k33K81j48j28M59
$$ -171 179 75 45 -53 185 -58 166 -126 46 64 41 330 -118 195 -147 127 -106 175 27 -101 358
2848C58n31L73m98N49m78O53j09m42K89k21M82o42N63n01N05m28K32rj82K79n85
$$ 358 -173 200 -298 251 -227 426 317 -125 164 -57 425 -217 346 -155 350 -78 154 145 -37 242 -343
2869c43O64p10P81o08M69m18J37J38k42M84n85O64n59L44l46j07K96l60P00p36
$$ -343 321 -389 392 -216 253 -165 -28 110 -132 352 -233 431 -128 216 -130 -237 59 -301 399 -337
2889c37Q58r03L46m7K0O6q0J76m35P15m18K71n21P04o72L85k70j5K17k07M07o27
$$ -337 521 -382 -36 -83 -63 3 -77 99 -336 379 -39 232 -289 415 -257 128 -142 -157 60 -147 260 -367
2911c67L57q0J31j24p5R1m1M06o49N91k89K2p8J49n4j78M58n92M08j03J42j56
$$ -367 -10 -90 41 -83 -158 -67 -108 298 -351 240 -49 -27 -105 44 -10 -188 270 -322 86 -17 125 -31
2933c1P8j45K90j20J28k18J0L82n16J79j01J45k29R7J82k53K74n37N85l43J77
$$ -31 47 -98 192 72 200 -18 -8 374 -142 37 -64 81 -148 -51 131 -122 152 -385 200 -143 34
2954C4K18j78J23k13K62l82K81k90k0J06m6K86j94J55k21K24j01m9l7%J35k87
$$ 34 252 74 197 -16 246 -136 145 -145 -165 -59 -105 181 -13 142 -79 145 44 -5 -42 -42 93 -194
2976a94L30m19L46j64P7k2J11m2n5N7j47N1r9J01L3J81j43k12K43Q6J41n98M41
$$ -194 136 -283 63 -101 -24 -46 65 23 -32 25 -122 -71 -170 -69 -36 145 2 -210 33 119 260 -338 103
2999A03j52k8j49K68J37j85M04n88K42R0k99K51l00L29l85O03l35K86n48N67k24
$$ 103 -49 -77 -226 42 179 -6 398 -190 52 142 -157 94 -206 123 -262 341 6 292 -256 311 87
3020H7k6J3k02O92p86L07j9J9N0j65L35m84M07k34K14l52M93m01O2K37m06L34
$$ 87 61 74 -128 564 -222 85 66 85 135 -30 305 -179 228 -6 208 -144 349 -52 10 247 -159 175
3042A75k03J61l75K46k26M36r5k03M3k93N55o29L81kL23m81J98l8l48N62l09M16
$$ 175 -28 133 -242 4 -222 214 119 -84 -41 -334 221 -408 -27 -29 294 -187 11 -27 -375 187 -122 294
3064B94n44N17k60j84K92k48NK9M93q87J56M76k29J59N1J7m24O79l44o6l56L82
$$ 294 -250 267 7 -177 115 -133 -128 -99 394 -493 -337 139 -90 69 120 137 -287 392 48 -18 -374 8
3086Hj63K57J03n05K60j31L58l85O6L11j59J28k74M07l62Q4k5K12k69M6J07q9
$$ 8 -155 102 205 -300 -40 -171 187 -198 -132 179 20 148 -126 281 -81 3 -22 190 -79 -33 74 -15
3108a5k2o0K92l10R1j76J82l13O70m26k21K15p7M13o00K38m7J9M80m01L33m37
$$ -15 -37 -97 195 -115 -24 -200 -18 -331 339 -87 -308 -93 -170 243 -357 -119 -166 -147 333 -68 265 -172
3130a72K99l90K72J07j60K18k70J00j86L68j19p7K9k26K4L65N0m26O21p45N89
$$ -172 127 -263 9 116 -44 174 -96 4 -182 186 67 -10 19 -207 -183 182 232 -194 427 -318 271
3151B71k52j12k8N9J3l02M48q6j4J86J8k91j26M22n58K48J61L1m03M82j05k04
$$ 271 19 -93 -121 -62 -49 -351 97 11 -3 183 201 -90 -216 206 -352 -104 57 88 -315 167 62 -142
3173a42J64R8j17o7N94p96J92L5K76o04O31j71m64P26p73M32l01O24m18N6M35
$$ -142 22 120 3 -64 530 -266 -74 -39 237 -367 264 93 -371 355 -418 14 -287 337 -81 -25 410
3194D10k55J6k31J45l51N48m85p9O8K60l4J77J19o33O01k41o6K6K26j58m11P17
$$ 410 155 171 -60 85 -266 282 -203 -282 -214 46 12 189 308 -325 276 35 -31 -5 221 63 -348 369
3216C69n71M96k86k6j24K60K04m55M52m37L28q19Q75l88j2N77n54J52p0J20l83
$$ 369 -202 294 8 -18 -142 118 322 -133 319 -118 210 -609 266 -122 -134 443 -111 41 -29 91 -292
3237b92O27m20J88l65L66j09l65P86q92P75l59M41p83O62l73j48J97J62J56n37
$$ -292 335 -85 103 -262 104 -5 -370 416 -476 299 -60 381 -402 260 -113 -261 -64 98 254 -283
3257b83Q72q44O07k22k27J26K7j80k53N87l54M76m04J89l87K66J92l27M00l59
$$ -283 589 -255 352 130 -97 29 56 -124 -377 210 -144 332 -72 117 -270 -4 188 -139 261 -98
3277i8M61q36Q13o61K82K80l66L3j36P44j100P62m78L51K76k48o3j41M46n81M16
$$ -98 363 -473 340 -321 -39 241 -125 -92 -228 516 -584 178 -300 51 327 79 16 -125 321 -260 156
3298A56j96K79m61L31m2j24L13n14K53l40Q92r63L80lp7K71k61P6o53R36n73L00
$$ 156 -40 239 -222 109 67 -57 256 -258 -5 -345 547 -416 -36 -39 -116 155 -106 -30 -683 253 -320 -20
3320b0k74M55k12M6M16o64J89J63J73p34P54j99J9K33j14l1m39P88r15M12o1L0
$$ -20 -294 161 -51 -5 411 -253 -64 99 272 -462 292 93 112 345 231 200 -239 549 -366 46 -15 15
3342A5j50p2J61k34P10o38M44k63L59n70L72J6j90J48j37J11n05P16o80N82k30
$$ 15 -135 -207 -46 -280 430 -208 236 -27 332 -238 134 150 -40 108 -29 82 -423 293 -387 195 -35
3363c5K1J36r5K63n91O52m29K05n08N76n10M38K71o54L64l5R5o74Q87m57J47K71
$$ -35 -14 122 27 290 -301 351 -78 127 -381 195 -315 123 394 -260 104 69 164 -510 377 -80 67 338
3385C38n58J45l24L56j14M07k67j5j23L92k52k15O84k91J8m17L99r4O6k40L65
$$ 338 -220 -75 -399 -43 -157 250 -17 -32 -155 237 -15 -230 454 163 181 -236 163 69 135 -105 260
3406B60j6k78J87k85K64k04J48k8R7q5j42N6n1K78n41P45o44L16k47jL07n58P32
$$ 260 244 -34 153 -132 132 -72 76 48 145 60 -82 -26 -77 201 -340 405 -239 77 -170 -171 136 -422 310
3429C10n22L03m82N48l35l1K31j93K61nj3j68J30O1Q0j88k4R4k86L00j75J75k64
$$ 310 -212 91 -391 157 -178 -209 22 -171 90 85 72 -96 34 95 175 -13 -37 57 -229 71 -104 71 -193
3452a93K71L2m7K6M5J05o57O12l95J41Jo1p0j74M61n45O42k41K61j9k23K90l38
$$ -193 78 110 63 89 134 239 -418 194 -201 -60 -59 -120 -190 -364 97 -448 194 -47 214 195 -28 262 -76
3475g6R4k69P9K18K38j97K08m24l5J78l33L11o9K29k67L08l15PL02j75l82J46
$$ -76 18 -251 -172 46 284 87 295 -129 -164 14 -319 -8 -77 152 -115 193 -122 -115 187 12 -370 -224
3497b24K59j95P8n6K07K4k86L58k61K41j48J55mk46Q9J37J17k46J10l08L51M3
$$ -224 35 -160 -82 -138 69 93 -193 165 -96 145 -3 152 148 -98 -9 128 245 -1 109 -199 152 195
3519A95q3Nk77L28k67J31m6Q6l83M34j70O2j1j65K73j95K65Q0j15l89J37K8L9
$$ 195 112 117 -160 168 -99 32 -14 72 -311 123 -47 15 4 -161 112 -83 182 262 147 -242 -105 -77 -38
3542c8Q2j48K25r0M6k80K81J45k15j89J17K61p43O97p8J71j88o6m5l3J58l57P11
$$ -38 44 -104 121 31 77 -203 78 223 8 -181 -64 197 -546 151 73 244 56 -10 -55 -88 70 -287 424
3565D24n27J29j29j89M07q8J4j69L25l76K59j7l3R0l43M60m22L58k12M82n35K39
$$ 424 -103 26 -103 -292 115 27 41 -128 197 -179 80 63 30 120 -223 237 -185 173 -39 443 -92 147
3587A47j46K2K14m01L06m39N45k44P0j5N4k2J25j12j24L1j20M70o46J88j84L02
$$ 147 1 23 237 -164 142 -297 248 4 74 59 113 91 216 104 -20 11 -109 361 -285 -97 -281 21
3609B1J01q2R9l60K59l50N92n98K81J35p4K54o03O21m00K99m84N64k46j10J50
$$ 21 122 40 139 -221 38 -312 280 -318 -37 98 24 278 -325 296 -104 195 -289 275 29 -81 69
3630F9l96M28l78M91m18K87l65L49k7k43K31l01L82n14M84k29L77k47j70m4O2
$$ 69 -327 101 -277 214 -204 83 -282 67 40 -203 28 -273 109 -405 79 -150 227 -20 -190 -234 -172
3651a72L56m78L06n6l9K05q4M7k26p4N1L84k60M00o03J33kK94k06j43L44r0P3
$$ -172 184 -294 12 -44 -83 122 38 85 -141 -215 -164 220 -40 360 -243 -110 -112 182 -24 -167 177 87 160
3674A60m59M19k04J7j86K30R5L8L1l64J91q6K63k80J36o8K0M16k37M2k61O0O0
$$ 160 -299 120 -84 -67 -253 -23 72 110 141 -223 -32 -118 145 -135 1 -67 -47 369 132 174 -87 -27 33
3697C3J25k39J01j83PK54k72J00k6K37j16K8q0j70L50l71R8J01o5J02K38n29L28
$$ 33 158 -81 20 -163 -156 98 -174 -74 -100 137 21 49 -31 -201 149 -222 -124 -23 -88 14 252 -277 51
3720E1L6J75l68J46j8l0J61l38L65k89J2PKJ53k84J51J23Np6K63j79n1J8j20J34
$$ 51 87 262 -106 40 22 -8 153 -185 180 -109 -97 -90 -88 65 -219 -68 55 60 -16 247 68 17 35 -85 49
3745D9k37K24L8j68j2k08J22L7M05m69K32n8q2K65jr3l16L74l6j56LM34l38RJ8
$$ 49 -188 36 74 -94 -106 -314 -192 -155 250 -219 13 -45 -127 138 137 44 -272 102 66 -90 -87 347 9 18 36
3770C6J57j37J89n2l30L00Oj84N7q4j99M74n9l45R2K12p5m9l4o9kK0J64J71l89
$$ 36 193 56 245 193 -137 163 169 -15 42 -42 -241 233 174 -171 -79 133 58 9 -25 -94 -96 -76 88 259 -130
3795a30M5K89l48O6r3M10k55J10N0k79O7K01o1l91J89K5J70q1m1J55j82J95l64
$$ -130 -85 204 -144 -78 -171 239 -16 94 144 -135 -68 133 72 -319 -130 -105 65 -16 -57 98 -84 111 -253
3818b53L37j25J42%j35l1j83J50J67kJ14k21J93j95Qj6O5Qj3N2n5r5k36N05m28
$$ -253 84 -41 101 101 -34 -65 -248 -98 69 67 181 -40 153 -42 -34 -50 15 23 10 62 7 -88 -324 181 -247
3843b47M82k17J05J4l2o0o8J22k3J35l16J86n3n8k7L46l97K21K74l02j93j4J68
$$ -247 235 18 123 137 105 45 -23 99 76 211 -105 81 28 -30 -57 289 -108 113 387 85 -108 -122 46
3866D6j70K55l9l7k45O13l7l44N3k38L89k55K04m52L54k53J79J08j04L00m78L26
$$ 46 -124 131 92 55 -190 423 386 42 95 -143 246 -9 195 -257 97 -156 23 131 27 327 -151 175
3888A75l25K83Pn18M34m8Q1n6n6k77N15k42J05j14k7K00k79P4J15P2l40K45j91
$$ 175 -150 133 140 -378 56 8 89 33 -23 -300 215 -27 78 -36 -63 137 -142 -68 47 119 -221 24 -167
3911a67K65m32M51o4j17K10j52N7k10K51n8L0J45l94J81m5p6J02K33j74j14L04
$$ -167 98 -334 117 53 -64 146 -6 51 -159 92 34 64 209 -185 -4 -49 -125 -23 210 36 -78 226
3933B26k02j63j3M45k88J47j97o3QQ7n9NJ20j60K51l38L26m45M61p6o0j03j32
$$ 226 24 -139 -152 293 5 152 -45 -108 -100 -13 -72 -67 53 -107 144 -194 132 -313 148 72 12 -91 -223
3956b23K25k45J63j44M06l58L38k19L02o3l09L43l21K58j77K33l56K11j58J76
$$ -223 2 -243 -80 -224 182 -176 162 -57 245 182 -127 216 -105 153 -24 209 -147 64 -94 82
3976H2J08k62J14j94K42L7j25K15m24M8M2J37k27J69J46j56pJ3K29L4j76j00J76
$$ 82 190 -72 42 -152 90 127 2 217 -207 -159 -117 20 -207 -38 108 -48 -55 -42 187 221 45 -55 121
3999A21k45K56l90K43m5k87L82j41K16l34Q1P0K53j54o1L2K76j74q2J0j86L65
$$ 121 -124 132 -258 -15 -60 -347 35 -106 110 -224 -143 -73 180 26 -35 -3 273 99 17 27 -159 206
4021B06j37q4K14j70j0Ml3l4J21l06L9K43J9j66K67j21k9j18L3K06m0k60J23J66
$$ 206 69 -15 199 29 19 23 -10 -44 77 -229 -190 53 72 -94 173 52 23 -95 -62 144 104 -156 -33 133
4045A33k29K47Lj96k32K00Q0K4L5M1k27J62j56K8%m3L8K70k49J09jK3l18K29J9
$$ 133 -96 151 154 -42 -274 -74 6 30 65 106 -121 41 -115 -87 -87 -130 -92 178 -71 38 37 60 -258 -29 -10
4070a0LJ78j70K21k55q6L89k00R5k94L8J18o7k04J80k8k19M48k22J48j18Q4j43
$$ -10 -7 171 1 222 -33 -119 270 70 165 -129 -91 27 -40 -244 -64 -92 -311 137 -85 63 -55 29 -114
4093a14k8R9j2J77k06lQ8j69K6J22J51L3l80L72k13k49M58r5K2p2j30J56r2O8
$$ -114 -142 -43 -55 122 -84 -87 1 -168 -142 -20 131 164 -216 156 -57 -306 152 57 79 7 -123 33 -59 9
4117IpP7j45M4m9J37lK6Ol02l0L4K06j17O0j2r6JJ15J23k72K94p1J13ok07j78
$$ 9 2 79 -66 -22 -71 66 63 89 95 -207 -237 -203 3 -114 -54 -66 -162 -161 -46 77 -195 99 28 141 135 -72 -250
4144b50J95N4j23K41n1K0k91J46Nr7K17O2L1k07j07J76K2K9j39K24j90j23L40
$$ -250 -55 -1 -124 117 66 86 -205 -59 -54 -151 66 128 159 -48 -155 21 43 72 -67 157 -33 -156 184
4167A84j26k22P8J92j54J34k71L15m1J74m25M53k03J30j66J1j41q9M8K84k85j14
$$ 184 58 -164 -86 106 -48 86 -185 130 89 263 -162 291 88 218 52 63 -78 -167 -119 165 -120 -234
4189b34J78R2j28J05K9j51K7J14k6J96j75PKj12J92l78J86k3K82j27J6p1J92l60
$$ -234 -56 36 -92 13 42 -109 -82 32 6 202 27 34 36 -76 116 -262 -76 -99 183 56 72 1 193 -167
4213a67J41j40J21O8J81j76O3J22r0R7n3l01J11J74k29J27j00K61l26K76l92L34
$$ -167 -26 -166 -45 23 204 28 91 213 123 220 167 -134 -23 151 -78 49 -51 210 -116 160 -232 102
4235A02Q1j39J5J71l16k16J66M8K56jk36O5J5q2n0o3J94L3l56M62j67J45r3j55
$$ 102 183 44 59 230 -86 -302 -136 -88 168 167 -69 -4 11 -71 -121 -184 10 43 -313 149 -18 127 34 -121
4259a21j16O7OJ79J50k12K31j75M67j72j90j13p7%Q6M2l86L78k55O6J32L02j89
$$ -121 -237 -170 -164 15 165 -47 184 9 476 304 114 1 -76 -76 10 52 -334 44 -211 -145 -13 289 100
4282A00L7Q4m84JK18L26m89K51j02N2j42L3J77r2Pq8K61j7L4k05P7j15j47L26
$$ 100 137 221 -263 -262 -44 282 -207 44 -58 -6 -148 -115 62 -30 -23 -111 150 133 167 -38 39 -76 -223 103
4306A03j75Ln1J55J84j82K45k24J42j58K00k7j42J7k4q1M0J00l2q8l11K13K23
$$ 103 -72 -69 -120 35 219 37 282 58 200 42 242 215 73 90 66 -15 25 125 93 5 -306 -93 130
4329A30r6p4k03L45O4k10l6QK16j57o2N2L8o8N0J37r8MR8k93L84l65K83j72K7
$$ 130 34 -40 -243 102 166 -44 -80 -72 144 -13 -75 -23 15 -53 -3 134 36 40 138 -155 229 -136 147 -25 2
4354BJ71m35K01Q6J00j95K64j24j24P8j92P3J6K39k35K6rJ93l0j60p7L13k79J72
$$ 2 173 -262 -61 25 125 -70 194 70 -54 24 -168 -95 -79 160 -75 -49 -58 135 105 -55 -132 181 -98 74
4378G4j56j31M94m11K05k9j20j19K77rk05J63q5J17J60J32j43l51K07l4n6K34
$$ 74 -82 -213 281 -130 75 46 -74 -193 84 75 -130 33 -52 65 225 357 214 -137 70 36 -20 214
4400B14k8k08k73J45L37o9l1M4L0n5K9m1M0K1l03L54j4l27K63j48j36J99k69J85
$$ 214 186 -22 -295 -150 187 118 87 131 161 106 135 94 134 155 -148 206 192 -135 128 -20 -156 43 -226 -41
4424d1j86P9K81qj93J39Q9m89K85J66m10Q8m3K14J42J06k18J56l0K1k86K53j02
$$ -41 -227 -148 133 125 -68 71 160 -329 -44 122 -288 -200 -243 -29 113 219 1 157 127 148 -138 115 13
4447A3J16j07o6K15k72L2k1J77j02j85K27J95r5k58K39j21K5M6j79o4J85O6l50
$$ 13 129 22 -44 171 -101 -69 -90 87 -15 -200 27 222 127 -131 108 -13 12 58 -121 -185 0 66 -284
4470b84L73m2Q8k78K49p3l40L35j50K80K5j11j3pj63O3J52m9K53l70K48o23L94
$$ -284 89 47 135 -143 106 33 -307 28 -122 158 183 72 59 52 -111 -48 104 55 308 -62 186 -437 -43
4493d3l9k27L34l43K13J51o4j8M0J18k23j41K14j07J56j4J05j67K3lp1J94k17
$$ -43 -82 -309 25 -318 -105 46 -18 -36 4 122 -101 -242 -28 -135 21 7 112 -55 -32 -35 -106 88 -129
4516a29K23q3O8J48j40J1j51J55k82J73m8r5M55n74L11k22L89m04J50K25k38m
$$ -129 94 11 79 227 87 98 -53 102 -180 -7 -55 -150 305 -269 42 -180 209 -195 -45 180 -58 -62
4538f2j52K61j09M28n14K24k7J92l32j84L73K5J5l87K28j95J63l6J86K1k34K4
$$ -62 -214 47 -62 366 -148 76 49 241 -91 -275 98 123 138 -249 -21 -216 -53 -89 97 118 -116 -92
4560i2j55L92k22L34l22K0J75j36L2R0k1k54K93p7j94J23O1j19k4J69j82K80m14
$$ -92 -247 145 -77 257 -65 -45 130 -6 26 116 95 -159 134 57 -137 -14 47 -72 -96 73 -109 171 -243
4583b43J39l5K95M4j02J69l08O6j68K10k48M34l47mJ37q1J2N7m8N6k22J15J22
$$ -243 -104 -139 156 200 98 267 -41 25 -143 67 -181 253 -94 -98 39 -42 -30 27 -21 35 -187 -72 50
4606E0kj86N6P8K00M2j06N2n6j45L17l08j21n1J88P0l94O50l26k44K44q7J94m18
$$ 50 48 -138 -82 -4 196 238 132 184 128 -17 300 -8 -129 -180 8 78 -316 334 8 -236 8 -79 115 -303
4630c03M72j04K4l66N17o9l29M28l21K23k22J15j55K30L8j33O0k39QK05Q9r7j7
$$ -303 169 65 89 -277 240 171 -158 270 -51 172 -50 65 -90 140 178 45 105 -134 -126 79 168 71 54
4653E4nj36PJ61M8k03O0o3J04r4J60j82J82j70j01j1o8L81k52M52m80K61P7J54
$$ 54 49 -87 -80 81 129 -74 -14 -77 27 -67 93 -89 93 -77 -178 -189 -257 124 -128 324 -156 105 182 336
4677C36m55K53n5m14L00j02J27%N6P6l13K87o0l0k20L26kQ0k46j39K88l07L63
$$ 336 -119 134 79 -335 -35 -137 -10 -10 46 122 -191 96 36 6 -214 112 110 190 -56 -195 93 -214 149
4700A49j34RJ16j95p9m9K03k35M4J35r9K11l91K54J33R2k25l3K63j96m9JJ14j20
$$ 149 15 24 140 -55 -134 -183 20 -215 -171 -36 -135 76 -315 -61 72 164 -61 -94 169 -27 -76 -75 39 -81
4724h1r7P5J59k0n3P1r3p2K53j73j7Q0L2j65J20Q4k79K75j25j13J10k48K39J15
$$ -81 -178 -103 56 36 -17 54 -39 -111 142 -31 -48 32 64 -101 19 103 -176 99 -26 -139 -29 -277 -38 77
4748G7k21K85l5r7N9j39p3L47j86L11l69QK24j68Q0M7j2j8q8o2l3L8k1k9O8k24
$$ 77 -144 141 106 9 68 -71 -144 203 17 328 -41 -33 191 23 103 150 138 120 32 -30 -63 -25 -46 -75 -7 -231
4774b31L81l20M7M03k80J92%j55j72J5k4n5L47j73m3L26j14n8o0j9m2J14j70J15
$$ -231 150 -170 -123 280 0 192 192 37 -135 -120 -144 -199 148 -25 -68 258 144 86 26 7 -35 79 -91 24
4798B4j5MM3J52j07j66J8m4Q6j44L46l26J21r1j19L66j17Q7j25k0J27k81K75k4
$$ 24 9 13 56 208 101 -65 -47 -91 -5 -149 197 -129 -8 -99 -218 148 31 118 -7 -27 100 -181 94 70
4822G0M3j21j74J45p3K03m45L57Q6r2r4O0l1J53j6j35K22m43L94k4r1Jj69K38
$$ 70 113 -8 -182 -37 -110 93 -352 5 91 -1 -95 -35 -66 87 71 -64 158 -285 109 85 -6 -5 -174 64
4846F4j11l8J10L5l85M36pj55J79R5l67J04j02M2P8j7O7J84m22K88J66l93j8N1
$$ 64 -47 -85 25 60 -325 111 104 -51 128 223 -144 -40 -142 -100 -22 -39 28 212 -210 78 244 -149 -167 -116
4870a16r1L69j97K53k31J21q4M1N8j86m6J43j45lK11k18l0K94m0M7j5n2k83K16
$$ -116 -207 162 -35 218 -13 108 24 65 123 -63 -109 34 -111 -114 97 -121 -151 143 103 150 135 83 -200 16
4894A6J79o8k37J50j16J68j72N8J71l37N7M20k03K18k51O8l94K46j14J9j15L12
$$ 16 195 127 -110 40 -76 92 -80 -22 149 -188 -131 289 86 304 53 121 -273 -27 -141 -122 -237 75
4916G5N1o7O9j89J78p1p9O9N0j04j0Q5k00L03j77o8J73j95N8n0J15N5m0L9j8k4
$$ 75 126 59 128 -61 117 46 -33 36 86 -18 -28 57 -143 160 -17 -85 88 -107 -49 -99 16 71 31 70 52 28
4942B8k40L63Q4k00jk27K95m5n1r1J71K10j72n7j54J02k6R3OJ68l59k2R4N8J05
$$ 28 -212 151 235 35 34 -193 102 57 6 -85 86 296 124 67 -87 15 -11 82 88 256 -103 -125 -31 27 132
4967A32k12K26k39J77j51Q2J09k3n6O3m2k17L86j78k47L6LJ41j32J50p1J42K9
$$ 132 -80 146 -93 84 -67 15 124 101 45 108 66 -151 235 57 -190 -154 -151 -10 -142 8 -63 79 108
4990A08l45M80m1j83r7J0J41Q7l60j07L67j2q8K41j24j55M8R6j50K28j19K76m81
$$ 108 -237 243 202 19 -78 -68 73 160 -200 -307 60 48 -40 201 77 -78 -30 66 -84 144 25 301 -180
5013a80J69m1k24Q6K50k15K34J4k66Q5P8j03P1J17p7J82j35P1M5K0R4l76K25r3
$$ -180 -11 -52 -276 -190 60 -155 79 93 -173 -88 -10 -113 -42 75 -2 180 45 116 161 181 275 -101 124 31
5037C1l5K2K9J49m2j02k78L15l54J58J7J15j13J5P7J18lq9J21j30j11J85m1n3
$$ 31 -4 18 47 196 154 52 -226 89 -265 -107 -90 25 -88 -73 4 122 119 30 151 21 -90 95 54 1
5061Aj69J76j90K57j66J75j31J80j33Q8o8m8J9j83M17l05J27O8Rq0k6k44J0K32
$$ 1 -168 8 -182 75 -91 84 -47 133 0 88 20 -28 -9 -192 225 -80 47 115 124 44 18 -226 -216 16
5085A6M7J66o1k91J93j83P7M6Q3j47K68j82kN3k38K49k51K15j62k13K63N1J62
$$ 16 63 229 168 -123 70 -113 -36 10 93 -54 214 32 30 83 -155 94 -157 58 -104 -317 -54 -3 159
5108A59j24m08O40l19L48q9l60K93j42j47J14r0P5L7j0mK16k53kq6J76J31j92
$$ 159 35 -373 267 -52 296 207 -153 140 -2 -149 -35 -125 -50 -13 -23 -27 189 -64 -66 -152 24 155 -37
5131c7n5J2J25J12l2l45J23K40k50J10P3K0j94k13N26k47Nj14L59j91p3j9lo6
$$ -37 -92 -80 45 157 125 -220 -97 143 -107 3 76 96 -98 -311 215 -32 -27 -141 218 27 -46 -65 -68 -134
5155a34J9J54k2K9k02K24k00M03j28l98J02J96m5j23K47j27R5J28j80J3K3Q5n3
$$ -134 -115 39 17 46 -156 68 -132 271 143 -255 -153 43 -2 -125 122 -5 90 218 38 51 74 159 106
5178A06j10P1k06K90q7J02p0j54k04K38q7k9K05j3p1J77k72k21M33k15Q7l3K93
$$ 106 -4 67 -139 151 64 166 96 -58 -262 -24 -111 -140 65 52 -19 158 -114 -335 98 -117 -30 -63 230
5201B30l51l6K20k33K81j86R1Q6k0j09p0R1j45K84j15j50L47l17K3Q5mL47m21
$$ 230 -121 -157 63 -170 111 -75 16 102 82 -27 -97 -6 -151 133 18 -132 215 -102 -79 6 2 349 -72
5224g2J07j31L7m7J57P6j73K24K0l06k4Q6O7K2l9MPJ27j67l3j3J83j20j67K3R0
$$ -72 35 -96 -59 -106 51 127 -46 178 198 -108 -132 -46 21 43 4 8 15 142 -25 -58 -71 112 -8 -175 -152 -62
5250f2qJ05j35q4K61q8q2J02J27j87O3j80K00l6J76mJ05p0k25K3l00L04j80P7
$$ -62 -70 35 -100 -184 77 -11 -93 9 136 -51 12 -168 32 -4 172 168 273 203 -22 1 -299 5 -175 -98
5274i8J55r6K62j78q3J36j56q3J96r0K8l00K34P9J5p0K9J84M9j63lp0J42k38J35
$$ -98 57 -39 223 45 -38 98 -58 -141 55 -35 -7 -307 -73 6 21 -49 -20 164 213 50 47 -23 119 -119 16
5299A6j32L3J37K8r8R6j60j87M31l80K78k89M08k93Q4L4K52j81q7k12P1L14j68
$$ 16 -116 -83 54 82 -16 80 -80 -267 164 -216 62 -227 181 -112 -28 6 258 77 -10 -222 -151 163 -5
5322ej6j26K36j34K52m30P4J92mr4L2J38j11N5j55j23L45m2j95j63K38j14J35
$$ -5 -21 -147 89 -45 207 -223 -149 43 39 -55 -23 115 4 59 -96 -219 126 84 -111 -274 -36 -150 -15
5345a5p1J59j22n1J41N1j87L4o2Q2J74l42J34J33RJ52k30Q3j39k3J84l5Jk8k72
$$ -15 -86 73 -49 -100 41 92 -95 -61 -123 -41 133 -209 -75 58 67 219 -11 72 -67 -90 94 59 60 32 -240
5370b40L02j75J25j3n7J76p9K3Pk0q1o6R5K4k5j91J23pJ85j33N2k17K68K2j35
$$ -240 62 -113 12 -1 -58 118 39 62 69 49 -32 -98 -3 21 -4 -195 -72 -79 106 -27 25 -192 76 98 -37
5395c7QK73k20r6K37j33P4l03K83m8k67K21j22K67N3k64K56N6r1p9m4k61L55j23
$$ -37 -29 244 24 -72 165 32 106 -197 86 38 -229 -8 -130 137 190 -74 182 238 147 68 24 -237 118 -5
5419eJ24j96j45L3M10j30o3Q8J20m82J81rm7J74J02j30O4j29J45Kl3j2m5Q6K0
$$ -5 119 -77 -222 -189 221 91 28 116 236 -246 -65 -74 -121 53 155 25 89 -40 105 107 74 62 17 103 123
5444A23nnk50j42M36j76L6p8J09j11M3n5P5j70O2L12q3l28J76J1j2j2J72K9k03
$$ 123 118 113 -137 -279 157 -19 17 -61 48 -63 -20 -75 0 -170 -108 204 121 -207 -31 -20 -32 -44 128 157 -46
5469d6j1Lj94J27J1J34n2O9j29J74j89J44P0M5p6k91M09r0Q0n9j42l5M5l9K74
$$ -46 -57 -54 -248 -121 -110 24 -28 41 -88 86 -103 41 111 156 80 -211 198 108 188 129 -13 -48 -3 -42 232
5494B32k17R5j8j0M3j41L4N8lp9r9j25J89L6J82j30K7P3j18j14m9K55j87J62j23
$$ 232 15 110 92 82 125 -16 18 76 73 -6 -105 -230 -41 -5 177 47 74 147 29 -85 -134 121 -66 96 -27
5519b7Q6l1j15M7J71l68K68J34K4k94K12j52k9N7L8j81Q9j6n4L62j46K0l4J66
$$ -27 59 28 -87 -40 131 -237 31 165 189 -105 107 -45 -74 -17 21 -160 -71 -87 -141 221 75 95 61 227
5543B27k23J18k68L16n5j61J11j76J19k03L26j68R6q4j87J64J41j62P3J08j44
$$ 227 4 122 -146 170 115 -46 65 -111 8 -195 131 -37 59 -25 -212 -48 93 -69 4 112 -32
5564c2K38k0k42L42m04Q7O1j7p8J34j32j8J03jj69KJ64k92K7K88L3L6q9l9Q0j54
$$ -32 206 186 -56 286 -118 -31 30 13 -65 69 -63 -81 22 21 -148 -146 18 -274 -247 41 74 110 21 -18 62 -92
5590i2r7j2J15L76k24L0J05j32m42K37K56k11M0p8K82o6l43K0J01l5NJ11N6O6
$$ -92 -189 -201 -86 290 66 96 201 69 -373 -136 120 -91 -51 -129 153 87 -256 -236 -135 -170 -165 -54 2 68
5614F8k6k59N29j28k00K20j43k59O0P3N2k08K1J14M23n05o1K83l0j20K30j17J41
$$ 68 42 -217 312 184 -16 204 61 -198 -138 -65 -13 -221 -200 -86 337 -168 -229 54 24 -96 134 17 158
5637A58j61J3j00P7Q9n8J72k92K61k18j63J23r8L92k06l2Q2k15l7J87J59n56P2
$$ 158 -3 10 -90 -13 76 18 190 -102 159 -59 -222 -99 -197 195 -11 -43 39 -176 -213 -26 133 -423 -351
5660c51M53l65L39J22l6j54R4j22n7K46o9j34m1m0K10l57K87k13J4J66o8J16J5
$$ -351 102 -263 76 198 162 8 102 -20 -77 169 100 -34 -75 -115 95 -262 25 -188 -174 -8 -76 40 55
5683E5j32j76J83J26Q4j4j52J10n9j1J16j80Q3k33l3R9n6K01k27L63k76R5k3L5
$$ 55 -77 -253 -70 56 140 126 -26 84 25 14 130 -50 33 -200 -233 -134 -190 11 -216 147 -129 -34 -57 -22
5707b2k5J80p3r5j11J90L9K19m09Q9o3J9J71l22K95J19j00R0j68j94J78j8O9J02
$$ -22 -47 133 60 -35 -146 44 83 302 -107 -18 -81 -62 109 -213 82 201 101 191 23 -171 7 -11 58 160
5731A60j48l23L57j25O2J4p3K5R8l43O8K02Q5Pr5J9J02j9l3q6m3q0K74r0k22q
$$ 160 12 -311 46 -79 -17 -3 -76 -51 47 -296 -228 -26 59 66 -29 -10 92 73 40 -46 -89 -169 105 15 -207 -215
5757b15J38J07P3kl94K86r8r0N9J75L8j14O8K67k58n0r8K87k60j37L19l8j69j4
$$ -215 -77 30 103 101 -293 -7 -105 -195 -136 39 77 -37 31 298 40 -10 -108 179 -81 -218 101 63 -106 -120
5781a20J82J21k50K06j23j75K04j49K13jm6J53l09m0J39m4k44L73j80M3K17j56
$$ -120 62 183 -67 139 16 -159 45 -104 109 108 62 215 -94 -134 5 -39 -283 90 -90 -47 170 14
5803A4j42N5J08K95m85J02J12p8N1m8j5j77M0K72K11l02J71k95K06j31J14J72
$$ 14 -128 -73 35 330 -155 -53 59 -19 32 -16 -31 -208 -168 104 315 13 184 -111 95 -36 78 250
5825B50n9k29J06j79M50k25RJ21k00j58J3J16O7k10K03j48j33P1J36K28k36K0
$$ 250 191 -38 68 -111 339 114 123 244 44 -114 -101 15 82 -128 75 -73 -206 -135 1 229 -7 13
5847A3k9J27k48J95K98l33j23q8J18lK49k69M8Q5l05J24K90l8l56Q0K08j82J50
$$ 13 -16 111 -137 58 356 23 -100 -188 -70 -73 176 -93 -45 40 -265 -141 149 111 -245 -165 43 -139 11
5870A1j10l2L51l80K53k6pk34L51o7K5J0k95J64j35J86j41J63K03j23k08J87j25
$$ 11 -99 -131 220 -160 93 67 60 -174 177 110 135 145 -150 14 -121 65 -76 87 290 167 -41 146 21
5893B1J11J44k80Nm8K1l30J81J52k6k83N28j59K80m65K31m7R1k15P3nl72K85J61
$$ 21 132 276 -4 1 -47 -26 -356 -175 -23 -49 -332 196 37 317 -148 83 36 127 -88 -15 -20 -392 -107 54
5917E4P6r6k49K52q1k24J91Q4Q1RR5k29L5MJ37O0Q2k51j18K53j32P9l06O5J06
$$ 54 130 34 -215 37 -44 -268 -77 7 88 97 192 -37 -2 2 139 199 281 30 -88 165 33 112 -194 -129 -23
5942b3o7k0Q4K61j05j66J63M6j93j6m5Q6o3M2K25l99J64J05J77j72k80M9M49l63
$$ -23 -90 -110 -26 235 130 -36 127 173 -20 -36 -81 5 -58 -16 209 -190 -26 79 256 84 -196 -147 302 -61
5966f1J09k06J23k0K98K2J2l08j7l7j72Q1J88l23J77J28K19j81J71q3n8k21J82
$$ -61 48 -158 -35 -55 243 265 277 -31 -48 -85 -257 -176 12 -311 -134 -6 213 32 203 120 62 -159 23
5989B3j23M1J28J7p9k31m2M08j93l6K03q9o3j32K06RQ1j15O1n1O8j3j27L48Ll02
$$ 23 -100 -59 69 86 7 -224 -266 142 -51 -87 116 27 -36 -168 38 47 128 13 74 23 91 78 -49 299 302 0
6015@l8m8P4L9qk38K28j31J37l7l20L23j9M0K01Rk40j25P3O3M1J40k72K31l90
$$ 0 -38 -86 -12 27 19 -219 9 -122 15 -22 -342 -19 -38 2 203 212 -28 -153 -80 -17 24 164 -108 123 -267
6040b67J58O7Rn8J14J11K1l48K36r4K38k08oK13k41J56l41J1K11j01PoJ37J72
$$ -267 -109 -42 -33 -91 23 134 155 -193 43 -51 187 -21 -27 186 -55 101 -240 -229 -18 -119 -112 -118 19 191
6064A91j20J84k85K21j34l3N1m18M17j41J4j31kL26j69o2J57O3k0k24J39K76k75
$$ 191 71 255 -30 191 57 24 75 -343 74 -67 -53 -184 -186 140 -29 -91 66 129 109 -115 24 300 25
6087B5r8j55K53j22J37l2k1n9K40l34J53K68m51J05J75O0j31mk5LK34j08n02N44
$$ 25 -73 -228 25 -97 40 8 -13 -72 168 -166 -13 255 -196 -91 84 144 13 9 -16 -13 221 113 -389 155
6111A55k9j45L4q8Q4N7j5J38p5n86L99j9O6j41L10o0O4pq9P7k31K19j41J95j88
$$ 155 126 -19 15 -73 11 68 53 191 116 -470 -71 -90 -24 -165 145 85 149 142 53 130 -101 118 -23 172 -16
6136a6J28J18k60O0O5j35k8O9j47J71J88k90m0J05j37L78k46j94L41k08J03l16
$$ -16 112 230 -30 30 95 -40 -68 1 -146 25 213 -77 -117 -12 -149 229 -17 -211 130 -78 25 -291
6158b91K89J79o4j25J3J59r9j17M02k72j17K66j85J38j40l36K77K00l24L2K33
$$ -291 -2 177 113 -12 1 160 61 -56 346 74 -43 223 38 176 36 -300 -23 177 -147 -115 118
6179A18j36J92j10l05J33J83j93J92mj59l7j50L35p9J39k27K9j11L38j31j23O9
$$ 118 -18 174 64 -241 -108 75 -118 74 70 -89 -126 -276 59 -20 119 -108 -79 -190 148 17 -106 -37
6201c7j10J17J98N1j06j32k23j0L72J23m21j3J25q8J22o6K75j68LJ3ql4J72j85
$$ -37 -147 -30 168 219 113 -19 -242 -252 120 243 -178 -191 -66 -154 -32 -98 177 9 12 25 17 -17 155 -30
6225c0j18K17k89L39j70J10L7K8k80K33k77J44j5J21m6O8J82l77J64O7k2Qk71
$$ -30 -148 69 -220 119 -51 59 96 124 -156 77 -200 -56 -71 50 4 72 254 -123 41 108 86 94 -177
6248a77O1m8K83N1p2k00J8M7R8q7N0l7mj4q%n1P1M3M1j69J49L5J26r8J03j04j27
$$ -177 -116 -164 119 170 98 -102 -84 -37 61 -26 24 -13 -17 -31 -39 -39 -90 -19 24 65 -104 45 80 206 108 211 107 -20
6276b0m8J80m6l22J40K12l07N9Q1J70l30K8K83J53l09n1J58R5j0K7l15K78j57
$$ -20 -68 112 66 -256 -116 96 -211 -152 -71 99 -231 -203 80 233 -76 -127 31 126 116 143 -172 106 -51
6299e1j11J75q1K12j07q1o9L01j10l38J48M4j63L30P3n6k8L4k29J12n3j61J08
$$ -51 -162 13 -68 144 37 -44 -113 188 78 -260 -112 -68 -231 99 172 116 88 122 -107 5 -48 -209 -101
6322a01M3J33j23j6j14j15N12j95J10k75J22J70k34K18p4J73k53L71m83J98P6
$$ -101 -58 75 -48 -64 -178 -293 219 24 134 -141 -19 151 -83 135 61 234 -19 352 -131 67 143
6343A43j76P8j69J64j49N6q3O0K43j28j93oJ60pm2J38J6L9K50l06n2K81k08ok06
$$ 143 -33 45 -124 40 -109 -53 -136 -76 167 39 -154 -160 0 -7 -49 89 105 144 394 88 36 317 109 103 -103
6368a03J82j85r7K16k4j44O6J9K9J76m37L48nMk8J01q5J50j99K51k91k37N32l01
$$ -103 79 -106 -203 13 -11 -155 -89 -70 -41 135 -302 46 41 45 17 118 33 183 -16 235 -56 -293 239 -62
6392f2N4J51J40n54M42P8j16j29k5R6j76L54k68j83M39q6J2k65K04Rq5j86K32
$$ -62 -8 143 283 -271 171 249 133 4 -21 75 -101 253 -15 -198 241 155 167 -98 106 115 30 -156 76
6415G6K36l35Oj40J18K14l32r5L01j1j84K49l8p3J19k94J85o4J86k22k64N79j74
$$ 76 312 -23 -17 -157 -39 175 -157 -252 49 38 -146 103 65 -8 111 -183 2 -62 124 -98 -362 217 43
6438D3l16L27J78j67k7K37k63k71L7M09k6j49j93N7J72j4r7J90j90J76lM2pl89
$$ 43 -273 54 232 65 38 275 12 -259 -222 187 161 12 -181 -124 48 34 -63 127 -63 113 110 152 145 -244
6462b44K19p4Q0Ok4J02p6K75j91K00l91K71k45P4P1%N2Pm81L19K0O3pq5R4p8j89
$$ -244 -25 -99 -19 -13 -37 65 -11 264 73 273 -118 153 -92 -18 53 53 105 112 -369 -50 -30 33 26 -59 35 -43 -232
6489b32J95r9K15l76L82n4j52J45k95L48k8O5J02Pm56M54j95J11k33J32J34j92
$$ -232 -37 -136 79 -297 85 31 -121 24 -271 77 49 114 216 223 -233 221 26 137 -96 36 170 -22
6511b2J01o1k11J22L3p4L39k45j2O6K29l89J45L94m08N3K8O0J35m02L88j29j29
$$ -22 79 18 -193 -71 -38 -112 227 -18 -30 36 265 -124 21 415 7 60 88 148 283 -119 269 140 11
6534A1j61L98l49N9L59l83j5o1J95k84J27J97J9J6p4o4k0RK27j09k4J2k47l6L82
$$ 11 -150 248 -101 -42 317 -66 -81 -142 53 -231 -104 93 112 128 54 -10 -30 -21 206 97 73 85 -162 -198 184
6559A84j22k02M78k84l4l38M30j67J91J38k47o9P1j18n2L15k28J16J46j23j69
$$ 184 62 -140 338 54 20 -318 112 -55 136 274 27 -42 29 -89 -141 174 -54 62 208 85 -84
6580h4L37j10k30L44p0j80O9k94N8K38J71l30j2J12k57L87n5j61J46R6k90j58
$$ -84 253 143 -87 257 187 7 76 -218 -160 78 249 -81 -93 19 -238 149 94 -67 79 175 -115 -273
6602b73K94P3r0l16M07k4r3P9j8q4L2L1Q4m6k35n2L49J59l03J27n8p2J31j58k6
$$ -273 21 94 4 -312 95 71 -22 57 39 -45 -13 18 102 56 -179 -231 118 277 -26 101 43 -29 102 -56 -82
6627h2l9K01m1q6K35lk81k34K25J31j15K15j0k13J89k78K92Q6q0l84J47K3K77
$$ -82 -121 80 39 -47 188 185 -96 -330 -105 26 -89 126 116 -97 92 -186 106 192 112 -272 -125 -102 175
6650A75j03j05K06j09j00K55n50K89p7m3q7M08o6l19J87K00k96Q7K32p6n0n1l1
$$ 175 72 -33 173 64 -36 219 -331 -42 -119 -162 -249 159 93 -226 -39 161 -135 -48 184 108 58 7 -24
6673b4L4n3J83o8j63K08k07o7Q2J58j55J14J9J8O7n5LJ75k32K07k83J94k91K30
$$ -24 10 -43 140 72 -91 117 -90 -157 -75 83 -72 42 61 79 146 91 94 269 37 244 -39 155 -136 94
6697I4J20k81P1p4K99m08L12r7N4N7j90J12kJ2j34M5%J31j68J36k52P4J53R1m9
$$ 94 214 -67 4 -70 229 -179 133 36 90 147 -43 69 67 79 -55 -10 -10 121 -47 89 -163 -89 64 155 106
6722A06l4J5N6j11j95Q5K38l41M70n44P4J67k17K84N2P6j36K17l33m1R3K0J53
$$ 106 72 87 143 32 -163 -78 160 -181 289 -255 -181 -14 -231 53 105 181 45 262 -71 -112 -19 1 154
6745A54k93L2Q7L3K4J08l42K84o0J20n5k33K39k52L2K42r7nK8k11q2oN19l66J99
$$ 154 -139 -107 -20 13 37 145 -197 87 27 147 92 -141 98 -154 -122 120 23 18 46 -165 -247 -253 266 -100 99
6770I9M3q5n8k02J11J1K75k66m5K00P7m00J81R5J5Kl4k18K60J41m14J18J5Q4N5
$$ 99 142 57 -1 -203 -92 -81 194 -72 -117 83 160 -240 -59 36 51 53 19 -199 61 202 -212 -94 -79 5 60
6795F0l1q8O7nJ17j32N0K2k55M09j87J76Q9m18J92J09M7j57k51J04m4M19k15n5
$$ 60 29 -59 8 3 120 -12 38 60 -195 214 27 203 292 -126 66 175 222 65 -186 -82 -126 293 78 23
6819B3pM4J21j73n1J02Q2j6qL2k66o4J02j47L15j52l4N3KJ22j94J44J36j13n6
$$ 23 16 60 181 8 -43 59 141 125 117 149 -117 -181 -79 -226 89 -63 -97 -44 -42 80 -114 30 166 53 -3
6844cJ23P5l06K54j71O1J68j02k36J22K74j74k85K81j42J48P8j17j19M4j9O2j52
$$ -3 120 195 -111 143 -28 33 201 99 -137 -15 259 85 -200 81 -61 87 165 48 -71 -27 -46 16 -136
6867a36J86m0j04m1L54k55J85M9l48j16K26j2j73J82m2M8m4K09j42K07N9m77K61
$$ -136 50 10 -94 -135 219 -36 149 198 -150 -266 -40 -52 -225 -43 -85 -37 -81 128 -14 193 252 -225 36
6890C6m6j12K03j86R0L5k19J77Q4m7K93j58k67K54j16R1j33j17J09Lk7K39j45
$$ 36 -10 -122 81 -105 -15 20 -199 -22 62 15 308 150 -117 137 21 112 -21 -138 -29 -26 -53 186 41
6913D1p3R0l8p3j30J62P8R6k25p2J56p7k34M31j5M8k7m1q7K10k00M0N3m1Q8l41
$$ 41 -32 58 20 -53 -183 -21 57 153 -72 -144 12 -65 -299 132 117 165 138 97 10 220 20 60 113 72 160 -181
6939a81K83j62J14l6j6k4j10j23K36rK34k39K43m25K38L4o3j54j29K41j71M92
$$ -181 102 -60 54 18 2 -22 -132 -255 -19 -28 206 -33 210 -215 23 57 -6 -160 -289 -48 -219 273
6961B73q1l02Q3K50q5p8k76K97J3N3k87J76m5J55k27M1K41j7k55j00j30L63o0
$$ 273 192 -110 -27 223 138 60 -216 81 94 147 -140 36 -9 146 -81 -40 201 184 -71 -171 -301 62 2
6984Bo9p3o4K79j4Mq6pN8k56K82J05l34N1L46n41M98k64j58K82n1K1j07K6LJ53
$$ 2 -67 -140 -204 75 61 65 -21 -28 30 -226 56 161 -173 -122 224 -317 181 -83 -241 41 -10 11 -96 -70 -67 86
7010H6k36L22Lj01J65l89N9jJ80N6r3N4n2j56j4P0N9J52k83K61J14j63M4m43L26
$$ 86 -150 172 175 74 239 -150 -91 -92 88 144 51 105 53 -103 -117 -47 12 164 -119 142 256 93 137 -306 20
7035B0Q1j06q9J21K9J40m43K86J38j32N0j88MK76k80K49j54p3M9J03Q2l78L02
$$ 20 101 -5 -94 27 56 196 -247 39 177 45 95 -93 -89 187 -93 156 2 -71 -22 81 163 -215 87
7058H7j37M8N3k27J43K3N5m1M2j51q4J02Q8n2r5J83K05l03P8J49Pj34k25L08k55
$$ 87 -50 -2 51 -176 -33 -10 45 4 46 -105 -189 -87 1 -51 -146 37 242 -61 17 166 173 39 -186 122 -133
7083a33P8Q2K20k31j36K12k8k9L8o7j86M74m67L66l34J20J85L5k89P6J07j8j91
$$ -133 -55 27 247 16 -120 92 64 35 73 6 -180 294 -173 193 -141 -21 164 199 -90 -14 93 75 -116
7106a16K03m7O8j71J13k6j12J20j68M6J47J28j1j31K9q1M8p7J81j89q3J24O8j69
$$ -116 87 40 108 -63 50 24 -88 32 -136 -90 57 185 174 43 72 -9 39 -38 143 -46 -129 -5 63 -106
7130a06j96L61k56L11J27m04n5o1M55L1p0o2N6k66O6l0J63Q8j01j40J94r7r6J28
$$ -106 -302 59 -197 114 241 -163 -218 -279 176 207 137 75 131 -135 -69 -99 64 152 51 -89 105 8 -88 40
7154D0J56j69L5J25k63M7J22m28N65j06l64K63Pk53L09J68n98K22J27m3P6Q7j26
$$ 40 196 27 62 187 -76 -29 93 -335 230 124 -240 23 30 -223 86 254 -344 -122 5 -38 38 125 -1
7177aK2j3j04R5J54r0l7j51R4L43k48j18K51m7j88r4J71j66k8L57n20M45l06M02
$$ -1 21 8 -96 -1 153 63 26 -125 -31 312 64 -54 197 150 -38 -132 39 -127 -155 202 -318 127 -179 223
7201B23r8j53k85K75j25J32L80n81J11J10r3K25j72Q8j24Kp6K61j41J78k64L79
$$ 223 125 -28 -313 -38 -163 -31 349 -232 -121 -11 -104 121 -51 37 -87 -85 -161 100 -41 137 -127 252
7223B52k01j49K00m8L7m2P8k88j45J98J47l13J62j26M55j86k13r9Q3m6K30J57
$$ 252 51 -98 102 54 91 49 127 -161 -306 -108 39 -274 -112 -238 217 31 -182 -281 -198 -244 -14 143
7245A43n08L61J25Pj02j5m5j5m6m9J44J89j7k59K20j01l7j19J19l4M1n8N4Q7k6
$$ 143 -365 -4 121 128 26 11 -34 -49 -95 -144 0 189 172 -87 133 32 -5 -124 -5 -39 2 -56 -2 85 59
7270E9K50k83J25l14M98n47J16k12J58K49k44nL11j95l0P6l45N75j05k03j4K21
$$ 59 309 26 151 -163 335 -212 -96 -308 -150 99 -145 -150 161 -34 -64 12 -333 242 137 -66 -80 141
7292A41m2Rj19j40K32m3J11r3M2j88J44L4J60l87p7J16N7oK9l3J00K88k87j68
$$ 141 99 108 -11 -151 81 38 149 56 98 -90 54 88 248 -139 -216 -100 -43 -49 -20 -53 47 335 48 -120
7316a20K53K2J07k64j58J33q5pJ37p5K59l12J20k3J98l09K41j30p9Q3j5m5J60
$$ -120 133 155 262 -2 -160 -27 -112 -119 18 -57 202 -110 10 -13 185 -124 117 -13 -92 -9 -24 -69 91
7339I1k59J34J9J6n6j21K21J22j13l0O9j4o3J9KP9Lj05N5j69P2N8q9r2J2L94l49
$$ 91 -168 -34 -15 1 -55 -176 45 167 54 24 93 79 16 35 37 116 119 14 69 -100 -28 30 -59 -151 -139 255 -94
7366i4J48j3m6J00k87J21K25j44j65K47N1l3j97J67r1k18L05O6m01K02O4j0j49
$$ -94 54 41 -5 95 -192 -71 154 10 -155 92 143 110 -87 80 -11 -229 76 142 -259 -57 7 -3 -152
7389a52J29J65N4qk0k07L3j22J41j05L03k99j59L30m2K38l22P3K1j28j7J62k12
$$ -152 -23 142 196 188 168 -39 -6 -128 13 -92 211 -88 -247 83 41 279 -43 30 51 -77 -94 68 -144
7412a44m1M1K67J08k95J79j90M1K77l76P8K68l20K59l28J03J41J9K25m52J8J24
$$ -144 -185 -144 123 231 -64 115 -75 -34 243 -133 -55 213 -107 152 -176 -73 68 87 312 -140 -122 2
7434BN4n0j13m2J87j16J6J97p6K3J27j56k27J71K63j24k1l4k24L03q6j69L67m36
$$ 2 56 6 -107 -149 38 -78 -62 135 59 82 209 53 -174 -3 260 136 115 81 -143 160 74 -95 272 -164
7458a64J17M26l34k45J52J39p7k35L62k8m5nKk91K39k18N9K11M7J09j68M4l62
$$ -164 -47 379 45 -200 -48 91 14 -221 141 113 68 63 65 -226 13 -205 -146 65 112 221 53 97 -265
7481b65M2K55P2k62J94r6J20j46J29q7j56K4J86m4J33j93K18n5J30k22L9Q3j49
$$ -265 -223 32 104 -158 36 -60 60 -86 43 -44 -200 -176 10 -34 99 -94 124 69 199 -23 16 99 -50
7504e0Lk00M21j19j83J27l4L6j23j62L87L0J9L3J75l71K2q0J52l19J94J75L4j76
$$ -50 -47 -247 174 55 -128 -1 -35 1 -122 -284 103 133 152 185 360 -11 11 -69 83 -236 -42 133 167 -9
7528iN4j31N0k37K13j02Q9J69q4K87l28j8r1m1l1J71J22j41J48k26J48K7K03k97
$$ -9 45 -86 -36 -273 -60 -162 -73 96 12 299 -29 -47 -138 -179 -210 -39 83 -58 90 -136 12 39 242 -55
7552e5q4K16N2m41M62j33O7p6p9J85j65J43l37L79k18J77l2k83L04j97K94j39
$$ -55 -139 77 129 -312 150 17 84 8 -71 114 -51 92 -245 134 -84 93 61 -222 82 -115 179 40
7574D0M6N1k64K18l0p3j95J20J48j73Q2Q3J89j52J83m41Q5j7Q5J01l9K1k34K92
$$ 40 86 137 -127 91 61 -12 -207 -87 61 -112 -30 53 242 90 273 -168 -83 -100 -15 86 47 68 -166 126
7598A26j12k58J76L7K9j16J70j80J59J04Kj92N2l8J55j11R5j37J86k53M57k24
$$ 126 14 -244 -68 -31 -2 -118 52 -128 31 135 137 -55 -3 -41 114 3 98 -39 147 -106 351 127
7620A27n41L32l6J23K33l48L13l35J29n8J59k22j30L13j17j30J52K8N5P0k51P1
$$ 127 -414 -82 -118 5 238 -110 203 -132 -3 -61 98 -124 -254 59 -58 -188 -36 -8 47 117 -134 -63
7642f3j28J47J27LN5k13m6P2o6K2P4O7j23J49o2O8J33k10j12O1K51j35r7O3qj92
$$ -63 -191 -44 83 86 141 -72 -118 -46 -112 -90 -16 51 -72 77 15 83 216 6 -106 -45 206 71 -26 37 29 -163
7668a63J42K11j66j80K58q8p4J8J52nN5P8j72N0k18J78K2j36J74k18j1J99n7j03
$$ -163 -21 190 24 -156 102 14 -60 -42 110 105 160 238 66 116 -102 76 98 -38 136 -82 -93 106 49 -54
7692e4J63P5l27K07o7O7r6k1n9J24k14J6L56j58K54k58J58j16R1p5J4k17L46k53
$$ -54 109 184 -143 64 -3 64 -32 -53 -112 12 -202 -186 170 12 266 8 166 50 141 66 80 -137 209 -44
7716d4J40k60K76l09L69j48o1j54K72R4k34J34k13q7R1r6J32K30l98K85l0R0J00
$$ -44 96 -164 112 -197 172 24 -37 -191 81 175 -59 75 -138 -225 -134 -230 -98 132 -266 19 -11 79 179
7739A79p4k5j35J46l00J32J34k26K11n9j6J34l99L40Kj1l6k21M07K3l47J52Mn9
$$ 179 105 80 -55 91 -209 -77 57 -169 42 -17 -33 101 -298 42 44 33 -3 -224 183 206 -141 11 15 -44
7763d4q6M09k70j01L0o4R0k57L47j41J60J09l17M0M7L44l03j73L40k67P2N0k16
$$ -44 -130 279 9 -92 -62 -126 -36 -293 54 -87 73 182 -135 -95 -48 296 -7 -180 160 -107 -35 15 -201
7786b01O5o8J06J5L15q5k98J05q5L90l99K32l80L32J51k00q7M8Q8k33O4J62R2
$$ -201 -136 -204 -98 -83 232 147 -151 -46 -131 259 -140 92 -288 44 195 -5 -92 -44 44 -189 -125 37 129
7809A29k60J11P3J11l82M45n2j29Q9n0K12k94J25L2j81K05m05K55k13J91Q0p0
$$ 129 -131 -20 53 164 -218 227 175 46 135 85 297 3 128 160 -21 184 -221 34 -179 12 92 22
7831B2J2j71L71l25L4o2J67M4j27J4r7L82j25j01k21K59j89J94j25J06J8L1j37
$$ 22 34 -137 234 -91 -57 -119 48 92 -35 -21 -118 264 139 38 -183 76 -113 81 -44 62 80 111 -26
7854b6Q4q6K45j36J14l14K63j96OK7K94k99j41L31j53O6j07l5J14k88J18l5L84
$$ -26 58 -28 217 81 195 -119 144 -52 -46 -19 275 -24 -165 166 13 79 -28 -63 51 -237 -119 -154 230
7877B30k11k06L08l96L77J2j75J16Q2n09M75k4j80Q4qL7M1j43J90j16J41J52l56
$$ 230 19 -187 121 -275 102 114 -61 55 137 -372 103 79 -101 -17 -25 12 53 -90 100 -16 125 277 -79
7900g9Q1O4j21K14o6j05k76K55l24K62J68k24L20m21P4J21K47j69n7Q4k98L09
$$ -79 2 66 -55 159 93 -12 -288 -33 -357 -95 73 -151 169 -252 -178 -57 190 21 -36 48 -250 59
7922E9K02m60L94m60J67K48j67J13k3k90J33L00k71K68k02N4k72K60J6p5J7J17
$$ 59 261 -199 195 -265 -98 150 -17 96 73 -217 -84 216 -55 213 11 65 -207 53 69 -6 11 128
7944A28O1j72k87M99j71K3n1j61K72j77R7k3j02O9O7Rj87M3p2K48k36k6j28M10
$$ 128 189 17 -270 229 58 81 30 -131 141 -36 61 38 -64 5 72 81 -106 -63 -135 113 -123 -149 -277 133
7968A33j0P8p8m16K85P9k87K04J71k28L4J53O7k86J59k4J04K6k04j17J13l94M18
$$ 133 123 201 123 -293 -8 71 -216 -12 159 -69 -35 118 185 -101 58 34 138 164 -40 -157 -44 -438 -20
7991b0J39k25R7n1R5j06K2J53j19Q4j29K27j73j6j16K02N7j92m4L7P1K06m1j15
$$ -20 119 -106 -9 -60 35 -71 -49 104 -15 69 -60 167 -6 -22 -138 64 121 -71 -115 -78 -7 199 158 43
8015D3K7o24N05K70k33j55J22R4j41K77j45j92L2j1J77%K31j94k92J65L7n4O4
$$ 43 70 -554 -49 221 -12 -167 -45 49 -92 185 40 -152 -120 -131 46 46 277 83 -209 -44 -7 -61 3
8038Cq9n4K06r2K01l56J25p4R9j51k47P09l57j0J39r4r6R5M53n14J87k43j2J49
$$ 3 -86 -140 66 -26 175 -181 -56 -130 -31 -182 -429 280 -77 -87 52 -42 -138 -43 410 -104 83 -160 -172 -23
8062b3pP2q8j4j16J83l61L51j88L97k06n4L1K26j54j03J49k81L77j26Oj49q0J08
$$ -23 -30 42 -46 -60 -176 7 -354 -3 -191 206 0 -54 -23 203 49 -54 95 -186 191 65 71 -78 -158 -50
8086e0K74k44L1k54K77k70J83J37k27J20K60k72J66J65n78K66K66K4l54J16jJ02
$$ -50 224 -20 11 -243 34 -236 -53 84 -143 -23 237 -35 131 296 -282 -16 250 274 -80 36 35 137
8108A37l75L32O6j71O1q3N0O1k8m0k59L14n8O1r2Q3J64j96q0q0K1J37l4K57q1
$$ 137 -238 94 160 -11 50 -33 17 78 50 10 -249 65 7 68 -24 59 223 27 -53 -133 -112 25 -9 248 167
8133A67j94m7q5J71KJ45l20n2J56J56J04j87L6J2j5K94m70J59J37k85J80j32J46
$$ 167 -27 -74 -159 12 14 159 -161 -213 -57 99 203 16 52 64 49 343 -127 32 169 -116 64 -68 78
8156G8r7J01J49k04M5j7m7J68%o6p8o9qP5k26J49J36K9j99P7L1l72L27o4R3k7
$$ 78 -19 82 231 27 72 55 8 176 176 110 32 -37 -45 30 -196 -47 89 118 -81 -4 27 -345 -18 -82 11 -16
8182a6K4L09m3k87j13K40N8k7l56
$$ -16 8 317 274 -13 -126 114 172 145 -211
8191b11
$$ Imaginary data points
##PAGE= N=2
##DATA TABLE= (X++(I..I)), XYDATA
0@%%%%%%%%qJ6j6J6j6J2m%%nJ4k5M0n9P9j04J36j73K18k69L28l98M79n72O77p94
$$ 0 0 0 0 0 0 0 0 0 -8 8 -8 8 -8 4 0 0 0 -5 9 -16 24 -35 44 -60 76 -97 121 -148 180 -218 261 -311 366 -428
34d28R27j078J248j436J648j885K141k427K743l084L460l874M321m807N338n912
$$ -428 499 -579 669 -767 881 -1004 1137 -1290 1453 -1631 1829 -2045 2276 -2531 2807 -3105
50c105O535p210P937q719R561j0470J1442j2478J3578j4734J5932j7138J8294
$$ -3105 3430 -3780 4157 -4562 4999 -5471 5971 -6507 7071 -7663 8269 -8869 9425
63I425j9284J9864j9531J7124r521j4255J29840M30306j200641J236637j029898
$$ 9425 -9859 10005 -9526 7598 -1923 -16178 113662 543968 -656673 579964 -449934
74d49934P68238m57536L1679M56802q16839Q95808p46214N72336n11203N06514
$$ -449934 318304 -139232 -107553 349249 -467590 428218 -317996 254340 -256863 249651
84B49651m12631J93028L0153j30866J26282j50704K81719m36205M65449l38037
$$ 249651 -162980 30048 60201 -70665 55617 -95087 186632 -249573 215876 -122161
94a22161J89600j63831K39800k64361J38442P2124k29479K93982l53985M91129
$$ -122161 67439 -96392 143408 -120953 17489 89613 -139866 154116 -199869 291260
104B91260o46198O65672m72004J59036J05808k53134L50351m76808O02985o19042
$$ 291260 -354938 310734 -161270 -2234 103574 -149560 200791 -276017 326968 -292074
114b92074M74314k53635R1798k9489k3417J61294l59185M93207m85260L86973
$$ -292074 182240 -71395 20403 -9086 -32503 128791 -230394 262813 -222447 164526
124A64526l03726K65358j99150L9367J72484l18767L34110k73342K41860k71168
$$ 164526 -139200 126158 -72992 -33625 138859 -179908 154202 -119140 122720 -148448
134a48448K92488k31166J02100J0409n4859P3805j44295K71860l74498L69217
$$ -148448 144040 -87126 14974 25383 -29476 44329 -99966 171894 -202604 166613
144A66613k65018J48116q0491L7350M5477j74890K79942k96590K40491j86577
$$ 166613 -98405 49711 -30780 6570 52047 -122843 157099 -139491 101000 -85577
154h5577J78758j80262J24827M62j33772K06749k17319K18902k41519K50955j93740
$$ -85577 93181 -87081 37746 38208 -95564 111185 -106134 112768 -128751 122204 -71536
165g1536O9251O1227j33699J44194j42626J65294j91968J74186j04187K8910M988
$$ -71536 -2285 58942 -74757 69437 -73189 92105 -99863 74323 -29864 -954 4034
176D034m095J5650o6759J32038j62505J41088j00344Q0185p9473O0855k855o8437
$$ 4034 -61 15589 -51170 80868 -81637 59451 -40893 39292 -40181 20674 17819 -50618
188e0618J10012j10041R6622j00631J20251j22273Q2417j7622l4301N8344p3534
$$ -50618 59394 -50647 45975 -54656 65595 -56678 25739 8117 -26184 32160 -41374
199d1374J03588j41302J54868j25562O7004j3736j6466L6866o9371J11041j33844
$$ -41374 62214 -79088 75780 -49782 17222 3486 -12980 23886 -45485 65556 -68288
210f8288J20101q2381M8753l1989J8101J1649n5245Q9976r5887P9867o5485O2766
$$ -68288 51813 -30568 18185 -13804 4297 15946 -39299 50677 -45210 34657 -30828 31938
222C1938n8056L5431K400l6085N0171m9691N2275o4388P5280o9427M4719j7683
$$ 31938 -26118 9313 11713 -24372 25799 -23892 28383 -36005 39275 -30152 14567 -3116
234c116J289P603k2632M7681p1089P8633o7953N1042l8352K7819j0359j7420M5963
$$ -3116 -1827 5776 -16856 30825 -40264 38369 -29584 21458 -16894 10925 566 -16854 29109
247B9109o1726O2414n6870N3518m9346L7165j4029j2797L1703m0110M3397m7712
$$ 29109 -32617 29797 -27073 26445 -22901 14264 235 -12562 19141 -20969 22428 -25284
259b5284N1382m7441L2737j2952l096J2458k0033K9143l7549M0429l5015K4592
$$ -25284 26098 -21343 11394 -1558 -4654 7804 -12229 16914 -20635 19794 -15221 9371
271I371j4666Q500k976n870J6135k3042K4314k2616K1348k0560J8931j4087N464
$$ 9371 -5295 3205 229 -5641 10494 -12548 11766 -10850 10498 -10062 8869 -5218 246
284B46L686j0173J4178j8653K3487k5377K2931j7532J0202k315m515J0547j6788
$$ 246 3932 -6241 7937 -10716 12771 -12606 10325 -7207 2995 680 -3835 6712 -10076
297a0076K2138k3512K0542j5917J1334n426j046P351j3080J6887j7961J5900j3117
$$ -10076 12062 -11450 9092 -6825 4509 -917 -1963 5388 -7692 9195 -8766 7134 -5983
310e983J0104n409L08M108p406R698j0644J0049r326Q265n855K718m92j171L005
$$ -5983 4121 -1288 -980 3128 -4278 5420 -5224 4825 -4501 3764 -2091 627 135 -1036 1969
325A969m674N635o491P311p120O046m893L932k041m15K515m611O778q549R364
$$ 1969 -2705 2930 -3561 3750 -3370 2676 -2217 1715 -326 -741 1774 -2837 3941 -4608 4756
340D756r155P518n043K295Q83l869O758r428J0436r723P899n882L353n2l288O464
$$ 4756 -4399 3119 -1924 371 1254 -2615 4143 -5285 5151 -4572 3327 -2555 798 746 -2542 3922
356C922q339Q672p945P184o534M847k332r08L635m375M758n488O560o658N625
$$ 3922 -4417 4255 -3690 3494 -3040 1807 -525 -1433 2202 -2173 2585 -2903 3657 -3001 2624
371B624l864J987j778K120l11l439N993o456O193o889P741p755N966j740l035
$$ 2624 -1240 747 -1031 1089 778 -2661 3332 -3124 3069 -3820 3921 -3834 2132 392 -2643
386b643N517n878P260j0068J1667j0060N710j538k10J377l638P721j1880J2679
$$ -2643 2874 -3004 4256 -5812 5855 -4205 1505 -33 -243 1134 -2504 5217 -6663 6016
400F016r825O093m775M523j811l422Q692j1079R920p976P981r842R175m322j865
$$ 6016 -3809 2284 -2491 2032 221 -3201 5491 -5588 4332 -3644 4337 -5505 3670 -652 -2517
415b517N321n558O118r054J3291j4921J1588n530J875j099l97N781j2543J5770
$$ -2517 2804 -2754 3364 -5690 7601 -7320 4268 -1262 613 -486 -883 4898 -7645 8125
429H125j4563J1067q871Q909q116K576O557j3031J3515j1332J1506j3984J4230
$$ 8125 -6438 4629 -4242 4667 -3449 -873 5684 -7347 6168 -5164 6342 -7642 6588
442F588r415J413M686o017N199p398J3399j7790J6156j0614O244m918M191L69
$$ 6588 -2827 -1414 3272 -2745 2454 -4944 8455 -9335 6821 -3793 2451 -2467 1724 2093
456B093r201J6595j7816J4555j1990J2884j4135J0123q92p517J0767j0594J2489
$$ 2093 -7108 9487 -8329 6226 -5764 7120 -7015 3108 2216 -5301 5466 -5128 7361
469G361j7837K2336k0921J2760l670j175L465p810J5077k1227K1788j6488J0770
$$ 7361 -10476 11860 -9061 3699 29 -1146 2319 -5491 9586 -11641 10147 -6341 4429
482D429r086R144n783k329J1375j5824J5454j5277J7790k0835J8745j0232P70
$$ 4429 -4657 4487 -1296 -3625 7750 -8074 7380 -7897 9893 -10942 7803 -2429 -1659
495a659N260p970J0706j6781K3333k5038K0185j2866P960m886n40J0376k0148
$$ -1659 3601 -4369 6337 -10444 12889 -12149 8036 -4830 3130 -1756 -2296 8080 -12068
508a2068K4962k3422J8791j5525J3728r281o6J0035j5293J5852j6087J8030k0127
$$ -12068 12894 -10528 8263 -7262 6466 -2815 -2881 7154 -8139 7713 -8374 9656 -10471
521a0471J8668j1818K558M251p525J0387j5520K0021j9496J3922p632M798l977
$$ -10471 8197 -3621 -1063 3188 -4337 6050 -9470 10551 -8945 4977 -2655 2143 -1834
534a834J907L393r697J3046j2946J2545j4094J5832j3268N569K934p933R347j0762
$$ -1834 73 3466 -6231 6815 -6131 6414 -7680 8152 -5116 453 3387 -4546 4801 -5961
548e961J3570j6479J6016j0772N060l165L078N26q287J6098j9628J8181j5154
$$ -5961 7609 -8870 7146 -3626 1434 -1731 1347 1873 -6414 9684 -9944 8237 -6917
561f917J3424j0574L825O408j5383J8260j6362J3987j3809J3509r468J735N401
$$ -6917 6507 -4067 -242 6166 -9217 9043 -7319 6668 -7141 6368 -3100 -1365 4036
574D036q282Q493j0559J6150k0820J9304j2413M430N23l101Q119j6353K2509k1838
$$ 4036 -4246 4247 -6312 9838 -10982 8322 -4091 339 862 -2239 5880 -10473 12036 -9802
588i802J5360r136P228o359J807P539j6197J8696j5980J3989j5411J6375j2077
$$ -9802 5558 -3578 3650 -2709 -902 6637 -9560 9136 -6844 7145 -8266 8109 -3968
601c968J894Q011j2029J0953j0914J5668k1286K0868j3482N315j533N75L584j3448
$$ -3968 -2074 5937 -6092 4861 -6053 9615 -11671 9197 -4285 1030 -503 72 3656 -9792
615i792K3887k7216K1854j4208J0801r833M951N901j7337K1847j8720J4724j5765
$$ -9792 14095 -13121 8733 -5475 5326 -4507 444 6345 -10992 10855 -7865 6859 -8906
628h906J9772j8756R413K675r795J0427j1216J7164k5131K6773j9195Q041j381
$$ -8906 10866 -7890 1523 4198 -5597 4830 -6386 10778 -14353 12420 -6775 1266 -115
641a15J168q6p524J8008k3346K0375j4383J2695j5487J5912q119m808J4247j5434
$$ -115 1053 967 -6557 11451 -11895 8480 -5903 6792 -8695 7217 -902 -5710 8537 -6897
655f897J3527j5842K2393k6006K0189q467n60K749l124R331k0326K8203k6759
$$ -6897 6630 -9212 13181 -12825 7364 -1103 -1663 1086 -2038 7293 -13033 15170 -11589
668a1589J8638j2047J0685r799K021J1244k1887K3772j9004J5706j7751J9880
$$ -11589 7049 -4998 5687 -4112 -2091 9153 -12734 11038 -7966 7740 -10011 9869
680I869j5109L190Q269j2115J0643j1626J8462k5237K4295j5366N832k313K329
$$ 9869 -5240 -2050 6219 -5896 4747 -6879 11583 -13654 10641 -4725 1107 -1206 1123
693A123J749j2262K2864k5985K0817j4343J2464j3154R594J382j2938J8001j6394
$$ 1123 2872 -9390 13474 -12511 8306 -6037 6427 -6727 2867 4249 -8689 9312 -7082
706g082J3536j4825J8203j7618J0387o39m762M403m479R698j7777K1539j7631
$$ -7082 6454 -8371 9832 -7786 2601 1962 -2800 1603 -2876 6822 -10955 10584 -7047
719g047J1337p826P605o193j070J1737j8379J8218j5028J3538j4867J4359p838
$$ -7047 4290 -3536 4069 -2124 -3194 8543 -9836 8382 -6646 6892 -7975 6384 -1454
732a454k263R504j1446J1145j2700J6700j8883J5155o909K04K129l224O859j3059
$$ -1454 -3717 5787 -5659 5486 -7214 9486 -9397 5758 -1151 -947 1182 -2042 4817 -8242
746h242J7484j6941J2483q165O798n741J552N577j2053J4437j3018J1286j1596
$$ -8242 9242 -7699 4784 -3381 3417 -2324 -772 4805 -7248 7189 -5829 5457 -6139
759f139J1637q480K586L530p188P740q403J0713j2921J2788r107M208j084j11
$$ -6139 5498 -2982 -396 3134 -4054 3686 -4717 5996 -6925 5863 -3244 964 -120 -231
773b31J991o008J0577j2948J1719q633O436n613L870J22n103Q396q906Q403q461
$$ -231 1760 -4248 6329 -6619 5100 -3533 2903 -2710 1160 1282 -3821 4575 -4331 4072 -4389
788d389R029q340N513j348k658M439m840O309q694R934q684N949l026J094L14
$$ -4389 4640 -3700 1813 465 -2193 2246 -2594 3715 -4979 4955 -3729 2220 -806 288 602
803F02k605N867q767R502q104O158n081M037j647j918N332p084O947o310O086
$$ 602 -2003 3864 -4903 4599 -3505 2653 -2428 1609 -38 -1956 3376 -3708 3239 -3071 3015
818C015o216M962k100o93K563l406M099n062O340o417M524k347J116m24o53K455
$$ 3015 -3201 1761 -339 -1032 1531 -1875 2224 -2838 3502 -2915 1609 -738 378 -46 -699 1756
834A756m232M970m664L718l167L126k481N88K015l675L849l495L732m438L976
$$ 1756 -2476 2494 -2170 1548 -1619 1507 -974 -386 1629 -2046 1803 -1692 2040 -2398 1578
849A578j882l43J553j941K401l103M116m209K607q77Q8l4n57K249l822M020k682
$$ 1578 -304 -647 906 -1035 1366 -1737 2379 -1830 777 -100 -12 -46 -603 1646 -2176 1844 -838
866h38J303o12M53o6j574L166l406K106n65J62l15j24J256k505K884j717K97j54
$$ -838 465 -147 306 240 -1334 1832 -1574 532 -33 129 -186 -310 946 -1559 1325 -392 -95 -249
884b49O89n18n73J703j832R56P0L09j356J685m45j019J208n70l58m57K353l199
$$ -249 440 -78 -651 1052 -780 176 246 555 -801 884 439 -580 628 58 -300 -757 1596 -1603
902a603K231q74N28r48R90J078l761M430l412J845q93R25j081k19K337l447K980
$$ -1603 628 -246 282 -666 324 1402 -2359 2071 -1341 504 -389 536 -545 -764 1573 -1874 1106
919A106j811J641k662L174k080k83K723k894J891k315L996m647L110l01j964J806
$$ 1106 -705 936 -1726 1448 -632 -915 1808 -1086 805 -1510 2486 -2161 949 648 -1316 490
935D90n23N26k230L981l857J683j2N04j912K034L39l048L609j926K24r37L274
$$ 490 -33 493 -1737 2244 -1613 70 58 562 -1350 684 1023 -2025 1584 -342 -118 -1055 2219
952B219l626J344J203j551k06J098O51l460N000l909J305l63J547k365N06K899
$$ 2219 -1407 -63 1140 -411 -617 481 1132 -2328 2672 -1237 68 -295 1252 -1113 -607 2292
968B292m623L506j258O05k620M202k740j243L683k591N40j70K761m769L337j27
$$ 2292 -2331 1175 -83 522 -2098 2104 -636 -1879 1804 -787 -247 -417 2344 -2425 912 785
984G85j864O60J661j746r62L823l694J374M81O60l654L860m93k829L126o83r66
$$ 785 -1079 -419 1242 -504 -1466 2357 -1337 37 518 1178 -2476 1384 891 -1938 1188 505 -461
1001d61q19L788m275J607J288j463j036K734l09l925N267k508n76M45K158l964
$$ -461 -1280 2508 -1767 -160 1128 -335 -1371 1363 1054 -2871 2396 -112 -688 -243 1915 -2049
1017b049K109J819l828J667J401n67l237N989m410K83J866p54j070K0M028o608
$$ -2049 60 1879 -1949 -282 1119 552 -2685 3304 -1106 -823 1043 289 -781 -761 3267 -3341
1033c341M868k93k540Q67K035k061j127L654k796J36J156J302n104M890r19k823
$$ -3341 1527 1234 -1306 -439 1596 -465 -1592 2062 -734 -598 558 1860 -3244 1646 727 -2096
1049b096K867J37j443r44M202m313J086J883r60k799M642j730l368N377k959K24
$$ -2096 771 908 -535 -1479 2723 -1590 -504 1379 419 -2380 2262 532 -2836 2541 -418 -194
1065a94r17L972n191J541L833n693K738J107j095k310M671k793r26J829R55l389
$$ -194 -1111 2861 -2330 -789 3044 -2649 89 1196 101 -2209 2462 -331 -1257 572 1527 -1862
1081a862J949K703o519N164j132l47j662M001k663j683M790l488j02Q64K394n507
$$ -1862 87 2790 -3729 1435 303 -44 -1706 2295 -368 -2051 2739 -749 -851 13 2407 -3100
1097c100M903j060k405K164K27m04k824O394n942J711J690j502j769K934L29l959
$$ -3100 1803 743 -1662 502 729 325 -2499 3895 -2047 -336 1354 -148 -1917 1017 1346 -2613
1113b613M558j461j289o0L622m997K107K001l032K54K356q56l359N657l764M51
$$ -2613 1945 484 -805 -865 2757 -2240 -133 1868 -1164 -910 1446 590 -2769 2888 -876 -425
1129d25K7K382m408K648K348n767M748j868J477l988N997m427j84L894l282O91
$$ -425 -398 1984 -2424 224 2572 -3195 1553 -315 1162 -2826 3171 -1256 -1440 2454 -828 -137
1145a37n60L660o802O224k298o71K89J795j737j811N152n571K928r55K366m860
$$ -137 -697 2963 -3839 2385 87 -584 -295 1500 -237 -2048 3104 -2467 461 -494 1872 -2988
1161b988M894j188k768L876k383J194k942N817o512L774k44n57p45J337N15m107
$$ -2988 1906 718 -2050 1826 -557 637 -2305 3512 -3000 774 530 -27 -772 565 1080 -3027
1177c027O136n162L555l372M275m766K504J772m469M569k896K419m560O324n358
$$ -3027 3109 -2053 1502 -1870 2405 -2361 143 1915 -2554 2015 -881 1538 -3022 3302 -2056
1192b056K397l48J97m45o43L839o990P842o053L978l914L965k074j744N353o228
$$ -2056 341 -7 190 -255 -898 2941 -4049 3793 -2260 1718 -2196 1769 -305 -2049 3304 -2924
1208b924N303m287M701o069N600k904k84K169k523K731m511O832p413N648k816
$$ -2924 2379 -1908 2793 -3276 2324 -580 -864 1305 -1218 1513 -2998 3834 -3579 2069 -747
1223g47J286j209M92J279l485N245n228M167m164N349n730L962p26j913K988k947
$$ -747 539 -670 -178 1101 -2384 2861 -2367 1800 -2364 2985 -2745 1217 491 -1422 1566 -1381
1239a381L801n748P089o352L966j898R08q15p83L690n892O720n659M417m329M321
$$ -1381 2420 -3328 3761 -2591 1375 -523 385 -430 -1213 2477 -3415 3305 -2354 2063 -2266 2055
1255B055k713j68K988m503M531m477N231o304N777m020J840J79j328K345m125
$$ 2055 -658 -826 2162 -2341 2190 -2287 2944 -3360 2417 -1603 237 416 -912 1433 -2692
1270b692O294o971N905m288K900j738K55J873l938M684m419M063l954L883l362
$$ -2692 3602 -3369 2536 -1752 1148 -590 -335 1538 -2400 2284 -2135 1928 -2026 1857 -1505
1285a505K104O8j390J729k450L424m326M645l723K093j034L54J80j068K238k936
$$ -1505 599 667 -723 1006 -1444 1980 -2346 2299 -1424 669 -365 -11 169 -899 1339 -1597
1301a597L109k695K583k681K607j960N41O60j134J445k318L137l284K684j634
$$ -1597 1512 -1183 1400 -1281 1326 -634 -93 567 -567 878 -1440 1697 -1587 1097 -537
1316e37R33m68j99R74j708K143k296J829j235J267j434J044j40o74Q43o84P47
$$ -537 396 -72 -271 703 -1005 1138 -1158 671 -564 703 -731 313 173 -501 342 -342 405
1333D05j288J926j768J092n16K65l93L01O57j615J461o19R62j815J474r10K60
$$ 405 -883 1043 -725 367 -149 116 -277 24 681 -934 527 -92 870 -945 529 -381 -121
1350a21L08o36Q10j049J459j571J182l15j52L38k32J08l04M84k33m46N02J89q20
$$ -121 187 -449 361 -688 771 -800 382 67 -85 253 21 129 -175 309 76 -370 132 321 -499
1369d99R06l60j71l17R13o88M37k3l37K91p66J583k017J897j433Q43k8l04O74
$$ -499 407 47 -124 -441 472 -216 221 198 -139 152 -614 969 -1048 849 -584 259 231 -73 601
1388F01j554K258k336J829j418J217r57M48L58j209J826k109K120k219K267j632
$$ 601 -953 1305 -1031 798 -620 597 -360 88 446 -763 1063 -1046 1074 -1145 1122 -510
1404e10K54R55j408J526j613J982k180J683j096N34J3m40O58j379K288k360J888
$$ -510 -256 699 -709 817 -796 1186 -994 689 -407 127 140 -300 358 -1021 1267 -1093 795
1421G95j229R87r47M84j10p10J066o53J250j770J892j920J299o03M8K79o77J647
$$ 795 -434 553 -394 90 -20 -730 336 -317 933 -837 1055 -865 434 -169 -121 158 -519 1128
1439A128k311K394j971J534j497J288o40o70J584j687J722k049K626k799J953
$$ 1128 -1183 1211 -760 774 -723 565 -75 -745 839 -848 874 -1175 1451 -1348 605
1454F05j055N50J21o55J636k936L454k952K096j700J578r25m92K337l454L531
$$ 605 -450 100 221 -434 1202 -1734 1720 -1232 864 -836 742 -183 -675 1662 -1792 1739
1470A739l075K991l357K740p89j300K322k546K517k852L520l557K050k49n25O99
$$ 1739 -1336 1655 -1702 1038 249 -1051 1271 -1275 1242 -1610 1910 -1647 403 154 -371 328
1486C28j022K182l197L418k671J386j164J095q05l01J949k497K124j441J792k940
$$ 328 -694 1488 -1709 1709 -962 424 -740 355 -450 -751 1198 -1299 825 -616 1176 -1764
1502a764L367k123K33J206j389Q63j856L690m413L362j454K82o63M98J078k785
$$ -1764 1603 -520 -287 919 -470 393 -1463 2227 -2186 1176 -278 4 -659 -161 917 -1868
1518a868M004l321J718j294J778k128J272J041k781K455j227J203k602L509k653
$$ -1868 2136 -1185 533 -761 1017 -1111 161 1202 -1579 876 -351 852 -1750 1759 -894
1533h94O21Q22p92K66p86K411l835L793k136R36r32J091k99j836L271l256K493
$$ -894 -273 549 -243 23 -763 1648 -2187 1606 -530 406 -526 565 266 -1570 1701 -1555 938
1550I38j600J803k426J946n2j774K120j596J442k154L071l047J271Q46j036J01
$$ 938 -662 1141 -1285 661 609 -1165 955 -641 801 -1353 1718 -1329 -58 788 -248 -147
1566a47J33Q16k588L099j957Q97q02J813j839K57J782k760K083j158J410k354
$$ -147 -14 802 -1786 1313 -644 253 -549 1264 -575 -318 1464 -1296 787 -371 1039 -1315
1582a315K541j322o76J614j128K9k04J719k433J662m01L15p84J133n46j177K016
$$ -1315 1226 -96 -772 842 -286 -257 -461 1258 -1175 487 86 401 -383 750 204 -973 1043
1599A043j525O34n83J518k161J698j73r24O22r0L16j224K397k655J151p1J43q47
$$ 1043 -482 152 -431 1087 -1074 624 451 -473 149 59 375 -849 1548 -1107 44 -27 116 -731
1617g31O66R47k255K349j253M23q07J558j199M8R65j173P70m05R89k120K401j500
$$ -731 -65 882 -1373 976 -277 146 -661 897 -302 -254 711 -462 308 -97 892 -1228 1173 -327
1635c27K80q6L99n66j85J667k511J753p74Q14j033J184o72m76J095r01P77r47
$$ -327 -47 -133 266 -300 -485 1182 -1329 424 -350 464 -569 615 -57 -533 562 -339 438 -509
1653e09J358j839J230j19k86K50j74N40j470J998j639O05j31M09q63Q36J47j147
$$ -509 849 -990 240 121 -165 85 -89 451 -1019 979 -660 -55 -186 223 -640 196 343 -804
1671h04J413j245J136j577K057j741N09M30k92M9j24Q48j841K130j189N10o98
$$ -804 609 -636 500 -1077 980 -761 -252 178 -114 -65 -189 659 -1182 948 -241 269 -429
1688d29R88o30l23J254j812J568j076Q82r61R28k15n38P99p01K53m88J107j323
$$ -429 559 -71 -394 860 -952 616 -460 422 -539 389 174 -364 435 -266 -13 -501 606 -717
1706g17J113m55L43m29Q0L34r27J257j418J073k54L58q86P09lk36M23m86N61j014
$$ -717 396 -59 284 -145 -65 269 -658 599 -819 254 0 358 -528 181 178 -58 365 -121 440 -574
1726e74J494j416O12r4l59M20l31P53j130J142j148R96n60L47k08j72Q94j470
$$ -574 920 -496 116 22 -337 83 -248 505 -625 517 -631 365 -195 152 -56 -228 666 -804
1744h04J574j407J437j618J143l24l32Q51r52J050j392J431j230R04l56M6J14
$$ -804 770 -637 800 -818 325 1 -331 520 -432 618 -774 657 -573 331 -25 21 135
1761A35o81J074j349J425j083J045r26N51N5o29Q19r18Q87j038R06q03J050o84
$$ 135 -546 528 -821 604 -479 566 -360 191 246 -383 436 -482 405 -633 273 -530 520 -164
1779a64L83l89j92P36p61Q92j025J150q33L51j63j58N95r41J134j272J223j134
$$ -164 219 -170 -362 374 -387 505 -520 630 -203 148 -15 -173 422 -519 615 -657 566 -568
1797e68O63l41M48k44k40Q00j339J655j402J325j490J215o77k27Q67r38R37j128
$$ -568 95 -246 202 -42 -282 518 -821 834 -568 757 -733 482 -195 -422 445 -493 444 -684
1815f84J361j186R39p05J20j53L38K16p77J150j228J034p55P11o77K06K45p49
$$ -684 677 -509 430 -275 -155 -308 30 246 -531 619 -609 425 -330 381 -296 -90 155 -594
1833e94J023r90P88q97J293j045L39P9l9J59l70O33j116J078q98Q61p07O61m13
$$ -594 429 -561 227 -670 623 -422 -83 -4 -43 116 -254 379 -737 341 -557 304 -403 258 -155
1852a55o9P72r12O69q05J218j393J034l69L2K24l96N15j137J443j458J274p83
$$ -155 -224 548 -364 305 -500 718 -675 359 -10 22 246 -150 365 -772 671 -787 487 -296
1870b96M48j48Q4M71j455J603j310Q03o09Q71p01M3N59n65M14m79Q09j203R57
$$ -296 152 4 88 559 -896 707 -603 200 -409 462 -239 -196 363 -202 212 -267 542 -661 296
1889B96o27K26k73M26J68p74J342j418J032q72J032r66N57K27j180J252p63J199
$$ 296 -331 -105 -378 48 216 -558 784 -634 398 -474 558 -408 149 376 -804 448 -315 884
1907H84j447J313j120L86L2k75K43j87O05j200J216q19N64m94Q71n21m53J147
$$ 884 -563 750 -370 16 48 -227 16 -171 434 -766 450 -369 195 -299 572 51 -402 745
1925G45j239R87q80J268j926J639q21j85P24m77L90j088J763j685J576j070P02
$$ 745 -494 493 -387 881 -1045 594 -227 -412 312 -165 225 -863 900 -785 791 -279 423
1942D23r92O48K64j444K144j613J451j529J341j363N17P53j007P81r52J487j997
$$ 423 -569 79 343 -1101 1043 -570 881 -648 693 -670 -153 600 -407 374 -578 909 -1088
1959a088K030j462R52n11l8L03r12J752j973J742j388R68r69J018n57m18J259
$$ -1088 942 -520 432 -79 -117 186 -726 1026 -947 795 -593 375 -594 424 -133 -551 708
1976G08j301R14j095J645j709J152l58j08J01j69M10p78J212j494J353r89J076
$$ 708 -593 321 -774 871 -838 314 -44 -152 -51 -220 190 -588 624 -870 483 -506 570
1993E70j249N93K93p45J084r21J055j653J722j315R31l26J39M06j257J288j441
$$ 570 -679 -86 207 -538 546 -375 680 -973 749 -566 365 39 178 584 -673 615 -826
2010h26J540j194Q15q52N96L4m09Q34r91Q87j101J311j304J266m45k63J54k65
$$ -826 714 -480 335 -517 79 113 -296 538 -453 434 -667 644 -660 606 161 -102 52 -213
2028b13O80r70R55r75P19k77L01m41K72L60n63L50n07P19p54R57o79j47L82m0
$$ -213 467 -503 452 -523 196 -81 220 -221 51 411 -152 198 -309 410 -344 613 -66 -213 169 129
2048A29j72j6L10n87M55o12O91m10N68m20k64O69n00K47m80N71n49N58j77j29
$$ 129 -43 -59 251 -336 119 -493 198 -212 356 -64 -328 341 -159 88 -392 179 -370 188 11 -118
2068a18j6K89j68k77L49l43M75k97M56p53N45P4m35L18k69J84K7K99k54m36Q63
$$ -118 -134 155 -13 -290 59 -284 191 -106 350 -403 142 216 -219 99 -170 14 41 340 86 -350 513
2089E13m47j59R5j8l14K10N99p16K91J70j84j8K31o9n51R25r29K34J39P8j62O3
$$ 513 66 -93 2 -16 -330 -120 479 -237 54 224 40 22 253 184 -367 558 -371 -137 2 80 -82 -19
2111a9O83r76M25o8j07k86Q05l82m16Q27l85k29M7K77n37O30j88k63K66J44k48
$$ -19 664 -312 113 45 -62 -348 457 75 -341 486 101 -128 -81 196 -341 289 101 -162 104 248 0
2132@m38O15m42N63j96K76m58J30J74p23P33j53j20j38P08p05M9K68n17M13r2
$$ 0 -438 177 -265 298 102 378 -80 50 224 -499 234 81 -39 -177 531 -174 -125 143 -374 39 -53
2153e3M54j062J037l4p48N81Nl72J59L78o98L82L6n8l63R80o68l74R74n54r2N7
$$ -53 401 -661 376 342 -406 175 180 -192 -33 345 -353 29 65 7 -356 624 -44 -418 556 2 -90 -33
2175c3M79q12J63N63n20j15O44n35k82R19m11k22J57J82p13P20J13r97R64M5l81
$$ -33 446 -366 -203 360 -160 -275 369 -166 -448 471 60 -162 -5 177 -536 184 297 -700 264 309 -72
2196g2j88P53p53J5P73l70m43K43O44j347R05j64l24M66K46m75J03P21j215O55
$$ -72 -260 493 -260 -245 528 158 -285 -42 602 -745 160 -4 -328 138 384 -91 12 733 -482 173
2216A73J90m20m28Q33k19n77P31j37j79j47O20j101J55J204r43J58K90r8m54P01
$$ 173 363 -57 -485 348 129 -448 283 146 -33 -180 440 -661 -506 698 -245 -87 203 105 -349 352
2236C52o5n91N69k28m22L73K87m52J56N11n07k91P39l34n92Q00m29mK94J91p77
$$ 352 287 -304 265 37 -385 -12 275 -177 -21 490 -17 -308 431 97 -495 305 -124 -128 166 357 -420
2257d20N11R2m61K75K72m22r2O96m89m35P63M9j96N2J20o78O72j4o18J29K65L3
$$ -420 91 183 -278 -3 269 -153 -245 451 -38 -473 290 339 143 195 315 -363 309 295 -323 -194 71 104
2279A04k19N23o82N7O22m94n5J36K37n99M65L27j053M05L37m4j13M09m82k93M92
$$ 104 -115 408 -274 -217 405 -89 -144 -8 229 -370 95 422 -631 -226 111 67 -46 363 -119 -412 80
2300H0j30k86L61K57o74M66P3l38l4O49p22J61M01k51j97N12j71n08P33n42K35
$$ 80 -50 -336 25 282 -392 74 147 -191 -225 424 -298 -137 264 13 -184 328 157 -351 382 -160 75
2321G5k96P47r05L87J60k71K16j73L4k71O43n15K56P0k22J53j06N7k34O47o89
$$ 75 -221 526 -379 8 168 -103 113 -60 -26 -297 346 -169 87 157 -65 88 -18 39 -195 452 -237
2342b37M74m40L90n89J83N24q59O92k57L16o06Q61m19J00K51l35j34n1M36r72
$$ -237 237 -203 187 -402 -219 305 -554 138 -119 197 -409 452 33 133 384 49 -85 -136 300 -672
2362f72R82n62K66l48N29Jl33O98q44K18m41Q59n79N90n31O7N58m68K26o14R41
$$ -672 310 -252 14 -334 195 196 -137 561 -283 -65 -506 353 -226 364 -167 -100 458 -10 216 -398 543
2383E43j093O42l43O14o10K84J80q57J050q52P89o56R43j123L28K84LJ13m49P38
$$ 543 -550 92 -251 363 -247 37 217 -640 410 -442 347 -309 634 -489 -161 123 126 239 -210 528
2403E28j135J303r67K69j5K94k56k95Q11j009P78q49P93o22P81k35l7K19l87J45
$$ 528 -607 696 -271 -2 -17 277 21 -274 537 -472 306 -543 250 -372 409 174 137 356 -31 114
2423A14l78P43r76Q25m31J04o6N50k95m27N94p86O81p18P02n55N24J25n57O22
$$ 114 -264 479 -497 328 -103 1 -65 485 190 -237 357 -429 252 -466 236 -319 205 330 -227 395
2443C95o26K89m29P23p12K85J40k80M91p54O32n98Q70o39N2K33K11j40l51M87
$$ 395 -231 58 -371 352 -360 -75 65 -215 276 -478 154 -444 426 -213 -161 72 283 143 -208 279
2463B79p79O95j10j57q4L54Q8l00J44k49R3K65N9j43l71K44pJ10n4L01q19P04
$$ 279 -500 195 85 -72 -156 198 286 -14 130 -119 -26 239 298 155 -216 28 21 131 77 378 -441 263
2485B63k64M1R2n3R3l57M76n96L32j2j57J37p1J81j28J30k34K27n65Q12o07J06
$$ 263 -1 40 132 79 172 -185 291 -305 27 15 -142 -5 -76 105 -23 107 -127 100 -465 347 -260 -154
2507a54M37p25Q17o57O25q19O55j59j97L92l88M21p06J021j118O37j67J08p7L3
$$ -154 283 -442 375 -282 343 -476 179 20 -177 215 -173 248 -458 563 -555 82 -85 23 -54 -21
2527b1K85p27R75r65P15n55N59n20K61K79l62J94k36M54n83P22l82m60N79l78
$$ -21 264 -463 512 -453 262 -293 266 -254 7 286 -76 118 -118 336 -247 475 93 -367 212 -166
2547a66K75o75J109j156J016m47K21m38O43k79n54J033r51N01n71J020r09O80
$$ -166 109 -566 543 -613 403 -44 177 -261 382 103 -451 582 -369 132 -439 581 -328 352
2565C52j81p16R70p62P69j033R75o43M50j51k2K10l34Q09j393J046m67k88J32
$$ 352 171 -545 425 -337 432 -601 374 -269 181 30 8 218 -116 693 -700 346 -121 -409 -277
2584b77P34l98n11R52q78O81p00R44r48M86q9l52N85m79N63o42M66o66O27j61
$$ -277 457 59 -452 500 -378 303 -397 547 -401 85 -4 -356 229 -250 313 -329 137 -529 98 -63
2604f3K67l80L29J05q09R82n78J60j44N40p26K54M80q71O92j93K80r59R31j76
$$ -63 204 -176 153 258 -551 431 -147 13 -131 409 -317 -63 417 -454 238 45 325 -634 297 121
2624A21j67K94m15J22j34P59r40Q02n14K0j33M63j56o43R12o83M92j84J37n18
$$ 121 -46 248 -167 -45 -179 580 -360 442 -72 -52 -185 278 122 -521 391 -292 200 16 153 -365
2644c65M95R5n57N92o03K19l93R55r46P70lk61k07m3N91o79Q42r27L88O0K31n48
$$ -365 130 225 -332 260 -343 -124 -517 438 -508 262 259 -2 -209 -252 339 -340 502 -425 -37 23 254 -294
2666b94Q4M48o38O14l16N33o05N30m88o6J94Q2p3k62Q39j062O04j74K12n57P15
$$ -294 -210 238 -400 214 -102 431 -174 356 -132 -198 -4 78 5 -257 582 -480 124 -50 162 -395 320
2687C20m78R7O74p99N69p92P02q40Q16k44l50N66j71k26m12Q78m66K42k95J46
$$ 320 -158 -61 613 -186 383 -409 293 -547 269 25 -325 241 70 -156 -568 310 -156 86 -209 -63
2707f3l37L06K26m07M52j08J68n50P93q34M23O7j15o6k14O47r14P91n85L62k26
$$ -63 -400 -94 132 -275 177 69 237 -313 480 -354 69 136 21 -45 -259 388 -526 265 -320 42 -184
2728a84M30n70K82M30p89P38m03M57r94Q69k78k78N11m24L53n61R51j069P27l97
$$ -184 246 -324 -42 388 -401 337 -66 391 -603 266 -12 -290 221 -203 150 -411 540 -529 198 -199
2748a99J98o9k02J86j87P08n13K45j06M33o36K37j75q0L71k87J70m93O59n41L04
$$ -199 -1 -70 -272 -86 -273 435 -78 167 61 494 -142 95 -80 -160 211 -76 94 -399 260 -281 23
2769B3o7j03m3L3M67q28R39o69N53n78K48l33J90J70j32M30m48N09p35P90o44
$$ 23 -44 -147 -190 -157 310 -518 421 -248 305 -273 -25 -358 -168 2 -130 300 -148 361 -374 416 -228
2790b28J17J97j6%l98N74m37L09j1J2m58M65Q9m15K93j19K87n72M63o6O9j31q1
$$ -228 -111 86 70 70 -328 246 -191 118 107 119 -339 126 215 -200 93 -26 261 -311 152 86 155 24 -57
2813e7K7k68O62p31J98j57N75k79J34Q9j55R0l22L09j74L17j27K89n26j48M90
$$ -57 -30 -298 364 -367 -169 -326 249 -30 104 193 38 128 -194 115 -59 258 131 420 -106 -254 236
2834B36o31P12m38J59m3K9K11l83M64n56N69o09L75j40J21m52L15m6l1N90q67
$$ 236 -395 317 -121 38 -5 24 235 -148 316 -240 329 -280 95 -45 76 -376 -61 -107 -138 452 -415
2855d15O80j75J02k47L5j9l24N04k33n5N7L01m52M35j74P7l7k24L38l86N09m50
$$ -415 265 90 192 -55 -20 -39 -363 141 -92 -147 -90 211 -241 194 20 97 60 -164 174 -212 297 -153
2877a53L71k00J24r2j56N74o66N15p53M89l02M34k5j22J91l66K50m46N02m81M46
$$ -153 218 18 142 50 -106 468 -198 317 -436 53 -249 185 160 38 229 -137 113 -333 169 -312 134
$$ [...]
8191c
##END NTUPLES=NMR FID
##END=
