##TITLE=1H_LR-758-R5-3HS-FR3
 CCl4
 8 sc, 
 5.9.2023
##JCAMPDX= 6.0         $$ Bruker NMR JCAMP-DX V2.0
##DATA TYPE= NMR FID
##DATA CLASS= NTUPLES
##ORIGIN= UXNMR, Bruker Analytische Messtechnik GmbH
##OWNER= root
$$ XWIN-NMR		Version 3.5
$$ Wed Sep  6 13:50:14 2023 Russian Standard Time (UT+4h)  she@DPX200
##.OBSERVE FREQUENCY= 200.13135
##.OBSERVE NUCLEUS= ^1H
##.DELAY= (6, 6)
##.ACQUISITION MODE= SIMULTANEOUS
##.ACQUISITION SCHEME= undefined
##.AVERAGES= 8
##.DIGITISER RES= 18
##SPECTROMETER/DATA SYSTEM= spect
##.PULSE SEQUENCE= zg30
##.SOLVENT NAME= CDCl3
##.SHIFT REFERENCE= (INTERNAL, CDCl3, 0, 15.7039)
##AUDIT TRAIL= $$ (NUMBER, WHEN, WHO, WHERE, WHAT)
$$ ##TITLE= Audit trail, XWIN-NMR		Version 3.5
$$ ##JCAMPDX= 5.01
$$ ##ORIGIN= Bruker BioSpin GmbH
$$ ##OWNER= she
$$ F:/spectra/data/she/nmr/H-F/1/audita.txt
$$ ##AUDIT TRAIL=  $$ (NUMBER, WHEN, WHO, WHERE, WHAT)
(   1,<2023-09-06 13:48:42.48 +0400>,<she>,<DPX200>,
      <created by zg, POWCHK disabled, PULCHK disabled
       configuration hash MD5:
       00 E9 B6 7A A2 85 ED C7 34 08 36 98 17 FE 4E 26
       data hash MD5: 16K
       16 E7 CC 17 72 1A B1 B8 0F BA 88 22 0C 5C D5 6A>)
$$ ##END=
$$ 
$$ hash MD5
$$ E4 7F 2F 9F 10 FA D7 E6 16 FC 57 F8 E0 F0 E5 4B
##$RELAX= 
##$RELAX= 
##$RELAX= 
##$RELAX= 
##$RELAX= 
##$RELAX= 
$$ Bruker specific parameters
$$ --------------------------
##$DU= <F:/spectra>
##$EXPNO= 1
##$NAME= <H-F>
##$PROCNO= 1
##$TYPE= <nmr>
##$USER= <she>
##$AMP= (0..31)
100 100 100 100 100 100 100 100 100 100 100 100 100 100 100 100 100 100 
100 100 100 100 100 100 100 100 100 100 100 100 100 100 
##$AQSEQ= 0
##$AQ_mod= 1
##$AUNM= <au_zg>
##$AUTOPOS= <>
##$BF1= 200.13
##$BF2= 200.13
##$BF3= 200.13
##$BF4= 200.13
##$BF5= 200.13
##$BF6= 200.13
##$BF7= 200.13
##$BF8= 200.13
##$BYTORDA= 1
##$CFDGTYP= 0
##$CFRGTYP= 5
##$CHEMSTR= <none>
##$CNST= (0..31)
1 1 145 1 1 1 1 1 1 1 1 1 1 1 1 1 1 1 1 1 1 1 1 1 1 1 1 1 1 1 1 1 
##$CPDPRG= <>
##$CPDPRG1= <>
##$CPDPRG2= <>
##$CPDPRG3= <>
##$CPDPRG4= <mlev>
##$CPDPRG5= <mlev>
##$CPDPRG6= <mlev>
##$CPDPRG7= <mlev>
##$CPDPRG8= <mlev>
##$CPDPRGB= <>
##$CPDPRGT= <>
##$D= (0..31)
0 1.2 0 0 0 0 0 0 0 0.06 0 0.03 0 0 0 0 0.0002 0 0 0 0 0 0 0 0 0 0 0 0 
0 0 0 
##$DATE= 1693993721
##$DBL= (0..7)
120 120 120 120 120 120 120 120 
##$DBP= (0..7)
150 150 150 150 150 150 150 150 
##$DBP07= 0
##$DBPNAM0= <>
##$DBPNAM1= <>
##$DBPNAM2= <>
##$DBPNAM3= <>
##$DBPNAM4= <>
##$DBPNAM5= <>
##$DBPNAM6= <>
##$DBPNAM7= <>
##$DBPOAL= (0..7)
0.5 0.5 0.5 0.5 0.5 0.5 0.5 0.5 
##$DBPOFFS= (0..7)
0 0 0 0 0 0 0 0 
##$DE= 6
##$DECBNUC= <off>
##$DECIM= 32
##$DECNUC= <off>
##$DECSTAT= 4
##$DIGMOD= 1
##$DIGTYP= 9
##$DL= (0..7)
0 120 120 120 120 120 120 120 
##$DP= (0..7)
150 150 150 150 150 150 150 150 
##$DP07= 0
##$DPNAME0= <>
##$DPNAME1= <>
##$DPNAME2= <>
##$DPNAME3= <>
##$DPNAME4= <>
##$DPNAME5= <>
##$DPNAME6= <>
##$DPNAME7= <>
##$DPOAL= (0..7)
0.5 0.5 0.5 0.5 0.5 0.5 0.5 0.5 
##$DPOFFS= (0..7)
0 0 0 0 0 0 0 0 
##$DQDMODE= 0
##$DR= 18
##$DS= 0
##$DSLIST= <SSSSSSSSSSSSSSS>
$$ [...]
##$SUBNAM2= <"">
##$SUBNAM3= <"">
##$SUBNAM4= <"">
##$SUBNAM5= <"">
##$SUBNAM6= <"">
##$SUBNAM7= <"">
##$SUBNAM8= <"">
##$SUBNAM9= <"">
##$SW= 18.05172834244
##$SWIBOX= (0..15)
0 0 2 0 0 0 0 0 0 0 0 0 0 0 0 0 
##$SW_h= 3612.71676300578
##$TD= 16384
##$TD0= 1
##$TE= 0
##$TE2= 300
##$TE3= 300
##$TEG= 300
##$TL= (0..7)
0 120 120 120 120 120 120 120 
##$TP= (0..7)
150 150 150 150 150 150 150 150 
##$TP07= 0
##$TPNAME0= <>
##$TPNAME1= <>
##$TPNAME2= <>
##$TPNAME3= <>
##$TPNAME4= <>
##$TPNAME5= <>
##$TPNAME6= <>
##$TPNAME7= <>
##$TPOAL= (0..7)
0.5 0.5 0.5 0.5 0.5 0.5 0.5 0.5 
##$TPOFFS= (0..7)
0 0 0 0 0 0 0 0 
##$TUNHIN= 0
##$TUNHOUT= 0
##$TUNXOUT= 0
##$USERA1= <user>
##$USERA2= <user>
##$USERA3= <user>
##$USERA4= <user>
##$USERA5= <user>
##$V9= 5
##$VALIST= <valist>
##$VCLIST= <CCCCCCCCCCCCCCC>
##$VD= 0
##$VDLIST= <DDDDDDDDDDDDDDD>
##$VPLIST= <PPPPPPPPPPPPPPP>
##$VTLIST= <TTTTTTTTTTTTTTT>
##$WBST= 1024
##$WBSW= 4
##$XGAIN= (0..3)
0 0 0 0 
##$XL= 0
##$YL= 0
##$YMAX_a= 191627
##$YMIN_a= -270970
##$ZGOPTNS= <>
##$ZL1= 120
##$ZL2= 120
##$ZL3= 120
##$ZL4= 120
##$ABSF1= 10
##$ABSF2= 0
##$ABSG= 5
##$ABSL= 3
##$ALPHA= 0
##$AQORDER= 0
##$ASSFAC= 0
##$ASSFACI= 0
##$ASSFACX= 0
##$ASSWID= 0
##$AUNMP= <proc_1d>
##$AZFE= 0.1
##$AZFW= 0.1
##$BCFW= 1
##$BC_mod= 2
##$BYTORDP= 1
##$COROFFS= 0
##$CY= 11.3945322036743
##$DATMOD= 1
##$DC= 2
##$DFILT= <>
##$DTYPP= 0
##$F1P= 15.7292609196834
##$F2P= 12.9074282941183
##$FCOR= 0.5
##$FTSIZE= 0
##$FT_mod= 4
##$GAMMA= 1
##$GB= 0.15
##$INTBC= 1
##$INTSCL= 1
##$ISEN= 128
##$LB= 0.24
##$LEV0= 0
##$LPBIN= 0
##$MAXI= 10000
##$MC2= 0
##$MEAN= 0
##$ME_mod= 0
##$MI= 1.114404
##$NCOEF= 0
##$NC_proc= 0
##$NLEV= 6
##$NOISF1= 3.799351
##$NOISF2= 2.8
##$NSP= 1
##$NTH_PI= 0
##$NZP= 0
##$OFFSET= 15.70392
##$PC= 1
##$PHC0= -21197.83
##$PHC1= 7.65271
##$PH_mod= 1
##$PKNL= yes
##$PPARMOD= 0
##$PSCAL= 0
##$PSIGN= 0
##$REVERSE= no
##$SF= 200.130013532006
##$SI= 16384
##$SIGF1= 3
##$SIGF2= 2
##$SINO= 400
##$SIOLD= 16384
##$SREGLST= <1H.CDCl3>
##$SSB= 0
##$STSI= 0
##$STSR= 0
##$SW_p= 3612.71676300578
##$SYMM= 0
##$S_DEV= 0
##$TDeff= 0
##$TDoff= 0
##$TI= <>
##$TILT= no
##$TM1= 0
##$TM2= 0
##$TOPLEV= 0
##$USERP1= <user>
##$USERP2= <user>
##$USERP3= <user>
##$USERP4= <user>
##$USERP5= <user>
##$WDW= 1
##$XDIM= 8192
##$YMAX_p= 0
##$YMIN_p= 0
$$ End of Bruker specific parameters
$$ ---------------------------------
##NTUPLES= NMR FID
##VAR_NAME=  TIME,          FID/REAL,        FID/IMAG
##SYMBOL=    X,             R,               I
##VAR_TYPE=  INDEPENDENT,   DEPENDENT,       DEPENDENT
##VAR_FORM=  AFFN,          ASDF,            ASDF
##VAR_DIM=   8192,          8192,            8192
##UNITS=     SECONDS,       ARBITRARY UNITS, ARBITRARY UNITS
##FACTOR=    0.0002768,     1,               1
##FIRST=     0,             0,               0
##LAST=      2.2672688,     0,               0
##MIN=       0,             -270970,         0
##MAX=       2.2672688,     191627,          0
$$ Real data points
##PAGE= N=1
##DATA TABLE= (X++(R..R)), XYDATA
0 0 0 0 0 0 0 0 0 0 0 0 0 8 -8 8 -8 16 -16 16 -24 24 -32 40 -48 56 -64 72 -88 96 -112 128 -148 168 -189
33 -189 215 -240 272 -304 340 -380 421 -469 521 -577 637 -705 777 -857 944 -1040 1146 -1261
51 -1261 1388 -1531 1691 -1871 2076 -2308 2578 -2893 3269 -3727 4293 -5020 5982 -7319 9301
66 9301 -12522 18591 -33643 138873 127614 -270970 163328 32904 -179653 190469 -23476
77 -23476 -165381 165992 -28035 -62463 84048 -81749 18389 76936 -88076 25905 12259
88 12259 -32824 64258 -44331 -29722 60500 -34504 21050 -3702 -53846 82056 -23615 -54871
100 -54871 84289 -63721 -6143 98343 -112858 9872 99991 -106317 31793 49711 -95347
111 -95347 73822 12303 -86051 78980 -17374 -38767 71464 -65786 1789 75946 -83382
122 -83382 16983 48819 -69336 47230 10709 -66691 60290 -486 -38951 37799 -29188
133 -29188 8693 35017 -54776 21196 21247 -39018 42176 -17329 -39636 64727 -20138 -32285
145 -32285 41753 -30474 8494 33759 -53817 17650 27201 -36727 29961 -10589 -33659 57410
157 57410 -17090 -37023 44306 -20519 -7394 37579 -41590 -407 38724 -29129 3099 9293
169 9293 -21165 26290 -2195 -25551 22458 -5006 -5176 17239 -23546 3586 22294 -20493 3432
182 3432 5667 -12304 18071 -6672 -14338 19858 -9304 -2448 14523 -21937 8624 17553 -25975
195 -25975 9336 10650 -19403 16483 -1185 -18092 21360 -5082 -11823 16616 -12363 638
207 638 15807 -20830 5119 14553 -18307 8339 4973 -15575 14779 196 -13755 11801 -2470
220 -2470 -2878 7346 -10939 4834 7567 -11987 6995 455 -8991 13669 -4908 -10062 13258
233 13258 -4331 -3401 7104 -9243 4519 5792 -10508 6510 -435 -6736 12504 -7223 -7759
246 -7759 14920 -6946 -4869 10562 -9055 741 8846 -9592 1607 4126 -5069 5153 -2965
259 -2965 -4011 8606 -5044 -2456 7198 -6958 939 6929 -8045 710 5406 -4538 998 735
273 735 -1727 2556 -2096 490 1826 -4426 3757 1758 -6675 4502 2133 -5936 3904 641 -3915
288 -3915 3432 -584 -1689 1813 -1837 1669 431 -3805 4078 116 -4917 5001 -209 -4913 5047
303 5047 -186 -4291 3681 80 -2487 1716 -268 -163 -110 -805 2002 -1448 -1432 3483 -1845 -2103 3868
320 3868 -1501 -2260 3080 -558 -1791 1246 442 -650 -829 1165 739 -2616 1295 2007 -3608 1016
336 1016 2693 -3452 487 2453 -2410 27 1325 -715 -249 -450 979 147 -2172 2141 662 -3432
352 -3432 2594 1264 -3797 2033 1680 -3057 960 1370 -1390 -99 579 383 -1073 -298 2151 -1635
368 -1635 -1529 3185 -1211 -2116 2768 -578 -1674 1785 -76 -1085 206 780 252 -1891 778 2061
384 2061 -2821 199 2705 -2963 259 2880 -2849 -382 2543 -1163 -838 459 532 94 -1294 1200
400 1200 474 -2363 2385 724 -3759 2417 1733 -3280 1121 1172 -1464 735 -13 -260 -51 -425 1902
417 1902 -1461 -2075 3995 -1011 -3176 3613 -777 -2204 3186 -1376 -1731 2441 -340 -528 -448 -296 2440
434 2440 -1865 -1345 3301 -2145 -570 3463 -3595 -503 4112 -2446 -1210 1638 -411 827 -962
449 -962 -444 1563 -1709 1434 1157 -4417 2883 2995 -4988 1363 1969 -2673 2181 -213 -2297 2174
465 2174 -134 220 -170 -2728 3758 703 -4656 3290 394 -3052 4058 -1385 -3323 4085 -49 -1866
481 -1866 570 -738 2106 -580 -2166 2729 -1616 -592 3985 -4176 -908 5287 -3151 -1125 2525
496 2525 -2150 1502 525 -2322 2057 -1075 121 2645 -4414 1197 4519 -5210 787 3464 -4403
511 -4403 2005 2056 -4099 1926 1300 -1669 1029 -1418 1011 1646 -3399 1786 1386 -3381 2944 415
527 415 -3759 3131 806 -2689 1210 104 101 239 -1269 1550 -600 -1119 2993 -2317 -1678 4494 -2061
544 -2061 -2323 3335 -1270 -741 1915 -1630 72 843 -366 908 -2008 313 3244 -3115 -670 3473
560 3473 -2869 85 3126 -3506 -62 3331 -2057 -788 1111 -220 690 -805 -106 1022 -1456 1252
576 1252 1068 -3397 1591 2597 -3370 400 1980 -1984 888 922 -1878 516 802 23 -324 -1410 1808
593 1808 822 -2679 1422 791 -2294 2387 320 -3206 2172 1196 -2050 608 -179 204 924 -1563 699
610 699 247 -1469 2656 -825 -3128 3682 274 -3154 2420 -352 -1512 2528 -1012 -1323 1179 -164
626 -164 896 -1134 -1406 3142 -1186 -1937 2897 -2017 -877 3754 -2823 -1377 3211 -1299 -405 614
642 614 -1165 1538 -464 -945 1590 -2006 745 2586 -3826 531 3138 -2988 492 1411 -2243 1636
658 1636 243 -1512 1198 -1042 897 1061 -3348 2228 1774 -3969 2304 988 -3404 3054 84 -3221
674 -3221 2614 -30 -1176 986 -1497 1428 657 -2734 2269 -193 -2207 3552 -1771 -2588 4301 -1269
690 -1269 -2129 2418 -1444 455 1372 -2503 1174 377 -1201 2377 -2268 -1238 4258 -2432 -1727 3096
706 3096 -2039 145 2111 -2718 280 1543 -768 451 -1545 490 2279 -2739 447 1842 -2915
721 -2915 1996 1320 -3933 2051 1665 -2513 1160 -283 -656 1776 -1640 121 1178 -1981 1951 236
737 236 -3249 2980 605 -3113 2287 -17 -1683 2005 -860 -760 1196 -784 772 -459 -1392 2531
753 2531 -983 -1864 2809 -1239 -1319 2657 -1663 -904 2225 -1147 -430 515 -471 928 -990 -379 1679
770 1679 -1607 110 1822 -2473 496 2134 -2329 41 1432 -1214 400 177 -562 654 -604 448
786 448 364 -1689 1420 745 -2363 1278 927 -1854 1070 425 -1370 767 367 -488 -119 -158 902 -452
804 -452 -1043 1531 -465 -1217 1669 -582 -1246 1724 -310 -1201 878 174 -378 -92 60 423 -557 4
822 4 927 -1154 -23 1505 -1208 -574 1447 -543 -642 821 -122 -445 275 375 -414 -543 971 206 -1306
841 -1306 713 735 -1253 448 745 -1148 195 921 -681 -421 679 207 -531 -66 554 -326 -396 823
859 823 -220 -931 914 435 -1144 320 880 -831 -147 820 -440 -474 874 15 -895 510 631 -731
877 -731 -207 761 -260 -464 553 117 -757 372 657 -766 -253 972 -362 -690 743 20 -628 502
895 502 410 -748 31 893 -434 -765 750 319 -834 358 467 -759 183 714 -678 -308 794 54
913 54 -724 197 568 -426 -287 746 -408 -496 1092 -170 -1095 850 435 -888 146 458 -270 -23 193
932 193 -69 -340 304 522 -776 -362 1064 -339 -761 719 -34 -561 624 50 -673 343 696 -477
950 -477 -666 763 366 -806 323 427 -674 454 549 -929 -12 858 -277 -635 163 526 -210 -403
968 -403 500 -95 -418 804 -206 -1052 999 531 -1107 156 646 -362 -4 235 -248 -145 501 222
986 222 -833 47 1071 -531 -686 797 -3 -464 506 -151 -494 625 367 -730 -401 854 264 -930
1004 -930 273 571 -575 306 236 -896 329 894 -622 -618 490 548 -386 -496 418 -7 -129 578 -672
1023 -672 -654 1371 191 -1270 310 631 -174 24 -256 -136 266 418 -155 -911 368 1171 -725 -775 735
1042 735 17 -29 257 -672 -155 791 147 -701 -412 808 424 -1028 32 574 -512 475 115 -1194 598
1061 598 882 -876 -302 444 273 -33 -496 96 184 -125 511 -454 -724 1224 108 -1188 497 428 -385
1080 -385 109 -293 -123 383 -9 -57 -532 120 1031 -859 -732 1175 -204 -504 504 -550 12 806 -431
1099 -431 -548 165 513 142 -1007 66 952 -560 -91 235 -845 689 883 -1339 -198 1044 35
1116 35 -298 -405 104 536 -195 -24 -393 -392 1255 -141 -1493 728 644 -438 57 -429 -84 743 -135 -346
1136 -346 -372 101 1158 -804 -1092 1209 -25 -634 684 -689 -254 1252 -460 -795 364 399 126 -630
1154 -630 -123 712 -458 32 362 -1029 479 1008 -1226 -106 834 -400 25 11 -213 346 -180 110
1172 110 25 -583 826 97 -1177 795 435 -981 494 179 -465 419 -93 -251 128 57 388 -578 -404
1191 -404 1117 -354 -718 775 -270 -250 788 -596 -326 664 34 -199 -436 146 667 -603 -131 522
1209 522 -614 411 598 -1147 170 996 -541 -317 70 65 301 -252 -52 33 -162 779 -250 -1015 854
1228 854 378 -764 251 42 -211 403 -48 -267 -122 258 528 -718 -260 951 -466 -290 681 -544
1246 -544 -77 754 -477 -311 306 104 -82 -367 221 297 -590 348 361 -816 589 481 -892 301 447
1265 447 -495 40 162 -20 -11 -146 355 -124 -375 697 -223 -565 883 -24 -631 528 59 -321 135 45
1285 45 -23 -169 159 297 -657 195 680 -754 -27 617 -495 61 348 -299 -18 288 133 -206 -341 544
1305 544 88 -718 624 77 -702 713 18 -737 514 155 -347 105 -73 189 -59 -215 452 -313 -170
1324 -170 856 -528 -481 853 -314 -358 540 -221 -93 243 -77 -20 -242 271 321 -672 219 595 -689 247
1344 247 548 -688 192 483 -447 -50 202 51 21 -180 243 72 -407 489 -62 -647 609 169 -577 301
1364 301 193 -272 117 73 -18 -165 93 328 -446 -68 648 -406 -230 640 -389 -120 470 -309 -143 247
1384 247 -26 74 -218 160 305 -535 209 466 -681 248 508 -676 105 483 -542 58 203 -134 27
1403 27 -55 138 8 -315 403 110 -607 437 204 -631 370 218 -455 215 128 -208 0 132 106 -292 -80
1424 -80 458 -276 -293 527 -229 -335 513 -186 -336 393 54 -224 20 68 51 -193 52 235 -393 96 419
1445 419 -514 -85 513 -343 -157 370 -170 -102 155 20 -113 -166 330 59 -496 328 219 -564 312 217 -572
1466 -572 312 235 -391 44 107 -56 42 -144 123 -16 -259 396 -65 -521 554 38 -590 330 148 -373 197
1487 197 67 -274 84 147 -16 -299 -37 375 -250 -200 374 -297 -57 449 -330 -221 416 -9 -220 3 79
1508 79 198 -190 -22 183 -332 184 254 -624 96 552 -423 -185 287 -130 27 40 -156 -145 64 253 -169
1529 -169 -435 458 194 -455 213 87 -314 342 15 -381 193 188 -108 -159 -51 294 -98 -243 327 -145 -198
1550 -198 400 -241 -368 506 4 -389 128 103 -33 -32 -22 38 -85 109 129 -461 131 399 -371 -147 283 -106
1572 -106 3 15 -116 31 83 166 -208 -315 499 65 -536 194 188 -199 248 -54 -324 184 231 -45 -307 90
1594 90 394 -248 -289 368 -178 -34 451 -465 -213 585 -64 -330 -2 108 173 -180 -20 52 -223 304 137
1615 137 -622 239 435 -451 -79 178 -171 206 59 -184 -49 32 278 -186 -299 435 73 -383 297 -39
1635 -39 -272 339 -44 -280 182 113 -34 -145 16 364 -247 -118 419 -374 -1 484 -552 -11 429 -302
1655 -302 -123 125 14 109 -156 15 159 -215 276 53 -512 368 310 -492 124 192 -222 194 53 -233 72
1676 72 100 147 -248 -176 439 -2 -408 339 -36 -146 348 -185 -301 283 55 -172 -149 -18 222 -170 -134 240
1698 240 -200 13 420 -385 -132 442 -112 -160 98 -20 -11 82 1 -125 -67 268 36 -385 183 231 -259 112
1720 112 129 -184 100 191 -157 -69 82 140 -117 -87 240 -83 -141 237 -15 -228 315 -12 -317 201 183 -213
1742 -213 -7 96 -18 -89 34 73 -89 -2 214 -117 -180 261 29 -211 161 125 -175 37 72 -155 25 179
1764 179 -91 -175 122 160 -157 -21 149 -146 -39 209 -94 -187 247 42 -249 81 101 -140 -75 92 -47 -143
1786 -143 68 145 -196 -28 233 -139 -51 216 -70 -147 217 -47 -133 86 188 -118 -67 164 3 -179 136 82
1808 82 -261 102 219 -267 43 181 -162 -9 147 -43 -153 45 93 -70 -50 136 -87 -130 193 -6 -238
1829 -238 145 130 -232 -23 204 -123 -67 164 -24 -95 63 108 -87 -53 169 -43 -139 126 5 -186 110 72
1851 72 -135 25 181 -96 -81 102 -78 -130 114 152 -200 -24 171 -88 -79 150 -106 -161 127 79 -142 -34 67
1874 67 -35 -60 89 -34 -151 55 112 -206 6 196 -166 -76 164 1 -87 121 -10 -204 20 126 -142 -130
1896 -130 146 75 -115 59 14 -175 83 131 -145 -61 203 -17 -209 48 103 -127 -20 106 -133 -77 153 -61
1918 -61 -172 35 119 -117 -60 80 -72 -91 91 -89 -195 185 98 -196 17 113 -46 13 64 -32 -79 83 110 -214
1942 -214 -23 273 -141 -93 152 -99 -82 154 -105 -137 61 42 -13 -115 117 78 -160 39 145 -210 178 183 -214
1965 -214 48 159 -163 -36 50 31 -1 -18 82 -76 -134 242 -29 -223 185 26 -146 120 -37 -61 141 -40
1987 -40 -31 -80 47 229 -221 -32 260 -171 -28 222 -218 4 200 -186 -55 91 -23 83 -110 -20 98 -166
2009 -166 76 55 -261 159 170 -256 38 216 -103 -10 -43 -51 18 -29 79 -142 -84 251 -37 -192 190 -10 -115
2032 -115 114 -29 -51 129 79 -97 -41 92 153 -151 -137 210 -50 -17 158 -199 -48 216 -57 -162 95 87 -22
2055 -22 -41 13 60 -25 22 -23 -147 111 172 -221 -76 141 2 -1 50 -71 44 91 -25 -116 -52 115 66 -212 32
2080 32 127 -90 24 33 -140 136 135 -198 -12 209 39 -46 -27 28 91 45 -20 -45 -42 206 51 -298 81 232 -155
2105 -155 -50 -11 -50 141 69 -155 -115 163 168 -151 -179 199 97 -122 16 -58 -47 269 -88 -276 93 154 -16
2128 -16 -150 -52 111 35 -79 -5 -115 78 170 -257 -88 283 33 -119 17 -35 141 91 -109 -105 47 165 20
2151 20 -246 66 218 -95 -72 51 -28 85 38 -210 -55 169 73 -178 -177 117 85 -113 3 -39 24 203 -62
2174 -62 -264 136 166 -82 -122 73 94 128 -114 -61 -1 135 160 -213 -191 292 42 -169 51 -13 14 89 -113 -168
2198 -168 65 117 -65 -171 16 208 -63 -188 39 -14 160 106 -189 -60 221 -24 -140 -55 66 105 -85 -57
2220 -57 -6 22 127 -56 -181 143 219 -129 -138 83 23 45 -69 -93 -48 154 -13 -203 -102 201 40 -129 -10
2243 -10 5 25 78 -128 -73 115 129 -107 -166 107 195 -114 -129 14 -16 101 53 -170 66 184 -29 -140 -80 108
2267 108 91 -37 -17 21 114 153 -140 -116 126 91 -85 -32 22 131 55 -107 -24 -58 102 54 -206 -43 215 -34
2291 -34 -79 -2 -42 5 22 -84 -56 90 71 -40 -117 78 111 -47 2 3 7 104 -32 -117 27 64 5 -34 -18 123 9
2318 9 -60 47 -14 -68 133 -87 -102 108 18 -118 -21 24 53 -40 -45 68 -32 82 51 -100 54 137 -113 -48 50 25
2344 25 24 -63 23 11 31 21 -98 -125 137 35 -133 27 72 -11 50 -7 -101 69 180 -9 -108 20 126 -84 -60
2369 -60 86 -116 40 118 -154 -54 148 -1 8 -50 64 52 -53 54 14 -137 135 31 -172 113 62 -29 71
2392 71 -15 -17 26 -22 48 -15 -27 121 -40 -106 167 -47 -86 197 -120 19 65 -75 -45 47 -21 53 -100 -62 100 -130
2418 -130 -23 102 -115 101 62 -74 50 87 -40 45 -60 12 58 -66 28 69 -95 138 52 -137 150 55 -83
2441 -83 71 -14 -45 43 -22 33 35 -38 67 12 -94 187 14 -84 124 -41 -12 69 -61 -54 72 15 21 -2 35 60 -20
2468 -20 -10 49 -48 -50 127 -40 -40 92 -73 -34 48 4 38 -28 35 -5 -78 84 5 -132 13 67 -73 40 30 -48 -48
2495 -48 2 -36 6 15 -18 -24 -83 51 67 -57 70 8 -48 44 30 -93 55 83 -69 -2 54 -62 109 -14 -18 65 -18
2522 -18 84 1 -116 127 77 -96 53 52 -39 116 -71 -69 75 -21 39 -31 -31 71 -8 -130 49 32 -38 108 -33
2547 -33 -28 164 8 -56 34 -37 11 1 -103 56 -34 -11 88 -143 15 177 -75 -82 114 -44 23 13 -70 59 76 -66
2573 -66 19 -63 47 59 -158 35 128 -16 72 -8 -186 97 43 -105 13 7 64 6 -92 13 97 -2 62 34 -51 133
2599 133 1 -76 45 54 -7 50 -63 61 -3 -23 35 -91 13 128 -12 -110 132 -38 -72 96 -35 -48 90 -21
2623 -21 -106 -30 13 81 -77 -64 66 13 -27 61 -91 15 138 -158 -54 99 20 -30 -14 -38 74 11 -63 -7 -36 95
2649 95 74 -157 7 129 -39 50 31 -63 87 74 -110 3 58 71 46 -78 19 38 -61 71 -14 -56 105 21 -129
2674 -129 90 -8 7 -44 -70 100 74 -56 49 -36 33 69 -84 -76 145 18 -54 61 -72 42 92 0 -26 0 31
2699 31 42 -39 -18 112 -27 -14 88 -72 102 64 -100 -2 49 15 -23 -83 36 106 -14 18 -11 -47 45 -6 -95 8
2725 8 47 26 -41 -35 65 -25 -11 8 7 38 79 -37 -43 31 7 0 -9 27 1 28 4 -59 -39 51 -21 -74 18 -13 6 28 -10 8
2757 8 -3 -26 -10 -71 43 114 -44 -45 82 -16 22 42 -52 23 45 -12 10 -7 15 79 -61 0 46 -40 21 -1 -82 76 45
2786 45 -44 -2 44 -14 66 -76 39 47 -49 66 -77 -54 75 11 -52 54 -28 37 0 -95 9 6 -24 97 -47 -33 104
2813 104 -67 -50 96 -26 18 66 -157 72 30 -34 -57 -6 51 76 -79 52 53 -38 122 7 -115 40 18 -46 6
2838 6 -35 -4 8 -34 11 36 2 52 -7 -88 69 -24 -88 49 45 -8 29 48 23 4 -48 -3 28 12 77 20 -43 66 34 -35
2868 -35 3 -43 3 122 5 -27 30 28 -22 -25 -60 47 19 -12 2 -10 -8 32 -63 -61 84 28 -44 68 35 -17 65 15 -11 -50
2898 -50 -3 90 -53 21 87 -24 -18 79 -7 40 61 -98 9 -29 1 9 -53 49 49 -17 2 -21 -102 41 104 -34 58 -11
2926 -11 -9 34 -55 -2 73 -70 -1 -2 -22 92 -2 -68 87 5 -41 109 -124 22 20 -21 9 33 -17 42 -23 16 19 -44 6
2955 6 87 -55 -7 24 -85 27 -6 -24 -21 6 -42 27 -6 27 75 -59 24 30 -40 19 6 -86 1 -38 27 92 -37 10 15 -44
2985 -44 46 -48 -52 75 -12 -6 52 -5 -16 46 -49 -30 -5 -14 -22 19 -7 -17 -23 -4 65 -27 1 21 -41 8 4 8 51 -47 -13 9 -25
3018 -25 59 17 -66 36 62 -26 61 -21 18 62 22 2 33 18 53 -95 -14 98 -39 -15 88 -2 31 -9 2 42 8 5
3046 5 -39 -17 -2 -6 -32 1 24 -33 16 -15 -113 36 -21 -51 15 35 20 14 -50 -38 -13 -62 17 -28 -74 85 4 -69 -7 -34 -40
3077 -40 26 5 -21 -1 -6 18 -16 -88 52 -27 -80 103 -11 -70 13 -67 -38 32 -41 -74 29 -1 -14 -43 47 46 -15 -22 43 -40
3107 -40 32 69 -68 -37 67 -60 -7 54 -24 11 -19 -57 8 -22 47 66 -72 26 90 -28 5 23 -40 10 5 -98 56
3134 56 29 -1 -12 -112 61 26 -90 38 -10 -86 67 -37 -46 82 18 -8 -46 -38 22 62 -70 -20 10 -7 59 -43 -62
3161 -62 116 47 -89 38 8 13 44 -22 -29 18 -23 35 -55 -71 40 0 -67 103 -19 -3 36 -107 -4 73 -5 -4 -28 -8
3189 -8 72 43 -39 3 2 -20 72 -71 16 72 -90 17 31 -29 13 10 -40 94 -17 -3 32 17 53 52 -118 -16 15 -93
3217 -93 63 13 -46 70 34 -36 53 -36 26 0 -82 24 103 -87 48 -28 -88 148 -11 -86 115 14 32 37 -85 38
3243 38 36 -16 62 -2 -11 124 -118 -75 111 -4 17 120 -73 52 47 -92 61 -2 -18 131 -139 -43 63 -65 -37
3268 -37 88 -117 35 89 -145 -11 6 -3 64 -48 -20 96 -106 35 90 -55 106 73 -129 66 37 -52 48 -34
3292 -34 10 69 -26 30 61 -14 115 25 -169 84 -20 -72 66 -83 -7 79 -103 4 59 -28 68 -36 -116 83 1
3317 1 -52 97 -79 -24 112 -92 7 61 -27 15 -41 -18 91 -27 -12 65 -67 53 56 -84 31 75 -68 -19 -27 -64
3343 -64 84 -18 -26 30 -61 39 22 -59 15 16 -55 37 -45 -46 113 -34 -97 81 8 9 10 -23 55 39 -7 132 -25 -34 75
3372 75 3 -26 120 -35 -27 28 -14 53 -55 13 1 -7 2 26 -44 -26 59 -74 -64 28 -60 3 31 -36 18 47 -14 -67 -14 49
3402 49 77 -83 36 49 -36 74 22 -57 24 24 -20 13 -30 26 62 5 42 66 -37 86 -1 -50 55 74 -25 -8 6 -41
3430 -41 59 15 -25 -12 30 51 27 -50 10 8 1 -7 -21 -72 53 -22 18 22 -7 -12 8 -13 41 -45 -33 55 -32 -9 11 -54 14 9
3462 9 -59 -2 48 4 -16 38 29 21 6 84 75 -4 12 -28 -45 26 3 -85 47 -17 -107 23 -11 8 -4 -2 17 -6 6 16 18 -11
3494 -11 18 -28 -71 65 13 -51 87 -44 41 38 36 -62 13 -52 19 21 -24 49 0 -67 41 -9 -8 56 11 -34 14 -22 19 2
3524 2 -2 14 15 -6 6 -38 -28 7 -34 -3 -2 45 25 36 2 -2 -14 5 -6 7 38 18 -69 12 36 -48 51 45 -35 29 94 14 -10
3557 -10 -31 9 6 -34 -13 -11 4 4 -25 -97 56 -13 16 38 -24 -1 16 -28 -9 14 -24 -24 -51 -23 60 7 -49 84 -14 -39 82
3588 82 16 -16 42 -18 26 -8 13 22 -13 15 13 17 7 40 -53 31 66 -38 41 42 -29 10 -28 -39 37 -7 -45 34 -17 -16 16 -63
3620 -63 17 44 -36 -2 12 13 21 13 6 -4 -52 24 -14 -8 42 14 -62 72 -3 -51 43 -24 -50 7 0 0 12 -20 9 -45 -16 35 -71
3653 -71 -69 76 -15 19 17 -30 -36 44 -36 10 19 -1 72 -10 -43 36 36 33 47 -68 5 50 5 6 11 2 44 43 6 26 -33 68 48 -34
3687 -34 76 -9 -53 62 -21 -21 19 -26 -13 48 42 -14 -55 0 16 -42 -18 41 -56 -39 90 5 -31 64 28 -37 41 6 74 51
3717 51 10 72 -74 15 59 -18 -8 37 -56 -7 34 -2 20 -18 -20 -4 -20 -45 5 -44 10 -23 -58 40 -2 -33 19 75 -35 27
3747 27 -1 -1 29 8 -18 -12 11 -4 30 9 9 -21 -35 -3 -6 -53 -17 7 -34 15 0 27 -45 27 13 -46 -6 35 -5 -18 61 -31
3779 -31 0 39 -40 -86 44 26 -8 27 57 10 25 0 25 -31 64 35 -51 -26 36 16 -51 36 -57 -6 24 -35 -22 6 22 19
3809 19 -12 34 3 -61 -48 -5 -21 -74 21 -26 -4 57 -10 17 57 -19 -32 -4 -3 -2 -44 -9 36 -47 52 35 -95 35 88 -14
3839 -14 49 -39 -32 47 0 -19 -2 -49 29 73 -49 73 -33 -28 63 -3 -37 10 37 -36 10 -23 -29 -8 -51 28 4 -28 50 -45
3869 -45 -83 38 -9 -106 70 -50 -32 -12 -35 -39 27 -31 -4 1 18 60 -55 48 46 -52 54 43 -15 69 -9 -4 51 -88 -12
3898 -12 1 -32 -1 66 -72 -10 22 -52 5 11 -58 -6 -29 -43 -29 9 -12 -14 21 48 24 -63 73 -36 -60 59 -52 -32 71
3927 71 -31 15 41 -6 30 38 18 49 2 -36 65 10 15 -1 -37 -46 43 -75 1 15 -27 12 7 -14 14 -85 -10 6 -58 4 81
3958 81 -46 20 37 -23 25 5 -16 -6 -17 47 51 -3 34 20 0 81 -30 -13 10 -53 2 52 1 -22 48 -3 45 8 -43 40
3988 40 -6 -52 15 21 -17 50 2 -40 31 -24 -40 -23 -17 8 -8 -15 55 -28 -57 20 -30 1 20 -21 6 41 -23 17 -2 -19 -20 7
4020 7 9 19 -6 47 56 -55 11 -15 -48 23 29 -12 18 37 2 -10 7 41 -12 -41 -15 2 -31 25 -14 -24 -33 33 -57 26 64 -6
4052 -6 43 -7 61 50 -13 2 -51 25 69 -28 32 -9 -4 5 48 40 21 -25 37 -52 4 7 34 6 -84 17 -18 -16 -5 -36 24 32 13
4085 13 22 -20 -34 -26 -20 -27 31 16 46 26 -34 20 8 -13 -3 10 24 -6 15 -33 -9 32 49 -14 6 48 -24 -39 -14 28 -26 24
4117 24 -5 -40 60 -15 -3 -7 28 -66 7 12 11 -9 1 -4 -9 -3 -2 6 19 70 11 -21 9 6 -26 13 -12 60 44 36 17 -82 12 15 -10
4152 -10 -14 43 -27 11 7 21 -64 35 10 -39 -14 14 31 -29 63 9 -72 19 23 15 21 50 -8 -11 36 32 30 -18 74 -60 -67 56 11 16
4186 16 34 28 -13 42 21 26 23 -52 -55 1 -18 9 7 -4 25 -9 -1 2 -13 -14 5 -26 -28 -47 31 -7 -28 -34 -7 1 -8 46 -8 -21 21 18 55
4223 55 -23 -2 34 -2 -9 43 0 18 -12 -8 13 20 2 45 25 -71 18 9 20 -10 -30 -15 17 -7 -22 -34 -39 16 -20 -10 5 -18 -19
4256 -19 28 -18 -33 -27 35 -28 68 -16 41 -8 -11 -6 0 59 0 22 7 16 -27 -37 3 11 7 -13 -17 -5 -15 -3 10 -45 -11 -7 -44 -6 -5
4291 -5 -39 11 11 -68 -29 -1 -50 -14 11 21 3 16 -32 7 -30 53 -26 -37 10 7 -10 9 39 7 -2 55 -22 -48 -10 27 -15 -3
4323 -3 72 -50 27 21 -57 12 3 9 -14 11 -8 -7 -43 -22 0 -14 47 -17 -79 10 35 -29 32 38 -8 1 0 26 -12 6 21 -5 -4 62
4357 62 0 -53 -4 19 9 22 -72 45 26 -14 30 -19 -12 -33 -51 -24 26 -14 -17 3 3 1 45 -17 -6 23 19 -30 3 -4 34 31 74
4390 74 4 6 5 15 -72 -36 7 -23 -35 36 -36 50 23 -9 -61 -46 27 -14 -43 21 3 -51 12 -42 8 -17 10 -26 -35 50 -37 -77
4422 -77 -20 0 -44 -25 45 -36 -12 14 -3 -58 31 51 -13 49 -45 7 5 36 -4 -85 -7 -1 -25 -16 66 41 -14 -15 -29 -17 12 29
4454 29 20 -9 10 5 -70 -9 -19 -21 -7 12 1 -45 39 -25 -49 26 -47 17 56 -10 28 13 -1 7 -30 22 56 -14 25 -8 -12 12 -13
4487 -13 12 13 -29 -19 42 17 15 31 -8 21 11 -6 -38 -44 -21 -19 14 8 33 59 10 -72 21 -78 -8 46 -33 11 -12 -14 -13 -15 56 25
4521 25 -61 26 3 6 75 -20 7 78 -8 -50 -56 -32 25 65 10 -22 5 -18 18 -16 -74 13 3 -43 -59 0 19 35 4 -35 33
4552 33 15 19 7 7 86 2 -1 36 -83 -53 8 -7 31 12 -20 59 11 90 1 -6 23 36 -15 33 -21 -78 -3 -43 -37 -20 -17 -14 20
4585 20 7 34 15 -16 -1 -43 9 18 14 -22 46 -6 -5 7 1 6 -23 -3 70 -3 3 44 21 14 23 -11 2 69 28 -44 19 -38 -34 -33 36
4620 36 38 -47 30 51 -14 -5 4 -17 7 24 -31 -30 12 -55 17 -27 -19 -25 -50 -13 56 17 31 21 -15 81 23 -5 81 -5 3 9 -11 27
4654 27 9 40 13 -22 17 50 11 12 25 -12 9 47 -36 -39 -12 25 -14 -17 26 36 -35 -31 -70 44 -8 84 -44 15 -20 -20 23 25
4686 25 -28 -25 42 -6 -23 -25 -7 -25 -20 31 16 -9 46 49 57 -69 18 -47 28 -26 57 -18 17 26 -40 -1 -14 9 -92 -16 -12 -42 2
4719 2 37 -17 -15 10 -16 -44 -2 14 -11 5 8 24 5 15 -8 6 -47 28 -32 -1 8 -31 36 6 -14 28 2 9 -6 10 -24 -30 -44
4752 -44 -4 -11 16 74 -12 -20 9 -66 -24 0 54 25 13 -26 8 -14 -10 -2 17 -22 26 -37 -10 22 -26 23 -30 2 -31 -17 -16 21 7
4785 7 32 25 -27 49 -28 -28 -9 73 14 35 -28 -9 6 8 -59 20 -49 3 9 -41 13 -36 56 49 24 -42 37 1 -34 -2 19 94 -76
4818 -76 68 64 -15 -24 25 10 -30 64 15 -1 13 -34 18 -20 -28 19 -9 -3 -13 -3 7 -28 -19 33 0 -17 2 28 52 -44 31 -62
4850 -62 -51 4 62 34 5 -32 24 -31 6 -33 9 76 56 29 -20 11 12 -2 8 -13 60 -6 19 19 -78 9 18 -50 17 -14 -17 7
4882 7 35 -17 -11 1 -11 -27 -15 -3 -17 -2 1 11 -11 18 24 32 41 10 -18 4 -19 -5 44 17 79 3 33 39 28 26 -19 7 -21 4
4916 4 -20 52 48 2 -29 -38 13 -25 25 -44 -11 -68 4 37 10 -43 10 12 15 16 34 20 -11 22 5 -27 27 12 39 66 10 -5 1 3
4950 3 -25 -1 18 57 27 -48 15 -11 35 -30 -14 -13 -1 -54 3 13 16 -27 -20 -21 -44 64 -37 -37 -27 -19 -18 -29 -36 55 13 31 -41 -10
4984 -10 7 -16 -27 21 5 9 46 35 5 23 29 0 16 24 37 -36 -71 -41 -28 -14 27 -27 -44 2 5 -41 36 -25 19 -82 20
5015 20 -70 -17 19 -13 -41 -27 26 60 18 43 -2 -27 12 -8 16 -9 18 49 -5 -31 -16 -50 7 32 -3 -54 24 -58 -17 -3
5045 -3 2 17 -56 -5 -14 23 -28 44 -61 50 -24 -21 36 -23 -40 -22 18 0 -4 -5 16 37 -12 54 -19 32 34 20 21 15 15 -24 -35 -6
5079 -6 -18 10 2 -46 10 32 16 45 22 46 4 21 21 -28 16 -49 25 18 3 4 9 -24 56 7 -41 8 16 -26 -27 7 1 44 66 -6 8
5114 8 -33 38 -21 -65 -9 -19 24 -28 -6 3 6 35 51 -20 -19 20 -6 16 -23 2 -5 13 2 -31 -39 2 -26 21 29 -5 6 -25 22 -45
5148 -45 -5 -7 10 12 -11 -8 20 46 -16 -1 53 -39 0 73 9 2 15 3 -85 63 -5 -12 -25 41 37 30 -32 21 -22 25 37 -39 29
5181 29 -17 -3 -65 12 6 -53 -21 11 -11 21 -13 20 3 -7 18 -43 -20 31 -32 -6 64 19 -18 -7 38 -10 10 0 -3 1 -3 4 3
5214 3 -42 13 -25 -11 -1 -51 33 -27 18 35 15 0 -8 17 -16 -2 -27 -19 -34 -60 -11 -26 20 48 52 -56 31 -4 1 0 26 -7 -19
5247 -19 -26 -9 -40 -20 23 -16 34 23 -24 7 -7 -4 6 -23 12 -27 -19 2 -11 -23 -26 -30 -29 -49 -26 -32 14 24 16 -38 19 -2 -7 33 4
5282 4 -65 16 16 21 12 28 28 18 35 -20 46 38 -12 14 27 2 -6 -9 17 -11 22 -5 -45 -75 -32 34 44 -35 -28 35 25 12 67 -6 -17
5317 -17 14 -61 -39 -17 33 39 76 36 4 11 50 1 -18 8 -36 104 55 -1 40 -19 22 47 -65 -4 -17 -52 -4 -1 4 -27 7
5348 7 -14 -29 -8 0 37 -41 -24 -43 -13 -46 20 35 46 0 18 -32 0 50 22 -9 -5 17 31 4 -5 16 3 -21 -2 3 24 43 -31
5381 -31 5 18 20 39 52 -66 -1 -2 10 -8 -11 -44 -37 -45 53 1 -31 7 16 14 -4 -11 -44 -16 1 -32 39 -22 -16 -15 28 -42 25 -5 -32
5416 -32 39 10 -2 35 -16 31 -51 -15 14 -28 24 -12 -14 -26 -6 37 -22 -42 -14 20 27 -15 -3 -5 0 -24 -33 24 -15 -11 14 29 42
5449 42 -11 -13 7 4 20 39 10 7 -48 38 4 42 14 -1 -7 -19 10 -15 69 -46 82 -9 5 -31 -12 19 32 29 -7 -21 -12 -16 -56
5482 -56 8 3 22 13 38 -21 -27 16 -13 -41 -28 -12 52 11 39 22 57 2 12 -16 -2 38 79 36 58 18 26 19 58 6 68 -6 -28
5515 -28 -18 -50 14 -18 35 10 -31 24 -22 -51 13 6 17 -6 25 -16 3 38 25 11 -1 36 9 67 -1 34 2 -12 -11 -3 39 12
5547 12 -19 6 -14 46 -41 -4 -13 11 46 43 -40 -15 51 -5 35 2 -11 4 44 0 3 20 -1 -10 5 -8 39 45 17 20 53 59 7 -12
5581 -12 56 -34 40 -10 46 -29 -11 -28 33 14 29 -43 40 23 -29 -15 39 -13 46 22 14 -7 37 -7 -36 -26 13 -16 5 -11 -29
5612 -29 31 -45 7 4 17 -21 23 5 -9 -39 -9 -16 -39 -2 -26 24 -7 -22 11 42 -23 -31 18 -41 19 7 -4 -25 6 78 -3 -30
5644 -30 -11 -11 -7 -36 19 37 50 -16 33 -12 -16 3 0 -8 -14 11 -7 26 0 -67 -35 38 -39 1 0 30 -7 -8 35 7 -35 -7 2 -14 -20
5679 -20 19 -18 -48 -15 -4 -8 -48 28 -1 -35 -16 -21 19 -15 -21 -18 -22 12 41 6 4 -19 -13 -16 16 -11 -7 -16 -7 -12 20 25 -22 -13 -4 -30 -7 19
5717 19 -8 2 -40 35 24 37 26 -44 -24 18 -10 -25 -2 22 -22 -22 -24 -28 -44 -5 -24 2 18 -70 -19 -32 -10 7 21 51 8 -57
5749 -57 14 2 -28 -6 -35 -30 22 27 -22 -65 10 18 -22 -14 23 -10 -15 3 -31 -51 30 -29 -5 -34 14 53 -7 17 2 35 0 50 0
5782 0 -18 71 22 -31 45 74 -23 14 15 21 2 4 -34 -11 -36 19 -34 -15 73 -13 26 50 9 -17 9 -12 -14 26 -27 17 10 40 -30
5815 -30 1 -44 29 0 -7 -23 20 -41 -13 -22 -10 29 -10 -14 -27 -2 -16 -25 -27 38 -9 7 30 1 -1 40 48 -5 -19 18 9 63 25 -16
5849 -16 -16 5 -20 -8 -33 11 -73 4 -69 40 13 -31 -1 -5 53 -5 -57 -16 -7 -26 -46 4 23 12 -25 -33 3 -41 7 -16 67 -41
5881 -41 9 57 34 1 -1 -38 -12 11 17 32 29 -17 13 -27 3 10 -42 -25 -34 -2 -33 -10 -15 0 -40 54 31 -47 -35 24 -3 31 -10
5914 -10 -7 3 10 -9 18 -3 4 49 21 -4 -7 56 -22 28 3 48 -60 32 -71 24 -34 14 62 13 -9 32 -102 17 -3 -18
5944 -18 -55 -53 -33 4 58 -51 41 -25 -6 16 60 17 56 -10 -20 -7 9 -22 -43 -28 5 52 -10 39 -2 19 -3 20 -14 19
5974 19 18 10 1 11 -25 9 -7 4 -1 10 -35 -11 -18 44 14 -28 -17 25 7 -28 4 -20 -1 -13 -48 -40 20 -22 36 22 -8 8 -9
6007 -9 46 -17 5 35 -4 -17 26 -13 -29 20 -24 -47 32 33 36 4 -23 -27 -16 54 24 -3 -11 14 -29 -44 -26 -19 -18 -34 -10 -33 6 30
6041 30 0 42 -8 -10 15 12 39 -31 -11 5 26 2 -12 -18 32 -11 -28 -12 3 0 56 53 1 1 23 5 7 -37 -19 -12 20 -46 2 35
6075 35 56 -38 -44 -19 -12 -21 46 3 -63 -17 -33 26 2 54 21 -48 17 -7 22 -14 23 -55 36 -49 10 -11 -4 -16 -41 -56 10 -8
6107 -8 -14 0 -15 -10 9 -10 -34 -33 25 -39 19 9 9 -1 -20 -2 1 -33 -6 17 -8 -10 5 -57 -27 86 21 12 -14 -19 -9 3 -1 -16 -40
6142 -40 5 3 5 -11 -3 -10 -4 26 36 -66 25 -43 -3 -30 9 -9 -7 -32 42 -2 0 14 -34 20 55 -30 4 -28 -24 -14 -14 15 -48 -9
6176 -9 -14 -22 -14 5 -3 41 7 29 8 4 35 -36 4 19 -51 8 27 -10 12 -15 -12 -59 -30 -6 19 19 55 20 33 -5 34 12 42 54
6210 54 -16 -11 9 28 1 33 11 -2 19 -1 15 11 49 -55 -24 -26 -20 -10 -35 5 8 8 29 23 10 10 24 -28 -9 -5 8 -30 32 -46
6244 -46 -33 18 -28 13 -26 -35 -19 54 32 -5 37 -9 8 14 42 36 34 34 -8 -5 29 28 13 54 30 8 34 27 -1 -32 -11 -7 16 -47 -29
6279 -29 12 -4 -14 16 35 33 -17 -62 46 -26 -18 -4 -36 38 -7 -27 -2 17 -4 -38 -36 -10 67 23 18 13 -7 42 -9 0 32 -34 35
6312 35 -24 62 17 2 -53 -45 -38 -53 -18 -3 -1 49 -59 -17 -56 -8 35 -25 8 -44 -23 14 7 44 -17 34 14 -12 2 -3 42 -27
6344 -27 -16 12 2 15 24 47 2 16 21 -15 30 55 27 15 30 -13 -38 24 -24 -7 -30 -17 -30 -38 23 -11 -22 -59 15 0 -23 6
6376 6 35 0 -34 -1 -37 -24 -43 2 27 -30 30 -21 -44 2 0 21 63 11 22 39 -11 43 16 24 3 -41 -15 15 -1 45 -10 -12
6408 -12 -24 -16 20 3 49 5 -15 -1 -14 -32 23 -23 29 -1 -19 -12 -3 8 24 15 -3 7 -23 19 50 40 6 -4 4 -12 23 46 29
6441 29 17 42 28 -19 21 8 -12 23 4 -50 -7 -17 25 -9 -62 -31 -40 15 -25 -25 -8 -35 24 -24 7 -33 -54 -35 -17 16 -20
6472 -20 35 -11 74 21 42 -14 -26 40 -12 13 10 -26 -39 34 3 1 -33 15 -22 36 -39 0 -10 10 10 -22 26 -15 -27 -34 -27 -49 7
6505 7 -32 -9 -26 -16 -5 12 -18 15 37 5 -25 -13 24 51 -39 30 78 -3 18 5 57 15 -10 -53 -6 -24 -39 30 -34 -4 -37
6536 -37 35 34 -48 -17 53 13 -34 9 -11 -17 -63 44 15 3 0 -20 10 16 -68 16 55 10 -29 55 -25 2 32 56 34 18 42 -6
6568 -6 -46 -2 -4 -52 9 -7 -19 -17 -38 -36 -28 -24 4 -10 19 -39 32 3 21 -39 -42 -2 18 -1 -24 0 -12 20 46 33 21 16 43 51 24
6603 24 25 11 -6 33 21 -23 52 28 -26 -10 29 -11 -28 12 -45 17 11 -3 -15 -32 -36 10 -28 12 -17 -28 -24 1 -30 -5 6 30
6635 30 40 13 57 -29 44 13 -40 28 21 0 5 -3 31 7 -26 37 24 -24 -63 -26 34 1 42 23 -40 9 -36 -2 1 28 10 -20
6667 -20 -13 1 0 -15 -68 23 19 8 15 6 26 -2 25 -47 33 30 1 8 -36 30 -24 19 -29 -9 -7 58 -3 1 -35 53 32 19 75 -6 2
6702 2 -25 4 -14 -9 -6 -7 -24 12 2 27 4 35 -30 24 -26 -54 2 -36 22 -6 -19 -10 12 35 -22 -24 5 12 35 16 49 77 56 35
6736 35 2 19 0 -45 -3 9 48 2 -3 -29 -55 25 -1 -36 1 2 -23 33 29 19 10 -3 16 -62 26 -5 -22 -49 -1 16 -15 33
6768 33 55 9 -37 -30 3 53 32 16 -23 12 36 -26 -16 44 29 7 5 -1 0 -36 23 -32 31 -33 47 -12 -14 -21 -30 -50 12 -60 -10 -42
6802 -42 -12 -47 27 60 -11 36 6 -5 18 -16 12 30 1 19 -4 -28 7 -6 51 -22 36 31 -15 -35 -40 47 53 -22 -39 -56 0 9
6834 9 -23 17 -62 -8 -40 -6 -29 -45 36 6 36 36 -37 45 -46 6 -16 11 51 7 19 19 11 4 45 11 20 21 20 3 -50 11 28 -34
6868 -34 -5 31 26 -37 34 23 -25 6 -5 -14 -29 -29 -44 29 -14 21 -14 -11 -37 -16 35 12 -13 -21 -29 60 -1 -12 -21 5 -1 -38 2 2 2
6903 2 10 -8 48 39 29 61 23 -20 -27 27 -38 8 11 -55 46 -1 53 -53 -17 -7 -44 11 -10 -29 7 -19 -13 31 20 -12 33 -15
6935 -15 4 9 34 5 47 -5 48 -7 8 -47 2 16 -61 62 -24 -4 -39 2 -1 -21 1 -3 6 1 6 -13 -51 -19 -70 -8 82 13 -33
6968 -33 -33 44 -15 9 10 -17 61 25 14 -44 -43 8 17 -1 -23 37 -10 40 -67 8 63 22 -23 -41 -28 37 38 36 51 -38 28 -58 32
7001 32 28 30 -39 -20 21 25 27 -11 67 -36 -8 3 -27 -10 -27 6 44 34 9 24 77 47 43 -22 10 23 45 -44 24 26 -22 -30 14
7034 14 -10 -33 -1 22 18 17 16 -56 -29 1 -23 -30 -1 0 1 -14 -43 -35 -5 -25 38 -9 -26 7 -13 54 -79 -12 25 -11 -25 58 -11
7067 -11 -68 35 48 29 -26 41 -49 3 40 -54 1 44 -60 58 26 -25 11 -14 -20 6 34 -13 57 4 -45 -44 19 -8 1 -10
7097 -10 -21 7 15 -49 4 12 6 -13 14 7 -54 -3 61 -22 13 -12 -11 9 32 -3 3 1 23 1 -36 -17 -32 -21 -39 -29 7 -25 0 -21
7131 -21 19 -11 4 -11 7 -38 -11 -16 -36 -49 22 -11 -18 9 16 3 55 11 12 34 41 13 49 -9 -60 2 -66 -61 21 -7 18 -14 -5 -44
7165 -44 -25 -20 16 -38 -23 -39 -24 -31 47 -24 -14 33 21 30 27 20 -11 11 -47 -22 -3 11 -10 27 -12 -45 7 -9 5 -4 15 -25 -2
7198 -2 18 -7 46 -13 7 -43 56 12 41 -3 33 9 -48 27 24 6 -41 -10 -14 6 11 -8 -1 -15 -22 -15 53 -21 34 27 -32 -30 -24 52 -7
7233 -7 2 17 -22 -29 3 13 -4 5 19 -19 -14 43 14 21 30 14 34 15 65 -30 -8 -38 38 -18 20 34 -17 -6 -37 25 -7 36 -34 -13
7267 -13 26 -15 -18 -3 -15 65 25 1 2 1 -43 43 -1 5 14 38 41 7 20 37 35 22 39 10 -29 -1 -5 6 -8 13 -34 -9 0 -8 11
7302 11 -13 15 8 5 -3 3 1 0 -15 -18 24 -55 -2 8 -4 -19 56 -3 15 19 15 -21 -8 24 2 45 -2 46 -3 14 -6 -27 60 -25 -24
7337 -24 -2 -2 4 -15 -28 -2 2 -7 -16 26 29 -17 -19 26 34 8 -1 -33 12 6 -4 20 -16 4 -28 24 32 32 1 22 -6 2 55 40 6 -21 10
7374 10 -32 -12 34 8 28 17 13 -5 -21 12 37 -27 -47 -54 -23 -1 -46 -57 -4 -22 -16 26 -15 27 5 8 4 5 21 -5 -2 27 -11 44
7408 44 16 36 40 -1 -17 0 -76 2 -3 25 -54 5 -4 29 -24 -21 29 -42 46 10 -18 -28 -27 12 49 -21 -30 37 -30 -23 22 17 15 6 25
7443 25 -35 25 13 4 80 1 1 38 -11 14 2 36 8 62 19 -48 -44 22 -22 42 -58 -8 -73 -5 -23 -1 28 32 -10 -57 -25 6
7475 6 -13 21 -27 48 -5 16 29 -15 -2 1 80 -19 41 8 2 33 37 20 -8 35 27 -12 6 -4 43 -22 55 32 15 -15 32 -7 -7
7508 -7 23 14 -71 -20 22 24 6 28 42 37 -34 21 -13 6 -8 50 4 -5 34 -30 32 -61 3 7 -19 -13 24 29 -17 18 28 2 -7 35 45
7543 45 31 31 -9 -7 -28 -1 40 -19 95 37 -6 29 11 -4 -30 -46 -24 -12 -14 -31 35 -46 -4 42 25 48 12 -1 -6 -21 -34 -27
7575 -27 68 -19 -2 -35 47 22 3 30 -61 71 29 6 0 -30 -36 17 12 -22 2 -1 25 -13 -13 2 17 20 -23 18 -6 -13 21 29 -8 -20
7609 -20 5 47 41 -38 20 2 -3 -28 6 14 -17 -30 19 -12 29 4 20 50 -26 30 -14 -14 24 21 7 6 -45 18 -52 -8 21 45 -24
7642 -24 -16 -76 -1 22 13 25 -5 -29 -62 -3 -32 -28 -39 -14 9 -24 8 -1 -2 67 -48 -30 -12 -19 6 64 -27 47 14 20 10 17 -6 6
7676 6 35 -33 -2 -6 -1 -52 61 12 20 4 -47 -18 -7 -2 -10 -12 -73 43 -17 40 65 26 -15 -46 -66 -10 44 -30 14 -54 37 30 63
7709 63 -13 -9 -37 43 -23 7 1 -44 26 -29 -10 -1 39 -28 36 21 -18 37 7 -10 -12 -30 -7 -24 53 1 -27 -36 -1 -2 -15 -16 10 -28
7743 -28 58 38 -52 14 -20 77 40 23 6 49 40 0 -17 -4 36 -3 -50 5 -11 -57 17 -40 -35 -21 -8 -18 13 20 -36 -39 -25 -35
7775 -35 36 -26 43 15 40 -14 -19 -25 6 2 -14 17 -9 -3 6 -5 22 1 -2 9 35 12 -29 -10 22 4 4 -11 25 -43 -32 26 -37 -6
7809 -6 26 1 -31 3 39 8 -24 -44 2 -10 -6 -27 -6 5 59 10 -26 -3 12 -41 -25 37 -16 29 -6 31 38 10 19 29 9 -5
7841 -5 5 -6 -7 -17 45 3 7 -45 -2 12 9 45 40 67 -4 34 -64 -38 -41 -3 -31 -69 10 -3 29 -21 -3 0 28 48 3 -10 24 33
7875 33 31 -40 -1 17 -6 -10 14 -8 42 -23 16 29 12 9 -37 -18 43 -9 -3 13 10 13 -33 -35 -1 -6 -8 -30 -36 -41 3 23 -19 23 18 10 8
7912 8 36 13 7 13 57 30 29 -24 22 -6 17 34 36 5 16 -24 7 -27 26 6 -38 -6 0 -36 37 2 24 2 0 -9 28 -25 -19 -34 -12
7947 -12 -7 -25 -12 37 -10 -41 -16 -3 6 15 13 -33 13 75 57 2 16 8 1 18 45 -26 -10 -9 -47 6 3 6 -43 5 53 20 -5 -4 -17
7982 -17 -24 -61 23 -29 -1 -11 34 23 27 7 -57 22 7 19 -12 12 -35 24 -2 17 6 -6 6 -4 1 -5 10 69 19 -2 -15 -8 3
8015 3 3 -15 -46 -24 -1 -82 5 -28 -26 7 -83 -30 -4 -10 -34 11 -26 22 -40 4 15 -11 32 44 9 3 -7 -44 13 -15 5 -9 -20
8048 -20 -23 0 35 17 -34 8 29 1 8 -4 2 -39 -8 24 -35 -4 -2 -7 24 10 -12 38 -13 -36 -56 -63 36 -7 -46 -13 1 -34 -21
8081 -21 -11 12 1 -31 -7 15 27 -52 47 28 56 -49 7 -5 -25 37 -34 30 55 -2 9 48 -32 -46 7 -7 30 14 -9 27
8111 27 -6 -20 45 -1 -6 36 1 16 -35 21 -14 -37 -49 -28 -45 12 0 -30 13 -23 -4 -22 -24 -29 -13 3 -49 12 12 -1 8 -3 -59
8144 -59 -7 -2 19 -16 10 -9 31 -48 2 13 -50 -15 23 38 -21 33 28 -4 -36 -69 20 24 14 -42 -27 58 -52 7 82 -12 20
8175 20 31 -11 -12 50 -4 -69 26 17 -3 26 9 -4 21 35 5 -12
8191a2
$$ Imaginary data points
##PAGE= N=2
##DATA TABLE= (X++(I..I)), XYDATA
0 0 0 0 0 0 0 0 0 0 0 0 0 0 -8 8 -8 11 -16 16 -24 24 -32 40 -48 56 -64 76 -88 104 -120 136 -156 179 -204 231
34 231 -261 294 -332 372 -418 467 -521 578 -642 713 -789 870 -962 1061 -1170 1289 -1419
51 -1419 1563 -1721 1899 -2094 2315 -2565 2845 -3171 3550 -3998 4534 -5194 6025 -7114 8594
66 8594 -10748 14177 -20717 58553 -225718 10940 191627 -223228 110229 83834 -207787
77 -207787 118058 73038 -141742 86441 -24146 -40088 99211 -68567 -25887 64824 -48366
88 -48366 38650 -5329 -59137 66692 -8666 -25471 30180 -53033 48914 23842 -85972 67135
100 67135 -2582 -62029 101240 -61173 -55693 128161 -72316 -38556 97384 -82775 16487
111 16487 67146 -100031 44622 39874 -76265 60526 -16602 -46705 88549 -52499 -34668
122 -34668 81697 -57019 1088 50709 -71629 32486 37631 -62044 29868 2960 -22080
133 -22080 43613 -39149 -8975 47903 -40412 13833 16741 -51914 48907 11336 -58194 40797
145 40797 -1912 -22518 42299 -38076 -9951 49516 -36042 3544 18872 -41310 39956 10895
157 10895 -56198 38387 7645 -32427 37333 -20818 -22804 47969 -19669 -18881 24836 -18104 10475
170 10475 12619 -31785 16167 11023 -18219 15825 -10965 -9408 27694 -15430 -9993 16670 -11980
183 -11980 7856 4735 -20492 16529 2659 -14559 16117 -11642 -5062 24310 -20714 -4653
195 -4653 22179 -18598 4155 11738 -21736 13952 7565 -20551 14352 -886 -10828 18017 -12850
208 -12850 -6796 21404 -14829 -3122 14488 -15298 6249 9399 -17489 8106 5823 -9655 7463
221 7463 -5239 -2344 11797 -10529 -186 8138 -10585 7960 2897 -14386 11188 2722 -10172
234 -10172 8080 -4212 -2106 9751 -9539 646 6595 -9002 7826 474 -12512 13174 264
247 264 -11746 11014 -3118 -6013 11080 -6721 -3811 8424 -5097 1094 1776 -6279 7076 -476
261 -476 -6900 7644 -2855 -3953 8418 -5464 -3395 7846 -3785 -1962 3213 -2388 1566 -209
275 -209 -1712 2810 -2984 703 3939 -6082 1484 5173 -6190 1294 3715 -4783 1956 1693 -3290
290 -3290 1932 -404 -444 1871 -3419 1811 2611 -5285 2664 2781 -5769 3116 2650 -5394 2504 2218 -3640
307 -3640 1386 957 -1167 485 -705 1134 -80 -2184 2742 -92 -3303 3187 333 -3423 2695
322 2695 742 -2606 1227 978 -933 -549 660 1023 -1896 52 2660 -2667 -653 3589 -2557 -1218
338 -1218 3358 -1764 -1235 2126 -632 -590 161 367 612 -1771 896 1814 -3123 998 2737 -3628 570
355 570 3124 -3000 -179 2392 -1440 -510 962 191 -643 -504 1690 -499 -2145 2660 247 -2961
371 -2961 2276 745 -2482 1507 707 -1539 370 773 99 -1262 61 2279 -1817 -1158 3190 -1763
387 -1763 -1430 3393 -1743 -1773 3077 -625 -1599 1093 445 48 -922 380 1245 -2043 855 1965 -3439
404 -3439 905 3124 -3313 -142 2487 -1643 101 743 -754 313 -274 974 -208 -2479 2933 785
420 785 -4085 2639 1378 -3369 2525 361 -2858 2431 511 -1600 378 -254 1625 -525 -2412 2972
436 2972 -345 -2325 3331 -1644 -2269 4412 -1315 -2804 2557 -12 -220 -28 -1087 1688 -653 -395
452 -395 2014 -3300 708 4377 -4442 -753 4051 -2674 307 1494 -2848 1684 1061 -1338 605 -1861
468 -1861 1921 2349 -4844 1509 3080 -3918 2230 1034 -4395 3373 1609 -3480 878 290 683 575
484 575 -2777 1952 556 -2342 3420 -1882 -3043 5466 -1398 -3516 3586 -1117 -462 1945 -2618 1068
500 1068 920 -1572 2468 -2436 -1203 5326 -3610 -2147 5102 -3234 -638 3914 -3773 149 3080
515 3080 -2430 337 137 -382 2214 -2517 -70 3008 -3217 886 2384 -4011 1680 2537 -3488 621
531 621 1391 -827 516 -987 674 681 -1827 2040 -431 -2874 3831 -183 -3854 3216 381 -2323
547 -2323 2052 -753 -959 1525 -647 218 -681 -767 3063 -1762 -2399 3849 -1274 -1993 3551 -2157 -1801
564 -1801 3866 -1308 -2151 1835 -57 -83 -172 -713 1109 -729 -112 1563 -2579 110 3410 -2812 -1181
581 -1181 3078 -1521 -528 1690 -1684 -53 1343 -539 -415 -876 946 1411 -2526 161 2057 -2255
597 -2255 859 1629 -3233 1130 2418 -2547 -34 967 -459 910 -1041 -264 1234 -1404 1217 663
613 663 -3362 2489 1935 -3928 1374 1525 -2446 1846 151 -2212 1546 336 -244 -147 -1581 2266 323
630 323 -3016 2397 -69 -2385 3432 -1145 -2995 3542 -250 -1981 1357 -823 597 653 -1762 1420
646 1420 -513 -857 2827 -2523 -1306 4045 -2188 -1364 2662 -1952 291 1459 -2062 824 239 -548
662 -548 1535 -2496 366 3144 -3610 273 2965 -3478 1300 1967 -3791 1689 1625 -2449 1018 -360
678 -360 -61 1559 -2573 811 1717 -2860 2188 473 -3739 3555 673 -3763 2414 113 -1279 2017
694 2017 -1864 -50 1892 -1754 1301 -361 -2366 3786 -661 -3483 3372 -423 -1768 2662 -1806
709 -1806 -984 2537 -1027 -308 -262 -390 2368 -1841 -1228 2829 -2019 -56 2659 -3524 485 3177 -2816
726 -2816 88 1296 -1308 1448 -625 -1136 1852 -1392 325 1544 -3100 1524 2265 -3567 1204 1712
742 1712 -2492 1487 396 -1745 1475 -233 -234 479 -1456 1625 389 -2630 2250 451 -2463 2344
758 2344 -314 -2028 2345 -322 -1354 1189 -297 320 -161 -1066 1588 -613 -1116 2150 -1512 -848
774 -848 2695 -1679 -1121 2227 -940 -448 884 -697 482 -22 -272 741 -1214 525 1594 -2152
790 -2152 350 1948 -1887 229 1275 -1443 372 876 -813 -37 69 416 -1 -1216 1118 433 -1575
807 -1575 1265 417 -1719 1379 465 -1660 790 634 -735 38 74 354 -174 -335 869 -534 -566 1456
825 1456 -636 -1120 1510 -48 -1088 743 198 -561 283 399 -279 -463 671 477 -1194 260 1134
842 1134 -1077 -112 1078 -908 -235 1120 -512 -677 761 253 -557 -125 595 -141 -562 649 232 -925
860 -925 596 779 -1081 -9 1055 -567 -500 878 -142 -693 661 358 -922 225 830 -622 -494
877 -494 769 -21 -620 396 309 -722 89 764 -615 -541 962 -43 -922 535 437 -739 177 556 -683
896 -683 -167 797 -209 -770 646 621 -870 -1 737 -643 -163 799 -495 -558 823 157 -739 74 662
915 662 -309 -525 563 -63 -705 735 211 -1130 538 842 -925 -136 648 -274 -172 226 -22 -237 146
934 146 487 -539 -490 986 34 -1042 628 391 -690 374 246 -640 155 706 -432 -667 643 507
952 507 -845 -28 715 -538 -27 724 -751 -268 957 -202 -731 251 491 -172 -446 231 173 -537 511
971 511 154 -1088 596 871 -1148 -190 889 -335 -287 268 -98 -138 347 264 -687 -180 1022 -262 -962
990 -962 761 377 -687 404 62 -521 414 464 -661 -446 794 353 -942 9 809 -465 -102 437
1008 437 -741 37 974 -581 -802 547 548 -390 -566 373 241 -329 361 -241 -750 1046 469 -1465 134
1027 134 980 -393 -275 -28 -91 299 276 -192 -674 194 1097 -550 -1111 758 392 -452 236 -333 -309 736
1047 736 77 -765 -278 704 457 -1007 -277 832 -390 -24 385 -928 245 1138 -888 -620 683 247
1065 247 -126 -409 18 372 -218 155 -39 -681 895 471 -1272 263 821 -546 -50 73 -139 411 13
1084 13 -219 -194 -9 848 -529 -1014 1106 249 -937 438 -88 -342 775 -304 -748 419 449 46 -809
1103 -809 -208 1078 -248 -561 527 -514 113 1020 -1153 -571 1217 -3 -570 -159 204 562 -137 -266
1121 -266 -34 -304 848 234 -1453 427 1137 -687 -184 -22 -232 732 -133 -572 4 131 788 -383
1139 -383 -1243 1105 595 -1166 502 -53 -580 1072 -183 -1012 513 544 -96 -502 -234 744 -106 -433
1157 -433 606 -624 17 1189 -941 -600 1152 -252 -450 286 -211 218 27 -213 198 -420 381 420
1175 420 -1128 383 956 -1010 76 566 -609 255 175 -436 185 95 120 -278 -517 881 76 -1028 673
1194 673 227 -660 677 -236 -616 773 121 -469 -166 131 612 -389 -484 723 -251 -139 781 -887 -219
1213 -219 1261 -410 -654 350 73 166 -183 -236 190 -120 400 90 -1013 576 811 -967 12 456 -327
1232 -327 259 96 -359 45 257 321 -484 -434 916 -127 -665 667 -152 -408 789 -261 -542 472 147
1251 147 -141 -208 67 405 -483 -38 566 -692 105 697 -827 8 743 -455 -144 320 -117 -3 -170
1270 -170 111 80 -467 410 166 -804 603 321 -810 394 351 -436 107 163 -82 -97 88 304 -415 -123
1290 -123 800 -479 -368 767 -250 -255 582 -279 -189 335 -17 -133 -277 337 270 -721 225 462 -743 350
1310 350 412 -865 299 502 -505 -11 138 27 15 -313 311 -13 -460 636 -113 -747 790 72 -670
1329 -670 518 4 -363 294 -39 -91 -62 2 393 -493 -191 740 -499 -270 700 -577 -161 641 -425 -252
1349 -252 353 -34 -42 -181 105 209 -406 192 262 -674 315 439 -706 138 446 -341 -33 183 -39 -102 36
1370 36 297 -260 -253 600 -183 -499 635 -86 -440 544 -124 -330 305 -38 -91 -129 20 338 -355 -146 586
1391 586 -497 -167 649 -520 -269 651 -352 -219 417 -166 -71 52 -43 119 -229 120 251 -561 172 475
1411 475 -592 52 493 -492 55 311 -235 -65 185 27 -167 -148 359 -92 -401 421 66 -488 429 23
1431 23 -536 307 149 -347 54 105 -25 -61 -51 249 -268 -109 494 -323 -321 526 -159 -309 334 -51 -244 227
1453 227 18 -126 -98 168 167 -421 144 410 -479 67 442 -525 87 491 -464 -95 331 -86 -54 -86 57 151
1475 151 -254 202 152 -532 361 345 -683 162 337 -437 76 191 -345 101 227 -37 -193 -9 355 -128
1495 -128 -304 400 -20 -304 395 -138 -345 454 85 -357 28 129 57 -144 -60 198 -126 -28 338 -415 -95
1516 -95 588 -350 -348 363 -11 -90 113 -146 -74 99 152 -42 -416 301 383 -471 55 366 -327 114 201 -366 113
1539 113 292 -125 -154 34 273 34 -331 234 81 -295 306 -50 -486 423 229 -431 88 199 -35 -26 -18 69
1561 69 -66 66 188 -318 9 454 -290 -319 351 -24 -166 28 -70 15 145 36 -114 -254 371 227 -580
1582 -580 23 375 -179 51 90 -320 173 252 -146 -228 51 384 -109 -421 319 30 -230 334 -227 -361 528
1603 528 100 -437 43 130 72 -65 -108 104 -17 118 281 -504 78 604 -416 -244 349 -123 16 184 -273
1624 -273 -41 170 163 -55 -371 338 231 -414 284 241 -353 268 95 -384 198 209 -180 -126 -7 255 -122 -279
1646 -279 404 -150 -242 505 -257 -313 529 -204 -321 271 -4 -50 -54 -48 201 -149 -6 206 -422 122 538 -497
1668 -497 -76 424 -220 34 129 -237 120 185 -9 -39 -163 358 137 -500 204 173 -330 262 -2 -386 291
1689 291 238 -234 -81 2 201 -30 -213 216 -69 -156 309 -270 -265 474 -36 -302 186 32 -60 75 -24 -62 -15
1712 -15 130 133 -319 63 305 -287 -29 247 -223 -15 184 -122 -86 113 33 -115 -157 199 -6 -275 148 119
1734 119 -267 165 95 -315 124 252 -207 -78 125 12 -64 13 47 -31 -32 103 -50 -222 242 97 -344 109
1756 109 183 -241 57 134 -157 -51 237 -17 -206 97 151 -175 -86 122 -64 -177 173 -69 -287 178 103 -266
1778 -266 50 159 -125 -47 102 -5 -66 70 123 -201 -68 216 -77 -137 215 -23 -173 201 22 -142 100
1799 100 127 -120 -112 159 -25 -192 76 115 -240 -48 207 -192 -137 218 -101 -131 160 2 -159 47 96 -106
1821 -106 -92 106 5 -135 109 106 -219 65 220 -129 -57 238 -47 -111 131 30 -102 54 83 -116 -64 218
1843 218 -3 -161 102 117 -194 27 176 -148 -77 138 -89 -139 99 -11 -178 36 152 -111 -67 135 -56
1864 -56 -171 154 -7 -197 83 51 -135 -12 103 -61 -74 80 76 -128 -75 126 -122 -86 249 -54 -158 180
1886 180 24 -138 124 97 -173 -10 157 -41 -147 142 78 -192 17 101 -172 37 160 -174 -113 88 7 -172
1908 -172 14 133 -59 -44 35 -33 -93 134 31 -141 71 105 -80 -69 149 -6 -112 186 41 -187 187 113
1930 113 -226 8 179 -58 -88 106 -19 -63 49 71 -145 -103 240 -74 -181 167 -20 -116 162 -8 -141 73
1952 73 77 -67 -69 59 101 -108 -16 170 -184 36 236 -215 -25 199 -74 -47 112 11 41 7 3 19 -90 137
1976 137 63 -248 163 205 -189 70 82 -107 52 -1 -57 -33 -8 106 -55 -148 233 -61 -206 136 -103 -139 198
1999 198 -103 -125 174 0 6 -18 -68 153 -84 -27 140 -165 22 316 -239 -64 274 -124 -62 112 -38 10 -5
2022 -5 -2 -19 -70 161 -13 -242 106 116 -197 4 44 -108 123 24 -141 -36 95 83 -103 -123 142 57 -124 99
2046 99 -76 -88 245 -29 -200 122 128 -57 -19 -17 82 15 17 -35 -78 32 177 -133 -135 206 59 -144 21 -97 -19
2071 -19 102 -1 -158 -9 104 -2 -195 42 144 -68 -45 78 -82 14 166 -228 -140 232 85 -117 -39 13
2093 13 55 -41 -47 -20 7 93 46 -236 45 240 -100 -166 61 -69 37 49 -142 -60 164 72 -92 -181 119 102 -175
2118 -175 -29 6 -26 177 -40 -224 129 177 -75 -125 -10 168 43 -99 19 -45 74 120 -172 -161 278 57
2140 57 -200 9 47 19 79 -121 -144 71 92 -50 -204 -34 260 -59 -168 30 -38 4 58 -218 -67 211 35
2163 35 -215 -139 151 168 -121 -123 118 -33 80 -27 -184 88 269 -127 -103 61 95 50 -116 -69 32 51 74 -137
2187 -137 -119 267 117 -247 -24 93 25 94 -143 -152 74 92 -109 -215 27 306 -81 -185 66 45 43 43 -178 -86
2211 -86 216 -13 -202 -32 88 90 -37 -29 12 31 30 -58 -147 82 200 -142 -114 113 52 0 -47 -98 39 135 12 -217
2237 -217 -108 187 41 -217 -33 68 -19 53 -171 -83 141 88 -55 -130 35 170 -116 -173 58 -25 41 27 -187
2260 -187 -61 218 -17 -185 5 116 74 -104 -65 -8 39 128 -106 -186 162 139 -150 -77 -11 85 -8 -152 -42 -18
2284 -18 46 33 -194 -118 176 9 -196 42 44 -11 71 -58 -45 58 47 -13 -95 83 154 -101 -65 94 -17 5 -40
2309 -40 -122 23 90 -46 -66 35 40 39 -98 5 -24 -57 51 -63 -111 156 76 -107 -21 83 27 -42 -37 75 14 40
2335 40 -5 -164 -15 128 -38 -63 23 4 3 -41 -43 44 -14 87 -62 -149 137 122 -133 61 86 -54 45 -51 -51 46 52
2362 52 11 -97 -13 149 -84 -80 73 16 -27 142 -144 -58 139 37 -60 -3 20 46 -29 -33 71 -110 33 28 -167 31
2388 31 147 -77 23 43 -36 36 -110 33 26 -61 52 5 -153 126 29 -125 150 -17 -99 114 -75 -74 31 2
2412 2 17 -12 -39 30 -65 -62 165 -52 -17 158 -85 -9 177 -71 -26 31 -11 37 -41 -19 116 -81 25 84 -133 76
2438 76 136 -107 15 5 -89 40 5 -6 40 -20 -5 22 -166 65 15 -130 61 47 -85 68 14 -104 60 60 5
2463 5 30 -23 99 -9 -93 63 -21 -63 95 -32 -55 70 -35 -74 20 28 15 10 -2 0 -62 32 18 -77 -75 141 -21 -57
2491 -57 40 -32 -34 61 -93 -37 30 21 4 -12 79 41 -90 18 46 -123 26 73 -82 -53 96 -95 -12 50 -38 60 10
2518 10 -6 38 24 -12 19 -83 83 90 -131 43 75 -73 39 22 -163 66 44 -68 -38 12 13 31 -68 39 35 -96
2544 -96 40 -37 -61 81 13 -110 90 42 -2 28 -89 53 -9 -62 8 -42 -82 174 -62 -99 81 14 -20 4 -37 37
2570 37 91 -9 34 -91 -22 72 -46 -106 135 -58 -14 87 -96 12 91 -106 -22 36 -1 29 -50 -10 77 -50 -26
2595 -26 29 -88 102 78 -123 10 50 18 38 -56 -28 56 -69 29 13 -90 88 -1 -150 96 26 -140 13 -86 -27
2620 -27 43 -60 -101 23 -13 -1 -20 -85 63 38 -74 39 -18 -64 103 -13 -66 101 36 -100 -15 16 40 29 -42 -16
2646 -16 17 49 32 -126 -10 80 -67 -29 57 -105 -5 38 -124 -41 35 15 -17 -115 31 62 -88 -31 48 -54 87
2671 87 34 -109 36 75 -41 2 -67 31 55 -18 21 42 -18 100 22 -134 66 89 -61 -9 3 -27 71 -13 -48 6 -30
2698 -30 40 -63 -72 80 -37 -44 -3 -57 8 21 -7 7 6 16 -4 -5 1 59 -49 -32 -57 -11 30 73 -8 6 79 9 -69 -40 88
2729 88 -4 -22 41 -4 7 80 5 -9 59 13 -38 23 -53 -6 0 5 -17 -69 60 8 -108 4 11 56 -18 14 15 -1 -3 14 -49
2760 -49 -27 110 -78 -49 28 13 -34 33 -77 27 75 -50 -6 -4 -34 91 -41 -21 132 -16 -12 84 -71 12 72 -100
2786 -100 -29 -5 -14 39 -14 7 54 -64 -8 -23 -81 100 -45 -128 25 12 -24 1 -111 65 77 -11 -4 -7 -9 120 -75 -59
2814 -59 112 11 -20 49 -73 -33 120 21 -37 -19 4 56 -20 1 96 -53 32 80 -50 44 82 -55 -48 14 10 17 -50 -15
2842 -15 34 -5 27 25 -82 4 38 -105 -4 93 -47 74 34 -55 40 -1 1 5 16 16 -8 -52 32 2 -32 70 33 -50 36
2871 36 11 -76 -18 -16 -18 -67 -45 29 9 -44 -62 -18 -19 50 -57 -78 54 53 -35 34 -18 -24 52 -44 -52 -35 7 68 -64 -77 54
2902 54 -58 -30 69 -19 -6 111 -64 15 41 -29 -9 -20 -9 0 -88 1 -25 -81 -11 72 -106 18 29 -99 -4 2 -89 52
2930 52 -20 -3 0 -76 13 35 -76 -6 16 -86 51 18 -9 86 19 -14 4 -41 38 -12 -69 61 -51 -45 63 -64 -61 21
2958 21 -71 -21 37 -50 -46 -28 -19 11 -24 -29 32 -68 16 47 -67 -18 93 13 -33 56 -40 2 -37 39 39 -39 35 -3 -20 68 23
2989 23 -68 29 -6 -35 75 -37 -30 2 -77 6 -29 -26 54 -31 -23 -14 -38 4 57 -23 0 16 36 -26 -13 34 12 -10 9 -30 -38 76
3021 76 64 -41 12 16 1 54 -14 -29 49 37 -32 21 -21 87 -5 -84 3 -22 -95 67 20 -26 11 18 -22 -40 38 -23 -82 -60
3051 -60 53 -46 -11 75 -58 -7 63 -26 -15 -9 21 40 -27 -3 33 49 -46 49 -83 38 71 -54 -28 16 -40 5 27 -44
3079 -44 35 60 2 2 -2 -3 -14 -69 34 10 -73 41 -17 -28 11 8 -108 -27 42 -61 -26 -1 56 -17 -77 63 -18 -14 59 -2
3109 -2 -51 40 21 -14 50 -5 -6 31 -14 31 21 -6 13 -36 -78 104 -49 -46 44 -53 8 32 -18 -34 61 -9 17 -31 -25 75 -59
3140 -59 -73 -20 -78 41 29 -100 40 27 -66 -51 -9 1 15 -5 -5 30 25 42 42 -15 51 50 -57 9 -1 -22 97 -51 -69
3169 -69 43 7 -16 -19 -41 41 1 -110 13 -5 -45 32 -35 -95 58 -2 -45 18 0 69 -16 -74 30 26 -42 20 -38 -67 129
3198 129 -32 -58 115 23 47 51 -29 23 49 -77 25 -48 24 55 -112 -36 123 -112 -15 36 -100 42 56 -108 -19
3223 -19 28 -9 33 -87 -3 90 -28 -6 66 -69 55 24 -194 7 48 -35 54 -18 -33 107 -43 57 9 -85 74
3248 74 -12 -111 85 47 -30 48 -50 -48 87 -37 7 -7 -13 29 -61 -158 85 -33 -88 59 -82 17 50 -78 -16 63 -17
3275 -17 66 -35 -99 100 -66 -70 95 -64 31 130 -64 4 149 -56 4 7 -18 138 7 -42 93 -19 40 38 -137
3300 -137 82 91 -64 16 -15 -34 138 -44 -56 35 -9 20 50 -68 86 60 -84 72 -22 -41 140 -55 -100 102 -23
3325 -23 0 42 -59 59 19 -74 71 -39 -23 12 -64 -63 151 -45 -21 47 -75 47 -7 -104 51 -26 -7 73 -98 12
3351 12 47 -67 32 13 -95 62 71 -56 27 13 -79 -9 -45 -15 60 -70 32 86 -71 -2 -40 -10 30 1 -57 -4 19
3378 19 -7 21 -95 -14 10 -21 48 2 -74 30 -8 -42 46 -12 -10 26 -80 -44 33 -20 -13 -10 -8 94 15 -27 41 15 14 41 -50
3409 -50 -1 33 -40 -5 68 -51 46 56 -28 65 41 11 -4 -39 -10 9 -69 -9 20 -53 15 26 -21 29 -6 -18 -11 -31 46 25
3439 25 -14 51 -10 -89 64 48 -38 31 -18 24 39 -23 38 -4 27 88 15 -22 18 13 -25 46 -63 -41 39 -41 11 -13 5 22
3469 22 -27 -28 21 -58 -22 5 -47 -5 52 -18 38 52 -77 55 46 3 35 0 41 46 1 -8 33 -12 21 56 0 -1 57 -39 36 31
3501 31 -41 -16 23 10 103 19 60 37 10 23 20 -64 46 -18 -46 79 0 -33 -6 -26 -49 -32 -28 1 24 -2 56 -26 12 52
3531 52 -33 -49 64 -3 -47 46 -5 57 44 -13 -11 -10 -25 29 -20 -10 59 -53 12 55 5 22 52 4 -20 29 29 -22 -24 -19 77 -68
3563 -68 -3 63 -54 21 57 -46 3 50 0 18 14 -78 33 23 67 25 -22 57 -21 -13 13 61 -49 69 -23 -19 64 29 22 63
3593 63 -40 -30 23 -65 58 -46 32 61 -34 11 45 -58 -50 52 -56 -12 49 -28 33 -56 -11 71 -15 10 -16 -107 38
3620 38 33 -73 61 64 -4 19 80 -13 35 -9 24 3 -23 15 31 -36 69 14 -39 32 -5 -66 4 -61 -36 21 -28 57 -13 -56
3650 -56 37 -13 -85 62 -5 -53 57 -22 -28 19 7 -38 29 28 25 -28 34 59 -2 -7 67 -67 1 53 -70 36 10 -51 42 2
3680 2 -7 39 3 16 9 -103 -42 45 -76 17 35 -58 32 16 -11 -7 2 -22 20 7 54 39 -32 23 15 18 98 -5 -20 -2 -15 -23 2
3713 2 -3 -10 3 -6 29 -13 18 52 -67 -11 70 -16 -73 39 7 -65 27 -5 -32 47 -18 -5 26 -25 1 -90 -28 11 -57 27 92
3744 92 -77 -28 19 -51 -26 9 -18 11 28 7 -39 -52 1 18 0 0 -4 -52 -27 11 -43 -36 32 -15 8 -18 -10 -53 3 -26 11 -6
3776 -6 47 -46 -15 39 24 0 -23 25 -34 -18 -11 19 -24 -38 9 46 0 51 -14 -31 34 44 -18 23 46 -7 3 -15 -37 3 -6 -62
3808 -62 -54 -23 12 16 -51 4 -20 -33 8 -11 -33 64 19 -34 38 -10 -8 14 -22 38 -11 3 42 -28 17 46 23 8 50 -57 7
3839 7 32 -47 -3 22 20 61 -53 16 -7 -39 -30 85 -20 45 74 -54 -16 23 -12 0 -1 -10 42 -25 -28 9 -12 37 -11 -58 85
3870 85 -14 -60 82 12 -7 24 -7 -22 54 -39 3 26 -21 16 -54 -7 94 -59 -18 27 -75 -37 -23 -58 56 -43 -51 -44 -34
3899 -34 1 64 -68 -2 43 -60 2 24 -77 9 53 -48 74 -29 -56 60 -3 -23 71 -63 -8 56 -15 -5 75 -20
3925 -20 14 6 -17 -4 -96 -4 -14 -9 42 -17 -68 71 -46 -8 71 -50 -77 33 -15 -42 50 -80 17 -44 0 45 -33 24 11
3954 11 -52 -50 51 -18 5 86 37 47 6 -3 36 48 -48 23 -26 34 65 -11 13 64 -101 13 41 -64 13 2 -27 -7 -25
3983 -25 -52 34 -13 16 6 -71 3 0 -54 23 19 -43 42 18 1 34 -64 74 -26 52 45 38 21 17 -21 -47 19 -23 -36 60 -3 -42
4015 -42 -16 -38 34 12 -28 -11 -25 -31 18 -13 -36 26 -77 -42 38 20 -3 -26 -41 44 -38 1 -21 -7 23 21 -23 -14 46 -30 43
4046 43 -9 -35 -8 6 -32 2 54 17 -47 -2 50 -30 -8 51 -2 -61 16 -25 -48 7 7 -20 -13 28 -3 -35 19 -61 -64 34 8 -10
4078 -10 3 17 -11 -44 8 32 -3 10 6 32 -12 -9 -41 20 35 -7 -15 -1 13 -6 14 27 -34 -11 41 42 -29 10 19 -69 -15 40 18
4111 18 -28 50 -1 -43 0 3 -31 -15 50 -28 8 32 -16 5 19 48 2 19 26 -47 -45 29 -1 -36 29 29 -5 15 20 -4 33 -81
4143 -81 35 -37 -51 -16 7 5 12 -18 -14 -7 -42 -15 6 16 -63 -59 -22 -15 -10 3 35 -23 -19 61 -81 46 38 -6 46 24 -19 4 19
4176 19 4 28 74 -31 -32 -80 17 -28 -67 42 6 -55 -46 -69 -19 -30 -22 -26 -23 -5 11 36 12 -12 -51 -25 6 -13 -78 27 -25
4207 -25 -20 -9 40 41 6 11 10 4 -12 11 9 -16 23 29 11 11 -36 -23 41 -11 -99 29 2 -22 -35 -14 -65 -44 -41 5 -49 23 -5 -14 17
4242 17 -42 -1 -47 24 6 -2 -16 2 32 -34 33 17 12 3 26 -1 80 26 -9 28 -9 11 3 24 23 -7 -14 39 -9 -10 76 -27 -5
4275 -5 36 -8 4 63 8 -20 -12 -26 -20 -11 -14 20 -16 -24 37 -20 16 11 -15 1 70 -19 4 -41 1 10 30 -5 -40 -26 -22 2 -16 3 48
4310 48 -10 7 24 -41 -34 -7 -53 12 19 -16 -21 -70 18 -18 -18 27 -30 -40 -11 -17 10 35 14 -26 -4 29 20 -41 18 10 -18 -61 19 -37
4344 -37 30 0 7 -25 -39 -15 12 -36 -1 -11 -18 -26 -29 -28 9 27 -59 14 3 -24 -41 -39 -53 32 -16 25 -12 -7 22 -42 -76 68 5
4377 5 -6 1 -20 -3 -14 10 -5 -14 -6 41 1 19 34 19 13 11 -10 46 29 -20 2 81 -7 -46 37 -18 -18 3 -48 1 -17 -12 22 -19
4411 -19 7 -35 -70 -7 10 -41 -6 -11 -15 -28 31 -20 -33 15 32 48 -28 19 48 0 -2 91 -1 -3 24 12 -32 -37 -21 -70 -19 2 -47
4444 -47 22 9 -22 -13 4 12 -32 16 28 -10 -1 81 -35 -5 60 30 -16 -50 38 -31 -11 35 20 -9 64 1 -42 9 38 75 67 -45
4476 -45 9 11 4 -1 20 -39 52 -41 19 -13 -84 -27 -36 -35 -51 34 -1 -10 27 -20 -29 -19 -13 9 -45 -46 34 -8 4 30 -28 -8 21 -30 51
4511 51 -24 -22 76 -7 18 -5 -17 7 28 -2 29 -26 -8 49 45 -36 33 -19 -4 -59 -7 43 -2 -26 -1 26 -38 -32 -59 -25 11 29
4543 29 -57 -5 -47 -16 20 62 18 -14 42 17 25 -90 21 -43 -42 73 -30 32 2 -36 -20 -9 -37 -8 22 44 25 3 32
4572 32 -17 -22 7 21 -42 -14 27 -2 -6 20 -17 -12 -4 -14 16 -26 39 -21 -10 15 33 -36 43 23 -48 35 -32 -3 32 -3 15 11 5
4605 5 60 3 -13 37 -27 -39 48 -1 -23 -7 -3 -39 -38 11 -1 -5 -61 47 3 -22 -1 -6 44 -20 -57 3 -17 -33 -17 -15 20 13 86
4638 86 31 35 53 14 57 38 36 8 6 -44 55 -10 25 -10 13 19 -10 -7 -18 -22 29 38 -11 15 -11 -53 -28 -50 -25 9 -9 -19 -23 19
4672 19 49 -27 -31 -7 -16 13 60 -10 26 52 30 5 26 -38 18 34 34 19 7 54 -55 5 7 52 11 -24 3 -2 -60 21 -10 -18 -7
4705 -7 -16 -42 16 -14 -1 4 47 23 4 -44 49 15 1 41 33 0 57 -10 -92 43 46 12 -29 -1 10 24 78 -8 23 51 14 -19
4737 -19 -5 47 -15 -12 8 16 -24 34 -20 -7 -51 -18 -34 -36 48 -8 10 -2 -71 -29 -16 -3 12 34 71 27 -11 -15 0 15 13 111 -25
4770 -25 8 41 19 19 47 30 -23 -29 49 -9 2 14 6 4 -16 -12 -48 37 1 -28 -35 -8 -14 -33 -46 -2 -42 16 -24 -51 -21 30 17 48
4804 48 26 -12 -6 4 38 14 -15 -9 -18 -1 10 12 -29 11 19 -26 -46 -40 -5 -62 -21 8 -11 -35 24 -41 13 1 -29 46 -18 -8 26
4837 26 11 -7 -75 -3 -2 29 5 15 -41 13 18 8 -94 5 27 -13 -33 33 -13 -18 -6 58 -34 4 28 -6 13 56 27 10 -12
4868 -12 -34 -43 -34 16 6 -44 -14 17 -40 -19 -9 -28 -3 37 -10 11 48 9 -16 -10 36 -51 0 43 18 28 2 -2 -34 10 7 -7 -4
4901 -4 24 -10 30 13 5 -17 -34 34 -7 -2 71 -10 -2 6 -59 -35 44 -42 -50 -24 -12 -18 15 16 -36 -34 -46 -25 -33 10 -8 -33 -25 10 -2 8
4937 8 42 7 -3 -8 15 41 -57 84 21 4 -14 -33 -60 14 -28 -35 -28 35 12 -3 57 -21 24 -21 -31 -38 8 41 2 -2 15 -19 -36
4970 -36 23 15 -3 -28 -17 3 -24 10 20 28 -15 30 -11 34 6 -4 9 11 -4 -4 -33 28 11 -36 -13 1 -30 -15 44 -26 11 -18
5002 -18 9 -23 40 -25 -4 3 -30 -19 43 27 -5 -24 58 -23 18 33 -20 -9 46 45 -21 7 34 29 -6 0 13 -38 42 -22 0 -35
5034 -35 -46 3 -18 -5 41 0 44 -8 13 55 35 -26 3 -37 12 -29 -2 7 -13 5 25 -4 49 26 -17 24 11 25 32 -18 10
5065 10 18 -14 -9 2 -51 -2 0 -64 10 31 11 48 19 3 16 25 -20 -20 0 11 -42 6 19 -23 -18 10 -21 -39 -32 1 12 -9 -19 12
5099 12 26 -9 -3 -34 -20 -13 19 2 -41 38 -31 -23 -16 -17 36 13 -17 -54 74 13 7 23 -43 -83 13 -14 -38 15 -37 10 12 -22 -35
5132 -35 -55 5 -26 -29 -4 -1 76 -72 6 -38 -25 20 35 16 -27 34 -5 -8 0 41 -3 49 20 12 6 5 7 -8 -15 -61 -38 -13 47 3
5166 3 11 -16 -58 -2 -6 16 4 -33 4 -31 -20 54 -9 2 28 -33 -23 -8 32 -14 -51 21 37 -28 2 14 46 1 60 -16 -4 27
5198 27 -20 30 -25 -36 26 -6 -2 3 10 -49 16 -30 -1 16 -57 -11 -13 -16 -22 2 -34 -40 20 -36 -25 27 11 9 -23 -39 -39 -59 -5 20 -4
5233 -4 13 40 -24 54 83 -2 0 -11 37 15 13 8 -46 -10 35 -43 -51 -13 55 -43 13 12 7 13 22 -21 6 -32 -5 25 -3 21 -15 -14 -35
5268 -35 -53 -83 -18 -28 -43 6 6 11 1 22 58 13 -9 74 18 41 -13 39 25 -30 -12 25 36 -58 1 -14 25 1 4 -46 -10 -8
5300 -8 33 -16 31 27 -16 17 -5 5 -31 -24 16 -24 61 28 9 -54 -36 56 6 42 -7 2 52 -15 -23 -32 -39 -7 -1 14 -4 21 -30 -13
5334 -13 -24 -24 10 4 -74 -1 -72 -55 -1 37 10 26 20 -27 -30 -25 -23 -25 -7 1 -63 15 10 -3 -6 -17 11 45 7 19 17 -36 3 12 -4 -13 9
5371 9 1 -20 -26 -25 9 23 2 -14 -52 -15 27 10 15 -19 -33 3 -11 -11 -10 29 54 0 -9 44 10 18 -14 9 -49 26 6 16 34 33 -17
5406 -17 46 44 -26 21 30 -1 1 -21 14 2 20 -19 -29 26 -58 -22 -23 -45 -14 -38 62 40 -21 7 -19 17 -42 0 -32 3 27 43
5438 43 41 1 -14 -8 52 18 -22 19 15 91 27 2 -5 -49 28 -1 40 -50 27 1 -24 -25 -27 -42 -72 27 -38 -15 10 -24 -20 -3 19 -28
5472 -28 -21 19 -10 17 -4 23 -67 3 53 -3 -5 24 -55 16 55 44 32 12 36 44 36 -7 -46 31 0 21 -31 6 -30 -49 11 -18
5504 -18 18 -19 -33 -47 -6 -7 9 -37 -15 -19 -51 -31 -26 -10 -34 6 -39 -25 -10 22 -44 -14 -60 -9 -9 29 21 37 30 22 10 56 26 -5
5538 -5 42 -19 24 -10 -22 37 -14 -16 16 -42 -14 7 27 -30 -8 -18 -12 -23 2 -17 1 -43 21 -13 28 17 -29 26 25 5 -17 -22 30
5571 30 -20 -14 -38 17 -25 -1 7 -18 5 78 26 40 45 9 -40 -40 3 3 75 -19 -2 19 -46 -28 -6 -21 -19 -8 19 -34 -47 -19 50
5604 50 -34 -21 0 -17 -33 -19 46 40 -1 -12 -17 10 8 21 18 10 -3 -1 22 47 -25 -8 17 -11 6 -13 7 -49 -29 21 -22 -52 29
5637 29 17 -28 17 -27 3 -8 -14 -27 -32 30 28 -8 -8 17 -8 5 -27 46 -30 26 7 -3 -70 34 23 23 -19 10 -14 25 -10 -20
5669 -20 13 18 -30 -47 13 -9 -14 -10 -23 -25 3 -58 -36 0 -8 13 -19 -2 -24 6 27 3 6 39 10 -32 -8 -2 11 -24 0 12 60 23
5703 23 41 4 -16 -28 28 22 -7 -3 65 11 75 -21 0 3 -23 16 -7 27 -6 -13 -26 45 11 54 -45 -5 -2 22 -18 13 9 -8 3
5736 3 40 1 29 11 30 24 30 4 6 8 53 -15 40 61 46 30 17 -44 -38 1 -6 -50 -20 -20 -1 16 48 23 -26 -16 1 -27 38 -10
5770 -10 -11 -10 3 -1 -58 22 -1 -30 -57 -37 53 0 -27 -9 44 4 22 -7 2 3 13 24 -40 35 14 16 14 -32 -37 -9 7 -29 -18 -8
5804 -8 -35 33 -7 0 39 -48 -76 34 46 24 -73 -8 10 3 16 13 -18 9 18 -15 -5 -13 64 54 24 -11 11 -18 31 60 -37 -2 -1
5837 -1 -32 -53 6 0 -18 -15 -46 -35 9 3 2 -29 9 21 -5 8 -16 -5 -33 10 4 -24 -27 18 -24 63 -37 42 41 -4 18 28 16 34
5871 34 51 3 26 5 38 8 18 -27 -44 23 -17 -16 -48 -14 -29 -12 -10 11 -40 22 27 -68 -4 -45 -57 45 26 -15 18 9 -38 -34
5903 -34 -17 -15 30 -66 11 16 -10 -22 38 65 22 28 -41 -2 -7 -33 59 -11 -23 17 -20 7 -31 -8 -11 -73 18 40 -34 -47 8 37 -14
5936 -14 -6 -11 0 -4 -44 13 40 1 -16 28 35 -20 -12 -2 1 18 42 0 35 4 -50 -9 6 -28 6 -16 27 -15 1 -14 2 -9 -31
5969 -31 17 35 -35 -29 -13 30 9 30 14 -28 -11 6 35 -10 -11 -47 18 40 4 -10 35 -6 -37 0 -9 3 14 -19 -22 13 4 -10 18
6002 18 -21 -15 17 20 40 27 -1 6 -11 6 31 1 43 -17 29 -34 -39 -1 35 -28 -15 -8 -41 53 -1 2 -8 9 -37 16 -50 30 5
6035 5 -7 26 -13 34 22 39 0 35 14 21 46 39 -5 -17 -26 -22 -48 -24 2 -10 -29 -46 1 29 21 -20 11 -7 6 -11 -65 29 -23
6068 -23 19 4 -105 -28 -22 -27 -36 36 -2 11 -34 17 54 -40 38 -22 -25 34 11 23 46 16 -30 -17 -5 11 10 -35 -10 -19 40 7 -8
6101 -8 3 13 -14 -45 20 40 26 -36 -13 49 3 33 -4 30 -12 4 32 21 -33 6 4 39 -8 -22 6 23 -7 -8 4 19 12 8 -39
6134 -39 2 -27 -31 -46 16 -15 -13 -10 -58 -45 -24 -30 -14 7 -38 9 3 6 31 -5 19 -22 -47 -44 41 1 40 25 21 10 -34 -12 -81 17
6168 17 -4 23 15 33 9 -13 0 23 35 -44 30 35 39 -12 39 -10 -60 5 -50 19 39 53 4 -54 10 -49 8 -19 -56 -13 -75 -44
6200 -44 -12 -9 -26 9 38 13 21 44 14 37 58 -28 14 -16 37 -24 8 36 8 -2 -60 34 43 -37 -30 38 -27 -17 -53 0 -27 -55
6232 -55 21 20 -11 -16 18 -4 -7 7 -9 -3 8 -53 -18 -2 -41 -13 39 -59 33 26 8 -17 -17 -5 16 -35 28 33 -14 1 -25 -45 1 32
6266 32 13 31 5 -4 -38 -64 18 -56 -96 -40 -26 -34 -54 -4 -72 20 -24 6 -15 41 9 16 50 30 -2 -9 -4 -8 0 -17 12 -11 76 7
6300 7 -13 -2 -2 -7 -33 -41 -19 14 -1 -14 -37 26 -25 33 32 -30 -5 26 -13 19 -23 23 12 8 -54 -1 15 11 -1 22 14 18 -7 25 13
6335 13 50 35 -43 -1 26 21 9 -60 12 -20 31 -7 -27 40 -52 72 -25 19 2 -56 15 -24 -60 -18 21 32 -69 -15 -11 -5 -11
6366 -11 -51 3 -25 -56 -16 -51 -8 -31 9 4 13 17 6 -15 16 3 -58 39 41 -56 -7 23 18 -33 56 56 -28 -40 18 45 -14 -16 34 -8
6400 -8 -3 -22 29 -21 -39 -16 -5 6 44 24 -9 -70 -7 26 -7 26 0 -34 36 -25 40 1 -20 59 -34 -30 15 64 1 16 26 57
6432 57 0 -58 16 -23 -30 -15 -40 -22 -35 2 14 23 -1 -30 -6 -82 -19 25 -27 26 0 -16 41 13 -8 25 -58 2 -20 19 29
6463 29 -20 11 43 -5 11 -6 13 21 25 43 -3 48 -1 -34 10 22 -24 -4 -14 22 -1 -17 -12 14 27 10 -14 26 -68 -45 37 -7
6495 -7 -15 -24 20 -35 -48 5 -50 -4 -45 -39 -11 32 -3 -15 -37 0 42 -20 52 15 19 15 -1 29 -20 57 59 -32 -47 -19 -6 -42 7 -35
6529 -35 20 5 1 -23 -15 -19 41 -11 -19 -25 2 -17 31 13 -1 -42 -27 -17 26 12 -20 2 9 -35 10 29 -4 12 -4 -19 32 -23 -35
6562 -35 14 16 32 -25 -34 -28 -54 -8 -3 -13 -19 15 -11 -8 8 -12 -9 -72 7 -25 13 -33 -60 -1 -14 24 12 -5 -2 -17 -19 56 0 -5 34
6597 34 28 -1 -27 22 -44 -12 0 28 -10 -68 22 -7 -8 37 14 -36 -12 -16 -11 30 -57 -44 42 19 1 -8 1 10 2 -4 -4 -62 -17 17 -9
6632 -9 -4 -10 33 -42 -13 -16 50 44 39 13 -68 30 1 -24 -26 55 7 -15 -38 -41 4 -5 -61 -48 -21 35 -73 17 30 22 1 -50 -17 4 -9
6667 -9 -42 12 57 14 26 4 -41 -13 -10 0 1 14 -20 12 29 24 52 -17 -46 9 27 -10 -2 -7 5 -57 -2 -9 -1 5 40 8 -49 30 29
6702 29 49 -4 -61 -13 14 -22 -28 -19 -10 26 71 66 9 -8 -13 17 24 -21 -23 28 21 2 -31 9 -13 -24 13 -45 -45 24 -28 -12 0 -50 8
6737 8 -20 7 -7 10 -33 -43 -70 24 -51 -7 18 0 -14 -63 17 -23 -9 -3 14 -23 -40 -77 21 -11 16 -40 25 36 -15 -18 6 13
6769 13 -9 7 48 14 -40 28 -2 10 -11 6 -8 29 38 -26 -48 -25 13 -28 24 7 6 44 30 19 -9 -25 6 -41 49 18 5
6800 5 -43 15 -30 5 -19 -22 38 14 37 -30 29 36 -34 -32 52 18 45 -2 -9 -34 8 13 1 -13 0 6 -9 34 -19 11 -16 47 10 -20
6834 -20 16 34 20 -8 -2 -47 -50 31 -18 -61 -18 23 31 -54 -15 -5 24 0 20 56 29 43 -26 2 24 -14 13 -38 -4 5 -55 27
6866 27 3 -33 -64 -17 -50 -8 -2 -22 10 -27 0 49 0 -42 2 21 25 51 5 13 -36 24 -2 -10 2 27 -45 23 53 -18 13 -11
6898 -11 14 -55 4 -10 -9 -6 -25 -20 -9 -36 -41 -16 -57 -45 -4 -19 -17 19 0 -12 20 20 37 7 -8 24 52 0 -5 -9 -42 -73 -14 58
6932 58 -2 19 -38 4 1 16 6 22 53 -21 -24 -13 -22 -8 -37 8 12 -37 -30 -27 -1 -7 44 -33 -41 -13 19 -25 26 26 -21 35 -15 3 17
6967 17 54 8 22 -17 -4 20 20 15 -1 -34 65 38 -16 15 -7 -9 5 -23 -27 -17 -37 -7 -4 25 -47 -5 -4 -64 -19 -16 52 -58 -44
7000 -44 -53 -11 -3 -26 66 3 21 -36 -44 -19 16 -41 -3 10 35 17 29 31 16 -34 -31 24 25 -28 47 36 14 14 -17 27 28 -36 -36 18 -2
7035 -2 -49 -58 -18 -43 -14 30 -14 5 -21 -2 -65 23 57 -47 -16 -24 -8 14 31 17 -26 -45 62 -3 -37 -51 -9 -6 -1 10 -35 21
7067 21 3 -20 -35 -21 -5 19 2 -3 -11 -39 -17 -20 -1 -47 0 -15 -21 7 -38 18 -19 37 -19 -2 20 14 19 -5 -36 28 13 -4 -22
7100 -22 46 28 31 -25 26 10 -8 36 -9 -19 -5 21 -6 13 -9 -3 -6 -4 1 -36 34 21 3 18 8 -37 -20 5 29 41 -16 11 -58
7133 -58 37 24 23 69 -13 12 3 3 -50 -15 23 21 -16 -20 12 -14 -10 -25 -32 15 -14 16 -16 37 11 -6 -14 22 -25 -58 13 -13 -13 -35 17
7168 17 15 -16 0 -2 -23 -6 4 9 10 -24 37 19 -6 52 28 -3 6 37 -45 1 21 -8 12 -13 18 31 30 9 39 -39 -28 -1 -7 27
7202 27 2 7 -37 -11 -19 6 2 -72 -12 -14 -68 36 -5 -38 29 -2 -8 -39 19 -5 3 27 -23 -31 6 -12 12 61 -20 -32 31 -5 18
7235 18 -41 -36 72 -18 -16 17 -12 48 -41 18 22 -16 0 -44 2 -71 -7 -36 9 -5 -13 -20 -19 1 -17 0 7 -24 37 -42 -1 34 -52
7268 -52 -1 -16 -5 -35 40 -28 -20 -12 -12 14 -9 -7 18 21 -38 -11 -57 -22 2 47 -42 -13 -70 5 -19 -9 -17 -3 -6 -29 -30 5 22 -7
7302 -7 10 -41 -49 -9 -11 46 33 13 -15 5 48 -29 -8 -9 -54 0 -5 10 22 27 -71 35 -12 12 -2 14 9 -10 -11 -33 34 0 -30 -70
7336 -70 13 -3 -30 7 -20 -12 -45 -18 -5 -39 -18 -30 25 27 3 -1 1 -25 10 -1 26 28 -31 21 3 30 12 12 17 -5 -46 -58 -11 -22
7370 -22 -40 0 -26 -46 -42 0 33 43 54 -52 39 -61 -27 1 -7 -13 -16 24 -10 3 8 20 35 -25 -25 -28 31 20 55 9 -11 2 21
7403 21 -65 -13 21 -27 26 23 39 3 -31 -39 65 -47 -11 -15 -37 -25 4 43 -11 -5 5 -28 -36 -56 -27 38 -33 16 16 -23 -23 20 -25
7436 -25 29 20 12 23 15 30 11 66 -11 37 38 8 -3 14 -4 -21 66 -39 39 -28 5 -30 13 -24 -6 -73 -31 28 -1 -17 -30 56
7468 56 -15 27 32 26 24 1 42 2 34 14 9 -25 16 -24 81 31 -10 8 56 -35 6 24 28 -5 28 46 -13 -14 -8 20 -11 -38 42
7501 42 -23 -14 29 25 -4 12 14 28 -28 4 11 24 -24 44 -39 -13 5 18 31 3 1 85 4 -22 -25 -17 -7 -6 33 16 9 46 67 -4 16
7536 16 -12 18 46 -14 24 31 -17 6 13 -39 -41 6 -7 -29 -52 -4 -30 -38 16 4 11 2 23 -26 4 14 -31 9 -4 1 -39 -28 -11 17
7570 17 -24 16 24 12 -24 23 -24 23 46 -6 -16 -4 -5 8 -35 -12 41 -23 -43 -36 -16 -25 -38 -7 0 -14 2 -13 -10 50 12 -32 -38 39
7604 39 -14 56 -22 32 17 -28 -7 4 -11 49 25 30 -10 60 37 54 -10 -15 -5 27 -1 -50 66 -1 -11 7 -8 -23 -4 7 -22
7635 -22 -20 -8 39 0 38 -47 -36 11 4 -30 -33 10 42 9 9 29 -4 0 -59 42 31 32 37 -19 55 33 -30 34 4 -18 46 -1 11
7668 11 2 20 6 21 -2 -29 17 6 62 -20 30 -17 -1 8 -12 4 -2 2 -11 5 9 59 38 25 -1 55 -16 33 27 -21 18 -1 30
7701 30 -23 -2 61 8 36 27 -17 27 -37 0 10 3 33 -10 23 53 -8 -10 3 -42 -7 1 -6 -43 -51 26 -41 -18 1 26 -26 31 -1
7734 -1 19 20 6 20 58 33 -13 37 45 23 55 -53 13 43 -76 40 -1 51 18 -4 10 -10 -23 34 -13 16 -12 -71 -1 10
7764 10 17 3 5 51 10 28 65 10 33 -16 6 -6 12 -30 17 -8 41 8 26 46 13 13 35 -39 -23 1 -8 -28 -11 -11 -31 15 45
7797 45 5 -27 41 37 11 -48 -4 -25 -33 11 -30 41 -35 -48 27 -25 5 -36 48 17 -49 6 -13 0 -56 -9 -26 -13 -21 15 10 55
7829 55 5 5 -60 -8 -19 -29 -13 -3 10 -44 11 -20 21 -33 64 -26 40 6 -17 18 -49 36 -15 -28 44 -28 15 24 -3 -21 -9
7860 -9 75 45 33 32 28 60 7 55 -6 31 43 -38 -11 -32 43 -47 23 -22 -42 -12 -43 43 12 -52 -34 -3 7 -48 30 -19 -4 13
7892 13 27 5 17 -1 -24 -22 -29 28 -36 42 -27 -15 -25 6 -9 47 4 4 31 -4 10 26 -26 -1 -33 -64 19 -14 -24 -7 -29 35
7924 35 -47 -32 -24 -8 -39 -11 -39 -20 8 -28 8 33 -11 -6 10 40 -12 -41 -20 -37 -2 10 -17 4 34 34 -14 46 -35 0 28 -51
7956 -51 5 -1 -15 6 -8 -6 50 16 -33 -12 -20 9 -103 2 -19 23 11 -13 4 -8 -42 -21 13 -14 5 41 1 -39 8 -12 25
7987 25 21 -2 -20 14 16 24 -23 41 -18 4 7 1 -7 -14 13 63 42 6 -5 63 26 4 -18 13 9 29 33 16 -11 -5 36 3 -1 17 -3 -8
8023 -8 -7 -7 -5 -33 -32 -2 -38 -24 45 17 -41 13 62 -22 6 44 -8 18 -29 6 -33 -30 40 15 44 0 6 -47 6 24 11 -30 2 -73
8057 -73 38 -18 -17 -2 -13 -93 2 4 28 -30 -36 -61 -7 48 25 -2 1 0 -54 -34 5 22 13 26 -1 6 12 -38 29 17 9 0 -39 35 -22
8092 -22 -45 4 -18 -24 -44 2 18 -15 -25 38 -13 -6 -30 20 7 2 -3 4 -10 -43 19 23 4 2 -17 -1 15 -6 1 57 13 -14 -4 19
8126 19 -23 -6 5 35 4 6 -55 -36 -36 35 -9 9 53 -4 -7 35 -33 -41 77 28 -1 -30 -10 2 -61 -24 8 11 50 9 -6 14
8158 14 -36 -27 8 -9 45 -4 36 20 6 36 14 -5 -14 -35 54 -25 -53 5 -6 16 22 -3 9 28 63 8 27 27 -31 -12 -43 73
8190 73 -33
8191c3
##END NTUPLES=NMR FID
##END=
