##TITLE=1H_LR-758-R5-3HS-FR2
 CCl4
 8 sc, 
 5.9.2023
##JCAMPDX= 6.0         $$ Bruker NMR JCAMP-DX V2.0
##DATA TYPE= NMR FID
##DATA CLASS= NTUPLES
##ORIGIN= UXNMR, Bruker Analytische Messtechnik GmbH
##OWNER= root
$$ XWIN-NMR		Version 3.5
$$ Wed Sep  6 14:03:21 2023 Russian Standard Time (UT+4h)  she@DPX200
##.OBSERVE FREQUENCY= 200.13135
##.OBSERVE NUCLEUS= ^1H
##.DELAY= (6, 6)
##.ACQUISITION MODE= SIMULTANEOUS
##.ACQUISITION SCHEME= undefined
##.AVERAGES= 8
##.DIGITISER RES= 18
##SPECTROMETER/DATA SYSTEM= spect
##.PULSE SEQUENCE= zg30
##.SOLVENT NAME= CDCl3
##.SHIFT REFERENCE= (INTERNAL, CDCl3, 0, 15.7039)
##AUDIT TRAIL= $$ (NUMBER, WHEN, WHO, WHERE, WHAT)
$$ ##TITLE= Audit trail, XWIN-NMR		Version 3.5
$$ ##JCAMPDX= 5.01
$$ ##ORIGIN= Bruker BioSpin GmbH
$$ ##OWNER= she
$$ F:/spectra/data/she/nmr/H-F/1/audita.txt
$$ ##AUDIT TRAIL=  $$ (NUMBER, WHEN, WHO, WHERE, WHAT)
(   1,<2023-09-06 14:02:10.59 +0400>,<she>,<DPX200>,
      <created by zg, POWCHK disabled, PULCHK disabled
       configuration hash MD5:
       00 E9 B6 7A A2 85 ED C7 34 08 36 98 17 FE 4E 26
       data hash MD5: 16K
       92 86 C0 AF E8 0A 5A 89 69 E5 49 B1 9F 7E 59 6E>)
$$ ##END=
$$ 
$$ hash MD5
$$ BA C7 21 A1 2A B6 5E 49 A4 A3 65 D2 CB E7 F0 DA
##$RELAX= 
##$RELAX= 
##$RELAX= 
##$RELAX= 
##$RELAX= 
##$RELAX= 
$$ Bruker specific parameters
$$ --------------------------
##$DU= <F:/spectra>
##$EXPNO= 1
##$NAME= <H-F>
##$PROCNO= 1
##$TYPE= <nmr>
##$USER= <she>
##$AMP= (0..31)
100 100 100 100 100 100 100 100 100 100 100 100 100 100 100 100 100 100 
100 100 100 100 100 100 100 100 100 100 100 100 100 100 
##$AQSEQ= 0
##$AQ_mod= 1
##$AUNM= <au_zg>
##$AUTOPOS= <>
##$BF1= 200.13
##$BF2= 200.13
##$BF3= 200.13
##$BF4= 200.13
##$BF5= 200.13
##$BF6= 200.13
##$BF7= 200.13
##$BF8= 200.13
##$BYTORDA= 1
##$CFDGTYP= 0
##$CFRGTYP= 5
##$CHEMSTR= <none>
##$CNST= (0..31)
1 1 145 1 1 1 1 1 1 1 1 1 1 1 1 1 1 1 1 1 1 1 1 1 1 1 1 1 1 1 1 1 
##$CPDPRG= <>
##$CPDPRG1= <>
##$CPDPRG2= <>
##$CPDPRG3= <>
##$CPDPRG4= <mlev>
##$CPDPRG5= <mlev>
##$CPDPRG6= <mlev>
##$CPDPRG7= <mlev>
##$CPDPRG8= <mlev>
##$CPDPRGB= <>
##$CPDPRGT= <>
##$D= (0..31)
0 1.2 0 0 0 0 0 0 0 0.06 0 0.03 0 0 0 0 0.0002 0 0 0 0 0 0 0 0 0 0 0 0 
0 0 0 
##$DATE= 1693994530
##$DBL= (0..7)
120 120 120 120 120 120 120 120 
##$DBP= (0..7)
150 150 150 150 150 150 150 150 
##$DBP07= 0
##$DBPNAM0= <>
##$DBPNAM1= <>
##$DBPNAM2= <>
##$DBPNAM3= <>
##$DBPNAM4= <>
##$DBPNAM5= <>
##$DBPNAM6= <>
##$DBPNAM7= <>
##$DBPOAL= (0..7)
0.5 0.5 0.5 0.5 0.5 0.5 0.5 0.5 
##$DBPOFFS= (0..7)
0 0 0 0 0 0 0 0 
##$DE= 6
##$DECBNUC= <off>
##$DECIM= 32
##$DECNUC= <off>
##$DECSTAT= 4
##$DIGMOD= 1
##$DIGTYP= 9
##$DL= (0..7)
0 120 120 120 120 120 120 120 
##$DP= (0..7)
150 150 150 150 150 150 150 150 
##$DP07= 0
##$DPNAME0= <>
##$DPNAME1= <>
##$DPNAME2= <>
##$DPNAME3= <>
##$DPNAME4= <>
##$DPNAME5= <>
##$DPNAME6= <>
##$DPNAME7= <>
##$DPOAL= (0..7)
0.5 0.5 0.5 0.5 0.5 0.5 0.5 0.5 
##$DPOFFS= (0..7)
0 0 0 0 0 0 0 0 
##$DQDMODE= 0
##$DR= 18
##$DS= 0
##$DSLIST= <SSSSSSSSSSSSSSS>
$$ [...]
##$SUBNAM2= <"">
##$SUBNAM3= <"">
##$SUBNAM4= <"">
##$SUBNAM5= <"">
##$SUBNAM6= <"">
##$SUBNAM7= <"">
##$SUBNAM8= <"">
##$SUBNAM9= <"">
##$SW= 18.05172834244
##$SWIBOX= (0..15)
0 0 2 0 0 0 0 0 0 0 0 0 0 0 0 0 
##$SW_h= 3612.71676300578
##$TD= 16384
##$TD0= 1
##$TE= 0
##$TE2= 300
##$TE3= 300
##$TEG= 300
##$TL= (0..7)
0 120 120 120 120 120 120 120 
##$TP= (0..7)
150 150 150 150 150 150 150 150 
##$TP07= 0
##$TPNAME0= <>
##$TPNAME1= <>
##$TPNAME2= <>
##$TPNAME3= <>
##$TPNAME4= <>
##$TPNAME5= <>
##$TPNAME6= <>
##$TPNAME7= <>
##$TPOAL= (0..7)
0.5 0.5 0.5 0.5 0.5 0.5 0.5 0.5 
##$TPOFFS= (0..7)
0 0 0 0 0 0 0 0 
##$TUNHIN= 0
##$TUNHOUT= 0
##$TUNXOUT= 0
##$USERA1= <user>
##$USERA2= <user>
##$USERA3= <user>
##$USERA4= <user>
##$USERA5= <user>
##$V9= 5
##$VALIST= <valist>
##$VCLIST= <CCCCCCCCCCCCCCC>
##$VD= 0
##$VDLIST= <DDDDDDDDDDDDDDD>
##$VPLIST= <PPPPPPPPPPPPPPP>
##$VTLIST= <TTTTTTTTTTTTTTT>
##$WBST= 1024
##$WBSW= 4
##$XGAIN= (0..3)
0 0 0 0 
##$XL= 0
##$YL= 0
##$YMAX_a= 156592
##$YMIN_a= -208897
##$ZGOPTNS= <>
##$ZL1= 120
##$ZL2= 120
##$ZL3= 120
##$ZL4= 120
##$ABSF1= 10
##$ABSF2= 0
##$ABSG= 5
##$ABSL= 3
##$ALPHA= 0
##$AQORDER= 0
##$ASSFAC= 0
##$ASSFACI= 0
##$ASSFACX= 0
##$ASSWID= 0
##$AUNMP= <proc_1d>
##$AZFE= 0.1
##$AZFW= 0.1
##$BCFW= 1
##$BC_mod= 2
##$BYTORDP= 1
##$COROFFS= 0
##$CY= 11.3945322036743
##$DATMOD= 1
##$DC= 2
##$DFILT= <>
##$DTYPP= 0
##$F1P= 15.7292609196834
##$F2P= 12.9074282941183
##$FCOR= 0.5
##$FTSIZE= 0
##$FT_mod= 4
##$GAMMA= 1
##$GB= 0.15
##$INTBC= 1
##$INTSCL= 1
##$ISEN= 128
##$LB= 0.24
##$LEV0= 0
##$LPBIN= 0
##$MAXI= 10000
##$MC2= 0
##$MEAN= 0
##$ME_mod= 0
##$MI= 1.114404
##$NCOEF= 0
##$NC_proc= 0
##$NLEV= 6
##$NOISF1= 3.799351
##$NOISF2= 2.8
##$NSP= 1
##$NTH_PI= 0
##$NZP= 0
##$OFFSET= 15.70392
##$PC= 1
##$PHC0= -21203.29
##$PHC1= 7.65271
##$PH_mod= 1
##$PKNL= yes
##$PPARMOD= 0
##$PSCAL= 0
##$PSIGN= 0
##$REVERSE= no
##$SF= 200.130013532006
##$SI= 16384
##$SIGF1= 3
##$SIGF2= 2
##$SINO= 400
##$SIOLD= 16384
##$SREGLST= <1H.CDCl3>
##$SSB= 0
##$STSI= 0
##$STSR= 0
##$SW_p= 3612.71676300578
##$SYMM= 0
##$S_DEV= 0
##$TDeff= 0
##$TDoff= 0
##$TI= <>
##$TILT= no
##$TM1= 0
##$TM2= 0
##$TOPLEV= 0
##$USERP1= <user>
##$USERP2= <user>
##$USERP3= <user>
##$USERP4= <user>
##$USERP5= <user>
##$WDW= 1
##$XDIM= 8192
##$YMAX_p= 0
##$YMIN_p= 0
$$ End of Bruker specific parameters
$$ ---------------------------------
##NTUPLES= NMR FID
##VAR_NAME=  TIME,          FID/REAL,        FID/IMAG
##SYMBOL=    X,             R,               I
##VAR_TYPE=  INDEPENDENT,   DEPENDENT,       DEPENDENT
##VAR_FORM=  AFFN,          ASDF,            ASDF
##VAR_DIM=   8192,          8192,            8192
##UNITS=     SECONDS,       ARBITRARY UNITS, ARBITRARY UNITS
##FACTOR=    0.0002768,     1,               1
##FIRST=     0,             0,               0
##LAST=      2.2672688,     0,               0
##MIN=       0,             -208897,         0
##MAX=       2.2672688,     156592,          0
$$ Real data points
##PAGE= N=1
##DATA TABLE= (X++(R..R)), XYDATA
0@%%%%%%%%%%%%qJ6j6J6k4L2l2M0n4O2p2Q8j04J20j36J56j80K08k39K71l05L44
$$ 0 0 0 0 0 0 0 0 0 0 0 0 0 -8 8 -8 8 -16 16 -16 24 -30 32 -40 48 -56 64 -72 84 -96 112 -127 144 -161 183
34A83l90M40m94N52o16O86p63Q49r42J042j151J270j401J544j702J877k066K273
$$ 183 -207 233 -261 291 -325 361 -402 447 -495 547 -604 666 -735 809 -893 984 -1082 1191
52A191k506K765l055L383l756M187m685N273n980O846p938R357j1281J4045j8353
$$ 1191 -1315 1450 -1605 1778 -1978 2209 -2476 2797 -3183 3663 -4275 5082 -6199 7846 -10507
67a0507K5976m3093J39658k9972k90959L50916j34806j38242K87621j93326q3636
$$ -10507 15469 -27624 112034 82062 -208897 142019 7213 -131029 156592 -36734 -120370
78a20370K59132j72963j1016J11653j31981Q4986L5963j24621R1762j6306k4855
$$ -120370 138762 -34201 -45217 66436 -65545 19441 55404 -69217 22545 6239 -18616
89a8616O5348q9489K9827O0607q1205N3938k5896l5197J08512r1608j7566J06835
$$ -18616 46732 -42757 -12930 47677 -33528 20410 -5486 -40683 67829 -23779 -41345 65490
101F5490j15872N2961O5440j59509J12249N0177j57933J20675k938j03709J38905
$$ 65490 -50382 2579 68019 -91490 20759 70936 -86997 33678 30740 -72969 65936
112F5936o5682o7089J33466q2848j1309P8578j02596O1265M1262j15351Q5148
$$ 65936 254 -66835 66631 -16217 -27526 51052 -51544 9721 50983 -64368 20780
123B0780O067p5567R3721n1584m0387J03257o8226j5163O1228o3788M0934J6836
$$ 20780 26847 -48720 45001 -6583 -46970 56287 -11939 -27102 34126 -29662 11272 28108
135B8108p4871O6344m312m4326O2730n2630o571P7751p4955K060N4239o1280L8531
$$ 28108 -46763 19581 15269 -29057 33673 -18957 -25528 52223 -22732 -20672 33567 -27713 10818
148A0818J3713o8445O0965K463m6716M9051l3518o480N9815o2275J920N0289n4065
$$ 10818 24531 -43914 17051 19514 -27202 21849 -11669 -18149 41666 -20609 -18689 31600 -22465
161b2465K7516J8602o2628N1331J3504n6025M1076n713k4465M4177l0432j4477
$$ -22465 5051 23653 -38975 12356 25860 -30165 10911 5198 -19267 24910 -5522 -19999
173a9999M0657k6532K627J4919l0610K6778N952l2527K5870m297j2961K5772k3405
$$ -19999 20658 -5874 -3247 11672 -18938 7840 13792 -18735 7135 2838 -10123 15649 -7756
186g756k347K6649k4425O497R492k2589K4981l925k4973L0982j1397j3421K9277
$$ -7756 -10103 16546 -7879 -1382 8110 -14479 10502 6577 -18396 12586 1189 -12232 17045
199A7045k6418o96L1845l3481M493K3637k9894J6101R504l0440K4998L367k4421
$$ 17045 -9373 -10069 21776 -11705 -7212 16425 -13469 2632 12136 -18304 6694 10061 -14360
212a4360K2118p000j0195K2558j7628l994J9545j5729L790O550j5118J4409n2
$$ -14360 7758 758 -9437 13121 -4507 -8501 11044 -4685 -895 5655 -9463 4946 4894
225D894j3226J3142o416j187J1662j6733N782J1120j6753J0577J039j4666J9481
$$ 4894 -8332 4810 -1606 -2793 8869 -7864 -2082 9038 -7715 2862 3901 -10765 8716
238H716n662j4380J9685q963n748J6423j6144J288J5355j6647M386P711j3153
$$ 8716 3054 -11326 8359 -604 -6352 10071 -6073 -4785 10570 -6077 -1691 6020 -7133
251g133J0639M20j1818J1970k559n742Q997p822J071P644r736L906L151p451P964
$$ -7133 3506 3926 -7892 4078 1519 -4223 4774 -3048 -1977 5667 -4069 -163 2988 -4463 3501
266C501k479o423R910m711l317Q132p475J238O819r092L256M358p429N143M19
$$ 3501 1022 -5401 4509 -202 -3519 4613 -2862 -1624 5195 -3897 -641 3717 -3712 1431 1850
281A850n728O309j626l559N001l026k33L281m189K005J346l421L446j517j897
$$ 1850 -3878 2431 805 -2754 2247 -779 -1012 2269 -1920 85 1431 -1990 1456 -61 -1958
296a958M592l749l00M356n210J838L398o106L578K242o139M710O92n351N242o40
$$ -1958 2634 -1115 -1415 2941 -2269 -431 2967 -3139 439 2681 -3458 1252 1944 -3407 1835 1195
312A195m206N069j561k853M268j949j576L085j701n89J692j051j65L68K23j52
$$ 1195 -3011 2058 497 -2356 1912 -37 -1613 1472 -229 -818 874 -177 -342 26 249 97
328I7p63J406o20j284K515j514j294L392k469j009L912l425k74L755l880O24L146
$$ 97 -666 740 120 -1164 1351 -163 -1457 1935 -534 -1543 2369 -1056 -1330 2425 -1455 -831 2315
345B315m052J410K312l707J777J304k727J694L76j632J344j63n62M16l34O76o56
$$ 2315 -1737 -327 1985 -1722 55 1359 -1368 326 702 -930 414 251 -311 105 -229 447 -209
362b09k09J345j630N09J505k729J482J423l212K074Q37k930K761k21k721L163
$$ -209 -418 927 -703 -194 1311 -1418 64 1487 -1725 349 1186 -1744 1017 796 -1925 1238
378A238o53k012K533j213o08J920j665m2J108p76M40n28r4J164j341P37K38j783
$$ 1238 585 -1427 1106 -107 -715 1205 -460 -502 606 -170 270 -258 -352 812 -529 208 446 -1337
396a337K538m75k762L383r40k079L658k572j045M264l366p86L610l181Q95J939
$$ -1337 1201 726 -2036 1347 407 -1672 1986 -586 -1631 2633 -733 -1519 2091 -1090 -195 1744
412A744l672K063J365k757J629l12p62K071j984L5J471j652J669r09j775L695
$$ 1744 -1928 135 1500 -1257 372 60 -702 1369 -615 -580 891 -761 908 -1 -1776 1919
428A919j828j552L283l085P70L364n284J741L460m873K585Q74m219M690l95m261
$$ 1919 91 -1461 1822 -1263 -493 2871 -2413 -672 2788 -2085 500 1374 -2845 1845 1450 -2811
444b811M009q30j309K777l248O58K778k857J062j96j338L461k512j271L283k746
$$ -2811 1198 368 -941 1836 -1412 -754 2024 -833 229 33 -1305 2156 -356 -1627 1656 -1090
460a090J445J379m837M071J239n056M404j363k822O170m087k529O283m045l81
$$ -1090 355 1734 -3103 968 2207 -2849 1555 192 -2630 3540 -547 -3076 3207 -838 -1219
475a219L815n143K445K869n018K450N86k162L289k660n96L302l093J495O24l479
$$ -1219 2596 -2547 -102 2767 -2251 199 785 -1377 1912 -748 -1344 1958 -1135 360 984 -2495
491b495M492j177l575N051k860j029M890n591J056M952o481K682K625o006N171
$$ -2495 1997 820 -2755 2296 -564 -1593 3297 -2294 -1238 3714 -2767 -85 2540 -3466 1705
506A705J92n793O030j069l825N180l132r54M435m138N48K569l359K672m34k989
$$ 1705 1897 -3896 2134 1065 -2760 2420 -712 -1666 2769 -1369 -821 1748 -1611 1061 627 -2362
522b362M213j769j541L334l311J054K749m511K119J561l366L320j282k573M644
$$ -2362 1851 82 -1459 1875 -1436 -382 2367 -2144 -25 1536 -1830 1490 208 -2365 2279
537B279k364j517L565l258P93K892m358J589J989k948K007m57j714K891j577n02
$$ 2279 -85 -1602 1963 -1295 -502 2390 -1968 -379 1610 -1338 669 212 -1502 1389 -188 -690
553f90J786k621K162R10m081L301M59l391L952j594k773N013k301k301M108k782
$$ -690 1096 -1525 637 1547 -2534 767 1226 -2165 1787 193 -2580 2433 132 -2169 1939 -843
569h43lL191m117J073K736l553J949M16k989L652n99k965L271j329q63K762k897
$$ -843 -846 2345 -1772 -699 2037 -1516 433 849 -2140 1512 913 -2052 1219 -110 -973 1789 -1108
586a108K28K502k499J046K47j936K967j068k076L051j937k0K758m066J277L035
$$ -1108 -880 1622 -877 169 416 -1520 1447 379 -1697 1354 -583 -603 2155 -1911 -634 2401
602B401m128J900J022l579M073o82l734M362j401j740L735l613J54L962m095P91
$$ 2401 -1727 173 1195 -2384 1689 1007 -2727 1635 234 -1506 2229 -1384 -1230 2732 -1363 -572
618e72J985l178K892j54l252L642j168j222K789l473J334K853m640K297J264l777
$$ -572 1413 -1765 1127 973 -2279 1363 195 -1027 1762 -1711 -377 2476 -2164 133 1397 -2380
634b380M291j205l784N388j966k356M182l498M77L624m827J577K299l616K937
$$ -2380 1911 706 -3078 2310 344 -2012 2170 -1328 -851 2773 -2054 -477 1822 -1794 1143
649A143q04k530M309k196j458L226l027J611J633m505L345O88l539L953k343j650
$$ 1143 339 -2191 2118 -78 -1536 1690 -1337 274 1907 -2598 747 1435 -2104 1849 -494 -2144
665b144N480m428q93M789m589J783K437n765M011J748n155L853p90k303M809l603
$$ -2144 3336 -1092 -1985 2804 -1785 -2 2435 -3330 681 2429 -2726 1127 337 -1966 2843 -760
681g60j309M372l208R23J358m030L923L85m115L737j572r96M320m778J02M553
$$ -760 -2069 2303 -905 18 1376 -2654 1269 1654 -2461 1276 -296 -1292 3028 -1750 -1648 2905
697B905m411J509J605m597M508L76m940M324p89k020L930l660l31M126l540P21
$$ 2905 -1506 3 1608 -2989 1519 1895 -3045 1279 490 -1530 2400 -1260 -1591 2535 -1005 -284
713b84J311k905L335n98l068L661j618o41K843l903J475K783m276K202Q74l370
$$ -284 1027 -1878 1457 859 -2209 1452 -166 -807 2036 -1867 -392 2391 -1885 317 1191 -2179
729b179M017j409k930M636k265j353L578l599J002K943m453J932J693l290K848
$$ -2179 1838 429 -2501 2135 -130 -1483 2095 -1504 -502 2441 -2012 -80 1613 -1677 1171
744A171p34k354L727j816j291K743k467J016J613l481K203Q96k704K601j228j376
$$ 1171 437 -1917 1810 -6 -1297 1446 -1021 -5 1608 -1873 330 1226 -1478 1123 -105 -1481
760a481L402k431o16K649k583J185J205l191K469N48k615K368q31j277K862k160
$$ -1481 1921 -510 -1126 1523 -1060 125 1330 -1861 608 1156 -1459 909 78 -1199 1663 -497
776d97n51K381k034O34R29k145J870J03j774J787q90m00J835k019L56J635k155
$$ -497 -1048 1333 -701 -67 862 -1283 587 690 -1084 703 -187 -587 1248 -771 -415 1220 -935
793i35J120M64j945K167m00j793K240r22p38J843j805K58J658j956O36P44j425
$$ -935 185 649 -1296 871 471 -1322 918 -4 -742 1101 -704 -446 1212 -744 -108 636 -789
810g89J298j33j365J506m43m19R44j108M38Q16j336O43K30q36J147o10p27J404
$$ -789 509 376 -989 517 74 -345 599 -509 -71 745 -591 52 282 -554 593 -17 -744 660
828F60o98l15Q89j090N27O79j254N98L50p81Q66m14n50R99m32l73N66m54K30L72
$$ 660 -38 -353 536 -554 -27 652 -602 -4 346 -435 431 17 -533 466 34 -339 227 -227 3 375
848C75p58L53K18l88M69l82k10P66n39j33M82n05K43L58p81L51M34o12K59J70
$$ 375 -383 -30 188 -200 269 -113 -323 443 -96 -229 253 -252 -9 349 -432 -81 353 -259 0 170
868A70m35L71J78n92K69K41l29J01Q0k67K82J49m18M0L75j95j2J9k73L14J16l52
$$ 170 -265 106 284 -308 -39 202 -127 -26 54 -213 69 218 -200 -160 215 20 8 27 -246 68 184 -168
890a68K2K22l4p4l0n8J39J91k84k29M38M2l96K56n0k02M97j98n99P83n8n12M56
$$ -168 -146 76 42 -32 -62 -120 19 210 -74 -303 135 177 -219 37 -13 -215 282 84 -515 268 210 -302 154
913A54k56p1N19m30k07M82j61%Nl82N08ll25J88j21J40L22p07J81M77m47J92q8
$$ 154 -102 -173 346 -84 -291 191 30 30 35 -347 161 158 -167 21 -100 40 362 -345 -164 313 -134 58 -30
936c0l19P34l46m29N25j50M4K26o93L50N65o47%J48j13M35k96l42M25K8O5k22
$$ -30 -349 385 39 -390 135 -15 29 255 -438 -88 477 -170 -170 -22 -135 300 4 -338 87 115 180 -42
958d2l78P52q3n66M11k49J32N90j082J90Q68p05J00J26n88R82j11j014O87K89
$$ -42 -420 332 249 -317 94 -155 -23 567 -515 -325 543 -162 -62 64 -524 458 347 -667 20 309
978C09m54L89n46M7Q42n48l84K46J75L04l81m83N46J48j4k92m34Q57K70r77K37
$$ 309 -145 244 -302 -255 587 39 -345 -99 76 380 -1 -484 62 210 196 -96 -530 327 597 -380 -143
999a43O9O7N76q52l34J075k56k78K3l45P65K17j131K93N18r6O9o32J36O90k73
$$ -143 -74 -7 569 -283 -617 458 202 -76 -53 -398 367 584 -547 -254 264 168 237 -395 -259 431 158
1020A58k73k24K00Q52p60o05Q68j62N1L08j089N57J046j262j04O23k59M15k61
$$ 158 -115 -339 -139 713 -47 -652 216 54 105 413 -676 -119 927 -335 -439 184 -75 340 79
1039G9p40R30J71n18L1k59N59K90r73J73M37l3J08o95J78Q12n03j57l7j72J018
$$ 79 -661 269 440 -78 -47 -306 253 543 -430 -257 180 147 255 -440 -262 550 47 -110 -147 -319 699
1060F99n05j160J220J33n55N16q42M9J447j015p57R33k5J96l20p44Q94M17n78
$$ 699 194 -966 254 387 -168 348 -494 -445 1002 -13 -770 163 138 334 14 -730 164 581 3
1079Ck25l01Q44N73j425J68N83o1L97r28m50J534k93p96K86l96R47L45j667N36
$$ 3 -222 -523 321 894 -531 -363 220 159 556 -372 -822 712 419 -377 -91 -487 460 805 -862 -326
1099c26R60p09L69n32m84J497l73j063M89J89L41m7r71N26O37l83j8o20M46R09
$$ -326 634 -75 294 -238 -722 775 402 -661 -172 17 358 311 -660 -134 503 120 102 -518 -72 837
1119H37j046k33N26j54O53o09q08J239m9o59M76o03M21Q79j487K79R03p66L13
$$ 837 -209 -442 84 -70 583 -26 -834 405 356 -303 173 -430 -9 870 -617 -338 565 -201 112
1138A12n5p51J239k65p95N49k32M43J37j101P55M59p86M49m88J5J214j151m38
$$ 112 57 -694 545 280 -515 34 -198 245 382 -719 36 495 -291 158 -330 -315 899 -252 -690
1157f90J184o47L35J46j221J158N43j335M42M4j44Q92r71l58J060k71o3k76l47
$$ -690 494 -153 182 328 -893 265 808 -527 -85 -41 -185 707 -264 -622 438 167 104 -172 -519
1176e19J128k88p95N60m13O45L88j610O90R00r83N26l39n69J436n81r12R34k80
$$ -519 609 321 -474 86 -327 318 706 -904 -214 686 -297 229 -110 -679 757 176 -736 198 -82
1195h2K05K68j064N98O26p67L28l41q0R98q16l61P87n61N46j44r22J173r0p68
$$ -82 123 391 -673 -75 551 -216 112 -229 -309 689 -127 -488 299 -262 284 140 -782 391 301 -467
1215d67Q29o05j9J061j241O3R75r66L65L09q68Q56n7o39O58l03N2K26o73N18J67
$$ -467 362 -243 -262 799 -442 -379 596 -370 -5 304 -564 292 235 -404 254 -49 3 229 -444 74 241
1236B41n88O80m50j61R68j037J00P75q78M22K29j061J258j27j070J124m11l79
$$ 241 -347 333 -117 -278 690 -347 -247 528 -350 72 301 -760 498 371 -699 425 14 -365
1254c65J080j114p7J138q83K07K06o57Q67k22o11O68m11J77M70j048N45N25r60
$$ -365 715 -399 -476 662 -221 -14 192 -465 402 180 -431 237 -174 3 473 -575 -30 495 -465
1273d65O82k37n33J182o25n95J089o52M2O19j054N13N57q58M21j9l59O72l92k44
$$ -465 217 -20 -553 629 4 -591 498 -154 -112 507 -547 -34 523 -335 86 67 -292 380 -12 -256
1293b56M56k63K15j43l41N96k46j55M26o13K87N51j015N45K38p25P35j74o98J005
$$ -256 200 -63 152 9 -332 264 18 -137 289 -324 -37 514 -501 44 282 -443 292 118 -580 425
1313D25l40m23P19n72J0N55o03J49K52l61L47j78j55M05l79J64J87n04N17on40
$$ 425 85 -338 381 -191 -181 374 -229 -80 172 -189 158 -20 -175 230 -149 15 202 -302 215 209 -331
1334c31O44l15l02P38o18j13Q09p48J19M72o87L66K53o19N27K1m43L69j36j52
$$ -331 313 -2 -304 434 -184 -297 512 -236 -117 355 -332 34 287 -332 195 216 -227 142 6 -146
1354a46L02k27l3J68j20K41k55q3L56l41J01K41m88L54J73n63M27k9k73L71j92
$$ -146 156 -71 -104 64 -56 185 -70 -153 203 -138 -37 204 -284 70 243 -320 107 78 -195 176 -16
1375a6j98M47k53PL3j74L11j02k45K71k33J36K33m55K35K25m82M01j20l92P46
$$ -16 -214 233 -20 -13 20 -154 157 55 -190 81 -152 -16 217 -238 -3 222 -260 141 21 -371 375
1396C75l17m60P60m45j30O66p27M4O68o54J12L86n35K40K33m86K86P6j56J33k13
$$ 375 58 -402 358 -87 -217 449 -278 -234 434 -220 -108 278 -257 -17 216 -270 16 92 -64 69 -144
1417a44J26J61k12J70o9j60L69l26p9L88l98J04K94n34L42K82o10M07N4m54N16
$$ -144 -18 143 -69 101 32 -128 241 -85 -164 224 -174 -70 224 -310 32 314 -296 111 165 -289 227
1438B27r7m17M68k05o4K19k56Q2J62j50M1j09R9J77l74J61K04l70K61J37o42O74
$$ 227 130 -287 181 -24 -88 131 -125 -43 119 -31 10 -99 0 177 -197 -36 168 -202 59 196 -446 228
1460B28p1m76N48k36k86P54o13j43P23n65%M76p06L35M64p45L02J71l63L62j69
$$ 228 157 -319 229 -7 -293 461 -152 -295 428 -137 -137 339 -367 -32 432 -313 -11 160 -203 159 -10
1481a0k13L99j46l5P3k90L59N6n12M20q4j56M42n13n4O71n35kK95m43L67K10o76
$$ -10 -223 176 30 -5 68 -222 137 193 -319 101 17 -139 303 -210 -264 407 -128 -130 165 -278 89 299 -377
1504c77M33J09k87L07l12j87O40l22j79K28j56L00j79l03L90m5n7J27m28L62L19
$$ -377 56 165 -122 185 -127 -314 326 4 -175 53 -103 197 18 -285 105 60 3 130 -298 64 383
1525C83o08J44K65l86M68k29n34P26n7l52L82m12J68M57o68J11L24k39J82j68
$$ 383 -225 -81 184 -202 266 37 -497 229 172 -180 202 -210 -42 415 -253 -142 182 -57 125 -43
1545d3k42M72k9k63R1j20K81J17o21L41J32k16L20m03r8P43m28l15M43l13K05
$$ -43 -285 187 158 -105 -14 -134 147 264 -357 -16 116 -100 220 -183 -281 462 34 -281 162 -151 54
1566E4J86n64K14L47k09Qj98M6L39k68p8J72l2J09j24k28L64p8j30J72l13L13
$$ 54 240 -324 -110 237 28 36 -162 -116 223 -45 -123 49 17 126 2 -226 138 60 -70 102 -211 102
1588A02J26n42L85R3l49M52l39k64O84l10k69L21j41O3J89m47K00J99j20n3j64
$$ 102 228 -314 71 164 -185 267 -72 -336 348 38 -231 90 -51 12 201 -246 -46 153 33 -20 -184
1609a84K14K43m44J45Q5j60L97l61l64O98j75k71L71m55K88L95p11J13L96k57
$$ -184 30 273 -171 -26 59 -101 296 -65 -429 269 94 -177 194 -261 27 422 -289 -176 220 -37
1629c7K29k26k36M80p3j92L6j49L19L9l98K46o4P3K65n92J90M78n92K41P4m94
$$ -37 192 -34 -270 210 137 -55 -19 -168 151 190 -208 38 -26 47 312 -280 -90 388 -204 37 111 -383
1651c83O95p0o38N47Jl56M72l86o8M83l77J3J11j69K68j78j64L31j82K1K42m41
$$ -383 312 242 -396 151 152 -204 268 -118 -186 297 -80 -67 44 -125 143 -35 -199 132 -50 -29 213 -228
1673b28L19J44n11M42l0l94N12l36j44O07m89k8L83m75K55J73m96L94J15m22K62
$$ -228 91 235 -276 166 136 -258 254 -82 -226 381 -108 -136 247 -228 27 200 -296 98 213 -209 53
1694E3m0j32K92j77j57J75o7J63j56j72L49j45m2K07l16J96J85m11J28K29l04
$$ 53 13 -119 173 -4 -161 14 -53 110 -46 -218 131 -14 -56 151 -165 31 216 -195 -67 162 -142
1715a42K63n4k91L52k6k62J89m8k9J81k59J1J77m5N9r0q6J55p0l4J19k01J84M1
$$ -142 121 67 -224 128 102 -160 29 -19 -48 133 -126 -115 62 17 76 -14 -100 55 -15 -49 70 -131 53 94
1739I4k85K58j8k53L56j09k88M34r7k27L18j61j79L64k83q5L04j68o5J90j57P7
$$ 94 -191 67 49 -204 152 43 -245 189 92 -135 183 22 -157 207 -76 -161 143 -25 -90 100 -57 20
1761B0P7j95P9O1p3Q8j20P8J8n2Q8o8m9J48j49n6K43j96LJ78k64Q3K82l23L3J49
$$ 20 97 -98 -19 42 -31 57 -63 15 33 -19 69 1 -48 100 -49 -105 138 -58 -55 123 -141 -58 224 -99 -66 83
1787H3k31J64Q0k44J70R3j62R6n4q2J39Mq8K5m8J47j03j16K27j73J07J00k51J20
$$ 83 -148 16 96 -148 22 115 -47 49 -5 -87 52 56 -32 -7 -55 92 -11 -127 100 -73 34 134 -117 3
1811CJ47k40P8R6k16K35p2k68L23m1j53K28j64k9J62q5r2J11j0k8L3Qr9Q4L9j01
$$ 3 150 -90 -12 84 -132 103 31 -237 86 45 -108 120 -44 -73 89 4 -88 23 13 -15 18 26 -73 11 50 -51
1837e1RO7o7K4J16j57JJ58j19LJ18j35N7K7j25Q4M1o3L3k4n2R5n4nM3l5J7nm5
$$ -51 -42 25 -42 -18 98 -59 -58 100 -19 -16 102 -33 24 51 -74 10 51 -12 21 -3 -55 40 -14 -19 24 -11 6 1 -44
1866d4N0k6k2Q9r9nJ39r7mJ02j67J48j1j60R2J15k03J48nr0R1j4rK5or4M6J6o
$$ -44 6 -20 -42 47 -52 -57 82 -15 -19 83 -84 64 53 -107 -15 100 -103 45 40 -50 41 27 18 43 37 -57 -11 5 -1
1895ajK6l7K7P7j13n8J32q0l2J10r0q2K66j53p1J38j03JJ68k32mK17j69N2N3r4
$$ -1 -2 24 -13 14 91 -22 -80 52 -28 -60 50 -40 -122 144 -9 -80 58 -45 -44 124 -108 -112 105 -64 -12 41 -53
1922e3J37n7q2N3ML6Pj26J48p8n5J34j89P5K28k37M0J34k54K64j6l11L12O1l46
$$ -53 84 27 -55 -2 2 38 45 -81 67 -11 -66 68 -121 -46 182 -55 -15 119 -135 129 113 -198 114 175 -171
1947a71K90j36r6K83k02l5K05k12J05Rj80J88l1m1J16j96Q7J93l15J47J16k79
$$ -171 119 -17 -113 170 -32 -67 138 -74 31 40 -140 48 17 -24 92 -104 -17 176 -139 8 124 -155
1969a55L08j26j63L79k59k9K01k77J52J23k68J29J09k19J69j18o7J97o3p3P0j04
$$ -155 153 27 -136 243 -16 -45 156 -121 31 154 -114 15 124 -95 74 -44 -111 86 23 -50 20 -84
1991h4J18K5k09K45r3r7L15k99%K93l53Q8J54k89K40Q7l96M06o2k20K87j58j40
$$ -84 34 59 -150 95 2 -95 220 -79 -79 214 -139 -51 103 -186 54 141 -255 151 89 -131 156 -2 -142
2014a42L77k35p7J65j21N6L5k00K13m7J5nj34J23M3j17J15n9o8K17k13j09K96
$$ -142 235 0 -77 88 -33 23 58 -142 71 24 39 34 -100 23 66 -51 64 5 -63 154 -59 -168 128
2037A28j21o1J47k04J12J29k50K0J65o3L3q0J1M7k2K5j01J11K6m7o7K6L8L0L6
$$ 128 7 -54 93 -111 1 130 -120 -100 65 2 35 -45 -34 13 -9 16 -85 26 52 5 -62 -36 2 32 68
2062F8j42RJ54p0k4J7n1J06j5r9K6Q4r8K0k1N1J5kj11lJ26Mj14L8r3J49K2j13
$$ 68 -74 -65 89 19 -5 12 -39 67 52 -47 -21 63 -35 -15 -36 15 30 28 -83 -86 40 44 -70 -32 -125 24 46 -67
2090f7P0P2Or9j25J74N3j45M0q5Q6K05k56k0J71j22L9l1j00J71O1j60KJ07p1J24
$$ -67 3 75 81 -18 -143 31 84 -61 -21 -106 -20 185 -71 -91 80 -42 -3 -34 -134 37 98 -62 -60 47 -24 100
2116A00j96m6K46j3j50M2m6J11L9k10L6J23N5p5j19P0J52j09p7K2rJ86n1l11K37
$$ 100 -96 -142 104 91 -59 -17 -63 48 87 -123 -87 36 91 16 -103 -33 119 10 -67 -45 -54 132 81 -230 7
2141GO2p6O6k21Q1K46j90r8J65lQ3o3j99J27J09j63lj9J62O2j61RKP5K7k11pK95
$$ 7 69 -7 59 -162 -81 165 -25 -123 42 39 122 59 -140 -13 96 -67 -70 -89 73 135 -26 -17 -15 60 87 -124 -131 164
2169A64p0j46k9P3R6Pk44J17J56q2p7l7K3J94r7j38M0R0N1n2j59P3J56o7j04l2
$$ 164 94 -52 -81 -8 88 95 -149 -32 124 42 -35 -72 -49 145 48 -90 -50 40 91 39 -120 -47 109 42 -62 -94
2195i4J44J08k51L4N4J4J03j95j07K91M2k25K9K8Q1J04k68l9K48j5p3q7n1J98
$$ -94 50 158 -93 -59 -5 9 112 -83 -190 101 143 -82 -53 -25 56 160 -108 -147 101 86 13 -74 -125 73
2219G3J7j23p6J34J09p8k37J66J28o4l5j55J52J48j06q4K4KJ15j57n9K01K9j51
$$ 73 90 -33 -109 25 134 56 -181 -15 113 49 14 -141 11 159 53 -31 -7 -5 110 -47 -106 95 124 -27
2243b7J2l6R2R3j74o4J11O5l3r9J1J78p7o5Ok8J49l3k16P8J61p5K4j36lK53j44
$$ -27 -15 -51 41 134 -40 -104 7 72 39 -60 -49 129 52 -13 -7 -35 114 81 -135 -57 104 29 53 -83 -86 167 23
2270B3j17P0K2J23j06j44K01k3N9r1j70K10M6j39L4Mj6J45k28j05K59K0r0oq8
$$ 23 -94 -24 -2 121 15 -129 72 49 108 17 -153 57 103 -36 -2 2 -14 131 -97 -202 57 77 -13 -19 -107
2295a07J42Q7k10M9O8k2P4j83nJ21K5k1m7NJ33r4j10J06L1k1L0j88J74K9j53Q3
$$ -107 35 122 -88 -39 29 7 81 -102 -107 14 39 18 -29 -24 109 15 -95 11 42 21 51 -137 37 66 -87 -4
2321dJ5m7J50j50m7J17l6k3K5l6R1p3N0J6m3N2l6j34J18J1n0K7p3N5J30j92K1
$$ -4 11 -36 114 -36 -83 34 -2 -25 0 -36 55 -18 32 48 5 57 21 -113 5 16 -34 -7 -80 -25 105 -87 -66
2348f6J05p4J07m2j50J81M1j71O4k4L0P4q4l0M7RL0j06J9J45j32NO9q5J13pj65
$$ -66 39 -35 72 30 -120 61 102 -69 -5 -29 1 75 -9 -39 8 17 47 -59 -40 105 -27 -22 47 -38 75 68 -97
2375i7J35m4l4Q9r6j3J84j25QM5j63J57k4r5J06k4m4J04j08N5K8j54J06K7j4J33
$$ -97 38 -6 -40 49 -47 -60 124 -1 7 52 -111 46 22 -73 33 9 -35 69 -39 16 44 -110 -4 23 9 142
2401A42j43j03K50j54k4J44j49N4J35k85J56M1j35J84j39j4J20j43K2P3q0J59
$$ 142 -1 -104 146 -8 -32 112 -37 17 152 -133 23 64 -71 113 -26 -40 80 -63 -41 32 -48 111
2423A11j12j12J45k5r1R7r7N0J03j55J14Q5j72J02lj79K38r5j09K00j19J9J21
$$ 111 -1 -113 32 7 -84 13 -84 -34 69 -86 28 113 -59 43 40 -139 99 4 -105 95 -24 -5 116
2446A16k08P5P6r7M1K0r2J71j52l4J18j00Q6Pj36J25M0j40J60j06m2J34m1j01
$$ 116 -92 -17 59 -38 3 23 -69 102 -50 -84 34 -66 20 27 -109 16 56 -84 76 -30 -72 62 21 -80
2470h0J05k1j4L6j03N1J21o3n7N2n2M9l0J2Nl5K3J1o7O2K9j7n4J05q2N4l8j7L0
$$ -80 25 4 -10 26 -77 -26 95 32 -25 27 -25 24 -6 6 11 -24 -1 10 -57 5 34 17 -37 68 -14 40 2 -15 15
2499A5n3K4rk8K9J27j79N1M6q1J12j2j70J51L2j96J75l0n1J29j48m8J99j03L6
$$ 15 -38 -14 -23 -51 -22 105 -74 -23 23 -58 54 42 -128 23 55 -141 34 4 -47 82 -66 -114 85 -18 18
2524A8P8k07J78L6j91N5K4l2J60j78L4J65j59J8Q0j71K10k1j87J55o0m1J61k27
$$ 18 96 -111 67 103 -88 -33 -9 -41 119 -59 -25 140 -19 -1 79 -92 118 97 -90 65 5 -36 125 -102
2548a02R7J50j84J7J6j22J51j6j34K24j02o6J57j98J24J07k01O3P6j56K07j45
$$ -102 -5 145 -39 -22 -6 -128 23 7 -127 97 -5 -71 86 -112 12 119 -82 -19 57 -99 108 -37
2570c7n1K66j91n3R6r8P5J31k19L3J66j76J03o6q5K49j01o9N1o5P3O7j99P6Q1
$$ -37 -88 178 -13 -66 30 -68 7 138 -81 -48 118 -58 45 -21 -106 143 42 -27 24 -41 32 99 -100 -24 57
2595E7q0R7p5p8K26j74l8J41j22J07nj55J71j5j42J23l0q5J57o1j11J04Nk8N4
$$ 57 -23 74 -1 -79 147 -27 -65 76 -46 61 56 -99 72 57 -85 38 8 -77 80 19 -92 12 17 -11 43
2620D3j31J40nj12J26o2%Q0j29J4J43j72P9L4j43J60k8j74J56J5j1L5r8qO7Pn5
$$ 43 -88 52 47 -65 61 -1 -1 79 -50 -36 107 -65 14 48 -95 65 37 -137 19 34 23 58 -40 -48 19 26 -29
2647b9K8o3J56k5j39P7N3n3P4j00k8J12o2p0P3k7J11o7r7J34o6KM0j49J12J00
$$ -29 -1 -64 92 67 -72 5 58 5 79 -21 -49 63 1 -69 4 -23 88 21 -76 58 -8 -6 34 -115 -3 97
2673I7k08J13J8j29J57j06p2J51N6j57P7m4O5M1j24N1L1j7N1m2r0J31l2kk6PN3
$$ 97 -111 2 20 -109 48 -58 -130 21 77 -80 -3 -47 18 59 -65 -14 17 0 51 9 -81 50 18 16 -10 -3 50
2700E0Kj07Q4m2l5N2m6J9P0j15K6K4j6M3m4n8J36oj7jp8J09p3j1Q3o5J1M5q9N1
$$ 50 52 -55 29 -13 -48 4 -42 -23 47 -68 -42 -18 -34 9 -35 -93 43 37 20 19 -59 50 -23 -34 49 -16 -5 40 -49 2
2730BM8l7J5M3q9J01l3p1O1qm7P9j00P4K6r4N2l3j5N5kn1J00j32L0P3j08R0o1
$$ 2 50 13 28 71 -18 83 50 -21 40 32 -15 64 -36 38 64 -30 22 -11 -26 29 27 -24 76 -56 -26 47 -61 29 -32
2759c2MN5m9QR6r4k0N8m8O7n9o4J34jj33P0kL2O6j44J0Q2p8J07k0j52J76j08j2
$$ -32 -28 27 -22 -14 82 -12 -32 26 -22 45 -14 -78 56 55 -78 -8 -10 22 88 -56 -46 36 -42 65 45 -107 69 -39 -51
2788e1Q0q2O7L0j29R2L8p9K5j7M6L4k0q3P0mL6J8q8L5op2J10m0L0k8p4MQ5n8R4
$$ -51 29 -53 14 44 -85 7 45 -34 -9 -26 20 54 34 -49 21 17 53 71 -17 18 12 -60 50 10 40 12 -62 -58 27 -31 63
2819F3k1r6Q7K8k0j5m0k7J19q0mK5jl8L5n3mO0k%L1q3K6j6pO6p1N1M1p5P5m7k7
$$ 63 42 -54 33 61 41 26 -14 -41 78 -2 -6 19 18 -20 15 -38 -42 18 16 16 47 -36 -10 -26 -33 33 -38 13 54 -21 54 7 -20
2852b0Q0j2r2O1j1m0R6j05j6O7k2N3k4j6N4j3n7O0n7l6J17l2o3M1K6n0L9j3PJ7
$$ -20 60 48 -44 17 6 -34 62 -43 -59 8 -14 39 15 -1 53 40 -17 43 -14 -50 67 35 -28 13 39 -11 28 15 22 39
2882C9j8Kj1nN3r1o6J25l1oL3r4O3J3o8P4m6M2J19j00n8J17n0k8L3n8Q5o7l5K3
$$ 39 21 23 12 7 60 -31 -97 28 -3 -9 24 -70 -7 6 -62 12 -34 8 127 27 -31 86 36 8 41 -17 68 1 -34 -11
2912a1j9J6P7j19Q5K5j06P6M3r9O4j4o5O6m7RJ18j02k8J8l3J20n5k9L4Ol5J6m3
$$ -11 -30 -14 63 -56 29 54 -52 24 67 -32 32 18 -47 19 -28 -19 99 -3 -31 -13 -46 74 19 -10 24 30 -5 11 -32
2941c2J9Q1m7j0M7m5KJ8nK4m3o0R1n3KJ3Jj1M2k1l7N3k2M6m1OL3r0O5j0j1l4l7
$$ -32 -13 68 21 11 58 13 15 33 28 52 9 -51 40 -13 -11 2 3 -8 34 13 -24 29 7 53 12 18 51 -39 26 16 5 -29 -66
2974f6O8J3nQl7LN8l4K5p7N6j9Qj4rN2Mk1j6qlO2l1k8j1L3j3j8QJ6J6K0o6L8k
$$ -66 2 15 10 18 -19 -16 42 8 33 -44 12 -7 1 -13 -22 30 34 13 -3 -11 -14 48 17 -11 -22 11 -2 -20 -12 4 20 40 -26 12 10
3009A0j9Ol1pJ20p2N7q8O7m4J4n3O9k7JN7k8j6L6n9J2k5K7Rl4J6Jj4k4Q2k7n5
$$ 10 -9 -3 -34 -41 79 7 64 -24 43 -1 13 -40 29 2 3 60 32 16 52 -7 5 -20 7 16 -18 -2 -1 -15 -39 43 16 -39
3041c9P6j9n6P7j13Q4j3j4O8n6j1L0m5L7J5n5M3J11j74P3j3k7K8l1l9J24m6m6
$$ -39 37 18 -38 39 -74 10 -3 -17 51 -5 -16 14 -31 6 21 -34 9 120 -54 19 6 -21 7 -24 -63 61 15 -31
3069c1J26j49Q9L0j35L3P0m6O6p9RQ2n7m2M2n5Q4K1r2ON6m5K9m5%O3m9m9L2O5
$$ -31 95 -54 35 65 -70 -37 33 -13 53 -26 -17 65 8 -34 8 -47 37 58 -34 -28 28 -17 12 -33 -33 30 -19 -68 -36 29
3099B9o0P7m4n6L9m1Q5m2j9Q2m9l6Q9p4j2L8n5jO8j03N5Q8q6J06l9j14J02j8m2
$$ 29 -31 46 2 -54 -15 -56 29 -13 -32 50 1 -35 54 -20 -32 6 -49 -50 18 -85 -30 58 -28 78 39 -75 27 9 -33
3128c3J16j05J8P8j42L3J12o9K2m6%M9j9j03J48l9pL0j42L8R4l5M0j3o9J77j12
$$ -33 83 -22 -4 74 -68 -35 77 8 30 -16 -16 33 14 -89 59 20 13 43 -99 -61 33 -2 38 25 -44 133 21
3155B1r2R4km4P8j23O9O8q7M9J3q2R8o7l3O0j3PM1j30Q9R5j34J1K7o4R2n5m0J54
$$ 21 -71 23 21 -23 55 -68 1 69 -18 31 44 -38 60 -7 -40 20 7 14 55 -75 14 109 -25 -14 13 -51 41 -14 -54 100
3185A00r1m0P8r9M7Q0j63R1P7q0P8j35O3Q7j27n1J78p6k5K8j10J01L7j09J16n8
$$ 100 9 -31 47 -52 -5 75 -88 3 80 0 78 -57 6 93 -34 -85 93 17 -8 20 -90 11 48 -61 55 -3
3211coJ49j32r2J68p6L1k1j00J04P1j80J02j7k9J02q9o6J64m3Mo0p9J46M5j50
$$ -3 -9 140 8 -84 84 8 39 18 -82 22 93 -87 15 -2 -31 71 -18 -84 80 37 41 -19 -98 48 93 -57
3237e7J03%j04J24j07PJ57k05M5J11j22J32J2k34K20n7l1J01j48j5J53j78P8K5
$$ -57 46 46 -58 66 -41 -34 123 -82 -37 74 -48 84 96 -138 82 25 -6 95 -53 -68 85 -93 -15 10
3261A0p3J31j1j48J50j9j22J24j56J00J26j23m4J22p3L2l7o3J25j1k8R7j64R5
$$ 10 -63 68 57 -91 59 40 -82 42 -114 -14 112 -11 -55 67 -6 26 -11 -74 51 40 12 109 -55 40
3285D0N8j64N6J06j22N5m1o7J59m3j04J36o7j8O9j28J30N2j41P9o1l8Q7l6l3Q7
$$ 40 98 -66 -10 96 -26 29 -12 -79 80 37 -67 69 2 -16 53 -75 55 107 -34 45 -16 -54 33 -3 -36 51
3311E1j00L8Nj28J63K8j06R8n2j9J09j38k8J40j23P9l1l9J10l3j27J38q6L9Q7
$$ 51 -49 -11 -6 -134 29 57 -49 49 -3 -22 87 -51 -79 61 -62 17 -14 -53 57 24 -103 35 -51 -12 75
3336G5q6J0P1p6j0P8j00R1k3j00R5M6j21P3j39N3J50q4m0M1n6J40p8qO0p1PL1
$$ 75 -11 -1 70 -6 -16 62 -38 53 30 -70 25 71 -50 23 -116 -63 87 3 -37 4 -52 88 10 2 62 -9 -2 29
3364B9k9M8j1j14Q5Nm0P7n2p2J19j7q0P5r0Q4M1j43Q8M9l8O3r4j4P6k4n9R1q7
$$ 29 0 48 37 -77 8 13 -27 50 -2 -74 45 28 -52 23 -67 17 58 -85 3 52 14 77 -17 -31 45 21 -38 53 -34
3393c4J4R0j00L1Jk0M1j5m9LqJ8P8q4L3J4o7N8on3J08m6j8N3n3l1O7l5K4ln7R9
$$ -34 -20 70 -30 1 2 -18 23 8 -41 -38 -46 -28 50 -34 -1 13 -54 4 -2 -55 53 7 -11 42 -11 -42 25 -10 14 11 -46 53
3425E3n9J3oL4l9L4No2P8q4J2N7j3J0L6n7lk3m1O1K2l6K1j5l0K8l3N3m7k7M1J2
$$ 53 -6 7 1 35 -4 30 35 -27 51 -33 -21 36 23 33 69 12 9 -14 -55 6 28 -8 13 -2 -32 -4 -37 16 -31 -58 -17 -5
3457enN8k7KK9n8j0L2q7J06Kr0O0n0K1K9m8L4R1m0p0O4m1M8Qn9Kl6RP1l3l0N7
$$ -5 -10 48 21 23 52 -6 -16 16 -71 35 37 -53 7 -43 -22 7 -41 -7 84 44 -26 38 -3 45 53 -6 -4 -40 -31 40 7 -23 34
3490C4l5L7k8MJ4kp4N4L2m8ML7n6N4k6o0J40j50Q9Jp7K8RO3p2OPQ6m9m2Q0j31
$$ 34 -1 36 8 12 26 24 -50 4 36 -12 -8 29 -27 27 1 -59 81 -69 20 21 -56 -28 -19 44 -28 -22 -15 71 22 -20 60 -71
3522g1O9L5q2J6O1m0L7k6k5K8rm8J07p0P0mj11Q5k1%K7l4OQ7o9j0L3q9Q9m3n3
$$ -71 -2 33 -49 -33 28 -12 25 -1 -26 2 -7 -55 52 -18 52 48 -63 22 1 1 28 -6 0 87 18 8 41 -48 41 -2 -55
3553e5K6N2p1J19l4k9N4k2r2J18r5L8M0r6J11m6p1L9jm8Q9n6M2P2r0mJ3l0Q7j01
$$ -55 -29 23 -48 71 37 8 62 40 -52 66 -29 9 49 -47 64 18 -53 -14 -15 -63 26 -30 12 84 -6 -10 3 -27 60 -41
3583d1nJ12n5J5Q4j21k8P8q4J2P5p7R8p3MQ0j20kQ6j38J44L4r8N7j8n8Q5m2p8
$$ -41 -46 66 11 26 110 -11 -39 39 -45 -33 42 -35 63 -10 -6 74 -46 -48 38 -100 44 78 -20 37 19 -39 46 4 -74
3612g4J36n9m6M9ll1N7p0P7K0j08O8l7o9J35q8L4O8j04j5R0n2N2J0j07J75p7k1
$$ -74 62 3 -43 6 3 -28 29 -41 36 56 -52 16 -21 -90 45 -43 -9 59 -45 -60 30 -22 30 40 -67 108 31 10
3640A0N9o0pL5j06K0R7j13J06q8j2Q3k3k8Pl9L4P7q6N1l4k7O9j1n0R5k8o8R6o4
$$ 10 69 9 2 37 -69 -49 48 -65 41 -47 -59 24 1 -27 -20 -59 -25 52 -34 17 -17 -44 25 14 -36 59 31 -37 59 -5
3670ekK7p7Q3M2q7M5K0k2Nl3j9N5q8Q5kq5P5N8r6J3NrK4Nk1M9m1L4o3%O4oq5L5
$$ -5 -7 20 -57 26 68 -19 26 46 24 29 -4 -23 32 -56 29 27 -58 17 75 -21 -8 -3 -12 12 17 -4 45 4 38 -25 -25 39 33 -52 -17
3705a7mk2N4j2j4j1OK1Lk3Oj8J8lJ8l3O4n4qM1m2K8l0O2lo1qP8j2n0O5n3j3L6
$$ -17 -21 -43 11 -1 -15 -26 -20 1 4 -19 -13 -31 -13 -16 2 -31 33 -21 -29 12 -30 -2 -32 30 27 -34 -42 36 24 -26 39 -14 -27 9
3739Il7K0k9K6QJ9l8O3p5L1OK7m9m9Q4j7PJJ2pk6K8n6j4R2j8n5NM4m5O1j8RNk4
$$ 9 -28 -8 -37 -11 -3 16 -22 41 -34 -3 3 30 -19 -68 16 -1 6 7 19 12 -14 14 -42 -56 36 18 -37 -32 12 -33 28 10 19 24 0
3774@m3P0m7j0M0m6L8N4o4M9r1L1J9jn2L3lJ3M0j7j3M3q6J05r8K5Q8j8j8mOn6
$$ 0 -43 27 -20 -30 10 -36 2 56 -8 41 -50 -19 0 -1 -53 -20 -23 -10 30 13 0 43 -43 62 -36 -11 77 59 41 37 43 -13
3806a3L9q0O3J8n7j9N9r7J06m0K0nk7k2O6j3J7k3J4nj5J7j1l5M8K1j2lK7n5j0
$$ -13 26 -54 9 27 -30 -49 10 -87 19 -21 -1 -6 -33 -55 11 -2 15 -8 6 1 -14 3 -8 -43 5 26 14 11 38 -17 -27
3837b7N7n3L5J3n0O0l4jL9m5K8k4l6R4K8q7l6N8l6M2m4lP6j08P4k4n0M8P6j06
$$ -27 30 -23 12 25 -25 35 1 0 39 -6 22 -2 -38 56 84 -3 -39 19 -17 25 -19 -22 54 -54 20 -4 -54 -6 70 -36
3867c6J11r1L4J0n5J7M9o7J1N5o9M4j7pN3j9j3L5p3NR5j30J09lq2N9k5K6L2m7
$$ -36 75 -16 18 28 -27 -10 39 -28 -17 38 -31 13 -4 -11 42 23 10 45 -28 -23 72 -58 51 48 -34 25 0 26 58 11
3897A1nL5l1j3l0L8K1%o0K3L0r4P0j8J7M7n4K2jo9J19mo8L8j5lQno0J09p0KN5
$$ 11 6 41 10 -3 -33 5 26 26 -34 -11 19 -75 -5 -23 -6 41 -13 9 8 -61 58 54 -14 24 9 6 14 9 -51 58 -12 -10 45
3930D5r0J09m9k6K8k5L8M2r3N9k1j5M1n3j2N9m7l9P8o1o1J17r7P0P1j09L8k4K7
$$ 45 -45 64 15 -11 17 -8 30 72 -21 38 17 2 43 -10 -22 37 -10 -49 29 -32 -93 24 -73 -3 68 -41 -3 -27 0
3959@k8NJ7L0o6M5l1J6lQ9p4OJ1j2%K4n1Q6p4K7N0j38O2J7l7L6jJ0l3L4L1n2K7
$$ 0 -28 -23 -6 24 -42 3 -28 -12 -15 74 0 6 17 5 5 29 -22 64 -10 17 67 -71 -9 8 -29 7 6 16 -17 17 48 -4 23
3992B3M2k1p6O8m8NOM1k7Qj7o5J33p5%N8o5J2J4j5J9L0k5rj3j8j2JK4j3j1K9k6
$$ 23 65 44 -32 36 -12 -7 -1 40 13 21 4 -61 72 -3 -3 55 -10 2 16 1 20 50 25 16 3 -15 -27 -26 -2 -15 -26 3 -23
4025b3K0K2K8n7Oj9qj3K9jLk8N9j9o1N9K6n0P0l7m1N6k5k0N0l2n0P2j3L3j9m4
$$ -23 -3 19 47 -10 -4 -23 -31 -44 -15 -16 -13 -41 18 -1 -62 -3 23 -27 43 6 -35 21 -4 -24 26 -6 -56 16 3 36 17 -27
4057b7O6n2N1m0PoMk6Q0m0k4K1n2lL3k4M3n0M8Rm3L7N3q1J6K2m8mL7L6p7M8J4
$$ -27 39 -13 38 -2 5 -1 3 -23 57 17 -7 14 -38 -41 -8 -32 11 -39 9 18 -25 12 65 -16 0 22 -26 -30 7 43 -34 14 28
4090B8M7q0K9K1nk2%l0K7J4jk0j2K2Nk1J5Qk1k9O4Om2J9q6Q4j3k1N7q5O8k7LJ5
$$ 28 75 -5 24 45 40 18 18 -12 15 29 28 8 -4 18 23 2 17 25 4 -25 39 45 3 22 -64 20 7 -14 43 -42 26 -1 2 17
4124A7K4K3p4K9k3J4l4l1J5N9n7j2J2Q8m6K0KLmk6L5j5J4l6k6jL9PMnk6J0N0o3
$$ 17 41 64 -10 19 -4 10 -24 -55 -40 19 -38 -50 -38 50 4 24 26 29 25 -1 34 19 33 -3 -29 -30 9 16 20 15 -11 -1 49 -14
4158a4L4L1k3o2L1%J9o6N2qJ3lk9L3l9J2K8Jk8J3J8%j2k3N1m5L2j6K3mOJo2J7
$$ -14 20 51 28 -34 -3 -3 16 -50 2 -6 7 4 -25 8 -31 -19 9 10 -18 -5 13 13 1 -22 29 -16 16 0 23 19 25 26 -36 -19
4192a9L8QpLj04J23p7L9k5J6O5m3n7M5l7Q5l1M3k7j7k4jP1l6no9N3m0N9m9P7l3
$$ -19 19 27 20 23 -81 42 -35 4 -21 -5 60 17 -40 5 -32 53 22 65 38 21 -3 -4 67 31 26 -43 10 -30 29 -20 57 24
4224B4k9j4KK2K7o4J5N1o1L2M4o0rN3p2N1Lk0lL6o7P1r2J15l8m0K5l6M2nl2L6
$$ 24 -5 -19 -17 5 32 -32 -17 34 -27 5 49 -11 -20 33 -39 12 15 -5 -8 28 -39 32 -60 55 17 -23 2 -34 8 3 -29 7
4256GJ4mQkJ4o4M2o9R9l8k5P4l9L4k0l0L1J5q0P7j9k3K5k7m0L3M1l4M7m4N0k9
$$ 7 21 17 25 23 37 -27 15 -54 45 7 -18 56 17 51 31 1 32 47 -33 44 25 2 27 0 -40 -7 34 0 47 3 53 24
4288B4n7j0O1mN5l6n4K3j8K6K0J1q6M9j5M7K0q7M4n4k2J13j04N4K9o5K7Nk3K9
$$ 24 -33 -43 18 14 69 33 -21 2 -16 10 30 41 -45 4 -11 36 56 -31 13 -41 -63 50 -54 0 29 -36 -9 -4 -27 2
4318BN0n2J4J9n6P7l5l2M5m2L2n1J8K1j3k0L3l7Rk1O7kM2q0J4M0l4j4n1Q5n2K
$$ 2 52 0 14 33 -23 54 19 -13 32 -10 22 -29 -11 10 -3 -23 10 -27 -18 -39 28 26 68 -12 2 42 8 -6 -57 28 -24 -22
4350b2O6k1p8O0l3k6M2O8o4K4j9M5n5L6J3n3jOm1N1n7M7K3l0KN3n5j1J6K0kM9
$$ -22 44 23 -55 5 -28 -54 -12 56 -8 16 -3 42 -13 23 36 -17 -18 -12 -53 -2 -59 -12 11 -19 -17 36 -19 -30 -14 6 4 53
4382E3l9j5j1PRk2L7o2Q7l9L9j5n1L3Q6j34K0L9j1N3n1kN2o2mk7L8j0Jk8J9L0
$$ 53 14 -1 -12 -5 4 -18 19 -43 44 5 44 29 -22 11 97 -37 -17 22 11 64 13 11 63 1 -3 -30 8 -2 -1 -29 -10 20
4414B0l6PK2M3o5l6L8J9o0N4k3K3M2l0k8l1O1L9n2LPj2k0JM6k4K4o0MKL2ll2J5
$$ 20 -16 -9 13 56 -9 -45 -7 12 -48 6 -17 6 48 18 -10 -41 20 59 7 10 17 5 -15 -14 32 8 32 -28 -24 -22 10 7 -25 -10
4448a0J9OL0j3m0pjK7rk3n4O2NpnL7l4LK4k3L6j9m2M0%k0O4l9NJj7LOm9J09n4
$$ -10 9 15 45 32 -8 -15 -16 11 2 -21 -75 -13 -8 -15 -20 17 -17 -14 10 -13 23 4 -38 2 2 -18 46 7 12 13 -4 -1 5 -44 65 11
4484A1K7J9n9M3k5K7n3N6mr2L0j6kO9p0Q1j39R1M5j4o3K0j8R7j7o8KM0n0J0J9
$$ 11 38 57 -2 41 16 43 -10 46 42 -50 -20 -36 -38 31 -39 42 -97 -6 39 25 -38 -18 -36 61 44 -24 -22 18 -32 -22 -3
4515ck0J05q4J1nqO5p1j5J6K2jK3j8j1K3k5Oll4M3K3n7P2o9k1N2m0OM0k2k8M0
$$ -3 -23 82 -2 9 4 -4 61 -10 -25 -9 13 12 35 17 6 29 4 10 7 -27 16 39 -18 54 -15 -36 16 -24 -18 22 0 -28 12
4548A2n1M3n0j1P0j0n2j4M8j1R4q4PJ6l3M7Qp5P4m9%RL2m7Q1p4K1P2o9J7mq9J38
$$ 12 -39 4 -46 -57 13 3 -49 -63 -15 -26 68 -16 -9 7 -26 21 29 -46 28 -21 -21 -12 20 -27 54 -20 1 73 4 21 17 -72 66
4581F6p8QN0o4L8l6kML5j4k0K4q7J10m4L1k6M8o7J5l3M6Qm3J15j6r5L8mk1M1o2
$$ 66 -12 -4 46 -18 20 -16 -18 -14 21 7 -13 11 -76 34 -10 21 -5 43 -24 -9 -42 4 12 -31 84 68 -27 11 7 -14 27 -35
4613c5J6mM4J0M1m0j6m0PM1qpRn2N4K3n2j2K4m4PQL2Pk7L7L5j03N9K0n9P2n9J5
$$ -35 -19 -23 21 31 72 32 16 -24 -17 24 16 9 18 -34 20 43 -9 -21 3 -41 -34 -26 6 13 -14 23 58 -45 14 34 -25 47 -12 3
4647Cj4K2j3M9p7J7P7q8ML6l6kL3l1J4kJ8Nm1RN2o2L4L6o1j1L0L9k9n2N5kj6J4
$$ 3 -11 11 -2 47 -30 -13 64 -24 -20 16 -20 -22 11 -20 -6 -8 10 15 -26 -17 35 -27 7 43 -18 -29 1 40 11 -41 14 12 -4 10
4681A0lPqRn5M6O9j44P8nk4N2j4k6M1o3Q0l5l3N1J0n9O1n6L8k7J2n0lK8l1J08
$$ 10 7 14 6 15 -40 6 75 -69 9 4 -20 32 18 -8 33 -30 50 15 -18 33 43 -16 45 -11 27 0 12 -38 -41 -13 -44 64
4713F4j23P7l3l5Q0l4k2O1m2J4J7p3J8M8l0J6k7k7M4M5j4rj7k6N1kk8j6J0lK4
$$ 64 -59 18 -15 -50 30 -4 -26 35 -7 7 24 -49 -31 17 -13 3 -24 -51 -7 38 24 15 -2 -28 23 21 -7 -23 -13 -16 8
4744HJ3j0k9M1j6m4M4j5j2L3mPm1j1J9K9JMk2L5m1J8k2Pj0NLk2rL5J8K3l3J0j6
$$ 8 21 11 -18 23 7 -37 7 -8 -20 13 9 16 -25 -36 -17 12 13 17 -5 30 -11 7 -15 -8 -18 -13 -10 -32 -41 -6 12 35 2 12 -4
4779dm9O0k1mj6M1Q2k9n0m2Q8o3j7O1nn3J5L4ok9K6l9n8R0%jk7J6k3j7M1kjL7
$$ -4 -53 7 -14 -18 -34 7 89 60 10 -32 56 -7 -24 37 32 -21 -6 28 22 -7 19 -20 -78 12 12 11 -16 0 -23 -40 1 -1 -2 35
4813C5k1Rm0M9j0l3l5O2N3k7k8%m4N7J5m0j4L2Kl0J5LKj9K4J9j0j6k3l6N5J0q
$$ 35 14 23 -17 32 22 -11 -46 16 69 42 14 14 -30 27 42 2 -12 20 22 -8 7 10 12 -7 17 36 26 10 -13 -49 6 16 8
4846Hn7L9oJ9k2j1O3m6K4Ml4M3k1L0L2n1l5J6k4R3n6K9q5O8j8lK3q3J04m2qK9
$$ 8 -49 -10 -16 3 -19 -30 33 -13 11 15 -19 24 3 33 65 14 -21 -5 -29 64 8 37 -48 20 2 -1 22 -61 43 1 -7 22
4878B2lk1%k3K2j8RJ8J5j8L2j7j9M6m6o4J06qn7M8m9J6L8k0j0J8Kl0j8L6K5k8
$$ 22 19 -2 -2 -25 -3 -21 -12 6 21 3 35 18 -1 45 -1 -65 41 33 -24 24 -25 -9 29 9 -1 17 19 -11 -29 7 32 4
4910DnrLJ2JL9m1j6j5J1Pl9N8j3J2l4M0k8K4lj8J6l2M9j6j2K7k8J8Jql1M8p0N5
$$ 4 -1 -10 -7 5 6 45 4 -12 -27 -16 -9 -48 10 -3 9 -25 15 -13 11 8 -10 6 -26 23 7 -5 22 -6 12 13 5 -26 22 -48 7
4945GL8m3n2P5m4mJ1K4Ll7QMn1Q4nrK9n5J9L5ro0N7m6MNJ4mj3K2pj2K2lm2j0M4
$$ 7 45 2 -50 25 -19 -23 -12 12 15 -22 -14 -10 -61 23 18 9 38 -17 2 37 28 -32 25 -21 -17 -12 2 -2 -15 7 0 -12 10 7 -35 -45 -1
4982aK9j2l4J1K8o2O2J3m8J8J4lm2L4K3n1J9jJ2k3%J9j5LJ1l3K4j4LM1j7K3n2
$$ -1 28 16 -18 -7 21 -41 21 34 -14 4 18 15 -27 7 30 -21 -2 -3 9 -14 -14 5 -10 -7 4 -29 -5 -19 -16 25 8 31 -21
5015b1l7M3K8l0k6O6m3JJ8l9K3k2J0M9pRo%o0R7o7qL6j8P3p3K0l4N5o0j1L9l6
$$ -21 -58 -15 13 -17 -43 23 -20 -19 -1 -40 -17 -39 -29 20 13 22 16 16 -44 53 -14 -22 14 -4 69 -4 16 -18 37 -23 -34 5 -31
5048c1O7q5Q5l8O4o5l7J10q2P1Jn9j6oL9L5p0K7LL2K2n9Kj4jj3OmkJ6k3L5J0k
$$ -31 36 -49 36 -2 62 -3 -40 70 -12 59 60 1 -15 -21 18 53 -17 10 13 45 67 8 10 -4 -5 -18 -12 -16 -18 -2 -25 10 20 18
5082A8L3o8L9l6M4nk7M7n8M7k9j8j%J3J8j7%J0nPL1m7k0pk1P6lK5o6l0M4k1M6
$$ 18 51 -17 22 -14 30 25 -2 45 -13 34 5 -13 -14 -14 -1 17 0 0 10 5 12 43 -4 -24 -31 -52 24 21 46 -20 -50 -6 -27 19
5116A9l8J2L4j9k4J1l8L5L0Jn0PK2j0P1q9R3q1J7j0J5oN5m1j0kl4QJ8j8L6o5M7
$$ 19 -19 -7 27 8 -16 -5 -43 -8 22 23 -27 -20 2 -8 63 -26 67 -14 3 -7 8 2 57 16 6 4 -30 -22 -4 -22 14 -51 -4
5149dpoL8j5p1M5J7K3n1J2Q0r0K1K7n2L2P0r8K1M7m2N0j3p3M2rM3n5J8K7J5o4
$$ -4 -11 -17 21 6 -65 -20 -3 20 -31 -19 61 -29 -8 19 -33 -1 69 -29 -8 39 -3 47 34 -39 3 -6 37 -18 0 27 42 -22
5181b2j0O1r0K0M2nm0L0Mk4N5q6O8J2m9M1j6j2M9l0K3j4k8Q5k5k7K4k0l4J2Pj0
$$ -22 -32 29 -61 -41 1 -4 -44 -14 -10 -34 21 -65 3 15 -34 7 -9 -21 28 -2 21 7 -21 64 39 12 36 16 -18 -6 1 -9
5213iJ2J6K1m6K4qJ4k3J6j6kL6n4j3J2J1j7L1kL3k3m8PP8o8qj7L9M1p3RM2l7N1
$$ -9 3 19 40 -6 18 10 24 1 17 1 -1 35 -19 -32 -20 -9 -26 5 3 36 13 -35 -28 50 -18 -26 -43 -4 37 -36 -27 15 -22 29
5247B9o4L5JL8o4pJ1k6N9n2N5K0p3K7L0m3P5m2k7M5K2o1K1n4K9J3j0M3n9m7R6
$$ 29 -35 0 1 39 -25 -32 -21 -47 12 -40 15 35 -38 -11 19 -24 51 9 -18 27 49 -12 9 -45 -16 -3 -13 30 -29 -76 20
5278B0L1q2j7Q1p4N6m6J4O5p0j0J8%J7qQkK5k5pK9j8jORm2R6k1n0o0K1O4m4MN
$$ 20 51 -31 -48 33 -41 15 -31 -17 48 -22 -32 -14 -14 3 -5 3 1 26 1 -6 23 5 4 10 19 -23 73 52 2 -58 -37 27 -17 -13 -8
5313hl1O3m2lK2k3JMJ0j7L5o3N7rl2M5m9L9j9K9j6M4j2j3J8m6O6p9K1J8J9Jm4
$$ -8 -39 24 -18 -21 1 -22 -21 -17 -7 -24 11 -52 5 -4 -36 9 -40 -1 -20 9 -7 37 25 12 30 -16 50 -29 -8 10 29 30 -14
5346a4OK0j8L1j8n5L3L5K2n7nMknK4ml4j8L7j0OK6l5Q6j0j2J3o3j0K6l6O6k8m
$$ -14 -8 12 -6 25 7 -48 -15 20 42 -15 -20 -16 -18 -23 1 -3 -37 -55 -18 -28 -22 4 -31 55 45 33 46 -17 -27 -1 -37 29 1 -3
5380cL7j2m7P2l0%Ol1RL1l4l7R8n6K2m4J0J2j2J5M0j9l6M2k7o9N6MK6l7l7P1k9
$$ -3 34 22 -25 47 17 17 23 -8 1 32 -2 -39 59 3 25 -19 -9 3 -9 6 46 27 -9 33 6 -63 -7 -3 23 -14 -51 20 -9
5413iJ9j4n4J04o5M5m1L1m3L5Kl1M5j2j1L1k7oK3M9j03j1K0jM5k2m1ON1Rl6N7
$$ -9 10 -4 -58 46 -19 26 -15 16 -27 8 10 -21 24 12 1 32 5 -1 22 71 -32 -43 -23 -24 21 -1 -42 -36 15 24 -12 45
5445D5o1m6J03k5k9LK2J2Pn6K2L1j4k0J4oRl4PJ4L4P0q2k1rL1PpNn8QK4l3j4J9
$$ 45 -16 -62 41 16 -13 -10 12 24 31 -25 -3 28 14 -6 8 2 11 -23 -16 -2 32 102 20 -1 -10 21 28 21 26 -32 -24 0 -33 -47 -28
5480b8K0P0m4j8j3JJ4M8o9M5k7l3K1Q0l6m1nKM8m6j7P5j6Rp0L5LL7j5k9kmn6N7
$$ -28 -8 62 18 0 -13 -12 2 50 -19 26 -1 -34 -13 67 31 -10 -15 -13 35 -11 -28 47 31 40 -30 5 8 45 30 1 -1 -5 -61 -4
5514dM6Lm6j0j1QK1Ql3L8o0jP4o6J7Mj9J1J8j9K2j0LK7J2p1O4m5l6O7j5mJ9Lk6
$$ -4 42 45 -1 -11 -22 -14 7 15 -18 20 -40 -41 33 -33 -16 -12 -31 -20 -2 -21 1 -9 -6 21 33 -38 26 -19 -55 12 -3 -7 12 15 -11
5549a1J3J2PrML1l7kj1m1M4k4Q3q1j1J6L4J7O%m0kjK7j1lMq7P1j3K3mJ6j2Pl6
$$ -11 2 14 21 12 16 47 10 8 -3 -44 0 -24 59 -22 -33 -17 17 34 40 40 0 -2 -3 24 13 10 14 -73 -2 -15 8 4 20 8 15 -21
5585b1O2K3p1K8m0M0k9j4P1l7l3K5Qp9Q1Rl0M0o7j7M9m8O3j6m5J00p9M2m9PqR1
$$ -21 41 64 -7 21 -19 21 -8 -22 49 12 -21 4 12 -67 14 23 -7 33 -34 -51 -2 -50 13 -3 -48 52 -27 15 -34 -27 -35 56
5617E6q0K5Jm5L5pj1k8K9pL8j2M4p3K6J7M9r2J2L7QK5l6n3P2K2j8J6l7l8N7k5
$$ 56 -24 1 2 -43 -8 -15 -26 -54 -25 -32 6 -6 38 -35 -9 8 57 -35 -23 14 22 47 11 -42 30 52 34 50 13 -25 32 7
5649Gj5L4o5L4l0k4J08r4K7N5n0j4N2o8O1oj1j5k9M2Pk2O8J3o2QJ3mK0l2j9m3
$$ 7 -8 26 -39 -5 -35 -59 49 -45 -18 37 -13 -27 25 -43 18 12 1 -14 -43 -1 6 -16 52 65 3 11 24 20 40 8 -11 -54
5681e4jM1Lj4P2l1l0M9j4J1%m1N3o9k0K9K8j02Q5L2p1P8%Nk4NK7j8kk8l0P1n3
$$ -54 -55 -14 -11 -25 47 16 -14 35 21 32 32 -9 44 -25 -45 -16 12 -90 -5 27 -44 34 34 39 15 20 47 29 27 -1 -31 40 -13
5714a3M0l5L0K2o8M5Qm0L4mk7K8k1NQJ3qPk5N1p5J1k6M0n9K7NP4q4J3mj1L7K1
$$ -13 27 -8 22 44 -24 21 29 -11 23 19 -8 20 -1 4 12 25 17 24 -1 50 -25 -14 -40 0 -59 -32 -27 47 -37 -24 -28 -39 -2 19
5748A9K0l9J7j1qL6K2j15R5k6QL6p7j0K4LOk7Q0Lp6M5n8J6J4K7l8L7o0N0Jj1K8
$$ 19 39 0 17 6 -2 34 56 -59 36 10 18 54 -23 -33 -9 -6 0 -27 53 56 -20 25 -33 -17 -3 24 -14 23 -37 13 14 3 31
5781C1l1k8LO3m1K3m6K0l1OJjO0l7L0Rj9l2j8L0OJ06n6p1J5k7P4jp9L7K7l2J1
$$ 31 0 -28 -25 38 -3 20 -26 -6 -37 -31 -30 -31 29 -8 22 31 12 -20 -38 -8 -2 104 48 -23 -8 -35 39 38 -41 -4 23 -9 2
5814BJ9m1rrO1l4L1Jm3JJL5K9k2n1RJ9j7j9Q1k7Pj1k7K4m1Nk8P4n9k2P6Kk2L0
$$ 2 21 -20 -29 -38 23 -11 20 21 -22 -21 -20 15 44 22 -29 -20 -1 -18 -37 44 17 24 13 -14 10 -31 -26 -54 20 -39 -61 15 17 -5 25
5849B5K0j1n3LJQN5j5j9k0J3j3P%qK6n6L2j4rN8m1o0J19mn6k9O2rj5J2Nk9QL0
$$ 25 45 34 -19 -16 -15 -7 48 33 14 -6 7 -6 1 1 -7 19 -37 -5 -19 -28 30 -11 -71 48 44 -12 -41 21 12 -3 9 14 -15 -7 23
5884B3k9O8p4M1l1j6l0O1l6P0n2K3j1k3L1j9Pj5M8n7P9p1M0n2M0j8K1l7k7j7J20
$$ 23 -6 62 -12 29 -2 -18 -48 13 -23 47 -5 18 7 -16 15 -4 3 -12 36 -21 58 -13 27 -25 15 -3 18 -19 -46 -63 57
5915E7m1m4M4l6N2j5L9p8L5K5o0qQ9m7m1L5O4m7m2j9N9J6m5J2oK3Rn4j8J5L5J6
$$ 57 16 -28 16 -20 32 17 56 -22 13 38 -22 -30 59 12 -29 6 70 23 -19 -38 21 37 -8 4 -2 21 30 -24 -42 -27 8 24
5947B4m8L5J8q0K7mM6J7m1M2n3rN0k5J2j4j4k9L5O0o0j3M1j9L3j6j4k2J9mj1L1
$$ 24 -24 11 29 -51 -24 -28 18 35 -6 36 -17 -26 24 -1 11 -3 -17 -46 -11 49 -11 -24 17 -2 31 15 1 -21 -2 -6 -17 14
5979A4l2OJ0k2j9m7P1rK2l5N3nk2J0j6L8m1L1J5l1M3n4j3M0o6O8qOk3K8n0lM1
$$ 14 -18 -12 -2 -24 -43 -90 -19 -28 -6 -41 12 7 -15 -5 -21 17 -24 7 22 -9 34 -20 -33 7 -59 9 1 7 -16 12 -38 -41 0
6012@j7L3jJ2n8O9m7K8j4l1J1M6k1L5o8P3m9k9L6rM2n7L8m5N0n7L0l1M0l6N3k9
$$ 0 -17 16 15 27 -31 38 -9 19 5 -26 -15 31 10 45 -23 50 1 -28 8 -1 41 -16 22 -23 27 -30 0 -31 9 -27 26 -3
6044cL0q1N7j4lJ5RJ0n4MO3k2l2Q2n1O5m0m3K0L2l1n9L0N4k6N5k9o7K3J9NK1n4
$$ -3 27 -54 3 -11 -14 1 10 20 -34 -30 33 11 -21 61 10 75 35 -8 12 44 13 -46 -16 38 12 67 38 -29 -6 13 18 39 -15
6077a5k2L5M0m8kkqk5O4L1q3M8No3M3N3l9J7p2J12j9o5RL3JK1j1n0Mk9L2J9n7
$$ -15 -37 -2 38 -10 -12 -14 -22 -47 17 48 -35 13 18 -45 -2 51 12 29 -43 69 50 -15 -6 27 28 49 38 -12 -8 -37 -5 14 -43
6110d3N0k8L3J2l5K1l1J2RL8m7Q0p0PJJJ1m9L0m2R3p0pK7M4l9j2J7L4Jq0M5k1
$$ -43 7 -21 12 24 -11 10 -21 -9 0 38 -9 71 1 8 9 10 21 -28 2 -40 53 -17 -24 3 47 8 -4 13 47 48 -32 13 -8
6143hJ9k6QL4l3P3n5K3%k8l3M3K8n8j1O4m5%nk5K6k9O6l7N6l1RK8p3K7M7j27N8
$$ -8 11 -15 -7 27 -6 67 12 35 35 7 -26 17 45 -13 -24 40 -5 -5 -10 -35 -9 -38 28 -9 47 16 25 53 -20 7 54 -73 -15
6176a5j5P5o3M6k9K4L8q4K1k8O9J7n6LJ8j4K0l4K6L1p4L3L1j6k4J6jm5M1J9k8
$$ -15 -30 45 -18 28 -1 23 61 -23 -2 -30 39 56 0 3 21 7 27 -7 19 50 -24 9 40 24 0 16 15 -30 11 30 2
6207Bk2QJ2k0J5n5K6pJ1lO1j9J0k8l2jP0k3k0J6m0P5l4%%OL8j9k2jn8J25l2Po1
$$ 2 -20 -12 0 -20 -5 -60 -34 -41 -30 -33 28 9 19 -9 -41 -42 28 5 -15 1 -39 36 2 2 2 8 46 27 5 4 -54 71 39 46 -15
6242a5K1L8l1n6L4j9K6K2Koo3M2K9m0l7K8J5kR4p9n9O0j0L1okMno0Q4qmJmk6L9
$$ -15 6 44 13 -43 -9 -28 -2 20 22 16 -47 -5 24 -16 -53 -25 -10 -12 82 3 -56 4 -6 25 19 17 21 16 -44 40 32 28 29 25 -1 38
6278C8q5Q3rL3n1j1j5K4o2N4%LlJ3k8J6J1mJ3L5r8P1l6j2P8q5Q8o3J4lm1oR0l0
$$ 38 -47 36 27 60 9 -2 -17 7 -55 -1 -1 2 -1 12 -16 0 11 7 20 55 -43 28 -8 -20 58 -27 61 -2 12 9 -32 -38 52 22
6312B2%K6m9j0K8k5R0j02K9K3j8oK6j8l0M5l9pL1K3kl7o2Q5kpK2m7Q5j05J2J7
$$ 22 22 48 -1 -11 17 -8 82 -20 9 32 14 8 34 16 -14 31 -8 -15 16 39 37 0 -62 23 21 14 36 -11 74 -31 -19 -2
6344bqJ9oj8k0N3LpQj8J6n3J8M5mlk7K3q9J15j05P5N6p9NL7n6J8Ml9M5o6O6k0
$$ -2 -10 9 3 -15 -35 18 21 14 22 4 20 -33 -15 30 26 23 -4 19 -70 45 -60 15 71 -8 -3 34 -22 -4 0 -39 6 -60 6 -14
6378a4J8mL3m6M6j1J0rl7J4jj2M6q0K9k2O2l2jM8J0mq0J1L8J8j4l1j2M6rL7o9
$$ -14 4 0 33 -13 33 22 32 23 -14 0 -1 -13 33 -47 -18 -40 22 -10 -11 37 47 43 -37 -26 12 30 16 -15 -27 19 10 47 -22
6411b2L8k0k3L2K1J8n2j7N8p1k2J01n9j0L0K5l7l7N4l1K3jM3l8K9o9J4L4lk1N4
$$ -22 16 -4 -27 5 26 44 -8 -25 33 -38 -60 41 -18 -28 2 27 -10 -47 7 -24 -1 -2 41 3 32 -37 -23 11 8 -13 41
6442D1n3LNRk9JM3k5Lj3M0k4ljmj6L2k0rK4nrJ1j1M2j8l0oL7L2n7k3L1j4L3j3
$$ 41 -12 -9 -4 5 -24 -23 20 -5 -2 -15 25 1 -2 -3 -7 -23 9 -11 -20 4 -1 -10 1 -10 32 14 -16 -22 15 47 -10 -33 -2 -16 17 4
6478Dj3JK5j8opJ8J2k9O3nr6O1N4k2mo1K9l1J3K4J7k4K4k0L8k9k2j8J5RJ9j5j3
$$ 4 -9 -8 17 -1 -7 -14 4 16 -13 50 45 -51 10 64 42 38 -23 6 -25 -12 12 29 5 29 9 47 18 -4 -22 -7 2 21 6 -7
6512gm8L5m3L1M7o0J2JJ8O0o2N9m7Pk8J9L4l5k0M6m6M0K0l5j4j8O1j4J1m6J5m
$$ -7 -55 -20 -63 -32 15 -45 -33 -32 -14 46 -16 43 -4 3 -25 -6 28 -7 -27 19 -27 13 33 -2 -16 -34 27 13 24 -22 -7 -11
6544a1O4J6j8m0k4oM3n7mM0L7n8k2K7K9j3Mk8K7Pm5L3J7n8RM0k0L9l8R1q1NM7
$$ -11 53 69 51 11 -13 -19 24 -33 -37 3 40 -18 -40 -13 16 3 7 -21 6 13 -32 1 18 -40 -31 9 -11 28 -10 81 0 5 52
6577E2n0O5l5L9m8l7QK6n3l8R1l0J7k7J9Pk9K1L5j8k2j0M2p7O3Kk4k9L5K6k1K3
$$ 52 2 67 32 71 23 -14 -6 20 -33 -71 20 -10 7 -20 -1 6 -23 -2 33 15 -7 -17 25 -52 11 13 -11 -40 -5 21 0 23
6609B3pj4J1j9mrK2J5J2j4k2j3Q4pm5m6k2J20o1k8j2O8m3J5m9L7N8o5J9kk8O8
$$ 23 16 2 13 -6 -10 -19 3 18 30 16 -6 -19 65 58 13 -33 -55 65 4 -24 -36 32 -11 4 -45 -8 50 -15 4 2 -26 42
6641D2p2L5K0j2K0m8L6k0K2n1L6%l4J8j1oM6Mm4K4j0J2OLJ3n3M1Km0oL6k3R0q1
$$ 42 -30 5 25 13 33 -15 21 1 23 -28 8 8 -26 -8 -19 -25 21 25 -19 5 -5 7 13 16 29 -24 17 19 -21 -27 9 -14 76 -5
6675ej9J2K4J3k8N2o3k1K8L0kK5q5P2j5k1J1m3kL7j7K0RN1j5p8L7Qn8N6K8m7N1
$$ -5 -24 -12 12 25 -3 49 -14 -35 -7 23 21 46 -39 33 18 -3 8 -35 -37 0 -17 3 12 63 48 -30 7 15 -43 13 41 -6 45
6708D5no6K8JlrM3k6Rm2K1Kkk1k4N2o0Q0j9k0kQmrL5K6q3K2j4J6Qk4O9k1J0j1
$$ 45 40 -26 2 3 0 -9 34 8 17 -25 -4 -2 -4 -25 -49 3 -57 23 4 -16 -18 -10 -14 -23 12 38 -45 -23 -37 -21 -13 -37 32 11 21 10
6744A0o1O0k6J2K9%k3rk9P0l5L7m9Lk0JP0j0l5NJ0Ql0j5n8P4Pk0J5K7k1LN0o8
$$ 10 -51 9 -17 -5 24 24 1 -8 -37 33 -2 35 -14 -11 -31 -30 40 30 -5 0 10 18 -12 -27 -85 -11 -4 -24 -9 18 -3 0 50 -18
6778a8j2J6mnK1Rj4O0l0k1M0J1n2k7oL5K5Kl1mjj8J0l1M8L0k1o6N1lJ1K2n6J6
$$ -18 -30 -14 -18 -23 -2 7 -7 53 23 2 42 53 1 -26 -32 3 28 30 -1 -5 -6 -24 -14 -45 3 33 12 -54 -3 -6 5 27 -29 -13
6812a3m9R8k5l0K3l5j8P6j7P3q7NL6m4j3L8K6q8N6k8N1j7l2RMj5k1O2l9JJ3k6
$$ -13 -62 36 11 -19 4 -31 -49 27 10 83 -4 1 37 -7 -20 18 44 -44 12 -16 35 18 -14 -5 -1 -16 -37 25 -14 -13 0 -26
6844b6L8pk9K9K0p6N3J1j%OKL7k0n7P7n1l3M0jL8q5L5j4J5k7L3l8P6Pk5o0N3k8
$$ -26 12 5 -24 5 25 -51 2 13 12 12 18 20 57 37 -20 57 6 -27 13 12 50 -35 0 -14 1 -26 7 -31 45 52 27 -33 20 -8
6878hl3P4k0oL1J8p6M1k2Rk2j6N6k2kL0p6M3K5J5m7mN3q1K9j5N9k4M3m8K1m5K0
$$ -8 -41 33 13 7 38 56 -20 21 -1 8 -14 -30 26 4 2 32 -44 -1 24 39 -8 -12 41 -40 -11 -26 33 9 52 4 25 -20 0
6911@LlM1n6M8l3j7QJ1L0j8k2J1o1M5M6m2K2l2nJ0K7k4qO7r3L5K9m3kj5oP6k0
$$ 0 3 0 41 -15 33 0 -17 -9 2 32 14 -8 3 -58 -13 33 -9 13 -19 -24 -14 13 -11 -19 48 -45 -10 19 -24 -26 -41 -47 29 9
6945Im4K2Ll7N7J0rkm5J6K6J2l4OlK1l2K5L3k1j6K9o0K9K5l6J3k4J9j3N3m0J5
$$ 9 -35 -13 -10 -47 10 20 11 9 -36 -20 6 18 -16 -10 -13 8 -24 1 34 13 -3 26 -34 -5 20 -16 -3 -27 -8 -21 32 -8 7
6978GJ7n6N4l6J6RJ4n4PQ8p4NJ1Ljj4m8L9%K8n4K2K9j5M3m4L1j5J1prj8Pm8P8
$$ 7 24 -32 22 -14 2 11 25 -29 -22 66 -8 -3 8 11 10 -4 -52 -13 -13 15 -39 -17 12 -3 40 -4 27 12 23 16 7 -11 -4 -52 26
7013B6m8K8k8K2Lm3kO7p6PN5l5J3LJ1j2K7l2Q0n2K1J4n9j1J4M3j9k9j9M1mj3m
$$ 26 -22 6 -22 0 3 -40 -42 25 -51 -44 11 -24 -11 -8 3 -9 18 -14 66 14 35 49 -10 -21 -7 36 17 -12 -31 10 6 -7 -11
7046a1J4k0pK3Jk0J8J1j6JJl0OO0l3K0K3m8K4p5J8N3j9J2mj7N6nJ2m9j0J6k9L8
$$ -11 3 -17 -24 -1 0 -20 -2 9 -7 -6 -5 -35 -29 31 -2 18 41 -7 17 -58 -40 13 -6 6 2 -15 41 36 48 -1 -11 5 -24 14
7080A4on4N3K8n4N8m5K4l1L8%Rj5k4om7L8k9J02q2K8O6m2l9nK7J2j4K3p8P7j5
$$ 14 8 -46 7 35 -19 39 -6 18 -13 25 25 34 19 -5 -11 -58 -20 -49 53 -29 -1 65 23 -16 -21 6 18 4 27 -51 26 11
7112A1j3qMk7L0K4k6J3K5l9j5Qj5qK9J5jk1L4%jMl4J1l4Pj2N8po5N6m3J1N2j0
$$ 11 -2 -10 -6 -33 -3 21 -5 8 33 -6 -21 -13 -28 -36 -7 8 7 -14 20 20 19 23 -11 0 -34 -27 -39 19 12 -53 3 -40 -29 23 13
7147A3l9L8L3n0L9j9j1pj2N6r6O0j9L0on2M4J5rj1nk5L3K5k0K3n0L4RjJ1k5k9
$$ 13 -26 12 45 -5 34 15 4 -3 -15 41 -55 5 -14 16 10 -42 2 17 8 -3 -8 -33 0 25 5 28 -22 12 21 20 31 6 -23
7180b3M9Jm9l4Q1o0K6p9O5QJ1O3n5%L3l9n3J6j4Q0m1N5l8m3K9j4L8oJ2L2p3P4
$$ -23 26 27 -22 -56 25 -35 -9 -88 -23 -15 -4 59 4 4 37 -2 -55 -39 -53 27 -14 41 3 -40 -11 -25 13 7 19 51 -22 52
7212E2p7N8j2jJJj9K5l5ML2J5q2J9K8l6L3M2k6o1J7J7N6q0M8k9PqL1ql9J3k1M9
$$ 52 -25 33 21 20 21 22 3 28 -7 -3 29 44 -38 -19 9 -27 6 48 22 -39 -22 -5 51 -29 19 -10 -3 -11 20 12 -27 -14 -35 14
7246A4J8n0L1l1j6kL6k1K2l1k4M7L3j7j0K3m6J0J1n5K3j1P1k8k9J3N7n7J3J1l8
$$ 14 32 -18 13 -18 -34 -36 0 -21 1 -30 -54 -7 26 9 -1 22 -24 -14 -3 -58 -35 -46 25 -3 -32 -19 38 -19 -6 5 -33
7277c3L4J8k2k3N6k2K5q9K8M5l9K4K0o3M3J5n5oJ3j5N9kk5L0KK6n2km6P1J6j9
$$ -33 1 19 -3 -26 30 8 33 -56 -28 17 -22 2 22 -41 2 17 -38 -44 -31 -46 13 11 -14 16 18 44 -8 -10 -56 15 31 12
7309A2NOj0L8j3J0l7J3Jk0MK8l2l8Q5o5M4l6Q5p6l1L5l5pO6l8J8l4K6k4J2L6m1
$$ 12 17 23 13 51 38 48 11 24 25 5 9 37 5 -33 52 -13 31 -5 80 4 -27 8 -27 -34 32 -6 12 -22 4 -20 -8 28 -13
7342a3M5j6J3l1mj3J7QL5k6k4LnMM4l0Jl4K6O7o4Nk2QMK5p2N9K2j8m0O8q3O1j9
$$ -13 32 16 29 -2 -6 -19 -2 6 41 15 -9 -6 -11 -7 37 7 8 -26 0 67 3 8 -14 -6 -2 23 -49 10 32 14 -26 42 -41 20 1
7377AlLL3p2KM8K8pl1J0j8j0P1k9Mn7N7k6K9p2K5L9j0k1oJ5j7J5L8l0kM4p0L5
$$ 1 -2 1 34 -38 -36 12 40 33 2 12 -6 -16 55 26 30 -27 30 4 33 -39 -14 25 15 -6 -12 3 -14 1 39 9 7 51 -19 16
7411A6n1qJ02m8j6%K3k8m2K5N0Lm0jjpP3n8J4l0L4nl5rJ3M3JN3p2lOj2M2m7J1
$$ 16 -35 -43 59 11 -5 -5 18 -10 -52 -27 23 26 -14 -15 -16 -23 50 -8 6 -24 10 5 -30 -39 -26 17 18 71 -1 -4 2 -10 32 -15 -4
7446dK4ml6L9oPm4o4J22k3j1M6j2lKm9l6J12l4k2J15j51JM7rLMJ8ol2JL2kn5J2
$$ -4 20 16 -20 19 13 20 -24 -88 34 11 0 46 34 31 33 -16 -52 60 26 4 119 -32 -31 16 7 10 14 32 26 -6 -5 27 25 -30 -18
7481a8OKn5L6Pj0LN9l3k4MN1k4OL1p6K6PL7p1L6j0RK2p9Q3ml0M0J2n7K7K3J4m3
$$ -18 -12 -10 -65 -29 -22 -32 -29 30 -3 -27 -23 28 4 10 41 -35 -9 -2 35 -36 0 -10 -1 21 -58 25 21 -9 31 43 -14 13 36 50 7
7516GK4J1j8q1M6L1J4o5OL7mj5k4N9k8J3Jj3JNrL2l8K3lJ6k8k8L3pK5j0k8J3K8
$$ 7 31 42 24 -57 -11 20 34 -31 -25 12 8 -7 -31 28 0 13 14 1 2 7 -2 30 -8 15 12 28 0 -28 5 -2 23 13 -15 -2 26
7551B6l2Lnk9M6ml3J1L6l9P6l4J3J9q6LKL3Kk9k0K4L7m3L4Rk3j1J7K4k4Rl6k9
$$ 26 -6 -3 -8 -37 9 5 -28 -17 19 -20 56 22 35 54 -32 -29 -27 6 8 -21 -41 -17 20 -23 11 20 -3 -14 3 27 3 12 -24 -53
7585e3P5kKk0k5M1l1O6J5r7MM0L5m1j3j0k3RL5nK5%p2O9jJ1m3M0m3LJL6m1j8K8
$$ -53 22 20 22 2 -23 18 -13 53 68 -29 -25 15 50 9 -4 -14 -37 -28 7 2 27 27 -45 24 23 34 -9 31 -12 -9 -8 28 -13 -31 -3
7620cj5K7Pj5j6Jl4P3j9k5J7j3MJ0j4K2J9MqnJ1j2k7l7L6%k2O5k2j7M0k8L1p8
$$ -3 -18 9 16 1 -15 -14 -48 25 6 -19 -2 -15 -11 -1 -15 7 26 30 22 17 28 16 -11 -48 -12 -12 -34 31 9 -8 32 4 35 -43
7654d3P3n7N9l1qK2l4K6K9j4J0J5p3M1J7J8q0P1p4N2Jn2M0m8P3k2K3j1OJk2J9
$$ -43 30 -27 32 1 -7 15 -19 7 36 22 32 47 -26 15 32 50 -30 41 -33 19 20 -32 8 -40 33 11 34 23 29 30 8 27
7686B7k9K1N3r7K7Kk6M5moj3J7LpJ7n4k6N8l7N1komkj0k0J3j3K8K3m7J7N6o7M1
$$ 27 -2 19 72 -25 2 4 -22 23 19 13 0 17 20 13 30 -24 -50 8 -29 22 20 14 10 8 -2 -22 -9 -22 6 29 -18 -1 55 -12 29
7721B9n2L9M7o3Knj4O7j9l2K9j5o3N4k1J0j0qMmML2K3m8L8k2N0p5N9m2j1j8M0
$$ 29 -23 16 63 0 2 -3 -17 50 31 -1 28 13 -50 4 -17 -7 -17 -25 -21 -25 -21 11 34 -14 24 2 52 -23 36 -6 -17 -35 5
7754Ek7N5m1L1JM5m7j2k0J5K7n8Rj8N9l9L0K8m2%J1n1Q3k3n1R6o5J2mJ0J5n4L5
$$ 5 -22 33 -8 23 24 69 22 10 -10 5 32 -26 -17 -35 24 -15 15 43 1 1 12 -39 44 21 -30 66 1 13 9 19 34 -20 15
7787A5m5j7M2L6rkj3KJ9nk8k4P2n5J9j5j2LM9n2L1J6m2RNl1N3plOk1N2j3m1L0
$$ 15 -30 -47 -5 31 22 20 7 9 28 23 -5 -29 43 -12 7 -8 -20 -17 32 -20 11 27 -15 -6 -1 -32 21 14 11 17 -4 48 35 -6 24
7822B4M3m3j9K3l4J3k0N0j6o6L6nOJ7l4R0n9j1J1j6K8m6Rk4NR9m6K3l6k3L5J5
$$ 24 67 24 5 28 -6 7 -13 37 21 -45 -9 -14 -8 9 -25 65 6 -5 6 -10 18 -28 -19 -43 -38 61 15 38 2 -21 14 29
7854B9K5l3m0J3K4K3K7k9qn1M5k0m3K9M2j8oK3K4l7k7K8k6L8l6J3j3l0M7J3m1
$$ 29 54 21 -19 -6 18 41 68 39 31 -20 25 5 -38 -9 33 15 9 32 56 19 -8 20 -6 32 -4 9 -4 -34 13 26 -15
7885a5qJ7K8o7M4j4J6j3l2O3Om1M2l8M6m8N9l3M6p7J6j7K6j3Qm0N5k5L3j5l9k5
$$ -15 -23 -6 22 -45 -1 -15 1 -12 -44 19 25 -16 26 -12 34 -14 45 12 58 -19 -3 -20 6 -7 1 -39 16 -9 24 9 -30 -55
7917e5M9Jj3J6j3M4o9N0p3N0KM5n0PKL4k1LK6M2p7Rl8L5rJ6K2p4k4O4NML7Pl5
$$ -55 -6 -5 -18 -2 -15 29 -40 10 -63 -13 -11 34 -16 -9 -7 27 6 9 35 77 0 9 -29 6 -3 13 35 -39 -63 1 6 10 47 54 19
7952A9k7j5L5qJ8o7QN9k5k8N2J8o7Lj7P4j5j4K8l0NK3m4RML7pl6N5m6kl0lqQ6
$$ 19 -8 -23 12 4 22 -45 -37 22 -3 -31 21 39 -28 -25 -42 32 17 3 31 1 6 29 -15 -6 -2 35 28 -8 47 1 -1 -31 -34 -42 44
7987D4k4l4N4l9k3M8j8mJ9k6Rl2L0j3J3L2k8n3oM4L4Om7L7Prm3N7No1MkML1Kl3
$$ 44 20 -14 40 1 -22 26 8 4 23 -3 6 -26 4 -9 4 36 8 -45 -51 -7 27 33 -14 23 30 21 -22 35 40 -21 -17 -19 -15 16 18 -15
8023a5j7K9j2L9m9O2j6j9N4j0o9J7rL5pk7Pj0j2J8Mj4mK2L2rKPn4K7N5j04K4J2
$$ -15 -32 -3 -15 24 -25 37 21 2 56 46 -23 -6 -15 20 13 -14 -7 -17 -29 -11 -7 -21 -25 -3 29 20 22 29 -25 2 57 -47 -23 -11
8057a1k7Q6m2j3lJ9pm3O2qn5J03n6j9J0mk2N1l3%K2K4p8j1O9m1L8ll8Q9m1rm2
$$ -11 -38 48 6 -7 -10 9 2 -41 21 13 -42 61 5 -14 -4 -8 -30 21 -12 -12 10 34 -44 -55 14 -27 11 8 -30 59 18 9 -33
8090c3KO9km3l9M9j8K3kJ7n2L8JL0o0J3j0L2l2J5j2M5n2L8l4L8L0n3K5l4N5l4
$$ -33 -31 38 36 -7 -46 3 -15 8 6 23 -29 9 10 40 -20 -7 -17 15 -17 -2 -14 31 -21 17 -17 21 51 -2 23 -11 44 10
8122A0qJ5Ml2K6j07P7n7jP6k1J6L1n0RL7p1O8n2K5mM0m8M8o2J5QQk7L7K6n6K6
$$ 10 2 17 21 -11 15 -92 -15 -72 -73 3 -18 -2 29 -21 -12 25 -46 22 -30 -5 -9 31 -17 31 -31 -16 -8 0 -27 10 36 -20 6
8155Fj9Pj8L6k6N7l3j8K2lkj6mM6j2l8NL2J4k5M1p9oRM4l3L2J5m5Kl9L7M5k7k7
$$ 6 -13 -6 -24 12 -14 43 10 -8 14 11 9 -7 -11 35 23 -15 -10 22 36 11 52 -27 -33 -24 20 -13 19 34 -11 -9 -48 -11 34 7 -20
8190b0K8
$$ -20 8
8191H
$$ Imaginary data points
##PAGE= N=2
##DATA TABLE= (X++(I..I)), XYDATA
0@%%%%%%%%%%%%%Qj6J6j6K4l2L2m0M8n6P2q8J04j20J36j56J80k08K40k72L08l51
$$ 0 0 0 0 0 0 0 0 0 0 0 0 0 0 8 -8 8 -8 16 -16 16 -24 24 -32 40 -48 56 -64 72 -84 96 -112 128 -144 164 -187
35a87L98m47N03n65O30p03P82q69R66j071J185j308J444j593J755j933K130k347
$$ -187 211 -236 267 -298 332 -371 411 -458 508 -563 622 -686 758 -835 920 -1013 1117 -1230
53a230K586k852L147l478L858m291M787n369O061o898P938r265J1021j3471J7140
$$ -1230 1356 -1496 1651 -1827 2031 -2260 2527 -2842 3219 -3679 4259 -5006 6015 -7456 9684
68I684k3370M9316k19626K13290J06338l12111K77775n1994k10754K69466o4189
$$ 9684 -13686 35630 -183996 29294 135632 -176479 101296 49302 -161452 108014 43825
79D3825j55832J86503r7490m738J03329j32862M2194O2981q3097O6191m4135k5303
$$ 43825 -112007 74496 -22994 -27732 75597 -57265 -15071 47910 -35187 31004 -13131 -38434
91c8434R5351p3684J4M1987o8672Q6156k8443q2683J24441o0553l9240J19231
$$ -38434 56917 -16767 -16753 25234 -43438 42718 14275 -68408 56033 -4520 -43760 75471
103G5471j30249K3728J29093j64529M6242R3443j42358R1991K2798j27859J25639
$$ 75471 -54778 -31050 98043 -66486 -20244 73199 -69159 22832 45630 -82229 43410
114D3410j5326q8081J06777o2730j2560R3351j10894K8805P4126j03150N8827
$$ 43410 28084 -59997 46780 -15950 -28510 64841 -46053 -17248 56878 -46272 12555
125A2555J5233q5499R6868j9880p0404Q3796l7069j2133N4944p4537L1274M3415
$$ 12555 27788 -57711 39157 19277 -51127 32669 -4400 -16533 38411 -36126 -4852 38563
137C8563p1666M6026l976m7300Q1030m1182m5047P9943m3272q391M9369o7638
$$ 38563 -33103 12923 8947 -38353 42677 1495 -43552 36391 -6881 -15272 34097 -33541
149c3541K9403M2318o7612L3299P383l8435N9323l2792l5724O9190l6748j3282
$$ -33541 -4138 38180 -29432 3867 11250 -27185 32138 -654 -36378 32812 -3936 -17218
161a7218M7001n6242J9298M5626o5236J9966K8585m2351L3178l894l6042M4262
$$ -17218 29783 -26459 -7161 38465 -26771 -6805 21780 -20571 12607 8713 -27329 16933
173A6933j0110k2122K8152k2838O639K3549l6870J3625J6391k5615K0653o172
$$ 16933 6823 -15299 12853 -9985 -3346 20203 -16667 -3042 13349 -12266 8387 2215
185B215j8390L1253j4565j1688K2487j9948R035J3213l1254K1401Q339k8128K5995
$$ 2215 -16175 15078 513 -11175 11312 -8636 399 13612 -17642 3759 12098 -16030 9965
198I965p466j9593L5778j9731j6352L4961k2158m054K4874k9184R742K0251l0471
$$ 9965 2499 -17094 18684 -1047 -17399 17562 -4596 -8650 16224 -12960 -3218 17033 -13438
211a3438J2985R789k0809J9346m833j6205K3147q583q842J4747j3007M995R625
$$ -13438 -453 9336 -11473 7873 3040 -13165 9982 1399 -7443 7304 -5703 -708 8917
224H917j7570R246L799j0127J2482r365m457J7532j4239k21J1842j6395J0992
$$ 8917 -8653 593 4392 -5735 6747 -2618 -7075 10457 -3782 -4003 7839 -8556 2436
237B436O174k0815J5645K923j5778J6270o545r481J9403j1461o066J5196j1742
$$ 2436 8610 -12205 3440 6363 -9415 6855 310 -9171 10232 -1229 -7295 7901 -3841
250c841K285Q582j4179P592N154j1129Q046j722n235R973p000k123Q277p646L121
$$ -3841 -1556 7026 -7153 439 5593 -5536 2510 788 -4447 5526 -1474 -3597 4680 -2966 155
265A55L519r167P684R94q288Q282k757m387Q960o403j987Q103o781P78M842o863
$$ 155 3674 -5493 2191 3185 -5103 3179 422 -3965 4995 -1408 -3395 4708 -2073 -1295 3547 -3316
281c316L747K372o053M375K3l327M247k694p16L488l616J511J323l614L907j015
$$ -3316 431 2803 -3250 1125 1148 -2179 2068 -626 -1342 2146 -1470 41 1364 -2250 1657 642
297F42l289N219k911j788N403m873LN171n952J561M105o135K873K741n695L588
$$ 642 -2647 2572 -339 -2127 3276 -1597 -1594 3577 -2375 -814 3291 -2844 29 2770 -2925 663
313F63J412m745L700K62l374L144l49k036K067m77q09P87j18L6o30P20L49j754
$$ 663 2075 -2670 1030 1292 -2082 1062 713 -1323 744 267 -542 245 127 163 -467 253 602 -1152
331a152J722K01k485K849m67k653L663j364k488M348k252j912M248k836r49L814
$$ -1152 570 771 -1714 1135 668 -1985 1678 314 -2174 2174 -78 -1990 2258 -578 -1527 2287
347B287l195j10K953k866M54J712k140R01P42j259O47q4J28k7p43J281p23p19
$$ 2287 -908 -1018 1935 -931 -477 1235 -905 -4 738 -521 126 42 170 143 -600 681 -42 -761
365g61J982j841j32K520k806K92K556l131J281J620l342K094J120l097K116K90
$$ -761 1221 -620 -752 1768 -1038 -746 1810 -1321 -40 1580 -1762 332 1452 -1645 471 761
381G61j934K051p19j215J796o66k21K77o38J172p35m03J248j596J096J027l188
$$ 761 -1173 878 159 -1056 740 74 -147 130 -508 664 -71 -474 774 -822 274 1301 -1887
398a887K251J163l414K796j65k993M164j307l066M200j559j601L157k735J01K958
$$ -1887 364 1527 -1887 909 744 -2249 1915 608 -2458 1742 183 -1418 1739 -996 -895 2063
414B063l037M71J354j632J586p59j222K243j300J79P48k374K696J39l282L263
$$ 2063 -974 -503 851 -781 805 46 -1176 1067 -233 -54 694 -1680 1016 1155 -2127 1136
430A136r32j768M061l601j036N299m084m37L607m364K327K368n444K950J722l322
$$ 1136 204 -1564 2497 -1104 -2140 3159 -925 -1362 2245 -2119 208 2576 -2868 82 1804 -1518
446a518K593j324j395L746k282q74J870j896K261m56l060L621r64j353K959l906
$$ -1518 1075 -249 -1644 2102 -180 -1054 816 -1080 1181 725 -2335 1286 322 -1031 1928 -1978
462a978J327L868n555J976K341m675M635n79n365O392j165m055N163l177r06M981
$$ -1978 -651 3217 -2338 -362 1979 -2696 1939 1360 -4005 2387 1222 -2833 2330 -847 -1753 3228
478C228m722J51L346l315K057k35k613L886j748j171K670l325K168J808n098L800
$$ 3228 -1494 -1343 2003 -1312 745 510 -2103 1783 35 -1136 1534 -1791 377 2185 -2913 887
494H87N70m028M922k614k558O488m695j289N740n574J525L957o782L632K759o094
$$ 887 1457 -2571 2351 -263 -2821 3667 -1028 -2317 3423 -2151 -626 3331 -3451 181 2940 -3154
510c154M144J77l768M862k178k272M260k818L13J978l712K890P66l733L474j162
$$ -3154 990 1167 -2601 2261 83 -2189 2071 -747 -434 1544 -2168 722 1488 -2245 1229 67
526F7j593L911l445l58L701l620J276J500l813L577J25l811L854j187j776L841
$$ 67 -1526 2385 -1060 -1418 2283 -1337 -61 1439 -2374 1203 1328 -2483 1371 184 -1592 2249
542B249l122p60L831k939K94J542k553K307n1k260K376j372n9K485l798J319K764
$$ 2249 -873 -1633 2198 -741 -447 1095 -1458 849 798 -1462 914 -458 -517 1968 -1830 -511 2253
559B253m096K158J170m116L976K82m500M096m81k607L864k543j245M065k899k91
$$ 2253 -1843 315 1485 -2631 1345 1627 -2873 1223 742 -1865 1999 -544 -1789 2276 -623 -914
575i14K508l240J935J516m002K435R96k696K654j207j583L306j767q32J858k102
$$ -914 1594 -1646 289 1805 -2197 238 1234 -1462 1192 -15 -1598 1708 -59 -891 967 -1135
591a135J628P30l203K695M9k181L068k340j009M340l349o39L286l529J843J829
$$ -1135 493 1223 -1980 715 764 -1417 1651 -689 -1698 2642 -707 -1346 1940 -1589 254 2083
607B083m765L139J313l836L325j100k386M739k679j769L812k754O30K013l874
$$ 2083 -2682 457 1770 -2066 1259 159 -2227 2512 -167 -1936 1876 -878 -248 1765 -2109
622b109K455J248l206K688j329j217M069l628m35L807l947J724J838m973M039
$$ -2109 346 1594 -1612 1076 -253 -1470 2599 -1029 -1464 2343 -1604 120 1958 -3015 1024
637A024J005m761M066q88k428M538l282j195M372l444N23J967l673L221K89l615
$$ 1024 2029 -2732 1334 446 -1982 2556 -726 -1921 2451 -993 -470 1497 -2176 1045 1334 -2281
653b281L569j220j119L178l888J040L268m440K272Q48l738M743j484m010N750
$$ -2281 1288 68 -1051 2127 -1761 -721 2547 -1893 379 1227 -2511 2232 748 -3262 2488
668B488k459j857M601m722Q16M677n723J500K613m051L634o99l748M910j351k136
$$ 2488 29 -1828 2773 -1949 -1133 3544 -2179 -679 1934 -2117 1517 818 -2930 1980 629 -1507
684a507L205l378J499K902n099K283J556l295L837k077k750N654k864j805L978
$$ -1507 1698 -1680 -181 2721 -2378 -95 1461 -1834 2003 -74 -2824 2830 -34 -1839 2139
699B139l962J698L162n839K569K326m048L246r70k801M816k115j877L143k558
$$ 2139 -1823 -125 3037 -2802 -233 2093 -1955 1291 321 -2480 2336 221 -1656 1487 -1071
714a071J272J521l979K743P79k875L090j963j052M139l626k27L242l619J950J383
$$ -1071 201 1722 -2257 486 1265 -1610 1480 -483 -1535 2604 -1022 -1249 1993 -1626 324 1707
730A707m374L734L85l751L736j417j719M119l305o11L752l367Q71J703l439K843
$$ 1707 -2667 1067 1452 -2299 1437 20 -1699 2420 -885 -1496 2256 -1111 -240 1463 -1976 867
746H67K93l114L003q88j217K741k804L25K725l165J200R91k621K884o30k488L171
$$ 867 1160 -1954 1049 161 -1056 1685 -1119 -794 1931 -1234 -34 957 -1664 1220 590 -1898 1273
763A273j302r82K591k727O49K324l142J207J123k421K359m62k171K840j047j011
$$ 1273 -29 -1011 1580 -1147 -498 1826 -1316 -109 1014 -1407 952 490 -1681 1159 112 -899
779h99J944j893O43J488k390J160N81j564J787r56r20K259j600k38J565j903J029
$$ -899 1045 -848 -205 1283 -1107 53 634 -930 857 -99 -1019 1240 -360 -598 967 -936 93
796I3R56k377J672L77j797J842p97r71K157j399n48J688j378L83Q64j707J089
$$ 93 1049 -1328 344 721 -1076 766 -31 -1002 1155 -244 -792 896 -482 -99 765 -942 147
813A47M87j312J037m04m30J257j127j22J013r29N59J70j170J239n6j017J049n34
$$ 147 634 -678 359 -45 -475 782 -345 -467 546 -383 176 346 -824 415 359 -658 391 -143
831a43k23J097j037n1R59r07L02L13r04Q40Q8q28O51j35j69N02n84qO02n26K13
$$ -143 -366 731 -306 -357 602 -305 -3 310 -594 246 334 -494 157 22 -147 355 -229 -237 365 -161 52
852E2J7m24O69j75n30O03k53j57N40n51n9O92n24j36M90m09J78L24o64J09N05
$$ 52 69 -355 314 139 -391 212 -41 -198 342 -209 -268 424 -100 -236 254 -155 23 347 -317 -208 297
873B97l97m2K67k08N9K85l33j14M49k41j50J82j59J13K12l37n2L20o5j62j2N4
$$ 297 -100 -142 125 -83 -24 261 -72 -186 263 22 -128 54 -105 8 220 -117 -169 151 86 -76 -88 -34
895c4Q0O8j69j94L20J98m27oK94k35L09l2o50N72L31p29L10J43m02N54k10n00
$$ -34 46 114 -55 -249 71 269 -158 -164 130 -105 204 172 -478 94 425 -304 6 149 -253 301 91 -409
917d09O13J6k89R9k45K60K28n21J33J97j53L81m48q9O40m36j17K66l99M93P0p79
$$ -409 204 220 -69 30 -215 45 273 -248 -115 82 -71 310 -138 -227 413 -23 -140 126 -273 220 290 -489
939d89N28J46k90L40m94O7P15n57l23N00j94K11m3m73M90J06k28n1k20N64K5p14
$$ -489 39 185 -105 235 -259 -192 523 -34 -357 143 -51 160 117 -356 134 240 12 -39 -259 305 330 -384
961c84L51Q2j04M75o42l26J186n59n06N96m27M15L68j141M25P68p05J56j38k19
$$ -384 -33 49 -55 420 -222 -548 638 79 -427 169 -258 157 525 -616 -191 577 -128 28 -110 -329
981c29Q29l24p25N34J66Oj58m38N14K81l59j10l37O28M35r81KO42k49L44n61m71
$$ -329 500 176 -549 -15 151 157 -1 -439 75 356 -3 -113 -450 178 613 -368 -366 276 27 371 -190 -661
1003f61J193j58p27K45r5L60M14j059Q5R16l78j25k41n3P52k64n28J07J68N83
$$ -661 532 374 -353 -108 -203 157 571 -488 -403 513 135 10 -231 -284 468 204 -324 -217 -49 534
1023E34m06q70Q93K94o32L60o04R0J321j096o11J089k25j23J54q02P46N02q85
$$ 534 128 -742 151 445 -187 173 -431 -341 980 -116 -727 362 137 14 168 -634 112 614 -271
1042b71J2J00K81L28p53j29Q05j99j47k89r5R39l91o00L17l2N40n2j294R78P13
$$ -271 -259 -159 122 450 -303 -432 373 174 27 -262 -357 582 191 -409 -92 -124 416 364 -930 48 761
1063G61j112L53p3l80J333p05j252J332K03l80j01o05O67O51q23k72J38N21M83
$$ 761 -351 2 -71 -451 882 177 -1075 257 460 80 -21 -626 41 692 -131 -403 -265 256 739
1082G39j233k28J167k68l4l26n88J375P6j347M73O3L52N77j545M5J573p89k94
$$ 739 -494 -722 445 177 143 -183 -771 604 680 -667 -194 -131 221 798 -747 -702 871 82 -212
1101b12J83o15J217P8j508N80O10j36Op56K88Q95o00k35m5Q8R38q44o36R46j21
$$ -212 -29 -644 573 651 -857 -277 333 197 203 -553 -265 630 30 -205 -250 -162 776 -68 -704 242 121
1122A21K5n0q83J023M62j173M43j5p3Q14j037m16J463o06l67M54p38Q65K18j174
$$ 121 146 96 -787 236 698 -475 -32 -47 -120 694 -343 -759 704 98 -269 185 -553 312 530 -644
1142f44N99L13l07L70q02K13R57r32L3K59m41J038n98r89J357j16m79M70r09N36
$$ -644 -45 268 -39 331 -471 -258 699 -233 -200 59 -382 656 58 -931 426 310 -169 301 -608 -72
1162g2J009j488J64P60n51N69m73p08J291o8o51Q0k41P78J08j128N51J05l7O04
$$ -72 937 -551 -387 373 -178 391 -82 -790 501 433 -218 -138 -379 399 507 -621 -70 35 -2 602
1182F02j262J94J403j110j08M66p19J033J7j364R26K69m91M82q71K41J013r38
$$ 602 -660 -466 937 -173 -281 185 -534 499 516 -848 78 347 -144 338 -533 -292 721 -217
1200b17k0L58m23P82l51q60J034k05j45L58r14O77N20j144O57P2o59J088o84o47
$$ -217 -237 121 -302 480 129 -731 303 98 -47 311 -603 74 594 -550 107 179 -480 608 -76 -723
1220g23J378p38k84Q02q25L99M57r22M65K10m04M25m37P0N54p20L50J54n50P98
$$ -723 655 -83 -367 435 -390 9 466 -456 9 219 -185 240 -197 -127 427 -293 57 211 -339 459
1240D59n15n29J174o82j83P62r73N90O10j397P33L76r32R19l91o93J258n35m59
$$ 459 -56 -585 589 -93 -276 486 -487 103 713 -684 49 425 -507 412 21 -672 586 51 -408
1259d08P21n52L35K90r47O80Q7m27O83q22N0J038r69J21M40q77R56j5j089J035
$$ -408 313 -239 96 386 -561 119 206 -221 462 -360 -310 728 -241 -120 320 -557 399 384 -705 330
1279C30p0o27Q12p16j32J033q49o3N76n66M31qn29N58n9j30J57m75M39J11m78
$$ 330 260 -367 445 -271 -403 630 -219 -282 294 -272 159 151 -378 180 121 -9 148 -327 112 223 -255
1300b55M29k43j56P40p39p2P81p77L29L84r66P10J94q35O42j05m03P24m23j76
$$ -255 174 -69 -225 515 -224 -296 485 -292 37 421 -545 165 359 -476 166 61 -342 382 -41 -217
1320b17N11l95J30J15l37L53j00k38L97m33J67L16o27L84J87p06P52j62n19Q02
$$ -217 294 -101 29 144 -193 160 60 -178 219 -214 -47 269 -358 26 213 -493 259 97 -422 380
1340C80l39l67P06n39l0N82o37J49L94n28K22J42l16K88m9j87K55k08J33j03j55
$$ 380 41 -326 380 -159 -189 393 -244 -95 299 -229 -7 135 -181 107 58 -129 126 -82 51 -52 -207
1361b07L70k07j37L73l55R5L56n58K01K42l93K69Ll01L75n6j72J67j63J30J23
$$ -207 163 -44 -181 192 -163 -68 288 -270 -69 173 -220 49 52 -249 126 70 -102 65 -98 32 155
1382A55l98L07pj38L19m31O2L92m88J63L18o27N15J38p63O31J8n69P33l74l86
$$ 155 -243 64 57 -81 238 -193 -131 261 -227 -64 254 -373 142 280 -483 148 166 -403 330 -44 -430
1403d30R01m60l92O89l70m4L92m61P9L40l41Q0n1J0K49k73L9N7j58K98r8l40M77
$$ -430 471 11 -381 308 -62 -106 286 -175 -96 244 -97 -17 -68 -58 191 -82 -43 14 -144 154 56 -284 193
1426A93j16k16L71l62KN06n50L3M01m80K40K36n50L46O4l68L57r3j05K56k05J0
$$ 193 77 -139 232 -130 -128 378 -172 -139 262 -218 22 258 -292 54 118 -250 107 14 -91 165 -40 -30
1448c0L5p0J81k11p5L72k83k4L42n37L44L21p28M20J37n84O43j13o16Q00k21m30
$$ -30 5 -65 116 -95 -170 202 -81 -105 237 -300 44 365 -363 57 194 -390 253 140 -476 324 103 -327
1470c27O67m77r1O75o36kM60l87J62O4l45L67j4k53K04k09K11J61m97K79J65l56
$$ -327 340 -137 -228 447 -189 -191 269 -118 44 108 -237 130 116 -137 67 -142 69 230 -267 12 177 -179
1492a79L60k29k87P03l15l28M66l19J17K94o13K83L87m80J32P6l27M74j18l47
$$ -179 181 -48 -335 368 53 -275 191 -128 -11 283 -330 -47 340 -140 -8 68 -259 215 97 -250
1512b50L02p7O5O1l81L21J26k40J48k35R5N08o34p2M78l15J99Q2n89N25K27o28
$$ -250 52 -25 40 101 -280 41 167 -73 75 -160 -65 443 -191 -263 215 -100 99 181 -408 117 344 -284
1534b84L07k9j16M50m53k37O35k08r8O9l46M41J22m73J49K4J25J53n03J85L45
$$ -284 23 -6 -122 328 -125 -362 273 65 -33 36 -310 131 253 -220 -71 -47 78 231 -272 -87 258
1555B58l40J76r9l67P47k04n75N03j3j50L30m89O0M80l40j28J30p7L37k09k37
$$ 258 -82 94 -5 -372 375 171 -404 99 86 -64 266 -223 -163 317 -23 -151 -21 -98 239 30 -207
1576b07K63q6J29m6k19K93Kj68J08k24J33L21n15J10L81m20K23J5l99N52j5n84
$$ -207 56 -30 99 53 -166 127 129 -39 69 -155 -22 299 -216 -106 275 -145 78 93 -306 246 231 -353
1598c53M30N6j85K46l60J31K37k41N0j19O1L33m02rK30j54J90q4m55N67P1n17
$$ -353 77 133 -52 194 -166 -35 202 -39 11 -108 -47 286 -116 -125 105 -49 141 57 -398 169 240 -277
1620b77L58j21j20N38n01j86N94l12J4O8l75M40J13l82N7P2N8J76m17J74J53j66
$$ -277 81 -40 -160 378 -123 -309 285 -27 -13 55 -320 120 233 -149 -92 -20 38 214 -203 -29 124 -42
1642d2K01l73m4N99l94j57M70m67L17K51p58L36L84n68L68q1l06N38k54k09L08
$$ -42 159 -214 -258 341 -53 -210 260 -207 110 361 -397 -61 323 -245 123 42 -264 274 20 -189 119
1663A19j83J27j9k56K95l4j40K82l87R4L91n36J64L15m06K39nl92N26r5m01N23
$$ 119 -64 63 44 -212 83 49 -91 191 -196 -102 289 -247 -83 232 -174 65 60 -332 194 99 -302 221
1685B21k32j93M99m77K3M43m73P4K06k26K82r6k63K40l9M9O7l07L05J8k82K98
$$ 221 -11 -204 295 -182 -159 284 -189 -115 91 -135 147 51 -212 28 -11 38 105 -202 103 121 -161 137
1707A37j63j15L97l71o7L26k32N1J61l74K52J88l96J92O4j05K09k09r4K55o2l0
$$ 137 -26 -141 256 -115 -182 144 -88 -37 124 -250 2 190 -206 -14 50 -55 154 -55 -149 106 44 14
1729A4ro6R3j3q7J33j29R0Q6k61R7K19l42K13P6l75L51R0m02L08K8l15K55J9l17
$$ 14 5 -61 32 19 -68 65 -64 26 112 -149 -52 167 -175 38 114 -261 90 180 -222 86 114 -201 54 73 -244
1754b44L27m6k19K66n2j25J66j60L6J35q9oN8q6J12j26L7P2j51J53o7j03J68J6
$$ -244 83 37 -182 84 32 -93 73 -87 -51 84 -5 -11 47 -39 73 -53 -16 56 -95 58 -9 -112 56 72
1778G2j98K57j33r1K97k93q6L11j36q9K54k93O6K46k90O5J15j15P8j3o9MM9qq
$$ 72 -126 131 -2 -93 204 -89 -175 136 0 -89 165 -128 -62 184 -106 -41 74 -41 37 24 -45 -41 8 0 -8
1803hj11J89k0j07K12l37R3K89l06R7J47k35J79M5k91K39J1j71J09nj67K04J6
$$ -8 -119 70 50 -57 155 -182 -89 200 -106 -9 138 -97 82 127 -164 75 86 -85 24 19 -148 56 72
1826G2j78J62k9m3P1m3m9mQ0k1n5R1l6o4J53j42k1J44r3q7J37j02J1J74k11P3
$$ 72 -106 56 27 -16 55 12 -37 -41 39 18 -37 54 18 -46 107 -35 -56 88 -5 -92 45 -57 -46 128 -83 -10
1852a0P0p3j6Q8m8qO9r5O4k2LK7p4P8l0j01J73j06m1J38j12l0J49j36M6R4k22
$$ -10 60 -13 -29 59 11 3 72 -23 41 19 22 49 -25 53 23 -78 95 -11 -52 86 -26 -56 93 -43 3 97 -125
1879a25J60O9j46j4J45j54L4R5r8j3J08j37K4J17j09M2Nj9k9P7K7j11N9J03j77
$$ -125 35 104 -42 -56 89 -65 -31 64 -34 -47 61 -76 -52 65 -44 -2 3 -16 -45 32 59 -52 7 110 -67
1904f7J27j9j34J94m1k16K16Jj23J41r9k8J33j17kJ18j82J07M9j46Q5M1m0N0j29
$$ -67 60 41 -93 101 60 -156 60 61 -62 79 -20 -48 85 -32 -34 84 -98 9 58 -88 -3 38 -2 48 -81
1929h1J16kj13J27q2L4J47j90p1K69k28QK86m30K03K46m64K56J13k72K27o9k01
$$ -81 35 33 -80 47 -35 -1 146 -44 -115 154 -74 -66 220 -210 -7 239 -225 31 144 -128 99 30 -171
1952a71K48q1p6J12o8P1L0j12J06o9o5K37l05M7K92l47J81J17l84L43J6l19K48
$$ -171 77 -4 -80 32 -36 35 65 -47 59 -10 -75 162 -143 -96 196 -151 30 147 -237 106 122 -197 51
1975E1Pj79L21l02m7L35k51K6R2j76J96l4j70K30j91J10J08k67J26J41k16K23
$$ 51 58 -121 200 -102 -149 186 -65 -39 53 -123 73 39 -131 99 -92 18 126 -141 -15 126 -90 133
1997A33j61j74M02k54j30L29k23K1K73m16J80K42m15K10J9j94L24j03j79J86p4
$$ 133 -28 -202 200 -54 -184 145 -78 -57 216 -200 -20 222 -193 17 36 -158 166 63 -116 70 -4
2018dj00K18j41QJ03j30P2o5JJ86k14pJ49j16R1J9k24K27J9k24J69o6n2J93j62
$$ -4 -104 114 -27 -19 84 -46 26 -39 -38 148 -66 -73 76 -40 51 70 -154 73 92 -132 37 -29 -81 112 -50
2043e0LJ60j01l3Oo3O5K9q2J4LJ00J2j34L7O6l8M9j04J0J27l9j63J25K0j6J6j11
$$ -50 -47 113 12 -21 -15 -78 -13 16 -66 -52 -49 51 63 -71 -34 32 -6 43 -61 -51 76 37 -126 -1 19 3 19 -92
2071i2nJ91n1q4J7L5oK0j71O3J88q1op4M1N0P3k14O0J50q2n0m0M2J35j68j3K3
$$ -92 -97 94 43 -41 -24 11 5 25 -146 -83 105 24 18 -56 -15 35 108 -106 -46 104 22 -28 -68 -26 109 -59 -72 -49
2099d9KJ14p9j28J73Q1j76J36j72M1K13k38J7J88j21Ml6j13K49M0k66P8nP9J00
$$ -49 -47 67 -12 -140 33 114 -62 74 -98 -57 156 -82 -65 123 2 6 -30 -143 106 146 -120 -42 -47 32 132
2124A32j69r4J57K3n2p8L3J75q4j37J07n3J43j9k76J62J68j47%o1L4K27j71k23
$$ 132 -37 -131 26 49 -3 -81 -48 127 43 -94 13 -40 103 84 -192 -30 138 -9 -9 -70 -36 191 20 -203
2148b03K78qj9pk25K12Q5j60p2R6R0O1j90j9J60l3K4j25m7K93j53j98J35QN5N7
$$ -203 75 67 48 41 -184 28 113 -47 -119 -23 67 128 -62 -81 79 46 70 -55 -102 191 38 -160 -25 -17 38 95
2174I5k14NK37p3o2j3nJ66q5k01J15R2N5j28j40J94R4o8j59K4J42P7j72j08J79
$$ 95 -119 -114 123 50 -12 -25 -30 136 51 -150 -35 57 112 -16 -156 38 132 64 -95 -71 71 148 -24 -132 47
2199D7K1nj25p6K60O8l24P7R1j7J02k00q1K73k9q9o5N1P8R8k35k9J32P0o2j72
$$ 47 68 63 -62 -138 122 190 -134 -57 34 17 119 -81 -162 111 82 -7 -72 -21 57 155 -80 -109 23 93 31 -141
2225a41J14J32l6q2o1P9J46j26j36Q9R2k4m3j23J20J17j35p0J0R9O1j04j26J76
$$ -141 -27 105 69 -13 -74 5 151 25 -111 -22 70 46 3 -120 0 117 -18 -88 -78 21 82 -22 -148 28
2249B8L9k3j02K1J06qj28K5P3Q4o1k46J41J93j24l0l8j5J68rk34J31R1J9j54r2
$$ 28 67 44 -58 -37 69 61 -67 -42 31 115 54 -192 -51 142 18 -12 -50 -65 103 94 -140 -9 82 101 -53 -145
2275a45J74K2Rl7j50J43J59k51J9R9k7J08j54j13K29Pj74M1m2J20J34k66j2J91
$$ -145 29 51 60 23 -127 16 175 -76 -57 42 15 123 -31 -144 85 92 -82 -41 -83 37 171 -95 -107 84
2299H4m0m4l2o6J60L9j59L2K4M1J5j77R9M3j7j1p7J11R2j27o4J25j10J34m6j26
$$ 84 44 0 -32 -98 62 101 -58 -26 -2 39 54 -123 -24 19 2 -9 -86 25 117 -10 -74 51 -59 75 29 -97
2325i7J74Pj68P2n4P7M2q0k1M9K8J9j07N7R2j46M9ql9J58j49p4J75m6j5R0j49
$$ -97 77 84 -84 -12 -66 11 53 -27 -48 1 29 48 -59 -2 90 -56 -7 -15 -54 104 -45 -119 56 10 -5 85 -64
2352f4J11N4j91N8O5m6M9o2j7J26nm8n2n6J43L6k12J44m8N2M9k37J33J06j55J10
$$ -64 47 101 -90 -32 33 -13 36 -26 -43 83 78 30 -22 -78 65 101 -111 33 -15 37 86 -151 -18 88 -67 43
2378D3q2n7J85j14j03J98j12M7N2j67J16N5j17J10p1l9J76j69J1J35j69J74o9
$$ 43 -39 -96 89 -25 -128 70 -42 5 57 -110 6 61 -56 54 -17 -56 120 -49 -38 97 -72 102 33
2401C3j63J87o8j11K65j73p0K79k34LJ90k15L2M8r5J51l8j06J67j03k8Q6j77J46
$$ 33 -130 57 -11 -122 143 -30 -100 179 -55 -52 138 -77 -45 3 -92 59 21 -85 82 -21 -49 37 -140 6
2425FQ1j47J36r6r7J91j22l9J38j14O8N6j66J60N2k64K24k4q0J77j52m1J76j19
$$ 6 87 -60 76 -20 -117 74 -48 -87 51 -63 5 61 -105 55 107 -157 67 43 -37 140 -12 -53 123 4
2449Dl5J03j28J14l2j23N9R0p7J13j28jJ20r3M4Oo4J07k2j57N6J01o7O4q1l3J23
$$ 4 -31 72 -56 58 26 -97 -38 52 -25 88 -40 -41 79 -14 30 36 -28 79 57 -100 -44 57 -10 54 -27 -60 63
2476F3o1n3O4%l9M0n1L6O5p2Mj7j8R9k1q1P0p3P7J1o6M4Mo4P2rp3J53j58m1J84
$$ 63 2 -51 13 13 -26 14 -37 -1 64 -8 -4 -21 -39 60 39 -42 28 -45 32 43 -23 21 25 -39 33 24 -49 104 -54 -95 89
2507H9j23MJ16j22P3M7j37MJ06j21J04k2r2J80q2k6N8j16O2R2j74J09M9r9J06
$$ 89 -34 -30 86 -36 37 84 -53 -49 57 -64 40 18 -74 106 24 -2 56 -60 2 94 -80 29 78 -21 85
2532H5j01j05K36j45k7J27j55J09J24k95J40J19j85J22j8j12K55k17qJ46j57R1
$$ 85 -16 -121 115 -30 -57 70 -85 24 148 -147 -7 112 -73 49 31 -81 174 -43 -51 95 -62 29
2554B9mj93K18Lj35J04p1L8J34j72k0J69j67J01k1j70K44Rj83J65q7n8K05j74
$$ 29 25 -168 50 53 -82 22 -49 -11 123 -49 -69 100 -67 34 13 -157 87 96 -87 78 -9 -67 138 -36
2578c6l2K18k24O7M5j28J37Nj57J25Ml3P1j43L4J05j38Q0l1n3J74o4j68K20p4
$$ -36 -68 150 -74 -7 38 -90 47 52 -105 20 24 -9 62 -81 -47 58 -80 0 -31 -84 90 26 -142 78 4
2603Dn2J07j69P1J39j74K1O2p9K22j16k03K52q4n3O2m1N5P0j50oP5m3R4o3q1K02
$$ 4 -48 59 -110 -39 100 -74 -53 9 -70 152 36 -167 85 1 -52 10 -31 24 94 -56 -62 13 -30 64 1 -80 122
2630A22j35q3J60j17Q0Mj53J46J5j10J02p4o4J78j06k2J09m8L5K7j51R3M6j8l8
$$ 122 -13 -96 64 -53 27 31 -122 24 39 -71 31 -43 -107 71 -35 -57 52 4 39 66 -85 8 54 36 -2
2655bo3K9J15q6n9J00K9m1J3j27J72J7j51P3o8mJ82j94LJ08l8J1oj31J51k4r7
$$ -2 -65 -36 79 -7 -66 34 63 22 35 -92 80 97 -54 19 -49 -53 129 -65 -62 46 8 19 13 -118 33 9 -88
2682h8M6L9j0M3n9M0K5q9N7J1n5R7q0m3L9L6pO8j42O9K0l5Q6n3m0J02r3p0J07
$$ -88 -42 -3 -13 30 -29 11 36 -53 4 15 -40 57 -23 -66 -27 9 2 70 -72 -3 17 -18 68 15 -25 77 -16 -86 21
2711B1m8L1nk5M7J3o8J4l3M9J4j14J03M6q0Q6p4j05J66m2n5O3o3Q6L2j29MJ29
$$ 21 -27 4 -1 -26 21 34 -34 -20 -53 -4 10 -104 -1 45 -35 51 -23 -128 38 -4 -59 4 -59 27 59 -70 -66 63
2739F3j18Q9m7qP0p1m7Q5kj8Lk2Q1Nj25N4q1R9N9j08K2KPN2q0J5O7k9j2J3p2L5
$$ 63 -55 34 -13 -21 49 -22 -69 16 14 -4 -1 -23 58 63 -62 -8 -89 10 69 -39 -17 -15 -8 44 -36 -21 46 17 5 18 -54 -19
2771a9N8j00P4k9oP2l4n3J14o2o1N6j42J78j7j31R8J6m6J37j59K8J28q2j6K3j08
$$ -19 39 -61 13 -16 -22 50 16 -37 77 15 -46 10 -132 46 29 -102 -4 12 -34 103 -56 -28 100 18 2 25 -83
2798h3J75l0j03M0M2n4O9j34M1P4m3N4j4p7P7k2r3J35o5OR9j58R9K8m6l4k7l1
$$ -83 92 62 -41 -1 41 -13 56 -78 -37 37 -6 48 34 -43 34 12 -81 54 -11 -5 94 -64 35 63 17 -17 -44 -75
2826g5J43p2j13J69n9RL7l5nK7n1K4k3J8J6rl9O4Pn2O9j01M9M7j16Q6M1l3J3R
$$ -75 68 -4 -117 52 -7 2 39 4 -1 26 -25 -1 -24 -6 10 1 -38 26 33 -19 50 -51 -2 45 -71 15 56 23 36 45
2856D5r1P6j1o8O9k9j3O8p9N8R6j91P4j0p4J11l6q5J50m0m3K1k2L2M8r7L6k2Q
$$ 45 -46 30 19 -49 20 -9 -22 46 -33 25 121 -70 4 -6 -80 31 -5 -90 60 20 -23 -2 -24 8 56 -41 -5 -27 -19
2885a9O0m3l7K4K8n1K3l6O7L5o0j9N9q3J41q5o3R6o6%j2oJ5R8p4K8m0L7O4j15
$$ -19 41 -2 -39 -15 13 -38 -15 -51 16 51 -9 -28 31 -52 89 4 -59 37 -29 -29 -41 -47 -32 66 -8 20 -20 17 81 -34
2915c4m2O9K9m0jj5O3m2J0M6o3N4k1L3p5Q7k9r5J20q5L0L5j20J09k4l8R3n0k1
$$ -34 -76 -7 22 -18 -19 -34 29 -13 -3 43 -20 34 13 46 -29 58 29 -66 54 -31 -1 34 -86 23 -1 -39 54 4 -17
2944a7J4l2P7pq9Q8k9k7M6j4p0R6m5J0L5o5M5Mm7L4j1K7J0o2J7N2n4M5k3k6J0
$$ -17 -3 -35 42 35 -54 34 5 -22 24 10 -60 36 -9 1 36 -29 16 20 -27 7 -4 23 33 -29 -12 40 -14 31 8 -18 -8
2975hP3p3k6M3K8k0n6L8J9J1l2m0L1M1m6j1oM4LMml0QM6nq0Q6k1l5M3j2J1J6r1
$$ -8 65 -8 -34 9 37 17 -39 -1 18 29 -3 -43 -12 29 -17 -28 -34 10 13 17 13 -17 -9 37 32 -48 38 17 -18 25 13 24 40 -51
3009e1P3l5O7l2k6l1L6pPK9k5K1k0Mk8J9k4M0l7K6K2l0k9J9k0L3Rm8P7l1n2O6
$$ -51 22 -13 54 22 -4 -35 1 -6 1 30 5 26 6 10 -18 1 -23 17 -20 6 28 -2 -31 -12 -32 1 10 -38 39 8 -44 22
3041B2m8j9R5p1J3Kl0L5J1q1J03m3nO2p3QN1q7O3Mj4nL3j00Q9L5j01O7k0j4M9
$$ 22 -26 -45 50 -21 -8 -6 -36 -1 10 -71 32 -11 -16 46 -27 -19 32 -55 8 12 -2 -7 26 -74 15 50 -51 16 -4 -18 31
3072C1p0J8M8KqQr4M7N5n2K0m0K5L8Lr7J19n7l2L5k4L3L5n6j1JK7j0rM8J4m4p
$$ 31 -39 -21 27 29 21 29 -65 -18 37 -15 5 -35 -10 28 31 -66 53 -4 -36 -1 -25 8 43 -13 -24 -23 4 -6 -15 33 47 3 -4
3105dK0k1L1J7j15M8M3m5Q9p4k7J03n4o3Q4o0K3J3n0J02Jr0M2ro1J44o1q8J44
$$ -4 16 -5 26 43 -72 -24 19 -26 63 -11 -38 65 11 -52 32 -28 -5 8 -42 60 61 -29 13 4 -57 87 26 -62 82
3134H2m2p1Q7j53J09qo3J17n4j9O5n2o9J18j6n7M1n8Q6J0j25P6J7l5K8qo2J78
$$ 82 40 -31 56 -97 12 4 -59 58 4 -15 50 -2 -71 47 31 -26 15 -43 43 53 -72 4 21 -14 14 6 -56 122
3162A22j51KP7p1L1k3m3P9J1p6Q3q8J8Q3j69Q5O5p9O5lj09K04p6j36J15m3nJ47
$$ 122 -29 -27 50 -21 10 -13 -56 23 34 -42 41 -47 -29 54 -115 -30 35 -44 21 18 -91 113 37 -99 16 -27 -32 115
3190A15j58k4J09r2R0l3q6J60j09j01J90n9j3M5j50J23N7n2m3N3l2J4J5j28K10
$$ 115 -43 -67 42 -50 40 7 -79 81 -28 -129 61 2 -11 34 -116 7 64 12 -31 22 -10 4 19 -109 101
3215A01o4p2O1j03M3J02r3K2Q0j19J25qk03K40r6o9O9r6O4J14k05J00N2n2M7q8
$$ 101 37 -35 26 -77 -34 68 -25 -3 77 -42 83 75 -128 112 16 -53 16 -80 -16 98 -107 -7 45 -7 40 -48
3241d8p5K31j62j2J51j57J16k0j19N7J28j78Q7Or7J85p2q6J64j40P0O3k30J45
$$ -48 -123 108 -54 -66 85 -72 44 24 -95 -38 90 -88 -1 5 -92 93 21 -65 99 -41 29 92 -138 7
3265GR6j85O8N5p6J11r5o5J60j08L9nr7J41l9j07J09oNO0j65O0J08j04M1N0j11
$$ 7 103 -82 -14 41 -35 76 -19 -84 76 -32 7 2 -95 46 7 -100 9 3 8 68 -97 -37 71 -33 8 58 -53
3292e3J21o4p0J00n0L0N1j30K3J51j01k8L8n3J20q9n4J37l3r0J43j50QP8j26N1
$$ -53 68 4 -66 34 -16 14 65 -65 -42 109 8 -20 18 -35 85 -4 -58 79 46 -44 99 -51 -43 35 -91 -40
3318d0O5o0O2p9m7J68m9ll1j8N5K0j05N2J6n1P3n7PJ08j38oJ04o0J5J7n9N5M1
$$ -40 25 -35 27 -52 -99 69 20 17 -14 -32 23 43 -62 -10 6 -45 28 -29 -22 86 -52 -58 46 -14 1 18 -41 14 55
3347E5j23Q6m3J5Q5j10j1Q8m9M4n0m8J07j6m0O4j36N5J23r8m2N6k4L2L0q4P7k4
$$ 55 -68 18 -25 -10 75 -35 -46 42 -7 37 -13 -61 46 30 -10 54 -82 -27 96 -2 -44 12 -12 20 50 -34 43 19
3375A9r6J8J02p0K8j0K3M0q5P2l5n4R2k8q6J10m8j9J33j59J45k6l1k4j3l3O3r5
$$ 19 -77 -59 43 -27 1 -9 14 54 -31 41 6 -48 44 16 -70 40 -8 -27 106 -53 92 66 35 11 -2 -35 28 -67
3403f7N4L8m3K3j1j2mP7j17L7K0M0j0J5p5Q1J0r8Q1n8L2L5o2rP8j23J02k0J2k4
$$ -67 -13 25 -18 5 -6 -18 -22 55 -62 -25 -5 35 25 40 -35 46 56 -42 39 -19 13 48 -14 -23 55 -68 34 14 26 2
3433BQMK2m7n3J06m7n0P4j4Q0p4l2O8j00PM9m0P6q5ML6M1r2Q3j7l7O7l9pO3p8
$$ 2 10 14 36 -11 -64 42 -5 -55 19 5 85 11 -21 47 -53 -46 3 -37 39 -46 -42 -6 35 -57 26 9 -28 39 0 -7 56 -22
3465b2l1J09j19O5J1J3p1O1m1O4j2j01J21k5m8L7ql5J6N9pp1L9J8m2J3L4l8oM0
$$ -22 -53 56 -63 2 13 26 -45 16 -25 39 27 -74 47 22 -26 11 3 -32 -16 43 36 -35 4 22 -20 -7 27 -11 -17 23
3495B3j1n0M5m0L5k1K2O9n6o3M3M3n1N1l5K2jn5M1J4l2K8J6q1N5K2k3M4j04N1
$$ 23 12 -38 7 -33 2 -19 3 72 16 -47 -4 39 -12 39 4 26 25 -30 11 25 -7 21 37 -44 11 33 10 54 -50 1
3525Aj0l0OL8l2N9j2l3KNl0M7q9Q4N5o6Lj0J6OL3l4P3q2j7N5n3j3M6l2L0kq2J10
$$ 1 -9 -39 -33 5 -27 32 20 -13 -11 -6 -36 11 -78 6 61 -5 -2 -12 4 10 43 9 82 0 -17 38 -15 -28 18 -14 16 14 -68 42
3559D2%LJ1j08lJ26j05J1O1q3P7jr8J01o5j1P8%n9N7q3J7O8j7pJ5l3O8n7J3L9
$$ 42 42 45 56 -52 -55 71 -34 -23 38 -45 32 31 -67 34 -31 -42 36 36 -23 34 -49 -32 36 19 12 27 -6 62 5 18 57
3590E7j03N8L4q0L1mo4J69q6j17J45n8KK1k5Q9k0j28J09J19k25J32j5p1J12l7
$$ 57 -46 12 46 -34 -3 -7 -71 98 12 -105 40 -18 -16 5 -20 69 49 -79 30 149 -76 56 41 -30 82 45
3616D5o3M5jn1O5n2mJ6o6J14k0o4J34j26pR8q0Q0n7pj7L0o2N1j5K3M4j07O8L0
$$ 45 -18 27 26 -25 40 -12 -16 0 -66 48 28 -36 98 -28 -35 63 -17 63 6 -1 -18 12 -50 1 -14 9 53 -54 14 44
3646D4o2LM5l9Q8m6j35J52q0L6M2r9M3O6r8J8M5o2N6L5q9Q4o7n4J01l5NP7o4n2
$$ 44 -18 -15 30 -9 79 33 -102 50 -30 6 48 -51 -8 58 -40 -22 23 -39 17 52 -37 47 -20 -74 27 -8 -3 74 10 -42
3676d2Q1l5L9j1o0O0m3rO9o6J4M5q6P1L7n2j6L6j3j8k0rN7n9j8J02q7K3km6O2
$$ -42 39 4 43 32 -28 32 -11 -20 49 -17 -3 42 -44 27 64 12 -4 32 19 1 -19 -28 29 -30 -48 54 -33 -10 -12 -58 4
3707DK2J8k4j6lM2p8L5k6k5M5K0Jl8oN9nk2m8L0NK7K2o3N3N4r8Mm8M5QL2p0O2
$$ 4 26 44 20 4 1 43 -35 0 -26 -51 -6 14 15 -23 -29 30 25 3 -45 -15 -10 17 39 -24 29 83 -15 -11 -59 -14 -6 26 -44 18
3741A8K2r4J00m7j2M1o2O6n6l1N8lm3%N0JmJ1j3K5m8k4K1L4j1j2j2K6K4L0o9k5
$$ 18 40 -54 46 -1 -13 28 -34 32 -24 -55 3 0 -43 -43 7 8 4 15 2 27 -21 -45 -24 10 -1 -13 -25 1 25 55 -14 -39
3773c9J0J9L3LK8m3ok6L3l5M4l0j0K4J8K3n1RL6p1n2N8qQ4j7lq7N2oK0qJ0Jm0
$$ -39 -29 -10 23 26 54 11 5 -21 12 -23 21 -9 -19 5 23 46 -5 4 40 -31 -83 -25 -33 51 34 31 -56 -4 -10 10 2 12 13 -27
3807b7LJ3l4PP2l4j1K3p9R5L8q6N5p2K4K9k1J0Lo4L4N7j06Q5ll3O5q1ON5k1K0
$$ -27 -24 -11 -45 -38 34 0 -11 12 -67 28 66 -20 35 -37 -13 16 -5 5 8 -56 -22 35 -71 14 11 -22 43 -38 -32 23 2 22
3839B2Lp7Q2km3N2l8l6J13r2QL4m2M1po1Q9p6oM7pJ0K3p9nJ32r1KRp4O3j4j3J09
$$ 22 25 -52 30 28 -15 37 -1 -37 76 -16 -8 26 -16 25 18 -43 46 -30 -36 11 4 14 37 -42 -47 85 -6 -4 5 -69 -6 -20 -33 76
3873G6j51L4M4j6J2J3l5R5m1r6J08k7n6N4J0p1J24j08OK3Lj2L4m2J02o8j7J8j1
$$ 76 -75 -41 3 -13 -1 12 -23 72 31 -65 43 16 -40 14 24 -47 77 -31 -25 -2 1 -11 23 -19 83 15 -2 16 5
3902EK8J6n9K9lq2Q0k4PK1M2j01O6l1J7N7j10M0pj0J2P6q0KPj6L2o0M7N3r0N8
$$ 5 33 49 -10 19 16 -66 14 -10 -3 18 60 -41 25 -6 11 68 -42 -2 -9 -19 -7 69 -11 -9 -2 -18 14 -46 1 54 -36 22
3934B2j2m5P7p9J7Q3r8J7O8o5k2Q0n1QK7l2L7m7lK6l4j4J3LM3K7p9L4rL7j8jl6
$$ 22 10 -35 42 -37 -20 63 -35 -18 50 -15 -37 43 -8 0 27 -5 32 -15 -18 8 -26 -40 -27 -24 19 46 -33 1 -8 29 11 10 -26
3967b6J00q4K3m8L7kJ9n9J4N7p9Q3m3pK5j6J3L9qk3L4q5j5R7l4j3NlN0p1M2K2
$$ -26 74 -10 13 -35 2 0 19 -40 -26 31 -48 35 -8 -15 10 -6 7 46 38 15 49 -36 -51 46 12 -1 4 1 51 -20 22 44
3999D4l7K5m7l7K6K1j4L7m6N0N3m2n9N6nk1L5j4oj6QqJ0l9K6NJ6ml5K3N9o8N0
$$ 44 7 32 -15 -52 -26 -5 -19 18 -28 22 75 33 -26 30 25 4 39 25 19 3 11 3 13 -26 0 5 21 17 -18 5 64 -4 46
4032D6m2o6P8n7K4L0K6rm1l9P5j7n5K8K5m3R9j04mN4K0l0Jl3N3j3l2M7Ql4%j9
$$ 46 4 -62 16 -41 -17 13 39 30 -11 -50 25 8 -47 -19 6 -37 62 -42 -46 8 28 -2 -1 -34 19 6 -26 21 29 -5 -5 -24
4064b4J8k5L9L9j7n2Q1m1k1J2nmJ2p3J9M6j8K0J4m7O2k1qk0J8o1Q5j1L1n3N0p1
$$ -24 -6 -31 8 47 30 -22 59 18 -3 9 4 0 12 -61 -42 4 -14 6 20 -27 35 14 6 -14 4 -57 28 17 48 -5 45 -26
4096b6L0M8n9JK5On8K3K9n2R1m5Jn8M4M1qJn2J9kL9m9M5p4K4KK8k7M%M3o3K0O
$$ -26 4 52 -7 -6 19 25 -33 -10 19 -33 58 13 14 -44 0 41 33 34 -18 1 -1 38 -11 34 -40 -16 -14 14 -13 -9 -9 34 -29 -9 -3
4131cm8N4J3m8M2l1K9J2J2o3J8oN3m1mm7L1pO2K6o6J7l0Q8m0k3J1K4o2O7J4m5
$$ -3 -51 3 16 -32 10 -21 8 20 32 -31 -13 -19 34 -7 -11 -58 -27 -34 28 54 -12 5 -25 63 23 0 11 35 -27 40 54 9
4163Io7P4j4rqJ9PjOn8nL6kL7n4M5k3KL8rk4l2M8K2q2M6k3pP6m0J5K5l9j8Lk0
$$ 9 -58 16 2 -7 -15 4 11 10 16 -42 -47 -11 -13 24 -30 15 -8 -6 32 23 -1 -33 15 37 -45 1 -22 -29 47 7 22 47 8 -10 -7 -27
4199b7O3l8m3J8j8P5j5Jj3k6O3J1q4J8oj7L5qOJ8k2m1R0k3q4P0J7o3P1m7k2L0
$$ -27 36 -2 -45 -27 -45 30 15 16 3 -23 40 51 -33 -15 -21 -38 -3 -11 -5 13 -9 -50 40 17 -67 3 20 -43 28 -19 -41 -11
4231a1jrJ2m6P4k4k4M2K3n5O0mk5L1m1J5K9mrk5n8O2J6o2O2k1j6J1j3M2m8k9P1
$$ -11 -12 -21 -9 -55 19 -5 -29 13 36 -19 41 37 12 43 2 17 46 42 33 8 -50 12 28 -34 28 7 -9 2 -11 31 -17 -46 25
4264B5l0j2M3l3L2j1kJm2KM8j3MQL4o6J0j2nJ0J3L7j4m1LO5m3j7M1q7N2M3j06
$$ 25 -5 -17 26 -7 25 14 12 13 -29 -27 21 8 12 20 54 -12 -2 -14 -19 -9 4 41 27 -14 -11 54 11 -6 35 -52 0 43 -63
4297f3O0j4j3O1j3mJ9m0O1n3o4O6jk6M7l8m9R1r4L6N6n%k1kK2m9N7M4r9PP2j16
$$ -63 -3 -17 -30 31 18 14 33 -7 54 1 -63 3 2 -24 23 -15 -64 27 -67 -31 25 20 20 -1 -3 19 -30 27 71 -28 -21 51 -65
4330f5P5j2n7O6l1M8m0J7pL6o0P1k8j0n4O8l9Q5m6j9j1o4O0J5jqLj2L4k1M2n0
$$ -65 10 -2 -59 7 -24 24 -16 1 -6 30 -30 41 13 3 -51 17 -22 63 17 -2 -13 -77 -17 -2 -3 -11 -8 -20 14 -7 35 -15
4362a5J2K3j5q7R5qk2K0j0l6Q3p9J3O0m2k7J4lK6ln4Q1m2k9O4j1l1L6K8j3l1p
$$ -15 -3 20 5 -82 13 5 -17 3 -7 -43 40 -39 -26 34 -8 -35 -21 -24 2 -1 -55 26 -16 -45 19 8 -23 13 41 28 -3 -10
4394a0mR7p9Mk3K9lJ5n0K7mmj2pL3k3Pj0K8qQ0q4pL0k1K0m9L6n8N3nJ2J3k1q1
$$ -10 -14 83 4 8 -15 14 11 26 -24 3 -1 -5 -17 -24 9 -14 -7 -17 11 3 83 -1 -8 22 1 21 -28 8 -50 3 -2 10 23 2 -79
4429g9N0k4O5k2m0O6l9M2nj2J1j0k9L8j1j2M2m1L4o1j4M1K0l4JK0K6rqrkkj8j3
$$ -79 -29 -53 12 -10 -50 16 -23 19 14 2 13 3 -26 12 1 -11 31 -10 24 -37 -51 -10 10 -24 -23 -3 23 14 6 -3 -5 -7 -25 -38
4463c8K6M0m3m7K7L4m7N0j7J8J7l6N5m7l1KM0J3q1P8p6O8LJ1j0K5o0O0j4n1Q1
$$ -38 -12 28 -15 -62 -35 -1 -48 2 -15 3 20 -16 39 -8 -39 -37 3 16 -65 13 -63 5 8 19 9 34 -26 34 20 -31 50
4494E0l7J1Ml1K8m9N0J6m6l2J0J0j1P1q0N9ok0K7Ln6L4k5K2j7M1Mk5o9O5On9R1
$$ 50 13 24 28 -3 25 -24 26 42 -4 -36 -26 -16 -27 44 -36 23 17 -3 24 27 -29 5 -20 2 -15 26 30 5 -64 1 7 -52 39
4527C9k2r2O7MK0l2K1j3K5m2J1J1K1l3P0p2N2kk8L4Kn5pl3KL1K5J4k1k8M4K6n5
$$ 39 17 -75 -8 -4 16 -16 5 -8 17 -25 -14 -3 18 -15 55 -17 35 33 5 39 41 -14 -21 -54 -52 -21 4 18 -3 -31 13 39 -16
4560a6RN4pn5nN2n9nM3q2N9L0n0KN7n9N1n8O1km1K9Pr1L7P5K5j28J31q2L4J8l1
$$ -16 -7 47 40 -15 -20 32 -27 -32 11 -71 -12 18 -32 -30 27 -32 19 -39 22 20 -21 8 15 -76 -39 36 61 -67 64 -18 16 34 3
4593Cn2N6o6P3k6j9N3k1m0L5k5OL3K2oj3MQl5p0J30r8k2J10k1K5mm0QK8n3L6l
$$ 3 -49 7 -59 14 -12 -31 22 1 -39 -4 -29 -23 10 32 26 13 17 25 -10 -80 50 -48 -70 40 19 44 40 0 8 36 -17 19 16
4626A6m9N7l7K4O4j07K8J4j7J3J9k7P1o0l9M8j9k5L8n7R7k0r6O5O1r7M0j9L2o
$$ 16 -33 24 -13 11 75 -32 -4 10 -7 6 25 -2 69 9 -30 18 -1 -26 12 -45 52 32 -64 1 62 -35 5 -14 18 12
4656A2pnk7P2n0Km7O3Mm3M4m7m4J13j1k4M9q8P5jm0j3Nj7M5o7pP0n6N9nlj6j1
$$ 12 5 0 -27 45 -5 -3 -50 13 17 -26 18 -29 -73 40 29 5 54 -34 41 40 0 -13 -8 -25 20 -47 -54 16 -40 19 14 11 -5 -16
4690a6J5K8Pool2lQ1oj07P1m8qK1N7k6J2j8J9k9N8l8l1J3J6o2OM3n6R5o4k5J0
$$ -16 -1 27 34 28 22 -10 -13 68 62 -45 26 -22 -30 -9 48 22 34 16 35 6 64 26 -5 8 24 -38 -32 11 -45 50 -14 -39 -29
4723b9L0m5K4J6oM2L0q2pJ0N3qLo0j7M8qK4k8L3m9M0n7Q7rj6j3RMj6L0j5l9L3
$$ -29 1 -44 -20 -4 -10 32 62 -20 -27 -17 36 28 31 -29 -46 2 -6 18 -10 23 -26 14 -43 44 35 19 6 15 19 3 33 18 -21 12
4757A2J1j2J9o1J0J9J3Oj1m0M2K4l2N3l6MRml0K0nj5KN3k4k3J6k4kMK0pj1On8
$$ 12 23 11 30 -31 -21 -2 11 17 6 -34 8 32 0 53 17 21 30 26 -4 16 11 -4 -2 51 27 4 20 -4 -6 -2 18 11 0 6 -52
4792e2Q4o2O4k6K1j5l1O5n9J0K0k2J0n9O0K7OJ7m5k3OJ7m5M3L4o9j5L9kj6k6O4
$$ -52 32 -30 34 8 29 14 -17 48 -11 -1 19 -3 7 -52 8 35 41 58 13 -10 -4 13 -32 11 45 -24 -39 0 -2 -18 -44 20
4824B0n6L9L8km7L1l2rQ4p4J4J4%k9J0l6QJ4nM9jl9J3Oo5LN1J1Rk2j6J2pL2m8
$$ 20 -36 3 41 39 -8 23 -9 -18 66 -8 6 20 20 -9 1 -35 -27 -13 -18 31 30 -9 4 10 -55 -52 -1 10 19 -3 -19 -7 -14 18 -30
4859c0j9K6N6Rl9L1k2l0L3l8J6m5O7nj0N4j16P1Jj4MK4K9o2K7m7J5Rk2N6k9k4
$$ -30 -49 -23 33 42 3 34 12 -18 15 -23 -7 -52 15 10 0 54 -62 9 10 -4 0 24 53 -9 18 -29 -14 -5 -27 29 0 -24
4891b4j0M8nj5l4O0K8m5k0m1P3k6J4K0qm8mO7j8l5K8l8M0K8n0J1J5%m2L0NQ8j00
$$ -24 -34 14 9 -6 -40 20 48 3 -17 -58 15 -11 3 23 15 -33 -37 30 12 -23 5 -33 7 35 -15 -4 11 11 -31 -1 4 92 -8
4924hP2o7J6l5J3J2o6J00m2L1O%l5J7K2l9J3Rk6j9J0L0l9L8j5mj1mK5qjN0l7J8
$$ -8 64 -3 13 -22 -9 3 -63 37 -5 26 32 32 -3 14 36 -3 10 19 -7 -26 -16 14 -25 13 -2 -6 -17 -21 4 -4 -5 45 8 26
4958B6J7m5KLj8N9q1J3M5k7mJ4L9lk6l9N3J1n8J1mJ5Jl7J4lP8o1k5L0Mm9O9l8
$$ 26 43 -2 0 3 -15 44 -37 -24 21 -6 -10 4 43 40 14 -25 28 39 -19 -8 -12 3 4 -33 -19 -22 56 -5 -30 0 4 -45 24 -14
4992a4P1p9R9m3j08R9j0KJm6M9K4l8j6J1pJ4jkL5n8M9m3JM8j9J0Kk8l3Q3p5Kj3
$$ -14 57 -22 77 34 -74 25 15 17 18 -28 21 45 7 -9 2 -5 9 8 6 41 -17 32 -11 -10 38 19 29 31 3 -30 53 -22 -20 -33
5026c3P0o9N7l3K1L4n4K9m4k6O4k4J6qn1M8K5K7m8L7Jn1LnO0J8m7j7j6L4Krl7
$$ -33 37 -32 25 -8 13 47 -7 22 -22 -48 16 -8 8 0 -51 -3 22 49 1 38 39 -12 -9 -14 46 64 17 0 -16 18 20 11 -26
5059b6K4N1l8k6J6kK1LL4m5J3l3K0ROrj9K0n1N0NRj0l9J7oOKJ3m4pN5l9Kj4L5
$$ -26 -2 49 11 -15 1 -1 20 23 57 12 25 -8 12 21 27 18 -1 19 -32 18 23 32 22 -17 0 -6 0 2 15 -29 -36 19 -20 -18 -32 3
5095Ck6J9m9N3Pk6N4j3k9qK0m6L7K7k1mm0P9Kk8J9n8K3M1k7mjJ6J9q3P6l2K9p
$$ 3 -23 -4 -53 0 7 -19 35 22 -7 -15 5 -41 -4 23 2 -2 -42 37 39 11 30 -28 -5 36 9 5 4 20 39 -44 32 0 29 22
5129B2p2O7l1QnM8Mj9j8l0jO0n5J7j1K6l0K2J6k2J1J5m7j2M5j9l4Q8n1m5J2L4
$$ 22 -50 17 -14 -6 -11 37 41 22 4 -26 -27 33 -22 -5 -16 10 -20 2 18 -4 7 22 -25 -37 8 -11 -45 43 -8 -53 -41 -7
5161gl5mR3l8k0l7L8J1MN8l5n0K4PJ9jl3N0l1%l5K7k7K4L7No9j7K8K7j6J7k6J4
$$ -7 -42 -46 47 9 -11 -48 -10 1 5 63 28 -22 2 9 28 27 -6 44 13 13 -22 5 -22 2 39 44 -25 -42 -14 13 -3 14 -12 2
5195BL8j2n5%K7j1M9r0O8L7p4j0L9m7M1j6M2k9K0n%K8p6N8o2L8O6j1r4l5N1O1
$$ 2 40 28 -27 -27 0 -11 38 -52 16 53 -21 -31 8 -39 2 -14 28 -1 19 14 14 42 -34 24 -38 0 66 55 -39 -74 -23 38
5227C8Kj0j1l1N1p0k1N4L8o1N8Kq3P0j7rJ7j7k0J3k2qOj7k2R8m6Q2o6N8Po1K9
$$ 38 40 30 19 -12 39 -31 -52 2 40 -21 37 39 -44 26 9 0 17 0 -20 -7 -29 -37 -31 -48 -70 28 -18 64 -2 56 63 2 31
5260C1ol5J0M3m3mk1N8n0P5p6O0l9l2O9J6j12O9j01R1K3k2kJ5l0Rl6P6l4k5j5
$$ 31 25 -10 0 43 0 -4 -25 33 -17 58 -18 42 3 -29 40 56 -56 13 -88 3 26 4 2 17 -13 -4 -40 36 2 -23 -38
5291c8N8l5j5Qj0L8m0Q2m1l2LJ7k5O9k3j6lj3M8k8J6n9N1j5L1Lrj2j5j4J6k7J9
$$ -38 20 -15 -30 -22 -32 6 -34 48 7 -25 -22 -5 -30 39 16 0 -3 -16 32 4 20 -39 12 -3 28 31 22 10 -5 -19 -3 -30 -11
5324a1Ml8L2K0k9K6J8qN1n1l0Q1k1l6M2m7RL0j4k1J8J4l2j4QjJ5m8L6oJ0oj9M5
$$ -11 -7 -45 -13 7 -22 4 22 14 65 14 -16 65 44 8 50 3 12 42 28 7 25 39 7 -7 1 0 15 -33 3 -3 7 1 -18 27
5358B7j7m1j9O6j4J4k3o7N7j1K4L3m7rJ3m6O3o1P7j6L8n1l6P1k7O2n2M3q7K5k
$$ 27 10 -31 -50 16 2 16 -7 -74 -17 -28 -4 29 -18 -27 -14 -60 3 -58 19 3 41 -10 -46 25 -2 60 8 51 -36 -11 -13
5389a3P0o9l0N8Mj%l9K9Jm7L0K8q0R3k1J8j1o5Q0m5k6JM0PlkL4o5K7K7o0L4l3
$$ -13 57 -12 -42 16 20 19 19 -20 9 10 -37 -7 21 -59 34 13 31 20 -45 35 -10 -36 -35 5 12 9 7 41 -24 3 30 -30 4 -29
5423b9L6k2K3k6L4j8M8n8k0O0j7LKN0l9K4l3j1k2M0j5J7m7N4n3m8Q8j4j5n9N5
$$ -29 7 -15 8 -18 16 -2 46 -12 -32 28 11 14 16 66 27 51 18 7 -15 25 10 27 -20 34 -19 -67 21 7 -8 -67 -12
5454a2K5k7K8PP6q0Kk5K1l2L9n3O1pm7K7k5j6LK9J5OKQnM1k0nK9j20P5M6k0ql0
$$ -12 13 -14 14 21 97 17 19 -6 15 -17 22 -31 30 23 -24 3 -22 -38 -35 -6 9 15 17 25 20 61 41 36 65 -55 20 66 46 38 8
5489HK4k2l1M9k4Rj1J8n3P1n5O2o6N8Qn8J8J3l9k1J0OnmK1K7k6J5J4m0P3Rq4M7
$$ 8 32 10 -21 28 4 13 2 20 -33 38 -17 45 -21 37 45 -13 5 18 -21 -42 -32 -26 -31 -35 -14 13 -13 2 16 -24 49 58 -26 21
5523B1Ml7M3n2M0L6m9k7L7m4L5J4l2j5K2JJ0njl7N1J9jk8k2K7j2J6m5N0M3o0k8
$$ 21 25 -12 31 -21 19 55 6 -21 16 -28 7 21 -11 -26 -4 -3 7 2 1 -36 15 34 33 5 -17 10 -2 14 -31 19 62 2 -26
5556b6PM6LL4j6m9k0M4j0J1j4k4jL8J6m8lO9m2mj4l6M5pl5N3J8n3M5o6P5o8P3
$$ -26 -19 27 30 64 48 -1 -21 23 13 24 10 -14 -15 23 39 -9 -12 57 15 11 -3 -39 6 -1 -36 17 35 -18 27 -39 36 -32 41
5589D1r6P3o7P1m6RK6j7lJ0j8J1L0j8k9N4l0k5L9k4NK6m9J5M4j6j4o1Q6J3p7k5
$$ 41 -55 18 -49 22 -24 -15 11 -6 -9 1 -17 -6 24 6 -23 31 1 -24 15 -9 -4 22 -27 -12 32 16 2 -59 27 40 -37 -62
5621f2J14l8j6K3p4R5Jo4K7m6K7K0l9K8rpj1KM1J9j6nj8pO6q6j6P9p1J7N7m7L
$$ -62 52 14 -2 21 -53 42 43 -21 6 -40 -13 7 -32 -4 -13 -20 -31 -29 12 31 15 10 -8 -15 51 -35 -51 28 -43 -26 31 -16 -13
5654a3Lj2K9J3Jm8PN5qQm4L1j7m6P7p6O7P2q8jQJ3PK5p1nkJ2M%O5q2M2J7q6K7
$$ -13 -10 -22 7 20 21 -27 -20 35 27 35 -9 22 5 -41 36 -40 27 99 11 10 18 31 38 63 -8 -13 -15 -3 1 1 66 -16 26 43 -43 -16
5690a6JM2j3l9k8L3P6l0k9lO1o4K0l9J3k3M4jNn5O9j7j9jJ4qJ0J2l3L0J2pk6K9
$$ -16 -15 27 14 -25 -53 -20 56 26 -3 -6 55 -9 11 -28 -15 -38 6 5 10 -45 24 7 -12 -13 1 -7 3 15 -18 12 24 17 -9 20
5724B0m3K4%K8J4m7K9k5k9j1J5j8K1O1l4Kk6J8L4m8j3L4J4k8o7P3J4m1L6Kj2l1
$$ 20 -23 1 1 29 43 -4 25 0 -29 -40 -25 -43 -22 39 5 7 -19 -1 33 -15 -28 6 20 -8 -75 -2 12 -29 7 9 -3 -34
5756c4K8%m6k6R0J3Qq4M4j1N2m2PjK1m5J5M5m4L9j5Ml4O1o0J7J9Po9rJ6j2M6L0
$$ -34 -6 -6 -52 -78 12 25 33 -51 -7 -18 34 -8 -1 -2 19 -26 -11 34 -10 29 14 18 -16 45 -15 2 21 28 -41 -50 -34 -46 0 30
5790C0n3l0O9J2j6Q1j21L3j2qL8n4oJ5K2L9m0L0k9N1o2K5j4JM7n7P8J5p4m5M0
$$ 30 -23 -53 16 28 12 93 -28 5 -7 -15 23 -31 -37 -22 0 39 -1 29 0 51 -11 14 0 1 48 -9 69 84 10 -35 5
5821Ek0N7l0J9K0m8k8J7Jjj8K1KNPJ0L2m7k8O1n9K4pL9j2Nl1L8o7J4N9n8L9k7
$$ 5 -15 42 12 31 51 3 -25 -8 -7 -8 -26 -5 -3 2 9 19 51 4 -24 37 -22 2 -5 34 22 27 -4 34 -33 -19 40 -18 21 -6
5855fNM7l7oNk2N7p0JO0o0L1L2J0l7K3l1J8r4L5O1k5J6l1j4K4N2p3RK2L5p5M4
$$ -6 -1 46 9 3 8 -14 43 -27 -26 34 -26 5 37 47 10 33 2 20 -74 -39 22 -3 13 -18 -32 -8 44 -29 -20 2 37 -38 6
5888FK3j5l1L2K2Lp2M5K3j2l1L8n7K3K8n3N3ml0k4M9p6K2M9J2k5rk6O0l6k7k6
$$ 6 29 14 -17 15 37 40 -32 13 36 24 -7 31 -26 -3 25 -28 25 21 -9 -33 16 -60 -38 11 23 -2 -11 -37 23 -13 -40 -66
5920f6J15o9kP3p5l0Q2l2J7Rl4kO8l4K9m1o1Q4j2l8jN1o2M3K5m9J5J3j4l6K2L0
$$ -66 49 -20 -22 51 -24 -54 28 -4 13 22 -12 -14 54 20 49 8 -53 31 19 -19 -20 31 -31 12 37 -12 3 16 2 -34 -12 18
5952A8k5M2o3L1K4m8j9P3k2J5mok6QJ0L0m9Kk6N1N3j03O7j4l3L5Ok8P2m9nK2o7
$$ 18 -7 35 -28 3 27 -21 -40 33 11 26 22 16 -10 -2 8 38 -11 -9 -35 16 69 -34 33 19 -14 21 27 -1 71 22 17 39 -28
5985b8P4q4M8Om4N1k2L7pkRk2m1K9m3J7L4j7J9qM0k2k8j2L5K8p7Ol1L2QO1p1%
$$ -28 46 -38 10 16 -28 23 1 38 31 29 38 16 -25 4 -39 -22 12 -5 14 6 46 24 -4 -16 19 47 -30 -24 -55 -23 -15 46 -25 -25
6019b5K6L9oJ3n2L9j9L2j6k7K8k1l0J4J7mK3po9N7k2%k5j4M8oJ1J0j2k6J7qN1
$$ -25 1 40 34 47 -5 34 15 47 31 4 32 11 -19 -5 12 8 31 24 -45 12 -10 -10 -35 -49 -1 -7 4 14 2 -24 -7 -15 36
6052C6ok2m1RK4mP7m7rKrPLJ9m8k0J9K1L7n2L2l5jM3j9M2j7m7QJ8Po3L9J1n2O4
$$ 36 30 8 -33 -24 0 -4 73 26 17 19 10 17 20 39 -9 -29 -10 11 48 -4 28 -7 -8 35 16 58 41 -6 2 20 27 -36 3 14 -38 26
$$ [...]
8191c4
##END NTUPLES=NMR FID
##END=
