##TITLE=1H_LR-758-R5-3HS-FR1
 CCl4
 8 sc, 
 5.9.2023
##JCAMPDX= 6.0         $$ Bruker NMR JCAMP-DX V2.0
##DATA TYPE= NMR FID
##DATA CLASS= NTUPLES
##ORIGIN= UXNMR, Bruker Analytische Messtechnik GmbH
##OWNER= root
$$ XWIN-NMR		Version 3.5
$$ Wed Sep  6 13:58:32 2023 Russian Standard Time (UT+4h)  she@DPX200
##.OBSERVE FREQUENCY= 200.13135
##.OBSERVE NUCLEUS= ^1H
##.DELAY= (6, 6)
##.ACQUISITION MODE= SIMULTANEOUS
##.ACQUISITION SCHEME= undefined
##.AVERAGES= 8
##.DIGITISER RES= 18
##SPECTROMETER/DATA SYSTEM= spect
##.PULSE SEQUENCE= zg30
##.SOLVENT NAME= CDCl3
##.SHIFT REFERENCE= (INTERNAL, CDCl3, 0, 15.7039)
##AUDIT TRAIL= $$ (NUMBER, WHEN, WHO, WHERE, WHAT)
$$ ##TITLE= Audit trail, XWIN-NMR		Version 3.5
$$ ##JCAMPDX= 5.01
$$ ##ORIGIN= Bruker BioSpin GmbH
$$ ##OWNER= she
$$ F:/spectra/data/she/nmr/H-F/1/audita.txt
$$ ##AUDIT TRAIL=  $$ (NUMBER, WHEN, WHO, WHERE, WHAT)
(   1,<2023-09-06 13:57:08.45 +0400>,<she>,<DPX200>,
      <created by zg, POWCHK disabled, PULCHK disabled
       configuration hash MD5:
       00 E9 B6 7A A2 85 ED C7 34 08 36 98 17 FE 4E 26
       data hash MD5: 16K
       2B 4D 64 F0 F5 1C DD 05 C1 E7 F0 25 09 B5 EC 41>)
$$ ##END=
$$ 
$$ hash MD5
$$ 8D ED 28 01 D7 39 DA 67 76 D4 06 30 A5 EF F8 DF
##$RELAX= 
##$RELAX= 
##$RELAX= 
##$RELAX= 
##$RELAX= 
##$RELAX= 
$$ Bruker specific parameters
$$ --------------------------
##$DU= <F:/spectra>
##$EXPNO= 1
##$NAME= <H-F>
##$PROCNO= 1
##$TYPE= <nmr>
##$USER= <she>
##$AMP= (0..31)
100 100 100 100 100 100 100 100 100 100 100 100 100 100 100 100 100 100 
100 100 100 100 100 100 100 100 100 100 100 100 100 100 
##$AQSEQ= 0
##$AQ_mod= 1
##$AUNM= <au_zg>
##$AUTOPOS= <>
##$BF1= 200.13
##$BF2= 200.13
##$BF3= 200.13
##$BF4= 200.13
##$BF5= 200.13
##$BF6= 200.13
##$BF7= 200.13
##$BF8= 200.13
##$BYTORDA= 1
##$CFDGTYP= 0
##$CFRGTYP= 5
##$CHEMSTR= <none>
##$CNST= (0..31)
1 1 145 1 1 1 1 1 1 1 1 1 1 1 1 1 1 1 1 1 1 1 1 1 1 1 1 1 1 1 1 1 
##$CPDPRG= <>
##$CPDPRG1= <>
##$CPDPRG2= <>
##$CPDPRG3= <>
##$CPDPRG4= <mlev>
##$CPDPRG5= <mlev>
##$CPDPRG6= <mlev>
##$CPDPRG7= <mlev>
##$CPDPRG8= <mlev>
##$CPDPRGB= <>
##$CPDPRGT= <>
##$D= (0..31)
0 1.2 0 0 0 0 0 0 0 0.06 0 0.03 0 0 0 0 0.0002 0 0 0 0 0 0 0 0 0 0 0 0 
0 0 0 
##$DATE= 1693994227
##$DBL= (0..7)
120 120 120 120 120 120 120 120 
##$DBP= (0..7)
150 150 150 150 150 150 150 150 
##$DBP07= 0
##$DBPNAM0= <>
##$DBPNAM1= <>
##$DBPNAM2= <>
##$DBPNAM3= <>
##$DBPNAM4= <>
##$DBPNAM5= <>
##$DBPNAM6= <>
##$DBPNAM7= <>
##$DBPOAL= (0..7)
0.5 0.5 0.5 0.5 0.5 0.5 0.5 0.5 
##$DBPOFFS= (0..7)
0 0 0 0 0 0 0 0 
##$DE= 6
##$DECBNUC= <off>
##$DECIM= 32
##$DECNUC= <off>
##$DECSTAT= 4
##$DIGMOD= 1
##$DIGTYP= 9
##$DL= (0..7)
0 120 120 120 120 120 120 120 
##$DP= (0..7)
150 150 150 150 150 150 150 150 
##$DP07= 0
##$DPNAME0= <>
##$DPNAME1= <>
##$DPNAME2= <>
##$DPNAME3= <>
##$DPNAME4= <>
##$DPNAME5= <>
##$DPNAME6= <>
##$DPNAME7= <>
##$DPOAL= (0..7)
0.5 0.5 0.5 0.5 0.5 0.5 0.5 0.5 
##$DPOFFS= (0..7)
0 0 0 0 0 0 0 0 
##$DQDMODE= 0
##$DR= 18
##$DS= 0
##$DSLIST= <SSSSSSSSSSSSSSS>
$$ [...]
##$SUBNAM2= <"">
##$SUBNAM3= <"">
##$SUBNAM4= <"">
##$SUBNAM5= <"">
##$SUBNAM6= <"">
##$SUBNAM7= <"">
##$SUBNAM8= <"">
##$SUBNAM9= <"">
##$SW= 18.05172834244
##$SWIBOX= (0..15)
0 0 2 0 0 0 0 0 0 0 0 0 0 0 0 0 
##$SW_h= 3612.71676300578
##$TD= 16384
##$TD0= 1
##$TE= 0
##$TE2= 300
##$TE3= 300
##$TEG= 300
##$TL= (0..7)
0 120 120 120 120 120 120 120 
##$TP= (0..7)
150 150 150 150 150 150 150 150 
##$TP07= 0
##$TPNAME0= <>
##$TPNAME1= <>
##$TPNAME2= <>
##$TPNAME3= <>
##$TPNAME4= <>
##$TPNAME5= <>
##$TPNAME6= <>
##$TPNAME7= <>
##$TPOAL= (0..7)
0.5 0.5 0.5 0.5 0.5 0.5 0.5 0.5 
##$TPOFFS= (0..7)
0 0 0 0 0 0 0 0 
##$TUNHIN= 0
##$TUNHOUT= 0
##$TUNXOUT= 0
##$USERA1= <user>
##$USERA2= <user>
##$USERA3= <user>
##$USERA4= <user>
##$USERA5= <user>
##$V9= 5
##$VALIST= <valist>
##$VCLIST= <CCCCCCCCCCCCCCC>
##$VD= 0
##$VDLIST= <DDDDDDDDDDDDDDD>
##$VPLIST= <PPPPPPPPPPPPPPP>
##$VTLIST= <TTTTTTTTTTTTTTT>
##$WBST= 1024
##$WBSW= 4
##$XGAIN= (0..3)
0 0 0 0 
##$XL= 0
##$YL= 0
##$YMAX_a= 184227
##$YMIN_a= -258920
##$ZGOPTNS= <>
##$ZL1= 120
##$ZL2= 120
##$ZL3= 120
##$ZL4= 120
##$ABSF1= 10
##$ABSF2= 0
##$ABSG= 5
##$ABSL= 3
##$ALPHA= 0
##$AQORDER= 0
##$ASSFAC= 0
##$ASSFACI= 0
##$ASSFACX= 0
##$ASSWID= 0
##$AUNMP= <proc_1d>
##$AZFE= 0.1
##$AZFW= 0.1
##$BCFW= 1
##$BC_mod= 2
##$BYTORDP= 1
##$COROFFS= 0
##$CY= 11.3945322036743
##$DATMOD= 1
##$DC= 2
##$DFILT= <>
##$DTYPP= 0
##$F1P= 15.7292609196834
##$F2P= 12.9074282941183
##$FCOR= 0.5
##$FTSIZE= 0
##$FT_mod= 4
##$GAMMA= 1
##$GB= 0.15
##$INTBC= 1
##$INTSCL= 1
##$ISEN= 128
##$LB= 0.24
##$LEV0= 0
##$LPBIN= 0
##$MAXI= 10000
##$MC2= 0
##$MEAN= 0
##$ME_mod= 0
##$MI= 1.114404
##$NCOEF= 0
##$NC_proc= 0
##$NLEV= 6
##$NOISF1= 3.799351
##$NOISF2= 2.8
##$NSP= 1
##$NTH_PI= 0
##$NZP= 0
##$OFFSET= 15.70392
##$PC= 1
##$PHC0= -21197.63
##$PHC1= 7.65271
##$PH_mod= 1
##$PKNL= yes
##$PPARMOD= 0
##$PSCAL= 0
##$PSIGN= 0
##$REVERSE= no
##$SF= 200.130013532006
##$SI= 16384
##$SIGF1= 3
##$SIGF2= 2
##$SINO= 400
##$SIOLD= 16384
##$SREGLST= <1H.CDCl3>
##$SSB= 0
##$STSI= 0
##$STSR= 0
##$SW_p= 3612.71676300578
##$SYMM= 0
##$S_DEV= 0
##$TDeff= 0
##$TDoff= 0
##$TI= <>
##$TILT= no
##$TM1= 0
##$TM2= 0
##$TOPLEV= 0
##$USERP1= <user>
##$USERP2= <user>
##$USERP3= <user>
##$USERP4= <user>
##$USERP5= <user>
##$WDW= 1
##$XDIM= 8192
##$YMAX_p= 0
##$YMIN_p= 0
$$ End of Bruker specific parameters
$$ ---------------------------------
##NTUPLES= NMR FID
##VAR_NAME=  TIME,          FID/REAL,        FID/IMAG
##SYMBOL=    X,             R,               I
##VAR_TYPE=  INDEPENDENT,   DEPENDENT,       DEPENDENT
##VAR_FORM=  AFFN,          ASDF,            ASDF
##VAR_DIM=   8192,          8192,            8192
##UNITS=     SECONDS,       ARBITRARY UNITS, ARBITRARY UNITS
##FACTOR=    0.0002768,     1,               1
##FIRST=     0,             0,               0
##LAST=      2.2672688,     0,               0
##MIN=       0,             -258920,         0
##MAX=       2.2672688,     184227,          0
$$ Real data points
##PAGE= N=1
##DATA TABLE= (X++(R..R)), XYDATA
$$ [...]
705b018L797l401K314J278m836L490N21k355K856l174M97M147m908J128K460m139
721b343M076m60m968N861r88l776M768l131o62N028n150J97M123m181J965R00
737A259l925M161l13l370L450j704k17K780l910J290K404l468K257k39k641M424
753B238j894k614M235k443l98L098m154J368K937m057J708J008k714L075r23k281
769a811L126j313o65J827k361J234J240k483J498N0j334K281j688o55K582k187
785f59L32J530k623J824Q75l080K414P5k010K500j279j163K768j756n52J809j701
802f96O88R61k056J292M77j394J260p16l47J530j399J8J042j261R84P2j466J586
820E75r0j307J390p89l19J501j302k79J384j050K53N54j158P31L68q50M74l0j41
$$ plain form
705 -2018 1779 -1622 692 1970 -2866 624 1145 -1210 1646 -1528 -1031 3116 -1792 -664 1796 -2343
721 -2343 1733 1273 -3695 2166 1178 -2598 2170 -961 -1623 3405 -1745 -1548 2575 -1606 359 1259
737 1259 -2666 1495 1182 -2188 1262 -442 -659 2121 -1789 -499 1905 -1563 694 455 -2186 2238
753 2238 344 -2270 1965 -478 -876 2222 -1932 -564 2373 -1684 24 1032 -1682 1393 470 -1811
769 -1811 1315 2 -663 1164 -1197 37 1277 -1206 292 342 -992 1289 -399 -1054 1528 -659
785 -659 -327 1203 -1420 404 1279 -1801 613 688 -1322 1178 -101 -1264 1504 -252 -804 1005 -696
802 -696 -8 953 -1103 189 666 -728 532 -184 -531 999 -400 -382 660 -601 383 455 -1011 575
820 575 485 -822 568 -221 -540 961 -341 -620 764 -286 -33 521 -637 94 462 -388 86 56 -85
839h5M81o98Q8N22m70L63j20n39R02k68o33P21l29j65Q12r32k5J007q74KP02q77
861d15L86O80j208L08Q11q18J83M32q58O03M51r99K49N71o13K77J43n62N43J70
881C34o18J74K39m3j2j56J5J03L9R3m00J71M55n45L5L09m91O31p2r54R37J44q44
904d56O76j95n18J166o96o54J073l57j57L73o73L76N22p55J75N5k2N26q05j5R11
925E50o82J60K04q86J044K21j390Q40L20p13Q06o71l62J242o51l77M87l83N04
944B63Qq59N37L93k74p0m52M99M47p53J84m3n8R35j052n14J524o28l96O27r65
965f47P10Q55j633L54R06p48M95l05o93J330k07r75M56ML81R6j043M04O76k73
985A43ro94M27R46r82j85M19l53R29m82j255J420K85r07L25m38K99J014j163m14
$$ plain form
839 -85 396 -302 -214 308 -162 201 81 -458 444 176 -457 264 -65 -230 582 -350 -375 632 -242 -240 462 -415
861 -415 -29 651 -557 -249 562 -256 -73 359 -499 104 555 -444 -195 376 -237 40 183 -379 164 334
881 334 -284 -110 129 86 74 -82 -67 36 75 168 -232 -61 394 -151 -116 193 -298 333 261 -693 244 388 -456
904 -456 220 25 -493 673 -23 -677 396 39 -118 255 -418 -42 480 -275 -100 -45 -67 459 -346 -361 550
925 550 -132 28 232 -654 390 611 -779 61 381 -332 474 -197 -559 683 32 -345 142 -241 263
944 263 271 -588 -51 342 68 -2 -454 45 492 -261 -77 -120 -178 757 -295 -809 715 87 -309 318 -647
965 -647 63 918 -715 -361 545 -203 292 -13 -706 624 417 -558 -102 -98 283 379 -664 -260 416 143
985 143 134 -560 -133 813 -169 -354 65 -288 641 159 -1096 324 609 -298 27 -411 -112 902 -261 -675
1005f75Q97q7K32n81m90J209q0p02K12k92Q14J87j342M36O14l18L49r66L2J622
1025A071j085o48R84o42N63M19j724Q78J168j246k3J53k9Q19o37o33N79J91L00
1044D58o87p00J524Mj066M13k96M87Q31j670J22J186n24J33n42m66J719m53j413
1063i40J046j20J37O67j685L37J553q33m60n0J12J029p32p76P03J0O09l57j534
1082a284J515P49j492M92k19r6J514j308j012J579j11k89j3r10J240N70j524L46
1100b53K43N6P84j339j90J426m62l37j48l61J236k26j188P86K8J75K86j361O26
1119b19J133j146M5N1j40J062q71p24J118j67R9j92r71J392K49j307O08j22M5
1138e7J005j496k38J651q92%J28r43J538j3j749J160J64l56P54j350J53J526j102
$$ plain form
1005 -675 222 135 367 -214 -704 505 425 -277 -65 -357 457 644 -698 -262 352 34 383 -583 -551 1071
1025 1071 -14 -662 322 -320 243 662 -1062 -184 984 -262 -285 -132 -161 658 21 -612 -33 158 458
1044 458 -229 -929 595 599 -467 -54 -350 137 968 -702 -580 606 82 215 -327 -793 926 473 -940
1063 -940 106 -14 123 790 -895 -558 995 162 -298 -348 -236 793 61 -715 -12 -2 607 250 -1284
1082 -1284 231 980 -512 -20 -239 -335 1179 -129 -1141 438 327 38 25 -885 355 925 -599 -253
1100 -253 -10 46 830 -509 -699 727 265 -72 -220 -581 655 429 -759 27 55 230 516 -845 -219
1119 -219 914 -232 -187 -136 -276 786 -85 -809 309 142 241 49 -922 470 719 -588 20 -102 -57
1138 -57 948 -548 -786 865 -27 -27 101 -842 696 683 -1066 94 258 -98 656 -694 -541 985 -117
1157a17j42K02l76J233n95j154J161l8n8K03j203Q89Q81j272K77K6j11J160j325
1176c59m53J499q03J47L56j431J437N42j827R22J66m92J013j137j52J287r33K27
1194IJ23r40J592m85j314J666o90l92J322j654K88J611j768M68O71j222J350l48
1212B87j316J769o66n90J161j235M42J110j730O95M99r14R84o20n06J419j011
1229b22MO89j161J158N6j667J638k48r73J629j329k23J784j656J25J078j468J220
1247D34K0j571J699k89r23J342j205J44J450j728M27Q05j290J233k84j339J914
1264H39p32p78J487j462L85J429k058P23R64j567J175p1j314J622m46q48J193
1281E41q63J50Q97j354O29M40r30Q88l84o41J351q60k52Q95j005N58M06j144Q92
$$ plain form
1157 -117 -259 -57 -433 800 205 -949 212 174 116 319 -884 5 886 -386 -109 -83 -194 966 -359
1176 -359 -812 687 -116 31 387 -1044 393 935 -892 30 196 -296 717 -420 -572 715 -218 9
1194 9 132 -808 784 299 -1015 651 -39 -431 891 -763 -475 1136 -632 -164 507 -715 635 287
1212 287 -1029 740 74 -516 645 -590 -148 962 -768 -73 426 -488 496 -124 -630 789 -222
1229 -222 -218 471 -690 468 524 -1143 495 247 -726 903 -426 -649 1135 -521 -396 682 -786 434
1247 434 454 -1117 582 293 -630 712 -493 -349 1101 -627 -200 605 -685 548 264 -1075 839
1264 839 107 -671 816 -646 -261 1168 -890 -167 797 -770 405 334 -980 642 196 -652 541
1281 541 -322 -172 725 -629 0 440 -490 398 14 -627 724 -136 -388 507 -498 60 466 -678 214
1300B14O1q22R58n87k56J071q92J6P13q57N60J98r32Q02p9n31P25m76r8O93p77
1321b96K16M35p34N69q1n62P98l35l16O26n74N3O05p69K91L74o75N44q2m58O63
1342B92l12k29M22k98P9L73o56L69J50l85L66j41l23N74k63k33L60k44Q7K46l68
1363a34M9J83j26R0j05q5J80l1r9m1J82l6q9J06p1q9L34k63j89M19j54k43M48
1386B36l77ON53n41l1L58l41J59J47m82M69Ql53L06j32j05M07l91j10M45l03O6
1408fJ07l60L62J7l29K99k06L0L35m04M9L44m04J91J20m44L87M0l37K96j05n8
1430g6K56k88J02J12k20J99j19k06M32j65j00K19l23K39J59n11L60J02m07N30
1450B95l74k50P70n38p8N29o88K62M66q09M43L21o62N82k93l78Q52m84k22O06
$$ plain form
1300 214 275 -547 411 -176 -432 639 -253 -237 476 -381 179 377 -555 247 168 -363 362 -114 -212 481 -296
1321 -296 -80 355 -379 190 109 -453 345 10 -306 320 -254 -201 404 -365 -74 300 -375 169 87 -371 292
1342 292 -20 -249 173 -125 -46 327 -329 40 190 -195 171 30 -293 281 18 -215 145 -99 -12 234 -134
1363 -134 -85 98 -28 62 -43 -128 52 21 -78 -119 63 27 -62 44 -27 -116 218 -45 -234 185 31 -212 236
1386 236 -141 -135 418 -123 -154 204 -137 22 169 -313 156 164 -189 117 -15 -120 287 -104 -214 231 -72 -6
1408 -6 101 -259 103 120 -209 90 -116 -86 249 -155 -106 238 -166 25 145 -299 88 128 -209 87 -18 -76
1430 -76 180 -108 -6 106 -114 85 -34 -240 192 27 -73 146 -177 62 221 -290 70 172 -235 295
1450 295 -79 -329 441 -97 -175 354 -334 -72 394 -415 28 349 -313 269 -24 -402 450 -34 -256 350
1470C50o29K48N45r96M44M57p29N33j91m80R18l75m91O98m14O7M68q93M44N39
1490E13p98L28rl38P19l40m87O24k14J06P1o44O24J77o78M99k92o7Q38q88k22
1511d78R64n71J13J75p33Q09J91r87N63m4j51O56p72k01R24m70j13K35m84O85
1531C11N2p72M30J8j6M02q44J98P68p36J29J86o31R10j17r13Q09j6l71N38o96
1552c61J69Q06q00l3M34m58N56j36p57P66R9m22K17l14K51M17o89J92J78k36M80
1573C59m77l00Q53l75l52M63m55L39M11r46L88M16l89J54k76l6N43l15k46K44
1593Cj42L97j89n40N44J13k43J91l76J84M77o41P3K95k76L98l20l46O79j02l52
1614a73L55m37K48M63p74J84L69l50K87k11l03O49j66l12J89j91L43K8n72M23
$$ plain form
1470 350 -279 -31 514 -482 -38 419 -310 223 32 -448 470 95 -396 302 -112 -45 423 -470 -26 513
1490 513 -285 43 34 -304 415 75 -412 212 -2 104 175 -469 155 332 -346 153 -139 -206 632 -256 -478
1511 -478 486 -85 28 203 -530 279 470 -517 46 2 -149 507 -265 -466 458 -12 -125 110 -374 311
1531 311 363 -409 21 39 23 425 -419 -221 547 -189 -60 126 -505 405 288 -625 184 168 -203 335 -361
1552 -361 -192 614 -186 -219 215 -243 313 177 -580 186 285 -137 80 -234 17 434 -255 -63 115 -121 359
1573 359 -118 -418 435 60 -292 171 -284 55 466 -480 -92 324 -65 89 -187 -223 320 5 -241 3
1593 3 -139 258 69 -471 73 186 -57 134 -242 -58 419 -222 -149 146 -130 268 -52 -398 281 179 -173
1614 -173 182 -255 -7 456 -318 -134 235 -115 172 -39 -342 307 141 -171 18 -173 170 198 -374 49
1634D9R1k44K93m15M2N83m29j50L20l46L68q9m39N11m2k07K42k99J38L53m99P7
1656i2K65k65K35j66j66M17j92j59J72k15L01O8n94M46Q0l45L93k59k05N76l40
1677d5j77L83k74K10M1m10L32J13l38K47k00J5L81l75q4L99k60J38jl41L79l0
1699A03k39J76j33J16J54l28J15J90j96R3J7k32L28j01j76J38ml5R9k34K06O5
1721A22k11J98j77m0L28k76r4L32k75R0J31k96K50J63m49K79J7k69L78k66j87
1742b52N35k58k29L29k36P5K80m27Q3K88l14J51K9k20K34l8j34J59p7k9J32k59
1764a78K04N2k13J61J9j40J98j13j50K83j22mJ31k33J72L2k40J84k9j02J98j90
1786h0k2K39j87qJ44j91J76M7l10L16r7j18K64l14J3L58l68N8K32l12K60J7l85
$$ plain form
1634 49 140 -104 189 -226 -184 399 -30 -180 140 -206 162 73 -366 145 103 -104 138 -161 -23 330 -169 -92
1656 -92 173 -92 143 -23 -189 228 36 -123 49 -166 135 203 -391 55 135 -210 183 -76 -281 295 -45
1677 -45 -222 161 -113 97 138 -272 60 173 -165 82 -118 -103 278 -97 -181 218 -42 96 95 -246 133 103
1699 103 -136 40 -93 23 177 -151 -36 154 -42 51 68 -164 164 63 -113 25 21 -14 85 -149 57 122
1721 122 -89 109 -68 -108 220 -56 -150 182 -93 -3 128 -168 82 245 -204 75 92 -177 201 -65 -252
1742 -252 283 25 -204 125 -111 -36 244 -183 -100 188 -126 25 54 -166 68 30 -104 55 -22 -51 81 -178
1764 -178 26 78 -135 26 45 -95 103 -10 -160 123 1 -3 128 -105 67 99 -141 43 14 -88 110 -80
1786 -80 -102 137 -50 -58 86 -105 71 118 -192 124 27 -91 173 -141 -128 230 -138 -80 152 -160 100 117 -268
1809b68L88k8k45K54j21mK10k51j2J45r5J59j21j60K82j30p5J86j95J06J56l03
1831a22P7J58j69J32r6r1K14q4r0J29q6J29l0k18J93j6o7J34j84O1J66k05N9J02
1855I6k10K28r6k16L80j13j70K50k26QK91k57n3J94j89J23M5k63K40L2j67M6j0
1878c7J3R3j63N0N1m1J52j62o9K27r4o0O2q7O4J54k84J08J15j20P7m6r2K62r8
1903G5j24J54j66J01K3j78R7J00j08J19j22n1K28k29L4J58k64K55k3l41L47%j99
1926a14K20j62q1L17k14j59K73j66J70J0l59L38k1j25J72j60r1M52m08l0L37l25
1948a26K21K1l94L95Kk87K13j66J08K25l60N3K48l08K18k0k53L15L3l49K87o8
1970Hp0L36m01N4K22k94K17n1j91L22j14j80K45k33J42J82l93J88R7j98J74j01
$$ plain form
1809 -268 120 92 -153 101 -20 -24 186 -65 -77 68 -27 132 11 -149 133 3 -72 114 -81 25 181 -122
1831 -122 -45 113 -56 76 -20 -111 103 19 -71 58 -28 101 71 -147 46 30 -37 97 -87 -26 140 -65 -6 96
1855 96 -114 114 18 -198 182 69 -101 149 -77 -69 222 -35 -88 106 -83 40 85 -178 62 94 -73 -27 -37
1878 -37 -24 69 -94 -44 7 -34 118 -44 -113 114 20 -40 22 -65 -1 153 -131 -23 92 -28 49 3 -89 173 75
1903 75 -49 105 -61 40 63 -115 -18 82 -26 93 -29 -80 148 -81 -47 111 -153 102 79 -262 85 85 -114
1926 -114 106 -56 -137 180 -34 -193 80 -86 84 94 -265 73 52 -73 99 -61 -152 300 -108 -138 199 -126
1948 -126 95 116 -278 117 119 -168 45 -121 -13 212 -148 -95 153 -155 63 43 -210 105 138 -211 76 8
1970 8 -62 274 -127 -73 149 -145 72 21 -170 152 38 -142 103 -130 12 194 -199 -11 86 -112 62 -39
1992c9j18L51k29p0J92j88J53J05l71L25rk16K13j23j30M19l83K2K06k23J17J41
2014A45l71K82M6k36K13j26q5K76j72n2J30n3j4Q4j75R5N6l1j3m6R6L1r9PO3j10
2040e9Q1L7j43J10mq8K4j9P6l8nMQ5j4j3l3l2O4m8J7rpJ1J0J8p9N2N2k4m8O1j0
2072B9j5l0k8M6N2m8on9J80j01n2Q0n0pJ07j94L2J76j04j8P9j56J55j3j74K04
2098H5n0j16J56j84LK22k16K5J50j67J52Pk37J67J19j26Pm0j9K76l52M7J36p4
2122b9P6J1k65L77l0k22J85j34JJ79k78j6K84k06J08n8j56K87m8k76K46r5O4J56
2146A61l40J06K11j66N4n3j9J90j16j43R4R3k0j3k07J66J31j95M2k0j6J97j55
2169a8j11J57K2j7Nj15J53P9k24OQ0P6l0j81M5J49l4k3n8j0J61k2k60J35N2K8
$$ plain form
1992 -39 -157 194 -35 -105 87 -101 52 157 -214 111 102 -114 99 -24 -154 265 -118 -96 110 -113 4 145
2014 145 -226 56 102 -134 79 -47 -132 144 -28 -80 50 -3 -17 67 -108 -13 43 12 -1 -47 49 80 -19 -12 51 -59
2040 -59 22 59 -84 26 22 -66 -42 -61 15 -23 -28 -24 61 47 34 1 -31 33 -15 2 -7 -14 -3 7 25 -54 -2 50 26 -22 39 29
2072 29 14 -16 -44 2 54 6 0 -59 121 20 -32 48 -2 -9 98 -96 -64 112 8 -10 69 -87 68 55 -119 85
2098 85 35 -81 75 -109 -106 116 -100 -75 75 -92 60 67 -170 -3 116 -10 -3 -43 -62 214 -138 -91 45 -29
2122 -29 47 58 -207 170 140 -82 103 -31 -30 149 -129 -145 139 -67 41 -17 -173 114 66 -210 36 -59 5 161
2146 161 -179 -73 138 -28 26 -27 -46 144 28 -115 -21 72 52 39 -168 -2 129 -66 -24 -44 -60 137 -18
2169 -18 -129 28 50 33 38 -77 76 155 -69 -63 17 93 63 -118 -73 76 42 19 -39 -49 112 90 -170 -35 17 45
2195D5O1k13N6J95q5j01L1oJ49q1j85J38M7K0m1j53J55J23j82q7J21NP9j25j29
2220a63K39J3r2j0k7O2N5r3p3J34j7J2r6j3J73J3j37q8Q7J06n1j38O6M5M1o5j46
2247a63J09J25n2m1q2J04R5q3n9K1O5M7j14o1J18L0k0j17PJ06J5r5m5O3R9k1k09
2274a58J39R8p6j9J2o0K24o8k27J85j9l1K1r3K6K09j39n8N2n1Q7j8j49J86j7j47
2300i1J14r8R2L5j63M2J07n4N0n0o1J57n3m8j8oJ40n4j41J15J6Qk5j06Q2J33j61
2327c8k6J5O7Q9q7j14J09Rj5k8j08J65Pr0M1L8L7L5k08P3J17p8j9Qj32K27j47
2354e3k9Q5m9L1O6q9j7J58j57L8k7k4J45j30J6J46j25K1mp2J10J4j24Q3n4N0R5
2381A04j79O8O0j35R6Mj42K32r7r1J76j38rN8j25J03J13j86J22q4MJ77j44l7J09
$$ plain form
2195 45 106 -107 -51 144 59 -42 -11 -17 132 51 -134 4 51 71 30 -123 32 155 -27 -114 7 12 91 -34 -163
2220 -163 76 89 -3 -13 -40 22 77 -16 -89 45 28 40 -56 -69 104 117 -20 -108 -21 85 34 -104 -38 7 48 -17 -163
2247 -163 -54 71 19 -22 -104 0 95 12 -47 -26 39 86 -28 -89 29 59 39 -78 -71 35 50 -45 -90 -27 72 51 -158
2274 -158 -19 79 3 -16 -4 -64 160 92 -135 50 31 0 21 -72 -46 163 24 -34 18 -33 54 36 -113 73 56 -91
2300 -91 23 -75 17 52 -111 -69 38 -16 34 -16 -77 80 27 -21 -39 -45 95 41 -100 15 31 39 14 -92 -10 123 -38
2327 -38 -64 -49 18 107 20 -94 15 24 9 -19 -127 38 45 -45 -4 34 71 106 -102 -29 88 10 -9 -1 -133 94 -53
2354 -53 -82 3 -46 -15 51 -38 -55 103 -54 -16 -43 -67 78 -52 -36 110 -15 6 2 -70 40 54 -70 13 -41 9 104
2381 104 -75 -7 53 -82 14 18 -124 108 11 -80 96 -42 -51 7 -118 -15 98 -88 34 -50 -46 131 -13 -50 59
2406E9j20Q5L6j68J61K3j31O6o6M2Q2j38K3J34j22R9q1j25K06J1j79J54j17O1
2430eJ54k09%J22j48J00l6m9J32m9p5J62j97O0J75k78Q3J81j70O4J9j54K68r0
2454F0j37J34m1j08J59j42RJ36j05M6Lj25J55L2j73J35qo6K0l1P4N2r0K5k3n8
2480f7J23o4j69K44m2r7J27p6J3J20j23q9J80j31M9L9q9R3J3j07R0j38J29L7j44
2505g9O0Q7j19R3K1j81K04nk24J93n5o4J76j55m5J70j35J8Q7j42J80j9k19J72
2529A9L6j01J77k51J09J71k38L8Q6q0J56m4k17K40k4j09P4r9K9J93k25N8O5j99
2553a36K40j42j86L67j21j11J44j33N9J98l05Q1J89j97J34q4j18L04j70j50K24
2574H7j31P1J30l47K10J15k02J34k6j01K11j02j66K22j37K7P2k33J60J51j82M1
$$ plain form
2406 59 -61 24 60 -108 53 76 -55 11 -55 -13 69 -69 -46 88 -34 65 -16 -141 65 76 -103 51 -66 -5
2430 -5 149 -60 -60 62 -86 14 -22 -71 61 12 -63 99 -98 -38 137 -141 -58 123 -47 17 36 -118 150 60
2454 60 -77 57 16 -92 67 -75 -66 70 -35 11 14 -111 44 76 -97 38 30 -36 -16 -47 27 79 -11 14 -9 -67
2480 -67 56 -8 -177 67 25 -72 55 -21 -8 112 -11 -100 80 -51 -2 37 -52 41 54 -53 37 -101 28 65 -79
2505 -79 -19 68 -51 42 63 -118 86 81 -143 50 -5 -69 107 -48 -93 77 -58 -40 47 -95 85 66 -153 19
2529 19 55 -46 131 -120 -11 160 -78 -40 46 -34 122 78 -139 101 77 -32 42 -57 -28 165 -60 -2 63 -136
2553 -136 104 -38 -224 143 22 -89 55 -78 -19 179 -126 -45 144 -53 81 -3 -121 183 13 -137 87
2574 87 -44 27 157 -190 20 135 -67 67 41 -60 151 49 -117 105 -32 -5 67 -166 -6 145 -37 4
2596DMm9J31j83j7J81j76J89n9j85K58j5j98J45n0K9J02k00mK28j66j6M2o0J27
2621F2J3j90J23J9p6J45j12p8K15j53MP4j16J75l4j88J31K7n7J6k6K5O7j55M2
2646d7P5l2R8q9j02J32J1j03P8j41J25O5j51M0M7j7O5j15j8K06j06m1L9n5P7L4
2672G5j80R4R2q8l0K1o4J46o2q1J04r2J22j5j35Q4Q1j50R1l2l1J49j81L6K6j6
2698c6O6j12l6K21m7j13N7l3N8P0j62J8R9r6P1n8nJ93j11j00N3l1M6P7k11R5L2
2725Er5J53q7k7J37j61K6J07j26J08k3j40J55J5j35J44o0m8J55k30O5J49j69J23
2749D1j9j05J58k3j38J40j47O5J02j60N7J16j42Q2m6l0J33j12m1J64j46N3J13
2772A15k38J37O9k12J90p5o9K02j86M3R2j53O3J00j91J22L0j76J87r6k5J99j78
$$ plain form
2596 4 8 -41 90 -93 -110 71 -105 84 25 -160 98 83 -115 30 -20 9 111 -89 -93 135 -31 -47 -5 -65 62
2621 62 75 -115 8 27 -49 96 -16 -94 121 -32 -28 46 -70 105 71 -117 14 41 -16 0 -26 -1 66 -89 -47
2646 -47 28 -4 94 5 -97 35 46 -57 21 -120 5 70 -81 -41 6 -11 54 -61 -79 127 21 -20 19 -36 41 75
2672 75 -105 -11 81 -7 -37 -16 -80 66 4 -77 27 -65 57 42 -93 -9 72 -78 13 -19 -50 99 -82 -46 -20 -36
2698 -36 30 -82 -118 103 56 -57 0 -33 25 95 -67 -49 50 -46 25 -33 -38 155 44 -56 -3 -34 12 89 -122 -27 5
2725 5 -90 63 -24 -51 86 -75 -49 58 -68 40 17 -123 32 47 -88 56 -4 -52 103 -127 -62 87 -82 41
2749 41 22 -83 75 52 -86 54 -93 -28 74 -86 -29 87 -55 27 -19 -49 84 -28 -69 95 -51 2 115
2772 115 -123 14 83 -129 61 -14 -83 119 -67 -24 68 -85 -22 78 -113 9 39 -137 50 -46 -71 128 -50
2795e0M4J26j84J13O2k14J94n9j16J38q7J9L3m7j7J08j28J22l3j31J70m2j32J34
2819B3ko4J25q5p6J56j09M9M4j26J52j7j27M6m5L4J41j73K5J11q9N5nj34J38l
2845D4j40J52p0m7O8n6j4J90j56j5P1q5R6j1j48J50pq1J45j28m3J82j61J1J03
2870E0j02Q3M1k28J95Lj05R0m7OJ25j67M2R2j07L3P7k32K19k6j10J68j18M2M5
2895F9j22qJ27o3j3Q1j66J25j2j01J60r2m0J49j62J7J65j78R2kj03J16j8j09J46
2920E8p2k2J27j46M0O8j04M1O4j00P0o0l1J07n9kP1j32J20Jo5N4Rj14R9o8k6R5
2948B3k5K0J7j19Q1M0j10M3J3l2J24q6p5J17l9NK9o5M6M1r0P4K0p1N2K1j04J07
2976E7p1J0M0l2j0K0m9l9J20or3O1J2lM1r5N1j7k3N7k9PL8o0j6N9r5L6M6J0nJ
$$ plain form
2795 -50 -6 120 -64 49 111 -103 91 32 -84 54 -33 -14 19 -28 -45 63 -65 57 24 -107 63 21 -111 23
2819 23 21 -43 82 -3 -79 77 -32 17 61 -65 87 70 -57 -11 -56 -22 119 -54 -29 82 -7 48 43 -91 47 44
2845 44 -96 56 -14 -61 7 -49 -63 127 -29 -44 27 -58 38 27 -121 29 22 -59 86 -42 -85 97 -64 -53 50
2870 50 -52 31 72 -156 39 42 -63 27 -20 -14 111 -56 -14 78 -29 4 81 -151 68 42 -68 100 -18 24 69
2895 69 -53 -61 66 3 -10 71 -95 30 18 -83 77 -15 -55 94 -68 -51 114 -64 28 26 -77 39 21 -88 58
2920 58 -14 -36 91 -55 -15 53 -51 -10 54 -46 24 -36 -67 40 -19 -21 50 -82 38 39 -26 28 37 -77 22 -46 -72 23
2948 23 -2 18 35 -84 -3 37 -73 -30 -17 -49 75 -11 -86 31 -8 -3 26 -39 7 48 -42 32 52 -19 33 54 -50 57
2976 57 -14 -4 36 4 -6 14 -35 -74 46 40 -53 8 20 17 58 -37 14 -3 -26 31 2 9 47 -13 -29 30 -65 -29 17 27 22 23
3008B3o5J12n0orq8J4J18Nq1Q6q3K5O0j51Q1rKO8o2N1J2j19M9M2o0N5Q2j17L0
3038A5Qo0J52j90R4M1o0MN8n0M8j0j62J32N7r9L2j8n2J30j14J5L2K6m7P6j33K4
3066e1J55j80J00o9j1J21o0m1O2m5j0N1q7R4j8j04J19J0j08J47j21j7J02l8n5
3091e4N5r3J55K1j43J11k4l4L0o7o5J92n5p5P8j23J16O0j69J07Np9J11n6r9K17
3117A22r8j08J05p1M0J09j97R4N0p5N3Nn9J37j36n1J54j17N8L6r7J10Jj61J03
3142GM0o0O2p0j08K44j15n8J13j40J00nr0J09M2j53R1l3o6J66r3k3R0q8P1L7j48
3169g8J14K7n5P2j44NJ90j35p0J59p8M7K1j27J16O4k28J11k6o3J76j07n1J60r9
3194Al0Q4k10J82M5j69N2J2j1J43j52j5J43j02nP0r7N3J10j90J42m7n9Q0r2RJ66
$$ plain form
3008 23 -42 70 20 14 5 -83 -69 49 54 -27 59 -24 1 61 -90 -9 -18 -16 52 -10 41 53 -66 -17 25 -35 20 102 -15 15
3038 15 23 -37 115 -75 19 60 0 4 62 12 60 50 -112 20 77 -22 10 -8 -60 70 -44 -29 3 29 -18 58 -75 -51
3066 -51 104 -76 24 -45 -56 65 5 -36 26 -19 -29 22 -65 29 11 -93 26 36 -72 75 -46 -63 39 1 -54
3091 -54 1 -92 63 84 -59 52 28 -6 24 -43 -108 84 29 -46 32 -91 25 85 -84 23 28 -51 60 4 -95 122
3117 122 24 -84 21 -50 -10 99 -98 -4 46 -29 24 29 -30 107 -29 -80 74 -43 15 51 -46 64 65 -96 7
3142 7 47 -13 49 -21 -129 115 0 -58 55 -85 15 10 -80 29 71 -82 9 -24 -90 76 -17 -40 50 -38 33 70 -78
3169 -78 36 63 8 80 -64 -59 131 -4 -74 85 7 54 75 -52 64 128 -100 11 -15 -78 98 -9 -60 100 1
3194 1 -29 55 -155 27 72 -97 -45 -33 -44 99 -53 -68 75 -27 -32 38 -59 -6 104 -86 56 9 -50 30 -62 -53 113
3221A13o0j17J46j53J07K9j47N7N0p1J27j33P2J09j76K1P7o6M9m8j15K10j11r3
3245a23J43q6QJ40k14O1J41j22P9m3p7J57nj74J61l9l4J80k07J9J11m5p9N8q2
3270g2J55kk19J99o4m9J43j67KK01k30O7Q1r0J03l9j28J50n7pN5j71J60N3j87
3295a13J06L4q3J60j66m4J91q8l9L0l4N2M0j08P5J9o3Q2m0o5J59j17o8J21j23
3320h2R0P6j33Q9N9j34M5q8K0J51j03p9J35m9N9m7j34J37K7p2N7o9L4Q9j31L3
3346b0P6m2K8o5n6J32m2o1J07o5j6J09j56PR2p2L7J8r9J36k0p7O5l3L5M8j62M3
3374e3R0j09Q8Mn8R4q2m6Q8l4L2Mo0M3N1p2QQ5o5L4l5o8O5J1j6P8j37J00km1L4
3405C1M9j45J27q5n7J10l9J9lq3R3Pp2L5J7MJ5m6KJ34j39k1J21j23J9O6o2J4J8
$$ plain form
3221 113 53 -64 82 -71 36 65 -82 -25 25 -46 81 -52 20 129 -47 -26 51 -15 34 -14 -129 81 -30 -123
3245 -123 20 -66 -58 82 -132 -71 70 -52 27 -16 -93 64 59 -115 46 7 -27 153 -54 -35 76 31 -48 10 -72
3270 -72 83 81 -138 61 -3 -52 91 -76 -74 127 -103 -36 45 -45 58 19 -109 41 -16 -23 32 -139 21 74 -113
3295 -113 -7 27 -56 104 -62 -106 85 -3 -42 -12 -46 6 46 -62 13 32 -31 51 11 -54 105 -12 -80 41 -82
3320 -82 8 84 -49 40 99 -35 10 -78 -58 93 -10 -89 46 -3 56 9 -125 12 39 -33 24 -45 -11 78 -53 -20
3346 -20 56 14 42 -23 -79 53 11 -50 57 -8 -24 85 -71 -64 28 -44 -7 11 -88 48 28 -49 16 -17 18 66 -96 -53
3374 -53 37 -72 16 20 -38 56 -26 -72 16 -18 14 18 -42 1 52 -20 -12 73 8 42 7 -61 4 15 -1 77 -60 40 38 -3 31
3405 31 80 -65 62 -23 -80 30 -9 10 7 -76 17 24 -48 -13 4 8 23 -23 -21 113 -26 -47 74 -49 -30 36 -26 -12 6
3434FJ0K0Ll9N1l5m8N6p8oP4n5P4k9k3L8k4l7R7o2rK5k5pO6j11N1K2j3J6L6p6
3466c2J01K3j24L3l1j1R4p6L5N3n5L1j6q1O7Ml4Q6p8N1j6n2M7k3LJ0k1MO8n0l8
3497b8N5j7rqoj2L9p6J06o7m0R8qm9M3p0P3k4m9O7O1j16O8k6K0M5q9J3O2p1J8
3528CO4j15O2K3l3j8O4o9O1p0L5N0q7L8L6k9m1P8j35N1N2q4Q6qm2R3j00K9J02
3557I6j49M8J4n2M3Q8j39P6m0n5J71q6o2J26j13KR6j62J43j5j08Q0ko7Q7p9J7
3584d2R2j24M2J36j46P7k0q4O6Lj21J99j34K7J30r4j8P8j31Q0J7p2N0jl9R9j3
3611E7p2L7o8N2R9j96J21j3q1J52r0l7J25o5q1J11j05N0J38j76P1K2j64J44k9
3636Bn9J12r6k3J14j11M5N3j26J15K1q1R0k3k8N1n9l4O2m6M9J6j08J02m0l9M5
$$ plain form
3434 6 16 36 39 0 51 16 -32 24 -54 -60 14 -41 33 4 -19 19 -5 -42 55 -7 -16 9 -16 -23 43 -68 -17 5 -8 8 44 -32
3466 -32 69 92 -32 1 -30 -41 53 -23 12 65 10 41 25 -56 11 15 -19 67 -11 40 24 -28 19 -4 -1 9 -12 -8 60 10 -28
3497 -28 27 10 1 -7 -13 -25 14 -62 44 -23 -63 35 27 -22 21 -49 24 0 -49 18 79 -37 31 5 25 70 -19 -6 56 -15 3
3528 3 67 -48 14 37 4 -14 50 -19 42 -28 7 57 -30 8 44 15 -26 52 -83 -32 20 -64 22 14 -28 65 -35 -6 96
3557 96 -53 -5 9 -43 0 88 -51 25 -15 -70 101 15 -47 79 -34 -32 64 -98 45 30 -78 2 0 -67 20 -59 -42
3584 -42 50 -74 -32 104 -42 35 15 -69 -3 0 -121 78 -56 -29 101 7 -11 67 -64 16 33 -39 11 10 -29 70 57
3611 57 -15 22 -46 6 105 -91 30 17 -64 88 -2 -39 86 21 -60 51 -54 -4 134 -42 29 51 -113 31 2
3636 2 -57 55 -41 -64 50 -61 -16 37 -89 26 47 -34 56 33 5 56 -3 -37 25 -21 28 44 -64 38 -2 -41 4
3663Dm0n7J33q8MQ8p6LO5j02R2k1j06J03k8K5M0j15M8J22j62J13Mr0O8K8r6O9
3691B8j6J3jo8J6J10l3l1k9l4R5m1j00R6J0l9K5qJ6M1p4K6ln6Q4o4j3N4Nk8M5
3722B6n2K7M4n0J0J0l1Q0k7p6M6j2K6j6n4K1Q3l9Nl1l8P4m1J1JJ7m6N5p3J1L1
3753hqJ4L3l3m8L5k4M4K4n6J1K9k6N4o8P5n6K3j8K5QM3p3l2J8M4Mo2O0n5J4M5
3785C6m5pL8j9j8N2n0M5j13P9m7nJ5MJ8NJ1rP2p2j0M2n8K0K0k5M5%n5R8k0m5O
3818HLl4N7q8J02k6m4L5K6o9L7n7kJ14p5K1k3n1P4pj16J45Rj05J26p1j3O1n7l
3848b3O2m0J8K3q6M8J7k4Q0q7J2L4n4L1L3r7Q7q0M2PRm5J09n4m7K6l9L0K8l9O6
3879D7j3p2Q0q3oN8p5K1R0j00L4K9l0J7On1J17jp3R0j13M6K0o5K5Pp6P5Rl0M4
$$ plain form
3663 4 -36 -93 40 -48 -44 44 -32 -29 36 -66 26 5 -101 2 -26 -1 39 -76 -28 94 -68 45 49 -41 27 55 -41 28
3691 28 12 25 24 -44 -28 82 49 18 -11 -45 50 9 -91 5 15 -24 1 -7 9 50 -24 2 -1 -57 27 -37 -50 4 9 -19 26
3722 26 -26 1 45 -5 5 15 -16 64 37 -39 7 -5 21 5 -49 -28 55 16 21 -10 -48 26 -15 -4 -3 14 -32 23 -50 -39 -8
3753 -8 -16 -2 31 -2 -50 -15 -39 5 29 -27 -16 13 -13 41 -27 48 -8 15 -3 22 30 73 0 -32 -14 30 34 -28 32 -23 -9 36
3785 36 -9 -16 22 3 -15 37 -13 32 -81 -2 -49 -54 -39 -35 -17 -12 -1 -10 62 -10 -20 22 -36 -16 4 -21 24 24 -31 67 47 2 8
3818 8 11 -23 34 -54 48 22 -22 13 39 -30 7 -50 -52 62 -13 8 -15 -66 8 1 -115 30 39 -66 60 -11 -24 37 -20 -23
3848 -23 39 -1 17 40 -46 2 19 -5 75 -12 0 34 -20 11 44 -53 34 -46 -4 3 12 -33 76 22 -25 1 -38 -8 20 -19 47
3879 47 34 -38 42 -41 -47 11 -64 -43 47 -53 -19 10 -20 -3 3 -48 69 68 -5 85 -28 18 38 -27 -2 5 -71 4 13 -17 27
3910B7m8lO6j05O7P1j10L8Q1j41P8q2M7Q1j01JP7J1m8L7m6qM6j03R5j8n7P7j07
3939g7N0L3m9Q0J0p7L2Mm1M0Pm7R5o4rJ7J1l9J1j0L6k5KOqk9N2l8K0K8m6M4j2
3972Gp0R4k2l8M2QJ1L4o0k6Q5j16O4K6o9O1j7l0O0j4n2N4l9m3J09m6k1K7l6K8
4002A1m5N7qOk2j3rOL4j4M1jl1k3N6j6%m1J6Kl2K5J8m4M3k2nMpJ7j1K6k1mj0L4
4038A7K7r5P4J0n4J7J8k3L6Mm1Qk0j8M6m8K9J9l4O9l3OK5j6n1L7pK7M7p3mJ0o4
4071e5N0RK8qm2M9j4j9L4k0n3P7o0mL0n6O9m2n2P7Jm9P8L1n5NL9o6jL2M3r6K0
4104b0J0Nm4L6oM4J6Q%l4j7L0m5P5o6K5Nk3l1O5nl9k7R0o9j1Q7j06P0p6RmJ9K7
4138bJ7o1K0K0N6n8jM6l1L1q1pP2n3pN8pm4O8m6N7m1K9q2M6m4R9p3j3M6k7J1K0
$$ plain form
3910 27 -21 -24 42 -63 4 75 -35 3 84 -57 21 -61 -14 67 -34 -33 44 55 7 44 -2 -10 36 -67 28 10 -47 30 -77
3939 -77 -27 6 -43 37 47 -30 2 6 -35 5 12 -35 60 -4 -13 4 15 -24 -13 -23 13 -12 -10 -4 -12 -41 11 -27 -7 21 -25 19 7
3972 7 -63 31 9 -29 13 21 32 66 6 -20 65 -51 13 39 -30 31 14 -16 44 30 -22 32 -7 -50 59 13 -8 19 -17 11
4002 11 -34 23 15 21 -1 -14 -23 -17 17 3 44 43 12 -11 45 29 29 -12 4 6 -26 -1 17 -27 16 -6 -11 -7 -14 3 -8 18 -3 -7 -17 17
4038 17 44 -51 23 33 -21 -4 14 -9 27 31 -10 -2 -22 -40 6 -42 -13 6 -28 41 8 14 39 23 -28 9 2 29 76 3 -1 9 -55
4071 -55 -5 4 32 24 -18 31 17 -2 32 12 -41 36 -24 -28 2 -54 15 -27 -79 -2 -1 -50 28 59 4 9 48 -18 -19 13 56 -40 -20
4104 -20 -10 -5 -49 -13 -19 25 41 49 49 15 -2 28 -17 58 -8 17 22 -1 -32 33 28 -11 -38 52 -17 -28 59 -47 23 -53 -44 -48 -29 -2
4138 -2 15 -46 -26 -6 50 -8 -9 37 6 37 -44 -51 21 -32 -39 19 12 -32 36 -10 47 6 35 -47 -1 -45 54 -19 -32 14 -13 -2 18
4171A8m0L7J0l8M4o1N7j0l8j4L1p3L8O5l1l2LJ5N0n0m2R5n9LM5ppJ8k6k2L9j2
4203FK8m7j1K7j6K9lrk6M0r3L1M1QM1p5%L0k3K8Lj4M1n9J0OL4%l2RLlj7L0L4m6
4239EJ3J6k2O3o0l6N7o1K8J2j6oO1j11J2J2m5R6%o6O1oqjLK6mo2MP4k7K2l3n5
4273e4J04o3N3Kk4QJ2q2K4P0k0L7j20L6R1n9M8jp7J1J7l6K8M5n1LL3l6k0j8O4
4304B5k7o0O4k7o5J51n1q7L0M4M8o4M7rj8lmj4K6pjK4J2o0P9m9K4J4J3j19Q9R
4336C4l2J8l5J6%nK1l1J6L9k2m3Ok9j9O9L6q1N9n1M8j6q3J18m5jL6k9m1R7l9L1
4368D2l3j3k4K2j0L8k1k3oP3j00M4MK9o7N4ml6J0N7o0K7k4k1P5m8JOM5n2lk6J0
4401c4L4J0N6n6k2j2N3J1n2M6l1K4j1P0n2opLqk3k1M8q3M4oL1L5p3M4m4J6J7l3
$$ plain form
4171 18 -22 15 25 -13 31 -30 27 17 -21 -35 -4 -77 -39 26 -5 -37 -34 -19 31 -19 -61 34 -25 -22 23 16 9 27 1 -21 18 6
4203 6 34 -13 -24 3 -13 16 13 4 -22 18 -75 -44 -3 5 46 -29 -29 1 -22 6 9 -5 36 -23 -13 -7 27 27 -5 4 7 4 -13 17 51 5
4239 5 18 34 12 75 15 -21 36 -25 3 15 -1 -7 54 -57 -45 -33 -78 18 18 -48 13 7 -1 -2 1 27 23 -39 -35 39 12 34 1 -54
4273 -54 50 -13 40 42 18 26 38 -44 -20 50 30 67 -53 -17 74 15 63 62 -15 -4 13 -23 5 50 -1 2 35 -1 -21 -39 25
4304 25 -2 -62 2 -25 -90 61 10 -77 -47 -3 45 -19 28 19 1 -2 -6 -20 6 -1 -2 22 34 -26 53 4 28 42 55 -64 25 34
4336 34 2 20 -15 1 1 -4 17 -14 2 41 19 -24 -18 -47 -66 3 39 -42 17 -34 14 -2 -85 33 -12 -13 23 -6 -47 50 11 42
4368 42 9 -4 -28 -6 -16 22 1 -22 -28 45 -55 -11 -7 22 -45 9 5 -31 -21 36 -24 3 -21 -42 33 -15 -14 -8 37 -15 -18 -44 -34
4401 -34 0 10 66 10 -12 -24 29 40 -12 34 3 27 16 86 34 28 21 24 16 -7 -28 20 -63 -19 -25 6 41 -32 12 -32 -16 1 -32
4434c2M2p1K6NL1k4J9L4j2l0L8k8lJ1nl2LP3m1l0k2O8M4p0JP1j06K1L7o2P2m2
4466a4ql4J44j20Rjj3j3RQ6m0J5L2q5O9k8J0K5k8k8L0m1M4N8o2qj1O6m5Lj6K2
4498B7m8M7mo7M0RkK8n5J4J13j14K0Ok3pK5k9J7j3J5j0J5k4M4Mp7M8l3J1M4n3
4530c2Q0l5k8L6j6n1R4qq2N1kJ8lrrL3r7J34j38L1O4n1N7j9m5J2L2o8L6K7kK4
4562C4k9m6K8k3j1O3k1l8O4o2J8O8k5k3K4Jk7l9M1O8p2K9L3j01O7l2PJ2k7j7P8
4593D2n0qN3n9pM7n3O1pj0j6ol0Q6n0LK0qJj3o3M5MK8K8Nll7m9J0P1j2m3J1J9
4628A0pK8p2N3l3j8M2jJ5K0l7J8l2J3J0K4l7Qo5J9Q4q9K2Q0n9M5lo9L8K0k2kJ3
4661A6l8J01o4pj8K7k8K0j6O9r3K5L9m7M0M4r8OL9m4J06p0J3Lo3RL1J3l9O7m0
$$ plain form
4434 -32 10 -61 -35 -30 1 -23 -4 30 18 -12 26 -2 -5 6 1 -31 -28 45 4 -26 -48 20 64 -6 -5 66 -40 -19 18 -44 28 -14
4466 -14 -22 -56 88 -32 -23 -24 -37 -50 -41 45 5 20 52 -33 36 8 18 43 15 -13 17 -24 20 78 16 8 -3 63 18 21 5 27
4498 27 -21 26 22 -45 -5 4 2 30 -25 -11 102 -12 8 14 -9 -16 9 -20 -3 -16 -1 -11 4 -20 24 28 -49 -1 -34 -23 21 -32
4530 -32 48 13 -15 21 5 -46 48 40 -42 9 7 25 22 13 4 37 -60 74 -64 -33 31 -20 37 18 -27 -15 17 -51 -15 12 10 34
4562 34 5 -41 -13 -36 -47 16 -5 -43 21 -41 -23 45 20 -3 21 22 -5 -44 -3 65 -7 22 55 -46 21 -11 -4 8 -19 -36 42
4593 42 -8 -16 37 -22 -29 18 -35 26 19 9 -7 -13 -43 43 -7 -4 16 8 9 -4 -67 -22 -18 10 38 43 40 3 -46 -36 35 23 -20 -9 10
4628 10 3 31 -41 12 -21 -39 3 2 17 37 0 18 -14 -1 9 33 -4 4 -61 -42 42 -47 -25 55 -4 41 38 -31 7 27 5 3 16
4661 16 -22 79 15 8 -10 17 -11 9 -7 62 -31 -6 33 -14 26 70 -28 -22 17 -27 79 9 22 25 -38 -29 2 15 -24 43 3
4692CLj8J0kl6K0L1j2J3j1L5l3J7Jk1J0k4K0lKm8O8m2M9k6OL4n2pK6K9q2M2K2
4726B4K2p1J9PoRM6o1k0K4j1kLO2o1j4ML4J8m2j3Q6l2K5q8P1m1Mj8P0n4K5l4j3
4760b8L2l1mK3LqJ6m3nQ7l3j6OL5k2K3o8JL9lLK0Nm8K5N9j05M7J0k5nM7l9K2K6
4795D6l9J5J3l1l4O7o6%J4L1j7NJ5jo0N8rj9pN2q6lJ8OLP2m3l4O0n6L3j%K4k1
4830Ejjp2O7j4N2m3M7l1L5m1l0PM1Mn2N8l4RJ1j0l6M4k5j3l6P8j4o8R5k0l8L2
4863FK9n6j4MP0q9M7J2m2L4J0l0kJ1J9M4l8l0j3Q6nj8n5L4j9J7J3o4J5J3J6j1
4895fK6l0J9M8p6j3M3k9M2q9O3O6or3M3l0N6n8lplK9O1o2JJ5j4K4M2o2j1J8l9
4928c5M4l1K1L9k3ql1kL8orm3P6k9J4m1N4Qk8J7m7J8KKJ4L3q1P7mPo5%N1o5M4
$$ plain form
4692 3 6 -12 -2 -4 -40 -20 11 -1 12 1 36 3 20 21 0 10 -14 6 3 5 -43 25 -17 32 6 12 46 -6 -13 13 42 -40 2 24
4726 24 46 -25 -6 1 -5 4 50 -11 -31 -7 -18 -20 -17 45 -16 -30 -26 8 26 -16 -29 57 25 50 -38 33 -8 -4 -22 48 -6 19 -15 -28
4760 -28 4 -27 -31 -8 -5 -13 3 -40 -45 42 9 -7 -1 34 12 35 -33 -32 7 4 7 27 32 -16 9 68 -37 10 20 -5 -10 37 -2 20 46
4795 46 7 22 35 4 -30 37 -29 -29 -15 16 -1 4 19 18 -42 16 7 -12 -19 33 -53 -56 -38 -32 -29 43 0 -34 26 -30 3 2 2 26 5
4830 5 4 3 -69 -2 -16 36 -7 40 9 44 3 -27 -20 21 25 -27 31 -3 6 17 7 -29 15 -10 -23 -59 19 5 -63 32 12 -26 6
4863 6 35 -21 -35 -31 39 -50 -3 9 -33 1 11 -19 -21 -10 9 53 15 -15 -28 58 53 35 -20 14 -5 12 25 -39 -24 -11 5 -6
4895 -6 20 -10 9 57 -19 -32 11 -18 24 -65 -2 64 58 -35 8 -22 34 -24 -27 -34 -37 -8 53 -9 -8 7 -7 17 59 -3 -14 4 -35
4928 -35 9 -22 -1 38 15 7 -24 -26 12 6 -3 -46 30 1 15 -26 28 36 8 25 -22 -4 -2 0 14 47 -34 43 39 46 -19 -19 32 -33 11
4963A1k5L4K4m4K6o8M6K1j9k9L6j9J2o2L5N3n8Pj8N2Om0k2L3Kl2L6J9J0j9m1O4
4995C1jp0M0P3n0k0ko9J8Q1km1ql4L0J1O6k0p7K1KL4Pl8%J9%J6k1m8P8m4jM1l2
5030a0J4L2j2n0kL3j8J1JJ9j6j8M0k4K2K2l6L3mn5pk9Q5n8J3J3J6J9p6O0j3j9
5062a4J2Qk2P1n7J5o7N3Om7K4PRn2M4oN3l9NkK2j6K2n4J8j2K3jPpk1%J4J7K1j9
5098A5m8J6OM2n2MK4K1n4L6p8K0K9J5j7k1K6NK4j2j1k0k4P3k4l3J7M2m3J7M2k5
5130A2J7m0L3lkMK6j8j4l0Qm0P4j2K4k1m3Pk6N3j1m3M3l3Q7l0j3q0P6ok6jK1J0
5164Co1Q5j8J7Mn2MmN9n6Pj1J5LM0k8K4l1o8J07po3J2Rj0N3n2M6m0p7P0n9Q2L2
5198C5p3K9pKkk7QpM3rK3l8j9L2K1J0o0J1OK4K6L0l3n9N1L0m7Mk2j3P5o7J0kK8
$$ plain form
4963 11 -14 20 44 0 26 -42 4 25 6 -23 13 -6 6 -56 -21 32 -26 -19 -37 15 21 -19 -41 -8 -6 -38 -2 17 27 8 -33 31
4995 31 30 -40 0 73 23 3 1 -68 -50 31 29 -12 -20 -54 -24 -13 53 33 -44 -23 -21 13 20 -18 -18 1 1 17 -4 -52 26 -18 -19 22 -10
5030 -10 4 36 24 -26 -28 5 -13 -2 -1 18 2 -16 24 0 22 44 8 41 37 -18 -25 -54 31 -27 -14 -1 15 34 -42 18 5 -14
5062 -14 -2 6 -16 55 -2 13 -54 -1 5 -42 -18 -11 -2 -54 -10 -16 37 -2 3 1 23 7 29 -25 -7 -19 4 3 10 3 -18 -18 -4 13 34 15
5098 15 -33 -17 -11 31 -21 -17 7 28 -26 10 -68 -48 -19 -4 -21 -42 -16 -11 13 1 -10 -30 -54 19 -5 -38 -21 21 -22 -5 37 12
5130 12 29 -11 22 19 17 21 47 29 15 -15 -7 -47 27 15 39 18 -25 -18 -44 9 -2 -45 -2 -35 52 22 9 -71 5 -1 -27 -28 -7 3
5164 3 -58 27 9 26 30 -22 -18 -22 37 -19 -12 -23 -8 -5 35 7 31 0 -68 39 32 -31 -19 -10 -20 33 -19 27 -13 -90 -20 -79 3 35
5198 35 -38 -9 -16 -14 -16 -43 -35 -42 1 -8 15 -23 -42 -10 11 21 -39 -28 -22 2 28 58 25 -34 17 47 0 4 -18 -31 44 -23 -13 -15 13
5233A3l8k8N2n2PM6nn6L4K1K7m0nJ7J2oK0k8J2j8k1M2n5O1J7j1K5j6n5N9oj8L6
5266D3m6Rj7RL5o0K3QpM3o9MM2n5J7J0J8rj5J8q1O0L0l4N6l3J1m8J3J7k9L8K3
5299B4o7L0O3k9m1N0J0l2OJ1n1N3K2j9j3K1k8k7M2k1l4L7k0QOn5K8M7J2j7lK4
5331C7q3N1m1J1LML8m3j5L3k6O0j3Nk2jj7J8k6NKk8M2K4l9PmJ7Ok4J6j0J9J4p
5366A3n7K3Nj5Rk9M4l1pN2J1Rr0O6L4l6J9n9O6l2N8n4k3MJ4j8L6l4M0j4K1L2m4
5399A3lj8j8N6n9L4lqk2nO8m0j2K6k8O8l1Qr6O7j1k2O1q2Q3k2k1LMKJ0Ml9N9k3
5434Ck3RN2l5L4m2j8n8R6nnqO1n5%J7j2j0J1l1J9l1M8o2K6%K0J6k8OKnn8N6l9
5469d9K4OJ7L6q3O4KJ1j5n7L7L1j4j4k7j7J8p3Q1J1L1j9L8o5MP6m8K9p7L7K5l
$$ plain form
5233 13 -25 -53 -1 -53 -46 0 -5 -61 -27 -6 21 -19 -24 -7 5 -1 19 -9 3 -15 -36 6 -49 12 29 18 43 27 -28 31 25 7 43
5266 43 -3 6 -11 -2 33 -27 -4 4 -3 40 -29 -25 17 -38 -21 -11 7 -2 -17 1 -80 -20 10 -24 32 -1 10 -38 -25 -8 -37 1 24
5299 24 -43 -13 50 21 -20 30 40 8 14 25 -26 27 49 30 17 38 10 -17 25 4 -30 7 -13 -5 1 -54 -26 21 33 16 13 37
5331 37 -46 5 -36 -25 -22 -18 20 -23 -38 -5 -31 29 16 21 -1 -2 -19 -1 -27 -22 -20 -48 -6 18 -21 -14 -18 -1 5 -19 -3 -13 6 20 13
5366 13 -44 -21 -16 -31 -22 -51 -7 -38 -45 7 18 27 -63 3 37 1 20 -39 27 -5 53 -1 -24 -20 -6 -24 12 -22 18 4 25 57 13
5399 13 10 -8 -26 30 -29 5 2 -6 -28 -33 35 -5 -17 9 -19 49 18 26 -70 -3 -14 -36 25 -57 26 4 -17 -14 -10 -8 2 6 -33 26 3
5434 3 -20 -11 41 6 40 -2 -20 -78 18 13 8 0 61 6 6 23 11 1 12 -19 0 -31 17 -45 -19 -19 1 17 -11 -5 -3 -8 -66 -10 -49
5469 -49 -25 -19 -2 34 -49 15 17 28 13 -44 -7 24 10 -4 -31 -48 -30 -103 -22 -11 20 1 39 -26 -22 54 6 35 -42 -5 20 17
5501A7j8k3J5j9M2k6N7k5%k4M3j8k2J4nJ6j5j8L7K8n6O4m3jl6pj7N8n6K1K3m5
5533c9M1j7L1Pj3p2M8L7p8N1K1k7l3P9j11M2j1M2k7J6j6O8l0j6K3nJ1j4j2m9N3
5564@K6k2k1O4k5lj2ql3M5j3j5k8N0K5m7J1Qk4N6o8L7qK6J0k8qJJ8n8J6l7M7L7
5598A9M9n2k0jK7rj0J2J9l9ok1L2p7L9K1Rl7K6M4l1qj9O3n4K8K2J6q5J4J8k1M6
5631A4j9J5J2PKk5L9o0J6O9m2l7K4Kj2L3k5L4l0n8M8NRL4p2L4m6L9n3Q2m0RlO
5665A1l2j5M3k6L9k5K8Rk4o7N6l4PO1q1R4q0M5m6L1j2LO6o0K4Qk0k3L2Q%k3L8
5698C5l3jj4k0L4OKJK3q3QJ0NL1K5j4k8rJ6JQ6o7j02P5Jk8M5j8K1k5J6l8O6j5
5732A2qRl3K3J2L8l3O4q4L6J0l5M2l4k2K8Jl3o4J03l7oK6j9j1qK7l1M0j9Ok0O5
$$ plain form
5501 17 -1 -24 -9 -28 14 -12 45 20 20 -4 39 21 -1 13 8 24 9 -9 28 56 0 64 21 20 -16 -23 -40 18 -38 -17 6 -39
5533 -39 2 -15 16 23 10 -62 -14 23 -55 -4 17 -10 -43 36 -75 -33 -44 -2 -29 -13 -29 39 9 -7 16 11 22 8 -4 -53 0
5564 0 26 4 -17 47 22 19 7 -1 -34 11 -2 -17 -45 5 30 -17 -6 2 -22 34 -34 3 -5 21 31 3 -5 -4 14 -44 -28 -65 -18 19
5598 19 68 16 -4 -5 22 13 3 15 34 -5 -11 -32 0 -77 -38 -17 -8 -45 -19 25 -6 -14 -33 30 -24 4 26 42 -43 -29 -11 -32 14
5631 14 -5 10 22 29 31 6 45 -15 1 70 28 -9 15 17 5 38 13 47 17 -41 7 12 21 55 -17 17 -29 10 -43 39 -1 8 5 11
5665 11 -21 -36 7 -19 20 -5 23 32 8 -59 -3 -37 -30 31 -50 44 -36 9 -37 -6 -18 -15 51 -9 15 23 3 -20 12 20 20 -3 35
5698 35 2 1 -13 -33 1 7 9 10 33 -50 -42 -32 -27 4 29 15 -13 -22 -6 -5 81 14 -88 -13 -12 -40 5 -13 8 -17 -1 -39 27 12
5732 12 4 13 -20 3 15 53 20 84 0 36 46 11 53 19 -3 25 26 -7 -71 32 -5 -11 15 -4 -15 -23 4 -27 13 -6 0 -20 45
5765D5l2mkJ8M0o7p1J03kl5L2LkOl5J3lK8Qn6K1l9OL8j5m3M5k7k5O8m2j9L1l1
5799d5K5M0m0r3Q0K5L3k6N2m6J8q2L3R0Qk7l8K0nn4M3l7M5rkLK9o9j9N8k8j8O9
5832C3l1j2J0K8o7jJ8L8k0J5Nk6J8l4J1j0J2j3k9O8j6M0l4K4l3j0L7k9J8j8j1
5863a9K6J9j6n3N7l2M4n2j0L7l2N3j6K4p2P2J3l9k7O0Kn2j7K9L9j3l6L7m8M8n0
5894b4j9R4mq5L8rjLrN0k9J0Jn3j1L7m0O0p1L6%N4Lm8L0j1j0L4k8L7l6L0m0k5
5928c6M7nRm5J2J9K3o5Q2k7J6Rj3J3m2M6J0r1L8K2J9Om9OK7K0n1j4K2K1j6n2K9
5961a0k8O4Om8M1m0lJ20j62RQJ7O5J3q6N4jj2m7J9O1n3K8mj5Q9q2RNJ3j6qk0Q
5995fL1k7k7QN4J9p3L3o3O8o6J3L1k2M1n6O5m6MK5k4K9r1P4K0k0N1q1R5j4m4K
$$ plain form
5765 45 13 9 7 25 65 -2 -73 30 28 -7 25 28 26 32 -3 10 7 35 43 -13 8 -31 -25 13 -2 -45 0 -27 -52 16 -26 -45 -14 -45
5799 -45 -20 20 -20 -113 -33 -8 25 -1 51 5 23 -59 -26 64 72 45 7 27 22 -32 11 -26 19 10 8 11 40 -29 -48 10 -18 -36 33
5832 33 2 -10 0 28 -39 -40 -22 16 -4 11 16 -10 8 -26 -15 -25 -13 -26 -55 13 -3 37 3 27 -6 -16 21 -8 10 -8 -19
5863 -19 7 26 10 -43 14 -18 26 -26 -36 1 -31 22 6 30 -42 30 43 4 -23 37 39 -13 -30 -1 38 25 -11 26 -22 26 -24
5894 -24 -43 51 47 -38 0 -9 -10 -7 -16 34 5 15 16 -37 -48 -11 -51 9 -62 -26 -26 28 31 -17 13 2 -8 26 -2 35 -1 29 -11 -36
5928 -36 11 6 15 -30 -18 1 24 -41 41 14 30 39 26 39 -3 43 53 -38 0 22 41 47 -2 4 31 51 0 -14 8 29 13 -39 -10
5961 -10 -38 26 32 -16 25 -15 -18 102 -60 -51 -43 -26 39 52 -34 20 19 7 -40 -21 40 -13 15 11 -4 85 3 12 17 30 14 6 -14 -6
5995 -6 25 -2 -29 -21 33 52 -21 12 -51 17 -49 -36 -5 -27 14 -42 23 -23 -19 6 -18 11 -80 -6 14 -6 45 -36 59 45 1 3
6027CqN7n1Kl6J6K9lpJJ5l2l2N8j9M4l1mJ5l0K6j8mmJ0k4NN8Kk4q1O9K2m3K4J4
6063A9Qo4M0N3m0pK3ql8J7n4O1l9L1P3r8pO4J3k7L2n4J1j2Nk3LPj0J0ORj7k6N6
6098A7L4o5M8JNj8j9L4m5kj6M3j1J2J9p3L8M1r7R5n1J3J4l6M7m0M8n1L0Rj0l6
6130b2Lk2M5L0p3K8j2J8K4n7N1k5N2p4K5L6m0Oj9N1j2rK3r9N9J5j4N3k3K4k6J0
6162B6l3K4j2l4M4m9Pj2rL0K8J7o8kK5J5k0nL3n4NL4p6R1o3P0K1m1j1K3L8k1m5
6195b4J4K1J0L3m1n8J03m8J1ok7m5O7k3J4Qj9p8J01k9L5m9N7n3M6m5m2M7J7J7
6225A4j1n6N8K4n4K4m2N8p0N1k9OM9M8q4L1o4L4N9rQm2M7q2J8nk9L0kPJ9PJ1N
6259B9p0QK2kL5o0%M8M7n1J7m2j8J07j01l1N1K2J6k2n2Q1j5l1mORP0o1oO5l2k2
$$ plain form
6027 3 -5 52 1 3 -33 -17 12 9 2 3 18 -14 -46 12 -7 37 6 2 17 -13 13 -5 -9 -13 -3 -27 -22 36 38 14 -67 2 24 -19 5 19
6063 19 27 -37 3 56 16 9 32 24 -14 3 -51 10 -29 2 75 -23 -30 34 47 20 52 -2 9 -3 2 -21 -18 -11 -21 -11 -5 4 -13 -39 17
6098 17 51 -14 34 35 40 22 3 37 -8 -10 -26 17 6 18 37 -36 2 43 -54 41 -10 3 17 -19 28 -12 36 -15 15 24 14 -22
6130 -22 -19 -41 4 34 -39 -11 -23 -5 19 -38 13 -12 40 -34 -9 27 -13 -7 -26 25 13 4 27 -72 -13 2 -12 41 18 42 16 26
6162 26 -7 17 5 -29 15 -34 -27 -39 -48 -18 10 27 -41 -43 -18 -3 -23 -28 5 -49 -44 -10 -86 5 -58 12 33 -8 -19 4 42 21 -24
6195 -24 -10 11 21 54 13 -45 58 10 21 15 -12 -57 10 -13 1 9 -10 -88 13 -16 19 -30 27 -26 20 -25 -67 -20 -3 14
6225 14 3 -53 5 29 -25 -1 -43 15 -55 -4 -33 -27 22 70 -14 17 -47 -13 46 37 45 3 50 -32 -14 -19 -48 -18 -20 -13 6 13 24 29
6259 29 -41 -33 -11 -13 22 -38 -38 10 57 6 23 -19 -37 70 -31 -62 -11 11 27 5 -47 34 19 -12 -16 -10 -1 69 8 2 67 35 13
6292A3j1j9N5n8K3k8J3J%J4j6M3m8k6N6l1N4o1j5M4L0Mo6K5nl8L8J4J4j1J2pm8
6325c5M1j2l1J2L6n5R1r0O8p3M3K8k6l6MM8mj3L3m7K6m2Q6j11M7K8o2O1J0o7L3
6356iK9lJj7l8J6M5OMj1l1K7L9j0J5p0N2p6MO5p5J5rK5J1K8qm8N1mj0m8j6K7m
6391b7L0j0N4n5J1J2j4J6m8nP2k6Rm3N2K6n7J7n0L3j2l6OL5pN0n0nQKJ1L1p6L0
6425a6QL5p4K3N2k0r1Q6k6j0K5J8Ll2j6KO8m6N4j0n2L2j0L1l2j0j8j3O7L0o0K0
6457A8lL2j00R5o8J0L3j6J5l0L0o0O2oJ4k0l3L8m5MK9jqJ7on5P2k3k1RL8j1K5
6490C5l2NKj1L3l6k3O0pp6Q7n5J7k6rN9q4M6J9j3j4l7O5o8O5j9m6M2Mo2L7P7o2
6523b7K1ok5M0Nl4J4K2Pn4O0l3PnN4o4M1NLj8m9L5L5l5k2K7J9n6J1%J2J1l3L0
$$ plain form
6292 13 2 -17 38 -20 3 -25 -12 -11 -11 3 -13 30 -18 -44 12 -19 35 -26 -41 3 33 37 -29 -4 -9 -47 -9 5 19 8 20 13 -35
6325 -35 6 -6 -37 -25 11 -44 47 -43 25 -48 -5 23 -3 -39 -35 13 9 -4 29 -18 8 -34 52 -59 -12 16 -46 15 25 -42 -9
6356 -9 20 17 18 1 -37 -21 24 30 34 23 -8 19 58 48 63 -7 45 -31 -27 38 -37 -22 -31 -6 5 33 25 -23 28 24 14 -34 -50 -23 -27
6391 -27 3 -7 47 -8 3 15 1 17 -31 -36 36 10 19 -24 28 54 -3 14 -36 -3 -15 -51 -45 -10 -17 33 -17 -22 -14 -12 -1 30 -46 -16
6425 -16 -8 27 -47 -24 28 8 -83 3 -23 -33 -8 10 13 -19 -35 -33 35 -11 43 33 -19 13 3 34 2 -8 -26 -39 28 58 -2 18
6457 18 15 47 -53 42 -26 -16 17 1 16 -14 16 -44 18 12 26 6 -27 11 -34 -30 -1 -2 -10 7 1 -54 18 -5 -26 -17 21 10 35
6490 35 3 8 10 -1 32 -4 -27 33 26 -50 37 -18 -1 -27 -36 23 -61 -15 4 -9 -23 -60 5 -63 2 -17 -63 -21 -17 -79 -42 35 -27
6523 -27 -6 -12 -37 3 8 -26 -12 10 17 -37 23 -10 -3 -8 46 -18 23 28 31 13 -36 -1 34 -1 -23 4 23 -33 -22 -22 -10 1 -32 -2
6557bj9M2m9kO3o4Mk5L2oP2l6l7L2m2L3J0K4Rl0Oj7j1%M5m7M5l7L7m3J2Rj1ml
6592a0N6q4K2j3K6K3o2J6N8q7M9M7n7NN4m5rk5N1n7L5l0O7p4L5O1n5J1LmL3j25
6624h5R4j4jl3L1N5Ln1j1L1n3N5ko3%L6j4J8j1Pj3k2%MN2mj7l5R3l5k8L5k6lK4
6659A7j7qL2k6K8K4m9nK8k7p7P0M7j8l9j7O1M5l7q0N8pm1j6K5Q2n9M7p0O8r3J2
6691d2K2K8L3q2K2O1k3Rpj4m0J5L6L4Jk4l7M8n6L2mK0lk6k1L9j4k4k0O4l6L4o
6724A9k1j0J0n6Q2Ro0K1%J0j9J9j3J5m4L0K5m0P0l2n5J9K3k4J8M4q9L8Mj8J0N7
6756D2o0K5J0j2Mm8M6no2O4k4%l8N6l8Q6m3kNJ1l2k4O2l5M2j9Rn3J7N7j9k3M5
6789D4n9j5K0MN8j8kj7J8l4K2m9j0M2Qk1J2k0K9n3L4j5OO6r7N6Rq2L9L1l7RjN0
$$ plain form
6557 -2 -21 21 -28 -30 33 -31 -27 -52 -20 -26 46 10 -27 5 -37 -4 6 30 39 9 15 -2 -13 -13 32 -15 30 -7 30 -13 -1 8 -3 -7 -10
6592 -10 46 -38 -16 -29 -3 20 -42 -26 32 -55 -6 41 -16 -11 43 -2 -11 -36 15 -42 -7 -37 30 -44 -9 52 -3 8 11 7 40 -85
6624 -85 9 -5 -6 -39 -8 47 50 -1 -12 19 -34 21 19 -44 -44 -8 -22 -4 -15 -8 -21 -43 -43 -39 13 9 -8 -43 50 15 -13 22 -4 -7 17
6659 17 0 -8 24 -2 26 50 1 -4 24 -3 -80 -10 37 19 -20 -37 24 69 32 -48 10 3 -38 -54 -29 53 -6 41 -29 39 -54 -42
6691 -42 -20 8 41 -41 -19 42 19 28 21 7 -33 -18 18 52 53 29 -8 40 -16 16 12 32 29 3 -18 21 7 -17 -37 27 -9 25 19
6724 19 -2 -12 -2 -58 24 33 -27 -6 -6 4 -15 4 -9 6 -38 -8 17 -23 47 15 -40 -21 2 -22 -4 40 -49 -11 -7 -25 -15 42
6756 42 -18 7 17 5 9 -39 7 2 -60 4 -20 -20 -58 -2 -40 46 3 1 6 17 -15 -39 23 -12 30 11 20 -33 -16 41 22 -1 44
6789 44 -15 -30 -10 -6 52 34 32 15 33 -1 21 -28 -38 4 12 -9 3 -17 12 -41 -7 -22 -16 50 -47 9 18 -64 -25 6 -31 -22 -23 27
6823B7p8L0O4m5rM5m2KnN1m4K7M4n4j6l9L1M4%m8Q7p3L9L2n5j5rJ7Rl9L1J3m0
6856a8L6n7j0K5OL1K9m3j6k7L9K2j3j6Rj1J8QK9l6rK7J1jL9m1L7m7m0K9PK9o1
6889a5M8m2L3k6L7lk9J9m2j1N3j1k5MK0m6L4L8q4K3J3P6m8K2j4j4k2j7N0j7L3
6920C7j14J08l6K2m1K2m8P0n1j0M7j7j5J5K5QK0l6M6n7J0qj9oPj3mL3m2K5k0R6
6952E4p5J9Rj8L6n1J4J6L0rM1k2p5n8O2M8J3m4N0m4mlLnK4k8j1QkM9no2K5M0l3
6987hJ4o8K5O0l0QKj2K3O7r6kL5J4j2K8Ll4n8Q7k5k1O0k2j05P8Rn0K1oK1j9L4
7020B1k8Rj9n9J9N5PJ4J0l6J7l2j0N3J4KLl0K0m2M3m2RNk6L0M2l7kJLNK0L0r9
7055c0m0O3J1K5n0J3JL9n6N8j8j4K5o4M0M2m6j5N9m0l3k4Q5l4Qr8P9O1n5J1Qm8
$$ plain form
6823 27 -51 -21 43 -2 -11 34 -8 -6 -11 40 -4 23 67 13 -3 -42 -11 33 33 -15 72 -1 38 70 15 0 -9 8 17 -22 9 22 -18
6856 -18 18 -39 -49 -24 -18 13 42 -1 -17 -44 -5 17 4 -12 -3 -14 4 12 41 5 -4 23 34 33 72 31 68 21 -19 10 17 46 -15
6889 -15 33 -9 24 -2 35 32 3 22 -20 -31 22 11 -14 -10 10 -36 -2 36 -48 -25 -12 64 16 38 24 10 -12 -29 21 4 37
6920 37 -77 31 -5 17 -24 -2 -50 20 -31 -41 6 -11 -26 -11 14 22 42 6 52 -5 5 -3 -22 -28 -21 -34 -38 -5 -47 -22 -42 54
6952 54 -21 -2 7 -11 25 -26 -12 4 34 25 66 44 -31 -89 -27 21 34 -10 40 -4 -8 -11 -8 -13 11 -17 -28 -20 -22 27 22 -40 -15 25 -8
6987 -8 6 -62 -37 23 -7 1 3 -9 14 81 -15 -17 18 32 20 48 51 17 -41 46 21 0 60 38 -67 11 20 -30 -9 -15 6 -13 21
7020 21 -7 2 -17 -76 -57 -2 5 19 29 -7 10 -22 -32 21 35 37 40 10 30 -12 31 -11 -2 3 -23 7 49 12 10 11 14 19 39 69 -30
7055 -30 -70 -7 4 29 -21 -8 -7 32 -24 34 16 2 27 -37 3 45 -1 -16 43 3 -30 -54 31 -3 5 -93 -14 47 -8 3 11 -37
7087c7RL8Nljl9j3P8K8p2k0J4M6m8l2R6qn6%K7J0Km5M3m4m2K3N0o2M1m0M7L6p3
7121d2mL9NK8pk8Ok5J9nKK1J0j5L8m1L8j7j8M4j7qj3O0l6j04M9loj7PM1j9N2q6
7156e2O1m7LO4k5K4n3j4O5o7MK5K2Oj1Lm4L8K9k9j4Oj2O7q1O3m7L4m7j8K8J1K8
7189B0k9M6l7q6Q6j3K5K6p4Q8r7J3Nj0J4j0K6j1M9k6k9J7N0o8NL7K2J1q2P3l2
7220IqqM3l5K3q8Q3k3K8j9Oj3K3o5L1K0JJ9Nm0nj0J3N0p4P8lJ9j20J4N2kO4o3
7254EK5k6L2Mp7L5k8R1q7J6K1ONl1k9P5k2p7N1M6q8R9Kk5o1nJ9K5j2L0j6j4J7
7287Fj7K0oj8K1pK2L9l5L5o3K2J5p2P1K3l5N4r7L9k3k8L1pl3J5L2J9k8nj5J7M7
7320C9m6k0L7j3l1M8n2MJ1L1k0KKK9nj0k7P0p9L5J5l8K0J3j2m4P7m1K2l3l5P1
$$ plain form
7087 -37 -28 10 15 12 11 -28 -41 37 65 -7 -27 -13 33 -15 -47 49 41 -15 -15 12 22 24 -21 22 -22 -64 -41 9 -53 -12 -52 -5 31 -42
7121 -42 -46 -7 -2 26 19 -9 -3 -28 -9 -14 -12 9 19 4 42 1 39 22 4 48 31 23 10 70 34 -70 -21 -24 -30 -47 -40 1 -18 34 -52
7156 -52 9 -38 -35 29 4 28 -25 -39 26 -41 -37 -12 10 16 5 8 -36 2 31 2 -12 -6 -18 49 -32 31 -16 18 -29 -47 -19 -8 20
7189 20 -9 37 0 -86 0 -13 12 38 -36 52 -45 -32 -27 -37 -23 -33 -7 -18 31 5 -24 -7 43 -25 -20 17 39 50 -32 41 9
7220 9 1 -7 36 1 24 -64 19 -4 24 5 11 -2 21 -44 -13 7 8 27 32 -8 -13 -23 -10 40 -34 44 41 60 -60 -46 6 4 68 5
7254 5 30 4 36 40 -37 -2 -30 61 -26 -10 11 17 22 -9 -38 37 15 -62 -11 35 -53 46 48 23 -38 -43 -24 1 -11 19 3 -11 6
7287 6 -11 9 3 -15 6 -1 21 60 25 60 -3 19 34 -38 33 56 21 75 -22 17 -6 -34 -3 -10 -43 -28 4 23 -5 -10 -25 -8 39
7320 39 -7 -27 10 -3 -34 14 -38 -34 -23 8 -12 -10 -8 21 16 6 -21 49 -30 5 20 -18 2 15 3 -41 36 -5 17 -16 -51 20
7352B0Jj5Lm3JL9mJ1Nl3kJ0L5rl4PK3j0L0l2L5%k0qJ4m3N7j8k4N6l9k8J4PN7o2
7388Aj2l0%M6oMK2m3K3j2Jk3M7j4ML2o2N7m5pJ3j7J0l9N2L8l6J1p0N1PM8k3k5
7422CJ2n7P3rmJ9l7j5N2m2LJ7m1L7m1L2PK7m2n0N0k0kj1M1Kj6K8j7PMm8O3j5l8
7457b8qK6PON8n2Km9QO4k3k7L7k1O8n7Prj2QK1JJ3l6k1Lk2N1o5J3J9L6m6k2Q3
7492C3j7j6J8k5JM7n6l2J7k3R8j6m2J2j2jL8j9Nj3l5K5lk9O7q3J8N1l8K1K0K6
7524C7k2rK4l0j0JOK4j5J9l5L1k7j9j0L2j4m7M5l2OJ02o4M4j6k3nK1k2jK5n1Q5
7557E0k5l0K2J4j0J4n1K1l2k8L6j3J8J3k0P2r7L3K4J6m0mj8K4OJ1K0j3j2p2P5
7588DK6k9J3l9K7j3J7mJ5M3n3mK5K1j5m9k2L5k4J4M1K6j2o2K4oNj4k2J2K6j4k8
$$ plain form
7352 20 21 6 9 -34 -33 6 2 13 18 -15 -17 -7 28 19 -15 -8 15 5 35 3 38 38 18 10 24 -19 38 20 -4 52 13 -15 -1 6 63 1
7388 1 -11 -41 -41 5 -1 3 25 -18 5 -7 -6 -29 18 4 8 40 -22 35 -10 -17 -4 -21 -11 -50 2 40 4 15 -55 -4 3 51 28 3
7422 3 15 -42 31 22 18 37 0 -15 37 -5 -2 15 -26 11 -30 2 9 36 -6 -56 -6 -26 -28 -39 2 4 -12 16 -1 6 10 -38 25 10 -28
7457 -28 -36 -10 -3 3 61 9 11 -38 -30 34 11 -16 21 0 68 11 18 9 -3 5 26 27 40 4 -17 -14 -36 15 -50 -37 -18 18 -28 -50 33
7492 33 16 0 18 -7 -6 41 -15 -47 -30 -53 45 29 -13 -1 -13 -14 24 5 10 -3 -38 -13 -16 -45 22 -61 -43 8 -30 -9 11 37
7524 37 15 6 30 0 -10 -9 -3 21 6 25 -10 21 -6 -25 -35 -3 -17 -64 -19 -51 -45 57 -7 37 21 -2 -7 14 -8 -9 16 -35 50
7557 50 25 -5 17 31 21 35 -16 5 -27 -55 -19 -32 -14 -1 -21 51 -46 -13 11 27 -13 -17 -35 -11 -5 6 26 13 1 -71 4
7588 4 30 1 14 -25 2 -11 6 2 17 60 7 3 28 49 34 -15 -37 -2 -26 -12 29 55 43 -19 5 -1 4 -10 -32 -20 6 -8 -36
7621c6N6jj3n2O2j8Lm4J0N8m7M3j8k4M6m0K3k7K5lK7l6PN0m9l8L0L6j3l1O8j8
7653C6q0R1n2K6n9P5j3%p4P6mm4PjRL0l5J1M6q3K3M2lj2k2m0M1pj8QLL6j0J9k
7688B0k4PK8n0qK8l7M6l1J3%k9L1KJ8l3P7r7K8L3Kq9K5K8L1j9J9j4kJ1l3P2j0
7721D3m0J7l5K0MLm1K4m1J4O2m1N1m6M6j4m0J3jJ1Ml4l9K5L5k1ORoMj7LNK8l6
7756b5J7l2J8K0Nk8K8J1K2m7k0N1mmj0l7Q2m8O0l5L7r0j0L9OMmL2o3L9pK2m6J
7790a6k5JM0rJ8nl8j1Q2p0jM8%n8M4N5n5lM2l4j6J7J1k9K3l9K0J0j1lJ7j7l3L4
7824a1j7K6m5P4k4J0n2N5ol9K6k9O1nm4O0n4K1K5n0l2O0J0k1j1J5l0k8N8qL4K
7856C1k7qL8q0P7J4j1m5JMm8O3l5O9n7j0%L9k3kM8m6ol3L0L9K3l6j6K4L4j9m7
$$ plain form
7621 -36 20 19 6 -46 16 -2 1 -43 -33 25 -22 21 3 -21 25 -15 8 -19 6 3 30 -6 1 51 2 -36 -6 30 17 -14 54 36
7653 36 -44 47 -5 21 -38 37 24 24 -50 26 22 -22 -15 -16 -7 23 -12 -1 45 -38 -15 27 24 12 -10 -50 -9 -16 -34 -26 -23 13 3 22 20
7688 20 -4 3 31 -19 -27 1 -36 10 -21 -8 -8 -37 -6 -4 14 -19 58 -39 -11 22 24 -65 -40 -12 19 0 19 5 3 14 -19 53 43
7721 43 3 20 -15 5 9 12 -29 -5 -46 -32 30 -11 40 -6 40 26 -14 -1 -2 9 13 -21 -60 -35 0 -21 -15 -6 -12 -8 -25 -22 -17 11 -25
7756 -25 -8 -40 -22 -2 3 -25 3 14 36 -11 -31 20 16 12 2 -35 47 -1 59 24 61 -29 -39 0 6 10 6 38 -25 14 7 29 -17 -16
7790 -16 -41 -40 0 -9 9 4 -34 -45 37 -33 -34 14 14 -44 0 55 0 -3 39 5 -11 6 17 -12 11 -28 -8 2 -9 -12 5 -12 -45 -11
7824 -11 -28 -2 -47 27 3 13 -39 16 10 -29 -3 -32 29 24 -20 40 -14 7 32 -18 -50 10 20 -1 -12 3 -27 -55 3 -5 29 31
7856 31 4 -4 34 -46 31 45 34 -11 -10 -6 -54 9 -26 43 -14 -24 -24 15 -8 -10 38 -8 -14 -47 -17 22 45 9 -7 17 51 32 -15
7889a5m2O0j1K8Po4Q4n0OL3k8j3N4k6kPk3j5L6n1pj6P3p8N9j8M0l7j7K2m0L4Q
7922bK2ok2j8J3j5K6Q0o0Pq2J06l8%nj5PJ4j2K3l8N6q0P1J1o5N2l2j8l6K9J1L5
7955A9Qn1j8J2M2J7n8L1j1JJ5m1K6k6K0%j4l3N4l7M6Kl4R5n3J0pL5l5n5J9mN5
7988C0k4K0n0P9r2%N7m8L0m2K6J0K1n0K3Np4M7K5nLj9N0J4o1O7n9lN4j8p0K5M5
8021A6K1l6rJ4j5N2jk7J8j5Ql6L8l6j6K0K9o5O2j0p7KK7J4lO3r1J0PM9J3m9L2
8054IJ2j1j1nJ7K7m1jj3QM1j8M1p0k9M3j0k4N1o8K3k0K0k3P0k3l8J1M5nJ2j1n2
8087d3kmO6ol9K2K8l7l0N3q2M2O9J9l9l1K5k3L2l0J2j1JL3Rm4L5l3k7P9n8N2m5
8120gL7mjp1J9N9J9n8rk1K2RJ3Pj2k6k0P6o0K6kNmN3q4K8P4q4l7Q9q5M2qK3J9
$$ plain form
7889 -15 -57 3 -8 20 27 -37 47 -3 3 36 8 -5 49 23 21 28 5 -10 26 -25 -32 -48 25 -53 6 -12 28 -9 -26 -4 -44 -10 -2
7922 -2 20 14 -8 -26 -13 -28 -2 78 18 25 -57 49 11 11 6 -9 -2 12 0 23 -15 41 -39 32 43 -22 30 -2 -20 -56 -27 -16 19
7955 19 27 -24 -42 -30 12 29 -29 2 -9 -8 7 -34 -8 -34 -14 -14 -28 -61 -7 -44 2 4 -30 65 12 22 15 50 15 -40 -21 -25 30
7988 30 6 26 -24 55 -37 -37 20 -28 2 -40 -14 -4 17 -33 -10 -5 -79 -32 -7 -12 -9 -28 22 36 -25 42 -17 -20 34 16 -54 -29 16
8021 16 37 1 -8 6 -9 43 42 15 33 18 26 -10 28 -8 -24 -4 25 -40 22 12 -65 -63 -36 -22 -25 38 -53 -43 -36 13 26 -23 9
8054 9 21 10 -1 -6 11 38 -3 -4 -17 -9 32 14 55 -15 -44 -1 -11 -35 16 -52 -29 -49 -29 -52 18 -5 -43 -32 13 8 20 9 -43
8087 -43 -45 -49 17 11 -28 -6 22 -15 -45 8 -74 -32 37 56 17 -14 11 -12 20 -10 2 -9 -8 25 34 -10 25 -8 -35 44 -14 38 -7
8120 -7 30 26 25 -46 -27 32 51 -7 -16 -37 -15 -6 7 14 2 -24 -44 32 -28 -2 -4 1 -3 50 -34 -6 68 -16 -53 36 -49 -7 -15 8 27
8155B7j0Rll8j0N6J9o5qJ2l1N5k3KK3j6J5q5O3m8P6n8M5Nm1J7N1l9j4J8kK4oK1
8189D1m5k9
$$ plain form
8155 27 17 26 23 -15 -25 31 50 -15 -23 -11 -42 13 -10 -8 15 -1 14 -71 -8 -56 20 -38 7 12 -29 -12 39 0 -14 4 2 26 20 41
8189 41 -4 -33
8191c3
$$ Imaginary data points
##PAGE= N=2
##DATA TABLE= (X++(I..I)), XYDATA
0@%%%%%%%%%%%%qJ6j6J6k4L2m0M8n6P2q8J04j20J36j57J81k08K43k83L24l68M18
34B22m73N35o02O74p59Q52r49J055j171J299j440J594j762J945k143K360k599
51a362K862l154L476l832M233m685N195n779O456p249Q193r341J0776j2622J5089
66H256j8585K3961l3575P6339k71562K25160J73209l97048L20639k7762k79884
77b00852L17877m7230k09992K25648j07691j7341J36546j66032M4495R0564j15838
88d9846Q9364m5770n6701J38516q5340k8172P9931r2652Q6373J661j25925J40964
100E2403l5661q0315J48507j32148j0256J79338j83453J4183J42862j69043Q3485
111I902O1151j72388J37005J8472j32535J26753n3407m4632J33092j24822n92
$$ plain form
0 0 0 0 0 0 0 0 0 0 0 0 0 0 -8 8 -8 8 -16 16 -24 24 -32 40 -48 56 -64 72 -85 96 -112 131 -152 172 -196 222
34 222 -251 284 -318 356 -403 449 -500 555 -616 683 -757 837 -925 1020 -1123 1237 -1362
51 -1362 1500 -1654 1822 -2010 2223 -2462 2733 -3046 3410 -3839 4354 -4987 5789 -6833 8256
66 8256 -10329 13632 -19943 56396 -215166 9994 183203 -213845 106794 79032 -200852
77 -200852 117025 69795 -140197 85451 -22240 -39581 96965 -69067 -24572 65992 -49846
88 -49846 39518 -6252 -62953 75563 -9777 -37949 41982 -50670 35703 37364 -88561 52403
100 52403 16742 -63573 84934 -47214 -57470 121868 -61585 -47402 95460 -73583 9902
111 9902 71053 -101335 35670 54142 -78393 48360 -5047 -49679 83413 -41409 -42001
122d2001J18342j24607M9175M7814j23864J08971R935j12592J01059k5459m0243
133c3470Q6974q6696P599Q1376r0375L8219K1701p9715R5489j8532q4562R9351
145C7359l2994l5675P8936p8388O922P8570q4080K2344L2594o4561O8725j2031
157A7721p0366Q5166k4191l9969P0746o0834l231P7022p5583L686N2821n8082
169b5094L2387J4805n8887N0708K872m0007L9631k3579n814M1968m5045N235L2085
182B1265l7818K3355L991l6578M2200q147k8782L6697k2599k594L2765m2323J2654
195e914K8650m2039K4085P889l7812M2016p111l6286M3838j4847j8994L6961l0164
208i728k302L5060l4508N207K0479k7964J9828K913k6803K6987l951j6130K1229
$$ plain form
122 -42001 76341 -48266 909 48723 -75141 33830 43765 -68827 32232 6773 -33470
133 -33470 53504 -33192 -25593 55783 -34592 3627 25328 -54387 41102 22570 -61992 37359
145 37359 4365 -31310 47626 -30762 -23840 54730 -29350 -7006 25588 -38973 29752 17721
157 17721 -52645 32521 8330 -31639 39107 -21727 -24958 52064 -23519 -19833 32988 -25094
169 -25094 7293 22098 -36789 13919 16791 -23216 16415 -7164 -12978 28990 -16055 -10820 21265
182 21265 -16553 6802 10793 -25785 16415 8268 -20514 16183 -6416 -9010 23755 -18568 -5914
195 -5914 22736 -19303 4782 12671 -25141 16875 9764 -26522 17316 2469 -16525 20436 -9728
208 -9728 -12030 23030 -11478 -6271 14208 -13756 6072 8985 -17818 9169 5218 -10912 10317
221A0317j6282N26K0103k4503P127J1960j9365J7155l637j7725K5986j0308j1784
234a0430K1973j8224K000J9543k6168Q398J4880k2567J4248K417j8982K1260m453
247C895j4579J8636r596l487J4757j6187L822J1154j5045Q348J965j1557J4054
260F180m780q818J4070q502j884J1162j3019L871Q989j3396O715L783j0644R817
274C544j233q237J0092l871l895P820o385P28N213o878L481J631n097N491k393
289A1k846O308n043M1N179o887L371L233p621N795R49o966P283j544n439P740
305C564l515l522P215m633j520N719m881L82L838m387J462J850k966J718J03j184
321g57J497j187N01N04j726K146q30j648L266k194j051L718l346k9L634m227J219
$$ plain form
221 10317 -5965 -5439 14664 -9839 -2712 9248 -10117 7038 3401 -14324 11662 1354 -10430
234 -10430 11543 -6681 -4681 14862 -11306 -2908 11972 -10595 3653 6070 -12912 8348 3895
247 3895 -10684 7952 -1644 -5131 9626 -6561 -2739 8415 -6630 1718 3683 -7874 6180
260 6180 1400 -7418 6652 -1850 -3734 7428 -5591 -1720 7269 -6127 588 4371 -6273 3544
274 3544 2311 -5926 4166 295 -3600 4220 -2165 -1437 3776 -3102 379 2010 -3087 2404 11
289 11 -2835 3473 -1570 -1529 3650 -3237 134 3367 -4254 1541 2490 -4476 2807 1263 -4176 3564
305 3564 49 -3473 3742 -891 -2411 3308 -1573 -1191 2647 -1740 -278 1572 -1394 324 427 -757
321 -757 740 -447 54 558 -1168 978 148 -1500 1766 -428 -1479 2239 -1107 -1136 2498 -1729 -510
338e10K861m438K190J799m012K716O27l069K840m65j873K328j059m07J128j212
354e56Q42k5r23J542j351M3J904k704R72J895l231J946R06l263K960J12l112L112
372A069n35j956K755j573p83K369j705j01R98j078J131o19o12J350j231P24O71
389H74k520K398M28l036L020q75k143M192k740j785M791l189p88L607l872J153
405d85L062m483J566J927k855J978m83j664K684j250n05J133j879K303j96k989
421b136L506j161j613L753l924J31M831n202Q24L452n006L456J391o008M897Q70
437B061m753M341j657k089M990l464j213L546k688J471K26l148L943r75k063L243
453A771l450J190L689n946K247L001n213M405o07n044O940k057m159O118l983
$$ plain form
338 -510 2351 -2087 103 1902 -2110 606 1233 -1836 1004 539 -1334 994 -65 -472 656 -556
354 -556 286 261 -662 880 -471 -428 1476 -1228 -256 1639 -1592 354 1260 -2003 957 1069 -2043 1069
372 1069 534 -1422 1333 -240 -1023 1346 -359 -460 538 -540 591 -28 -640 710 -521 203 874
389 874 -1646 752 1180 -1856 1164 289 -1854 2338 -402 -2187 2604 -585 -1373 2234 -1638 -485
405 -485 2577 -1906 -340 1587 -1268 710 227 -1437 1247 -3 -508 625 -1254 1049 853 -2136
421 -2136 1370 209 -1404 2349 -1575 -1444 3387 -1815 -991 2461 -2545 911 2302 -3706 1191 2061
437 2061 -2692 1649 -8 -2097 2893 -571 -1784 1762 -926 545 771 -2377 1566 591 -1472 1771
453 1771 -1679 -489 3200 -2746 -499 2502 -2711 1694 1087 -3957 2983 926 -3233 2885 -1098
468a098n25N572o548J315M652n729K808J049m537N182j258l324M383k966O08K948
484B532n458L423J717n275N142j714l737P196m490k391O871n802P76N077p481
499c614L770L286p312N303K57n444O760k760l565O676m244p28M649n461K455K463
515B491n423M282m34l746N813l620k021O326n338K63M838o388K816L263o327L968
531G63R44m441M817j875k627M916l325j52L155m461K575J826m591L337j23k600
547a862L996k830r39M031l866J522J719n063M889N84o028N836j052m305O904l827
563b91l440P564m147k143N279m772J411L750n859K428J970l612L661k072k468
578b741N836l426j540M077m235K213K842o369L473K148m594M143j979k834O645
$$ plain form
468 -1098 -1623 3949 -2599 -1284 3368 -2361 447 1496 -3041 2141 883 -2441 1942 -1024 -416 2532
484 2532 -2926 497 2214 -3061 2081 367 -3370 3826 -664 -3055 3816 -1986 -1210 3867 -3614
499 -3614 156 3442 -3870 1433 1690 -3754 3006 246 -3319 3357 -887 -1615 3034 -2427 28 2491
515 2491 -2932 1350 916 -2830 2983 -637 -2658 3668 -1670 -1407 3431 -2957 -141 3122 -3205 763
531 763 1707 -2734 2083 208 -2419 2497 -828 -980 2175 -2286 289 2115 -2476 861 738 -1862
547 -1862 2134 -696 -1635 2396 -1470 52 1771 -3292 1597 2181 -3847 1989 937 -3368 3536 -291
563 -291 -3731 3833 -314 -2457 2822 -1950 -539 3211 -2648 -220 1750 -1862 1799 -273 -2741
578 -2741 3095 -331 -1871 2206 -2029 184 3026 -3343 130 2278 -2316 1827 -152 -2986 3659
593C659l876k552N503m302J205L759o975L220L741n881L185j6l316N658k854l136
609b978N179k930N12K564n777L815K731n998L716l07l007N913l864k848O370l850
625g59n1L240n935M216K719p062M325P10m192N967l413l406P142l502j930L943
641B012m050K466K173n524L230P84k323L467l924J8N270n164P15K696m673M943
657B116k80o280O572p86l912N391m648k72O867o802j8N064n288L408Q87o292N951
674A678N37m853M066k325k37M724n688N66L966l947K944r60m098O577j868l991
690b909N051l569O80M784p252J865M990n843K747P28m872O188r77n057M953j399
706A08j042L290m568J480L225l794J721l55j941M726l238j922M697l499R46K588
$$ plain form
593 3659 -217 -2769 2734 -1568 -363 3396 -3579 -359 3382 -2499 686 670 -2646 3012 158 -2978
609 -2978 2201 -729 -217 2347 -3430 385 3116 -2882 834 527 -2480 3433 -431 -3279 3091 -759
625 -759 -810 2430 -3505 711 3430 -3632 693 1403 -2789 3178 -235 -3641 3501 -1 -1931 2012
641 2012 -2038 428 2601 -2923 307 1091 -1232 2235 -1689 -1671 3599 -1565 -850 1846 -2827 2116
657 2116 1836 -4444 2128 1342 -2570 2821 -1827 -2099 4768 -2034 -2052 3012 -2276 1132 2019 -4273 1678
674 1678 2215 -2638 1428 -897 -1134 3590 -2098 -1532 2434 -1513 1431 471 -3627 2950 1082 -2909
690 -2909 2142 -1427 -747 4037 -3215 -1350 3640 -2203 544 1272 -3600 2588 1611 -3446 1507 108
706 108 -934 2356 -2212 -732 2493 -1301 420 65 -1876 2850 -388 -2310 2387 -1112 -166 2422
722B422n643L735K412n892L774K45l512N185k814k874N716k970j128L323l836
737a857J996K228m655K489R12k482L000k209j045L985l136j4K264l345K855O17
753A603m318L833p9k936L710k328j244M376l360n64L079k947J376J149l305K544
769E89M94k394K220j219n05K436k405K47J633k006J476p9j990K664r18j464K427
786A206j902J19K209k895Q62J915k780J528N24k312K453m30j845K218q32p23J728
803A043j738K98J483j790P61L21j134J450n98q99J550r37o5J018j594Q02J002
820I73j764R30K76j194J459m99j140J654n84o66J056q66J09Q92r85Q1N72m59M33
839B78l34k96P51m20j10L29o00O05J85q92N84J72o24Q26m74n20J120m88n82Q19
$$ plain form
722 2422 -3221 514 2926 -2966 808 1053 -2459 2726 -88 -2962 2754 -216 -1344 1979 -1857
737 -1857 139 2367 -2288 201 1113 -1369 1631 -578 -1623 2362 -774 -788 1476 -1869 986 1603
753 1603 -2715 1118 1039 -1897 1813 -515 -1759 2617 -743 -1307 1772 -1175 201 1350 -1955 589
769 589 1083 -1311 909 -310 -815 1621 -784 -537 1096 -910 566 487 -1503 1161 243 -1221 1206
786 1206 -696 -577 1632 -1263 -401 1514 -1266 262 786 -1526 927 497 -1348 870 38 -685 1043
803 1043 -695 -397 1086 -704 57 378 -756 694 96 -803 747 -190 -255 763 -831 -29 973
820 973 -791 139 415 -779 680 181 -959 695 111 -555 501 -365 -256 636 -349 -268 304 -155 278
839 278 -56 -352 399 -21 -131 198 -402 203 388 -504 80 252 -372 454 -20 -540 580 92 -490 329
859C29m12k13R69r64k10J103p04k46P38o38J12P12q73p4Q84n89j76M61m76K81
879A4L76o22m1M68q4j05j52O3K13l3m6k59O6N72m74k70M85l39J49L88q71M50P02
902F50j040L09L45p43P94K5j041R92P8p82O15l62m3P49p32j34N02k92M24m02m47
923e35J060l82n18P15p32L77P71j414M01R17r71M45Qp73J189k57r44P73o3m7L17
944C37q32L17O41n14l1j47J50O09p32r3M63l05O09m26r43J462j22j047R00m93
964a97j33J266j418k39J541q28k12M30q48J034K32j326M60M67j14K29q52J87R33
983F12m73k52k01J32J014r14n52Q52j98K64L2j289J021R56j410J56J93j12R51
1002G82q61q11J265m0k63k61m78J063K01j085K93J44K99L53j225J36J071o04L6
$$ plain form
859 329 -83 -296 673 -291 -501 602 -102 -348 390 -248 -136 576 -297 -371 513 -76 -252 209 -267 14
879 14 390 -232 -273 195 111 6 -146 -83 130 97 51 -208 -142 430 -44 -314 171 -168 -19 369 -502 -52 650
902 650 -390 -81 264 -479 315 340 -701 291 369 -413 202 -160 -203 546 -186 -320 182 -110 314 -88 -535
923 -535 525 143 -375 340 -392 -15 756 -658 -257 660 -311 134 142 -631 558 301 -643 130 67 20 337
944 337 -495 -178 463 -51 -82 -229 -79 530 -202 -295 168 -137 472 46 -897 565 443 -604 296 -197
964 -197 -330 936 -482 -721 820 -8 -220 210 -638 396 628 -698 -238 229 115 344 -508 -321 612
983 612 139 -113 -314 -182 832 -82 -634 218 20 284 316 -973 48 1004 -406 -250 -57 -169 782
1002 782 -79 -890 375 335 72 -189 -667 396 597 -488 -195 -51 248 601 -624 -488 583 -21 15
1021A5k67l58J556n60j370J261o8l76P57j330K33J687j248o32Q80j63L70k77q42
1040g32P90K99r7m01o25J138M62j451M11L20j62Q56j240m18J632n53m76J47n10
1059f10J284P8j793R90N00m99O06j104j94J844p51j039N68R5O54l68j136Q49M20
1078C94j90J3j252J047J302j850KP77n18R95n37j516J719L37j049K93m77O20R01
1097A011j565kR38l14L68o41o52J501j44r17L16k34Q39O5j399O97O03m58L39r53
1117f02J31J495j089m87O95k23O11l52j070J189J58n58K15p63P73Q44j621K83
1135c71P39n72Q39q19p79J787m98q79P57o69P41O56j930O78J067r76N09n11n24
1154g55J701p41q75P80k97N90%j383J072N61q58L61o60K84J259j324j73O87m47
$$ plain form
1021 15 -252 -610 946 386 -984 277 209 -167 590 -740 -507 1180 -68 -700 180 17 387 110 -732
1040 -732 58 357 260 -141 -766 372 834 -617 -206 114 -48 808 -432 -850 782 229 -247 -100 -610
1059 -610 674 752 -1041 -51 449 -50 556 -548 -742 1102 351 -688 -120 -25 629 261 -875 -26 394
1078 394 204 217 -1035 12 1314 -536 -534 243 -275 720 183 -1333 386 723 -326 -33 -510 110 1011
1097 1011 -554 -556 382 68 436 -205 -857 644 500 -417 -101 -335 504 569 -830 -133 470 12 351 -602
1117 -602 -471 1024 -65 -552 143 -80 531 179 -891 298 456 -102 113 -650 123 967 -654 -371
1135 -371 368 -204 635 -184 -963 824 326 -553 204 -465 276 932 -998 -320 747 -229 280 -231 -755
1154 -755 946 205 -670 110 -187 403 403 -980 92 653 -205 156 -504 -220 1039 -285 -458 229 -218
1173b18Q19o37j026J747l19q72R48j034M67J242j870K47J171r72O63l25q07J427
1191F51m99n59P36q76Q57M14j829J339L47j337J392p47p70K031j310o60J617j216
1209d19N08N75j748J345L93j466J252m69n38J490j298j84J351j147L96J65r40
1226g34J273l05q88J197q46K85Q55j746Q94R04j736J201j00j171J880q74j017
1243i28J710j046J08R48j824J124P31j601J142k11r30J796j200n91J576j154K83
1260f7P49j654J332K98j553J418m63q26J784j399l84J790j502K52J025j712J100
1277A88M79j516J190j50o84J197r74j87J130j054L76M21j073J042q3r38J108n27
1295e5k43R22j103K74P59j005N75J51q16R69l75o04J007o32j5O65q74L66M61q46
$$ plain form
1173 -218 601 -36 -1062 685 366 -506 442 -592 -125 1117 -753 -506 665 -307 356 31 -776 651
1191 651 152 -407 329 -547 310 724 -1105 234 581 -756 636 -111 -881 1150 -160 -820 797 -419
1209 -419 89 664 -1084 261 654 -812 440 -29 -567 923 -375 -559 792 -355 41 206 -734
1226 -734 539 234 -654 543 -303 -18 837 -909 -15 889 -847 354 254 -917 963 89 -928
1243 -928 782 -264 -156 792 -1032 92 823 -778 364 153 -777 1019 -181 -772 804 -350 -67
1260 -67 682 -972 360 658 -895 523 60 -766 1018 -381 -765 1025 -477 -225 800 -912 188
1277 188 667 -849 341 191 -493 704 -270 -457 673 -381 -5 416 -657 385 302 -636 472 -55
1295 -55 -298 624 -479 -205 554 -451 124 275 -541 428 53 -551 456 -176 -191 474 -400 -34 427 -419
1315d19N83M1n93P55m67k24P28o22J27M89p95N45J89p80P03j75m70Q06n21j42
1335b42O65o43J51L72o72M81O6n02N36j77j79M49m84J5M29m56K00J50m11L58R1
1356A97m29L21n1j02K61k71p0K82j31j3O1j43J32N2j44j2J26J00k14J8P9j66K57
1379A40p2l60L88J00m72L76q8j82N15l41l10N63k72j14L94n04K37K79n07K10J35
1400A15k74L51j67l75N54j40j94K70k86R3L05m40K05M8k12L36k47j90N15l48p
1421h8L15m20J26K71l34J11J19k34K68j21j31K97k01P3N0k88L05k2k74K83j25
1442b0j09L64m01Q2M10n55L49K5n92P48j31n77P09l55k08P44p06l8O62n97J44
1463e2K83n98O61p8p14O86j91k47P18p64J0Q58p98J29L72p14O98N6q57P44l4l84
$$ plain form
1315 -419 164 205 -388 367 -100 -324 404 -218 -91 398 -397 148 337 -443 260 85 -385 421 -100 -242
1335 -242 423 -220 -69 303 -369 112 178 -324 212 35 -144 305 -179 -164 265 -191 9 159 -252 106 197
1356 197 -232 89 38 -64 197 -74 -144 138 7 -6 55 -88 44 96 -48 -60 66 166 -48 -30 49 -117 140
1379 140 68 -292 96 196 -276 100 12 -170 345 4 -306 257 -15 -129 265 -239 -2 277 -230 -20 115
1400 115 -159 192 25 -350 204 64 -130 140 -146 -53 252 -188 17 65 -147 189 -58 -248 267 -81 -88
1421 -88 227 -193 -67 204 -130 -19 100 -134 134 13 -118 179 -22 51 101 -187 118 96 -178 105 -20
1442 -20 -129 235 -166 -84 326 -229 120 145 -447 301 170 -407 302 -53 -261 483 -223 -261 401 -196 -52
1463 -52 231 -367 294 216 -498 188 -3 -250 468 -296 -286 572 -226 -97 275 -439 259 315 -542 202 168 -216
1485b16N55o01K8Q04p69m3M40m88N31j4p62O88J7k68K76n42L31N96q80K33K18
1506A34m62P79l65p13J069k20m82N14n59K57O47j005J81N08m76M93l13n27R73
1525D33k00n98M35k53K12L72p85K46M43m17L39m28j60R27n65l28O02n40L89L49
1545D73j080N51N71q35M40j38l58R56n85n38P96k55K1K59p82N27M22p00J52j6
1565a19qN33n66j50N49l48K62j59m53P95q1o70N07q4q4M77o74p5P52m38k2J13
1587E7l43N51j10m90M09o8P3J06n51L96K61m92J33L1p0N72n54k88N94k52J22k4
1609F3n15O28J76n89K76o7p7N02n41k46P24l25j9L6l19N29pm86K70k3R2J33m95
1632b80K45L32m67K09q7j92N69l09k96M76j99O5J29n10M22K04n15K12j3j19M36
$$ plain form
1485 -216 339 -262 -234 570 -199 -242 198 -290 241 227 -535 153 170 -98 178 -364 -33 563 -317 -84 134
1506 134 -328 451 86 -627 442 222 -260 254 -305 -48 599 -406 -225 283 -193 300 -13 -540 433
1525 433 233 -365 70 -183 29 401 -384 -138 305 -112 227 -201 -361 566 1 -327 275 -265 124 473
1545 473 -607 -56 515 -320 120 -18 -376 580 -5 -543 253 -2 19 278 -504 23 445 -255 -103 -119
1565 -119 -127 406 -160 -310 239 -109 153 -6 -459 336 255 -415 92 8 -76 401 -273 -348 404 -34 -56 57
1587 57 -286 265 155 -335 74 6 79 185 -366 30 291 -201 -68 -37 -107 465 -89 -377 217 -35 87 63
1609 63 -452 176 352 -237 39 -28 -105 397 -144 -390 334 9 -10 26 -293 236 229 -257 13 -10 82 215 -280
1632 -280 -35 297 -170 39 -48 -240 329 20 -276 200 1 66 195 -315 107 311 -204 8 -5 -124 312
1653C12m75n1M71k84J8Q5k94M04k0l91L01r6M4J76m82J84M61m82J16P3l56N33
1675B47j11n14M87l9j20K26l95J13L93m44J83L0j73L54k76k73N09j51j29K28l77
1696b32K20K39l38R3J09j91K41k07q3L41j90o0J74k48J81O3k98K01R9q9oj10P5
1719a6J49k28J12%j12K48j62k55M53j34j65K68k70l1L69l65J02K03k47J15P9m00
1741b87M11L3l57L50j16j89L59l15p3M48k76j37K61k39J55J39l50K61n7p8J70
1762A13j82KK93l53J22J57k66J51J6k34K83p3j68K72j91M3J82l01P1J69k37J88
1784E7l1j39K56r9j45K33j86R0J05l20K39P4k43J79j02j32M20l13j46L35j79K5
1806b2J90l80J98K43l88J15N8j35K16r6j18K42j03m6M4j53K29ok42J97m5j5J51
$$ plain form
1653 312 -163 -214 257 -27 -9 76 -218 186 166 -225 76 -20 24 200 -282 -98 363 -119 -3 70 -286 247
1675 247 136 -378 109 70 -50 176 -219 -106 287 -157 26 56 -117 237 -39 -312 197 46 -83 145 -232
1696 -232 -12 227 -111 -18 91 -100 141 -66 -149 192 2 -58 116 -132 49 112 -186 15 114 25 19 -91 -16
1719 -16 133 -95 17 17 -95 153 -9 -264 189 55 -110 158 -112 -143 226 -139 -37 166 -81 34 113 -287
1741 -287 124 157 -200 150 34 -155 204 -111 -184 264 -12 -149 112 -127 28 167 -183 78 21 -57 113
1762 113 -69 -67 226 -127 -5 152 -114 37 53 -181 102 29 -139 133 -58 -15 167 -134 -63 106 -131 57
1784 57 26 -113 143 44 -101 132 -54 36 141 -179 60 134 -109 70 -32 -164 256 -57 -203 132 -47 -22
1806 -22 168 -212 -14 229 -159 -44 14 -121 95 -1 -119 123 20 -26 18 -135 94 88 -154 43 -2 -17 134
1829A34k40N0K23k27Q4M6j59J94j4k10J37Rl2N5j87J34Q5j19R6n9j37K70j67k3
1853e7J53j53R9L9k77K40R3k78K13nk25L67j90k02L25j43l2O8j99J45J33j92O2
1876a6l2Q2K0o4o1J35j15J00q6o3J57O2k10J55j02L7J34k08m5K55j51J1J2k07
1900b00L21J6k55J26M6q3J38j87m4K38j91P3rj00K83j47j63J96j02M7J50m04J76
1923g5K83l39O9L1j54L51j15k57K95p2l0J40l21J95J77l32J66K5j84L32j56k67
1945b38M08j76l6J96l71K74K06m23J47J01k54L90k38j98M45k46q3K71l63K00J83
1966A95l96J93J21k10K37j76r0K95k07M1N7k40K72O4l19K49n1j20J95k01L5J70
1988A14j44N7J8j81K66q9j88K51r9k5J71l01R0K44k74J13L1k23K89n0l22L94r9
$$ plain form
1829 134 -106 -56 167 -60 24 70 -89 105 91 -119 18 27 -5 50 -137 -3 82 -37 59 0 -137 133 -34 -57
1853 -57 96 -57 42 81 -196 44 137 -141 72 67 -158 209 19 -183 142 -1 -33 35 -164 -19 114 -78 -16
1876 -16 -48 34 54 -10 -71 64 -51 49 -37 -100 57 119 -91 64 -38 -1 133 -75 -120 135 -16 -5 7 -200
1900 -200 121 137 -118 8 54 -29 109 -78 -122 116 -75 -2 -11 -111 172 25 -138 58 -44 3 153 -251 -75
1923 -75 208 -131 -62 -31 -185 166 51 -206 89 17 -13 127 -194 1 178 -154 12 37 -147 185 29 -238
1945 -238 170 -6 -42 154 -217 57 263 -160 -13 88 -166 224 -14 -212 233 -13 -96 175 -188 12 195
1966 195 -201 -8 113 -97 140 -36 -126 169 -38 3 60 -180 92 156 -163 86 35 -85 110 -91 -56 114
1988 114 -30 27 45 -136 130 41 -147 104 5 -20 151 -150 -60 184 -90 23 54 -169 120 70 -252 142 43
2011D3r3J51k65J52J61k74J08J05j95J83k4k19J62Q2j41Q6p2O4K3p0L8l7M2M5
2035E5o5QP7j50P4l7qQ2L0j11J1M5JN2p7j5P0oK7o3l6M8Q7j37J7L6J7l6j8J3l4
2066d3J19j10LL7J5l1K9q3O3J03n4j05N9N4Pj13L6M0k3Q3j18p1K24j17r5J68j09
2093c2O7O7k20R0J20j33P6n3m2K43j42k01K78j78N5Q1k22J23K03k41J6J7q4K66
2117A54j68q8K02r8J9J5j90J86J40l19J30O5r4J65j71p9K33r7k3M4j64K42Rk65
2141a52K06n2k8J69k70j2K69j33p7R0r4J70K0k32Q5R7p1R7j54L9J58j58m3J03
2165B7k3R4j37p2J51K9p3j6qJ13P2k24kJ33J4%j24l3J55Mj34N0k5J16Mk20N9J02
2193C2l9P0j86O9J97r9j29P7rP5k4k27J84J00r6kn8N5J35j77j62K35N0Mr2j01
$$ plain form
2011 43 -50 101 -164 -12 149 -125 -17 88 -107 76 52 -167 -5 77 -64 22 -50 14 37 -33 5 -32 10 55
2035 55 -10 -2 75 -75 -1 -38 -46 36 66 -45 -34 11 12 64 -13 -28 42 36 63 0 -36 12 99 -38 -21 15 32 -4 -22 -9 -43
2066 -43 76 -34 -31 6 21 -10 19 -64 -1 102 48 -57 2 56 63 -50 -14 26 3 86 -32 -103 121 4 -91 77 -32
2093 -32 35 102 -118 -28 92 -41 35 -18 -60 183 41 -160 118 -60 -5 76 -146 -23 180 -61 -45 -28 -112 154
2117 154 -14 -102 100 2 21 36 -154 32 172 -147 -17 48 -46 119 -52 -131 102 5 -18 26 -138 104 113 -152
2141 -152 54 2 -26 143 -127 -139 130 -3 -80 10 -84 86 106 -126 -41 56 -15 82 -72 -33 125 -33 -76 27
2165 27 4 98 -39 -111 40 69 -4 -20 -28 85 157 -67 -69 64 78 78 -46 -79 76 80 -54 -4 -29 87 91 -129 -70 32
2193 32 -7 63 -123 -54 143 44 -85 -8 -17 58 34 -193 -9 91 -5 -7 -65 -10 125 -52 -214 21 71 75 -17 -118
2219a18J07J33j28n0J5M5Q1j63l8J85j5n8l1l7J40oj14q2J20J22p5j40O2P3O9
2244I7p6j79J16J32j07n9L4O2O0o0j13J26J4j9l1q7J28L0j11J6k8J30J2j58K1
2269e0Q5PK4j05p9K18p4m9K0jN0%j67J26J11j62O7r4m2K83k38QJ12p0O7lj68J56
2297C2O8j56O2l1O7J8j66P2J77j95Q6l8o5J74o4j26Q2n1J33n4k25K00R0j32Q5
2322D3o9nJ51j96JO0M6k7K6j58K30j7j17K0o7P4R1j58K8Q4j9M1j57lK14j23m1
2349d8O8r2J99m9k17J71P0j40Q9r4L1Q5q2k1N0o9J14n4j37K02r9k3R6j15R5J0
2375D0j35O2M4k2M2j15M7J06j20N6M9j31J62l8j47J35J0p4P3r1PJ05r7L0O5j24
2401f1J06m9j08J88q1j1J48k60J16R2j53P8L9r0J94j99o8J96q7N3Oj37J51O7k52
$$ plain form
2219 -118 -11 122 -6 -56 -41 4 85 -78 -116 69 54 -4 -35 -72 68 62 -52 -134 -14 108 33 -107 -45 28 97
2244 97 21 -158 -42 90 -17 -76 -42 20 80 20 -93 33 47 28 -3 -90 38 68 -43 -27 -55 75 87 -71 -50
2269 -50 35 42 66 -39 -118 100 26 -23 -3 -4 46 46 -121 5 116 -46 21 -73 -115 168 -70 -62 50 -20 47 44 -124 32
2297 32 100 -56 6 -25 42 60 -106 -34 143 -52 34 -4 -69 105 41 -85 -3 -54 79 25 -200 0 90 -42 43
2322 43 -26 -31 120 -76 -75 -15 31 4 30 -128 102 85 -32 -12 -79 -5 86 -72 -44 40 21 62 -95 -98 116 -7 -48
2349 -48 20 -72 127 78 -139 32 102 -38 51 -43 -12 73 -9 -30 20 -49 65 11 -126 76 -23 -46 50 -65 30 40
2375 40 -95 -33 11 -11 31 -84 -37 69 -51 5 54 -77 85 47 -100 35 45 -29 44 -47 -40 65 -32 -2 63 -61
2401 -61 45 -4 -112 76 -5 -16 132 -128 -12 80 -73 5 44 -46 148 -51 -119 77 -10 43 49 -88 63 130 -122
2426a22J59Qj35J76q8j35K78j72K7N7j49J55rj91J68l6l1J27j03n8K48j97q4J89
2450H2j48P7Q3j68N8O4q5J32j16l8J65o8n7O5p1O5N9j93R9L5o6j1K2p3J45n6n8
2477e7N9m5K6L9r7J50J5j15M7j8r5J88j18p2J51n5k8J8J0J7P5j94J00J1l2N4j08
2504g4o7K63j14l0J2r2J47J15k50K9J84k08J76j43r4K55q9q0J32j56R3J08k86
2527a69J51J28k51J82o4o8K63j56j45K35q6j0J05k73J54J31k37J42j8q1K42j91
2549a6r0K37j80O7O4k28K44l2k20J73j8l4K03k15j03L33j68l1J31j92J16Q8k64
2572a35J62k0j00K05k05J7K20k17O3K0r1J34K5k29J95L7q9N1j63R0J54j68l3J68
2596I1j12R3n5j45K48n9j01R8j21Q1J06k24P6N4r4J55q7j69K52k9j66J58j15O5
$$ plain form
2426 -122 37 45 -90 86 -2 -137 141 -31 -4 53 -96 59 50 -141 27 -9 -40 87 -16 -74 174 -23 -107 82
2450 82 -66 11 94 -74 -16 48 -37 95 -21 -59 106 38 -19 46 -25 40 99 -94 5 40 -26 -37 -15 -88 57 1 -57
2477 -57 2 -43 -17 22 -75 75 90 -25 22 4 -91 97 -21 -93 58 3 -25 -7 3 20 95 -99 1 12 -20 34 -74
2504 -74 -141 122 8 -22 -10 -102 45 160 -90 -61 123 -85 91 -52 -146 109 20 -60 72 -84 9 117 -169
2527 -169 -18 110 -141 41 -23 -91 172 16 -129 106 20 10 115 -158 -4 127 -110 32 14 -67 175 -16
2549 -16 -106 131 -49 18 82 -146 98 66 -154 19 1 -33 170 -45 -148 185 17 -14 117 -75 41 129 -135
2572 -135 27 7 -93 112 -93 -76 144 -73 -10 10 -81 53 78 -151 44 81 -8 43 -120 -30 124 -44 -77 91
2596 91 -21 72 17 -128 120 61 -40 58 -63 18 124 -100 -24 30 -64 91 4 -165 87 58 -108 50 -65 0
2620@J23k47J02N7m4O6q5n1J82j04j10J47l1K6O1j79J03J23j73M9n4K4J26r1j21
2645a01J59q2J3J5j09R7J00j50O5Ll0J08j35m5J36ql6j4o0J32rj20P6O2q7J03
2671H3j66j3J87j18n2J04p5J63j04n6O6n5O2K5j86J11J18j50K7J5m0J34p3m1L7
2696CQm6Qn2J57l4j20J24n8l1J38j13l0J02j29R5L9j34J73o9j27J21kk1J45k21
2722g4O8Q9j56J04lq3J31n7j07K26j13k8P5j87J05O5j38J43kj41J79j22j13K62
2746A23j10k5R2j75Q3R6j90J73q0l0J26j16j8J23j04NP5j45J78p7j18J48q0rR7
2771D2j17N0J87k54J49M2j70J57o9j09J88n8j52J85q6QJ41j95P7K8j66J44N0j54
2795h2J13p7K6M8j28J12O8j72J02M3j26J60q0r6J54r4K2J26k27Q9O3j50J59k7
$$ plain form
2620 0 123 -124 -22 35 -9 57 -28 -79 103 -1 -111 36 5 31 92 -87 16 139 -34 15 -39 -15 111 20 -101
2645 -101 58 -24 -11 4 -105 -8 92 -58 7 10 -20 88 -47 -92 44 36 0 -14 -74 58 49 -71 5 67 -20 83
2671 83 -83 -96 91 -27 -79 25 -50 113 9 -47 19 -36 26 51 -135 -24 94 -56 -29 -14 -54 80 7 -34 3
2696 3 11 -35 -27 -79 78 44 -76 48 -10 -41 97 -16 -46 56 -73 22 61 -73 100 31 -96 25 23 2 147 -74
2722 -74 -6 83 -73 31 28 -55 76 19 -88 138 25 -3 72 -115 -10 55 -83 60 58 -83 96 -26 -139 123
2746 123 13 -12 80 -95 -12 84 -106 67 -13 -43 83 -33 -51 72 -32 -27 48 -97 81 4 -114 34 -46 -55 42
2771 42 -75 -25 162 -92 57 99 -71 86 17 -92 96 38 -114 71 -15 -7 134 -61 16 44 -122 22 72 -82
2795 -82 31 -46 -20 28 -100 12 80 -92 10 53 -73 87 7 -89 65 -29 -7 119 -108 -19 44 -106 53 26
2819B6j10J29k6j10J62p3o1J21j94P7J53k04J08P0j11Q3j1j51K34j17JO6r0k0
2843d8J35j03K0K6r7P4K9p2J38r2m9J21j10L4O0j36J28K8j57J30k9j45J96q0o0
2868e9J05r3K2R0r6KJ43k03J08Jj22J65q6n5J66j36JJ09j57J25Q0k06P0O5j21
2893h2J41o4pJ00j25J9R2q2L1L5j14R2L9j29Q1m6j3J38j45m8J62j50R0M0j71J90
2919G4m8q0R6p3pJ54j74M0O9o5M4N1j70J30l7n3J13j14j2J25n9m0Q1p5P5Lj09
2946f1J21m9q4Q9J0M0Qq9k5P1n5Q7m3l4N6K4q3M5pk1K0m9k0N8l4l3P2p6P4K6r4
2977e6Q1l%L3n7nm%qK4Kj4k2m5Q3j4n1O4L7p0O5p2J0MJ2K2k8M3l0N1r6L8M9o7
3011b4K5j1m6Q5Kj38J63q7J1O6o0m7P1l3PO0j00Q0j4j4M3p5O4K7r0K5O5q5N7j8
$$ plain form
2819 26 -84 45 19 -91 71 -2 -63 58 -136 -59 94 -110 -2 68 -43 40 29 -122 112 -5 -4 62 -28 -48
2843 -48 87 -16 4 30 -67 7 36 -36 102 10 -39 82 -28 6 66 -70 58 86 -71 59 30 -115 81 1 -59
2868 -59 46 -47 -25 65 -31 -29 114 -89 19 20 -102 63 -23 -78 88 -48 -47 62 -95 30 110 -96 -26 39 -82
2893 -82 59 -5 -12 88 -37 -18 74 -8 23 58 -56 36 75 -54 27 -19 -32 106 -39 -87 75 -75 15 55 -116 74
2919 74 26 -54 42 -31 -38 116 -58 -18 51 -14 30 81 -89 41 4 -49 64 -50 -62 63 4 -36 45 -30 45 48 -61
2946 -61 60 11 -73 16 26 66 74 -15 -40 31 -24 63 20 -14 42 66 -17 28 21 0 20 -29 -49 9 -25 -58 14 -62 12 38 -56
2977 -56 25 22 22 55 -2 -7 -11 -11 -19 5 7 -7 -29 -74 9 -5 -56 8 45 -25 40 -32 -22 -18 -6 16 -12 31 1 52 -44 -6 43 -24
3011 -24 1 -10 -56 29 31 -107 56 -31 -20 46 -14 -61 10 -23 -16 44 -56 24 10 -4 39 -36 28 55 -35 -10 55 -30 27 9
3041Ip5Q7J3r9Q8l2J8Q5j64N3O0j04R4k4m5P5j7r7J14m9o7J39m3l2J02j31P2k
3069B8p6M6L4p7L2O5r8N9K3o3P0r4K1J8RJ5N5j03J21kj20Q6n8J3L5m2l2N5n9l
3099d2M3j12J88n6j18J09J8q2J46j37k1J92j92N0Om2J23Kj32R8o3j1Q3j14P0P9
3125H5r8j6J00j33J15l1j12J05L5j03N3l2L2J61j77k1R8n2K4q8m3J28L6j46J49
3150F9n7k4R1j67L8J56j57L1K8p6J48j7j07J09o5n5J45j54j3J48j69R3K4o9Q6
3175C6%j40J87l8r4J31r9L7J01j98L4J05o2O8n2j15J94r0o7J03j21Q9J82k59N0
3200a8O4o1M4k5j19K30r0j27J69j34R0M0j21O4P9j46R6k1p1J75j01j21J48n0j1
3225a7N8j61J42Q4j58L4Nm5J81p3j39J80n3k0Np8P6J05k70K12k4j41K06j61r3
$$ plain form
3041 9 -66 21 34 -65 23 -9 9 94 -70 -17 43 -61 33 9 -36 39 22 -75 39 -10 -77 62 19 -13 89 -42 30 28
3069 28 -48 -2 32 -45 -13 52 -46 13 36 -27 43 -51 -30 -12 -3 12 67 -36 85 83 -37 49 -9 4 39 -3 -35 20 -39 -42
3099 -42 1 -111 77 21 -97 12 30 -52 94 -43 -64 128 -64 -14 -8 -50 73 75 -57 41 -22 -33 50 -64 6 85
3125 85 -13 -29 71 -62 53 22 -90 15 50 -53 0 -32 0 161 -16 -37 61 9 33 -55 -98 30 66 -80 69
3150 69 12 -12 79 -88 -50 106 -51 -20 8 -68 80 63 -44 65 0 -55 90 -64 -77 71 -98 -5 19 -50 36
3175 36 36 -104 83 45 -49 82 -17 20 121 -77 -43 62 0 68 16 -99 95 5 -62 41 -80 9 191 -68 -18
3200 -18 46 -15 29 4 -115 115 25 -102 67 -67 23 63 -58 6 85 -61 35 14 -57 118 17 -104 44 -6 -17
3225 -17 41 -120 22 106 -52 -18 -13 -58 123 50 -89 91 38 18 23 -55 21 126 -144 68 44 -97 109 -52 -145
3250a45K97j76j8O8j04J39M5k19J26L7j14J44r3j7J95k38l8J98j32N2N7j84J28
3273HL6j22N5p2Q6J48j34k8J21j50P0j1j43J86mr3R4p9K5N9j61P1J03j15M2N8
3299E0j46J55Qj89J29M4q8J32j54P3P5j05Q8q9n5J41k4r1J36o9m2O3r8Q0R8j63
3325d1K4nK8O4j7j24J41n8lR6j66N1R8j59J36q9L4N7j31J5J19o6Qj6o0Q5L7j45
3353h7J17k1o1J32q7p5J60r0l6P3o7P8K8j03N2M7j28J30o7n0J53n6l6M8j05R2
3379D1M4j59J07j0k5L5p6N4M3q8L6L2o0L8K9r7O1K9k9M0p0J7N2q0rP7j3k6K4p1
3409e4J05l5o6N1k9mN3o6L5J03j59R2l3j6L1j4k9N5m3j4J12r2K8Km5k2M1nM4l2
3439fo7O6L8q4J36j15L2L0n0P5J4j26J02nn9R6j09n4J38q0K2M7j14J05k1l9K3
$$ plain form
3250 -145 152 -24 -42 26 -78 61 106 -113 13 50 -64 80 -13 -30 165 -73 -111 87 -45 7 64 -120 8
3273 8 44 -78 -23 -95 -9 139 5 -23 98 -52 18 7 -136 50 46 -47 47 -32 -7 52 -109 -38 65 -50 -8 50
3299 50 -96 59 67 -122 7 51 -37 95 -59 14 89 -16 72 -17 -72 69 45 -46 90 21 -21 42 -56 24 122 -41
3325 -41 -17 -22 6 70 53 -71 70 12 9 105 -61 -10 88 -71 65 -24 10 67 -64 -49 70 4 12 -4 -64 21 58 -87
3353 -87 30 9 -52 80 -7 -82 78 -12 -48 25 -42 36 64 -39 13 60 -68 62 -5 -55 98 42 6 54 -51 41
3379 41 85 -74 33 23 -2 33 -43 11 54 -34 2 34 -26 12 41 -56 5 34 5 45 -25 -8 44 -36 -45 32 19 -7 17 -54
3409 -54 51 16 -50 1 -28 -32 21 -45 -10 93 -66 26 -7 -23 8 -6 -35 20 -23 -37 75 -17 11 13 -32 -54 -13 -18 26 -6
3439 -6 -73 -7 31 -53 83 -32 0 30 -20 55 69 -57 45 40 -19 77 -32 -86 52 -28 -6 41 -73 32 11 -28 -5
3466eL0q6O3m7j5R5n2j7M2j4J5M9j11P5j4n8M8k9oL3p7R0M5m8k4M1qNRo4Q6j05
3498e4L1Q6q3J2L1l8k9Q9n5O5m7p5O6J3k6O5j03K8Q1q1k8P2Rqqm3Q8r2m3J23m0
3529Fq0J39j16L8pn6P6M4q1N4J1p1R8p1n5J26j31J06j0pL9J2j18M2PpJ2noP9o9
3560ak1O8j13K5R0j20J34q8m6J65q5l4R1j20M3P5j19M2K4j2J4k0k4J14q7l8J18
3587G5p7kK2o8J12n1j28J31j3q8J54q1l7J05j10L0J03j31N8K1q7J43Pj24J17r0
3613in1J53j08oP4j48J21j6r9J19J1j12J25o9j4P6r6J8O7r7L8P4j09R9j2r0J39
3640G8j00j8J12r4J7M2q1Q1lj22R6k8j4M1j8KM9j27O0O9r6N5M6o3O7m4o2J46j01
3669a0J9N2p9N4J2q3M5K3j38J44m6NN0n9k3O3j10NR0j32P0Q1o1L9J8RPq1K8M6
$$ plain form
3466 -5 25 -61 2 -45 -60 35 -17 -34 8 -6 9 58 -53 22 8 -50 -2 -31 -37 -4 -81 9 54 6 -18 23 15 20 29 -35 51 -54
3498 -54 -23 63 -20 -8 23 -15 -44 45 -10 55 8 -67 -1 12 -14 51 -52 -24 57 -24 -52 20 29 21 13 -30 58 -34 -77 46 6
3529 6 -74 65 -51 -13 -20 -76 0 44 -37 17 28 -43 55 -16 -71 55 -76 30 20 13 52 64 -54 -12 -5 -12 0 -5 -11 68 -1
3560 -1 -22 46 -67 -42 48 -72 62 -26 -72 93 8 -26 65 -55 -12 63 -56 -14 10 -2 12 -8 -32 82 -5 -43 75
3587 75 -2 -4 18 -50 62 11 -117 14 1 -87 67 -14 -51 54 -56 -26 77 -54 4 25 -62 81 88 -36 81 -9
3613 -9 -60 93 -15 -21 53 -95 26 10 -89 30 41 -71 54 -15 -29 47 -49 -31 36 -61 -23 51 -58 41 29 -61 78
3640 78 -22 -40 72 -22 -5 37 -44 37 34 -88 8 -20 -34 7 -11 -9 40 -87 -27 42 -54 1 47 -16 51 7 -55 91 -10
3669 -10 9 61 -18 36 48 -35 10 33 -105 39 -7 -2 48 -11 -34 29 -81 -76 14 -118 -48 33 -28 11 29 38 45 -36 -8 38
3699C8r2P0Rp6P2m6j0M0j5kM7jj22O9J0mJ7nP7p1l0P4l3j6K8r8O7M3j5k3K1Km5
3732b0O4k3k4Jk5N8l3l9Q5q9P8j0jo2J3L5mK2l8QL7l2j6P3k1J0l2j9K5m1N0Rj4
3765B5k4J6J0N0m3j9j4L8k1Oo6M4K4k2j4L9rl8O3n4K4n1QL0m8L3L8p0N2qk0P0
3797D9m9l8J7K1Mj1jj6J5K6l9N2kk4Ok6M1m2pM7op4R8n0kP5j13J13j7l7N6l7m2
3830a3P9j11J8P8j26R7LKk6O4p6PN6q6L9L0q6J15m1l4O1o0M9l9o1P6k1l7J15j09
3860c7O5J8o6kN6o0j7K6m7J10m2k7M9p4L5N3p9J24m1q3J7K4j9O2l9l9R5o9k5O3
3890C1o8N8Pr3R3Pn2J6L2o5J01j19N2K4p6Q6Om5K0jj9J8oPN9p4j5J3l8O4k6j6
3922a9K1J7rK3j8m2R3p0k2P8o7L5Ok5J6Qj08J01J1k2Q4j44P0J5o0Q2k8K1L4m0
$$ plain form
3699 38 -54 16 25 -51 21 -25 -35 5 -10 -12 35 34 -88 -19 -9 -13 4 -1 76 5 -25 49 16 0 28 -70 -3 40 25 2 23 25 -20
3732 -20 44 21 -3 -2 -27 31 -2 -41 44 -45 33 23 22 -40 -27 8 4 26 -12 -4 33 1 -15 58 37 47 15 -4 21 -20 30 39 25
3765 25 1 17 27 77 34 15 1 39 18 24 -42 2 26 4 -10 29 20 -18 45 -9 15 -36 -28 2 -46 -13 25 -45 7 -1 -21 49
3797 49 0 -38 -21 0 4 -7 -8 -24 -9 17 -22 30 28 4 10 -16 25 -17 -24 23 17 -57 41 -9 -11 64 -49 64 47 10 66 29 -13
3830 -13 66 -45 -27 51 -75 22 25 27 1 65 -11 -4 52 -34 5 35 -51 64 23 -11 50 -10 39 0 -61 15 -6 -43 72 -37
3860 -37 28 46 -20 -22 34 -26 -43 -17 -64 46 4 -23 26 -48 -13 40 -39 85 44 -39 -22 2 -17 45 6 -33 62 -7 -32 31
3890 31 -37 21 28 -65 28 35 -17 -1 31 -34 67 -52 0 24 -52 34 40 -5 15 14 -5 13 7 14 73 -1 -16 -3 -41 23 -3 -19
3922 -19 2 19 10 33 15 -27 66 -4 -26 52 -15 20 26 1 17 25 -83 18 29 7 91 -53 17 32 -28 54 26 47 81 41
3952D1q4J04p2k4N8l1N3K0j05M7K7m9K7k4jL4q9O6nqJ3M0j00O8j5n2J08p2L1O2
3982F8q0RL2r5J00K4k1n2N7n4J7n6M0N7n7KK8l2m9O0k9OJ8j1O0k0J2K0j3n8L2
4013A5k9M1rj00J48m5JK8j02N6M1n5qP9j4n5PKL2l4l9M7oj2Rk0J8K0l1L2j8n3
4045e4O7kj9OL1k4j0Qj6oJ2Ok0RM9l2n5O7k5J8o0M0L3o1J7J7Ql3M8pm6kj1J4L2
4080akM1l5p4N6n8L0L7M0o3mL5j5J04j42O7rJ6l5J8n0L8N4J5m4K0J4q9M0j7oL4
4112A5n3Q2n5K4m1QP6m9K1m0K6l7m3N6oJ0RLk1J4J0k9K4K9p5N1nj1qK0kqk2L0
4146Cj3n3Q9J1o3J0K5n1Q4l9Qk8L9o0Q8l9m1M0n8L4J3J4k5j0N1j2kl3M4j4rj4
4178a1L0j4K6j0l3J0%m7M4nK5J22j34k7M5Jn4P1j06L1L3K6K4n8OM4on2L3q7N7
$$ plain form
3952 41 -43 61 -11 -35 23 -8 45 65 -40 7 34 -15 12 -12 -13 21 -68 -2 -7 -15 -2 38 -62 6 -9 -61 47 -25 6 68
3982 68 -12 -3 29 -66 34 58 37 -15 42 -12 5 -51 -11 46 -11 -9 19 -13 -62 -2 -31 -25 -7 -18 42 22 34 54 41 -17 15
4013 15 -14 27 18 -82 66 21 22 50 -52 4 45 -10 -18 61 47 -8 -1 1 33 -1 -40 7 1 -11 -2 -22 -4 16 -15 17 -1 -54
4045 -54 13 11 -8 -2 29 5 -5 3 -13 -19 -7 -1 -21 -12 37 5 -50 17 -8 10 -50 -10 23 -38 -21 -4 4 -29 19 12 -34 -36 -47 -33 -1
4080 -1 -3 38 3 -71 -15 -73 -43 -6 34 -29 -33 2 -13 91 -51 16 7 23 -12 6 -44 -6 48 63 19 39 53 -36 4 -13 -19 15
4112 15 -38 44 -11 13 -28 -20 56 7 28 -12 14 -23 -66 -10 -16 -6 3 6 -15 -1 9 -20 4 33 -42 9 4 -7 -15 5 3 -5 -27 3
4146 3 -10 -63 26 37 -26 -16 9 -42 42 3 11 -17 22 -38 50 11 -30 10 -48 -14 -1 13 -12 -22 29 17 15 -18 26 12 3 -11
4178 -11 19 5 31 21 -12 -2 -2 -49 -5 -10 15 137 3 -24 21 22 -32 39 -67 -36 -3 23 47 -11 -5 39 33 -19 14 -73 -16
4209a6M5l1M1kl9O4o9J4k0j6M2j7l4O4k8jmjok2L7JK3m7K5k1l1J00n5j0J1L2k7
4242BMj6k9J7M2Jj5p7J04n3j6M5m7L9K1J7j3J2k6l5%QK9j4l0L8l9N5l5L5qJ0m7
4275b1L8k2J2kl6OM0o8P7p5k5J22l1J3j4qNK9j14O4j4j5M9n4j2M3M4p5O6k0J4
4306A6Pr6Q8Rm7K2L7o0J2l1K8O3o6L8nk4J9Rr3K6O0KJ5j18Q9P0q2j5L5j0ro9N1
4339b9L6J2jKj8L6ql0j1K4L5Qq4QM3m0R1r0pP6m3m5L9k0k1L1l5M5J1p5J8M2j7
4372a7M7j8j8K9l4lL7n8L4K9l8K1qK0J3Km8L7Rj3J7m0QK0m1J9j1m7P0l0J0ook
4406a6k9N4KJ8l4QO1m6L6k9j5Nj4j1j5J7O0p0l5P2j0j0K1k4K0J2j8K6kj6k8j4
4438b4lN9L1o0l6K1NmJ4K6k7jk6M0o7R1n8Rl1M1l0mO1j1j9jl9L5RM2l7j4k4L6
$$ plain form
4209 -16 29 -2 39 37 -2 62 -7 7 -13 -29 13 -4 -38 26 -2 -3 -7 -8 -14 -36 1 2 25 -22 3 -18 -49 51 -4 -14 -3 29 2
4242 2 6 -10 -39 -22 20 21 6 -71 33 -20 -36 9 -38 1 22 39 26 38 12 -23 -23 -15 14 0 -30 8 -31 24 -11 24 16 26 -21
4275 -21 17 -5 7 5 -31 -25 15 -53 24 -51 -76 46 15 28 14 6 11 40 -74 -10 -24 -39 10 -44 -56 -13 31 -44 22 2 16
4306 16 23 -73 15 24 -23 -1 36 -24 -12 -43 -15 48 -18 20 15 -9 10 19 -74 -48 12 14 29 -89 0 70 -12 -27 8 -2 -11 -80 -29
4339 -29 7 19 18 20 2 38 30 0 -11 13 48 56 -28 -20 23 -17 74 -16 -23 53 10 -35 4 -16 -37 -6 -41 4 15 -60 -42 0 -17
4372 -17 30 12 -6 23 -11 -14 23 -35 -1 28 -10 11 3 23 36 38 -10 27 36 23 40 0 8 28 -13 6 -5 -52 18 -12 -2 -8 -14 -16
4406 -16 -45 9 11 29 -5 3 64 18 54 25 10 15 1 -10 -25 -8 52 -18 -53 19 9 -1 20 -4 16 28 10 36 34 18 -10 -24
4438 -24 -27 32 63 3 -33 -12 -7 -11 3 29 2 1 -25 15 -52 39 -19 -10 -41 0 -30 -34 27 16 -3 -4 -43 -8 1 43 6 -8 -32 4
4472Dl5j0O9p8O2J6o3O1n2K5KL5m1M2m3k6jL0k4K2J6%k9K1M6q4mM9po1M3m9P2
4505Hl2Rm0N6l8P2K6n4j1l9K2O3q0O2Jo3L9Kj7M8m9j1K3n8J12n4j1L3%m3L0K5
4537C1k0nn9K4K3OOPL4q9M0p1J01l1J1L1r1J9k0L3oN2p0oO2l3L9k7lL6k8j7J7
4570dk1kL7n5M9qOLJl7N3j1M0k8k6l1L7k7K9N5p0J7m7m0J29j14J01L4q8P1j5q
4602C0l2k7q4Q6NmM6k9l1L7jL3k6pP%p3R4o9OJ08j04L8N1n0RJk6mJ7n8P6J3r0
4636e8P9j7L9l7J3o9L1k7N5Mp9O4K0p0R3m3j4J11j47N5j7jJ5J5q4R6o3%OL1k3
4667b2P5q4O6k5k2K6l1LJ6qqL1N4p6J3%Omj5lK6Jl6N7l9j4Lk8J4L9pL2o9J09o1
4702A9n2P2k1m8m9M7J2K8l1K3Qj1M5ln1M0l9Mk8J3L0MrL9m2qKK1n6mL9j9Q9o7
$$ plain form
4472 4 -31 -41 28 -50 12 28 -35 26 -26 -1 1 36 -5 37 -6 -32 -33 -3 -27 -5 11 11 -18 3 49 -35 -39 10 3 -58 -15 -64 8
4505 8 -24 -15 -55 1 -37 35 61 7 -4 -43 -21 42 -38 24 25 -38 1 3 -14 34 -15 -26 -3 -61 51 -3 -14 19 19 -24 6 31
4537 31 11 6 -53 -29 -6 0 6 13 47 -42 -2 -73 28 -3 8 39 -52 -33 -53 -20 -26 26 -44 -50 12 -21 18 -9 -12 24 -4 -21 -4
4570 -4 -25 -27 10 -45 4 -4 2 5 6 -31 22 11 51 23 -3 -34 3 -24 5 60 -10 7 -40 -80 49 -65 36 70 -18 53 38 30
4602 30 -2 -29 -113 -27 -22 -26 20 -9 -40 -3 -4 29 3 -4 3 3 -70 24 -45 -39 69 -35 3 54 4 13 14 -12 -16 1 -57 19 32 -58
4636 -58 21 4 43 6 19 -50 -19 -46 9 13 -66 -2 18 -52 41 -2 -16 95 -52 3 -14 -15 0 15 -69 27 -36 -36 -30 1 -22
4667 -22 53 -31 35 10 -12 14 -17 -14 2 -6 -14 17 71 -5 8 8 14 10 -5 -8 18 19 -17 40 1 -13 -10 -38 -24 15 8 40 -29 80 19
4702 19 -33 39 18 -30 -79 -32 -20 8 -23 0 8 -3 42 39 -12 28 -11 -7 -35 -22 8 12 3 42 0 -8 -6 15 -41 -45 -6 -25 64 -3
4736cK3Jqm5L2k1M4Nl0m4N2jM4k9KK7p9M4ok9rO3l8NMNm0K4jL1m0l2P8o6M7l4
4772b4lQ9j09j4J16o8K6qn2K3L6n9N8j3J5pl0M7l0N1o3K2L7o3L8l8L0kj8J4J5
4803A6n8N2j1L3p9N3J4m8K4k8L0m1O8j5pnK6Qm4Qm4P7m8K4P7p6k3LJ0N2j05M6
4835a1J6l1L1l1jN8o5K2jlK2L1J4r1M4k0ML9rk5L9o9N7m8J6M2n1J7J7m1j5M9K5
4868C1n3L9qk5k2PJ6OJ4j0K6j7l4L1K6l0K6n2M0Jl8l7M9k6J7l3P0P1j17Q3j02
4899e1J03l3m1K6k8L9j3kJ7J3k9j3J7%JL5m8jJ4k9j6N4k9K5n3O8l4M9j9Jm2L6
4931A7K9l6J6n0M2P0n2l2J1k9k9O4k6L5pmk5j3K9j4L4l3K9n8J0M8j0qm9O5l2j9
4963b7POJ7LM2r2K8J3l3JrJ8M3m2N4lj7j0l4J6J9l5L2M0k9%J1m1O2m9J8mK6k2
$$ plain form
4736 -3 20 21 13 -32 0 -21 23 28 -2 -46 6 5 49 20 22 49 -30 14 8 -21 -30 33 -5 0 4 9 -31 -7 -8 23 -17 -49 29 -37 10 -24
4772 -24 -27 62 -47 -61 55 -13 13 5 -47 -24 12 -47 11 -2 13 6 -24 23 -7 44 -19 3 40 -23 15 -23 7 5 -13 1 16
4803 16 -42 10 -1 32 -47 6 20 -28 -4 -32 -2 -43 25 10 3 -2 24 32 -12 -4 -48 29 -19 5 82 6 -17 -14 -4 48 -57 -11
4835 -11 5 -26 5 -26 -27 31 -34 -12 -13 -16 6 37 51 -40 4 -16 -12 27 18 -7 32 -37 20 -28 -12 30 -21 -4 13 -28 -43 6 31
4868 31 -22 17 9 -16 -38 -31 -15 -9 5 -5 21 4 -30 1 27 -3 23 -29 11 12 -26 -63 -14 -40 -23 -56 14 85 -32 51 -51
4899 -51 52 19 -22 4 -24 15 2 0 17 30 1 -12 5 5 6 41 -7 -8 6 -23 -39 15 -14 11 -42 26 -8 41 22 23 -19 17
4931 17 46 10 26 -24 18 88 36 4 15 -14 -43 21 -5 30 23 19 -6 -19 10 -4 30 -3 26 -32 -22 26 16 8 -41 24 -8 -27
4963 -27 -20 -14 3 6 48 -44 -16 -3 -36 -35 -44 -26 17 -25 29 26 9 -1 -35 -19 0 -35 -3 37 8 8 19 -22 40 -9 9 5 31 9
4997Ij3Pk8PJ8J6Lk2m2O4rKkkO6l1k2l6O0o2J6K7p7N5j5M2l3J6qrJ8jkJ3Mj11
5033h2O7NJ3j5L2p1L2N2j2K1q4M7M9q0L1jj8O7k5q4J4L9j3J6j3rK4j8K2L1q9L8
5065a4L6nl0j0K5k4N1k5k7N5o4L4K8l5N4p4L3k5kRJ7m4K3M4k8j2L1llk3J0J3n2
5098c7L0M6j2o7K6k7O2J9o0M5m2%j8nM4J9n6RM5q6P1J6l1M7j9k3J6Kl1N1o2L6
5130Hj6OK3l5N3j1k9K0M6r1Q8j00J6M0J7n9K1o5Q0nj3J1nQK7j5n4R5p5Pk4R1p5
5163a5K5Mo5J10q4N8j9Ro7M4j2k0J7K0L6q0N1J9l2Lj1J4Jk9L3j4j4M4rm7K5RK4
5196B8m9N3q1M1K0j3k5lm6M2K9m1R8p3J3Q1k5p7O3l6K4k9k1J9m0M4L8p5P1J5m
5227D1m0OqJ5j1%k9k8K7R0k9l9J1k9J8k5L3lj0n6P8j1j0J2l8K7J7J5n6M2n4O6
$$ plain form
4997 9 -4 3 -25 -18 0 16 19 -3 -45 19 10 12 10 8 74 43 21 -15 45 -17 -1 26 -51 4 -11 31 -2 14 6 -3 15 14 12 25 29 -82
5033 -82 -15 -10 3 -12 20 -51 -19 33 21 42 -42 5 54 -26 5 4 -14 53 28 -56 -42 -3 -16 0 -13 -22 2 -16 6 37 -52 -14
5065 -14 22 17 -13 -23 2 -22 29 4 -23 32 -32 2 30 -5 49 -25 8 -17 -19 -10 7 -37 -14 30 2 -10 21 18 15 -8 2 15 -37
5098 -37 -7 39 27 -40 -14 -41 21 40 -20 25 -17 -17 -35 -40 4 23 -33 -24 21 -65 6 22 -9 38 19 -4 12 14 -17 34 -28 8
5130 8 -8 -2 21 -14 39 28 -1 19 65 -26 62 -38 -22 18 35 -24 -3 -68 12 7 -6 5 0 8 35 20 -34 61 -14 -7 -31 60 -15
5163 -15 10 14 -51 59 -25 33 14 23 -44 0 -12 -32 -15 5 41 -39 12 31 -1 2 -9 5 6 -23 10 -4 -18 26 17 -30 -5 4 28
5196 28 -21 32 -49 -8 12 -1 -26 -29 -75 -33 -4 -45 53 -20 -7 74 49 -28 35 -1 23 -6 -27 -8 -48 -4 34 -41 30 45 41
5227 41 1 7 -1 14 3 3 -26 -54 -27 63 34 -5 6 -23 -5 -30 3 0 -10 -66 12 1 -9 3 -35 -8 9 24 -32 10 -44 22
5259B2J1k2nk5K0l3N7k1l5n2N9J8Qj6K0rK2n9O0j7L6o1J8l8L2jk7M5J9k0oo7J3
5292e4N3m8K6J3Kl7M0k8L5J2l9N6K0o8K8L6q3P6n4KJ2K7m4%N0k8p7O8Oj6N2o7
5324b9L7k8n1M4Q7l7n9M0QK5o7N0l6L2p5J8K6jK1%K3k0n3QQ2l3Mj6L4J5l0l5K2
5357Fj9L9n6M7k6m9M2j3J2K8oJ7oM0j5o7K5K7n5K0k1MK4N9n7j4l3K6K5Mj2oMl5
5391d1P5jk2n7L4Pj6J0j4Q3o5K8k7N1l1Om2O8l5pj6j2K1j7L8m8JkJ0K9K0n9L7
5424FJ0m6Jj5L7J5k8J0K3K6n5m0O0Lql4O8n9K3kQ3qq6KJ0Rl1L3jJJ4l9J9j7M6
5459C0l6k3K1j4K0n5K2K1m0P8l2K9n0O9m2KL0j0l1ON0n5l6ON7j1Pl1kK3kj3J0
5492bk5pM8OK5n0M8l5m3J9J2L1m0N4rjL3j9m8L3l2l8L3J9rm7J9k2P4m3N3n7K9
$$ plain form
5259 22 33 11 6 -19 1 -32 25 4 -31 -83 -24 -6 2 -14 6 -3 19 -40 20 3 39 -22 -4 -42 -10 -11 -38 7 26 6 0 -67 -54
5292 -54 -1 -49 -23 -10 -8 -45 -5 -33 2 14 -25 31 51 -17 11 47 -36 40 -14 -12 0 27 -17 -17 33 5 -72 -4 2 -14 38 -29
5324 -29 8 -20 -71 -27 60 23 -36 4 12 37 -30 20 -16 16 -59 -41 -15 -16 5 5 28 8 -45 -37 45 12 16 0 34 49 19 -16 6
5357 6 -13 26 -30 17 -9 -58 -16 -29 -17 11 5 22 16 56 41 -26 -1 26 -29 -9 -30 -26 -2 57 0 -14 -47 -21 4 8 -4 -10 -6 -41
5391 -41 34 33 11 -46 -12 -5 -21 -11 -25 58 -7 21 -6 45 14 20 -22 46 11 4 -12 -24 -3 -20 18 -30 -29 -31 -21 8 28 -31 6
5424 6 16 -30 -29 -44 -7 8 -20 -10 13 39 -16 -56 4 7 -1 -35 33 -26 -3 -5 78 70 -16 -14 -4 5 -26 7 6 7 21 -18 1 -16 30
5459 30 -6 -29 -8 -22 -2 -57 -35 -14 -54 24 -8 21 -29 40 -2 0 30 20 -11 -5 45 -10 -46 -40 17 6 13 -18 -20 3 1 -12 -2
5492 -2 -27 -34 14 20 45 -5 43 8 -35 -16 -4 27 -13 41 32 31 64 45 -3 30 -2 -40 -7 12 3 -44 -25 -47 27 -16 37 -20 9
5525IJ9jk4J3k1lJ1J2J4m2Qj1K9k6l0M0J9l2J1L8m5M0km8K4J9p%jj2L1k1k1j3
5559b3M8j1n4K4N7K7o4oN3q9J4j4M0K3o7M6K7l9K3m6K7LOj%m2J9%L1l7J6K1ll3
5593b4N0k3Kj6K2l6QL3n9R2k8Rl6L2l7L3q7N0Nm6O0Ol1L4o6M4L9j2j7n5rN2K4
5626A3K6k1l1m2O8k3k2NnL7J8j6j7L7Ko5M0l1J3rM7j4k7O9n4rj0K9L0j4k2k7M6
5659B1J0Nqj7K5k0K9n0j8MMK3K8l8J0j7L0k2l2M2lJ1ql3M8j6K3j2k9qM5l4Jl6
5693d2L4QmkjJ4l9K6K6j4k6K1L4n6L0j4J3O3o2k0KK3NJ7m2o3P0o%J3J2m2J2j9
5727b9N1l6P7p1jP1q9LK1J1J5J4j1o2J9Q1l2m0K6J4q6O2l8O4l8K6qk3rK0L7m6
5759gO4o5j2PmK7k6J0J9Kl5M7O2j36O6j1l4nN0j7M2p8K4M7k8Ln4L6ok3M6LJ5o
$$ plain form
5525 9 28 27 3 16 -5 -8 3 15 29 -13 -5 -16 13 -13 -43 -3 16 -16 -5 33 -12 28 26 -22 2 21 14 14 13 1 32 11 -10 -23
5559 -23 25 14 -40 -16 41 68 4 -2 51 -38 -24 -38 2 25 -42 4 31 -8 15 -31 -4 -1 5 4 4 -38 -19 -19 12 -25 -9 12 9 -24
5593 -24 26 3 5 -11 11 -25 -17 16 -43 49 21 30 -6 26 -11 22 -65 -15 -10 -56 4 10 -21 13 -53 -9 30 18 1 -54 -63 -11 13
5626 13 39 18 -13 -55 13 -10 -32 -27 -32 5 23 7 -10 27 29 -36 4 -27 -14 -23 24 10 -17 52 -2 -11 -21 8 38 24 2 -25 21
5659 21 31 36 28 11 36 16 45 -5 -23 -19 -15 8 36 -2 8 -9 21 -1 -33 9 6 17 9 -24 24 8 31 19 -10 -18 27 -7 -6 -42
5693 -42 -8 0 -4 -6 -7 7 -32 -6 20 6 -20 1 35 -21 9 -5 8 71 9 -11 -9 14 19 36 -6 -69 1 -5 -5 8 20 -22 -10 -29
5727 -29 22 -14 63 -8 -9 62 -27 -24 -3 8 23 37 26 -36 -17 64 32 -8 18 32 -54 8 -30 34 -4 22 14 -9 -18 2 39 -7
5759 -7 57 -8 -20 -13 -17 10 -16 -6 13 15 -20 27 89 -47 19 8 -26 -31 19 2 44 -34 -10 37 9 12 -42 -6 -12 -35 11 14 29 23
5793B3k2L9m3k8K2k4K3M8p4P3o0n3J27k8J8r5M6j3j7M2l8L5K9l3Ln5N8k8j3K6
5823a2O%j3L8k2J2j4L6q8JL7PL9n1J4K2k2jPJ0mJ8RoJ5q1L3J5mJ8rj4K1k9lRk0
5860b6j1L4j0J0K0m1M9n4M0J9l7OL7j1ln2L3J2QN0o8nJ7m0L6j0J8l0j1L5J1J1
5892C7n8MJ5j8jRm0O4l4L0K2q7M8j7O2m9L5j8J2o5N0j7OJL1j8nM6m6J0L9q6J9
5925a9L3l9MPoK7J3m2M4o7M9oO0l7Mj2l4J0j6K4m4J7L8M9p1K9Ok8K9L4n3l5k7
5958e9K7M2m4O8pm9nL0J0Ql0M9rJ6l4m0LK0J8l6O1k6k9K1j5Oj8Pk8j8J01o3l9
5991f2L9K5Mk0OJ5j3K0l4N0n0J2k1J2k2k0O3k0k6M1O6n3j7L7Pr0K8K5m6J1P1p7
6023c9N1Jn9P1o8P3k5j9l2P7k3Pnm1N4r3L1N9l7qM0%k4MK1l9N4j9l6J9N2o3qM7
$$ plain form
5793 23 1 40 -3 -31 -9 -33 -10 38 -36 37 -23 -76 51 23 41 -54 -8 -21 -38 4 -34 1 30 -3 0 -55 3 -25 -38 -12
5823 -12 -6 -6 -19 19 -3 9 -5 31 -57 -56 -19 -12 27 -24 -10 12 -10 -11 -4 6 2 20 29 23 38 -43 -10 5 1 19 10 -4 17 -12 -15 -6 -26
5860 -26 -37 -3 -13 -3 17 -24 25 -29 11 30 -7 -1 36 25 22 -30 3 15 23 73 5 0 17 -23 13 3 21 -9 -20 15 26 37
5892 37 -21 -17 -2 -20 -21 -12 -52 12 -22 8 30 -57 -9 -26 36 -13 22 4 16 -49 1 -16 -10 -9 22 4 -1 45 -1 9 48 -38 -19
5925 -19 14 -25 -21 -14 -20 7 20 -22 22 -45 4 -2 58 21 25 13 -21 -11 -27 -3 -47 -30 8 57 -14 15 21 -7 22 56 3 -32 -59
5958 -59 -32 10 -34 34 27 -22 -27 3 13 21 -9 40 31 47 13 -27 -24 -4 14 -22 39 13 -16 5 -10 -4 -22 -15 -43 -61 40 -23 -62
5991 -62 -23 2 6 -14 -8 7 -6 14 -20 30 -20 -8 -29 -17 -39 -59 4 -16 -42 -1 65 12 -5 32 39 -51 -23 2 -44 -33 38 -39
6023 -39 12 13 -46 25 -43 30 5 -14 -46 31 8 15 10 -31 23 -70 -39 20 -17 -25 15 15 -9 -5 16 -23 31 12 -24 -5 47 -16 -24 23
6057B3k9%k1O0j4J5j6l8j0M5k1%L0p2N3L3j6n2j0M0OL6p5M9l4j6Qk0J01n9k4N8
6089C0n1jK5K4mPj06Q4K7l2Rj0M6k4J9o2L5l6l5J2L9N7p2M9n1M6qPk7J0l3PM7
6122B8k3n6O0K8p8Q7jo1k4M4lm1N6j8K7LQm9nNJ0pK0m2M0k5J7J4k0J2j2PjK8k2
6157Fl1L6j6ML1n6K5L0J8n4K0l9NM9l8p3J01j8M0p4L2Rk8Pj0J4K3n4M5J5K2l4
6189Gk1jj0L9QM5n4n8R2m6Qj6mM3k3J0jj0m5K3QKJ0l9M0K5k5kJmnl3O8r4Q4lJ5
6226C4K5o0j5K3k8k8P7n9M7j8rj2Rm6N8K1n1O6pj0rk3K7l2J5L3j8k6J5K6j4k4
6258a3M5l0J2j1l6j0Q6p5M5J7j8l0J9J2L2m6J0Jrj6j7J5j3j2OO4L3Ml3l9O5j07
6290d9J3M4k4M0lj3J1j9k8N3j04P1JM6r4J10n1j3J5l8L0Qk5N2j2mrL4o4J5KK8
$$ plain form
6057 23 -6 -6 -27 33 19 34 18 -20 -30 15 -6 -6 24 -48 5 38 22 -30 -40 0 6 42 -33 16 -18 -34 -26 -46 55 -4 -28 30
6089 30 -21 -22 3 27 23 30 -76 8 35 3 12 2 48 24 43 -19 16 -20 -55 -43 -4 53 -19 30 -21 25 17 24 -3 7 -26 -19 28
6122 28 5 -51 9 37 -41 46 45 -16 -40 4 1 -40 16 -2 25 28 36 -13 -18 -13 -3 -10 10 -32 8 -17 0 14 -6 6 -6 1 0 28 6
6157 6 -25 11 -5 -1 30 -26 -1 29 47 -7 13 -26 -21 28 -10 -83 18 0 40 -34 -2 7 -21 -14 -24 -10 13 -41 4 19 41 7
6189 7 -14 -15 -25 14 22 67 13 -45 47 1 9 -7 -11 32 9 19 18 8 -37 -14 -6 -4 6 -33 7 32 7 5 6 2 -3 -36 32 -62 22 19 34
6226 34 59 -1 -16 7 -21 -49 28 -31 16 -2 -11 -23 -14 -60 -2 19 -32 34 27 17 8 -15 12 -20 -5 28 10 -16 -1 25 11 -13
6258 -13 32 2 14 3 -33 -43 43 -32 13 30 12 -18 1 13 45 -1 9 10 1 -15 -32 -17 -30 -42 -36 28 61 65 32 -7 58 -49
6290 -49 -36 8 -16 24 21 8 19 0 -28 25 -79 -8 -7 39 -55 55 4 -9 6 -32 -2 6 -19 33 21 17 8 42 -22 -7 -5 23
6322B3r1Q2rQk6j8J1N7j7k3L5o9J0M1n2R4m4k6MJ3mk0rk7M2K9k9j3L5k2M5n1j8
6355c9P4l4%nN6q1J2M5o3P2o0M3j2l6L9k9RK3l6J7mJ3Jm0K6PPMk3l1J9OK6%n5
6390d9JP0l2mp3O9M1jj0QRn3O4j0j8M3o2K9l4J7lJ4l6K0L1q0M7j1QJ4J6k7o0O8
6424Fm8K8Rl8K6K8l3j3kN6j3k4J1rj3oN2k7QL2qnJ0j0m0J8Np6N6N3L2o9j7j5L2
6459dJ0j5K5n7jN8n8M3J2l6J02j02k8L8J2N4k2m7O2q3P4l9k2L4j%%nnJ6m7M2m2
6492c2L3Nn5K6J6k1pM8j6J2Ll0J3j9O6q1NN3j1m1J2L1n0K8l1N8j4Mj9M2k9j1o
6525a8j0K9O8l6o3O7l0L5o3M6p3M2nK3%om7jM6p0P0j0j0J4M8l0L1m5j6J5Lk4O
6558a4k0J6jM4o5N4jJ1j6M4k3p4N6j3L6m7K8n0RL0K7k9k8M6n2M1Km2J6mJ4%Ol0
$$ plain form
6322 23 -68 14 5 13 -13 -31 -20 37 20 -3 32 -37 -27 14 -38 56 12 -14 -10 3 -1 -21 -30 -57 -15 14 -15 -28 7 -15 30 -21 -39
6355 -39 35 1 1 -4 52 -29 -17 28 -35 37 -23 20 8 -28 11 -18 -9 14 -22 -5 -9 4 5 -35 -9 -2 5 9 -14 -45 -26 -20 6 6 -49
6390 -49 -48 22 -10 -14 -87 -18 23 22 12 20 29 -24 40 30 12 55 -7 22 -12 5 2 16 -20 0 31 -49 -2 -13 -5 9 25 -2 -62 6
6424 6 -42 -14 -5 -43 -17 11 -22 -35 -37 19 6 -18 -7 -16 -29 -35 17 -10 -2 30 22 17 27 17 -23 -5 0 -76 -20 33 65 -4 -21 -36 -4
6459 -4 6 -9 16 -41 -42 16 -42 1 13 -23 79 -23 -51 -13 -1 53 31 -16 46 -37 37 -2 -24 10 9 9 9 4 -1 15 -32 10 -32
6492 -32 1 6 -49 -23 -7 -28 -35 13 -3 9 12 -18 -5 -24 42 -39 -34 19 8 -33 -21 10 -40 -12 -43 15 1 5 -14 28 -1 -12 -18
6525 -18 -28 1 69 33 -30 37 7 42 -21 25 -48 -6 -11 12 12 6 -41 -42 4 -66 4 -6 -16 -2 46 16 47 2 -14 1 4 -20 -14
6558 -14 -34 -18 -19 25 -40 14 13 24 8 52 29 -45 11 -2 34 -13 15 -35 -26 4 31 2 -26 20 -32 9 11 -31 -15 -19 -5 -5 1 -29
6592b9PK6j6N3j6k6l7N2l2K9oLK1l3k5L9j3l7J2M1L0n7m3L8k7N3j9j7J5Kk4M3
6624Gl3L3kK1l1Qj9M4k1j1k2K1K3l2J9kqk7k7M2lK8m4j8J5qK2P1l7m8M6J8l7K0
6658Hl9M3J1m4K5n6O3k8J9l4N5o3J2m2O6j7L4Lj0J6n7M9l1j4L9J4pk3J3K9o6J1
6690b1K0j2mK5k2J9lK1p2Q3k9nl5K0M2n9M2J2K3n3J0l0mQM2l4Rk4L8k4PKK4n7
6724d1K5j3O6J1m8J6l2M0n2K5k2M4K9n2k1J1M7k4kj4L5pk3J9K5k0prk5O0o9L2
6756DL8o8oK0J4k0kJ1N2k6k1m2J8J2m9NO3k1L6J1q8O6on8N5J2l1pM9m6K3j4J9
6789Ck6q7J35nk6P0j4l5Kj6m7L5L2j3j6K3k9QmOj5PM4o1J9L2n7R%Q0n0ol1j6O6
6824A7J1o1N9o5M1j3M3J7l3l2rK6M0k7o7J5K4j1L6rpJ9m5Lqk1J13l6Pn7j3N1m2
$$ plain form
6592 -29 -22 4 -12 41 25 -1 -38 14 -18 11 5 8 29 -4 -29 10 -3 -40 -28 13 43 -14 -57 -19 -46 7 -12 -29 -14 -12 -36 7
6624 7 -26 7 5 26 -5 3 -16 28 7 -4 -26 -5 18 -14 5 3 -5 -32 -59 -17 -20 8 -36 -54 -39 -47 -25 46 9 -39 7 25 -12 8
6658 8 -31 12 23 -21 4 -52 11 -17 2 -32 23 -40 -28 -70 -4 -21 13 16 6 22 -35 14 -17 -31 8 22 15 -8 5 34 -32 -21
6690 -21 -1 -13 -17 8 -14 5 2 23 -49 34 5 0 -35 -15 27 -32 10 22 45 -8 2 -28 -32 -24 18 -16 -7 -31 7 -17 -10 -8 16 -41
6724 -41 -16 -29 37 48 0 16 -16 24 -28 -3 -25 19 48 -4 -25 -14 33 9 7 -7 28 21 -2 17 42 22 15 6 -19 41 -28 4
6756 4 42 -26 -32 -12 2 -18 -20 -9 43 17 -4 -46 -28 -16 -65 -60 3 -18 18 29 -59 7 1 -57 -2 10 -21 -28 21 -25 -2 -16 3
6789 3 -23 -110 25 20 -6 64 50 15 17 1 -46 -11 21 8 -8 15 -14 -6 -10 -4 -19 -12 32 -29 -10 22 -35 -26 -26 54 4 -2 -33 -49 17
6824 17 28 -33 26 -39 2 -11 32 49 16 -16 -25 1 41 14 -53 -38 -14 -25 11 2 -5 14 -31 -28 -36 -57 56 20 27 -30 -43 8 -34
6857c4N6l0lJ8k1m1K4M9l8L6l4L8K0m5n0P6q8M4OK4m9J36j16J4J5Pk6l5K5K8j7
6888a1j4P5q8N9q9M1J3K0j2rJ2RJ1J7lq8N5J7n1L5J5k4J3O1n8J1j1K8j6k2M1J8
6920E5p6J0KnL6j6m3K3PK4j5m7O6m2K8j9%nl1O2j2j4n1P8m6M9LOp%l3K0j2j1N
6955a1m1M8mJ1K2K3k4J6q1K8K4J8Oj6mMoJ7o5oM4L4q1K0M0J6n7j5M0Ol0K0K3j2
6989GRk0M0l4l0k4L2K8LqL9n1L5j8J0l8R4r3J6KP1m7j6ln2L7L9J8m2J7Pl0K7k5
7023@k0J8J9n2M5m0M8Ql8qQ1k8rm1j5K2J6J7n8L5L2qj8J2l0M0K1n6j7L2K1m0M8
7056C7l6qJ6m9M7m2K9k1LL7RKo7N5o0J6L7Ko9M6L1n1J4L0pK5q5M6J0rj1M7l2J6
7090Hj2K6n2J2J7kM2j11P8K1m1k9kO0j6j8L7rp6Q9l2M1J4j9K4o1Nk3L1Kk8LN5
$$ plain form
6857 -34 22 -8 -11 7 -14 -55 -31 18 -20 16 -18 20 40 -5 -55 21 -67 -23 -17 7 -42 94 -22 -8 7 14 -12 -47 -22 6 -11
6888 -11 -25 50 -38 21 -68 -27 -14 6 -6 -15 -3 6 17 34 31 -57 -2 15 -36 -1 14 -10 3 64 6 17 6 34 18 -4 37 55
6920 55 -21 -11 -9 -14 22 6 -37 -14 -7 17 2 -45 21 -21 7 -12 -12 -17 -48 14 2 -12 -63 15 -31 18 21 27 20 20 -13 7 -5 -16 -11
6955 -11 -52 -4 -8 3 25 48 24 40 -41 -13 11 29 35 19 15 19 13 30 -35 -41 3 37 -44 -24 16 32 -25 -40 0 6 -24 -4 19 7
6989 7 16 -4 36 2 -28 -52 -20 8 11 3 42 -9 26 8 18 -20 74 -19 -3 -1 70 23 7 4 -48 -11 28 46 4 21 28 -2 25 0
7023 0 -20 -2 17 -35 10 -30 18 26 -12 -20 61 33 24 -17 -32 -10 6 23 -35 0 32 24 6 18 -12 28 49 -7 -24 8 29 -11 37
7056 37 1 -7 9 -40 7 -35 -6 -27 -24 13 22 24 -43 12 -48 -32 5 7 -62 -16 15 -36 -22 8 1 26 -59 -13 -3 -12 -23 24 -8 8
7090 8 -4 22 -30 -18 -1 -3 39 -72 6 27 -14 -43 -45 15 -1 -19 18 9 -67 22 -10 31 45 26 50 -11 -6 -29 2 4 -24 -21 34
$$ [...]
8191D5
##END NTUPLES=NMR FID
##END=
