##TITLE=1H_LR-758-R5-3HS-1
 CDCl3
 8 sc, 
 4.9.2023
##JCAMPDX= 6.0         $$ Bruker NMR JCAMP-DX V2.0
##DATA TYPE= NMR FID
##DATA CLASS= NTUPLES
##ORIGIN= UXNMR, Bruker Analytische Messtechnik GmbH
##OWNER= root
$$ XWIN-NMR		Version 3.5
$$ Mon Sep  4 15:30:37 2023 Russian Standard Time (UT+4h)  she@DPX200
##.OBSERVE FREQUENCY= 200.13135
##.OBSERVE NUCLEUS= ^1H
##.DELAY= (6, 6)
##.ACQUISITION MODE= SIMULTANEOUS
##.ACQUISITION SCHEME= undefined
##.AVERAGES= 8
##.DIGITISER RES= 18
##SPECTROMETER/DATA SYSTEM= spect
##.PULSE SEQUENCE= zg30
##.SOLVENT NAME= CDCl3
##.SHIFT REFERENCE= (INTERNAL, CDCl3, 0, 15.7039)
##AUDIT TRAIL= $$ (NUMBER, WHEN, WHO, WHERE, WHAT)
$$ ##TITLE= Audit trail, XWIN-NMR		Version 3.5
$$ ##JCAMPDX= 5.01
$$ ##ORIGIN= Bruker BioSpin GmbH
$$ ##OWNER= she
$$ F:/spectra/data/she/nmr/H-F/1/audita.txt
$$ ##AUDIT TRAIL=  $$ (NUMBER, WHEN, WHO, WHERE, WHAT)
(   1,<2023-09-04 15:29:10.65 +0400>,<she>,<DPX200>,
      <created by zg, POWCHK disabled, PULCHK disabled
       configuration hash MD5:
       00 E9 B6 7A A2 85 ED C7 34 08 36 98 17 FE 4E 26
       data hash MD5: 16K
       23 01 BD AF 94 6F 5A 44 1E 49 21 D4 8A 6A C3 FE>)
$$ ##END=
$$ 
$$ hash MD5
$$ FD 2A 73 8D 30 B4 0A D7 8E EE D5 56 DB CE FE 62
##$RELAX= 
##$RELAX= 
##$RELAX= 
##$RELAX= 
##$RELAX= 
##$RELAX= 
$$ Bruker specific parameters
$$ --------------------------
##$DU= <F:/spectra>
##$EXPNO= 1
##$NAME= <H-F>
##$PROCNO= 1
##$TYPE= <nmr>
##$USER= <she>
##$AMP= (0..31)
100 100 100 100 100 100 100 100 100 100 100 100 100 100 100 100 100 100 
100 100 100 100 100 100 100 100 100 100 100 100 100 100 
##$AQSEQ= 0
##$AQ_mod= 1
##$AUNM= <au_zg>
##$AUTOPOS= <>
##$BF1= 200.13
##$BF2= 200.13
##$BF3= 200.13
##$BF4= 200.13
##$BF5= 200.13
##$BF6= 200.13
##$BF7= 200.13
##$BF8= 200.13
##$BYTORDA= 1
##$CFDGTYP= 0
##$CFRGTYP= 5
##$CHEMSTR= <none>
##$CNST= (0..31)
1 1 145 1 1 1 1 1 1 1 1 1 1 1 1 1 1 1 1 1 1 1 1 1 1 1 1 1 1 1 1 1 
##$CPDPRG= <>
##$CPDPRG1= <>
##$CPDPRG2= <>
##$CPDPRG3= <>
##$CPDPRG4= <mlev>
##$CPDPRG5= <mlev>
##$CPDPRG6= <mlev>
##$CPDPRG7= <mlev>
##$CPDPRG8= <mlev>
##$CPDPRGB= <>
##$CPDPRGT= <>
##$D= (0..31)
0 1.2 0 0 0 0 0 0 0 0.06 0 0.03 0 0 0 0 0.0002 0 0 0 0 0 0 0 0 0 0 0 0 
0 0 0 
##$DATE= 1693826950
##$DBL= (0..7)
120 120 120 120 120 120 120 120 
##$DBP= (0..7)
150 150 150 150 150 150 150 150 
##$DBP07= 0
##$DBPNAM0= <>
##$DBPNAM1= <>
##$DBPNAM2= <>
##$DBPNAM3= <>
##$DBPNAM4= <>
##$DBPNAM5= <>
##$DBPNAM6= <>
##$DBPNAM7= <>
##$DBPOAL= (0..7)
0.5 0.5 0.5 0.5 0.5 0.5 0.5 0.5 
##$DBPOFFS= (0..7)
0 0 0 0 0 0 0 0 
##$DE= 6
##$DECBNUC= <off>
##$DECIM= 32
##$DECNUC= <off>
##$DECSTAT= 4
##$DIGMOD= 1
##$DIGTYP= 9
##$DL= (0..7)
0 120 120 120 120 120 120 120 
##$DP= (0..7)
150 150 150 150 150 150 150 150 
##$DP07= 0
##$DPNAME0= <>
##$DPNAME1= <>
##$DPNAME2= <>
##$DPNAME3= <>
##$DPNAME4= <>
##$DPNAME5= <>
##$DPNAME6= <>
##$DPNAME7= <>
##$DPOAL= (0..7)
0.5 0.5 0.5 0.5 0.5 0.5 0.5 0.5 
##$DPOFFS= (0..7)
0 0 0 0 0 0 0 0 
##$DQDMODE= 0
##$DR= 18
##$DS= 0
##$DSLIST= <SSSSSSSSSSSSSSS>
$$ [...]
##$SUBNAM2= <"">
##$SUBNAM3= <"">
##$SUBNAM4= <"">
##$SUBNAM5= <"">
##$SUBNAM6= <"">
##$SUBNAM7= <"">
##$SUBNAM8= <"">
##$SUBNAM9= <"">
##$SW= 18.05172834244
##$SWIBOX= (0..15)
0 0 2 0 0 0 0 0 0 0 0 0 0 0 0 0 
##$SW_h= 3612.71676300578
##$TD= 16384
##$TD0= 1
##$TE= 0
##$TE2= 300
##$TE3= 300
##$TEG= 300
##$TL= (0..7)
0 120 120 120 120 120 120 120 
##$TP= (0..7)
150 150 150 150 150 150 150 150 
##$TP07= 0
##$TPNAME0= <>
##$TPNAME1= <>
##$TPNAME2= <>
##$TPNAME3= <>
##$TPNAME4= <>
##$TPNAME5= <>
##$TPNAME6= <>
##$TPNAME7= <>
##$TPOAL= (0..7)
0.5 0.5 0.5 0.5 0.5 0.5 0.5 0.5 
##$TPOFFS= (0..7)
0 0 0 0 0 0 0 0 
##$TUNHIN= 0
##$TUNHOUT= 0
##$TUNXOUT= 0
##$USERA1= <user>
##$USERA2= <user>
##$USERA3= <user>
##$USERA4= <user>
##$USERA5= <user>
##$V9= 5
##$VALIST= <valist>
##$VCLIST= <CCCCCCCCCCCCCCC>
##$VD= 0
##$VDLIST= <DDDDDDDDDDDDDDD>
##$VPLIST= <PPPPPPPPPPPPPPP>
##$VTLIST= <TTTTTTTTTTTTTTT>
##$WBST= 1024
##$WBSW= 4
##$XGAIN= (0..3)
0 0 0 0 
##$XL= 0
##$YL= 0
##$YMAX_a= 356807
##$YMIN_a= -397056
##$ZGOPTNS= <>
##$ZL1= 120
##$ZL2= 120
##$ZL3= 120
##$ZL4= 120
##$ABSF1= 10
##$ABSF2= 0
##$ABSG= 5
##$ABSL= 3
##$ALPHA= 0
##$AQORDER= 0
##$ASSFAC= 0
##$ASSFACI= 0
##$ASSFACX= 0
##$ASSWID= 0
##$AUNMP= <proc_1d>
##$AZFE= 0.1
##$AZFW= 0.1
##$BCFW= 1
##$BC_mod= 2
##$BYTORDP= 1
##$COROFFS= 0
##$CY= 11.3945322036743
##$DATMOD= 1
##$DC= 2
##$DFILT= <>
##$DTYPP= 0
##$F1P= 15.7292609196834
##$F2P= 12.9074282941183
##$FCOR= 0.5
##$FTSIZE= 0
##$FT_mod= 4
##$GAMMA= 1
##$GB= 0.15
##$INTBC= 1
##$INTSCL= 1
##$ISEN= 128
##$LB= 0.24
##$LEV0= 0
##$LPBIN= 0
##$MAXI= 10000
##$MC2= 0
##$MEAN= 0
##$ME_mod= 0
##$MI= 1.114404
##$NCOEF= 0
##$NC_proc= 0
##$NLEV= 6
##$NOISF1= 3.799351
##$NOISF2= 2.8
##$NSP= 1
##$NTH_PI= 0
##$NZP= 0
##$OFFSET= 15.70392
##$PC= 1
##$PHC0= -21206.21
##$PHC1= 11.45272
##$PH_mod= 1
##$PKNL= yes
##$PPARMOD= 0
##$PSCAL= 0
##$PSIGN= 0
##$REVERSE= no
##$SF= 200.130013532006
##$SI= 16384
##$SIGF1= 3
##$SIGF2= 2
##$SINO= 400
##$SIOLD= 16384
##$SREGLST= <1H.CDCl3>
##$SSB= 0
##$STSI= 0
##$STSR= 0
##$SW_p= 3612.71676300578
##$SYMM= 0
##$S_DEV= 0
##$TDeff= 0
##$TDoff= 0
##$TI= <>
##$TILT= no
##$TM1= 0
##$TM2= 0
##$TOPLEV= 0
##$USERP1= <user>
##$USERP2= <user>
##$USERP3= <user>
##$USERP4= <user>
##$USERP5= <user>
##$WDW= 1
##$XDIM= 8192
##$YMAX_p= 0
##$YMIN_p= 0
$$ End of Bruker specific parameters
$$ ---------------------------------
##NTUPLES= NMR FID
##VAR_NAME=  TIME,          FID/REAL,        FID/IMAG
##SYMBOL=    X,             R,               I
##VAR_TYPE=  INDEPENDENT,   DEPENDENT,       DEPENDENT
##VAR_FORM=  AFFN,          ASDF,            ASDF
##VAR_DIM=   8192,          8192,            8192
##UNITS=     SECONDS,       ARBITRARY UNITS, ARBITRARY UNITS
##FACTOR=    0.0002768,     1,               1
##FIRST=     0,             0,               0
##LAST=      2.2672688,     0,               0
##MIN=       0,             -397056,         0
##MAX=       2.2672688,     356807,          0
$$ Real data points
##PAGE= N=1
##DATA TABLE= (X++(R..R)), XYDATA
$$ [...]
752A727m913L692K544n603J752L074m434J717L427n010K51M269l505m4L567l905
$$ 1727 -3186 506 3050 -2553 -801 2273 -2161 -444 2983 -2027 -1776 2493 -1012 -1056 2511 -1394
768a394m83M614k900j499M033l015j552N010k174l148M273j179l055M505o51m387
$$ -1394 -1877 2737 -163 -1662 2371 -644 -2196 2814 640 -2508 1765 586 -2469 2036 1385 -3002
784c002L802P67l842L152P21m371K799K085m028J735K000l977J615L071l876K91
$$ -3002 800 1567 -2275 877 1598 -2773 26 2111 -1917 -182 1818 -2159 -544 2527 -1349 -1058
800a058L084l247K58L487l213r13L610k230j137L484k139j962L643j144k072K857
$$ -1058 2026 -1221 -963 2524 -689 -1602 2008 -222 -1359 2125 -14 -1976 1667 523 -1549 1308
816A308r26k294K991j12k669K233L8k311K408L96k726J805Q19k479J883J102k965
$$ 1308 382 -1912 1079 967 -1702 531 569 -1742 666 1062 -1664 141 960 -1519 364 1466 -1499
833a499J117J794k433P95J930k699J48K466j843m72K053j706q12K414q97j336
$$ -1499 -382 1412 -1021 -226 1704 -995 -847 1619 -224 -696 1357 -349 -1161 1253 356 -980
849i80J695n93j354J849Q1j686J003K69j116J063M62j364L42P26p17M43M32r96
$$ -980 715 122 -1232 617 698 -988 15 284 -832 231 693 -671 -329 397 -320 123 555 -441
867d41J69Q22n39O0L42p13M6Q47l75l17K36l29%O92m18o14N12l4k07O10k41q48
$$ -441 -272 550 11 71 413 -300 -254 593 218 -99 137 -192 -192 500 82 -532 -20 -54 -261 349 108 -740
889g40N49N93n83J03L75q87K46J141o90n39O99l08k33J058l70j042O77M79n77
$$ -740 -191 402 -181 -78 297 -590 -344 797 107 -432 267 -41 -274 784 414 -628 49 528 -49
908d9L21M7r89N51P72o99q5J55o33N43Q00r14l44N52l68K02Q60r95m95J000o6
$$ -49 272 319 -670 -119 653 -46 -131 24 -609 -66 734 -180 -524 28 -340 -138 722 -273 -768 232 166
929A66j53O00q69m91J262L7p14M72m66m71J278J14j218K80K08m79R84J03j416
$$ 166 13 613 -256 -747 515 552 -162 310 -156 -627 651 765 -453 -173 35 -444 540 643 -773
948g73L17P60n31M76K74j562M09J482q34l88P49j017n3J782o66j253R16P7n00
$$ -773 -456 304 -227 249 523 -1039 -630 852 18 -370 379 -638 -691 1091 425 -828 88 165 -335
967c35J258m05j517R57Q48r42N10J16j503P56J440j110n50N79o87M34J208j127
$$ -335 923 518 -999 -42 806 -136 374 490 -1013 -257 1183 73 -477 102 -585 -151 1057 -70
985g0q66Q66m1J73Q71j295q45J442L00n15N31r50p14J760M15j255K51m27n00J889
$$ -70 -936 -70 -111 62 933 -362 -1207 235 535 20 551 -399 -1113 647 1062 -193 58 -369 -869 1020
1005A020K54k134L91P03r40J415O48k665J11K042p66j34Q33j783l40K358m26r38
$$ 1020 1274 -860 -469 234 -706 709 1357 -1308 -1197 845 79 -55 778 -1005 -1345 1013 587 -351
1023c51N27r45pK208q08j536R20j07k76J790q17j990J251Q60p03P49n80j604J468
$$ -351 176 -769 -776 1432 624 -912 8 -99 -375 1415 598 -1392 -141 719 16 765 185 -1419 49
1042D9J017j232K99j84j298J621J254k116k12Q82q04J051J070k114n83J625j11
$$ 49 1066 -166 133 -51 -1349 272 1526 -590 -802 80 -724 327 1397 -717 -1300 325 214
1059B14K01N24j798m50K197J2q34K73j076k48K147K9j540q5j46J96J675m36j978
$$ 214 415 939 -859 -1309 888 900 66 339 -737 -985 1162 1191 -349 -434 -580 -384 1291 855 -1123
1078a123K56R33k2R20m39j961M02J723k3l83m30r68N95J510j81r52m08j62Q69
$$ -1123 -867 66 44 964 525 -1436 -1034 689 666 283 -147 -1115 -520 990 809 -143 -551 -713 156
1097A56J096p14j220R7O41M47K54n97j089L61J061L50p05p39k35Q39P90m33r20
$$ 156 1252 538 -682 -585 56 503 757 160 -929 -568 493 843 138 -601 -836 3 793 360 -560
1116e60l8J64N92Q34p92j411P72J210m01o0k56j017O08J535m52j045j15q3P82
$$ -560 -598 -434 158 992 200 -1211 -439 771 370 310 54 -963 -355 1180 728 -317 -432 -515 267
1135B67R38j124q83M92O7P17P66j659j088J634L76l61N70j328r70K032P13j319
$$ 267 1205 81 -802 -310 -243 474 1240 -419 -1507 127 503 142 712 -616 -1586 446 1159 -160
1153a60J20l94p62K009P12k044j61P53m98J195N50k095j41J315l00N58J91k054
$$ -160 -40 -434 -1196 813 1525 -519 -680 73 -425 770 1320 -775 -916 399 99 657 848 -1206
1171a206L44J757o55k02L66j529L00K082r00j048O98o97L07J649j154j144J173
$$ -1206 -862 895 240 38 404 -1125 -825 1257 357 -691 7 -690 -383 1266 112 -1032 141
1188A41j87j89J398j152j303J613M15r21P55o03j062J478N98j232J96j30o18J467
$$ 141 -46 -235 1163 11 -1292 321 736 -185 570 -33 -1095 383 981 -251 -55 -185 -803 664
1206F64J54j591L81M05n62J215Q4j833M89J062n56N21M8j624P32J399r33k6L20
$$ 664 818 -773 -392 13 -549 666 750 -1083 -594 468 -88 433 481 -1143 -411 988 55 29 349
1225C49j347P36J723j407n95R70r77J88J747j264j216J347j97m00J257q26j327
$$ 349 -998 -262 1461 54 -541 429 -548 -360 1387 123 -1093 254 57 -343 914 88 -1239
1242a239J355L34o90O10l72j027J196N06r18L35q4o66R94M76j177K26L51n84O81
$$ -1239 116 450 -240 370 -2 -1029 167 673 -245 90 6 -660 334 810 -367 -141 210 -374 307
1261C07M36j162N9P14m03J52L47r13O7P84m10j22L74o91J37Q27m42l62L78k93
$$ 307 743 -419 -360 354 -49 103 450 -463 -396 388 -22 -144 230 -461 -324 503 61 -301 77 -216
1281b16L3O20l88l99M74j53N0M85n27l14N92j85j13M64m72m02P80r3m77M59k69
$$ -216 -183 437 49 -350 124 -29 21 506 -21 -335 257 72 -41 423 -49 -451 329 236 -241 218 -51
1302e1n47P53J67p02L50J59o44N67L89p96L8N47m20J08M90o44m9N60k31r4M34
$$ -51 -598 155 322 -380 -30 129 -515 52 441 -355 -317 230 -190 -82 408 -236 -285 275 44 -50 384
1323C84m52k30O08j44k18K15j32k54M26k2l33K33p5k95L93L5m31J92J54l06K36
$$ 384 -68 -298 310 166 -52 163 31 -223 203 181 -152 81 6 -289 104 139 -292 -100 54 -252 -16
1344a6J73l70K0L54k46N2K63l09q4M07j21r7J34j34p4J16L3Mmj63jK11j57j04
$$ -16 157 -213 -193 161 -85 -33 230 -79 -163 244 123 26 160 26 -48 68 101 105 101 -62 -63 148 -9 -113
1368a13K25j82j28K30O7k53J00ll4K01r9j42K10j44nL02j38l34L94jl13L26M0
$$ -113 112 -70 -198 32 99 -154 -54 -57 -91 110 11 -131 79 -65 -70 232 94 -240 154 153 -160 166 206
1391B06m52K64K61m08J54J69m84K15L38m51J06K47m62M4O06m77j82N31k99j84
$$ 206 -246 18 279 -129 25 194 -290 -75 263 -188 -82 165 -297 -253 353 -124 -306 225 -74 -258
1411b58N55j98m64M82K3l78L93Q8n31L02K40k51O7J33k56j5L13j78j72j2rJ58
$$ -258 297 99 -365 117 140 -238 155 243 -288 14 254 3 70 203 -53 -68 245 67 -105 -117 -126 32
1433C2M2j78N4r5o8K59J13l30J7J76p6K08o6k67J45J77k42K82J48o70J89O63n16
$$ 32 74 -104 -50 -145 -213 46 159 -171 -154 22 -54 154 88 -179 -34 143 -99 183 331 -339 -150 513 -3
1456cj12L41l88j19O83j65o00L23rk16N15n8o28K67K67j82J50J28o29J55M98j4
$$ -3 -115 226 -162 -281 402 237 -363 -40 -49 -265 250 192 -436 -169 98 -84 66 194 -435 -280 218 204
1478B04k31O1k08R0K94J08k31k66M9L67O7k74m4n3j26L89K43o38p2K91p0J17K15
$$ 204 -27 34 -174 -84 210 318 87 -179 -130 237 304 30 -14 -67 -193 196 439 -199 -271 20 -50 67 282
1501B82o03p5M80P1j38P9l28j78O95O9m74j4P4o7M20J29n64r5K61P9K32j20n18
$$ 282 -321 -396 84 155 17 96 -232 -410 285 354 -120 -134 -60 -127 293 422 -142 -237 24 103 335 215 -303
1524c03Q3L95n0J5j01m71J74O01j14l71l8j10K15M85k63l88P1P0J65M12l65n58
$$ -303 -220 175 125 140 39 -432 -258 343 229 -142 -180 -290 -75 410 147 -241 -170 -100 65 477 112 -446
1546d46L77L09o9J15k53m87M11M34l13K1k87k60O09K49m88j40J09k36M88K62o74
$$ -446 -69 240 171 286 33 -454 -43 391 78 99 -188 -448 161 410 -78 -218 -109 -345 143 405 -269
1567b69j78M99j24J33K61n47j55O14j20p8K70n45o9Q03j90n37L58j80j31O23j72
$$ -269 -447 52 -72 61 322 -225 -380 234 114 36 306 -239 -308 495 305 -232 126 -54 -185 438 266
1588B66o74L56R7j44M50k37o72N26K65l75K97j59n79N61M29n63R6J18m82M77N52
$$ 266 -408 -52 45 -99 351 114 -558 -32 233 -142 155 -4 -583 -22 407 -156 -60 58 -424 53 605
1609F05q20pM26l93K05O14p58l46Q19k53j14M03m92l73P66j08l34L58l81k38P01
$$ 605 -215 -222 204 -189 16 630 -128 -474 345 92 -22 381 -111 -484 282 174 -160 198 -183 -421 280
1630B80m9o25M16r8k45N16ko14L74J95l33M18k5n35L82J44l10L02p1m15M63K04
$$ 280 231 -394 22 -76 -321 195 193 -421 -47 148 -185 233 208 -327 55 199 -111 191 120 -295 168 372
1652C72o11J96K46m82L27L83o59r3N91l66l6M17n15p3N02k17p4J88k60j2M47j58
$$ 372 -239 -43 203 -279 48 431 -228 -321 270 -96 -132 285 -230 -303 199 -18 -92 96 -164 -176 271 113
1674A13k65L01j98q2M68j31m22L39o9o1K23j75k26K72Pk03J70j80r5L41p1k40
$$ 113 -152 149 -49 -131 337 206 -216 123 54 -7 216 41 -185 87 94 -109 61 -119 -214 127 56 -184
1696a84K00o3q5K25j9k06O7RK2K51j46l02L90o3j57K79k22k49M07J01l08J13k3
$$ -184 16 -47 -132 93 74 -132 -65 -56 -34 217 71 -231 159 96 -61 218 -4 -253 154 255 -53 60 37
1719C7k77M13Jl26J36ok18L61P9n49K73J89k78K52R1m51J86L24l03K02L5l99K04
$$ 37 -240 173 174 -152 -16 -22 -240 121 200 -349 -76 113 -165 87 178 -273 -87 237 -66 136 171 -228 -24
1742b4L60l73kK32l78J88L99m68m3K87k72P4L42n17m1M44k92r0M08l91j99O66
$$ -24 336 -37 -39 193 -185 3 402 -66 -109 178 -94 -20 322 -195 -236 208 -84 -174 234 -157 -356 310
1764C10j62m81M58j43l43N77J3m70K67N3k38M06q7m92M29M4l11L96n7n51M62K10
$$ 310 148 -333 125 -18 -361 216 229 -241 26 79 -159 247 160 -332 97 141 -170 226 169 -382 80 290
1786B90m69K03J73n98L51M13n93N6L45m60K22M48n50o9M78l52J4M16m47p5M85
$$ 290 -179 24 197 -401 -50 363 -230 -174 171 -289 -67 381 -169 -238 240 -112 -98 318 -129 -204 281
1807B81k05j76L24k56j35M30k30j76L06k06j72M82j63l77K44N2k49M10q6m62M10
$$ 281 76 -100 224 -32 -167 263 33 -143 163 -43 -215 267 104 -273 -29 23 -226 184 98 -364 46
1828D6R1l18L03j4l73K63K22l26J73R9k54M0L24k23j18J46j37L3J73j64p6J23
$$ 46 137 -181 122 108 -265 -2 220 -106 67 166 -88 -48 276 53 -65 81 -56 -23 150 -14 -90 33
1850C3o3l0J79j80j11K11p0j32K08j90k8J86j3n1M8rk4J49n2p6J50j19p1J71L5
$$ 33 -30 -60 119 -61 -172 39 -31 -163 45 -145 -173 13 0 -51 -3 -12 -36 113 61 -15 135 16 -55 116 151
1875A51j86M5O5o8N2oj16M9N9k7%J2o7n3J41j19M5j1l5m5R1M0j03J5J49m0j9K7
$$ 151 -35 10 75 7 59 53 -63 -14 45 18 18 30 -37 -90 51 -68 -23 -34 -69 -114 -23 17 -86 -71 78 38 19 46
1903D6l9o2Q5J06j77R6j0k7K8L0q4RJ5l9O2L6k24P0J15j23N7J22j58j7J66j08
$$ 46 7 -55 30 136 -41 55 45 18 46 76 -8 1 16 -23 39 75 -149 -79 36 -87 -30 92 -66 -83 83 -25
1929b5r3K18j01kJ43j54J0J12j50o3K87j47j64L11j08k47K43O8k94J87J12k62
$$ -25 -118 100 -1 -3 140 -14 -4 108 -42 -105 182 35 -129 182 74 -173 70 138 -156 31 143 -119
1951a19Q0J14j58J26L4k35J50J43k16J65J4k65J27K66k82M7J82k73R4K52k56n0
$$ -119 -39 75 -83 43 77 -158 -8 135 -81 84 98 -167 -40 226 -56 -9 173 -100 -6 246 -10 -60
1973f0K64k43n1L53l33j76M04j47j77L65k62k40M13o3j29J70j71j83M47n2k91
$$ -60 204 -39 -90 263 -70 -246 158 11 -166 199 -63 -303 110 47 -82 88 -83 -266 181 129 -162
1994a62K31n4k28M13K0n10K83J56k97K69J16m37J72J87k16J37L1m19K64L64m59
$$ -162 69 15 -213 200 220 -290 -7 149 -148 121 237 -200 -28 159 -57 80 111 -308 -44 320 -139
2015a39M3K67m23Q3M87m02j70L59k69P2L74l43k83M73o4q2K74l59k27N61l6k63
$$ -139 -96 171 -252 -169 318 -84 -254 105 -164 -92 282 -61 -344 129 65 -17 257 -102 -329 232 196 -67
2037f7K13j40k64M42O7l84J98j49j59M31J31n77J99J06k03L26k3m69J49L16j81
$$ -67 146 6 -258 184 251 -133 65 -84 -243 188 319 -258 -59 47 -156 170 147 -322 -173 143 -38
2058c8Q5R8m63K28L30k27NR1l06J15M76l55k47K91j74N2L75l02l27K56JM8K30
$$ -38 47 145 -318 -90 240 13 18 109 -197 -82 394 39 -208 83 -91 -39 336 34 -293 -37 -36 12 242
2081B42l69j92M40k4j58J77k20k99N53J71l81J0k1j14L34J47l50o8J01lK20J5
$$ 242 -127 -319 121 97 -61 116 -104 -403 150 321 -60 -50 -71 -185 149 296 -54 -122 -21 -24 196 211
2103B11m77J47K57j36J64o1l92J52L22p0j50Pk03J72L61l12j14P3j44J87M06m03
$$ 211 -266 -119 138 2 166 105 -287 -135 187 117 -33 -26 -229 -57 304 -8 -122 -49 -193 -6 400 -3
2125cl41L20P7L7Q3j66k48K96J58r5o0k03j9K95R1k58M9j38n5K88P8l50l7J01
$$ -3 -344 -24 53 90 173 7 -241 55 213 118 58 -145 -164 131 222 -36 13 -125 -180 108 186 -164 -201 -100
2149a00R8J57j48j92J6J65K7P3k2l51K00L40q4k41R0r7M5K35r1k98J09R1L7R6
$$ -100 -2 155 7 -185 -169 -4 23 96 74 -277 -77 263 179 -62 28 -69 -24 211 120 -178 -69 22 59 155
2173A55j19k25O5K13j3n4p9j78J66K86j20j93mL4O1J26o1j65p6J82K18j64j22
$$ 155 36 -189 -124 89 76 22 -57 -235 -69 217 97 -96 -100 -66 -5 121 60 -105 -181 1 219 55 -67
2196f7m0J02J12O0r8j96k2J48J57r2k31N4O9N8O7l6k26J4K57j4n0j05jJ08J21
$$ -67 -107 -5 107 167 69 -127 -149 -1 156 64 -167 -113 -44 14 81 45 -181 -167 90 76 26 -79 -80 28 149
2221A49j05k6q7k4J62K21k80j41J84m9M3J60k02k04J85Q8r1O8j40j41L00L1j55
$$ 149 44 18 -69 -93 69 290 10 -131 53 4 47 207 5 -199 -14 74 -17 51 -89 -230 70 101 -54
2244e4P2q2j26L03L2l28M4J75p0J03Q7k52L8J47rn4J00l04P9K90r3p3O6j18j7
$$ -54 18 -64 -190 113 145 -183 -139 36 -34 69 156 -96 -58 89 80 26 126 -178 -99 191 98 25 91 -27 -44
2269d4K03j02k07J88n8p5K65j69j14J18j8j20J88J4k47J82J51k06J8O5j80J95
$$ -44 159 57 -150 38 -20 -95 170 1 -113 5 -13 -133 55 69 -178 4 155 -51 -33 32 -148 47
2291D7Q2k08O1O6j14J22J60k47j46K67q9o8J81j24k67L89mj84O2M1k16K28Q3k83
$$ 47 129 -79 -18 48 -66 56 216 -31 -177 90 1 -67 114 -10 -277 112 108 -76 -14 27 -189 39 122 -161
2315a61J34R3j83J70J25l38J17K87l07J2K98l57l1L74j66k41L20j10j30K39j10
$$ -161 -27 66 -117 53 178 -160 -43 244 -63 -51 247 -110 -141 233 67 -174 146 36 -94 145 35
2336C5j84J97jj94K50j02j50K20J9k11J68j5j62J95R8k93J38J48k74J61J11k99
$$ 35 -149 48 47 -147 103 1 -149 71 90 -121 47 32 -130 65 163 -130 8 156 -118 43 154 -145
2358a45J44J99k09k3K38k85k3K99k61QK00k06j08K51q8k01K47m6j88L49j68j87
$$ -145 -1 198 -11 -34 204 -81 -104 195 -66 -58 142 -64 -172 79 -9 -210 37 -9 -197 152 -16 -203
2380b03L26q2j98K86jl70L33N0k50K31N2l86L00J26l43J54J40k75J66J22l60J42
$$ -203 123 41 -157 129 128 -242 91 141 -109 122 174 -212 88 214 -129 25 165 -110 56 178 -182 -40
2402d0J61k15J4K06k93J7L04k52n7L15k88K1K96k65o2K93k18r9L97k22k02L65
$$ -40 121 -94 -80 126 -167 -150 154 -98 -155 160 -128 -107 189 -76 -138 155 -63 -162 235 13 -189 176
2424A76j40j67L16j52j65K43rk84K11N3k56K15L9k56J73O1j74J05J35k43K0J97
$$ 176 36 -131 185 33 -132 111 102 -182 29 82 -174 41 80 -176 -3 58 -116 -11 124 -119 -99 98
2446I8j44RJ65j99LK07j45j3J54j79l2J73j01o4K42k24o2K56j00j47J87n4j76
$$ 98 -46 -37 128 -71 -68 139 -6 -19 135 -44 -76 97 -4 -68 174 -50 -112 144 44 -103 84 30 -146
2469a46J97Lj63J62m5q6J07J7j34J63Ok27J72O1k09J87P9j79N0Q2p7p8J29l1q6
$$ -146 51 54 -109 53 8 -78 29 46 -88 75 81 -146 26 87 -122 65 144 -35 15 97 20 -58 71 40 -46
2494d6P2l6k6N4K2j28Q3Mq6J21k3j22L7J36k9n3J04r9K4N0j2Jl6J1M4mo2K7M6
$$ -46 26 -10 -36 18 40 -88 -5 -1 -87 34 11 -111 -74 62 33 -20 84 -15 9 59 47 48 12 23 67 63 1 28 74
2523G4j13P1J29j35o9P3Rq2P0l4p8M4P2m9K5Nj33J78K8j72J08mq6Q5J93k45j5
$$ 74 -39 32 161 26 -43 30 39 -43 27 -7 -85 -41 31 -18 7 12 -121 57 85 -87 21 17 -69 16 209 -36 -51
2550e1J17m5K8J03j40j32K11J2j00M5o8j19K31l7j10R2j00p5K50jk33J5J04j28
$$ -51 66 21 49 152 12 -120 91 103 3 48 -20 -139 92 55 -55 37 -63 -138 112 111 -122 -107 -3 -131
2574a31K24K1k47M2J59p3O1Jj81J12K01j52p2P3j23R4J69j67r2J41j55N1K61k57
$$ -131 93 114 -133 -91 68 -5 56 57 -124 -12 189 37 -35 38 -85 9 178 11 -81 60 -95 -44 217 -40
2598d0j02J71kq6J79j71j38L10p3n9P5j55p4K69P0k60O1O2j64K32N2k87L6J72
$$ -40 -142 29 27 -59 120 -51 -189 121 48 -11 64 -91 -165 104 174 -86 -25 37 -127 105 157 -130 -94 78
2622G8n9Q1K2l19J17J60j45M0J23k66M2K88q8j65J11j67J01K57k02j30J38o5L
$$ 78 19 100 122 -197 -80 80 -65 -25 98 -168 -126 162 74 -91 20 -147 -46 211 9 -121 17 -48 -45
2645d5K95k42k13K32J07j10J53p8k97K54J12k06O3r8j37L25Q4l05O2L3j65K33
$$ -45 250 8 -205 27 134 24 177 99 -198 56 168 -38 25 -73 -210 115 199 -106 -44 -11 -176 57
2667E7J55l94L4J58q2J24O5k83J04J83j24J09M4k87M5L35j80j38J38j07n4L15
$$ 57 212 -182 -148 10 -72 52 117 -166 -62 121 -3 106 150 -137 -92 243 63 -75 63 -44 -98 217
2689B17j05k49J25j9m7K41j29l06K76K2j24J96p1l13K75J96k21K5N3j99J79J69
$$ 217 112 -137 -12 -31 -78 163 34 -272 4 26 -98 98 27 -286 -11 185 -36 -11 42 -157 22 191
2711A91k30q4J39r8J04K39l10j36K74q1rJ82j63k07K71J1k06J51r6j13K58O0k40
$$ 191 -39 -123 16 -82 22 261 -49 -185 89 8 -1 181 18 -189 82 93 -113 38 -58 -171 87 147 -93
2734i3J43l0j02J74j5k46J38J15j62J05P9k37J12J93k15pJ59j70kK65j97o8J43
$$ -93 50 20 -82 92 77 -169 -31 84 -78 27 106 -131 -19 174 -41 -48 111 -59 -61 204 7 -61 82
2757H2q1q5K48j95j76K51l3n6J58r2j80J73J22j98J13n6j47J96J26k05P4Q3k41
$$ 82 1 -84 164 -31 -207 44 11 -45 113 21 -159 14 136 -62 51 -5 -152 44 170 -35 39 122 -119
2780a19J39J98l42Q6J12j50N1J85k43m0K52j23j0J38j40j58K98p1j69J53j11o5
$$ -119 20 218 -124 -38 74 -76 -25 160 -83 -123 129 6 -4 134 -6 -164 134 63 -106 47 -64 -129
2802a29K41n8j44J26L4j38J33O8k30J31J16k09J15K9k28Q4J49j76J18L6j95J18
$$ -129 112 54 -90 36 70 -68 65 133 -97 34 150 -59 56 85 -143 -59 90 -86 32 68 -127 -9
2824iJ15j59k4J04o0OJ10j52LJ66o8q1J25j47p3K21j0r6P0j1q3R7K0j28N9Mk6
$$ -9 106 -53 -77 27 -33 -27 83 -69 -66 100 32 -49 76 -71 -144 77 67 -29 41 30 -53 44 64 -64 -5 -1 -27
2851b7O0O5j75L6Q6p2O3K5j31NQ1Ro7O7n9k6Q7K0q5Q7lr2L6M8r3N7Q9j15QR6j26
$$ -27 33 98 -77 -41 45 -27 36 61 -70 -65 16 25 -42 25 -34 -60 27 47 -38 49 46 -46 -10 38 -55 2 91 -24 -16 80 -46
2882d6j4R7n2k6N1l0n6R9J6j20Q1K7q9P7K9j01R3N4j14J7N1p3J4J04r7PR8j24
$$ -46 -60 37 -15 -41 10 -20 -76 23 39 -81 0 27 -62 15 44 -57 36 90 -24 -7 44 -29 -15 89 -8 -1 97 -27
2910b7J07L9j86N9J10j11r6J85p1j23K04j41j8J00k4j35J77j0j48K10o2k19K08
$$ -27 80 119 -67 -8 102 -9 -105 80 9 -114 90 -51 -69 31 7 -128 49 39 -109 101 39 -180 28
2933B8L8j59J14N3j25J41L5k33J06J18j92R3J63k42M0J42j94j0K46k35l8K09j72
$$ 28 66 -93 21 74 -51 90 125 -108 -2 116 -76 17 180 -62 -22 120 -74 -84 162 -73 -111 98 -74
2956g4o9K39j30p9K20j44r4K00q3j00K14o0j81K27k2j83J97M4k77J91N0k08K14
$$ -74 -143 96 -34 -113 107 -37 -131 69 -14 -114 100 40 -141 86 64 -119 78 122 -155 36 86 -122 92
2979I2pj97J33P5j79M3J48j84K2J58j85O7P5q7j5P6j05k3J69p8m0J69j25p0K18
$$ 92 85 -112 21 96 -83 -40 108 -76 -54 104 -81 -14 61 -26 -41 35 -70 -93 76 -2 -42 127 2 -68 150
3004A50r7j71J28L1j20J51K4k01J17M5j09R5L3p5j0M2q0O5qn3k5J15j02K2J00
$$ 150 53 -118 10 41 -79 72 96 -105 12 57 -52 43 76 1 -9 33 -47 18 10 -43 -68 47 -55 -33 67
3029F7j19J2J06m2q6J28n3k2Q0jj19O9J8p3J37j40o0J44k8o0K3J7o1P6J8l7l5
$$ 67 -52 -40 66 24 -62 66 13 -9 71 70 -49 20 38 -35 102 -38 -98 46 18 -42 -19 -2 -63 13 31 -6 -41
3056d1N6m6J3J04l6p9N9J3r5N5n4L7k1J16r2N2k7k5N0np2L6j2J7K9k8o1K1L9j6
$$ -41 15 -31 -18 86 50 -29 30 43 -52 3 -51 -14 -35 81 -11 41 14 -11 39 34 -38 -2 -14 3 32 4 -57 -36 3 -13
3086a3Om5M4pN2mjo4K2L6j8Nj3J8N6n1J7jK4p8N6j2l7K8j8m5Q5lq8O9ln7lQ0j13
$$ -13 -7 -52 -8 -15 37 33 32 -32 -10 26 8 13 0 18 74 23 40 39 63 -15 41 29 -8 20 2 -43 42 39 -49 20 17 -40 -43 37 -76
3121g6M8O9l9m8P7q7L4Q1o2l1J06n5j1Q9o6o2R8L4r4L0j1k0J5qo4O8j3n9O8k0
$$ -76 -28 41 2 -46 31 -56 -22 59 -3 -34 72 17 6 95 29 -33 65 99 5 35 24 4 19 11 -53 15 2 -57 11 -9
3151il4lL3k3Q1m7o5N0O0q0P4L3j40P2r%O7j23nJ14K7l7n9N9k0n1P9q2qN8k1J0
$$ -9 -43 -46 -13 -36 45 -2 -67 -17 43 -37 37 70 -70 2 -7 -7 60 -63 -68 46 73 36 -23 36 16 -35 44 -38 -46 12 -9 1
3183AK3j17M7J10j09j5J01l5j01J13mkQk9M3Q1o0o8Q7q9nJ07r2j8J2J9j3K1m9
$$ 1 24 -93 -46 64 -45 -60 41 6 -95 18 14 12 20 -9 34 115 55 -13 74 -15 -20 87 -5 -23 -11 8 -5 16 -33
3212c3o3O5O5n4Mk7k0O0K6o2J7K4o5R3N9j41N3%M7Km0q5M6P9Jj7J2l4J4M4p6J
$$ -33 -96 -31 34 -20 -16 -43 -63 -3 23 -39 -22 2 -63 30 89 -52 1 1 48 50 10 -75 -29 50 51 34 46 12 26 70 -6 -5
3244eJ9o1M8R2r5m2O7j06R7O8j13l7J19n9J7M1p2K8R2j04j6M5l5j0J09n7o3R4
$$ -5 14 -47 1 93 -2 -44 23 -83 14 82 -31 -68 51 -8 9 50 -22 6 98 -6 -22 23 -12 -22 87 30 -33 61
3272F1r8pJ14n8n6N4j4m2M9O1j30O3P0n5m4K2k3O2N9p4lJ1p4Q7L7kr3L9o7K8Q0
$$ 61 -37 -44 70 12 -44 10 -4 -46 3 64 -66 -3 67 12 -32 -10 -33 29 88 14 11 22 -52 35 72 70 -23 16 -51 -23 57
3303E7j18j7J03k2k5M5p4J5P5n8%Q8p2n3R8j7j22Q4L6n4L6J3q6P1L7r9J23j1r6
$$ 57 -61 -78 25 3 -22 23 -51 -36 39 -19 -19 69 -3 -56 42 25 -97 -13 23 -31 5 18 -68 3 40 -59 64 53 -43
3332d3lJ26q0OOqJ3mOm6P1q1l1Q8k8p6J06o0n2J01l3l4R4kq6Q9k0p6J21M8j78
$$ -43 -46 80 0 6 12 4 17 13 19 -27 44 -37 -68 20 -8 -84 22 -38 -90 11 -22 -56 38 36 -50 39 19 -57 64 112 -66
3363f6P8K8o3Q0J1j60N4J01p9M4Qo6L1K8q5L8K7k6o3J27n2k0O2q1J5J02j13MJ04
$$ -66 12 40 -23 57 68 -92 -38 63 -16 28 36 -30 1 29 -56 -18 9 -17 -80 47 -5 -25 37 -44 -29 73 -40 -36 68
3392F8l8k1N7m4p7J37o8n2N9J6q4N2j1p9J10j7k8N9J6j07O5M8j07N3L2p4lO4m4
$$ 68 30 9 66 22 -55 82 14 -38 21 37 -47 5 -6 -85 25 8 -20 39 55 -52 13 61 -46 7 39 -35 -38 26 -18
3421a8K6N9j22L7J13j24n8J52j56L1J04m3j8O8n9o3J36j7j31J08K1n2K0j2p5N8
$$ -18 8 67 -55 -18 95 -29 -87 65 -91 -60 44 1 -17 51 -8 -71 65 48 -83 25 46 -6 14 2 -73 -15
3447a5M5k7lj9%L7J3n9O0j3k3J1P2j35J06m8m7Q5l5m8P8m4l2L5m3JQ2l1k0p9R6
$$ -15 30 3 0 -19 -19 18 31 -28 32 19 -4 7 79 -56 50 2 -45 40 5 -43 35 -9 -41 -6 -49 -48 34 3 -17 -96 0
3478@n2M1K1l0kJ1%LM7n1k0N7Mj2Ml7m8Q9j0QK8m0l8P9p7m8R8o3N1J1pp1O5JN
$$ 0 -52 -11 10 -20 -22 -11 -11 -8 39 -12 -32 25 29 17 21 -16 -64 25 15 23 51 11 -27 52 -25 -73 25 -38 13 24 17 -54 11 12 17
3513A7L0o4LJ3J4J1%j1o3J16k3J1j0o1JQ1k8n8J3M7n0J5J3p1rJ02k4l4P4j8l0
$$ 17 47 -17 -14 -1 13 24 24 13 -50 66 43 54 44 -17 -16 65 37 -21 -8 39 -11 4 17 -54 -63 39 15 -19 55 37 7
3544Gm8O7m7J7l0mM0k1N3m3j8o1J04j3p8J00p9J2R0J2o6j6k6K0P0o9l0N0N5q0
$$ 7 -41 26 -21 -4 -34 -38 2 -19 34 -9 -27 -88 16 3 -75 25 -54 -42 48 60 -6 -22 -48 -28 42 -27 -57 -7 48 -32
3574c2N9jl7k6R4j01Q1k5l4J1O3m8Kl2ML0M7l1o5O1k1pkJ7j08J09Jm7M0l9m3N6
$$ -32 27 26 -11 -37 57 -44 37 12 -22 -11 52 4 6 -26 -22 8 55 24 -41 20 -1 -8 -10 7 -101 8 9 -38 2 -37 -80 -24
3606b4L2m9Q2m4l2Q6l2p0L4N2k6J9Ln4qR1o3L0mn7L9N3m9K5n3m7P5M5j7j13N8
$$ -24 8 -41 41 -3 -35 51 19 -51 -17 35 9 28 31 -23 -31 60 -3 27 23 -34 5 58 9 34 -19 -66 9 54 37 -76 -18
3637a8Mo2P8l8mOJ0Q3k0ro3M1N7q6P8j5p7J00n2jk8Q0p3M9N6r4n2L7PQ0m1r9k7
$$ -18 -14 -76 2 -36 -40 -34 -24 59 39 30 -33 8 65 -21 57 42 -35 65 13 12 -16 64 -9 40 96 2 -50 -13 -6 74 33 -66 -93
3670i3O2K8k7M7n9MN4L9r2M6l6j6R3k3k5k7O9k7Pj8m9qM7k2N5l0o9Q3L6l1l0K3
$$ -93 -31 -3 -30 17 -42 -38 16 55 -37 9 -27 -43 50 27 2 -25 44 17 24 6 -43 -51 -4 -26 29 -1 -70 13 49 18 -12 11
3702A1m0L6J5l0k3k2P2L2j5j6n0J00l3k3j5j6k6N6j4N0j23N9j9L1N6r3M7k8jL9
$$ 11 -29 7 22 -8 -31 -53 19 51 36 20 -30 70 37 14 -1 -17 -43 13 -1 49 -74 -15 -34 -3 53 -40 7 -21 -22 17
3732A7J3oj14O0N8r6J07j0j9%N1n6JPJ2j9J2k5J1j9M1j4o6P2m9P6l2j6J0j6k4
$$ 17 30 24 -90 -30 28 -68 39 29 10 10 61 5 6 13 25 6 18 -7 4 -15 26 12 -54 18 -31 45 13 -3 7 -9 -33
3763c3K3N2m6l3mNM0J2p4J0N5k8K7K9k9q7J50l2j09J12p7jJ07n3l4Oj1m4J27l6
$$ -33 -10 42 -4 -37 -41 -36 4 16 -58 -48 7 -21 6 35 6 -81 69 37 -72 40 -37 -38 69 16 -18 -12 -23 -67 60 24
3793B4n8L3J2p5P6J0q1O2k1PPj7OJ9Q3l6j11M4l7k1J52j04p4J35n4K7R6j26m4
$$ 24 -34 -1 11 -64 12 22 -59 3 -18 -11 -4 -21 -15 4 87 51 -60 -16 -53 -74 78 -26 -100 35 -19 8 104 -22 -66
3822f6R8j5m6Q0m9j18J71K9j45L0O1j66K44o1j32J04J5o4R7K5j78Q4O2q0LR7j12
$$ -66 32 17 -29 51 2 -116 55 84 -61 -31 30 -136 108 47 -85 19 34 -30 67 92 -86 -2 60 -20 -17 80 -32
3849c2J1R9j19K8N6j01j0J02p2l5Q7n3k6J51r0q0J44p9m6J72p6j6J0L3n1K7oj30
$$ -32 -21 78 -41 -13 43 -58 -68 34 -38 -73 14 -39 -65 86 -4 -84 60 -19 -65 107 31 15 25 58 7 34 28 -102
3877a02R0M7p8P6K3r9J5O9j08M7L7m3N2L8j41K2Q7o0K7jk6m1Q7j3JJ7m1OK6K6
$$ -102 -12 35 -43 33 56 -43 -28 41 -67 -20 17 -26 26 64 -77 -55 32 -28 -1 -2 -28 -69 18 5 6 23 -18 -12 14 40
3907D0p5R4ro6N7K6r0N0L3p4J3n8L8L2k5k6M1k3L1j3M3n2p1M8nk3R0qm5l5N8j2
$$ 40 -35 59 50 -16 41 67 -23 27 60 -14 -1 -59 -21 11 -14 -40 1 -22 9 -4 39 -13 -84 -36 -41 -64 26 18 -27 -62 -4 -16
3939a6L8q1O8mL7p7M7Jl3j8M4ll9P1M3r0NJ7l9L8k7J4K3M4j16J6L8k7MM2j2q8
$$ -16 22 -59 9 5 42 -35 12 13 -20 -38 6 3 -36 35 78 -12 -7 10 -29 9 -18 -4 19 63 -53 -37 1 -26 -22 20 8 -80
3971h0R2K1o2O4l1l7L1K3l2K1j4r9J42m6o4J00k1r2J27k3q7NJ22j46N3Q9j18Q6
$$ -80 12 33 -29 35 4 -33 -2 21 -11 10 -4 -103 39 -7 -71 29 8 -84 43 20 -67 -62 60 -86 -33 56 -62 24
3999B4O6r9k7K4o4R3K5L1n7P4j47N8R6j23K1L2l6j6L4kj3K1m9j8J14q9p9R7l2
$$ 24 90 -9 -36 -12 -76 17 42 73 16 90 -57 1 97 -26 -5 27 -9 -25 9 7 -6 15 -34 -52 62 -27 -106 -9 -41
4028d1NL5J6l5N2m7k4L3M9j67J13Q8j11M4Q4j05mM3l4JM8lq8Q7p0K9L5l4j9L7
$$ -41 -36 -1 15 -20 32 -15 -39 -6 43 -124 -11 77 -34 10 94 -11 -15 28 -6 -5 43 40 -48 39 -31 -2 33 -1 -20 17
4058A7n2L9J1j6q9J11j1p4K2P6r5L9N7o9L5K6n4Q6l0q8K6Q6o7K4mkk0M8l6o2J10
$$ 17 -35 4 15 -1 -90 21 10 -64 -42 34 -61 -22 35 -34 1 27 -27 59 29 -59 -33 53 -14 10 6 4 -16 32 -4 -66 44
4089D4m4l1N1Nj9k3L0m7M4M1o4K9P3j05L3k8Nj5L5N4p0oj9P8j3J4j09M8j0L1%
$$ 44 0 -31 20 25 6 -17 13 -34 10 51 -13 16 89 -16 17 -11 -6 -21 14 68 -2 -8 -27 51 38 52 -57 -9 -19 12 12
4120A2j8k8L1j1n9M1M9l8K4K9m6O2l1J8k8K4r0J05m7L0jk9m6N4K1k0Qj1L3r4M8
$$ 12 -6 -34 -3 -14 -73 -32 17 -21 3 32 -14 48 17 35 7 31 -59 46 -1 29 28 -1 -47 7 28 8 16 5 38 -56 -8
4151hM8j24Q4j4j9M7k2l8M2K1m7N8L8q3%J4j0M5Kl2m2P7k3j1%nL6j0Ql7Mj7M2
$$ -8 40 -84 0 -14 -33 14 -8 -46 -4 17 -30 28 66 -17 -17 -3 -13 32 34 2 -40 37 14 3 3 -2 34 24 32 -5 -1 -18 24
4184B4mJ5n7l7M2K2ok%m2P2L6n6kj4jL3k6n2O4oL7k7L7m8k4K5j9M3J6q4M6j5k4
$$ 24 20 35 -22 -59 -17 5 -1 -3 -3 -45 27 63 7 5 -9 -10 23 -3 -55 9 3 40 13 50 2 -22 3 -16 27 43 -41 5 -10 -34
4218c4J5ml7M1L4PLJ2n6K9K6o1l1R8j6k9K1n0K9K4n9M5q1O3k7qQ7k3o3O7l5k9
$$ -34 -19 -23 -60 -19 15 22 25 37 -19 10 36 -25 -56 42 26 -3 18 -32 -3 21 -38 7 -74 -11 -38 -46 41 18 -45 22 -13 -42
4250d2P4o1N0j2l4L7J0m4k5K2K9k9L3O%m0L6k9L8j0j9J5kj6k4M4k4mK3m1K3K4
$$ -42 32 -29 21 9 -25 12 22 -22 -47 -25 4 -25 8 14 14 -26 10 -19 19 9 -10 5 3 -13 -37 7 -17 -21 2 -39 -16 8
4282Hr0Q8Op7M2P8p2NJ7o3O4K0Mq2J02pl1M5j4k5n1M4oK2m1m9J14n3K3n7N8nn3
$$ 8 -82 6 12 -65 -23 55 -17 -12 5 -58 6 26 30 -52 50 43 12 57 43 18 -33 11 5 27 -14 -63 51 -2 21 -36 22 17 -36
4315c6M2k7k5Pl8J04Ml5l0M3L5n1lj1PK1J2L4p2m4J05J3r8J8L9K0n9J7M1n6K4
$$ -36 6 -21 -46 -39 -77 27 31 -4 -34 9 44 -7 -10 -21 -14 7 19 53 -19 -63 42 55 -43 -25 14 34 -25 -8 33 -23 1
4346AlM2n9QLlj7M5k3N1q6j2O4k3L1l3k2J0N8l0K5k3K5j9N5o1jPj1mn9K3M6k0
$$ 1 -2 40 -19 -11 -8 -11 -28 17 -6 45 -41 -53 11 -12 19 -14 -36 -26 32 2 27 4 29 10 65 4 3 10 -1 -5 -64 -41 5 -15
4380a5j8Rl0N8m2K6Pj6RJ5J6j5OM3j8j5L2o3K8L1om8Qqj3K5K4q6M0K5m5L7M3k2
$$ -15 -33 -24 -54 4 -38 -12 -5 -21 -12 3 19 4 10 53 35 20 52 -11 17 48 42 -6 2 -6 -19 6 30 -56 -16 9 -36 1 44 22
4414B2l6%%m6Q7J8k8J1m2J6jL7n5N1l2L6%ln3J5K3l3M1n7L4k4L0j26J36K1o7R
$$ 22 -14 -14 -14 -60 27 45 17 28 -14 2 1 38 -17 34 2 38 38 35 -18 -3 20 -13 28 -29 5 -19 11 -115 21 42 -25 -16
4446a6N0p2O2l2o6R4m3N3p2L2l2K6N9o1M8Ko5J4L8k4n3R4o3K6O7p3J8J6o5J3R2
$$ -16 34 -38 24 -8 -74 20 -23 30 -42 -10 -42 -16 43 -18 30 32 -33 -19 19 -5 -58 36 -27 -1 66 -7 11 27 -38 -25 67
4477F7o5m8K8J1j1M3n1n4N8L0k7M5n3LLL5ok4Q4j08J5J06r8K6M7k6j00N7L9j3
$$ 67 2 -46 -18 -7 -18 25 -26 -80 -22 8 -19 26 -27 -24 -21 14 8 -16 68 -40 -25 81 -17 9 56 30 -70 -13 26 13
4507A3J5k7k3L2j3lk1J1N0l0J3q4J40q0k0K1K1jrKl0l4P5k7l2O8q2J9M2j0n0K5
$$ 13 28 1 -22 10 -3 -6 -27 -16 34 4 17 -67 73 -7 -27 -6 15 14 5 7 -23 -57 18 -9 -41 27 -55 -36 6 -4 -54 -29
4539b9k2lJ7M9pj1J2l9O4k5k2K7j4l2P0K4rq0N0J1L3l2j8J9J2M0o1J6r7M3M3J2
$$ -29 -51 -54 -37 12 5 -6 6 -33 31 6 -16 11 -3 -35 35 59 50 -30 20 31 64 32 14 33 45 85 24 40 -57 -14 29 41
4571D1k0k4J4p3M3Kk7L9KL9l3M4q5L7K3n1M1J7m3K7Pk2L1J3mj02J09p0L0rJ1j2
$$ 41 21 -3 11 -62 -19 -17 -44 -5 -3 36 3 47 -38 -1 22 -29 12 29 -14 13 20 -2 29 42 38 -64 45 -25 5 -4 7 -5
4603eRJ2Nl0K3r0Q5M1o3k6N0L0q9R2k8K8n4K2JJ8l4j2j9M5J1On7M3k6M1ll6Pp9
$$ -5 4 16 21 -9 14 -76 9 50 -13 -39 11 41 -48 44 16 44 -10 12 13 31 -3 -15 -34 11 22 28 -29 14 -12 29 26 -10 -3 -82
4637h2O9lJ8J3j5lLL3q6K8J6Nj3O7o8n5J39j19M5j5L6L8l9j8k6L7j1L1n1l7K7
$$ -82 -13 -16 2 15 0 -3 0 33 -53 -25 -9 -4 -17 50 -18 -73 66 -53 -8 -23 13 51 12 -6 -32 5 -6 25 -26 -63 -36
4668c6J0jn0R3jl5j3L3l3L1L6p2M0O6p7m6M6m6J3M7JRk6N6j9Mj3MM4p6j4j3Kn
$$ -36 -26 -27 -77 16 15 -20 -33 0 -33 -2 34 -38 2 68 -9 -55 -9 -55 -42 5 6 15 -11 45 26 30 17 21 65 -11 -25 -38 -36 -41
4702d1R8o5n6N0L7m1L9lo4JM1l9mO5L2r0N5m0J7R7q9J6oJ8Lom7QP2m1q1Q2qm2
$$ -41 57 -8 -64 -14 23 -18 21 18 -46 -45 -4 -43 -47 18 50 -40 15 -25 -8 89 0 16 10 28 31 25 -22 -14 58 17 -64 18 10 -32
4736c2JK5j2L6j9j4j4L8o8Q1kl9J3K2o4O2RqJ8m8N3pk8n0K3J5k1M2J1j8K1l9R
$$ -32 -31 -6 -18 18 -1 -15 -29 9 -59 22 20 -19 -6 16 -48 14 23 15 33 -15 38 31 3 -47 -24 -9 -30 12 23 5 26 -13 -4
4769dRl7PN9l7J4J6m5J2j4pO5rk2K5j5jJ4n4j9J6L0j0K2J5o9L9k1L5o1J8n2R2
$$ -4 5 -32 -25 34 -3 11 27 -18 -6 -20 -27 38 29 7 32 17 16 30 -24 -43 -27 3 -7 15 30 -39 0 -21 14 -47 -29 -81 11
4802A1L2p5L2K5m5NQk4P5Kn4jP7l8k7L5m5K3kj9l3j7J04r8j7N0qL0%o7Q7l6k2
$$ 11 43 -32 0 25 -20 -15 -7 -31 44 46 -8 -9 68 30 3 38 -7 16 14 -5 -38 -55 49 -49 -66 -16 -24 6 6 -61 26 -10 -32
4835c2pO7k8k9J04r5J3qOK3M2p4J0O6m2pk6O3o3M0M2q4m7P4k0L6L9q7l1K2J9r1
$$ -32 -39 28 0 -29 75 -20 -7 -15 -9 14 56 -18 -8 58 16 9 -17 46 -17 23 65 -19 -66 8 -12 24 63 -24 -55 -33 -14 -105
4867a05J22rm2O1n7K6lJ0MK8K7p8L9k8j8K6N0o7N2o5KP7j3mk7N1m8L3j9n0K8L7
$$ -105 17 8 -34 27 -30 -4 -7 3 7 35 62 -16 23 -5 -23 3 53 -14 38 -27 -25 52 39 35 8 59 11 44 25 -25 3 40
4899D0j14Q2K4j09P9N5j49P3K8j4j3O6o2L4J3o3K8K1j9l4R3o1M3m0K9j20J26%
$$ 40 -74 8 32 -77 2 57 -92 -19 9 -5 -18 48 -14 20 33 -30 -2 19 0 -34 59 -2 41 1 30 -90 36 36
4927C6q1R8m3n2O1k6l3J0L4m8O4Oj09R6k2Oj4P9r3N2Kl4L6J3m5j1P7j26P6j8J3
$$ 36 -45 53 10 -42 19 -7 -40 -30 4 -44 20 26 -83 13 -9 -3 -17 62 -31 21 23 -11 25 38 -7 -18 59 -67 9 -9 4
4958Dp0M9j4j1M6j2KpK3j6K6jk7P6l1n5N7Lo4P8l0n3J7K1M9o5N0m0M6l5k8k7P8
$$ 4 -66 -17 -31 -42 4 -8 -6 -13 10 -6 20 19 -8 68 37 -18 39 42 -22 56 26 -27 -10 11 60 -5 45 5 51 16 -12 -39 39
4991C9l0j9J2l6N1Jo8R8q5%M4Mk2j3N7l6l2J8l9N8K0l5Np4J10o0KJ7k0N2rJ2K0
$$ 39 9 -10 2 -34 17 18 -50 48 -37 -37 7 11 -11 -24 33 -3 -35 -17 -56 2 22 -13 -8 -82 28 -32 -30 -13 -33 19 10 22 42
5024D2m9l3J8J6L9J3l1rqOl2M8K3m5oJ9l5j7oM7pN8o1J0l4K0Nk7N3j8ln4L0QM8
$$ 42 -7 -40 -22 -6 33 46 15 6 -2 4 -28 20 43 -2 -8 11 -24 -41 -47 0 -7 51 -10 0 -34 -14 -9 -36 17 -1 -4 -58 -28 -20 28
5059B8m1J9K1l3oK5rJ0Pm8J5j0M6m4J9k2KKJ5rpN6n2j2M7j14R1ml5L7K9n6loK7
$$ 28 -13 6 27 -6 -12 13 4 14 21 -27 -12 -22 24 -20 -1 -23 -21 -19 -4 -13 -20 36 -16 -28 19 -95 -4 -8 -43 -6 23 -33 -36 -42 -15
5094a5jM6j8j8P6q5jpj9O2l2%K7L6p1JL5l1M7r8J01l6k6J5N8j29O1Lk2L5j2K8
$$ -15 -16 30 12 -6 70 -15 -16 -23 -42 20 -12 -12 15 51 -20 -19 16 -15 32 -66 35 -1 -27 -12 46 -83 -22 -19 -41 -6 -18 10
5126A0K6k3j0M3p3J7LNn7O7j1nM8m4k7M9J0n8N4j4m1O3Jq6J04n7KQL2m4koM1n8
$$ 10 36 13 3 46 -27 -10 -7 -2 -59 8 -3 -8 40 -4 -31 18 28 -30 24 10 -31 32 33 -53 51 -6 -4 4 36 -8 -10 -16 25 -33
5160c3N8n2O0K2m2Kn4J7J2rRnP1n3j04N2J09p7NO1r1L4j1n1Q9Kl7OM9q3K5K4l7
$$ -33 25 -27 33 55 13 15 -39 -22 -10 -19 -10 -15 56 3 -101 -49 60 -17 -12 49 -42 -8 -19 -70 19 21 -16 -10 39 -44 -19 5 -32
5193c2nP2m0%jjJ3K6n5K0k0k1J09n9n1K7L3om5N6l0l7J1K4l9O0ll6Q7p8l5N5J9
$$ -32 -37 35 -5 -5 -6 -7 6 32 -23 -3 -23 -44 65 6 -45 -18 15 9 -36 20 -10 -47 -36 -12 -51 9 6 -30 57 -21 -56 -1 18
5226A8m7L2lKPqN2n6N0j8r0Q7J5m3K7n6J9M0m4m4O6Oo8O6m0L0j4K3o4N6j2m2L6
$$ 18 -29 3 0 2 9 1 53 -3 47 29 -61 26 41 -2 25 -31 -12 28 -16 -60 6 12 -56 10 -30 0 -14 9 -55 1 -11 -53 -17
5259a7jj5j3K9Pm8R9l1j0Q3p2K1j9o9P7k0%qN1n6k4Q0m9j6N5o9qO9p1RQ4k4q9
$$ -17 -18 -33 -46 -17 -10 -58 41 10 0 83 11 32 13 -56 21 1 1 -7 44 -12 -36 44 -5 -21 34 -35 -43 26 -45 -36 48 24 -65
5292f5R6k2NO4n3m3j4J4m0Q1m1K2K0k7nkj6K8j7J0l1N8ml3M4Oj1o1K9mk0P0rn4
$$ -65 31 9 14 78 25 -18 -32 -18 -58 23 -18 4 24 -3 -8 -10 -26 2 -15 -5 -36 22 18 -15 29 35 24 -37 -8 -12 -32 38 29 -25
5326b5J14j7j15P1kl2O2n2ol0N9p0O2j1m7M5L5j7K2p0OJ5J5r7R3K5k9m1M6j8m
$$ -25 89 72 -43 28 26 -6 56 4 -2 -32 27 -43 19 8 -39 6 41 24 46 -24 -18 -3 12 -85 8 33 4 -37 9 -9 -13
5357a3N7m5l8O3j7m4N5l8J6pM9k4L5p3J6L7k7j3K9L3j32Q2k5j8N5k9m0K4N8k8
$$ -13 44 -1 -39 24 7 -37 18 -20 -4 -11 38 14 49 -24 -8 29 2 -11 18 51 -81 1 -24 -42 13 -16 -56 -32 26 -2
5387bN2n6%K9P5j22J7L4l9L0j6l0K4L7K8m3Q5j32OJ0RN3m3M9r4N1l6j7L8K9m2
$$ -2 50 -6 -6 23 98 -24 -7 27 -12 18 2 -28 -4 33 61 18 103 -29 -23 -13 -4 49 6 55 -39 12 -24 -41 -3 26 -16
5418a6J8L9q5nQ9l7M9n8K9q1Q9k0o9N8k3J7K6QQm9J1qo5J11p2L3J9o2M2N6o2k9
$$ -16 2 41 -44 -49 40 3 52 -6 23 -58 31 11 -58 0 -23 -6 20 28 36 -13 -2 -10 -75 36 -36 -3 16 -46 -4 52 -10 -39
5450c9M4Kj9j2rM4L9k4nn8L2M8K3j07K4L3k2k5P1n8k3K1K9m5N2n2nK8MMJ7M3q3
$$ -39 5 7 -12 -24 -33 11 50 26 21 -37 -5 43 66 -41 -17 16 -6 -31 40 -18 -41 -20 9 -36 16 -36 -41 -13 -9 -5 12 55 -28
5483b8M4n2O2j7L6m6J8nK0J5K9q3L5m1M1p8Q5n1l8O6%lK2k5k4J5oo7M0J7J7J4
$$ -28 16 -36 26 9 45 -1 17 12 32 47 76 -7 28 -13 28 -50 35 -16 -54 12 12 9 31 6 -18 -3 -9 -76 -36 -19 -2 12
5515A2Qo8QJ6jM5Lo7M6M7p7K5L5m1J8M2r5K8N4k9m9P0j6Pk3j2j1M1K3n4M3j6n6
$$ 12 20 -48 -40 -24 -25 20 23 -44 2 49 -28 -3 32 -9 9 51 -44 -16 38 9 -40 30 14 21 -2 -14 -25 16 39 -15 28 12 -44
5548d4K8K0l4N3l6KrQ5j00J9M6o6M4J9p8L4N6l2m1K8K0n2NO5l9jp0L4Q7r5L2K8
$$ -44 -16 4 -30 23 -13 -11 -20 65 -35 -16 30 -36 8 27 -51 -17 39 7 -34 -6 14 -38 -33 32 -7 -8 -78 -44 43 -52 -20 8
5580HL5l2%L7n7J2K8k5pM8Nm7J8Pk7l9L3j2O9j00P8k5l7nQ3l7j8L3pPom1K6K8
$$ 8 43 11 11 48 -9 3 31 6 -1 47 52 5 23 30 3 -36 -3 -15 54 -46 32 7 -30 -35 48 11 -7 26 19 26 20 -21 5 33
5614C3l7OM0qo1K0N5m2L0Qm0J3k0j4J5KnL0Kk6mL1m8nN2o0K4M4l6Qj0k2k4O0K7
$$ 33 -4 2 42 34 -27 -7 48 6 36 44 4 17 -3 -17 -2 0 -5 25 27 1 -3 28 -20 -25 27 -33 -9 35 -1 7 -3 -25 -49 11 38
5649C8k8M5l2m2K4L%NJ5k4K2j5KqJ4o7L6Q3l0k7m1L8J5m8L1%mK2l6J0L8n4M9o
$$ 38 10 55 23 -19 5 8 8 13 28 4 26 11 13 5 19 -48 -12 71 41 14 -27 11 26 -22 9 9 5 27 -9 1 39 -15 34 28
5683B8l8k5J2LP0k2J7j5mp2M3L5r2K3J42j17M3o0OP3l7k9K3K0k6oQL8rn4L5j9
$$ 28 -10 -35 -23 -20 50 28 45 30 26 -46 -3 32 -60 -37 105 -12 31 -29 -23 50 13 -16 7 27 1 -5 3 41 32 -22 13 -6
5715fL3o9P4j2o8k9J13n7j9L8LOOj6n1K8%%N0n0L0mNj1oM4j2k4J4Qj5K5k8K5K
$$ -6 27 -42 32 20 -48 -77 36 -21 -40 -2 1 7 13 -3 -54 -26 -26 -26 24 -26 4 0 5 -6 -12 32 20 -4 10 18 3 28 0 25 27
5750B7K5q3%L7L0K6m5K1j5l8K1J5m2OK2l0K1L4j1OK7j00M2K8J5n%o2K6j8N0nJ3
$$ 27 52 -31 -31 6 36 62 17 38 23 -15 6 21 -21 -15 7 -23 -2 32 21 27 54 -46 -4 24 39 34 34 -28 -2 -20 30 25 38
5783C8m4K0j2L9n7K4k8L5j4JJ3J8L9n6l4K1kJ7K0K8j2Rl4ln5J1L7k1L6l6J8K6
$$ 38 -6 14 2 41 -16 8 -20 15 1 2 15 33 72 16 -18 3 1 18 38 66 54 63 29 26 -29 -18 19 -2 34 -2 16 42
5815D2n6J6PJ3m9J7L0p5Q2q3Q7n0L1rK2l8J1j5K0K6nj6J0j1L7m2kLk8J3Rl6KL8
$$ 42 -14 2 9 22 -27 -10 20 -55 27 -56 31 -19 12 3 25 -13 -2 -17 3 29 24 8 18 7 44 2 0 3 -25 -12 -3 -39 -37 1
5849Am1R6n0n6L7Q5q9qJ7M8n8K6jl6M6m6L4M8p9M7m7N9o0K7M1l9L6j2pmN4q2P2
$$ 1 -40 56 6 -50 -13 72 -17 -25 -8 40 -18 8 7 -29 17 -29 5 53 -26 21 -26 33 -27 0 41 2 38 26 19 15 69 -13 59
5882E9j4k6KK0o9KO1j9K3l2K0J6J2p4k3J2PJ3MPl0M0L5q1J2L7kl9M9N1n0L2p6
$$ 59 45 19 21 41 -28 -26 35 16 39 7 27 43 55 -19 -42 -30 -23 -10 -6 1 -29 11 46 -35 -23 14 12 -27 22 73 23 55 -21
5915b1N6j0kk6M1l4K1k7n9J02n5K9k1%lQj5K1Oj2l0RJ4L0n8M5Rk8M0P2j12K4k2
$$ -21 35 25 23 -3 38 4 25 -2 -61 41 -14 15 -6 -6 -9 -1 -16 5 11 -1 -31 -22 -8 22 -36 9 18 -10 30 102 -10 14 -8
5948h%oJ3l2K0O5o6KN1m0%j7K4M2l3p1K9N3m1k0L4m1P5J5m4%K2o4mJ04q3j4K7
$$ -8 -8 -14 -1 -33 -13 52 -14 -12 39 -1 -1 -18 6 48 15 -56 -27 26 -15 -35 -1 -42 33 48 4 4 26 -38 -42 62 -21 -35 -8
5981hO0n8j1jj3M0J6m7QL4l4R4j10L5j6O5k0K9j8q9N2K2j5J5k6k4l9O5Rlj1L8
$$ -8 52 -6 -17 -18 -31 9 25 -22 -14 20 -14 80 -30 5 -11 54 34 63 45 -44 8 30 15 30 4 -20 -59 6 15 12 1 39
6013C9l8k9J4KMlJ2J8qk2J9k2m1j7O7k6N5k3K5m6J1k5Q1J7Rq8L2k7J8P7o7m6M0
$$ 39 1 -28 -14 -12 -8 -11 1 19 11 -11 8 -14 -55 -72 -5 -31 24 1 26 -20 -9 -34 47 64 73 -15 17 -10 8 85 18 -28 12
6046A2l4L1O4r7P6p4LK7L7m7k1N1j2l4K9np6K0MN4rJ4j1K4l9QlKjk7J4MN4J6m9
$$ 12 -22 9 73 -24 52 -22 -19 8 45 -2 -23 28 16 -18 11 6 -70 -50 -46 8 -1 13 2 26 -13 -5 -8 -6 -7 -34 -20 -16 38 54 5
6081EK1k0oJ7m5M3M5p2j2K2l6N0l0O4l2j3j8loN4o7J9N8l3%k6N9K1o1J1K9o4K8
$$ 5 26 6 0 17 -28 15 60 -12 -24 -2 -38 12 -18 46 14 1 -17 -20 -26 28 -39 -20 38 5 5 -21 38 59 -2 9 38 -26 2
6114BJ9oj0NJ1r4O0P1n2L1j1n5N3Kl9L6rJL2l3kM0n7O0K8q7K2N4p0k4M8k1k9K9
$$ 2 21 15 5 10 21 -73 -13 58 6 37 26 -29 24 26 -13 23 14 15 47 14 12 52 -5 55 83 -4 18 72 2 -22 26 5 -24 5
6148EKrrkj7k9M1k1qN5n5K6j2J3P2J6q0j9R7r2lJ4N5n6K7k3kK0k4M4j9J3j6M9
$$ 5 7 -2 -11 -13 -30 -59 -18 -39 -47 8 -47 -21 -33 -20 52 68 -12 -31 66 -26 -29 -15 40 -16 11 -12 -14 6 -18 26 7 20 4 53
6182E3m0j9j4L8mPk1qK3pm4R0n6k9JJ7Nl4N2o0Q6J3n9oR1n3l7O5Pj21Q9k2k2L2
$$ 53 13 -6 -20 18 14 21 0 -8 15 8 -36 54 -2 -31 -30 -13 -8 -42 10 -50 36 49 -10 -16 75 22 -15 50 57 -64 25 3 -19 13
6216A3j5J5k8k4J4Q9o5j5j1K3K9l5N1l6k5L0m4M8l9J3K0k5L6l8J1L0k4m4KM0J5
$$ 13 -2 13 -15 -39 -25 64 -1 -16 -27 -4 25 -10 41 5 -20 10 -34 14 -25 -12 8 -17 19 -19 -8 22 -2 -46 -44 -4 11
6247A1o2L5L9p2L7Pm6J1P2p2K0L8j6k5M8j1rK5pk1J5nj3%PJ9Kk7J9j9K9o4k5P3
$$ 11 -51 -16 23 -49 -12 -5 -51 -40 32 -40 -20 18 2 -23 25 14 5 30 23 2 17 12 -1 -1 6 25 27 0 19 0 29 -35 -60 13
6281A3l0j7pl1K1K2N9n8K6Oj8N5l2qM6n8K7nL8n7m2P9o7P3m4J4M1m6k5K5lPjL7
$$ 13 -17 -34 -41 -72 -51 -29 30 -28 -2 4 -14 41 9 1 47 -11 16 11 49 -8 -50 29 -38 35 -9 5 46 0 -25 0 -3 4 3 40
6315D0k0Rl5k0J4RO6j06J0L2m2M7j1K8k0JK2J0n8L5j2LJ7l6K7l2K2j1j6L4L2j6
$$ 40 20 29 -6 -26 -12 -3 63 -43 -33 -1 -43 4 -7 21 1 2 24 34 -24 11 -1 2 19 -17 10 -22 0 -11 -27 7 39 23
6347B3m8pN9o6J38p5l4K6k3J4Mrj8M1j3p0L7l5L9PJ3k6K8K0j3l0j6M3M7n4l9J1
$$ 23 -25 -32 27 -39 99 24 -10 16 -7 7 11 2 -16 25 12 -58 -21 -56 -17 -10 3 -23 5 25 12 -18 -34 9 56 2 -37 -26
6379b6M3KJ9m6RL2Ol5j8O1l3o5M9l5K9jn9M6R2m6j4LJ1k2M0q8N8n6L5M0l8OOn2
$$ -26 17 19 38 -8 1 33 39 4 -14 47 14 -51 -2 -37 -8 -9 -68 -22 70 24 10 13 24 2 42 -46 12 -44 -9 31 -7 -1 5 -47
6413d7L2J0J2j8l8RO2Qj7J2p8O2mL0l9O0Rl1j1l0j4K5K3n8K6M8m3pL6l9K8m9k3
$$ -47 -15 -5 7 -11 -49 -40 22 30 13 25 -53 9 5 35 -4 56 65 34 23 -7 -21 4 27 -31 -5 43 0 -7 29 -10 18 -31 -54
6446e4NR8n8pN9k8j6Pjk5j0J5QN5r2J8R3m1qL6p9k2N3N%m8L6j2O2m0j9J6J8j2
$$ -54 -49 49 -9 -16 43 15 -1 6 5 -20 -30 -15 -7 48 -44 -26 67 26 18 54 -25 -47 6 11 11 -37 -1 -13 49 9 -10 6 24 12
6480A2m5N1q4O1J2j3K2mqn6R0p2L3J0kJ9m8K1O9n5j6KJ6n1M8%pMk2NJ5j0Jok7
$$ 12 -33 18 -66 -5 7 -6 16 12 4 -52 38 -34 -1 9 7 26 -22 -1 68 13 -3 -1 15 -36 12 12 5 9 -13 -8 7 -3 -2 -8 -35
6515c5M7mkN3p0J37j58N3m4N2k2nK5n2M4Lj8K6Mm5m1J2L9m4L6J1L0o6K8l8k1N0
$$ -35 12 8 6 59 -11 126 -32 21 -23 29 7 2 27 -25 19 22 4 30 34 -11 -52 -40 -1 -45 -9 2 32 -34 -6 -44 -65 -15
6547a5L2q3L6L7K0m0PNL1m5K5J3qJ3m0lK5rkJ9J3j2n6qN8l4L4q7M8J5ok0L3l3
$$ -15 17 -66 -30 7 27 -13 -6 -1 30 -15 10 23 15 28 -12 -15 10 1 -1 18 31 19 -37 -45 13 -21 13 -74 -26 -11 -17 -37 -4 -37
6581c7N0Mm1%N7k4k2j5J20p3j4Mm3N1Ml2k1N4k9j8M6l4QL9l7KL9m3j3L4j0m9R9
$$ -37 13 17 -24 -24 33 9 -13 -28 92 19 5 9 -34 17 21 -11 -32 22 -7 -25 21 -13 -5 34 -3 -1 38 -5 -18 16 6 -43 56
6614E6l4k3M2j7l7J0L5ok2MM2m6L1l9n7J15m0L8o8J2J5O2j33R8%r5O7j5j3M0L4
$$ 56 22 -1 41 24 -13 -3 32 26 4 8 50 4 35 -4 -61 54 14 52 -16 -4 11 73 -60 38 38 -57 10 -5 -18 22 56
6645E6n9M3m5K6m3j1P4n2L1j7m2O9j7p0L1J9j5L8k5J5M6q2J8J2ql9P3j1Pm4L5
$$ 56 -3 40 -5 21 -22 -33 41 -11 20 3 -39 30 13 -57 -26 -7 -22 16 -9 6 52 -30 -12 0 -8 -47 26 15 22 -22 13
6676A3j7l7L7j2M7ok5l6kN7J6k6j8J8JL3L9l8k7m0Q4n4Qk7M2k2M8l9J7l4J5n9
$$ 13 -4 -41 -4 -16 31 25 0 -36 -38 19 35 9 -9 9 10 43 82 44 17 -23 61 7 15 -12 30 8 56 17 34 0 15 -44
6708d4J01q8L6j3K7k5J2L1n8L7j8K8m7O9J6q6N6k1j1j2K5j0l4P4k7m7N2rn0J2
$$ -44 57 -31 5 -8 19 -6 6 37 -21 16 -2 26 -21 48 64 -22 34 13 2 -10 15 5 -29 45 18 -29 23 14 -36 -24
6738b4N2k3qL7n0nL1l2J6l2NN6nn2N0k2m8O9jON0n8NQ0j01k7K1M7n6N1o4NKpK5
$$ -24 28 5 -3 34 -16 -21 10 -22 -6 -38 -33 23 18 -34 16 -6 -54 15 14 20 70 12 17 97 -4 -31 -10 37 -19 32 -32 -27 -25 -32 -7
6773gj2R9n1l2J8m3LN0o7N2L2q2M1k7K5k7Q1pm2L7m5j5k3JJ2N3L7k2j00M9Q0l3
$$ -7 -19 80 29 -3 15 -28 -25 25 -42 10 42 -40 1 -26 -1 -28 53 46 4 41 -4 -19 -42 -41 -29 24 61 39 -61 -12 68 35
6805C5k2J6J2j8m0M0Koj9l5L4K1l3JM3o4K2Nrk5M1J5p4l1P9j6L5om7M1j9N9n7
$$ 35 13 29 41 23 -17 23 25 19 0 -35 -1 20 -13 -12 31 -33 -11 -6 -15 -40 1 16 -58 -89 -10 -26 9 3 -44 -3 -22 37 -20
6838b0j4K3K6K2n4Q1n0q6Q6plK5k5JK3j4M7m6jM4j8n0M8p3M3K1m4J4J7k7OJ5j7
$$ -20 -34 -11 15 37 -17 64 14 -72 14 7 4 29 4 5 28 14 61 15 14 58 40 -10 38 -35 8 29 -15 -1 16 -11 -5 10 -7
6871gOJ8l3j2P5jp5L1m2J7L1j5j2P0q0k5L5N4k8l3j4M3K1k0k0L7J2l8oL9Rnl3
$$ -7 -1 17 -16 -28 47 46 -29 2 -40 -23 8 -7 -19 51 -29 -54 -19 35 7 -26 -40 3 24 4 -16 21 33 -5 -11 28 37 32 -1
6904aPjn1M8j3qO0p5L9nj8N1j9pPK4k7l0j8L8k0k8K5J6L4k4l6M5l9K6L8l6qJ7
$$ -1 6 5 -46 2 -11 -19 41 -34 5 0 -18 33 14 7 14 38 11 -19 -37 1 -19 -47 -22 -6 28 4 -32 13 -26 0 38 2 -6 11
6938A1k8rO8j9l3%j4nN2Pm1L3lj4%oRL5o1j4QkK7qPK2K2qk0l2LL6k3j4L5n7L1
$$ 11 -17 -26 42 23 -10 -10 -24 -29 23 30 -11 22 19 5 5 -1 8 43 -18 -32 -24 -26 1 -7 0 22 44 36 16 -16 -13 23 0 -14 21 -36 -5
6975eL5M2m8q7P3l2N4l9JO6l1J3l2K4Pk9j0j3J1K1n1pN7l1M%kkj1M7j6o7M4oM
$$ -5 30 72 24 -63 10 -22 32 -7 -6 60 29 42 10 34 41 12 2 -11 0 21 -30 -37 20 -11 -7 -7 -9 -11 -22 25 9 -58 -14 -20 -16
7010a6K8oK4l2j4QL9j9m7M1O3n0K4p9N4KK0o8L0Qj5N7m8J4L0mk4M7p4J9k9L5k
$$ -16 12 6 30 -2 -16 -8 31 12 -35 6 69 19 43 -36 18 20 40 -28 2 10 -5 52 4 18 48 44 20 67 -7 12 -17 18 16
7043A6K4o0PPk2K8qP6j12R3p8M8n6M0J0r8J56j09J34j13J6O1p1l0O7k8L9j3m7
$$ 16 40 -20 -13 -6 -28 0 -8 68 -44 49 -29 19 -37 3 13 -85 71 -38 96 -17 -1 60 -11 -41 26 -2 37 24 -23
7072b3N5m8J1K8j3pLk0L0Rjk7O4n9L1q6K7L9J1n6K0k6j4Q6k3pj9K2m8J7LlJ6J4
$$ -23 32 -16 -5 23 10 3 6 -14 16 25 24 -3 61 2 33 -53 -26 13 24 -32 -12 -38 -52 34 11 4 -15 7 -41 -24 -21 -24 -8 6
7106FpkJ6N9j52N8J5j2K5QJ8n4K6N1n0l2K1k2J0oj1N4qO1p8Klj8N4k9k3L7l7K1
$$ 6 -1 -3 13 72 -80 -22 -7 -19 6 14 32 -22 4 55 5 -27 -6 -28 -18 -24 -35 19 11 72 -6 -4 -7 -25 29 0 -23 14 -23 -2
7140bK2q9N3K2o7L9PJ2l1J7PNl0M8k5rO%J8J4j1Qp8Q7k4rK6l0K0n5LoP1k0j2P6
$$ -2 20 -69 -16 6 -61 -22 -15 -3 -34 -17 -10 -5 -35 13 -12 -21 -15 -15 3 17 6 14 -64 23 -1 -10 16 -14 6 -49 -46 -52 19 -1 -13 63
7176F3j05M1j8qk4J24q7L7j4K4JJ7l6n6O2J9j3j7oK1pLl6M9k3Pn2J0Q0o6J6Mj3
$$ 63 -42 -1 -19 -27 -51 73 -14 23 9 33 34 51 15 -41 21 40 27 10 4 25 18 21 -15 34 11 18 -34 -24 56 -10 6 10 -3
7209cJ7n3N0j6M3k8L0j4o6Q5j09K4JM4j0J1o2O9J7m9L8nj1m9R1m2K7rl1K8j0L
$$ -3 14 -39 11 -5 38 10 40 26 -40 45 -64 -40 -39 5 -5 6 -56 13 30 -19 19 14 3 -46 45 3 30 21 -10 18 8 11
7241A1J3l1K1pj9J4OJ9j7l9N3K0l2mLl1K6J8n2nM3m3QO7j01M9L4%Qll2MK1J9k2
$$ 11 24 -7 14 7 -12 2 8 27 10 -29 24 44 12 8 11 -20 6 24 -28 -33 10 -33 -25 42 -59 -10 24 24 32 29 -3 1 22 41 19
7276A9k0n1M5j7P5l2l9K5mP4p7OpnJ6k4l2O9r0O0OJqK5J5k9k6JK2J4L1j8l1Nl
$$ 19 -1 -52 -7 -24 51 19 -20 5 1 75 -2 4 -3 -8 8 -16 -48 21 -69 -9 -3 -2 -10 15 30 1 -25 -24 -2 12 43 25 -6 -1 -4
7311dJ1M1j4j5p7P6o2M1j9M1m3Rk4qL4J4MK5N1o8pq%k8j0O3J5m5j8J2loj0L9L3
$$ -4 7 48 34 19 -58 18 -44 -3 -22 19 -24 -15 -39 -47 -13 1 5 30 81 13 6 -2 -2 -30 -40 23 38 -7 -25 -13 -16 -22 -32 7 40
7346D0l9lO8r2J1j8K6j5RK6J1o9O2rk7K8L0n6J7J8k0RL9n3N3mm9kK6o8O3k8K0
$$ 40 1 -2 66 -26 -15 -33 -7 -22 -13 13 24 -45 17 8 -19 9 39 -17 0 18 -2 7 46 -7 46 42 -7 -9 17 -51 12 -16 4
7379DqO2m0Nj7J3j7k9pM1LRm8j6N5k8O5n2qj9j3J7mPjQ5n1J3Oo8P5p5P9j9p3P3
$$ 4 -4 58 18 23 6 19 2 -27 -34 7 10 19 -29 -45 10 -18 47 -5 -13 -32 -45 -28 -32 -25 -26 59 8 21 27 -41 34 -41 38 19 -54 19
7415A9JNp8Q4l0oK7k4j8K2l1L2j5j8N1k7K4oL4p6M0n9J9QK7m4K3L3k6KM4p5M8
$$ 19 20 25 -53 31 1 -5 22 -2 -20 2 -29 3 -12 -30 21 -6 18 12 46 -30 10 -49 -30 -22 5 -39 -16 17 -9 -7 37 -38 10
7448A0L7q4P4n4K4J7n1M1Pn2J3J3KM7m5m6O3mm7J3K9k0Lk0L1K7l2k7L9J5o3k1
$$ 10 47 -37 37 -17 7 24 -27 14 21 -31 -18 -5 -3 44 -1 -47 16 12 -35 -22 7 -13 -10 -30 1 28 -4 -31 8 23 -40 -61
7480f1P5M5r6K0N6m8O7o0mJ4J6j3O1r9M3jj2P6o8Kl9kM5p8R2k1P9r0N3n0J8l2
$$ -61 14 59 -37 -17 39 -9 58 -2 -6 8 24 11 72 -27 16 15 3 79 11 13 -26 -28 17 -61 31 10 89 -1 52 2 20 -12
7512a2J3L8l8Kl4K0K7J5p1P7p7J9k2P7lm9RL5l9QLL8n4L8j2l6J2M6mm8lJ4L6o5
$$ -12 1 39 1 3 -31 -11 16 31 -40 37 -40 -21 -43 34 31 -18 -9 26 -13 -5 -2 36 -18 20 8 -28 -16 30 26 -22 -25 -11 25 -40
7546d0M6l6MN4m9Kj4L5k5K7J3k3m9J5M9QOm7KRj8L3kL5m9RK9l0k1K9M3k0l1O8
$$ -40 6 -30 -26 28 -21 -19 -33 2 -23 4 17 -6 -55 -40 9 17 23 -24 -22 -13 -31 2 0 35 -14 -5 24 -6 -27 2 45 25 -6 62
7580F2m1k5l3O4k3l6L5j8O9j07M9oK8m1j3O2k9J3k0J2J9pm1K0l1J0J9k7N7n4K4
$$ 62 21 -4 -37 27 4 -32 3 -15 54 -53 -4 -10 18 -23 -36 26 -3 10 -10 2 21 14 -27 -7 -38 -28 -9 -36 21 -33 -9
7611im6O8K4j2j4N0p3M4o1J7M0L6j4m8j3K3j9L8l3J7L2l1J7L0m9p4N6p4K3M9L9
$$ -9 -55 13 37 25 11 61 -12 32 -29 -12 28 64 50 2 -11 12 -7 31 -2 15 47 16 33 63 14 -60 -4 -78 -55 -6 33
7642C3OKn4k6l4L3J0j8M5J1j6J0N5l3o5M2k1P5r0L6k9k3M8j9j1j9J00o2L0k3q
$$ 33 39 41 -13 -39 -73 -40 -30 -48 -3 8 -8 2 57 24 -41 1 -20 55 -35 1 -28 -51 -3 -22 -33 -52 48 -14 16 -7 -15
7673a5j3J9l2O3oLjj1J4m4J3n6P8J2kl8J0J0K6l5K6k9K6J8o1J0J2J7qjK5j7j04
$$ -15 -28 -9 -41 22 16 19 18 7 21 -23 -10 -66 12 24 22 -16 -6 4 30 -5 21 -8 18 36 -25 -15 -3 14 6 5 30 13 -91
7706i1R7n7M6K8k5M4o5P1o7J5K4m1QM4k3j9LQMj9qK9mOJ5n0O1k8l9j0N8k6k6J7
$$ -91 6 -51 -5 23 -2 42 -23 48 -19 -4 20 -21 -13 31 8 -11 -8 0 4 -15 -23 6 2 8 23 -27 34 6 -33 -43 15 -11 -37 -20
7740b0oN7pK6n0N8m3k1J7m6K6N7j03L9O3o1J6mL4m2K1j1k0O1j0m7K0l9P5l7Rj7
$$ -20 -26 31 24 50 0 58 15 -6 11 -35 -9 48 -55 -16 47 -14 2 -2 32 -10 11 0 -20 41 31 -16 4 -35 40 3 12 -5
7772eML8l2m9LO5o7P3p9N7j1L1m4N7k9RL9n9k3O8o1J7k7M2k2KrJ7k1M1J5m1K3
$$ -5 -1 37 5 -44 -41 24 -43 30 -49 8 -3 28 -16 41 12 21 60 1 -22 46 -15 2 -25 17 -5 -3 -12 5 -16 25 40 -1 22
7805B2m5oK2K0kk5lmJ5l6M2J2n7LL3m4Q8j5k4k6j6J10o2mQl2K9Lj8L6K8m5j1K9
$$ 22 -23 -29 -7 13 11 -14 -17 -21 -6 -42 0 12 -45 -42 -9 -53 35 20 -4 -30 -46 64 2 -2 6 -26 3 6 -12 24 52 7 -4 25
7839B5ojj2K6l9K5k4n3P4k9N4r4PmR9n4j4J1L0Ln5J3l5L2O7j4n6M9k1k6K6m0M0
$$ 25 19 18 6 32 -7 18 -6 -59 15 -14 40 -54 -47 -51 48 -6 -20 -9 21 24 -31 -18 -53 -21 46 32 -24 25 4 -22 4 -36 4
7872Dk0lK6K2k6J0Kn0J2L7k9J9RJ7J1j7l3J2k9N3k8j8kN9o7%K1J0M6n9Mm2K6n
$$ 4 -16 -19 7 29 3 13 15 -35 -23 14 -15 4 13 30 41 24 -9 3 -26 27 -1 -19 -21 38 -29 -29 -8 2 48 -11 -7 -49 -23 -28
7906b8L2Ok7l4N0l4j7O2m6O0r8R0M4pqm2L8l9q2N1nJ7P3o8J1l0M6J8j2o5O0j3
$$ -28 4 10 -17 -51 -1 -35 -52 10 -36 24 -74 16 60 53 45 3 41 2 -80 -29 -34 -17 56 -12 -1 -31 15 33 21 -44 16 3
7938Ck4K5k6m4O8K6m9J7L5r0N4K5n1K8j2L8k3J1l5O3j4qj8j8K4p9J05l7qk1Q0
$$ 3 -21 4 -22 -66 2 28 -21 -4 31 -59 -5 20 -31 -3 -15 23 0 11 -24 39 25 17 -1 -19 5 -74 31 -6 -14 -35 45
7969D5o4M7j0l5K5mq8P2%K4k4j0Qj8P0m8J8o%mOL3rn3L2j7OL4k2O7q3oP4r0L3
$$ 45 -19 28 18 -17 8 4 -84 -12 -12 12 -12 -22 -14 -32 38 -10 8 2 2 -2 4 37 28 -25 7 -10 -4 30 8 75 -8 -14 60 -30 3
8004CK3ol9M5l8K5L7roo9N6m1j0K0l%LRk5N8j7m9L1k3ON1j8j7k2L7MK2l2J0J3
$$ 3 26 20 -19 26 -12 13 50 41 35 -34 22 -19 -29 -9 -12 -12 -9 0 -25 33 16 -33 -2 -25 -19 32 14 -3 -25 12 16 38 6 16 29
8039B9p6J6PM5orn4M7j3k9N5J2k9J6LJ4j6mk2o8J06jj6l7O0l8l5J7L2n5K5P5n4
$$ 29 -47 -31 -24 21 15 6 -48 -1 -14 -43 12 24 -5 11 14 28 12 8 -14 -82 24 23 7 -30 30 -8 -43 -26 6 -49 -24 51 -3
8072cK3q6Q7qJj0k0j5J4J2jK1m9N1k5J0J8k9l8Q7j9j1o0L4LJ3l6k4P6k7J6J5p
$$ -3 20 -66 21 13 14 4 -16 -31 -17 -5 -6 15 -34 17 -8 2 20 -9 -47 40 21 10 -50 -16 -13 0 -36 -60 16 -11 5 20 13
8105A3L3j9J1l3mJ8m2L0%l1l8O7Nl6J9J1j1m5L2J3J1pm6N1l0P4Kk0o4M2K4n8P4
$$ 13 46 27 38 5 1 19 -23 7 7 -24 -62 5 10 -26 -7 4 -7 -52 -20 -7 4 -3 -49 2 -28 46 48 28 -36 6 30 -28 46
8138D6J4j5o3L8M3J3q6J6k8K8j1j8O0m7pL3Ol6J4LK1%j4m7K6l7Q7m7J7L3m0k7
$$ 46 60 45 -18 20 63 76 -10 6 -22 6 -5 -23 37 -10 -17 16 22 -14 0 3 24 24 10 -37 -11 -48 39 -8 9 42 2 -25
8170b5L5j5k0LK5M1p9L8J0k3J5RO0o0L5q3K4K4l2L0M3
$$ -25 10 -5 -25 -22 3 44 -35 3 13 -10 5 14 74 14 49 -34 -10 14 -18 12 55
8191E5
$$ Imaginary data points
##PAGE= N=2
##DATA TABLE= (X++(I..I)), XYDATA
0@%%%%%%%%%%%Qj6J6j6K4l2M0m8N6p2Q8j04J20j42J66j92K24k60L03l50L99m55
$$ 0 0 0 0 0 0 0 0 0 0 0 0 8 -8 8 -8 16 -16 24 -24 32 -40 48 -56 64 -78 88 -104 120 -140 163 -187 212 -243
33b43N18n83O56p43Q37r37J047j167J300j446J605j778J966k169K394k644K913
$$ -243 275 -308 348 -395 442 -495 552 -615 685 -761 844 -934 1032 -1137 1257 -1387 1526
50A526l206L532l892M289m733N228n783O415p141P985q977J0160j1604J3414j5755
$$ 1526 -1680 1852 -2040 2249 -2484 2744 -3039 3376 -3765 4220 -4757 5403 -6201 7213 -8542
65h542J8918k3447L0526m3500J02784l97677K18440M59305n71462R4864M38936
$$ -8542 10376 -13071 17455 -26045 76739 -320938 -102498 356807 -214655 -119791 319145
76C19145m14296j54962M65562j77796j77985K58297j19858j46732K56700o3558
$$ 319145 -95151 -250113 215449 37653 -140332 117965 -1893 -148625 108075 44517
86D4517j26429J43843q0872p4867J97430p9408j08086J39084p1915n5670J86213
$$ 44517 -81912 61931 -18941 -93808 103622 24214 -83872 55212 -16703 -72373 113840
97A13840j13767j13044K02782p9246j26796K37458p6862k18085K46007L5129k49164
$$ 113840 73 -112971 89811 10565 -116231 121227 44365 -173720 72287 107416 -141748
108a41748J76123P3986k51593J44644J42483k44171O0512J51762j97858N2917
$$ -141748 34375 108361 -143232 1412 143895 -100276 -39764 111998 -85860 -32943
118c2943J71911k09930j5736K01911j40839m6080J80544j28641q7366J88280m9945
$$ -32943 138968 -70962 -86698 115213 -25626 -71706 108838 -19803 -107169 81111 31166
129C1166r8835J19234n4125p3724J41581l4671r5890J07758l8334q3148J47779
$$ 31166 -67669 51565 -2560 -76284 65297 30626 -65264 42494 4160 -78988 68791
140F8791j7173j43695J09839L0901j20955J00350M3758j50690N9162Q6476j08578
$$ 68791 51618 -92077 17762 48663 -72292 28058 71816 -78874 -19712 66764 -41814
151d1814L6539O9885j22909K2520J10915r6228j6032R7083q6220k8327J21735
$$ -41814 -5275 64610 -58299 -35779 75136 -21092 -37124 59959 -26261 -54588 67147
162F7147n5072p1134R2182k0232o0553Q2781r097p5414O1077J3107n7407N0021
$$ 67147 12075 -59059 33123 12891 -47662 35119 26022 -49392 11685 24792 -32615 17406
174A7406O188o6010M8443K7431o2609K9679K6632n9269K8692M0132n8772Q422
$$ 17406 23594 -42416 6027 33458 -29151 528 27160 -32109 -3417 36715 -22057 -13635
186a3635M0034m5751J1505M2464n4121k679N3851m0527j0241N3223m3097k5721
$$ -13635 26399 -19352 -7847 34617 -19504 -22183 31668 -8859 -19100 34123 -8974 -34695
198c4695O6199k0260m1958N0315j0349m3374N1818O828n3225L0446J6289m1399
$$ -34695 31504 11244 -30714 19601 9252 -34122 17696 24524 -28701 1745 18034 -23365
210b3365K8937K0222m8821J3994L0360l4373R033K6391l7987J126L5350k4948
$$ -23365 5572 25794 -23027 -9033 21327 -13046 -4013 22378 -15609 -14483 20867 -4081
222d081n881K6418k5304n533L3504j9025j3514K7017j6815j1662L2792j4002k2037
$$ -4081 -9962 16456 -8848 -14381 19123 98 -13416 13601 -3214 -14876 17916 3914 -18123
235a8123K9172o180k1169K8605l150k8543K4677O715k6934J8829Q432k8476J5395
$$ -18123 11049 4869 -16300 12305 9155 -19388 5289 12004 -14930 3899 12331 -16145 -750
248g50J5998k6507P523J6893k3260M468K0400k0828k717K0453j4839m845J9215
$$ -750 15248 -11259 -3736 13157 -10103 -5635 14765 -6063 -8780 11673 -3166 -8011 11204
261A1204j2295q737J8445o706r957J4857m917j0504J4183j478j1351J0589j57
$$ 11204 -1091 -9828 8617 1911 -8046 6811 1894 -8610 5573 4095 -7256 3333 3176
274C176j0078J0224J114j1260Q083K968j0200P253L699j1333N681O353j0348L390
$$ 3176 -6902 3322 4436 -6824 1259 4227 -5973 1280 4979 -6354 -673 5680 -4668 -1278
288a278P024j0129J703R140q852j245R207o913k821R650n147n283Q895k373o074
$$ -1278 5746 -4383 -2680 6460 -2392 -3637 5570 -1343 -4164 5486 339 -4944 3951 1578 -4496
303d496P574q29o867O214J352o658M279K252o272L193L217n513J623L488m641
$$ -4496 3078 2249 -4618 1596 2948 -3710 569 2821 -3451 -258 2959 -2554 -931 2557 -2084
318b084R76L633m024J86L625l382j31L623l157n69L677k849r52L857k597j530
$$ -2084 -1108 2525 -1499 -1313 2312 -1070 -1201 2422 -735 -1304 2373 -476 -1428 2429 -168 -1698
334a698M002k208k174M227j643l015M246r25l595M228j36m370L709J187m495K752
$$ -1698 2304 96 -2078 2149 506 -2509 1737 812 -2783 1445 1309 -3061 648 1835 -2660 92
350I2J995m542J957L030m198O77L291l358M4L300k883p41L163j871q46K483j828
$$ 92 2087 -2455 -498 2532 -1666 -989 2302 -1056 -1012 2288 -595 -1336 1827 -44 -890 1593 -235
367b35q83K551j421r56K088j632o74K616j578j280K404j367j067K978j525k065
$$ -235 -1118 1433 12 -944 1144 -488 -1162 1454 -124 -1404 1000 -367 -1434 1544 19 -2046
383b046K873m07j805K713q88k714L201N14k825K248J36l162K864J482l544J260
$$ -2046 827 420 -1385 1328 440 -2274 927 1441 -1384 864 1000 -2162 702 2184 -1360 -100
399a00J319k843J990J853l696O15K140k609J321K047l887M08L289k716K40K536
$$ -100 1219 -1624 366 2219 -1477 -862 1278 -1331 -10 2037 -1850 -1442 1847 -869 -629 1907
415A907l783J25M419l054j131L586l300q00N314k866l155M750j705k652N313j762
$$ 1907 -1876 -1751 2668 -386 -1517 2069 -1231 -2031 3283 417 -2738 2012 307 -2345 2968 1206
431A206m844M999M88m260M175k69n357M624K142n430K609J575n151L747L288o092
$$ 1206 -3638 1361 1849 -2411 1764 1495 -3862 762 2904 -2526 83 1658 -3493 254 3542 -2550
447b550J396L134m633K942L527o666R82N039n048J535M956p489l34P950n086j981
$$ -2550 -1154 1980 -2653 289 3816 -2850 -1868 3171 -1877 -342 4614 -2875 -3209 4741 -345 -2326
463b326O659n962k773R211l591n124O899l318m382Q978k023p431P003l83o208
$$ -2326 4333 -1629 -4402 4809 1218 -3906 2993 -325 -4707 4271 2248 -5183 1820 1437 -4771
478d771P876J67q858O032K537o906N888J580q921N547M236q163M450L868r772
$$ -4771 3105 3272 -5586 446 2983 -3923 1965 3545 -5376 171 4407 -3756 694 4562 -5210
493e210M165P265r412J346P132q837Q36R093q401j818R006p122k160J0243o881
$$ -5210 -1045 6220 -3192 -1846 5286 -3551 -2715 6378 -2023 -3841 5165 -1957 -4117 6126 -755
508g55n191J0917m169o675J0296k338q542R091P34q214O569J105p319O151J609
$$ -755 -5946 4971 802 -5873 4423 2085 -6457 2634 3368 -4846 1723 2828 -4491 1660 3269
523C269p414N574J677p752O057L189r343M263N111q317K776N637p984J145O094
$$ 3269 -4145 1429 3106 -4646 1411 4600 -4743 -480 4631 -3686 -910 4727 -3257 -2112 3982
538C982o438J299N381p741J047P740p625p81Q733p599l250J1000m513o700Q974
$$ 3982 -2456 -1157 4224 -3517 -2470 5270 -2355 -3136 5597 -2002 -5252 5748 1235 -5465 3509
553C509j986o648Q454q4p811N885J046o406O440J311q715M917M064p563L549M635
$$ 3509 1523 -5125 3329 3245 -4566 1319 2365 -4041 2399 3710 -5005 -88 3976 -3587 -38 4597
569D597q574J300P155n554r28N191n556n56O980m219k456N411m144j957P870l211
$$ 4597 -3977 -2677 4478 -1076 -2004 3187 -2369 -2925 4055 -164 -2620 2791 -1353 -3310 4560 1349
585A349n680O128m05m631O056j29o756M071K434m272L268O02o062L896L419n430
$$ 1349 -4331 1797 1392 -3239 2817 2688 -4068 3 2437 -1835 1433 2035 -4027 -131 3288 -2142
601b142K227K551o611K629O132o193j184N186m376l27O503m682l527O176k279
$$ -2142 85 2636 -3975 -1346 4786 -1407 -2591 2595 -1781 -2108 4395 -287 -3814 2362 83
616H3k374O147l537n003P009J19n456N073m12o190N785K664o606K431K151n159
$$ 83 -2291 3856 319 -4684 2325 2444 -3012 2061 1649 -4541 1244 3908 -2698 -267 1884 -3275
632c275M042L040o793J549L816m904K692L801p288O59O382m815j75M997o304o83
$$ -3275 767 3807 -2986 -1437 2379 -2525 167 3968 -3320 -2661 3721 -1094 -1269 3728 -2576 -3259
648c259P723m117k938N498m399j839Q263l746n369O522k015m048Q172k195q027
$$ -3259 4464 347 -2591 2907 -1492 -3331 4932 1186 -4183 2339 324 -3724 4448 2253 -5774
663e774O850J708o373N810P46q715N340M900p146K528L145p609L497O510p162
$$ -5774 1076 2784 -3589 2221 2967 -5748 -408 4492 -2654 -126 3019 -4590 -1093 5417 -1745
678a745l96N232n832J183O992o496k548O649l670j196O398n218l731P413k088
$$ -1745 -2141 3091 -2741 -1558 5434 -1062 -3610 3039 -631 -1827 4571 -647 -4378 3035 947
693I47l587N958l373m868P749l27o221N225k04n713O258J596p192L484K527n314
$$ 947 -2640 3318 -55 -4923 2826 2499 -3722 1503 1299 -4414 1844 3440 -3752 -268 2259 -3055
709c055M039K477p064K665M264n520K233L671p014J561O400n807r09N662n320
$$ -3055 984 3461 -3603 -938 3326 -2194 39 3710 -3304 -1743 4657 -1150 -2059 3603 -1717
724a717j210P385m101m096O097k187l192O172k087n211N474L58m492M687l82n478
$$ -1717 -2927 4458 357 -3739 2358 171 -3021 3151 1064 -4147 1327 1685 -2807 1880 1498 -3980
740c980M700K108n362K853J776n248L316L370n661J286L464m652J464M130n123
$$ -3980 720 2828 -2534 319 2095 -3153 163 3533 -2128 -842 2622 -2030 -566 3564 -1559
755a559n18M884l560p72M418l790j777N105k106k470M007k125k347M793j285l506
$$ -1559 -2077 2807 -753 -1525 2893 -897 -2674 2431 325 -2145 1862 -263 -2610 2183 898 -2608
771b608L888p35l185M484k20m552L610J137m080L147J324m876K517K801m254J348
$$ -2608 1280 545 -2640 1844 1624 -2928 682 1819 -2261 886 2210 -2666 -149 2652 -1602 -254
787b54K461m190J136L626l851k30L312l212k42L967l112j543L932k084j564L859
$$ -254 2207 -1983 -847 2779 -1072 -1302 2010 -1202 -1444 2523 -589 -2132 1800 -284 -1848 2011
803B011j917k486L860p24k695L326o73k911L265M31l235K322O24k929K329J157
$$ 2011 94 -2392 1468 744 -1951 1375 702 -2209 1056 1487 -1748 574 1198 -1731 598 1755
819A755l204J333J456k621J322J550l013Q41J935k396N82J918k595K3K651k007
$$ 1755 -1449 -116 1340 -1281 41 1591 -1422 -581 1354 -1042 -460 1458 -1137 -1114 1537 -470
835d70n35K417j933r69K882j076j560K195p14j538K269ok113J499M03j678J301
$$ -470 -1005 1412 -521 -1490 1392 316 -1244 951 237 -1301 968 962 -1151 348 751 -927 374
852C74O89j907N29J005j205M39Q41j368oJ078o55m5O41q86j32J072l88l86M66
$$ 374 1063 -844 -315 690 -515 -76 765 -603 -609 469 -186 -231 410 -476 -608 464 76 -310 156
871A56l88j47Q48k35n54L74o8m1N61j69p56M61L26m49L98m5q92L95Q67o73k64
$$ 156 -232 -379 469 234 -320 54 -14 -55 506 337 -419 42 368 -81 317 272 -620 -225 642 -31 -295
892b95M42n09l9J021m80r41P58J88n37P61n0j105N13Q92o60L0K96p32K58R62n92
$$ -295 147 -362 -401 620 140 -801 -43 145 -392 369 319 -786 -273 619 -41 -11 285 -447 -189 773 181
913A81m30M47m01J67Q31p99o47Q29r4j90O82p53p57J061K82o75L91l20n99J167
$$ 181 -249 198 -203 -36 795 -4 -651 178 84 -106 576 -177 -934 127 409 -266 125 -195 -794 373
933C73K64j088K78J90n56R61M69j422P8Q92m46K92M36j321R8J199n33j93M83j101
$$ 373 637 -451 -173 17 -539 422 891 -531 -453 439 -7 285 721 -600 -502 697 164 -29 454 -647
953f47mJ642o80r55P79l47m83J500l37j660Q80O93p40P83l3j477P94J323j045
$$ -647 -651 991 311 -644 135 -212 -695 805 468 -1192 -312 381 -359 424 391 -1086 -292 1031 -14
972a4k36O43j019L19J647j072j103R76j17p7J017r18j074J013M42l71M52q33r23
$$ -14 -250 393 -626 -307 1340 268 -835 141 24 -53 964 46 -1028 -15 427 56 508 -325 -1248
991a248J522N71j095J28k38o67J496P46j704j41N45m03J266M71k188P7J550p32
$$ -1248 274 845 -250 -122 -360 -1027 469 1215 -489 -630 -85 -488 778 1249 -939 -862 688 -44
1009d4M23R28k331k89K645n50j226Q94j034n82K296j11j855N29N4m09J791m64
$$ -44 379 1307 -1024 -1313 1332 782 -444 450 -584 -1166 1130 1019 -836 -307 -253 -662 1129 665
1027F65k106R92Q75p62J039j61k078J064J651j097rR1j298J148J454j500m59O43
$$ 665 -1441 -449 426 -336 703 542 -1536 -472 1179 82 73 164 -1134 14 1468 -32 -491 152
1045A52q84R50J430k079q04J624l46LJ054j808q97K109K25q45M56j133n63K303
$$ 152 -732 218 1648 -431 -1235 389 43 46 1100 -708 -1605 504 729 -116 340 -793 -1356 947
1063I47J50j610J98j44j87J759J30k068K6Q19N9J117l26k164M52J548k31M6k09
$$ 947 1097 -513 -315 -459 -646 1113 1243 -825 -799 20 79 1196 870 -1294 -842 706 475 521 312
1082C12j550L54J971k33j106k68l57N70J292l44j322j60M34P44O43q03j258M72
$$ 312 -1238 -884 1087 854 -252 -520 -877 -307 985 641 -681 -841 -407 337 980 177 -1081 -609
1100f09J058K52k43n71o64M75J142j9r55n43K22Q17N36o54r77K49M83L50L94q11
$$ -609 449 701 458 -113 -777 -302 840 821 -134 -677 -455 362 898 244 -733 -484 -1 349 743 -68
1120f8j269Q62J432o31o96J14n35M67J457n91j394L13M01N61O10j062j027R56
$$ -68 -1337 -475 957 326 -370 -256 -791 -324 1133 542 -852 -539 -138 423 1033 -29 -1056 -100
1138a00N03PM90j260j089J731R02j132N1m83q81J764R53j875k56N09o28J394Q48
$$ -100 403 410 900 -360 -1449 282 1184 52 103 -380 -1261 503 1456 -419 -675 -166 -794 600 1448
1157A448k260m81J501k29M07N85j889k92J955j95l20K86j415J9K127n33j156O31
$$ 1448 -812 -1293 208 -21 386 971 -918 -1210 745 550 230 516 -899 -880 1247 714 -442 189
1175A89p02j08J903o43j733Q79J67k27J269p51j619J254M98o64R34n64j544J578
$$ 189 -513 -621 1282 639 -1094 -215 -48 -275 994 243 -1376 -122 376 -288 646 82 -1462 116
1193A16J004j441K41K16j014J148R53j571q8N36m71R18M62j755J33J157o39M23
$$ 116 1120 -321 -80 136 -878 270 1223 -348 -436 100 -371 547 1009 -746 -613 544 -95 328
1211C28L18j561J01J713p05l43M04j191L17J745r96p12P65p95K07J759j133j296
$$ 328 646 -915 -814 899 194 -149 255 -936 -619 1126 130 -582 183 -612 -405 1354 221 -1075
1229a075J238j39l92J499p49j638J372N91r89Q33k77j358J065R44j130K03J31
$$ -1075 163 24 -368 1131 382 -1256 116 707 -282 551 274 -1084 -19 925 -205 -2 129
1246A29r80R12Q56j244j26N76o45O20O61j184j20Q42m68K12N51r92j75J071l11
$$ 129 -851 61 917 -327 -453 123 -522 98 759 -425 -545 297 -171 41 592 -400 -575 496 185
1265A85k58M79o35j25R71l66m60M29l35j89P89l14o10M77Ok37N21l18n46M99J00
$$ 185 -73 406 -229 -354 617 251 -209 220 -115 -304 485 171 -439 38 44 -193 328 10 -536 -37 63
1286F3j66K82k22m61O03J50m48L94k03m69P40J95o87K88J52o57O55L85r51J47
$$ 63 -103 179 -43 -504 99 249 -199 195 -8 -477 263 458 -229 59 211 -446 209 594 -357 -210
1306b10N75n89K04M88o85k25O82k63k61N76m51l75P77n1m75M08j62l87N59J15
$$ -210 365 -224 -20 468 -217 -442 240 -23 -284 292 -159 -534 243 192 -283 125 -37 -424 135 250
1326B50m26K82J7k79L00J62m39J68J75m01L28J57m79J24K77l48N3L02m07n6L34
$$ 250 -176 106 123 -156 144 306 -133 35 210 -191 137 294 -185 -61 216 -132 -79 223 -184 -240 94
1347I4j34j31K86j87j34K81J4k33J28K8r4K08k8j14Q2n9j1K17j08j29J76r5j82
$$ 94 -40 -171 115 -72 -206 75 89 -144 -16 12 -82 126 98 -16 66 7 -4 213 105 -24 152 57 -125
1370a25K74j6k95J32L9l3M1k2j76J16nr0K00L5l70K93J79l68J86K55m71R8M46
$$ -125 149 133 -162 -30 9 -24 17 -5 -181 -65 -70 -160 40 75 -295 -2 177 -191 -5 250 -221 -123 323
1393C23l42q3L63l79L8M25l28j28L60k82j56N20k85m66N46M1n06M49L3n72L21
$$ 323 -19 -102 261 -118 -80 345 17 -111 249 -33 -189 331 46 -420 126 167 -339 110 143 -429 -108
1414a08L54m82J52K85n10J68M22l09j65L25j83k5L15j46j91J30%P6Q1k26m0J38
$$ -108 246 -236 -84 201 -309 -141 281 -28 -193 132 -51 -76 239 93 -98 32 32 108 189 -37 -77 61
1436F1j45K15R8l95n0K89q6K5O7l31O1L37k24M0K06n40R6O64l05l81M43j51l09
$$ 61 -84 131 229 -166 -216 73 -13 12 79 -252 -191 146 -78 -38 168 -372 -276 388 83 -298 145 -6 -315
1459c15O59L6p43K24L60k62K83L8o14J45M63k59%J52n51Q3O17k01l02K5nL8K86
$$ -315 344 380 -363 -139 221 -41 242 280 -334 -189 274 15 15 167 -384 -301 316 115 -187 -162 -167 -129 157
1482A57Qk93j24J25L62L5l73l5J97j19L07J76n73j50N49q9j16J49l61k09N47J27
$$ 157 165 -128 -252 -127 235 270 -103 -138 59 -60 247 423 -150 -300 249 160 44 193 -168 -377 170 297
1504B97l86L6j53j59N69J28o31q1L90n2J35J44m87r6M98M4k7o1m37J81N03j37
$$ 297 -89 -53 -206 -365 204 332 -299 -380 10 -42 93 237 -250 -346 152 196 169 108 -329 -148 355 218
1526B18j63j01j68Q0O31k26n00P3O8L3M32k74m98J63K46N2J65l00n11L95M69j93
$$ 218 55 -46 -214 -134 497 271 -229 -156 -88 -55 377 103 -395 -232 14 66 231 -69 -580 -185 284 91
1548I1j00p9k97L73M44k97k59N2k21M88L23n54k12K69l9J28L54o26l07O02j3j15
$$ 91 -9 -88 -385 -12 432 135 -124 -72 -293 195 518 -36 -248 21 -18 110 464 -162 -469 133 120 5
1570EJ82m30k11O90o7l48J83j93k45P89np23K41K25k66M84J1p34K27M96l12J71
$$ 5 187 -243 -454 236 169 -179 4 -189 -434 355 350 -373 -132 93 -173 311 322 -412 -185 311 -1 170
1592A70N9p03L80N37m53k0J51n15L68O07o69k65M10l24K43N24o42l49P07k71j6
$$ 170 229 -474 -94 443 -10 -30 121 -394 -26 581 -88 -353 57 -267 -24 500 -142 -491 216 -55 -71
1613g1N54n82m74Q59L7m78L79k28m06O61J44p18M13k8l70O48K2o94K88J99m51
$$ -71 483 -99 -573 286 323 -155 224 -4 -410 251 395 -323 90 62 -308 340 362 -332 -44 155 -296
1634b96M36N8o09K28M46m19O6K07m77K45M28m35O8K09m11L56L23n83PM56m08R3
$$ -296 140 198 -411 -183 263 -156 -90 117 -360 -115 313 -122 -54 155 -256 100 423 -160 -153 303 -105 -12
1656a2M39n82j75P10l27k45M39k92k69N29q1l36K11q8j46M07j20m04L40K0k07
$$ -12 427 -155 -330 380 53 -192 247 -45 -314 215 134 -202 9 -79 -225 182 62 -342 -2 18 -189
1677a89L32m6m05K85K46k70J26O6l48K33K22k45L7J0j93K55M2k81Q2J31j61J30
$$ -189 143 97 -308 -23 223 -47 79 145 -203 30 252 7 44 54 -139 116 158 -123 -41 90 -71 59
1699E9N3k90J27O9j11J32l6k77L29L9j58J01n1k48L84J89m47P9J55j87K12J54
$$ 59 112 -178 -51 18 -93 39 3 -274 55 94 -64 37 -14 -262 122 311 -136 -57 98 -89 123 277
1721B77m30J20J90k45K11J06m36M9M38k92l2J76l89L8M96l01j55K71l15J20L45
$$ 277 -153 -33 157 -88 123 229 -207 -158 280 -12 -44 132 -257 -219 277 -24 -179 92 -223 -103 242
1742B42k76j45L19k29l8M47l31k22M30j52j61L45k48k50N71j88l67M85k14m47
$$ 242 -34 -179 140 -89 -127 320 -11 -233 197 45 -116 229 -19 -269 302 114 -253 232 18 -429
1762d29O12Ro06M49J30m94M20J59n73K18K65l40K80Q7n08K28M17m43J78J63n48
$$ -429 183 192 -414 35 165 -329 91 250 -323 -105 160 -180 100 187 -321 -93 324 -119 59 222 -326
1783c26L19M71n73J7L92m54N0N08m99j22M05k48o8M35m11k52O10k89k30M03j31
$$ -326 -7 464 -109 -92 300 -154 -104 404 -95 -217 188 -60 -128 307 -104 -356 254 -35 -265 138 7
1804Gl84N01K4m25L67m2k83M36qm29K39J09k54L60M7m68J94K54l84K19J33m53
$$ 7 -377 124 148 -277 90 48 -235 201 193 -236 3 112 -142 218 265 -203 -9 245 -139 80 213 -240
1826b40K05K37k94K9K13m01Q2M29l39q6K59k39J2L78k57k20K76j0p3J71q7j37
$$ -240 -35 202 -92 -63 150 -251 -169 260 -79 -165 94 -145 -133 245 -12 -232 44 34 -39 132 45 -92
1848i2K20p3j06J71j08j64K21J3j64J40m6j28J65N3k42R0np0J64k5j35R1M2n7
$$ -92 128 55 -51 120 12 -152 69 82 -82 58 12 -116 49 102 -140 -50 -55 -125 39 14 -121 -30 12 -45
1872d5J21Kj87K3K38j63L1M9j35M1J44q9rPn9K6M4J9r8J3L4l7N2k9n2n6J43K2
$$ -45 76 78 -109 -86 152 -11 20 69 -66 -25 119 30 21 28 -31 -5 39 58 -40 -27 7 -30 22 -7 -59 -115 28 50
1900E0j10K8J3m8R3R2j21m0P8n4K9N3j4q8J30o9J4N7j38K7J39j24q1J28j15j2
$$ 50 -60 -32 -19 -67 26 118 -3 -43 35 -19 10 63 49 -39 91 22 36 93 -45 -18 121 -3 -84 44 -71 -83
1926h3J34Oj98J77o7j10J87r6n8J51m4q3J42M0k61K91L5k67J57R9k58J41J59k30
$$ -83 51 57 -141 36 -31 -141 46 -50 -108 43 -1 -84 58 98 -163 128 163 -104 53 152 -106 35 194 -36
1950c6o1K13j33N1J15k55N4K13k79K7J70k10OL22k56r9L31k00p0K44j90j76L35
$$ -36 -97 116 -17 34 149 -106 -52 161 -118 -91 79 -131 -125 197 -59 -158 173 -27 -97 147 -43 -219 116
1973A16j21o3L05k11k76M17l3k59K42m7l53L35J69l79J60M5k30L25K6m07K17R4
$$ 116 -5 -68 237 26 -250 167 134 -125 117 70 -283 52 221 -158 2 47 -183 142 168 -239 -22 72
1995G2k86L17J17n66J94L63l15R0J99l59P3L41k51kJ65l30J19M47m57q6L40k66
$$ 72 -214 103 220 -346 -152 211 -104 -14 185 -174 -101 240 -11 -13 152 -178 -59 388 -69 -155 185 -81
2017h1j24N52l19l20K95J20k55L37j88l50L62J34l02K49j41l25N10J31m67J66
$$ -81 -205 347 28 -292 3 123 -132 205 17 -333 29 163 -139 110 -31 -356 154 285 -182 -16
2037a6J08l08M16J41m70L5J99j71K63J19n65M4M06k76J57J76n38M2N10k29j27
$$ -16 92 -216 200 341 -129 -94 105 -66 197 316 -249 -205 201 -75 82 258 -280 -238 272 43 -84
2058h4J59k85j6N57k94k51K39k02M0M55k60l89L75K7r4L14k19l35L36J82k33J38
$$ -84 75 -210 -226 331 37 -214 25 -177 -137 318 58 -331 44 71 -23 291 72 -263 73 255 22 160
2080A60j85k77M53J21m08J26k5k81M13K11n09j1K23j13J81Q2l58l4K48PJ04Rl70
$$ 160 -25 -302 151 272 -136 -10 -35 -316 97 308 -201 -212 11 -102 79 161 -197 -231 17 24 128 137 -233
2103b33L0M24j29o4N8k39Q2L94k19k11Q0r1J44K98k87k99K44j9N8K15l11l38L77
$$ -233 -203 221 92 28 86 -153 -71 323 104 -107 -27 -118 26 324 37 -262 -18 -37 21 236 -75 -413 -36
2126c6K42j96M4o8k18J54L23j59j13r1n2L29Q4k23j17J20q2K05K6l39n3L16k8
$$ -36 206 10 54 -14 -232 -78 245 86 -27 -118 -170 159 243 20 -97 23 -59 146 172 -167 -220 96 68
2149F8K9m2k39j3K27Rk9n8j80P8L65j62j76J26p7M5K26l7l29P2J84P5n1j37j07
$$ 68 97 55 -184 -197 30 39 10 -48 -228 -150 215 53 -123 3 -74 -29 197 160 -169 -97 87 162 111 -26 -133
2174a33J50J36l4j07j14k3J17J89j07k17J4J18N8K6j00j23m0K33J48j72j84O7
$$ -133 17 153 119 12 -102 -125 -8 181 74 -143 -129 -11 47 73 -27 -150 -190 43 191 19 -165 -98
2196i8J27J15n4p5j20K7K02R4j54k29Q6J63J8j6lj93L6K21l9j59j10L4J25J29
$$ -98 29 144 90 15 -105 -78 124 218 64 -165 -79 84 102 86 83 -110 -74 147 108 -51 -161 -127 -2 127
2220A27j38j33J32p5J24J16k14j32J82R7k6J4j06r6J71J50j42m3q1J1K31L6l30
$$ 127 -11 -144 -12 -87 37 153 -61 -193 -11 86 60 74 -32 -128 43 193 51 8 -73 -62 169 205 -125
2243a25M0R6j12K20J27l96m8K96j09M3O0k05o2L09n4j41Q6j44k7L06o3k34J60
$$ -125 -85 11 -101 119 246 -150 -198 98 -11 32 92 -113 -175 134 80 -61 25 -119 -146 160 97 -137 23
2266B3j9l5J23L5j99M4J02q0J19q9j70J87J16j99P3K6k49J27J75j59l4J35j48
$$ 23 4 -31 92 127 -72 -28 74 -6 113 24 -146 41 157 -42 31 57 -192 -65 110 -49 -83 52 -96
2289i6J02J78j91j48K45o1r0K74j98j27L06j05j55J70l5j90J60J33k63R0N7j38
$$ -96 6 184 -7 -155 90 29 -61 213 15 -112 194 89 -66 104 69 -121 39 172 -91 -1 56 -82
2311h2P9J61k83P8J17j71J24Q8k98K4L61k58m4J91j51o4L59j29k73L16n0j97K24
$$ -82 -3 158 -125 -47 70 -101 23 111 -187 -163 198 -60 -104 87 -64 -128 231 102 -171 145 95 -102 122
2334A22l0k03J97O0k80J94J02k78Q9K00k92M0J54j55N8K24l56N5K39k01k4K45
$$ 122 92 -111 86 146 -134 60 162 -116 -27 173 -119 -79 75 -80 -22 202 -154 -99 140 -61 -85 160
2356A60k75rK50j54m4K36j66r6L03j21j92K32o6j91L42o9l34K36R3k99K51M9m12
$$ 160 -115 -124 126 -28 -72 164 -2 -98 205 84 -108 124 58 -133 209 140 -194 42 135 -164 87 136 -276
2379b76K61J72l08K13K7l11K32J80l08N9K15k82Q0K17k36m2L09k92O4K24k94k2
$$ -276 -15 157 -151 62 89 -222 10 190 -118 -59 156 -126 -46 171 -65 -107 202 -90 -26 198 -96 -118
2401a18L22k10q9K48k19q1L80k87j19L03k05r5L23j44k22L38p2k83L35kk98L05
$$ -118 204 -6 -95 153 -66 -147 233 -54 -173 130 -75 -170 153 9 -213 125 53 -230 105 103 -195 110
2423A10J6l67L11Q7l29K04J37k75J44J76l48Q8K08k29oJ77k04N3J80k35L9J39
$$ 110 126 -241 70 157 -172 32 169 -106 38 214 -134 -46 162 -67 -73 104 -100 -47 133 -102 -63 76
2445G6j21r4J84j00o9J74o2p2J45n2j36K46j26l6J63l4j62J80L3k67K53n1j33
$$ 76 -45 -139 45 -55 -124 50 -12 -84 61 9 -127 119 -7 -43 120 86 -76 104 137 -130 123 72 -61
2468f1J24Nj17L9P3j82J85jk20J29J17k24J35R3j96L4J98j48r6J38m5p2K10k6
$$ -61 63 68 -49 -10 63 -119 66 65 -155 -26 91 -133 2 95 -101 -67 131 -17 -113 25 -20 -92 118 92
2492I2o9K8%o8J15n9o3P9or4Q8N6j72P7R8j45L7K9p8j5Q2Ml6k0l8O7P4p9rL7j0
$$ 92 23 51 51 -17 98 39 -24 55 49 -45 43 99 -73 4 102 -43 -6 23 -55 -70 12 16 -20 -40 -78 -11 63 -16 -25 12 2
2523BrN4L2j62J09N6j15J05j0j40J22M6q9k8J7q9R6J19j73n9J07Lk2J37j60q4
$$ 2 -7 47 79 -83 26 82 -33 72 62 -78 44 90 1 -27 -10 -99 -3 116 -57 -116 -9 -6 -28 109 -51 -135
2549a35J80rr1P8Jj84K61O1j99Q6l2r5J85Jj71M2M1n9J53jk38N5P2n5J19J4k28
$$ -135 45 36 -55 23 24 -160 101 162 -37 49 17 -78 107 108 -63 -21 20 -39 114 113 -125 -70 2 -53 66 80 -148
2576a48N1K07j28n0R9j86R9K32j21j50J02j1K3J84j92j14J74n1L0J75j91k10K67
$$ -148 -97 110 -18 -68 31 -155 -56 176 55 -95 7 -4 19 203 11 -103 71 20 50 225 34 -176 91
2599I1Nj12Q6r1j68K49O2k17pO2j50K81O9k97lR8o1J74P8k56n6K63r0L5O3k95
$$ 91 96 -16 70 -21 -189 60 122 -95 -102 -40 -190 91 160 -137 -140 -42 -103 71 149 -107 -163 100 10 45 108 -187
2625a87J11K80j72p6J12j58J1K98j07k41R7k4l1K94j73k10J66L2l8J93j43l19
$$ -187 -76 204 32 -44 68 -90 -79 219 112 -129 -32 -56 -87 207 34 -176 -10 22 -16 177 34 -285
2647b85K65K15k52O4M2k10J04K65k00l7k5n4J90J48k91n8J98j68J39J73l72l8
$$ -285 -20 195 -57 7 49 -161 -57 208 8 -29 -54 -108 82 230 -61 -119 79 -89 50 223 -149 -187
2669a87K50j7k9O3j94m9L07o4j40Q9j86oM08j52k39J23J5r9K70K5l55J47J55j71
$$ -187 63 46 17 80 -114 -163 144 80 -60 29 -157 -163 245 93 -146 -23 -8 -107 163 188 -167 -20 135 -36
2693c6J59m6l22K31K08k87Q6N2l23K43K94k83j56K28j51M0K88k09k33L08p0j19
$$ -36 123 77 -245 -14 194 -93 -7 45 -278 -35 259 -24 -180 48 -103 -63 225 16 -217 91 21 -98
2715i8K89k20j72K93N1j47J21j03j66K97J9k14M2Rj33K25M7k79P7R3j30J32P4
$$ -98 191 -29 -201 92 143 -4 117 14 -152 145 164 -50 -8 1 -132 93 140 -139 -62 31 -99 33 107
2738A07k57O2K20j63L2Q7j96k0K90j49j24J29o0k5K49j33j99K08m2p0K07r9j91
$$ 107 -150 -88 132 -31 1 88 -108 -128 162 13 -111 18 -42 -67 182 49 -150 58 16 -54 153 54 -137
2761a37K05O7j90J05m2j87J87J91l28J02O6j34R3J62k66LJ55j67P7J90k35o5K90
$$ -137 68 135 -55 50 8 -179 8 199 -129 -27 39 -95 -2 160 -106 -103 52 -115 -38 152 -83 -148 142
2784A42j14q0K29k32j17L18m6k25J64o0j57K82l0k14J27L2j38J28O5k30J58Q7
$$ 142 28 -52 177 -55 -172 146 100 -125 39 -21 -178 104 74 -140 -13 19 -119 9 74 -156 2 89
2806H9j60K7J41j74J7J58j17m7J29j47Q1J83k15l2J53j57N5J55j49p3J67o9q7
$$ 89 -71 -44 97 -77 -60 98 -19 -66 63 -84 -3 180 -35 -67 86 -71 -16 139 -10 -83 84 15 -72
2829g2J78j51n9Q0Q0j51R5L1j59J60J01k28Q1R5j55J21K1j20L1N5q6P5J29k26
$$ -72 106 -45 -104 -24 56 -95 0 31 -128 32 133 -95 -14 81 -74 47 68 -52 -21 34 -52 23 152 -74
2853g4M4J53j42K8L2p4k7R6kq3O7oq9Q4Pj15O2M6n5J4M4j44J04P2n6J1L6l5o9
$$ -74 -30 123 -19 9 41 -33 -60 36 34 -49 18 12 -77 7 14 -101 -39 7 -48 -34 10 -134 -30 42 -14 -3 33 -2 -71
2882g1J42l7m3P4n6l9M5P1j47M1Q6j33J10l6p6L2N8r4O3k1m6O5N8j31L9J13j32
$$ -71 71 34 -9 65 9 -30 15 86 -61 -20 66 -67 43 7 -69 -37 21 -73 -10 -31 -77 -12 46 -85 -46 67 -65
2909f5K8J13q3j03J66r9KJ66j05j23K02l0j25P6N7j97J42N3j40O5P4j87Q4J27
$$ -65 -37 76 -7 -110 56 -43 -41 125 20 -103 99 69 -56 20 77 -120 22 75 -65 0 74 -113 -29 98
2933I8k18M2J84j64K8J75k31kJ78j29K3J20j57k7K58j19j56K26j85p4K30k6j67
$$ 98 -120 -78 106 -58 -30 145 -86 -88 90 -39 -16 104 -53 -80 178 59 -97 129 -56 -130 100 74 -93
2956i3J32m1j04J59Mj78K08n3k06J86M7k34J61J12j95Q7J45k14M0J71k00M2J41
$$ -93 39 -2 -106 53 57 -121 87 34 -172 14 61 -173 -12 100 -95 -8 137 -77 -37 134 -66 -24 117
2979A17j20m4K09j56l7K22k03m7J43r8j35J85m2q5J27l9j17J22oj00J17Rj33J34
$$ 117 -3 -47 162 6 -31 191 -12 -59 84 -14 -149 36 -6 -91 36 -3 -120 2 -4 -104 13 22 -111 23
3003B3P6k46R3J15j70J65O9j89M7O7mp0J46j37j8Q2m7qO0j38N4J44j13q9J26q3
$$ 23 99 -147 -54 61 -109 56 125 -64 -17 50 46 -24 122 -15 -33 49 2 -6 54 -84 -30 114 1 -88 38 -45
3029d5oJ01r8J5qO9j07J11l8r0R4L6r8R0L1q5L6L8j2p0Q4n6l5P5m5o5J32m5m6
$$ -45 -51 50 -48 -33 -41 28 -79 32 -6 -96 -2 34 -64 26 57 -28 8 46 34 -36 48 -8 -43 32 -13 -78 54 9 -37
3058c7O8o2k6P0kk1J14j12k5L8L4j6k9Rj0Q4o9J7o1M9k1m0R3o1k2N9J4m3K2p0
$$ -37 31 -31 -57 13 11 -10 104 -8 -33 5 39 23 -6 3 -7 77 8 25 -36 13 -8 -48 45 -16 -38 21 35 -8 14 -56
3088e6j8J7L6jm0Q0m5M2pk5oO6k1k4M4%q1L8J15j44O9j6k8J6J4k2P3p0l2PN6o4
$$ -56 -74 -57 -21 -22 -62 18 -27 15 8 -17 -23 43 22 -2 42 42 -39 -1 114 -30 39 23 -5 11 25 3 76 6 -26 -19 37 -27
3120b7k4P1n4n2M2K0rL2k8k1K3M4j2N5p9m7J16Lo3M7kk5K9L8j02P3L5p7L8Lp4
$$ -27 -51 20 -34 -86 -44 -24 -33 -1 -29 -50 -27 17 5 60 -19 -66 50 53 -10 37 35 10 39 77 -25 48 83 6 44 47 -27
3151b7K1J5o8O8Rl0K9Mo1LN1q5j9J36l0k4Ll2k3P3j1q9J73m4p0J07q3n4R2M8n5
$$ -27 -6 9 -59 9 18 -12 17 21 -40 -37 14 -71 -90 46 16 -8 -5 -37 -60 13 2 -87 86 42 -28 79 -4 -58 34 82 27
3182B7K6l4o5R5Nj08O6Kk6J9N9p8m6M2K3J7k0J7j0oL7M8q4n6J03m9m3Q2J3j00
$$ 27 53 19 -46 49 54 -54 12 14 -12 7 66 -12 -58 -16 7 24 4 21 11 5 42 90 6 -50 53 4 -39 43 56 -44
3212d4O4L6n6j6On8Q3L2p1M0m5K2LK0j14M0P1Rn3O6r4K5J11o0K8qk8K2O4j10j4
$$ -44 20 56 0 -16 -10 -68 15 47 -24 16 -29 -7 -4 16 -98 -58 13 22 -31 35 -59 -34 77 17 45 37 9 31 95 -15 -29
3243b9J8k6L6N4o5j9N2n3PO9q3l3J11mo7P2l2p2Q4p1L8kk2l3J21K1j09Q3Jj7J6
$$ -29 -11 -37 -1 53 -12 -31 21 -32 -25 44 -39 -72 39 35 -32 40 8 -64 20 -51 -13 -15 -37 -70 51 72 -37 46 47 30 46
3274D6k6j01J27nk8jM4o2o3J22p5n4R2p4J8J02o6m1N8j2l9M9l0p8Q3L6j04O8M
$$ 46 20 -81 46 41 13 12 56 -6 -69 53 -22 -76 16 -58 -40 62 -4 -45 13 1 -38 11 -19 -97 -14 22 -82 -14 -10
3303a0j5Q6J6o6L9n2m0Q8m0m2L6%n1Q1L0j23P8J1p8MQ3j20LJ49pk9n1j2j3O4l8
$$ -10 -25 61 77 11 50 -2 -42 46 6 -36 0 0 -51 30 60 -63 15 26 -52 -48 35 -85 -82 67 60 31 -20 -32 -45 19 -19
3334a9%O5m6j3Q2r3m3R6pk0Nj8j0M6J0n7P4l1o6L0N0j11J31n7k1M9Mo3M2L3m0
$$ -19 -19 46 0 -13 69 -24 -67 29 22 2 7 -11 -21 25 35 -22 52 21 -45 -15 35 -76 55 -2 -23 26 30 -33 9 42 2
3365BK2P2q9J0J2J8k9K8l3k8P0o7k9J30q2m0J08j25PM9k2o6J02n6m2P4O6j20O3
$$ 2 24 96 7 17 29 47 18 46 13 -15 55 -12 -41 89 7 -33 75 -50 -43 6 -16 -82 20 -36 -78 -4 62 -58 5
3394EM7j26J19j9o5J01n5lP9j0j51O3R7j04L9K0p1%M7l5j2J02j24k4N8qk5Q3m1
$$ 5 52 -74 45 26 -39 62 7 4 83 73 -78 -15 82 -22 17 37 -34 -34 13 -22 -34 68 -56 -80 -22 -30 -55 28 -13
3423a3p0J34l0o7K6k7lQ2k5p9M1M6n7N0l8o2J03L7q3P8nj07N5M8n2MJ0k9N4j3
$$ -13 -83 51 21 -46 -20 -47 -50 32 7 -72 -31 15 -42 8 -30 -92 11 48 -35 43 38 -69 -14 34 -18 -14 -4 -33 21 8
3453Hn5N9K9p7K9K2j0l4P2m5j7J3JK9Jn7K7K5n2LM3l6rQ9r8L1N0l8m1P6l4nol0
$$ 8 -47 12 41 -36 -7 15 5 -29 43 -2 -19 -6 -5 24 25 -32 -5 20 -32 -29 14 -22 -31 58 -40 -9 41 3 -38 38 4 -1 -7 -37
3487c7L6L1jl2O9n1m6j0Q5n5N7p8qJ37q9j0K5j6l1M3J7n2k3jL2kK8r1P4L4o1m8
$$ -37 -1 30 29 -3 66 15 -31 -41 44 -11 46 -32 -40 97 8 -2 23 7 -24 19 36 -16 -39 -40 -8 -10 18 -73 1 35 -26 -74
3519g4R5m1L8M3m7PJ4M2p4P7l2m8Q6p2k4M8k5l8P8p6M5K3j00rM1L8p0K0K1k8Q
$$ -74 21 -20 18 61 14 21 35 77 3 80 48 0 86 14 -10 38 13 -25 53 -23 22 45 -55 -64 -23 15 -55 -35 -14 -42 -34
3550c4K1Qk2Nl4R3m4n7J05p1jK3K6q9N8Q9p4qO0p5j4O2m3lR2j67P8J28j33MJ6
$$ -34 -13 -5 -27 -22 -56 37 -7 -64 41 -30 -31 -8 18 -71 -13 76 2 -6 54 -21 -35 27 -16 -19 73 -94 -16 112 -21 -17 -1
3581aK6o1P2m2q2P8j4jN1m8pP9J6r6M2j4r5R9k2k8L8N1j02J23j5o7rL4l0J8J07
$$ -1 25 -36 36 -6 -88 -10 -24 -25 26 -22 -29 50 66 -30 12 -2 -97 2 -20 -48 -10 41 -61 62 47 -20 -29 5 -25 -7 100
3612A00j56K1L9K5m6O0j06J7Q2l5l3Ok0K6J17r1l2L2l8J8L7J8n4L5n6K4PK3r1
$$ 100 -56 -35 4 29 -17 43 -63 -46 36 1 -32 -26 -46 -20 97 6 -26 6 -32 -14 23 41 -13 22 -34 -10 -3 20 -71
3641g1N2P5o6N2k1k3K0O3j24M7j4k1N2N1q8J3Lk1L0P2q9L3J5j1k3O7o4o4O7j1
$$ -71 -19 56 -10 42 21 -2 18 81 -43 4 -10 -31 21 72 -16 -3 0 -21 9 81 -8 25 40 29 6 73 9 -55 12 1
3671Al8N0l6n6R7K9q6j5O5p2O4pj4O0l5%Npp0J13N8p0k4k7k3L3K0RoJ4J0k2O3
$$ 1 -37 13 -23 -79 18 47 -39 -54 11 -61 3 -4 -18 42 7 7 12 5 -65 48 106 36 12 -15 -38 -5 15 24 18 32 42 20 83
3704H3j10j4j3K9M6j2m5l0N7M8p5L9l9o8Q8M9J0j06N2L0K1k4m1p5Q8P9k8K5n9
$$ 83 -27 -41 -54 -25 21 9 -36 -66 -9 39 -36 3 -36 -104 -16 33 43 -63 -11 19 40 16 -25 -100 -12 67 39 64 5
3733El1N2Qq0K7M3n4KK8L4q9M1K2L2j1k4m5M1N6k3n0K0m2M4J0o3JN4o7O9J4n2
$$ 5 -26 26 34 -46 -19 24 -30 -28 0 34 -55 -14 8 40 29 5 -40 1 57 34 -16 4 -38 6 16 -47 -46 8 -59 10 24 -28
3765b8j3J7O3j6l3m8L8J6L1qKo4nJ00l0n6J6K2jK8K0j03L3J0%L2J8q3K4J16j19
$$ -28 -41 -24 39 23 -10 -58 -20 -4 27 19 21 -43 -48 52 22 -34 -18 4 3 31 51 -52 -19 -9 -9 23 41 -42 -18 98 -21
3796b1j1K6o7nJ44q1j2N5q1j6J06l9j6N8p4J6J01n2q1Q1kq2J18p4o9J29J7r7P3
$$ -21 -32 -6 -73 -78 66 -15 -27 28 -53 -69 37 -2 -18 40 -34 -18 83 31 -50 31 29 -53 65 -9 -78 51 68 -29 44
3825D4K9j75J30Kj03M4N5p2K8Q6j14J2O8j31O6P9j05nJ20r6l4J29j34PJ15jj19
$$ 44 73 -102 28 30 -73 -29 26 -46 -18 68 -46 -34 34 -97 -31 48 -57 -62 58 -38 -72 57 -77 -70 45 44 -75
3852g5J11J2j40J64j7j92J72J6j48J50J2j48P7L8j34R1O3p7m4R9j10N8O6j59J33
$$ -75 36 48 -92 72 55 -137 35 51 -97 53 65 -83 -6 32 -102 -11 52 -25 -69 30 -80 -22 44 -115 18
3877A8L2j26M0P5j04O8L3o1k2O0Nm7K0N0o8J9Rn4J34q1q5J23o9J5P8o1L5J2k0
$$ 18 50 -76 -36 39 -65 3 36 -25 -47 13 18 -29 -9 41 -27 -8 1 -53 81 0 -85 38 -31 -16 62 1 36 48 28
3906B8j02P8M4r2J01k5k8L9J6n5q1J39n2k9O4k9omJ8l8L6O2m4l7J8m7KJ7n9N3
$$ 28 -74 4 48 -44 57 32 4 43 59 4 -77 62 10 -19 45 16 10 6 24 -14 22 84 40 3 21 -26 -24 -7 -66 -13
3936a3L2k7l2K1km2O2mj3P0l8oL6jm7k9M1j4N7j2m3M7J3k2n0M9n3n1J04j9l8J0
$$ -13 19 -8 -40 -19 -21 -63 -1 -5 -18 52 14 8 44 43 -4 -33 8 -6 51 39 -4 43 56 34 -16 33 -20 -71 33 14 -24 -14
3968a4j8qjJ2kqK0n2R2l9k3N6J3j7rK5l5QM2nJ2N6j69M7N7p5J2P5p5p7J59j44
$$ -14 -32 -40 -41 -29 -31 -39 -19 -71 21 -18 -41 15 28 11 2 27 -8 0 42 37 49 105 -64 -17 40 -35 -23 52 -23 -100 59 -85
4000h5P9K2l2n7J20J2q9P3n4l0R2j4j50J44m6j5rP4j39J42Rj12R7m6JL3M9r7o
$$ -85 -6 16 -16 -73 47 59 -30 43 -11 -41 51 37 -113 31 -15 -30 -39 35 -104 38 47 -65 32 -14 -13 20 69 -28 -34
4029c4J0o7J05K4l7l2N9k6L2J4m7l5O8om4N1k5j2J16n3r3K3Q0q8M4Pj26O7O3j65
$$ -34 -24 -91 14 38 1 -31 28 2 34 48 1 -34 34 28 -16 35 10 -2 114 61 -32 -9 71 -17 27 34 -92 -25 38 -127
4059a27J07R0j10K9kOjJ7o4Q3m1Jl0P4m9k0P6o7NQ4n1l5P6r7J8O3o9j4R0k9m9
$$ -127 -20 70 -40 -11 -13 -7 -8 9 -55 28 -13 -12 -42 32 -17 -37 39 -28 -23 61 10 -25 51 -46 -28 35 -34 -48 42 13 -36
4090c6O6qp8OJ1L0m7K9mM3Nk7L0Ro4J3K6j3k6J05k7p4M9k8l6K9K3J5l5L5p7O2
$$ -36 30 22 -56 -50 -39 -9 -56 -27 -31 12 17 -10 20 29 -35 -22 4 -9 -35 70 43 -31 18 -10 -46 -17 6 21 -14 21 -56 6
4122FJ0n7Q5l6r3J09n8J8k3O2k7j3J9l8k3K4L9n1K4kk2O3k7k8O2n8L2P0p3K8l8
$$ 6 16 -41 44 8 -85 24 -34 -16 -39 23 -4 -17 2 -36 -59 -35 4 -47 -23 -25 -47 16 -11 -39 23 -35 -3 67 -6 22 -16
4153a6J1k2J2N0n1K0Prj0Lj0j1j3P0j1j9k0K0QM0n7J0jK1%Rq8L1L5j0j0lmK2k5
$$ -16 -5 -27 -15 35 -16 4 11 2 -8 -5 -15 -26 -39 31 20 1 -19 1 9 49 -8 2 1 22 22 31 -57 -26 9 -1 -11 -14 -18 4 -21
4188b1L6k7K5m0mK1M2o6M2k9LM2l5PRL9o5M7l%K6op0L4J2l6J5N6l4m6P4jk7o2
$$ -21 15 -12 13 -27 -31 -10 32 -34 8 -21 -18 24 -11 -4 5 44 -21 26 23 23 49 43 -27 7 19 -17 -2 54 20 -26 48 47 20 -42
4222d2oJ2J8K9o9M0Lj08J08N2j9l6K3j01O9P7p2L6j9K0Nj1n5O9l9J4k0M8o8M1
$$ -42 -48 -36 -18 11 -58 -18 -15 -123 -15 37 18 -18 5 -96 -27 50 -22 14 -5 15 20 9 -46 23 -16 -2 -22 26 -42 -1
4252aJ0J2L0k6J0k7L1l7jJ4k4o0J01o6J4KN3l8rN0p4N3K8q9N1j4k9N6j4nJ6K2
$$ -1 9 21 51 25 35 8 39 2 1 15 -9 -69 32 -34 -20 -18 35 -3 -12 38 -36 17 45 -44 7 -7 -36 20 6 1 17 39
4284C9l7j2M8k8l0N9p9K8K1k0QL2k4L7n4L0j2K1Jl2m1N3qlL9q5RN8l5K8j9P2p6
$$ 39 2 -10 38 10 -20 39 -40 -12 9 -11 -3 29 5 42 -12 18 6 27 28 -4 -45 8 0 -3 36 -49 -40 18 -17 11 -8 64 -12
4317a2l7L6QLp9OO2jk9N2l7RO1J0o7j3R3l3l5ll5N0L9om8jl7N8jJj9J0Jj8O3o7
$$ -12 -49 -13 -5 -2 -81 -75 -13 -14 -43 9 -28 -19 42 52 -15 -28 65 32 -3 -6 -41 9 48 42 -6 -7 -44 14 13 14 -5 5 6 -12 51 -16
4353a6rQm7L1M2J1qp2K5L9j6j3k1L7n1P1j4NJ5LQJ8m3k1L5Q5p8Nj7m7L4k1L8j
$$ -16 -25 -17 -64 -33 9 20 12 -60 -35 4 -12 -25 -46 -9 -60 11 -3 2 17 20 28 46 3 -18 17 102 24 29 12 -35 -1 -22 16 15
4387A5om3J6L1k8J0L5m2J0O5q6J6pK5k2M0l9mJ0%m3N4pj3J3j3OM6m0o1Q6j2pL1
$$ 15 9 -34 -18 13 -15 -5 30 -12 -2 63 -23 -7 -14 11 -11 29 -10 -14 -4 -4 -47 7 0 -13 0 -13 -7 39 -1 -62 24 12 5 36
4421C6m6k7P7l2o4R7qp7Q6q6L9O4p8M2nm2N7r6P6n6M4J7l6L9J8j12R1K2n5n0P8
$$ 36 -10 -37 40 8 -56 41 33 -44 42 -44 -5 59 -19 23 18 -24 33 -63 13 -43 1 18 -18 21 39 -73 18 40 -15 -65 13
4452A3o7M8R1o7o0R1o3J6j8L4l8J7L7k7LK2l4K5J5j5n1Q1k7o6M3q3L9K5RK4k6
$$ 13 -54 -6 85 18 -42 49 -14 2 -16 18 -20 -3 34 7 10 32 -2 23 38 23 -28 53 26 -40 3 -80 -41 -16 -7 17 -9
4483il1J7K4rk9N6l2L7m5J7n9R7j24J21rl6JN3rk4J6Mq1N6MPL8l8k4j3O6n4J7
$$ -9 -40 -23 1 -8 -37 19 -13 24 -21 -4 -63 34 -90 31 22 -14 -13 40 31 7 23 27 -54 2 6 13 51 13 -11 -24 42 -12 5
4516Erm6kN0rnM8J8m1L1n7rK8L9k0k6JQL0Jn8%j7K1k6Q6k3M0n9OJ0L6n7n1M0O3
$$ 5 -4 -50 -52 -2 -11 -16 32 50 9 40 -17 -26 2 41 21 -5 -4 4 34 35 -23 -23 -40 -19 -45 41 18 58 -1 5 15 51 -6 -57 -17 46
4552D6k7j0j8K9k0J6m5qK1O0l3Nl7M9lk2K3Lm2nL6l4l6M3j7oK5lJ4k5J6L3k3K4
$$ 46 19 9 -9 20 0 16 -29 -37 -16 44 11 16 -21 28 25 3 26 29 -13 -18 18 -16 -52 -9 -26 -32 -7 -10 4 -21 -5 28 5 29
4586B9ppj2j1M2L1l7l5N3l6j8q8J17j1N7m5Jn1N3n1M5l4Plk9J8j0M6l3k3J6J7
$$ 29 22 15 3 -8 34 65 28 -7 46 10 -8 -96 21 10 67 22 23 -28 25 -26 19 -15 -8 -11 -40 -22 -32 14 -19 -42 -26 -9
4618ik5J8L4k3l1L2j0O4p2K2L9l1L3k4Pn0P3n7NN0m0n1P8m0KK9o1ONrl5R2r0P
$$ -9 -34 -16 18 -5 -36 -4 -14 50 -22 0 39 8 41 17 24 -26 47 -10 -5 45 5 -46 32 -8 -6 23 -38 -32 -27 -36 -71 21 -69 -62
4652f2O1J4p2PK9l6N3K5k0J5j9mN0k4m3K4JL1q8L4J3k8N2mJ8jK8p8R6r6Kl8KR9
$$ -62 -1 13 -59 -52 -23 -59 -6 19 -1 14 -5 -9 41 17 -26 -2 -1 30 -58 -24 -11 -39 13 9 27 26 54 -24 72 -24 -22 -60 -58 41
4686D1l7no4L2K6l8N5J3k3pM2l4LJ3m6N7m8L7o8N5Ll9Q6q9m8J14n8L7J4n9pQ7
$$ 41 4 -1 -65 -33 -7 -45 10 23 0 -7 35 1 4 17 -29 28 -20 17 -51 4 7 -32 54 -35 -83 31 -27 10 24 -35 -42 45
4718D5k0m4N7Lq9K5P8j12O6M2m7O5n1l9L7l4J0K6J9m9Mk5J4JkJ0j6O2p6lK2L8
$$ 45 25 -19 38 41 -48 -23 55 -57 9 51 4 69 18 -21 16 -18 -8 18 37 -12 -8 -33 -19 -18 -20 -10 -26 36 -40 -43 -21 17
4750A7lj1oL7l8Rk9l0N5no0Q6rj6J5k8MM7o3J1J2Lk%K8k5ml2O7K6k0o7K2K6Lo0
$$ 17 14 3 -3 34 -4 5 -24 -54 1 -4 -64 22 13 -3 12 -16 -12 35 -28 -17 -5 -2 -4 -4 24 -1 -5 -37 30 56 36 -31 -9 17 20 -40
4786d0jM0l3J6J5L1j1j9J2J6l6M5J0o7L9Jj4k9Q5n5kk1j8K7k4L6J5rk7L9j2lj3
$$ -40 -41 -1 -34 -18 -3 28 17 -2 10 26 -10 35 45 -22 17 18 4 -25 60 5 3 -18 -36 -9 -33 3 18 9 -18 21 9 6 -7
4819gj2O8Oo9P2j18L3K4QPj0JKk2J6j7jL0k4L3Lm6j9O2m3pQ1q2L7L4k8MJ9o8P0
$$ -7 -19 49 55 -14 58 -60 -27 -3 5 12 2 3 5 -17 -1 -18 -19 11 -13 20 23 -23 -42 20 -23 -30 51 -31 6 40 12 16 35 -33 37
4854C7l8N3m3J8J6m2M2q2J2L0n7N7RKn7J0j3L1L0n4j5Q5J0n1K8j2L3l2J1r4K2
$$ 37 -1 52 9 27 43 1 43 -39 -27 3 -54 3 12 14 -43 -33 -46 -15 15 -39 -54 31 41 -10 18 6 39 7 18 -76 -54
4885e4R0p5K4N1p7O8L8r4J2L1l9NnK1mJ9m1k8J20l8nK2m6mM3n2l3L6K0n8O1Rj03
$$ -54 36 -39 -15 36 -41 27 65 -29 -17 14 -25 -20 -25 -4 -8 11 -30 -58 62 24 19 41 -5 -9 34 -18 -51 -15 5 -53 8 17 -86
4918h6J45l1r2J01K3m6RK4q4O7n4L3j8j2kL0no5L6R7r6%M2n9M1J2J0o1L1K1l8
$$ -86 59 28 -64 37 60 14 23 47 -37 30 -24 9 -9 -21 -23 7 2 -63 -27 70 -26 -26 16 -43 -2 10 20 -41 -10 11 -27
4949b7K6oPk1j9J4K6J7m9L6J2m6L9K2q3J16k1o5J9O1q6L5M5j19K0Q7j37L8P5K6
$$ -27 -1 -7 0 -21 -40 -26 0 17 -32 4 16 -30 9 31 -52 64 43 -22 -3 58 -28 7 52 -67 -47 40 -97 -59 16 42
4979D2o1L4o6O4J5o2O5m6nj9R3o6j1nM7l2J7Jq0N1jK9J3n1mJ0M1n3J8%N2m5Jj0
$$ 42 -19 15 -51 13 28 -34 31 -15 -20 -39 54 -12 -23 -28 19 -13 4 5 -75 -24 -25 4 17 -34 -38 -28 13 -40 -22 -22 30 -15 -14 -24
5013b4L8O5j13N7N0p2J1N0m0k4N8p0m2N6j8M3k4qL5jLl0K5n5K0O7j15J06j5o3
$$ -24 14 79 -34 23 73 1 12 62 22 -2 56 -14 -56 0 -18 25 1 -7 28 27 30 0 25 -30 -10 57 -58 48 33 -30
5043c0L5l6j6K8M2j6k9k6O0J9q2O8o9J04n7K9k3K8Km6K5M1o8N3k4J7nNNqK4j14
$$ -30 5 -31 -47 -19 23 7 -22 -48 12 31 -51 17 -52 52 -5 24 1 29 31 -15 10 51 -17 36 12 29 24 29 34 26 50 -64
5075f4O8L4k6l1M0o2N2j0j8J7lMJ3Jlk3Nkk5M2l7N5m8J8L0l9M2q4J7M5k2J9J3
$$ -64 4 38 12 -19 21 -41 11 1 -17 0 -3 1 14 15 12 -11 -6 -8 -33 9 -28 27 -21 -3 27 -12 30 -54 -37 8 -14 5 18
5108A8lj4jJ9j5K7l4kO8m7J6j5j6j2k7Lj4L9j3%O9m3k1l3k2R7m0L7n3L4J6Om6
$$ 18 15 1 0 19 4 31 -3 -5 63 16 32 17 1 -11 -38 -35 -49 -10 -23 -23 46 3 -18 -51 -73 24 -16 21 -32 2 18 24 -22
5141b2M3J0lj2M3kn0j5qM5k2J5j6Ql1M0l7KM5j9m8M1k0J0ml4K4j4L2o8N5O8j04
$$ -22 21 31 28 16 59 57 7 -8 -16 29 7 22 6 14 -17 23 -14 -12 33 14 -34 7 -13 -3 -7 -41 -17 -31 1 -67 -12 56 -48
5174d8K3J6L3kj2m8L4K3mk8N4k8o3N6M9n3Nm2M1nJ6o6Q3p4J0M8m5PK5J7n8N4L
$$ -48 -25 -9 24 22 10 -38 -4 19 15 -13 41 13 -50 6 55 2 7 -35 6 1 17 -49 34 -40 -30 18 -27 -20 5 22 -36 18 21
5207B1o4K8O6n7J5Np8N4J8q6Q5Pm8NM7o5j0N6k4MQ8q1L7j0l6L5jl5k4M3j1K6J9
$$ 21 -43 -15 51 -6 9 14 -64 -10 8 -78 7 14 -34 -29 18 -47 -57 -1 -25 -21 67 -14 23 13 -23 12 11 -24 -48 -5 -16 10 29
5240B9%n5M2nl8QJ1l1L3J1j9M3qm3M9l6k8mN2%j3Qn8M4Ql0L9NK4m1L3j0o1J04
$$ 29 29 -26 16 11 -27 -19 -8 -39 -6 5 -14 29 21 -22 27 -9 -37 -41 11 11 -2 6 -52 -8 0 -30 9 14 38 -3 30 20 -41 63
5274F3o1k4N6m6k5P4n8nO2p1oK5j2k4L8K4j12J05Pj13Q6M1j0n1K8n0N8Rplk5L5
$$ 63 2 -22 34 -12 -37 37 -21 -26 36 -35 -41 -16 -28 -52 -14 10 -102 3 10 -103 -17 24 14 -37 -9 -59 -1 8 1 -2 -27 8
5306HK6k7Jl2K7lk4R8p0n2J10n8k7L5l5J7K8j6n2N4rJ3nj1l3L0Oj1Plk5M9J3k9
$$ 8 34 7 8 -24 3 0 -24 74 4 -48 62 4 -23 12 -23 -6 22 6 -46 8 -1 12 7 -4 -37 -7 -1 -12 -5 -8 -33 16 29 0
5340@l3M4j3k5M6m4K5jn8O4M3qo0M1J5j14J19j8o5M8rM3l4j4K7k0Pl0O3p0j8J13
$$ 0 -33 11 -2 -27 19 -25 0 -1 -59 5 48 40 -20 21 36 -78 41 23 -42 6 -3 40 6 -8 19 -1 6 -24 39 -31 -49 64
5372F4q5ml0R3o5k7M2Kj7M1m9M0R4j62P1l1KL5n3J7pL8nj7RM7q1n8J05m4P4J1
$$ 64 -21 -25 -55 38 -27 -54 -12 -10 -27 14 -35 5 99 -63 8 -23 -21 14 -39 -22 -29 9 4 -13 -4 43 -38 -96 9 -35 39 50
5404E0o9O7j2m8K8Pk8RK5m5j1lN4o4L8k1m5J08o3L6J6m9k6J0P5n3k6nM2J3j4j3
$$ 50 -19 48 36 -12 16 23 -5 4 29 -16 -27 -30 24 -40 -2 -23 -68 40 -23 13 29 -20 -46 -36 39 -14 -40 -45 -3 10 -4 -17
5436a7RRJ7K3J0k6j8mm5L3MoL3l9J7l9M7k3k5N1j9mM6j6n6Q3j2m8J9k3jJ4N6r5
$$ -17 -8 1 18 41 51 25 7 3 -42 -9 -5 -11 22 -17 0 -39 8 -15 -40 11 -8 -12 34 18 -38 45 33 -15 4 -19 -20 -6 50 -45
5470d5O0m6NRM4q2R1m9%J1ll5oJ49j09l1LM3k1N0Rp0K7j5mO8o4PK6J6m1K1qK3
$$ -45 15 -31 -26 -17 27 -55 36 -13 -13 -2 -5 -40 -46 103 -6 -37 -34 9 -12 38 47 -23 4 -11 -15 53 -11 -4 22 38 -3 18 10 33
5504C3J5m3K6l9krj2P9r9K5J3N4n9K9J4p5N1j6k1K2O2q0O4k9n4N4M1l9J8K0j04
$$ 33 48 5 31 -8 -10 -19 -31 48 -51 -26 -13 41 -18 11 25 -50 1 -15 -36 -14 48 -32 32 3 -51 3 44 5 23 43 -61
5535f1P4P7j28R0j6p2J6N9l8k7LLl1R2n5nM4p2K4j3K3mQ2k9l6K1j8lM3m2l0O2
$$ -61 13 90 -38 52 36 -36 -20 39 1 -26 -23 -20 -51 41 -14 -19 25 -47 -23 -36 -13 -17 65 36 0 21 3 0 43 1 -29 33
5567C3m9pN9j0Ok3Nl9K7M3q3J22j01K4j0NJ3J4L9p7j9M0M7j08R6q0L8J5l5MQ8
$$ 33 -16 -23 36 26 32 9 14 -25 2 45 -38 84 -17 7 -3 2 15 29 68 -9 -28 12 59 -49 47 -33 5 20 -15 -11 77
5598G7r3PQM6o4O8n8%J1j3lP3L0j15NJ7j6K1M3j05O3K6p6M1M1n0N7J4n9l8P6o5
$$ 77 -16 -9 -1 45 -19 49 -9 -9 2 -11 -14 59 89 -26 -21 -4 -20 1 44 -61 2 28 -48 -7 34 -16 41 55 -4 -42 34 -31
5630c1NP7r1M6k0k0M0Mm3l4N6K7n6M6K6q1P5j7n8N4N5j29P8J9m9O3Pn1MN1j00
$$ -31 -26 51 -40 6 -14 -34 6 10 -33 -67 -11 16 -40 6 32 -49 26 9 -49 5 60 -69 9 28 -21 42 49 -2 2 53 -47
5661d7R9k0lm3L7m1O7m4OK3j5o0N9Pm3J2k8k9L9M6pOk0L3o1L5mm8L8Nj5mO0q5
$$ -47 52 32 29 -14 23 -18 49 5 11 34 19 -41 18 25 -18 -6 -34 -63 -24 22 15 21 1 34 -27 8 4 -44 -6 -1 -16 -20 40 -45
5695d5J22n5k1j3L1l8nM1n5N2L0n5Nk3J1M5L0q7rM6K9k9L7n1j0J4J3r4Q1O0o4
$$ -45 77 22 1 -12 19 -19 -24 17 -38 14 44 -11 -6 -29 -18 27 57 -30 -39 7 36 7 44 -7 -17 -3 10 -84 -3 57 -7
5726gj7mN6l3M3m7oK1L1K7j8K2o6K9o9N9K0n3nM9k8j0N6k6k9kP1j01P7j3o0P0
$$ -7 -24 -28 28 -5 38 -9 -15 6 37 64 46 68 2 31 -38 21 41 -12 -17 32 4 -6 50 24 -5 -7 64 -37 40 27 -33 37
5758C7j8j7JK7l9K3j2LoJ6K5l2j6K9K8o3j1k8O5L7r8N9k8J7Lk9j7L0K3rJ1J6k3
$$ 37 19 2 3 30 -9 14 2 5 -1 15 40 8 -8 21 49 -14 -25 -53 12 49 -49 10 -18 -1 2 -27 -44 -14 9 0 11 27 4
5791Dj6P0l9P1p4m6M5k7Jj3O1l9l6O9kn4m3P5JJ5k5j3pL3j1jJ9n2N3pl5J8j2J
$$ 4 -12 58 19 90 16 -30 15 -12 -11 -24 37 -2 -38 31 29 -25 -68 7 8 23 -2 -15 -22 11 0 -1 18 -34 19 12 -23 -5 -17 -16
5825a6QO3l7k3k7j8K1J40q6k0j7rNM0l4M9m9j4k5P9k7k5M3r6O5M5j04Q5J5qKn9
$$ -16 -8 55 18 -5 -32 -50 -29 111 25 5 -12 -21 -16 24 -10 39 -10 -24 -49 30 3 -22 21 -75 -10 35 -69 16 31 23 25 -34
5857c4N5n7N9Rl4kqM9j3M9o1j1Ok8M2jm4P2n3J7K7m4n4N4J8J4Oo3J6jP1p0RL6
$$ -34 21 -36 23 32 -2 -4 -12 37 24 73 12 1 7 -21 21 20 -24 48 -5 12 39 -5 -59 -5 13 27 33 -30 -14 -15 56 -14 -5 31
5891C1mr6Q1J0m2kkL4n8O6m1M1J5n0L2m4J8lNJ1k0L8m9oM3Ol2P8n3O2m3k6l3N9
$$ 31 27 -69 12 22 -20 -22 -24 10 -48 18 -23 18 33 -17 15 -29 -11 -14 -9 2 -18 20 -29 -35 8 14 -18 60 7 69 26 0 -33 26
5925B6m4OL4k0J3J7r1jJ00n5k4mK1K4J1k8m1N5K8p0L6M5n7MQmM5J9m4j5K8L5p4
$$ 26 -18 -12 22 2 15 32 -59 -60 40 -15 -39 -43 -22 2 13 -15 -56 -1 27 -43 -7 38 -19 -15 -7 -11 34 53 9 -6 22 57 -17
5958a7O2l0p1O5j7JJK8j5M7l5l8K7nj8K3k4J2j1L0j6j1k8L7n4O1j0k8P1l5j5O
$$ -17 45 15 -56 9 -8 -7 -6 22 7 54 19 -19 8 3 -15 8 -16 -4 -15 15 -1 -12 -40 -3 -57 4 -6 -34 37 2 -13 -7
5990gL6j9jqj4M8l4ML1n9M0K3m1J8OOo8O8n6K2K0j9J4j0l9K5KPJ8jn2N0lK1p0
$$ -7 29 10 9 1 -13 35 1 5 36 -23 17 40 -1 17 23 29 -39 29 -27 -5 15 -4 10 0 -39 -14 -12 -5 13 12 -40 10 7 28 -42
6025d2MO8n8j8M7l4L4M2ll1l3P0m3JK7n0P1Mo4k0L0J2j6l4pN9pJ0o7K6j6L8K7
$$ -42 -38 30 -28 -46 1 -33 1 43 40 9 -24 46 3 4 31 -19 52 56 -8 -28 2 14 -2 -36 -43 16 9 19 -48 -22 -38 0 27
6058B7Lm0j8j2M4rJ0J0Jj3m1N4jm7L3J0J7nk2j5m7R8n2M3klNl1NMLMQk3J9k5N0
$$ 27 30 -10 -28 -40 4 -5 5 15 16 3 -38 16 15 -32 1 11 28 23 1 -14 -61 37 -15 28 26 23 28 -3 2 6 9 13 21 -2 17 -8 42
6095D2r2L6j7K7o3M9%m8R3J3j5l9K5l0oJ5J1k1LM8j4N6j06L8M0n6R4r5J4j0K4
$$ 42 -50 -14 -31 -4 -67 -18 -18 -66 27 40 25 -14 11 -19 -25 -10 1 -20 -17 31 17 73 -33 5 45 -11 83 -12 2 -8 16
6126A6j5OK1n0J7rk0L9M5p3n8R3Ql2m5L3J9l3j1NL2M2m2M6J8r4N2jm3Q2l9n1N
$$ 16 1 7 28 -22 -5 -14 -34 5 50 -23 -81 12 20 -12 -57 -24 -5 -38 -49 -44 -12 30 -12 34 52 -42 10 9 -34 48 9 -42 -37
6159c7M4J5j7jk7ON1m5k6P6l5o1J16j2m6J4k3j4R2l3m6j6Kk2MPj5K9QK0j3k7k6
$$ -37 7 22 5 4 -23 -17 34 -11 -37 39 4 -57 59 47 1 15 -8 -22 70 37 -9 -25 -23 -45 -41 -34 -49 -20 -12 8 -5 -32 -58
6192e8M7M8k7n2O5p1Q8m2Ln5P0m8J6O7j0j7KlJ1K0o5k5P2mj02J11m4KMP3j37M6
$$ -58 -11 37 10 -42 23 -48 40 -2 1 -54 16 -32 -16 51 41 24 26 23 34 54 -11 -36 36 32 -70 41 -3 -1 3 76 -61 -15
6224a5pK5j3J1Kq5J30r6N8L0l9Ql4m7O6j7L3k8N7n8j0oL9M1m0k1L7N1m9lL3k3
$$ -15 -22 3 -10 1 3 -82 48 -48 10 40 1 9 -25 -72 -6 -23 10 -18 39 -19 -29 -35 4 45 5 -16 21 72 23 20 53 30
6256C0q9J03m3LK5k7l9N6K4m2pN0qn6K7j1j7L2J6m9J8j5l9N9m2J5M2j9o6J23m3
$$ 30 -59 44 1 4 29 2 -37 19 43 1 -6 44 36 -20 7 -4 -21 11 27 -22 -4 -19 -58 1 -41 -26 16 -3 -69 54 11
6287A1Ol5M2n5LM1p3N4J7m7M5j2j5K5l1K1j7J3qrJ1K6Rk9j9k2P7J7m8jNk1M2l7
$$ 11 17 -18 24 -31 -28 13 -60 -6 11 -36 9 -3 -18 7 -24 -3 -20 -7 -15 -24 -13 13 22 -7 -26 -48 29 46 -2 -3 2 -19 23 -14
6321a4n0L0K6L2J6m3k1J2qJ7j2j1oL3K0K7m2l2k7N6K5l6O7qm5jL2m4o9N6L2j5
$$ -14 -64 -34 -8 24 40 -3 -24 -12 -20 -3 -15 -26 -32 1 21 48 6 -26 -53 3 28 -8 59 51 6 5 37 -7 -76 -20 12 -3
6353coLK8j6Jk4m7N3j7N0K7o9K3Rm3J06n2Ln7J1J7OOL1Qk9N0q4J8Ok3K6K%j7K3
$$ -3 -9 -6 22 6 7 -17 -64 -11 -28 22 49 -20 3 12 -31 75 23 26 -31 -20 -3 3 9 40 48 19 69 -15 3 9 -14 12 14 14 -3 20
6389B0L5n4lo4L8PK0j3K4k5lk5QJ2M7Qo9O8j1j2K2k1l4M5j3n4N9o5Q0mJ8m1M9
$$ 20 55 1 -2 -66 -28 -21 -1 -14 10 -15 -18 -43 -35 -23 24 32 -37 31 20 8 30 9 -25 20 7 -47 12 -53 27 23 41 0 49
6422D9m8rKl1J7M7KoK7n4l5J1L7lL0m5oK5o0O9%jm0O6ml6M7m8Pk3oLK2K9j01R1
$$ 49 1 -8 -6 -37 -20 27 29 23 50 -4 -39 -28 9 6 36 -9 -15 10 -50 19 19 18 -22 44 40 4 51 3 10 -13 -19 -16 6 35 -66 25
6458B5m2L2l6K0QJ5j2qm1N8O0p5J3J5j8Rj1j4LJ7K7r5L1rP6o3k6Ql2P5m9Nj3J7
$$ 25 -17 15 -21 -1 7 22 10 2 -39 19 79 4 17 32 14 23 12 -2 1 18 45 -50 -19 -28 48 -15 -41 -33 -65 10 -39 -34 -47 -30
6492c0J3m0N2J4L3Rn0j0m0M0j3L7q5R3k3l6R6r0O4K4j8j9rl7P3On4L2Rl1o4O5
$$ -30 -17 -57 -5 9 42 51 1 -9 -49 -9 -22 15 -70 23 0 -36 60 -30 34 58 40 21 12 -25 48 54 0 32 41 10 -54 11
6524A1J2m3K4K3J0n0k0O8nqL4j8n1o7N8K9qK8l3K3k5LJj%L4k3N2m4j5m2Q2j8k
$$ 11 23 -20 4 27 37 -13 -33 35 30 22 56 38 -13 -80 -22 7 -1 27 -6 17 -8 -5 -4 -5 -5 29 6 58 14 -1 -43 39 21 19
6558A9l2Lj2M9n1K7M4n9M4p4K9N7j3n2M6k0j8j4K0k1qL1j7K9J0qJ7k7ljln5O2
$$ 19 -13 -10 -22 27 -24 3 47 -12 32 -42 -13 44 31 -21 25 5 -13 -27 -7 -28 -36 -5 -22 7 17 9 26 -1 -4 -5 -8 -63 -1
6591aJ0K4j9J3k8J7K1o5L5j1ok1j6M2J7L9k1l5rL4m6P4n4j2M6m6j4N6pk1j3K3
$$ -1 9 33 14 27 -1 16 37 -28 7 -4 -10 -31 -47 -5 12 51 30 -5 -14 20 -26 48 -6 -18 28 -18 -32 24 17 -4 -17 6
6623Fm4J6QJ8M9j9l7J7l3K8PM8l6m3N9m2J8k1kPj5NO2n9j0j4K4k2LL9m4M9J3j9
$$ 6 -38 -22 -14 4 53 34 -3 14 -19 9 16 64 28 -15 44 2 20 -1 -3 4 -11 -6 56 -3 -13 -27 -3 -25 -22 17 -27 22 35 16
6657A6Pn5L3pj4j5l2N1j7L7m3J0Mj8O0j2j2mL7jj6%NK2o5M5J8j5j4l0M5j3M9q0
$$ 16 23 -32 1 -6 -20 -35 -67 -16 -33 4 -39 -29 -25 -43 17 5 -7 -11 26 25 9 9 14 36 -29 16 34 19 5 -25 20 7 56 -24
6691b4L7J1m2L2Ol5l0K5N6j9Ko9qL1QJ5l4Q3p9K0O0p2k9P4l7NL9m7K4M8m6k0K
$$ -24 13 24 -18 14 20 -15 -45 -20 36 17 19 -50 -58 -27 -19 -4 -38 45 -34 -14 46 -26 -55 19 -18 -13 26 -21 3 51 5 -15 -13
6724a3K9l3J6J0L6p2O8k1j5oQj9qJ4J0nj1l7P8l1j9KNj9jR8p9K5K0J3m9m3M8K8
$$ -13 16 -17 -1 9 45 -27 41 20 5 -1 7 -12 -20 -6 4 -1 -12 -49 29 -2 -21 -19 -14 -33 -34 64 -15 10 30 43 -6 -49 -1 27
6758B7j7nRrl7N2kn1L1K2pm2L2ll5N3k6J9jj2l0lM6J2n8K4ML3o5K1M8q5K0N6N
$$ 27 10 5 14 5 -32 20 18 -33 -2 20 13 -29 3 0 -35 18 -8 11 10 -2 -32 -35 11 23 -35 -11 -7 26 -39 -18 30 -55 -35 21 26
6793B6o7L7m1L8J7L1l0m2O4n3lNK1K2jk1M6k1q7M8P5q5k6R8J8o9L2pl1l0K7N6
$$ 26 -41 -4 -45 -7 10 41 11 -31 33 -20 -23 -18 3 25 24 3 49 28 -59 -11 64 -21 -47 51 69 0 32 25 -6 -36 -9 47
6825D7p2J5L3%j3Qk1kl1MO8j8m4M2Lk8Jn7P5Jl3O3L0p4mM4o6j5N3Pm3Q3k8k8K3
$$ 47 -25 -10 23 23 10 18 -3 -5 -36 -32 36 18 -26 16 19 -9 -8 -65 10 11 -22 41 71 -3 -7 37 -29 -44 9 16 -27 56 28 0 23
6860B3k6L8J1q8M6LL4k5j8M5k5k5L3j9kj9m1N4J4j9J5l1k4M4K4ln0L8j2j5O2k9
$$ 23 -3 35 46 -42 4 7 41 16 -2 43 18 -7 26 7 5 -14 -55 -1 13 -6 9 -22 -46 -2 22 19 -31 7 -5 -20 42 13
6892A3kk3L2l2L3K1j1L5n7KK3m0k0RL5kkJ7r7Q8k0nk8J9Pk4K1K0j8M8o8L7pk8
$$ 13 11 -12 20 -12 21 42 31 66 9 11 34 -6 -26 -17 18 16 14 31 -66 22 2 -3 -31 -12 -5 -29 -8 12 -6 42 -26 11 4 -24
6926b4K6l4Pl0M2L8m9J1k8PL8K3Ol2M2o3j6K4J5Kpj3K3J0n8P8p7P7l1j6nk5J8
$$ -24 2 -32 -25 -55 -13 25 -24 -13 -41 -34 4 27 33 1 43 -20 -36 -12 3 5 -2 -15 8 18 -40 38 -39 38 7 -9 -14 -39 -21
$$ [...]
8191c7
##END NTUPLES=NMR FID
##END=
