##TITLE=1H_LR-758-R43-KA5-CR20
 CDCl3
 8 sc, 
 29.12.2023
##JCAMPDX= 6.0         $$ Bruker NMR JCAMP-DX V2.0
##DATA TYPE= NMR FID
##DATA CLASS= NTUPLES
##ORIGIN= UXNMR, Bruker Analytische Messtechnik GmbH
##OWNER= root
$$ XWIN-NMR		Version 3.5
$$ Fri Dec 29 13:51:46 2023 Russian Standard Time (UT+4h)  she@DPX200
##.OBSERVE FREQUENCY= 200.1313
##.OBSERVE NUCLEUS= ^1H
##.DELAY= (6, 6)
##.ACQUISITION MODE= SIMULTANEOUS
##.ACQUISITION SCHEME= undefined
##.AVERAGES= 8
##.DIGITISER RES= 18
##SPECTROMETER/DATA SYSTEM= spect
##.PULSE SEQUENCE= zg30
##.SOLVENT NAME= CDCl3
##.SHIFT REFERENCE= (INTERNAL, CDCl3, 0, 15.7039)
##AUDIT TRAIL= $$ (NUMBER, WHEN, WHO, WHERE, WHAT)
$$ ##TITLE= Audit trail, XWIN-NMR		Version 3.5
$$ ##JCAMPDX= 5.01
$$ ##ORIGIN= Bruker BioSpin GmbH
$$ ##OWNER= she
$$ F:/spectra/data/she/nmr/H-F/1/audita.txt
$$ ##AUDIT TRAIL=  $$ (NUMBER, WHEN, WHO, WHERE, WHAT)
(   1,<2023-12-29 13:50:05.32 +0400>,<she>,<DPX200>,
      <created by zg, POWCHK disabled, PULCHK disabled
       configuration hash MD5:
       00 E9 B6 7A A2 85 ED C7 34 08 36 98 17 FE 4E 26
       data hash MD5: 16K
       57 D1 AA 9F C6 D3 04 A1 5A 11 CA 72 B6 0D 8A 91>)
$$ ##END=
$$ 
$$ hash MD5
$$ 2C 27 B3 B7 53 21 38 68 2D EF A1 00 B5 47 FD 32
##$RELAX= 
##$RELAX= 
##$RELAX= 
##$RELAX= 
##$RELAX= 
##$RELAX= 
$$ Bruker specific parameters
$$ --------------------------
##$DU= <F:/spectra>
##$EXPNO= 1
##$NAME= <H-F>
##$PROCNO= 1
##$TYPE= <nmr>
##$USER= <she>
##$AMP= (0..31)
100 100 100 100 100 100 100 100 100 100 100 100 100 100 100 100 100 100 
100 100 100 100 100 100 100 100 100 100 100 100 100 100 
##$AQSEQ= 0
##$AQ_mod= 1
##$AUNM= <au_zg>
##$AUTOPOS= <>
##$BF1= 200.13
##$BF2= 200.13
##$BF3= 200.13
##$BF4= 200.13
##$BF5= 200.13
##$BF6= 200.13
##$BF7= 200.13
##$BF8= 200.13
##$BYTORDA= 1
##$CFDGTYP= 0
##$CFRGTYP= 5
##$CHEMSTR= <none>
##$CNST= (0..31)
1 1 145 1 1 1 1 1 1 1 1 1 1 1 1 1 1 1 1 1 1 1 1 1 1 1 1 1 1 1 1 1 
##$CPDPRG= <>
##$CPDPRG1= <>
##$CPDPRG2= <>
##$CPDPRG3= <>
##$CPDPRG4= <mlev>
##$CPDPRG5= <mlev>
##$CPDPRG6= <mlev>
##$CPDPRG7= <mlev>
##$CPDPRG8= <mlev>
##$CPDPRGB= <>
##$CPDPRGT= <>
##$D= (0..31)
0 1.2 0 0 0 0 0 0 0 0.06 0 0.03 0 0 0 0 0.0002 0 0 0 0 0 0 0 0 0 0 0 0 
0 0 0 
##$DATE= 1703843404
##$DBL= (0..7)
120 120 120 120 120 120 120 120 
##$DBP= (0..7)
150 150 150 150 150 150 150 150 
##$DBP07= 0
##$DBPNAM0= <>
##$DBPNAM1= <>
##$DBPNAM2= <>
##$DBPNAM3= <>
##$DBPNAM4= <>
##$DBPNAM5= <>
##$DBPNAM6= <>
##$DBPNAM7= <>
##$DBPOAL= (0..7)
0.5 0.5 0.5 0.5 0.5 0.5 0.5 0.5 
##$DBPOFFS= (0..7)
0 0 0 0 0 0 0 0 
##$DE= 6
##$DECBNUC= <off>
##$DECIM= 32
##$DECNUC= <off>
##$DECSTAT= 4
##$DIGMOD= 1
##$DIGTYP= 9
##$DL= (0..7)
0 120 120 120 120 120 120 120 
##$DP= (0..7)
150 150 150 150 150 150 150 150 
##$DP07= 0
##$DPNAME0= <>
##$DPNAME1= <>
##$DPNAME2= <>
##$DPNAME3= <>
##$DPNAME4= <>
##$DPNAME5= <>
##$DPNAME6= <>
##$DPNAME7= <>
##$DPOAL= (0..7)
0.5 0.5 0.5 0.5 0.5 0.5 0.5 0.5 
##$DPOFFS= (0..7)
0 0 0 0 0 0 0 0 
##$DQDMODE= 0
##$DR= 18
##$DS= 0
$$ [...]
##$SUBNAM2= <"">
##$SUBNAM3= <"">
##$SUBNAM4= <"">
##$SUBNAM5= <"">
##$SUBNAM6= <"">
##$SUBNAM7= <"">
##$SUBNAM8= <"">
##$SUBNAM9= <"">
##$SW= 18.0517328524113
##$SWIBOX= (0..15)
0 0 2 0 0 0 0 0 0 0 0 0 0 0 0 0 
##$SW_h= 3612.71676300578
##$TD= 16384
##$TD0= 1
##$TE= 0
##$TE2= 300
##$TE3= 300
##$TEG= 300
##$TL= (0..7)
0 120 120 120 120 120 120 120 
##$TP= (0..7)
150 150 150 150 150 150 150 150 
##$TP07= 0
##$TPNAME0= <>
##$TPNAME1= <>
##$TPNAME2= <>
##$TPNAME3= <>
##$TPNAME4= <>
##$TPNAME5= <>
##$TPNAME6= <>
##$TPNAME7= <>
##$TPOAL= (0..7)
0.5 0.5 0.5 0.5 0.5 0.5 0.5 0.5 
##$TPOFFS= (0..7)
0 0 0 0 0 0 0 0 
##$TUNHIN= 0
##$TUNHOUT= 0
##$TUNXOUT= 0
##$USERA1= <user>
##$USERA2= <user>
##$USERA3= <user>
##$USERA4= <user>
##$USERA5= <user>
##$V9= 5
##$VALIST= <valist>
##$VCLIST= <CCCCCCCCCCCCCCC>
##$VD= 0
##$VDLIST= <DDDDDDDDDDDDDDD>
##$VPLIST= <PPPPPPPPPPPPPPP>
##$VTLIST= <TTTTTTTTTTTTTTT>
##$WBST= 1024
##$WBSW= 4
##$XGAIN= (0..3)
0 0 0 0 
##$XL= 0
##$YL= 0
##$YMAX_a= 406054
##$YMIN_a= -366553
##$ZGOPTNS= <>
##$ZL1= 120
##$ZL2= 120
##$ZL3= 120
##$ZL4= 120
##$ABSF1= 10
##$ABSF2= 0
##$ABSG= 5
##$ABSL= 3
##$ALPHA= 0
##$AQORDER= 0
##$ASSFAC= 0
##$ASSFACI= 0
##$ASSFACX= 0
##$ASSWID= 0
##$AUNMP= <proc_1d>
##$AZFE= 0.1
##$AZFW= 0.1
##$BCFW= 1
##$BC_mod= 2
##$BYTORDP= 1
##$COROFFS= 0
##$CY= 11.3945322036743
##$DATMOD= 1
##$DC= 2
##$DFILT= <>
##$DTYPP= 0
##$F1P= 15.7292609196834
##$F2P= 12.9074282941183
##$FCOR= 0.5
##$FTSIZE= 0
##$FT_mod= 4
##$GAMMA= 1
##$GB= 0.15
##$INTBC= 1
##$INTSCL= 1
##$ISEN= 128
##$LB= 0.24
##$LEV0= 0
##$LPBIN= 0
##$MAXI= 10000
##$MC2= 0
##$MEAN= 0
##$ME_mod= 0
##$MI= 1.114404
##$NCOEF= 0
##$NC_proc= 0
##$NLEV= 6
##$NOISF1= 3.799351
##$NOISF2= 2.8
##$NSP= 1
##$NTH_PI= 0
##$NZP= 0
##$OFFSET= 15.70392
##$PC= 1
##$PHC0= -24587.04
##$PHC1= 6.852731
##$PH_mod= 1
##$PKNL= yes
##$PPARMOD= 0
##$PSCAL= 0
##$PSIGN= 0
##$REVERSE= no
##$SF= 200.130013532006
##$SI= 16384
##$SIGF1= 3
##$SIGF2= 2
##$SINO= 400
##$SIOLD= 16384
##$SREGLST= <1H.CDCl3>
##$SSB= 0
##$STSI= 0
##$STSR= 0
##$SW_p= 3612.71676300578
##$SYMM= 0
##$S_DEV= 0
##$TDeff= 0
##$TDoff= 0
##$TI= <>
##$TILT= no
##$TM1= 0
##$TM2= 0
##$TOPLEV= 0
##$USERP1= <user>
##$USERP2= <user>
##$USERP3= <user>
##$USERP4= <user>
##$USERP5= <user>
##$WDW= 1
##$XDIM= 8192
##$YMAX_p= 0
##$YMIN_p= 0
$$ End of Bruker specific parameters
$$ ---------------------------------
##NTUPLES= NMR FID
##VAR_NAME=  TIME,          FID/REAL,        FID/IMAG
##SYMBOL=    X,             R,               I
##VAR_TYPE=  INDEPENDENT,   DEPENDENT,       DEPENDENT
##VAR_FORM=  AFFN,          ASDF,            ASDF
##VAR_DIM=   8192,          8192,            8192
##UNITS=     SECONDS,       ARBITRARY UNITS, ARBITRARY UNITS
##FACTOR=    0.0002768,     1,               1
##FIRST=     0,             0,               0
##LAST=      2.2672688,     0,               0
##MIN=       0,             -366553,         0
##MAX=       2.2672688,     406054,          0
$$ Real data points
##PAGE= N=1
##DATA TABLE= (X++(R..R)), XYDATA
0@%%%%%%%%%%%%%%Lj1J6j6J6j6K4l2L2l7M5n2O0o9Q1r5J08j20J36j54J73j94K16
37A14k41K69k99L31l68M07m49M98n50O05o66P34q08Q89r80J081j195J324j469
56g73J635j830K060k332K668l091L632m360N392o954R568j4684K8051j22283k63252
71c66553M15484J53762k68885J73500K98746k84335k29630K33251M7871j93289
81b0078J00612J38938j65071j02485R1958n6532j35627N2538R9348m2298n6435
92i5132L7544K8201n7503j5967J06389N2493r0137j5680J00505M391l2627Q3152
104A05629J3107j17838j217O5343o0073o343J05270n1325j17688P0911M0163j29724
116h3785j3723J02884k3280l5023O9115j204o5466L220M495N722Q2305J2878q8985
$$ y = [0, 0, 0, 0, 0, 0, 0, 0, 0, 0, 0, 0, 0, 0, 0, 3, -8, 8, -8, 8, -8, 16, -16, 16, -21, 24, -28, 32, -37, 44, -51, 57, -63, 73, -81, 92, -102, 114, -127, 142, -157, 174, -194, 213, -236, 262, -288, 317, -349, 385, -423, 466, -514, 567, -628, 696, -773, 862, -968, 1092, -1240, 1428, -1663, 1969, -2391, 3001, -3953, 5615, -9069, 18982, -103301, -366553, 48931, 202693, -66192, 107308, 406054, 121719, -107911, 125340, 173211, -20078, 80534, 219472, 54401, -48084, 43874, -12658, -148285, -95747, 3601, -38697, -95132, -57588, -29387, -86890, -102857, 3532, 56025, -34112, -49792, 50713, 55104, 22477, 105629, 118736, 898, -319, 65024, 4951, -1392, 103878, 52553, -65135, 5776, 45939, -83785, -97508, 5376, -17904, -52927, 16188, 14984, -50482, -47262, -42767, -37045, 45260, 58138, -30847]
129c0847J4957N3906o5936p08J14783k9660j04612M0630K6350p1899L3480P4301
141E4745n6189k7191N8400m3344o9616N9299L6231m3352L2083M6557n9817k9859
153d2053M3464o251m322N3437j3255o0040K8929L9084l1227N593M3395l5745o2289
166d1280J5191L9438k745r800J1586N020l1264l5302J5770K9059k0557m346N0877
179B1647q85m9552J9087K4973m4903R857O9838k2560m2652N2782Q154o8160K6777
192D403O1992n0858l2611N8758j4853o2775L8336L8594m7839J510M3480m1295
204c158m4706L6817R507k9748L1373L4435l6018k6678J5305r233j5508K4485K0625
217G498p830m678k758r472O91P522L989N931o62p591M500R827K408P769K279j6595
$$ y = [-30847, -15890, 38016, -27920, -28628, 86155, 56495, -48117, -7487, 18863, -53036, -19556, 54745, -1444, -28635, 29765, -13579, -83195, -23896, 12335, -31017, 1066, 47623, -12194, -42053, 1411, -4840, -9162, 44275, 31020, -29020, -91, 38993, 7766, 13359, 56754, 21009, -41280, -26089, 13349, 10604, 804, 12390, 17410, -13854, -49156, -33386, -4327, -24884, -29230, 21647, 20762, -28790, -9703, 15270, -29633, -19776, 50062, 27502, -15150, 37632, 45786, -22374, 4403, 66395, 15537, -17074, 41684, 26831, -35944, 2392, 40986, -6853, -5343, 38137, -3158, -47864, -11047, -1540, -31288, 85, 34520, -1498, -28176, -12871, -22104, -37612, -13127, 7498, -332, -5010, -7768, -17240, -16549, -9027, -5038, 893, 231, -7360, -2860, 6967, 9375, 17144, 19423, 2828]
233B828p484R098j916k001J5891P77j7229L099N289k0442r106J0281m252p16K2790
248F907M597j6232o9j29j3192O045J6524k061L210J8412J72r041K717j1139j8936
263a2215J1571J9113l857M072Q209k3130j7411J5173k477k0761J0402J2529j4780
276a3562M836K3291j5862k7753J0439R744j2071J3486K4483j4245j4277K1138
288I647O376k0856r08R803j1121j85K8149Q661k4671j4177J869r012l287K0708
302I96R444j7659o659J2686l979j3435Q259J0779o796O277K4000l730k4255K042
316b030J2867l278R618K0815j2725k7160K848P572j0534J098J1261j0675j1809
329a2132J2408K044k0362q040M306p87J1581K2256J185j5474o871r89L28J1655
$$ y = [2828, -4656, 4442, 2526, 525, 16416, 17193, -36, 3063, 8352, -12090, -21196, -10915, -15167, -15883, 6907, 11504, -4728, -4797, -4926, -18118, -12073, 4451, 2390, 5600, 24012, 24184, 15143, 17860, 6721, -12215, -644, 18469, 14612, 18684, 26893, 3763, -13648, 1525, -952, -21713, -11311, 1218, -13562, -8726, 14565, -1297, -29050, -18611, -8867, -20938, -7452, 17031, 2786, -11491, 9647, 16023, -4833, -5741, 4062, -7059, -7244, 20905, 29566, 4895, -9282, -7413, -16425, -19712, 996, 10440, -7219, -13878, -1192, -5171, -18606, -10347, 432, -6364, -87, 23913, 20183, -4072, -2030, 10837, 7559, 17177, 37992, 25267, -1893, 955, 8527, -2007, -909, 10352, -323, -12132, 276, 2320, -18042, -26082, -21776, -22563, -10982, 11274, 12459, -3015, -9886, -10875, -10547, 1108]
343A108J2503o03j105M998j708o814n537q412n073J0346J2771k68o661j1206j3406
358a9067p21J1630P343j778k927k274j136N044O154k168o083J245N616L556J269
373E703l020o101k556P284R388k38q078o185l524j71R504R201m132n697L080N71
389E029l926J914J80q426K567J4752L323q017j048n023j1164M404J3004n098p829
404e358P018K593n935L873J031j6492j0364J1705R626K056O154l88j6360q723
418a9564O057L057J386Q570P163j988k424r33o289o181P839J3192N474q79l751
433A0729j0568q415N695J3198N675j777n934j1039q348L741Q857M389M899J892
447A2994j0135j0644k04n23n52J2028J1324m124q208l780o055k791R695P625k570
$$ y = [1108, 13611, 13008, 11903, 16901, 15193, 8379, 2842, -5570, -10643, -297, 12474, 12206, 5545, -5661, -19067, -19788, -8158, -815, -2593, -5520, -7794, -8930, -3886, 2268, 100, -5983, -4738, 878, 4434, 5703, 2683, -3418, -5974, 1310, 10698, 10460, 2382, -3803, -7327, -7498, 2006, 11207, 7075, 1378, 4458, 5029, 1103, 3017, 3197, -5229, -2662, 12090, 15413, 7396, 6348, 1325, -9839, -5435, 7569, 2471, -5358, 1660, 4253, -1682, 2191, 3222, -13270, -23634, -11929, -2303, -247, 5907, 5519, -10841, -19564, -13507, -10450, -9064, -494, 6669, 4681, 2257, 1324, -4965, -11146, -3307, 9885, 15359, 14480, 10729, 161, -8254, -2559, 10639, 16314, 14537, 8603, -2436, -10784, -7043, 1814, 6203, 11102, 12994, 2859, -7785, -7989, -8512, -9064, 2964, 14288, 10164, 1956, -1824, -7879, -10670, -975, 6650, 4080]
462D080j903k4m541K656J1267n11j0891k083Q10m098N323J3725K132j0601q214
477b873o077q264j255R174N509j322j954o156r547k646N550K373Q18N492M440
492f738j286J372R136N546l051j241K049J003K731O075P970O037l229j2050j0562
507C762l120j313O68J0829R792o254j4899p649l836m994L804J1905P281k2k939
522C015m394m917k54M966N428O192M122m951j0015K20Q004L268j254j968p365
537I7j1222k378R319Q957K273o194j1986o894K919K938K901J0726N326j0234o316
552i768P189K198m859N912J0284k064q292l122j252R20O410K686l110n790r919
567a2577j0279M072J3295M439l027p97j579m314n91M612N953N120N447P008N432
$$ y = [4080, 2177, 2153, -2388, 268, 11535, 11024, 133, -1950, -1140, -5238, 85, 13810, 15942, 5341, -2873, -8950, -17214, -18469, -9295, -3786, -5108, -7062, -13218, -22765, -25411, -19861, -17488, -16670, -11178, -6738, -8024, -6652, 2484, 8030, 4979, 3738, 5787, 6790, 9521, 15596, 23566, 29603, 26374, 14324, 3762, 642, -671, -3, 10826, 20618, 14364, -535, -8184, -12020, -17014, -13210, -1305, 5976, 5954, 3015, -1379, -6296, -6550, -1584, 3844, 10036, 14158, 9207, -808, -588, 7416, 10684, 9430, 7462, 97, -11125, -13503, -4184, 4773, 7046, 852, -11134, -18028, -15109, -12171, -9270, 1456, 6782, -3452, -9768, -2579, -381, -5240, 672, 10956, 8892, 600, -2522, -3774, -2854, 3556, 6242, 3132, -2658, -12577, -22856, -18784, -5489, -1050, -4077, -4874, -6453, -10767, -11358, -6746, -793, 4327, 9774, 16782, 22214]
582B2214k380r421n808K428P148O951K11q262p851n677p869M86P338n127j3674
597a9293k16O933j146J70N969k09m094K873M758L758P935N102qN145L106j0364
613A0419n408Q565L952k426N64n358j3403m737N879L784J283l755j4069q924O049
628a7585R460N171N394j709r768l872L913L097N115M683j924Q87M930m954q056
643e218R04J029j551M839N611l565m699Q66l66R7K259k934k710N921M970J04K292
660G849j560q452j327M981J51J454M187l183l020M941k312j0220n29M631o20N462
676B433Q935p345j3457o89K252J843J0736O492r663p340J39k145L269J0884L001
691I345m270k07j918p116P70N216N17K746N215l025q153l201j438r19L552J684
$$ y = [22214, 19834, 10413, 4605, 7033, 14181, 21132, 21343, 13081, 5230, -447, -8316, -7830, -492, -5619, -19293, -19509, -12576, -13722, -13552, -7583, -7792, -11886, -9013, -4255, -497, 7438, 12540, 12532, 17677, 20783, 10419, 5011, 13576, 17528, 15102, 15666, 10308, -3095, -7832, -1953, 1831, 3114, -641, -14710, -23634, -17585, -8125, -2954, 2440, 731, -9037, -12909, -8996, -5899, -784, 3899, 1975, 2862, 7792, 2838, -5218, -4314, -3285, -4836, 3, 5614, 2049, -2650, -1784, -2150, -2053, 206, -2728, -5438, 483, 5453, 5557, 7849, 6289, -2163, -3490, 1491, 1642, 3096, 7283, 4100, 1080, 6021, 3709, -6511, -7040, -2409, -3029, 2433, 11368, 4023, -9434, -10123, -7871, -6028, 4708, 11200, 1537, -5803, -5664, -7809, -4540, 6344, 9345, 5075, 4868, 2950, -4166, -3396, 1820, 2337, 5083, 10298, 7273, -880, -4081, -5519, -6438, -2886, -1202]
707a202r84P25j011j633J638j484n955Q45O098L207M006O054m855q278K242K934
723B347k398N663N833o733l712O349j508n763K179p9o587J205N718j092l92L384
739D414l029n113J809J1l427K546N060j496q32J211l192l178J33k265M5L309O41
756c353L92M358j5n752r94J302j630K967P589J057j708J067j970m559K217K799
772C767k991P41K629k021j968K541l43l492o86j389j585K894L794N66R01K89m544
789h97k527L291M85Q0K707j77k003J507O94k562k00M07l127p0M443o21k379L164
807B215J186l930j15P45m934j327N497J553O2K651k018o533j662K604n59Q67M622
824I24J364m03M42o84l336j682J154K274L917J459k761j648j310k124N54R14k699
$$ y = [-1202, -2186, -1461, -2472, -4105, -2467, -3951, -9906, -9061, -2963, 244, 4250, 10304, 5449, -2829, -587, 2347, -51, 5612, 11445, 4712, 1000, 7349, 5841, 78, 2257, 2178, -4409, -3204, 2514, 1422, 1030, 4414, 1385, -3728, -1919, -1908, -5335, -2789, 2271, 775, -57, 1154, -2038, -5216, -5083, -7348, -7303, -3994, -3353, -2961, 1397, 1382, -4370, -5364, -4062, -5692, -2725, 4864, 5921, 4213, 5280, 3310, -1249, 968, 3767, 776, 1517, 4146, 2125, 157, 2698, 2355, -1137, -1823, -3212, -4797, -1903, 1891, 2457, 3358, 3647, -897, -3424, -133, 352, 432, 3139, 2962, 959, 2466, 3160, 598, 398, 805, -2322, -2392, 2051, 1430, -949, 2215, 3401, -529, -644, 101, -4833, -6160, -663, 890, 952, 3603, 1585, -4948, -6610, -4006, -4565, -3698, 924, 2288, 1885, 2327, 1643, -1693, -3375, -2221, 53, 3970, 5429, 2668, 1020, -290, -2414, -1860, -946, -3645]
841c645k206K218J732N94J881j127m625j8M475J990K130K555j636k412L443L299
857H648j147j27n20l787j685K164r23j008K127p36k766k757l417n315L29O075
873d845N463K821m5o486o582Q33L519L857N407K012l004r52Q14k394j265Q87k43
890b03N31L640O28k976j826n58j983M28J467k770k009L159K079K74O76l096o286
907h825r77L660L724L065K188l110l522P66J196J000K844J520k99J927J002k904
923C255r84J301l42K300L236k798n563r7l3J80M199K354m389l450Q84j108r61
940b016L775K22l256K408K765k890k062k43l758j050M138J957j372J71q26k343
956d380r4J35j540J255L225J267K794K196l470l882J329Q64J090M589Q12m011
$$ y = [-3645, -5851, -3633, -1901, -1307, 574, -553, -5178, -5196, -721, 1269, 3399, 5954, 4318, 1906, 5349, 8648, 7501, 7374, 6854, 3067, 1382, 3546, 2623, 1615, 3742, 3006, 240, -2517, -5934, -11249, -10920, -4845, 618, 3439, 3394, -3092, -9674, -8841, -5322, -1465, 3942, 5954, 2950, 1998, 2812, 418, -847, 40, -203, 328, 3968, 4596, 1620, -206, -764, -2747, -2319, -852, -3622, -5631, -2472, -393, -119, 557, -2539, -8825, -9802, -6142, -2418, 647, 2835, -275, -3797, -3031, -1835, -835, 2009, 3529, 3230, 5157, 6159, 3255, 2271, 3572, 3230, 5530, 8766, 5968, 405, 308, 275, 455, 4654, 7008, 2619, -831, 53, -1055, -2016, 1759, 1981, -1275, 1133, 3898, 1008, -1054, -1297, -5055, -6105, -1967, -10, -1382, -1211, -2037, -4380, -4474, -4339, -5879, -4624, -1399, -132, 2662, 4858, 1388, -2494, -1165, -301, 789, 5378, 6190, 2179]
972B179n59R25l196q63K329k742k080L767P71l246K28R92l010J011L818j390j827
989b893K222m34o20N309J437l963j41L92l260O24M003K25l31K290j337l529j41
1006a47n94j982L030M029k172j181P57l443j971K784p27k405J885o03k141L950
1022i31K458m028j231K138l018r07O510K469j674K621J18m396l2K400k292J299
1038A504M878j520k705J621r17m395J641J913j544Q90J722k006j87K182k176n77
1054C24L534j738m356K069M70k847K657K929l996k885P20m520k089N997J822k489
1070d398L167J686n663j457M640K0Q45N303K79k646J356l1k259K475R64m449j133
1087a301J824j538q6K946j911m328k41n67j272L828K186k741J291L618k733l65
$$ y = [2179, 1620, 2545, -651, -1514, 815, -1927, -4007, -240, 531, -2715, -2487, -1495, -4505, -3494, 324, -1066, -2893, -671, -1105, -1725, 3584, 5021, 1058, 917, 1309, -1951, -1327, 2676, 2901, 2570, 4860, 3523, -6, -147, -741, -2723, 307, 4336, 2164, 983, 1740, -1703, -3674, -890, -1617, -4022, -2137, -2740, -4881, -931, 1527, -2501, -3732, -1594, -4612, -5519, 991, 3460, 1786, 4407, 4525, 129, 97, 2497, 205, 1504, 6382, 4862, 2157, 3778, 2861, -1534, 107, 2020, 476, 1366, 3088, 1082, 895, 3077, 901, 324, 3858, 2120, -2236, -167, 303, -2544, 113, 3042, -954, -3839, -3119, -7639, -9728, -3731, -1909, -4398, -1231, 455, -5208, -6665, -2025, -2005, -1160, 4143, 4422, 1776, 3132, 3101, 842, 3317, 4281, -168, -1301, 523, -1015, -1101, 1845, -66, -4394, -4635, -5202, -6474, -2646, -460, -3201, -1910, 1708, -1025, -1390]
1103a390L829k063k691L836K176j704L319J348m448n40K220l906j952N204J185
1118D423j420L481L07o389j626J634k202J090M283q52j694J428j322m345p98n38
1134d540j597L799M671n55j531p60m847q64N750K321r36K074n06m443J467M136
1150C639j709j809J441k726k699L490Q41k605J471N25l502p31J434j282O60L889
1166C27P9j686J068r85j701L637K475l091o94K68j471J542M950j055l380m60k027
1183b204j980M060L199k118Q1K262j859j861J862r35k281K862K879K94R98m24
1199D835m661j620J943J51K46K571l35k604M84L01k578j51R58j238K41J931j795
1216a321j779J639l91j448M36j95k240R31K810N11J75M30k570n63L519J354o10
$$ y = [-1390, 2439, 376, -2315, 1521, 3697, 1993, 5312, 6660, 2212, 1672, 3892, -14, -1966, 3238, 4423, 3003, 6484, 6791, 402, -1224, 410, -1792, -702, 3581, 2729, 1035, 2463, 1141, -3204, -4002, -4540, -6137, -2338, 2333, 1778, 247, -513, -5360, -6224, -474, 1847, 911, 2985, 2479, -1964, -497, 3639, 1930, 121, 1562, -1164, -3863, -373, 468, -2137, -666, -141, -3643, -4374, -2940, -4222, -3562, 327, 406, -1280, -212, -1197, -2898, 739, 3214, 123, -571, -303, -1774, -232, 4718, 3663, 283, -177, -2204, -4184, -124, 3075, 957, 1038, 3300, 1441, -420, 1442, 507, -1774, 1088, 3967, 4261, 5259, 4835, 174, -1446, 497, 648, 894, 3465, 3130, 526, 1010, 1311, -1267, -1418, -460, -1698, -1457, 474, -1321, -3100, -1461, -1852, -3300, -2864, -3059, -5299, -4368, -1558, -1047, -872, -442, -3012, -3575, -56, 1298, 688]
1233F88J129k56k524J409L832pj445r17k742j942K333K228l06M55q3l106j893
1250c147J136j57P2K740J404m75jl54j296J184Q15j020J98J153l80N12J997m73
1268C908k682j619o94l72J773K164p75j213m14k019j215J853o9j275L01J115l22
1285a555n52K19o40j069K77P07N03J389K98l92K94Q82p55M94Q50m99k05P01l68
1304E79L75J006j14j332l24m71j867L80J982K42l0Q85k04j178k0R98k63P96J092
1323B532QL42J420o59j969p67r99r56L65J577L2n74p12j511j686K04O98K44J163
1342a248O13p6J11O44J41J96J35j029m24J099P99Q94Q83j013j797j051m86o66
1360b275O50J705M93o2M61j057j599k30n4K1J356J640k51n87pr40j214J67J10
$$ y = [688, 1817, 1561, -963, 446, 4278, 4271, 2826, 1909, -833, -2775, -442, 1786, 1480, 1935, 1852, -1254, -3147, -2011, -2168, -2096, 644, 2048, 1573, 1572, 1218, -78, 1106, 1921, 901, 1099, 2252, 1872, 2384, 4381, 3908, 1226, -393, -1087, -1459, 314, 2478, 1703, 490, 76, -1943, -3158, -1305, -1374, -2649, -2348, -1233, -1555, -2107, -1888, -2528, -3597, -3320, -2613, -2110, -721, -423, -815, -521, 361, -394, 100, 950, 451, 246, 947, 579, 954, 1960, 1846, 514, 190, -281, -2148, -1768, 214, 456, 426, 1311, 1107, -71, -91, 907, 644, 1440, 2532, 2540, 2882, 4302, 3643, 1674, 907, -92, -1048, -683, 894, 926, 352, -360, -1871, -3557, -3353, -2655, -2411, -1248, -635, -711, -600, 44, 185, 381, 516, -513, -937, 162, 961, 1855, 2738, 1725, -72, -1123, -1609, -2275, -1625, 80, 573, 511, 972, -85, -1684, -1914, -1968, -1947, -591, 1049, 798, 211, 204, -736, -1950, -1783, -1673]
1379a673J93J272J371L32m71j82n16n32J196Q85J78M73L87k38Q4N49j079j096
1397A133p76n42j44O27J85j320n26q5p95L3K21l73m80P40J297R39L18k8o18l35
1417e29J94O2L83O71L69K91L51q29j663j538k59K08J241J352J32j053k13o32l65
1436a827j94L15J18R15J500J046o32o99j024o35M75J105J020P45k50m23J72l6
1454A691o00k27J12L0M12P29k07p68p81J55l97J18M9j39j098R45J346k14N86J66
1474A908j034n77Q36J65m50N7O96Jm88k59j671k136j062J55M14P45M45q77j153
1493d285m54q4P7O04R24J657J832R42L26j55p59k96R61J377P27r9K83r96j233
1512A349l21r41r41M1l13j4N92l2r39m76O22K64j92Q91P25k2J351J259l58M33
$$ y = [-1673, -1480, -208, 1163, 1495, 1024, 842, 326, -206, 990, 1875, 2053, 2526, 2913, 2675, 2759, 3308, 2229, 1133, 357, -185, -329, 298, 483, -837, -1363, -1448, -2243, -2210, -1989, -2362, -2842, -2102, -805, 134, 452, 424, -194, -529, -335, -273, 110, 781, 1150, 1441, 1792, 963, -700, -2238, -2497, -2289, -1048, 304, 436, -617, -830, -1462, -1827, -2021, -1706, -1588, -673, 827, 1873, 1241, 542, -482, -1117, -642, 463, 1483, 2228, 1978, 1555, 1727, 1691, 1091, 864, 976, 1006, 1418, 2147, 1940, 1172, 391, 546, 149, 267, 316, 177, -921, 24, 1370, 1156, 1742, 1908, 874, 297, 1133, 1298, 848, 905, 1601, 1602, 1114, 855, -816, -2952, -4014, -3859, -3445, -2700, -2255, -3132, -4285, -4739, -4823, -4746, -4142, -3218, -1561, 271, 1213, 1539, 1384, 625, 329, 1290, 2667, 3394, 3295, 3578, 2582, 1349, 1028, 87, -854, -813, -1126, -1140, -548, -580, -1519, -1995, -1373, -1109, -1301, -410, 315, 293, 1644, 2903, 2545, 2978]
1532B978m83o77o6J158M13j82n1p68j225M9K09o69n80k42r33n56R19M16j145Q32
1552f03j72k012o0M22k00Q73J604P50m85n69m15j240J016Q95L94O43K81o58r27
1571d63M62p72p34L57k1l58J033N90r97L80J75j109n9J456l3K19J919M84n28K41
1591B242k5j850p7J128l26k52J233p94k150L70k74j716P39R42p23O9J202m64L36
1610c90J367Qj071N58P43m22J236J743p29p30m81j681j325Q28O29n75O53m80j824
1629a943j83L66o96K13J372o52p59J663L17l60J445K47k370K28J003p53O42K345
1647B125r96j620J148p60j395J106J111j003M28J583o33m68R88j088j153J178
1663E51N10r14J339N52j469k05O60j425n01Q62j78k67J517J77j022N62J53j638
$$ y = [2978, 2495, 1818, 1752, 2910, 3323, 3141, 3090, 2322, 1097, 1146, 1355, 686, 106, -136, -1069, -1625, -706, -290, -1435, -603, -775, -2787, -2847, -2425, -2625, -1752, -148, 602, 117, -452, -867, -2107, -1091, -196, 198, 841, 1122, 464, -463, -1, -773, -1507, -1150, -1171, -1529, -496, 94, -903, -523, -348, -1457, -1516, -60, -93, 126, 2045, 2529, 2001, 2242, 2217, 367, 290, 1418, 1092, 840, 2073, 1279, -871, -501, -775, -2491, -1752, -810, -1533, -1464, -262, -726, -390, 977, 985, -86, 472, 1215, 793, 2029, 3772, 3043, 2313, 1832, 151, -1174, -346, 283, -292, 361, -119, -1943, -2126, -1760, -2456, -2243, -871, -1523, -2282, -619, -302, -662, 783, 1030, -1340, -1112, -109, -862, -220, 2125, 1129, -491, 657, -103, -1498, -392, 719, -284, 144, 1727, 1094, 626, 1614, 526, -627, 551, 1061, 147, 1486, 2038, 569, 364, 1024, -401, -902, -40, -218, -485, 1032, 1209, 187, 749, 902, -736]
1681g36l39J264o74k12K465j09k258O6m89j977J115K185r80n02Q08j178o88J947
1699b92J14q65K51M92j065Q86J839o30l98J69j205r69J148l7q36J459M72j266
1717g33r9J130j060k65J656l74k84J633M68q80J365N37k525l52J221m32l47K083
1735B742m65j627P9o06j457N73J003r02M10J726l01r15L07r77j561J125J173k10
1753A17O80K34k121n12M99r11j51J203o19q22Q89K30j095J238J006j142k37J238
1771b76l06J40K167L01j223M33j45j635M53J654n07k28M74j008p38J359m5j111
1789b41K18k6j140Q34J887j74m59M16j205j405J190O53p12J205R54j412j86Q30
1807A227j457n06J361j79o89J426P6j276K89N8j795j57J170l92k66J209o58j536
$$ y = [-736, -1075, 189, -485, -697, 1768, 1659, -599, -533, -1022, -2999, -1884, 301, -679, -1181, -373, -1551, -2239, -292, -178, -1043, -792, -300, -1365, -479, 1360, 730, 332, 501, -704, -1673, -525, -562, -1398, 61, 533, -733, -832, 298, -762, -1027, 629, 255, -29, 1604, 2072, 1192, 2557, 3094, 569, 217, 1438, 1006, 659, 2742, 2277, 650, 729, 123, -1334, -761, 242, -660, -250, 1476, 1175, 260, 567, -410, -1971, -846, 327, 117, 797, 1031, -1090, -1602, -1103, -2014, -2165, -962, -1581, -2403, -1514, -1284, -2379, -1141, -135, -1277, -1514, -276, -582, -442, 1725, 2026, 803, 1236, 1091, -544, -91, 1563, 1056, 828, 1302, 294, -444, 915, 870, -241, -23, -49, -1189, -355, 1532, 1358, 899, 1315, 110, -1295, -105, 548, -164, 1041, 1995, 583, 397, 1227, -230, -736, 625, 446, -243, 1183, 1259, -17, 272, 330, -1465, -1622, -452, -844, -1110, 99, -559, -2095]
1825b095N25K51p49N01J033m25r4J511m43o0J086l93j372Q74M16j73O82O53j211
1844E17j052Q52p30q16J342l85n39P37L67o59L57J187r76m65J133j96j98J954
1862B430K16j117k06Q7j535k26J285n11q43Q66m44j065K80K5q76L10O93m57K39
1881h49J436m30l2Q83o57r26N41P97m86L18P07j055n21O52q74p01R22j16p00Q13
1901b78P85q74q1K19p44o36J056l6k07J255k67j041N26P6p42Q0P01o7L94P51J34
1922A004n58Q32n59r71R57M76n30P72O76j074n30K32p86q28P29J93n66l3O16q25
1942g73k42R96n78j94N79L29l05O80J042j010R7K47p21n74J025k54n04P83l51
1961B72p10N11k25j126J10L95k35O75R50n45o34R09n32o87M67O09m62N30O59o11
$$ y = [-2095, -1570, -1319, -2068, -1567, -534, -959, -1053, 458, 15, -45, 1041, 648, -724, 150, 566, 393, 1075, 1728, 517, -535, 317, -413, -1229, 113, -272, -811, -74, 293, -366, -9, 1178, 202, -263, 870, 674, 476, 2430, 2646, 1529, 1323, 1410, -125, -351, 934, 423, -420, 446, 2, -1063, -783, -758, -1634, -1324, -631, -1088, -849, 587, 157, 125, 1008, 351, -575, -34, 763, 277, 595, 1302, 247, -274, 378, -496, -1197, -275, -391, -1091, -278, 507, -367, -448, -229, -973, -1609, -553, -589, -796, 459, 192, -849, -323, -247, -989, -909, -208, -275, 119, 870, 1004, 446, 1278, 719, -252, 705, 1181, 651, 1423, 2099, 1025, 495, 727, -59, -887, -158, 35, -531, -564, 52, -773, -1015, -19, -597, -791, -212, 117, -188, 492, 1534, 524, 621, 868, 147, -427, 598, 344, -160, 623, 272, -438, 73, -152, -1278, -1168, -773, -1008, -333, 617, 72, -562, 347, -185, -872, -405, 204, -258, 272, 931, 320]
1981C20k64L71o46r70J176J65k08Q68L87r06J68K7o27l60Q80K35n73O71K4j188
2001d50j0O49r44O86J80n75J16O66Q5k85K73q8m57K64P87l84k2M79j18p05Qp69
2023f14o06K74M0q38O65N07r91K06M06k61l48R35J16m9J359N47m31K26L32q46
2043F29Q6L25l0k46O90n08o64J04j9j194j79P90k78J68Q71l77p19P11m00m79Q79
2064A60M63l14L16M49l57j08K70m84o07N35m6m92M75L08k75O4L30j051o98P43
2084c19j37M04N6L22j139k9K63n57L29Q1l8q9M97M3l0J42J10o34K45N06m18P11
2106C19P34l73l87J89m46q79M67J42l96P10J65m48m90M36M2l78P17J80j52P11
2126H63M29k04J9Q6o95L37L9j6k68R4L8m36ql91n28l43L49j74J92R21qm63K54
$$ y = [320, 56, 427, -219, -1189, -13, 152, -56, 812, 1199, 293, 461, 488, -139, -499, 381, 616, 43, 714, 738, -450, -460, 189, -755, -69, 111, -464, -348, 318, 403, 118, 391, 303, -154, 110, 897, 513, 491, 970, 852, 147, 155, -614, -1220, -946, -906, -1744, -1079, -572, -1563, -1357, -951, -1212, -1560, -625, -509, -558, 801, 1348, 917, 1143, 1475, 629, 715, 1040, 1010, 764, 1454, 946, 282, 386, 367, -827, -1006, -216, -494, -326, 545, 168, -551, 160, -240, -719, 160, 623, 309, 625, 1074, 717, 609, 879, 395, -212, 323, 277, -215, 260, 568, 293, 357, 687, -364, -1062, -319, -456, -52, 4, 326, -813, -842, -579, -1136, -807, -726, -764, -853, -356, -313, -343, -201, -91, -725, -480, 26, -392, 319, 1053, 680, 293, 482, 36, -843, -376, -234, -630, 80, 245, -203, -693, -257, -215, -593, 124, 304, 152, 863, 1292, 1088, 1107, 1193, 498, 835, 874, 858, 590, 684, 722, 286, 278, -113, -641, -984, -635, -809, -617, 304, 296, -167, 87]
2149H7k89j54L28P04k53J97K90o29J3N9j33n01R7m02j75L43J50Q9j5l76n13j63
2171a246K20K53O6J043Q9n27l80K23l73R8L04r2K54N1k55K67J22J20k42m07N84
2192A72n8N06M29j17j30p8k10k39L77j36j55M94l4k56j22l7m97l10J94p7L46L44
2214D06M04o92O2l05k37k67O01l41k10L05P1l17J55k34o51l1K94J42P3O14M25
2235B67l98Jk14k74M53J1P4L28ql78k86K39l01j10Q8m3J22r7M24K71L82k15j07
2258B29k45L03O18M03L15Q3m8k28l90k08j85K8N0j52k85k41p6j22m25Q5n47K99
2280g39J23L53K38L22l59R1O2j96M6j2J99Rk12J23N3l66m97m70k74J32M10L39
2302f25K83l26l48j11K35J11N63o5L07q6P6L49J60j17j06J09N7o5R5O2M11r8k82
$$ y = [87, -202, -356, -28, 676, 423, 620, 910, 281, 294, 353, 220, -281, -184, -586, -761, -418, -268, -179, -194, -570, -1083, -1246, -1026, -773, -707, 336, 425, -102, -482, -259, -632, -534, -230, -322, -68, -17, -272, -5, 117, 237, -5, -412, 172, 114, 620, 1049, 932, 802, 724, 514, 275, 652, 516, 361, 855, 821, 565, 443, 406, -91, -401, -207, -284, 62, 406, 810, 118, 180, -125, -362, -629, -28, -369, -579, -274, -203, -520, -365, -599, -1250, -1281, -987, -845, -772, -158, 267, -131, -130, -344, -618, -165, -154, -80, 248, 240, -138, -424, -185, -486, -596, -508, -551, -429, -526, -102, 169, 551, 336, 229, -16, 287, 905, 1308, 1623, 1706, 1658, 1430, 1040, 832, 647, 675, 725, 573, 288, 47, -29, -151, -576, -491, -1038, -739, -616, -263, -25, 297, -62, 29, 91, -105, -59, -71, 128, 137, -75, 48, 101, -265, -762, -1232, -1506, -1374, -964, -625, -342, -668, -1016, -1127, -892, -781, -218, -283, 24, -62, 14, 363, 523, 406, 300, 409, 466, 401, 496, 558, 969, 871, 589]
2325E89j13j61m06J36N62j43K02j92l28k50K92j88q7k92Qk01N02L54J22J7n19
2346i6m5k35N43J21M01j51k9l72l13q0k15p4j98J18K97n33L13l70j11J97m25M12
2368h45O07L86p6K04J5k24J75J04m6L9J13j4j18j29j26j76o7j50L9l76M63K55
2390E3J05L17j54r6K93k34L17K71K23l42J79n0m24j30k79k9k21k17O3l5J03K18
2412f9l62kp8j81L08J69M45k6K57j88lm95M6K02j95R1M2Q3J11l74k71k33J86k03
2436g40k8M57p6np9J06K4J26k98K36l1L01K11O8K59k09l69j18L52j53L12J99n
2459E40J99j14l5N7m30K51MP4Ll00J74k20j05k13L72m85K26J98J15j99J32M4k89
2482ak1J56J87k1L4K32j42M2m76k86K91n13j62m1O0k1K03J39n01Mj31J82j29P54
$$ y = [589, 476, 315, -91, 45, 607, 464, 666, 474, 146, -104, 188, 0, -87, -379, -371, -572, -70, 284, 406, 423, -96, -141, -376, 167, 288, 689, 538, 509, 137, -176, -256, -471, -545, -743, -625, -328, -861, -548, -918, -1029, -832, -1257, -845, -238, 148, 72, 276, 291, 67, 242, 346, 300, 339, 452, 438, 320, 191, 65, -111, -178, -328, -289, -665, -202, 53, 158, 475, 321, 225, 518, 284, 601, 872, 1095, 753, 932, 882, 458, 328, 49, 20, -201, -418, -355, -390, -287, -69, -431, -433, -511, -692, -384, -215, 230, 204, 461, 273, 270, -225, -179, 23, -172, -81, -39, 44, 155, -219, -490, -723, -537, -740, -768, -311, -387, -392, -471, -365, -341, -215, -513, -277, -308, -7, 204, 272, 531, 322, -47, -165, 187, 34, 346, 545, 540, 739, 625, 590, 647, 217, 468, 472, 546, 549, 249, 423, 203, 98, -115, 257, -228, -2, 196, 311, 112, 244, 288, -1, -22, 134, 321, 300, 334, 566, 424, 466, -10, -296, -5, -518, -680, -721, -661, -682, -479, -340, -841, -837, -968, -786, -915, -161]
2506a61J50j06j7L50k76k41N86m25k0M57k59n0n8O7l14K08L12o43K84L36N6m7
2528A89K66k64j99K72J44k51K61K65j76l2L87o02l28K48j14k02K36L09l56j44
2548i1L27k87n3J44k02n1M02K19k55J73l53k09o8j44L2m92O40r0p0L29k52k56
2570f07L96L7j11m8P70k63j15J58o0j02p9N9k56L81J25k05J03J62l68m72L22n2
2592b25j67L83L23k43N27j08l12q5K35j91m66O71j30q0O4l8m19rL56j58R4L94
2614D16l86RK81jl65L11j9k64R7n9qj96M96k72m54K7J07n01J98M94k11J25J87
2637A2l23L6K45k18J14N08j63k90L69L9n13k12M00j53j73q8j14o9N65m4m69J84
2659c57J55J43L81k2LK66L72l46k52L30k54l17J66N39l79l31L20m71k48q6J11
$$ y = [-161, -11, -117, -134, 216, -60, -301, 285, -140, -160, 297, 38, -12, -70, -3, -317, -109, 203, -440, -156, 180, 236, 189, 455, 191, -8, 264, 408, 157, 418, 683, 507, 475, 862, 260, -68, 180, 66, -136, 100, 409, 53, -91, 236, -51, -104, 40, -162, -213, 189, 408, 153, 326, -27, -236, -304, -448, -416, -908, -268, -358, -428, -99, -351, -607, -211, -174, -285, -333, 437, 174, 59, 217, 157, 55, -24, 35, -221, 160, 285, 80, 183, 345, -23, -495, -173, -225, -392, -9, 314, 71, 598, 490, 178, 93, 328, 137, -329, 342, 212, 132, 196, 158, -261, -270, 86, -72, 22, 416, 30, 39, 320, 319, -46, 265, 246, -18, 79, 20, 12, -184, 312, 40, -414, -387, -280, -781, -583, -89, -300, -175, 12, -311, -275, -30, -248, -134, 374, 211, -79, 290, 329, -184, -396, 4, -149, -322, -410, -524, -593, -28, -72, -541, -357, -202, -59, 322, 300, 303, 569, 941, 595, 343, 673, 419, 102, 268, 807, 428, 97, 417, -54, -302, -388, -277]
2680b77n9K45K8j8J07N64p53K19o1J25n6J67M0k24K99L7m63j34J8l86J91M44j64
2703a11k62L49m01p0J72J62k45J07N1p9o4O34k31j25r3j09k91N95O9J22j14J25
2725A91j61k12J99l3MM46m7k92L10R7k62j34L29k59k94M76J7o59P85j36j80k63
2747g8J41j95J51J95P7j98L57k79l38K97k32j21l0L25l20O9K72n26k91J34Q6k63
2769g67O33K56p11N30J86l22K10K68l59j17L68Ok96K07J91n20j93J93k64Q9M90
2790G8k15MK73o7k4K2L26l76L91J76k77N3L65k68J29k20L3n65L57j3k82K76k4
2813A52n23j22K98j45Q2k5P2J09L89o1l77J34K98m75k16O35m88o3M99l85l46K81
2835b77j84k5J70O5J72j43K14p5k04J41j15o8K93K13k87K26L27n89J97K9k20M5
$$ y = [-277, -336, -91, -63, -81, 26, 590, -163, 56, -5, 120, 64, 231, 271, 47, 346, 383, -80, -214, -196, -582, -391, 53, -111, -373, -24, -425, -495, -323, -161, -406, -299, -248, -327, -391, 243, 12, -113, -206, -315, -606, -11, 58, 180, 66, 191, 30, -182, 17, -16, -12, 434, 387, 95, 405, 502, 240, 106, 435, 176, -118, 358, 375, -284, 501, 365, 185, -78, 63, -132, 19, 214, 291, 93, 450, 171, -167, 130, -102, -223, -253, 72, -248, -179, 93, -433, -724, -590, -504, -767, -134, 122, -589, -59, 127, -195, 15, 283, -76, -193, 175, 181, -115, 92, 283, -237, -430, -237, -501, -412, 78, -137, -133, 140, 73, 49, 71, 397, 21, 412, 588, 311, 364, 729, 461, 590, 370, 403, -162, 195, 182, -100, 176, 152, -371, -493, -195, -340, -258, -283, -211, -102, 287, 226, -151, -17, 281, -194, -410, 225, -263, -326, 173, -212, -558, -277, -461, -486, -316, -251, -79, -222, -8, -83, -287, -146, -261, -329, -36, 177, -110, 116, 443, -146, 51, 80, -140, -95]
2857i5N48j85j12%K4p8K2K60l06L69l69m8j24K51K30m47J25Jj16m90P86k11j9
2880A6K22j31p1J42l05q5M47K15j46j44L70l67k57L61j02n51nK81m98O40o06J53
2902d21K06k25J1q9M73K62j46P4K8j0j97M93m28J9L27m41K84r6j30k16j22K9r3
2925d08J79K31pj59K04M8j93N88j78k97K67Q1q7O4K47k00j30k21j58k42J73M60
2947B62l46K54k72k57K23J6K60k52J55J77k51J63J0k08J85k53k47M29j68J91k84
2968b13K43q3k98J68Rj42KN86m13K12O7r6m9j66O5PK42Q4k00R3j73k22j53M06
2992b4R3k22L15J24j8k53N47n77N0K32k95J01K97J46l42J29k38k79J27K05m03
3013b85J53M18j80k75J12J44q8j5J55k10M1K86j85j76J46k37k57K56j09j68K18
$$ y = [-95, 453, 268, 156, 156, 180, 102, 124, 384, 78, 447, 78, 30, -94, 157, 387, -60, 65, 66, -50, -540, 246, 35, 16, 238, 107, 36, 178, -127, -212, 235, 450, 304, 160, 530, 163, -94, 267, 165, -386, -391, -110, -608, 32, -574, -421, -215, -440, -429, -518, -45, 217, 71, 145, 173, 163, -34, 459, 31, 50, 377, -64, 220, 124, -6, -222, -344, -315, -408, -229, 2, -5, -164, 40, 88, -105, 483, 305, 8, 275, 356, 269, 333, 580, 380, 250, 29, -129, -371, -198, 262, -84, 170, -102, -359, -136, -120, 140, -112, 43, 220, -31, 132, 142, -66, 119, -134, -381, 48, -120, 71, -213, 30, -53, -351, -183, -174, -316, -314, 272, -141, 71, 138, 42, -7, -173, -108, -101, 141, 225, 25, 118, -55, -277, -430, -24, 69, -153, 162, 286, 268, 15, 562, -15, 35, 267, -28, 73, 370, 516, 174, 303, 65, -214, -87, 118, -285, -132, 286, 106, -169, -57, 87, -1, -16, 139, -71, -30, 256, 71, -105, 41, -196, -453, -197, -306, -474, -256]
3034b56K13m44J42L80l97J4M11j61k66L33L24p6J89P9l3k99n1m05L48m1M5k71
3056b22J86J0l07KJ94j44K84K58kN1M7j74r2J78k49L31l3k5k84K31J81l93j58
3079a30P5K26m04J53pJ54r9L39m11J14j4j57Q0L3J60k83m0J57K2k89K30k48L00
3102c9J77L7k75k3J15K10l41M8J18K39j63m9K56rm84J81j55j47L32n9l24K26J90
3125F1j48K1o1R6J75Kn1K8J09L16l68M13l25l66J21j12L59l66J97oj85k83J58
3148b15n0N7N3J50r5N6QM0J54k07K83j79%M5N5r6Q9m54J00J08j79j4J6K2J69j77
3174b61L45n9q4J80l27L27l82K55O4O6j02J57k78k30J90j57R9k53P6K68K44l84
3196b46M25j66J64r8L53r7k3J36M9j3j05l81p4K70O8j21j35k15r9J44m8N1N2L36
$$ y = [-256, -43, -487, -345, 35, -362, -348, 63, -98, -364, -31, 293, 217, 406, 485, 452, 153, 102, -303, 45, 4, 49, -222, -36, -26, -333, -331, -137, -281, 3, 261, 259, 310, 357, 183, 91, 269, 20, 351, 318, 293, 9, 240, 421, 28, -130, -55, 171, -233, -80, -87, 67, -32, 307, -104, 10, -4, -161, -81, -48, 112, -171, -211, -54, -32, -321, -91, -339, -39, 138, 175, -100, -123, -8, 202, -139, -91, 27, 266, 103, 54, 310, 301, -183, -2, -157, -304, 28, -31, -355, -129, 61, -87, -66, -127, -31, 144, 146, 95, 123, 232, 548, 180, 593, 268, -98, 23, -89, 270, -96, 101, 95, -90, -373, -215, -265, -208, -155, -5, -100, -44, -36, 4, 158, -49, 234, 55, 55, 100, 155, 59, 148, -306, -206, -98, -277, -291, -275, -253, -84, -261, 84, 25, -59, 121, -206, 121, -261, -6, 58, 124, 22, 179, -99, -329, -139, -296, -197, -450, -374, -106, 138, -246, 179, 13, 177, 79, 432, 335, 312, 448, 497, 484, 379, -2, -76, 194, 262, 141, 6, -209, -308, -164, -212, -161, -109, 227]
3220B27j51Mo9J90j37q3j17J53P5K00L1j06j86j20M1k27M5J21L3j99N3l4L5J11
3244a10J12l76K09N5m5j6r2K31K48k60o3M9J9J76p0m4J4M0R1l34N96k74J06rj89
3269F4N7R7K37j79k33p6%l6n4m4K56N6m93K32p4J11P1N6R8L9j1J93l50K08L3m40
3295a82j86K75K82j90N2k82K35l65j50J24R6J28k26J71O2K51o8l4J61l12J65j20
3317a13J94j04OK65l13q3J56m8O7j36k72K91j2O0J91kN0r7K5J43N9K36m35m7M5
3342A26Nj79J17K23m73K83n9K57k55o3j84N8JL38n35K61K96q4q1l76L36k80J21
3365a47R8j21k91L90Qo5N3m7m8M5J39j5L2OL14k75NJ38j85j10l27M78Q6p4j03
3390a6j9Kl5O5O1m6j19M86l27Q4L0k33K34L1oj80K32k27L49l88N8j16p0K35j59
$$ y = [227, 76, 80, 11, 201, 64, -19, -136, 17, 92, 292, 323, 217, 31, -89, -48, -275, -230, -109, -76, -275, -222, -256, -221, -110, 2, -374, -165, -110, -155, -171, -263, -32, 216, -44, -107, -58, -39, 137, 67, 23, 37, 77, 168, -166, 430, 156, 262, 253, 64, 121, 218, 455, 276, 43, -33, -33, -69, -123, -167, 89, 145, -348, -116, -190, -79, -8, 48, 146, 185, 174, 367, 17, 225, 258, -182, -368, -93, 189, -1, 51, -231, 4, -361, -511, -387, -291, -163, -389, -218, -156, 95, 27, -7, 154, -158, 7, -113, 81, -23, -17, 248, -65, -148, 8, -40, 27, -109, -381, -90, -102, -42, 149, 147, 197, 100, 125, 268, 327, 563, 128, 81, 126, 131, -48, 69, 292, -181, 102, 43, 300, 45, -18, -202, -144, -143, 195, -340, -79, 217, 133, 52, -324, 12, -268, -147, -49, -170, -461, -71, -63, -128, -75, -122, -170, -125, 14, -1, 31, 37, 351, 76, 81, 219, 34, -76, -403, 75, 161, 87, -16, -35, -33, -68, -3, 58, 12, -107, 379, 52, 136, 166, -67, 167, 198, 192, 12, 244, 17, 366, -22, 36, -80, -150, 85, -74]
3415g4p2N5JO5k9M3R0k21M43l15M1K68r0j28l7n1j63j15j46M22k87k4J71m9j72
3440c74J85r1j4J77J25L24j47j47J7L98k58l78L0L39r6k48J81K2k37J3k6o6J75
3463i6K40j41P0j08j24K68J34m8j25j72K48N9L63k31l08O6n9k92J12L87k72q4
3485a13J80l5J31j22J08j44k72J75K17J1N8j84Q4q8l48o7L65j03Q7j88r3L4L73
3508F6J61k95j46K75jj30K20j52M9k86M25k24J48k34Q5p8J11J6n8j19K77j19J09
3531A00j29P0r2L24O1l90Q8j4n5J91j0k70K92Rl00K93K7j14j32K57k31j25K22
3554G2O1n9l2J25j66J41l3N2j17J58r9l91J32J19j00J55k58m6O5L50j63k42K77
3577An2k00K12R8q8Q3J78k30p3j77M7Q8j55J86J85j64J36R1j73j29K14k70K35
$$ y = [-74, -146, -91, -90, -25, -54, -11, 79, -142, 301, -14, 27, 295, 205, 77, 40, -11, -174, -289, -435, -13, -300, -324, -153, -202, -374, -189, -280, -294, -117, 8, 332, 185, 38, 55, 453, 195, -183, -153, 186, 90, -158, 23, 45, -192, -179, -205, -271, -96, 144, 3, 73, -35, -159, 109, 243, 195, 70, -102, 146, 205, 568, 337, 29, 95, 36, -256, -144, 243, -29, -113, 67, 32, 163, 41, 149, 5, -267, -92, 125, 136, 194, 10, 94, 6, -342, -409, -44, -147, -60, -248, -341, -307, 66, 227, -68, -214, 61, 60, -70, 150, -2, 47, -239, 186, -38, 110, -124, -39, -117, -6, 10, -48, -167, 110, -9, 100, -29, 41, -51, 273, 334, -56, 32, 18, -37, 154, 144, -126, 166, 175, -125, 168, 195, 81, -51, 206, -25, -150, 72, 133, 74, 42, 167, 1, 142, 109, 161, 44, 202, 103, -288, -156, -37, -137, 18, -240, -286, -221, 129, -34, -276, 1, -51, -251, -39, 59, -29, 54, 232, 2, -71, -248, -201, -113, -268, -82, 103, -61, 75, 166, -7, -136, 78, -192, 43]
3600D3j3j31L13R8K7j35P0j43J17R5k34j51J33q0k63M04p9n83M27K40K6m9k04
3623g2J13O3j30J12j84l9K67j66J7K41k04n1j51K77j84J79q9j11J52J2j85J34
3645AL0M5j34K35L8l24K6K39l52K31l4j11p6L9O2Q3O4p8j17M78J05m73L81k26
3669A32J77k69J89j31l3J10Q5Lk94o8KO5O6j78J51k64L55N6k17Q1j40M07K3K7
3693C35j80N1k56J85j2k62o7J47j44Nn7J76k01N9P7M7l9O3J24J44m48K97r4jJ87
3718A36m49J50K59l14J30m4K90m43L9P2k9K3K08j02j1K02j56M0j90L57M4j01o3
3741D8K48m1r6N0j00l12K32j20M57j97n2j13q7j25Q6K10o2m2J72j86K43k27m7
3764f1k32K28Pk34M22k64j3k66L87j02j16K98j35j77K60j53K91j25k10Q9R2k33
$$ y = [43, 30, -101, 212, 310, 337, 202, 272, 129, 246, 341, 107, -44, 89, 9, -254, 150, 71, -512, -85, 155, 181, 132, -72, 41, 104, -26, 86, -98, -137, 130, -36, -19, 222, 18, -33, -184, 93, -91, 88, -1, -112, 40, 52, -133, 1, 31, 76, -58, 177, 215, -109, -83, 156, -196, 35, 1, -110, -186, -147, -85, -2, 62, -16, -133, 345, 450, -23, 358, 132, 309, 40, 229, 98, 65, 175, 260, 263, -31, -99, -97, -32, 34, -144, 7, -257, 98, 154, -63, 18, -122, 285, 308, 335, 155, 206, -50, 135, 123, -139, -206, -59, -203, -198, -255, -79, -280, -221, -144, -97, -136, -73, 51, 195, -253, 44, -50, -51, 136, -313, -163, 96, -218, -88, -132, 158, -285, -246, -174, -203, -180, 28, -74, -85, 117, -39, 1, -189, 168, 212, 111, 48, 296, 255, 159, 209, 109, -203, 29, -91, 366, 169, 117, 4, -83, -208, -122, 88, 26, -16, 156, -30, 213, -14, -61, -293, -65, -58, -292, 130, -134, -147, -413, -26, -128, -244, 54, -81, -258, 2, -151, 140, 15, -195, -106, -14, -247]
3786b47K69k12M24k97J54p4j46M48o25N48k07J68K46l07m0K96o21M62k58J67j0
3807A38j91M75l73o9J5j13P1L41k44j05K72k16lrJ40j42K67k33J9j36L73j70j7
3830I0J11k04k52J79N3k98L62J45k44j45K62j37l02K69l0mR5Q0J94l57O8P3j2
3853dQK06l15J05r5R2j14j18J48J93j37m2k2K79k02Q8L0j21j25O3K40j74j22J41
3877BJ25l06L75j63J85j11J22k15R7K21k63p6J22q0N1j7k75L02j15J89k07K4n2
3900f5JJ75k36k38L90l66J31J88K70j76k81J86L4K52j51ml15J60K56j20L9j88
3922e8OP5r2P7k17J62k21R9j33P9L67j83K00R2k79L28j62R1l22K46p1j56K1q8
3946a39J48j74L67l08K62j43nJ9m8K0P5r8P8m3nP7j07P3O1qj47j0j41K16j70L42
$$ y = [-247, 22, -190, 234, -63, 91, 17, -129, 319, -306, 242, 35, 203, 449, 142, 102, 398, -223, 239, -19, 148, 138, -53, 422, 49, -20, -5, -118, -47, 294, 50, -55, 217, 1, -2, -11, 129, -13, 254, 21, 40, -96, 277, 107, 90, 201, -3, -255, -76, -23, -321, 41, 186, -58, -203, 59, -78, -380, -111, -141, -145, -50, 30, 224, -133, -65, 8, -4, 4, 210, -105, 0, -95, -3, -117, -235, -87, 106, -31, -73, -95, 184, -18, 70, 100, -21, -146, -83, 157, -17, -139, 2, 127, -179, 196, 33, 218, 107, 229, 14, 111, 332, 69, -7, 115, 35, 86, 69, -206, 96, -19, 170, -37, -13, -65, -64, 111, -125, -363, 27, -339, -208, -20, 250, 74, -207, -21, 13, 265, 114, 110, -205, -45, 211, 91, 130, -58, -52, 23, -69, 8, -209, -47, -268, -169, -302, -223, 144, -39, 161, 253, -26, 302, 140, 231, -91, 155, 84, -72, -51, -139, 9, -165, 202, -106, 156, 13, 8, 27, -21, -1, 74, -24, 54, 11, 6, 83, -24, 49, 110, 102, -45, -55, -196, 20, -150, 192]
3972A92l40O7J90k62J28j75J04K13j20P6k8j69L27j62j61L59p7j70J05l9J6l70
3994b96K32Jp8J41j64M5pK54j92J61m6J81j36K4lR9j41q9O1l9J37k35j7L90J3
4019B96m58J46N5J22J90k47j9Q8k14n3K33O3k76R6J01k16K47J31m01J43j63M5
4041i1J31p6J48m38L65k3q3P6L3%p5j2o8J50P0l1n7J5K23m01o5K13k32L87r6p
4067E6j30K45J20l3j77L6k4k05M44k28J05j09Kk6j46P8Q4p4kJ2o1p9J77l27L21
4092E9j19J07j43J38K31j07N9l01J46j16k0JJ6J68k66J56m2k22P2M9R4N4N1J8
4116H3j04k12L15K07j11n7J5l29K95j52J27j61J56j52j88J42Q1K02m2k09J47n2
4138AK70q4r2p4M04m40J82j69j02nJ76J04k82J15m7j8q7J67j97J04K43K6l40K43
$$ y = [192, -148, -81, 109, -153, -25, -200, -96, 117, -3, 73, 45, -124, 203, 41, -120, 239, 162, -8, 97, 58, 74, -296, -64, -63, -141, 0, -164, -119, -126, 128, -64, 97, 51, 232, 96, 120, 117, 216, 75, -14, 47, 8, 145, -90, -107, 283, 296, -162, -16, 39, 161, 351, 104, 85, 173, -41, -94, 139, 202, -74, 22, 123, -93, 154, 285, -116, 27, -136, -91, 40, -36, 112, -326, 39, 16, -67, 9, 42, 42, -33, -45, -113, 37, 107, 76, 19, 34, 257, -144, -209, 4, -228, 159, 63, 56, -74, 171, 291, 258, 81, 117, 93, -112, 332, 104, 209, 100, 102, 76, -70, 8, 92, 18, 16, 28, -33, -112, 65, -262, 59, -60, 47, -96, 42, 273, 166, 225, -76, 70, -46, -66, -65, -49, 119, -147, 9, -33, -255, -183, -134, -40, 14, 65, 83, -21, -233, 82, 289, 178, 121, 136, -193, 102, -50, 77, -84, 72, -80, -268, -126, -45, 157, 115, -94, 53, 1, 271, 187, 95, 21, 425, -15, 167, -2, -104, -109, 67, 171, -111, 4, -43, -61, -148, 19, -178, -74, 169, 195, -145, 98]
4162I8j28k13p6K60M0r0n4M1Q5q0k5J0O7J57%%n2j45q4M24k60j3K05j60J10QR6
4189B21k66p4l2M9J01P6O0j74J13k09L4J36j50j9L83q2k48L24k26j55K86J93l35
4212Fk62L09J31k74J21P6k6l18M16j74M2l3o8Q9J60mk40J34j17J20m3j82Q0q5
4236a42m0J61K05k91r1L5pk22L41J91J34k91N2J19m3M5k05J16k75K57J45j26j00
4259c2O1N2lq7n9r2L1Q0l1J29J98j39j17j43K50k28K23p6m7K05q1K8O4l36P5p4
4285a49J31K1P3J65O6l5l10L87k09Q0m7j30K28p3j86k36K90J76j11n2j13K1k1
4308c4J14q5j78o1L04j94J45J87l02J12K9k6j13J8K24j64R2jj87j27L08k90l7
4331b66K91L3k29J03N2R3K03r8o8j68J3L01l05M4K96k79k5K31o0l31J04J36O7
$$ y = [98, -30, -243, -319, -59, -19, -109, -163, -122, -37, -117, -142, -132, -65, 92, 92, 92, 40, -105, -189, 235, -25, -38, 167, 7, 117, 125, 221, -45, -119, -151, -102, -1, 75, 135, -39, 74, -135, -101, 35, -115, -134, 249, 167, -81, 243, 17, -138, 148, 341, 6, -256, 53, 184, -90, 31, 107, 81, -237, 179, 5, 47, 14, -54, 35, 195, 191, -49, 85, -32, 88, 45, -137, -57, -142, -182, -21, 184, -107, -198, -163, -170, -392, -51, 140, 274, -17, 35, 154, 111, 156, -49, 67, -208, 49, 194, 68, -32, 29, 81, 78, -9, -68, -160, -129, -49, -80, 49, 247, 108, -9, -152, 98, -130, 93, 17, -30, 175, 94, 122, 186, -150, -75, -149, -18, 3, 76, 241, 307, 272, -38, 349, 140, 220, 173, 43, 271, 198, 12, -224, 66, 242, 131, 79, -34, -13, -34, 80, -5, -183, -244, 60, -134, 11, 198, -104, 8, 37, 11, -102, -84, 140, -24, 68, 67, -120, -247, 61, -229, -266, 25, 58, -171, -68, -16, 77, 280, 182, 114, -54, -41, 260, -45, -1, 295, 16, -9, 222, 162, -169, -65, 71, 138]
4354A38n5k64p1R9K73r7P3m0l46K57n4J42J56j87n7K24j69O5k39pJ22p0K00j64
4378g1l8k9J00J45m1L9k5j99QJ24%k40J19J29l68L58J44k77J23O9j34R7k80J18
4402a29n7L25o7P6j03j8J67j48J30L2l85L81k40M6K65j30l46L70l60L04o6J23
4424A70j65ln2L4l4J52j33k47K26P2o7K03j41K8J21l82j01L05j78m2K12k84M52
4447A46k35R6J39j44m3J31q4j15l8M30k45j76j71K51j62J82J63j89k31J42K30
4468G7Q6j18j23R2K52k61L73k30qQMk1k25J81J2j45K71k05O3m9M9R1j42J7N2j55
4494e4o7K67l66M72r2j51j75L23k47K10r3j6j72J77L14m41K60m16J78j54J49K77
4516A83R1j57n5k38K08k36L08j44n2L8n8m9L21l49N0K66j34k6J00N6K40k79r2
$$ y = [138, 83, -181, -252, -153, 120, 23, 96, 56, -290, -33, -87, 55, 211, 24, -33, 191, 22, 87, -152, -159, -37, -107, 93, -71, -109, -138, -38, 107, 66, 105, 80, -119, -111, 13, 13, -227, -108, 21, -347, 11, 155, -122, 1, 70, -64, 33, -247, -129, -186, 139, 72, 148, 45, 27, 194, 46, 176, 208, -177, 204, -36, 10, 275, 145, -201, 169, -191, 113, 47, 170, 5, 2, -50, -16, -50, 102, -31, -278, -52, 20, -47, 156, 15, 43, 164, -218, -319, -14, -192, -234, -22, -306, 146, -89, 7, 146, 2, -41, 90, 6, -109, -147, 283, 38, -138, -309, -58, -220, -38, 125, -64, -295, -153, 77, 163, 45, -78, 14, 266, 5, 378, 148, 140, 148, 152, 131, -94, 87, 99, -46, 225, 20, 83, 34, 83, 174, 32, 49, 101, -54, -121, 146, -220, 252, 160, 9, -166, 157, -90, 120, 27, 11, -161, 16, 330, -111, 149, -267, -89, -243, -94, 183, 274, 117, 62, -176, 32, -204, 104, -40, -92, -54, -112, -161, 160, -189, -139, 127, -7, -33, 67, 123, 363, 84, -8]
4539hk36K10J08j4pk12K29n8J15m87N29j4j94M9L8j14m9K12k05oP2M5o8L49l74
4564i0J26j02J48j63l0m1K81R9k40j12JO7K41k91k62R9L71m3N0J0j35p6J68o5
4588A1J37k51L61l87N5l5q1j21K62J6L7J79l12J57N7n5J02k43L05k86l6K36o0
4611D8j05N6QJ12k69J04j35L97l4k31J1l34L35j5M7j7j97L30m5M0l38M31k8l65
4635a94M19O7K8k80Mj72J33Po3p7j1j13L43j03k06K57J68j37J32k43q1p1Jm3M84
4660B49l47J78l09J77PJ52k65L11j58J71m6k50L38l00J72J88l80K5K11j31L7L8
4682F8K14k29j48L1q5J09j20j61K50j48M18J04k00j13J19p%j26rk27L36j65o5
4705a54K89k23J94j16O4O0k53K17q5k7l1L1j64K4J10N1J05o1%o0j41J44K94l39
$$ y = [-8, -244, -34, 74, 60, 53, -159, 70, 12, 127, -360, 169, 155, -39, 10, 48, -66, -115, 97, -108, -114, -42, 3, -65, 284, -90, 36, -66, 82, -81, -111, -152, 129, 228, -12, -124, -123, -56, 185, -106, -368, -269, 102, 59, 109, 119, -16, -92, 76, 11, 148, -103, 258, -129, -74, -109, -190, -311, -49, -33, 4, 183, -129, 28, 85, 30, 132, -111, 194, -92, -128, 108, 48, -57, -1, 7, 119, -150, -46, -181, 216, 182, -49, -38, -372, -37, -52, -5, -22, -219, 111, 66, 106, -232, 199, 171, -194, 225, 292, 320, 40, 44, -128, 5, 12, -51, -128, -139, -252, 91, -12, -218, 39, 207, 70, 202, -41, -122, -193, -192, -235, 249, -98, 80, -229, -52, -45, 107, -158, 153, -5, 166, 120, -130, 208, -92, 80, 268, -112, -87, 124, -7, 30, 68, 282, 53, -95, -64, -149, -40, -160, -321, -71, -219, 199, 303, 103, -10, 109, 102, 102, -24, -33, -260, 76, -89, -154, 135, -88, 106, -10, 54, 114, -139, 78, -7, -34, -65, -34, -198, -174, -64, -13, 92, 31, 31, -29, -170, -26, 268, -71]
4729g1o3L06l49l8L9J5M1K16K99m80R4J07j52J63j67L8k3K2Q8J38k80J34j82k25
4753c30L34j2j37M03o8J22p5j96K0q7K64J3k13k72j2O9M27k47J53J0o9k77O8K56
4777A44k52K16l7M4l28J11L2J99n0Q2j78j36Q0k19o9L54j56j12L26o4j0o4j28
4800b15Q6Q8J40k14r8J77K66m39J84K16J14k87L9P2K5J30k67j50l6N8n9J35K05
4823A70Q0r8j16J22J16k22R7j49J24r0j42M09l18J60l05J25J74j86m0Q0l25J44
4845a90R3J12j73K24j04P0r3M0O7j68M19l12m6J37Q7j27J03k93N3J39M1k24p7
4868b22M0K22j88J90rk5n2p5mJ12l6L65k84R4j16j03M17l68J38nk52K17q2J03
4892G7J9l82L94j77J1j7L8N3j03J47o2M7j51J69Q9m2k74K98O3l52n6L34q9j60
$$ y = [-71, -134, 172, -177, -215, -176, -161, -120, 96, 395, -85, 9, 116, -36, 127, -40, -2, -25, -3, 85, 223, -57, 77, -105, -330, 4, -8, -145, 258, 190, 312, 237, 41, 61, -26, 238, 251, 38, -234, -246, -177, 250, 3, 156, 166, 97, -180, -112, 144, -108, 108, 71, 115, -213, -102, -70, 129, 79, 161, -17, -153, -73, -292, -361, -7, -163, -275, 51, -13, -23, -87, -215, -129, -41, 99, -115, -213, -36, 230, -209, -25, 191, 305, 18, 57, 129, 154, 284, 17, -133, -169, -111, -170, -35, 170, 250, 152, 36, 158, 274, 52, 149, 0, 124, 34, -108, 301, -17, 143, -162, -37, 137, -49, -89, -9, -334, -190, -97, 15, -158, 66, -38, 32, -61, -21, 46, -122, 297, -15, -61, 76, 163, 36, 139, -154, -101, 38, 79, -145, -222, -182, 40, -148, 42, 33, 8, -44, -119, -123, -11, -47, 318, 34, 128, 12, -91, 326, -42, 96, 91, -161, 56, -26, 77, 96, -286, 108, -69, -58, -75, -37, 16, -87, 60, -2, 45, -106, 63, 152, 110, -164, 134, 197, -155, -211, 123, 34, -126]
4916a26j1m9K93j71K19o0j22q3Q9J81k57M27k93P4j79J47j11K40N8j73K30j88
4938A35r1K04j09l69L41o8n1o9J87J85l53l8J80j80Q4l60L35J74k14J78l1J38
4960B08r3k18j34L69J75l29K07m0j50j42J36l1l1K97k15K9j76K23j27O6j23K61
4982A62k3m48M45j7j95j11pK10n3P8r7L25l33J41j31L6M4k4j01N8N5r9O2J03j83
5007a03K35k87K57J7J34j63rk98K04J87k69J06k04L36O1j84r2J62o6j67J76O4
5029I7m29M29J28M5j61j75O3K08k59%J05j88K26j88r7J69P1k55L03p6k4kj92l7
5053b39M09q1j71K03l58M10k53J97k06J07q7n3R1j21j11J00L48j68n2r3K92L9
5075B03j68j56J41j14J51P0J34m83Q1P8N7r7O9M0p2J8J4M7nJ35j81K69j83J56
$$ y = [-126, -137, -186, 107, -64, 155, 95, -27, -110, -21, 160, -97, 330, 37, 111, -68, 79, -32, 208, 266, 93, 323, 135, 44, 248, 139, -230, 111, 43, -8, -77, 110, 295, -58, -96, 84, -96, -12, -372, -37, 137, -77, 101, 70, 208, 115, -103, -237, 132, 307, -22, 185, 145, -5, -147, -11, -42, -73, 224, 9, 38, -138, 85, -42, 24, -99, 162, 139, -309, 136, 119, -76, -187, -194, 16, -37, 41, -56, 269, -64, 77, -54, -18, 26, 2, -99, -41, 14, -85, -23, 80, -103, 132, -155, 102, 119, 253, 90, 81, -217, -13, 174, -95, 11, -193, 143, 204, 20, -72, 90, 24, -143, 33, 97, -332, 97, 225, 270, 109, -66, -3, 205, -54, -54, 51, -137, 89, -99, -196, -27, 44, -211, 92, 16, -8, -10, -202, -239, 170, 89, -82, 121, -237, 173, -80, 117, -89, 18, -69, -122, -31, -152, -263, -163, 185, 17, -35, -128, 164, 203, 35, -121, 20, -94, 57, 127, 261, -222, -141, -63, -6, -103, -34, 6, -66, -48, -34, 13, 8, 143, -38, 231, 48, 204]
5099B04m59L22j73L46r3j80k35K11m8M1L8N6r9L3qO1o3J31K11k44j35ML51k94
5123b2J48mOj19M0n0P9k21K45p1j88K07j50J04j49n9jK21J38k65N3n0K03q9k0
5148a4j40L11j25K5J53l95R8K68l42K16N4k59n2J70K76k28r4K79j45KK72k69Q3
5171A44l9k40N63m77Jp4K32L7j35J20j87J87k57KL9J01j54K5J95j7j28j85L44
5194I7K4j24j8j0L09n19K15j18K46J18k81j30N7J18l00L47K0qJ30m02N54k86j89
5217a50L9O9j50N6K7K97j93l2J30r6j2Q3M8q1j08R9J79l10Q2j0j35M0j31L19k94
5242b34J43J86O8k65k8J38L1J1k5k06m1J01L01Jj06O6o6L4q0m9n4M1O9j5R5p6
5268D0J45j63Km0K84l68K28j05JK02j84j00m4K52j15J86k71L47l05k1Q7j86R5
$$ y = [204, -255, 67, -106, 240, 147, -33, -268, -57, -105, -64, -26, 30, -69, -36, -44, 17, -46, 85, 296, 52, -83, -79, 272, -22, 126, 122, 128, 9, 49, -1, 78, -143, 102, 31, -157, 50, -100, 4, -145, -204, -205, 16, 154, -111, -58, -108, 95, 6, -14, -154, 157, 32, 57, 210, -185, -87, 181, -161, 55, 109, -150, -202, -32, 244, 16, -78, 201, 56, 58, 330, 61, 144, 105, -135, 428, -49, -48, -122, 110, 147, 12, 132, -55, 132, -125, -123, -84, 17, -137, -112, 83, 66, -62, -247, 97, 121, -3, -21, -31, 278, -241, -26, -144, 102, 220, -61, -191, -134, -16, -316, 31, 51, 43, 173, -229, 325, 39, -150, -111, -42, -192, -136, -109, 188, -5, -37, 93, -3, -15, 68, 116, 35, -73, 26, 205, -105, -23, -33, -168, -128, -259, 60, -234, -91, 95, 163, -102, -130, 8, 39, 50, 25, -181, -222, -121, 180, 181, 75, 141, 75, 109, 29, -20, -74, -33, 36, 21, 116, 40, 185, 22, 24, -16, 268, -100, 128, 23, 24, 226, 42, -58, -102, 150, 35, 221, -50, 297, -8, -29, 58, -128, -33]
5291c3P0j18m7J58rr1R0J38M4k26O6J07k36K34l14J88m5R4j60J61k94L44p4j16
5315f9J33k19J27J95Qoq2r8K61k05n6J11q9J11p6l83K48M3P2j39J35M9N0k08k0
5340a07Q1j39L54j68R6n2k07n8O05o57K31K13K1R4J6l25l46K46J63R2p9L3J65
5363B72k77K66j83k04J0K70k52L57j02j27j32J64k5l8j06j15K0O8K05k31KP9J22
5386D3m03L35N5l9o0K93j88M8Q6j29j66R4K28lj93n3J68k99K38j25Q5N1j30L3
5410c1K8J40j57J6R8K17l83k1K85J6l93J62j17K4J81R6k52P3J75M6jN3K9j41j03
5435D0J19l75R7J03J7Rj26J23M0J34r5P6k34O0l3p6R9oj89L06k19j11K4Q1O3R8
5461B5J91m89N9L96l50M5Q9o5N9j01K45k83K88j07KJ78j09l9j09Q0r9J82p9m0
$$ y = [-33, 37, -81, -128, 30, 21, -70, 20, 158, 202, -24, 42, 149, -87, 147, -167, 21, -24, 70, -90, 71, -223, 121, 47, -69, 64, -155, -28, 167, 175, 169, 87, -11, 250, 45, -11, 100, 11, 122, 46, -337, -89, -46, 26, -113, 22, 71, 121, -87, -107, -26, -165, 189, 21, 117, 65, -142, -200, 405, -252, -21, 192, 213, 307, 323, -2, -348, -102, 61, 153, 74, 107, 272, -5, 261, 78, -126, -116, 154, -98, 259, 157, 30, -102, 62, 37, -1, -107, -222, -202, -134, 71, -160, -158, -79, 43, -360, -25, 30, -9, -69, 224, 36, 84, 170, 41, -125, -31, 197, 194, 1, -52, 116, -183, 55, -70, 15, 66, -64, -31, -3, 137, -20, -4, 94, 311, -72, -93, 192, 208, -185, -23, -140, -116, 65, 161, -91, -18, 157, 203, 202, 255, 284, 143, 40, 159, -216, -119, -16, 1, 10, -116, 7, 47, 181, 86, 162, -72, -12, -45, -121, -22, -28, -217, 89, -130, -241, -217, -136, -73, 25, 216, -273, -214, 182, -168, -123, -34, -99, -40, -141, 104, -179, 109, 2, 4, 182, 73, 34, -75, 5, -94, 88, 9, -31]
5485c1N0J02j42L1k28N2K66k15M10o02M40j65J00j0j44K03N5k11J23k07K37N8
5507A72j13qj9j23K15j65J00j07J91l73K32j49pL35k48m5K25j13Nj39K76k04R3
5530C1k49J24K2Q6j67PL56l80J70J3J25j74l2K43j28P4k39L22k42O6j54M01k65
5553A0j29L2K19k70J1K95j67l5j10L27K5r0j51J79m32L42p7p8J07j9k6K8J91l63
5577a81L22k06J3J90m66K43PR1J30n70M57k80Q9j9J67P4k73K86J05k86R6N8j4
5600C3N5J40O3n72J70j1L06Or3M3J21l42J61p7j2k70L02j52K43k74J05K54j89
5623A0J66k29n4O7L03q1j18M7K1j31J41l55J27J52J47l4j68KN7M3r4J01k04K33
5647A49N3k15j15K2R5O1j63k3M48m85J75m1J94j55j68K12n4p8K05N5k14n0N4p1
$$ y = [-31, 19, 121, -21, 10, -218, -166, 100, -115, 295, -307, 133, -32, 68, 58, -86, 117, 172, -39, 84, -123, 114, 172, 59, 51, 32, -91, 124, -41, 59, -48, 143, -230, 2, -147, -154, 181, -67, -112, 113, 0, 5, -134, 142, -62, 31, -218, -94, -72, 14, -153, -146, 210, -170, 0, 13, 138, -36, -68, 175, 47, 121, -118, 204, -38, 28, -126, 275, 10, -119, -87, 132, -138, -127, 168, 1, -34, -144, 183, 208, 118, -33, 146, -286, 56, -21, -99, 8, -11, -37, -9, 182, -181, 141, -65, -52, 138, -328, -85, -78, 13, 143, -427, 30, -250, -161, -180, -13, 61, -212, 74, 179, -107, -11, 47, 33, 88, 228, 291, -281, -111, -122, 184, 190, 97, 140, 261, -81, 80, 3, -9, -279, 23, -129, 114, -160, -55, 199, 10, 176, -53, -107, -40, 263, 182, 64, 111, 132, 1, 142, -213, -86, 66, 213, 179, 11, 13, 70, 113, 19, 120, -84, 149, 202, -13, -128, -106, -11, 50, -113, -136, 312, -173, 2, -39, 155, 0, -168, 44, -10, -88, 117, 172, -42, -92, -38, -109]
5671a09K74j76K45j89j94K43O4P3j16k79K79j10J2J08j24K0K89l74J00k59J72
5692e1j24J69O4J25n11M28O7l8j22M0J39j38m4P0j00K38m15J80Kj91L02k6m9K62
5716B77m18K03Q5j75k7O6j13J12j42J18N4j66O9J41j04l8n2K2J22O9m05K03n8
5739a57K47j95k03J22koL10l23L37j96J15o5r7K10J67k10N1j10k5k04J61K23j29
5762B1J76k46M4J44l13K75m7J19j45jJ59k79K08k16K55j72l4j1K59k23K08k15
5784c4L5j25K66k13j82J57J05j74j3rL20m08N9K79L6j00k57K38J9O6k85J28L9
5807e3o5J17J85o76N20J96k37J70k32L07j95pj22J28M1j16J44L0k85K82k79K66
5829A19j85M68n20j13J17j88L25L7n3J38j79l5M8P4j57J75l43P8N25m45J58K1
$$ y = [-109, 165, -11, 234, 45, -149, 94, 158, 231, 115, -164, 115, 5, 17, 125, 1, 21, 310, -64, 36, -223, -51, -175, -6, 58, 183, -328, 100, 167, 129, 7, 47, 186, 48, 4, 74, -26, 212, -203, -23, -21, -212, 90, 64, 15, 277, -141, 62, 147, -28, -55, 11, -102, 10, -132, -14, 40, -126, -57, 84, -20, -58, -110, -88, 34, 103, -302, -99, -157, 90, -105, -308, -186, -188, -194, 116, -207, 130, -66, 49, -16, -113, 97, 264, 54, 105, -5, -30, -234, -73, 150, 21, 197, -49, -5, 139, -174, 101, 54, 173, 28, 27, 186, -93, 115, -101, 154, -18, -52, -63, 196, -27, 181, -34, 1, -124, 142, -71, -253, -96, 9, -165, -178, -187, 133, -275, -216, 63, 99, -1, -258, -20, -1, 65, -220, -92, -53, -118, -1, 184, -492, 28, 224, -13, 157, -75, 232, 37, 30, -92, 36, 77, -39, 105, 135, -150, 132, -147, 119, -66, 402, -118, -231, -114, -302, 23, 60, 7, 145, -34, -69, -21, 53, -104, 71, -272, -194, 331, -114, 44, 65]
5851F5j11KK63j31k8M8j27K22j72o2k08L36o9p4K53k62O7l18J37K36m4K9L0m1
5875D1J5j72J59j74Q0Q1j85N81m09O3j35n6J06K62l06q7K20j54J34p8j20Q5Q8
5898C9N4k09M1P2k9K16r8m1q9k93M49Q8j15k83J72q1J31Q5j07J28l02K72j42K57
5922B15l50K77j51p7nL29k45k13J98oj82R0l3K83l6l92K34r0J42j26K85j29j45
5945a27J24j21J40j79K05J24k11J84j08k05L66r4k98L70k04j62K10K6r3K3p2K9
5967g3J73j36%k1J28J56j89J31J5k31J58j83K59j00j73J9M6J96k02j6j82M79k14
5990D0p1L18j08k34q9J29M6K0K59m52N1j49K79k52J26N4n5K72j02r4j60J37n7
6013i2R2k34K26O9K47j83o8K13j34k27K08l71M1n1M04j85L06k72K92k20Pk14L95
$$ y = [65, -46, -44, 219, 88, 60, 108, -19, 203, 31, -31, -239, 97, 28, -46, 207, -55, 12, -306, -169, 67, 23, 52, 82, 41, 56, -116, 43, -131, -51, 30, -155, 426, 17, 80, -55, -111, -5, 257, -49, -136, 84, -70, 64, -14, -134, -49, 39, 93, -116, -75, -3, -32, 184, 86, 45, -44, -337, 112, 200, 85, -198, -26, -107, 24, 109, 2, 130, -172, 100, -42, 215, -135, 142, -9, -86, -91, 238, -7, -220, -22, -28, -210, -120, -153, 130, 94, -298, -64, -154, -12, -138, 147, 18, -127, -3, -124, 16, -163, 42, 166, -45, 139, 31, -174, 192, 98, -200, 170, -34, -196, 14, 40, -53, -30, -102, -73, 100, -36, -36, -57, 71, 227, 38, 169, 184, -47, 111, -72, 187, 87, -86, -67, -21, 175, -27, -43, -225, 254, 40, -31, 287, 179, -55, -144, -15, 31, 51, 310, -142, -91, -240, 39, -213, -87, -33, -88, 184, 82, -12, -172, -35, -92, 0, -234, -8, 61, 308, 125, 57, 270, 136, -91, 117, -254, -213, -264, 140, -45, 261, -11, 281, 61, 68, -146, 249]
6036B49k30K7J58O4m86L3K66j93J34rk64L14Jr7Q6p1Q2j0l12L62r5L01l70l3j98
6061b91M57k06j38K35K15l0m69J24K48k29j15l6M57r6k63J70q4R5P3k81O4J96
6083I6o2K6k6q4L5J01Mn3o2P6j07k6q6K49K97m72R9L46j67l58M62k05q4J12k25
6108a14K18j4j55K43n7j57O2O4J15j47j33n4J50j0M3p3j29J29p5p0K6n6L34l64
6132b24q4K13j5j17K48k7k2k99J95J95k04L20n29K57J37p6j91L13L0j29j31J61
6154B1j9J6N9j17q4J64j11K75m1k19L1J32K9%k21nn9K34L9j26p4P8k51L57Nk80
6180a67K34j73o4N9K28k49K03l3k06j57J34L40j54N7N0k33K32q2J74k67J19k78
6202b33L78k35J27kJ55j60J99k80M6p5K24l32J99J99k7o5k53N38k31l8j77P6j05
$$ y = [249, 19, 46, 204, 268, -218, -185, 81, -112, 22, 13, -251, 63, 64, -33, 53, -18, 64, 54, -258, 104, 9, 310, -60, -93, -291, 166, -40, -178, 57, 272, 242, -227, -103, 145, -84, -199, -235, 222, 126, -137, 33, -51, 44, 117, -164, -100, 96, 34, 60, 34, -50, -15, 86, 90, 37, -25, 51, -56, -82, -168, 81, 378, -94, 5, 351, 184, -174, 288, 83, -1, 111, -114, 104, 90, -65, 178, 121, -36, 26, 90, 205, 58, -75, -129, 21, 11, 54, -19, -148, -19, -94, -164, -138, -194, 140, -224, -308, -95, -110, -227, 21, -6, -28, -327, -132, 63, -141, 179, -350, -93, 44, -32, -223, 90, 120, -9, -140, 21, 2, 18, 77, -40, -124, 40, -71, 204, 163, -56, -25, 107, 136, 136, -85, -90, -149, 85, 124, -2, -76, 2, -249, 108, 113, -167, 67, -106, -170, -111, 117, -132, 71, 38, -168, -325, -191, 149, -5, 52, 102, -131, 101, 19, 193, -74, 45, -233, 145, -90, 37, 35, 190, 30, 229, -51, -5, -80, 144, -188, 11, 210, 183, 118, -135, 403, 172, 134, -43, 33, -72]
6225g2k8J71n2r8K82k39K83Nk32J31p0K89n6j24l53K95k08M3L2p0k10M88o15L26
6249h2K87k44J82l77M0j8K48m3L37m26k52L93nl0r9K01J38k39Oj79k8J5K5J7j14
6274b47N1k1QJ52j11J59jL3J00j38K76m0m4n7j22K48l14j18L71j62k72N07l65
6297a07K8M7O0L66k82J33k14q9J98j21kK38j24M9j25k4l91O88j30l05J77k38J27
6320d1k3J88j85r7L16j67M8J31J48j74k83J5K44j83j42JK33J16j02J07l10J58
6342bJ67k13j77L52n4k00J74j34k41L44K11j42j57%L79k53k29J07J4J72j44N4
6364B8L2n0k4Q2p5j58J78k02J30L8J62k68j00M04j39j47J37j81K84r7K5r6j37
6387a74J54N2n1M1N9j04K7q6J50J8pl5K7j44J51J40j94J6j02J63n7k16K35m5k64
$$ y = [-72, -100, 71, 19, -79, 203, -36, 247, 252, 20, 151, 81, 370, 314, 190, -163, 132, -76, -33, -1, -71, -281, 207, -408, -82, 205, -39, 143, -234, -194, -212, 36, -7, 330, -96, -348, 45, 40, 10, -89, 112, 250, 11, 17, -162, -190, -175, -150, -133, -247, -196, -217, -209, -57, -168, -9, -10, 23, 123, -15, 261, 221, 177, 120, -2, 246, -68, -186, 185, 23, -249, 258, -107, -79, -32, 28, 394, 112, 245, 31, -58, 140, 19, 17, 255, 131, 180, 55, 31, -360, 328, 198, -107, 70, -168, -41, -64, 124, -61, -158, 158, -9, 39, 170, 318, 144, -139, -124, 120, -63, -205, -204, 29, 145, 43, 150, -160, -2, 165, -48, -225, 127, 73, -127, 47, -87, -328, 16, 227, 85, -72, -72, 307, 54, -175, -68, -54, 118, -26, 28, 60, 10, -14, 68, -7, -165, 13, -189, -59, -21, 141, -127, -227, 177, 38, -109, 28, -153, 131, 34, 59, -37, -174, -20, 32, -19, 22, 81, -23, 4, -82, 68, 86, 79, 44, 71, -73, 78, 218, 24, 40, -62, 101, 44, -172, 63, 18, -246]
6412b46J08P9J96k55K39j49r0lL07l42M22k67j25K27k43L48k06K14m01K04k10
6433a93J68L2O3j53J77P0l9K03l76J54j78J46j04J0k3j92K21P8l97M20J06k94
6455a01O4k32K80k34K88J22k02Q3n7j44L3K4L95k24r6K73j67j30l2J27j76K89
6477A83K9j41k53K82j71K3J83o6K8j67J2J52j78j3J23K73j82k46k4M9R4J34j10
6500A4k71J71J57K7R0k49J75q6m3k0OJ81l6J16l05QQ9J39k97L32P0l44j53J53
6524g6Q4J06m9j95K9j5L82k71m3P6j04J42j3o4j42K24Q2M1k53p0J36o6q8J92J90
6549B35j40j73k2o8o4K87N9j39J28k92O7K89j32p7j79J79K6M6M7q6J2K70m19K35
6573H9k16J75j05Q9q8l0J05K9J24k19M6M6l8J49m10Q4J34Q3k1j69K36k3j29p3
$$ y = [-246, -138, -59, 137, -118, 121, -28, -118, -121, 186, -156, 266, -1, -126, 101, -142, 206, 0, 214, -187, 17, -193, -25, 7, 70, -83, 94, 164, 125, 328, -48, 106, -72, 74, -30, -20, -43, -235, -14, 64, -333, 87, 193, -101, -37, -269, 11, -223, 65, 187, -15, 68, 11, -133, -100, -76, 319, 95, -1, 272, 105, -25, -57, 70, -106, 183, 212, 71, -182, 100, -71, -48, 135, 69, 97, -70, -58, 94, -84, -97, 26, 299, 117, -129, -153, -104, -10, 124, 14, -257, -86, 71, 98, 188, -61, 114, 28, -15, -35, -29, 152, 116, 232, -73, -65, 24, 163, -134, 198, 268, -76, -229, -76, 8, 114, 65, -130, -101, -116, 266, -5, -48, 28, -76, 66, 53, -11, -153, 71, 153, 194, -59, -129, 7, -59, -147, 45, 235, 95, -78, -100, -168, -232, 55, 114, -25, 103, -189, -122, 167, 35, -42, -221, -42, -16, 30, 77, -9, 3, 273, -146, 89, -127, 48, -57, 32, -56, -86, 19, 48, 172, -47, -1, 45, 7, 156, -254, -170, -36, 47, 26, -143, 93, 70, -59, -132]
6597a32M9Q2k36J92K33k14K2J88k10J45n5k38J56K08j29m3K38j86l7O2n7k44J60
6620d6q1q8K82l0o4O6j06M6j41J41j14k6L30j85L7j69K10Q8j29J37l73L58q6k08
6644a51J36RJ70r5j89K68l06J86k6J6l7n6P4o5q2j22K2M6L09l35k3K78J33m88
6668c28K97pp4J43p2j50L15k37K02l67L57j45N2j74K36J22k85J48k7j23p2L21
6690A32n8K39l07m3m3Q9Q1j71J85j92J98k74Q1L22l78N9J68M8l01PL57j23J26
6713B02j62n4oN6j22N8k7q9K35j53j38J92j28K91j71l04M25qk69J69K1j09Q1P
6737ck7o7L68k0m40J63J82M7j90l14J54J02N4j4l6MjN8L48j48k50L22l32K34R2
6762B86l92Q0m1n0K12m0k22J47M1J05j95K45j26j2J69m49K36N5k9r1J50r2N8q8
$$ y = [-132, -83, -1, -237, -45, 188, -26, -4, 184, -26, 119, 64, -174, -18, 190, 61, 18, 256, 70, 33, 95, 38, -206, -46, -127, -215, 67, 37, -27, 39, -67, -21, -162, -21, -135, -161, 169, -16, 21, -148, 62, 150, 21, 158, -215, 143, 57, -151, -15, -6, 164, 69, -120, 148, -158, 28, 2, 18, -19, -75, -1, -66, -148, -270, -248, -202, 107, -228, -251, 27, 160, -328, -31, -38, -112, 31, -41, -191, 124, -113, 89, -278, 79, -66, -14, -188, 48, 170, -115, 33, 6, -117, -189, 132, 74, 313, 6, -37, -80, 9, 90, -81, 104, -88, 110, -164, -83, 239, -139, -80, 88, 136, -165, -158, 199, 76, 202, 40, -14, -20, 36, -86, -28, -55, -144, 91, -62, -200, -8, -136, 155, -16, -320, 105, 97, -172, -3, 18, -91, -10, -3, -30, -97, 271, 251, -189, -26, 156, 203, 13, -301, -147, -45, 9, -5, -41, -37, -38, 20, 368, 220, -30, 292, -40, 194, 286, -106, -26, -67, -117, 95, 55, -167, -20, 21, 126, -69, 176, 50, 38, 207, -242, -6, 49, 20, -71, 79, -13, 45, -43]
6786d3K17R0l96J5J48j35L20j25j6j8q7R0n6k87J89L19j82k9L50k22j58K40j55
6809F9k3Np1o3o1K85j62K04j81l6O2j9p8J35j16P4m3J28j31J55k30K02k84K06
6833B7o9k06M56j65r7j39M0j66J56P2L9J81k07J82j1j68K69j55o8k39P3K94K20
6856C19l56M10k49J50m27O1K35J17l2k29K26k28J4M8j88L25j80k4J10k13L71l18
6878e8RM7O8j66K16j43L70j86j71K60n22M30j34j93L06q2j94L42l51L6K86k17
6900d7K07k32J92k75K7K85k45N5j79J76N5q3N0l9J54l27Q1J96l11L2R5j14L17
6923G0R3k06K34k60L89k55j8l6j7K62l5m13N1J32l3n0n4J86j00R3J05J11k6p7
6947A46l4J07j53J5M0j37m8J71rj08R1k01Q0PK79m07O5J53k23L48l38K46k91K31
$$ y = [-43, 174, 264, -132, -117, 31, -104, 216, 91, 75, 57, -30, 60, 4, -283, -94, 225, 43, 14, 364, 142, -16, 224, 69, 46, 51, -20, -83, -144, 141, -21, 183, 2, -34, 28, 9, -69, 66, -50, 24, -19, 109, -22, 133, -97, 105, -179, 27, -42, -248, 208, 43, -54, -193, -153, -319, -163, -91, -52, 129, -78, 104, 93, -75, 194, 39, -29, -268, -195, 99, 319, -37, 373, 124, 274, -153, -92, 143, 260, 228, -1, 225, -3, 11, 59, -129, 196, 16, -8, 102, -111, 260, -58, -49, -2, 66, -100, 116, -27, 343, 157, -14, 246, -276, 154, 20, -173, 133, 51, -143, 199, -152, -116, 170, -47, 160, -72, 120, -155, -128, 157, -88, -33, -212, -36, 19, -64, -14, -53, 101, -226, -145, 51, -260, -228, -133, -247, 70, 163, -43, 191, -69, 320, 65, 47, 11, -6, 256, 221, -192, -141, -9, -42, -92, -146, 40, -60, 33, 138, 249, 223, 146, 112, 219, 66, 81, 121, -16, -64, 107, 98, -10, 81, -120, -40, -33, 246, -161, -96, 57, -166, 182, -156, 90, -201, 30]
6971C0l54L01j46J68J51M2j90P1j11J58Qj42L2j41J91l31L52k74PO9K13Ml08M1
6995a59K81l25L25O8j5M0k15j5J91r2j62l7K30l24K89L2k45K31k91m5O6p4K10
7018c6J11o3J21k3J42k79P1j67K35k1J39j51L0j75K05j34%j81J02No4M3%ll6J77
7044D8k86M11l02M3K93jj97k7j03K09j14j99L40k05J64M1k15L9L8J84j96J14n5
7067B4K3k41K29P6k29K44J0j26Q7n0q4l73M96N4j70J9K20l00N7K2p9k8J82k04
7091a41J31k52K50J22l0M0j6k37J21K83m24m3L83r3l1Q3J6j7k63J88j69k6j8R9
7115d4K07r4k40J13m6O2k52L17l6J20o9K48k24l2j57M3J13j25J72qL6Q0O5l84
7139a35J51N7k59J73J30N5k19P8n9k54L28m9k1k23L07M3k22K33k64L02k85J85
$$ y = [30, -324, -23, -169, -1, 150, 192, 2, 73, -38, 120, 128, -14, 18, -123, 68, -263, 89, -185, -178, -109, 104, 108, -200, -159, 122, -203, 122, 190, 175, 215, 0, -15, 176, 84, -78, -115, 115, -209, 80, 112, -133, 98, -193, -238, -172, -246, -36, 75, 12, 133, 110, 252, -27, 44, -123, 112, 91, 230, 79, 109, -66, 139, 5, 5, -176, -74, -69, -133, -90, -90, -93, -129, 48, -238, 173, -129, -86, 207, 206, 9, -18, -121, 88, -26, -225, 115, -90, 74, 115, -100, -61, -23, 161, -35, 79, 24, 47, -194, 35, 111, -118, 126, 136, 10, 97, 47, -37, -410, 86, 140, -30, -11, 209, -91, -34, -12, -91, -119, 63, -141, -10, -262, -12, 110, 80, 120, 104, -133, -12, 271, -153, -196, 187, 94, 63, 146, 162, 145, -118, 70, -99, -125, -143, -44, 163, 69, -171, -58, -104, -42, -294, 23, -13, 107, 38, 286, 62, 30, -127, -84, 29, -96, 76, 68, 104, 184, 249, -135, 16, 73, -186, -13, 117, 172, -47, 31, -28, -282, 46, -3, -24, -247, 60, 103, -119, 114, -150, 152, -133, 52]
7161E2k23J13M9J65l10L24j57j21J57p6O2M8j33p2P4P9k6J85j23k06K36m7J00
7184A50k03J18j4K4p9j10J68j01j76L98k01j2oR1j1O3l82K29K56k24Qj1N1j74
7208a48M4l7n2O40m42N0J96l65Rk18L07j63J89J0k55P5k55L93k37K54J41j14J24
7231A46kJ0l20L72j68l08L77r1j99J41J45l26L02l2j19r6P5M0L22l26K03k80j
7254a35L94j52O5j54K85l24j95L16j34L5K9n5k60L54l07L25j46j27L20j14R6j66
7276e0K48j94j74R4j59K80j02o3J96k76L43j51l2N8N6K9K0k39o8L10J28l53R4
7299eo7P7j46P0K79k57J46J0J05o4k56n1J68J26l22P2m9J42k27M63k62K55J81
7322C88n53K62K5k82J9K06J36l57K57k46j13L04m25L33pO7j32N2k1K12n9J45k15
$$ y = [52, -171, -58, -9, 156, -154, 170, 13, -108, 49, -27, 35, 83, -50, -122, -48, 31, 5, 190, 67, -139, 97, 50, 150, -53, 65, 51, 75, -4, -114, 54, -47, -223, 175, -26, -38, -44, 47, 36, 99, -283, -54, 202, -22, -14, -25, 26, -148, -104, -141, -193, 447, 5, 55, 251, -114, -105, -323, -16, -179, 10, 20, -235, -160, -415, -22, -259, -5, 136, 22, 146, 144, 154, -166, 206, 38, -270, 107, 16, -183, -42, 103, -223, 79, 47, -72, -168, -93, -53, 269, -57, 146, -134, -135, 259, 107, 172, 18, 303, -21, -216, 100, -34, 1, 30, -25, -285, 69, -238, 87, -59, -186, 134, 20, 116, -50, 198, 4, -170, -76, -235, 45, -57, -120, 76, -200, 143, -8, -40, 18, 74, 103, 123, -116, -184, 126, 254, -99, -5, -72, 5, -141, -71, 208, -49, 97, 107, 212, 148, -108, -159, 9, 135, -187, -115, -164, -22, -249, 214, -48, 207, 388, -165, 97, 122, -160, -141, 65, 201, -156, 101, -145, -258, 46, -379, -46, -53, 14, -118, -66, -87, 125, 66, 211, -4]
7345dp8l32L73m3L7j64Q2J82O7k82J96MJ0j7K23k98M0Mj3K59j11j47n7O4J44q6
7371E3%k24L00L2j45j80J74M6L7l9k59K79M0j67j30K07Q7k29L48m51L2M8M3J23
7395B5n5p8N0l7j22L80j55rL8L2j86j27L14m4j21L09l99J81J01r6k25K92K28l68
7419g2j13L87k17J28R9j98O3j45P7j69J56j34R1J06q4q4Q4R0j62J78k18l8K59
7442H4j38O5K15k94OK8N8m2L9o5K9J25j67m3R4r5J7K2L0J26L0j46k01K94p2K1
7468B0J9J01J27l51K03j41L5j12o5K00J69k07P2P5r2k06M69k24k26L14k25L54
7490C09j2l29L02m5j99j6J6j66L44P6l17J34j60J29j4J55r7k73K11j28L6K43k95
7513i6J73n3j5j84M78k05r2L9k85J61J78j79knn7K70k5k48n9M70k62l07J73Q2
$$ y = [-4, -82, -414, -41, -84, -47, -211, -129, 53, 120, -162, 34, 38, 48, 31, 254, -44, -4, 0, -13, 246, 135, -12, -69, -5, 139, 53, 53, -171, 129, 161, 16, -164, 10, 56, 93, 54, -205, 74, 114, -53, -183, 24, 111, -118, 230, -221, -189, -141, -98, 25, -30, -108, -58, -95, -217, 163, 8, -1, 37, 69, -117, -244, 70, 26, -95, 214, -185, -4, 97, 1, -224, 68, 296, -72, -185, 202, -15, 113, 212, 14, 77, -68, 9, -160, -4, -138, -47, 59, -25, -109, -25, 65, -97, 81, -137, -175, 84, -54, 11, 226, -68, -62, -34, 24, -18, 21, -44, -15, 110, -57, -100, -6, -101, -84, -62, -32, 94, 124, -22, -223, 71, -1, 20, 39, 140, 267, -84, 119, -22, 13, -99, -164, 36, 205, -2, 70, 145, 53, -153, 316, 92, -134, 180, -45, 309, 297, -32, 270, 225, 26, 10, 26, -140, 204, 280, -37, 97, -63, 66, 52, 207, 110, -163, 48, -80, -44, 199, -96, 77, 24, 9, -175, 303, 98, 6, 45, -240, -79, 99, -80, -82, -87, -144, 126, 101, -147, -206, 264, 2, -305, -132, -50]
7537e0K59k47J81j80K9K18m35L75j96J7j31K99J8M3n8k97PJ15K4J58k65N2R2N2
7561H0l6Q7j04J82k43k53J14L82j99J01k98j1K89k19K68k8j11K07k40K3r5l7N7
7584h4P7K76j45r6L2j37J7k8J50k68R4L34k34j38K00m00K32Q6Rj8k0M05k24j29
7608iJ44j55K01j13j91M43j52r7P7k59O7l95N11j89K59l06J18J27j39O0LM7j83
7631a31K70p8q6m9o9r2L06j22L41m85K85r2J6r2L20k73M8J49j44k9k84K47n3Q9
7655hj5K52m0k28K03k40p6P1j00R2J75j44J21l4r2J59N8m6k25R2q5J92J20j80
7679B2p0P4j22J27l75K33K1P8j31J58p8j09L39k16j69K36j54J74j14K58k01O2
7701D3Q0Q3k78l4J72j38O2l76M15k1R9j56J03k68K21r8P0J3K21l61K31k00K87
$$ y = [-50, 209, -38, 143, -37, -8, 210, -225, 150, -46, -29, -160, 139, 157, 200, 142, -155, -148, -33, -9, 149, -116, -64, 28, 80, 44, 131, 27, 209, -34, -287, -173, 209, 10, 111, -187, -198, 91, -128, 140, 112, 1, 208, -32, -9, -104, -141, -84, -7, 269, 124, 28, 60, -77, -60, -88, 62, -206, -112, 222, -12, -150, 50, -350, -118, -32, -23, -41, -61, 344, 120, -9, 135, -20, 181, 68, -123, 320, 168, 71, 148, -111, -44, -439, 72, -117, 142, -164, -46, 81, -58, 2, 5, 52, -131, 139, 61, -25, -74, -143, -235, 71, -51, 290, -195, 90, -2, 14, -78, 242, -31, 17, 166, 22, -7, -291, -44, -97, -8, -23, 229, 189, -39, 164, -76, -152, -81, -181, -89, 86, -58, 63, 29, -63, 96, 154, 108, -117, -25, -110, 82, 202, 22, -48, 26, -96, 31, -344, -111, -90, -12, -143, 15, -63, -172, 167, -49, -218, 18, -136, 38, -76, 182, -19, 43, 123, 206, -72, -106, 66, -72, -10, -386, 29, 8, 107, -49, 54, -214, 7, -91, -21, -8, 213, -148, 83, -117, 170]
7724A70mj4k5N3k54K45o4k66o0K99J1M4J3l38R5J14N5j54Q5K22k02K3Mr0lJ09
7750F8N0J11l25J46j21k4J58K6Mm96K95J08Ok98J40O6L27k24j8J60k77R5PR7N8
7775A39l7j95q8N63l36J8j54Q2k7K06k02n8n1L06o3m8l91L37M0k67K10k50L18
7798E2lJ75j62m1j29N8L3Q5R9J83k87l6J45k15J65k45J77k44Q6j70J41J67J22
7821A56l10L8J18k43M6M98k85j31M07l29L7n8j77K58j59R9j30p6L31Mj95K9j06
7844a78J19j28J74j45N4K36j57J1k35K98L6m5r9N2om0J2J52J02m44K7K72j09r
7868e0J27r1j96M16k09J00k08J05Q7k89K70j15J80j37l0l2N5k3K4l42K89J39K7
7891I7l3J44O6l49M32m45p2K66j49o7M08m17K06M1K2p9q1j36j6J26o2J45J52l09
$$ y = [170, 166, 152, 127, 180, -74, 171, 107, -159, -219, 80, 91, 135, 148, -190, -95, 19, 74, -80, 5, 227, 25, 48, 52, -38, -41, 68, 118, 229, -96, 50, -71, -95, 63, 89, 93, -403, -108, 0, 6, -292, -152, -86, 241, 17, -1, 159, -118, -23, -16, 81, 139, 102, -93, -181, 382, 46, 64, -90, -8, -35, 171, -31, -89, -140, 166, 103, 55, -336, 1, 41, -226, -16, -266, 52, 49, 224, 62, 21, -108, -50, -17, 68, 167, 350, 63, 27, 172, -43, 122, -123, 54, -190, -104, -274, -133, 34, 156, -154, -116, 2, -241, -195, 303, 18, -113, 294, -35, 2, -56, -233, 25, -134, -35, -165, -241, 90, 94, -101, -72, -178, -59, -187, -13, -158, -104, 132, -25, -14, -249, 49, 85, 40, -59, -7, -13, -53, -41, 111, 213, -231, -204, 68, -41, -50, 77, -14, -210, 206, -3, 97, -111, -6, 81, -208, 62, -53, 127, -10, -40, -72, -17, -40, -16, -358, -69, 70, 97, 64, 208, 274, -75, 357, -88, -160, 106, -43, -110, 298, -119, 87, 128, 150, 71, -10, -146, -162, -36, -98, 47, 199, -110]
7915a10j81M86j58o6K9l5nRO6k58n2L2K54P5k10L62k58o9J49r3l5q2J49m9J15
7940F5m2j00J84m7J23k10R7j24q3K36j01k83L16L9j07J55Q2j24L3l0j69j46J96
7963d0J05j11K8oL4k56L11k00j38J67K49p5M9k09N6l4rK30j90O6J49k69L33k85
7987d5j4L1L49k42j04j47L04k04j1K50q3O8j10n9j00K14J93R1n22J64J21K4m2
8010A26k40L70j66j32m6j28J75l0J7O2j40L07k28J75o6mo7L3k17K76k9j07P2L
8034A6L1p2j40L77j72k9J60j54j13J39j6r8R9o0J17k06P1k65K47J0o5J49R4J28
8058B48r2j03j28J5N9l72L81O2l7L0O0j14O9K7J17j12k46P7j00K74J63l04R5J5
8082H4jj54Nj46K09O5%j14pQj6J72n0l47M21l01P1J05L6l9k1K3j28J78m0nK27
$$ y = [-110, -291, 195, 37, -29, 0, -35, -40, -31, 35, -223, -275, -243, 11, 86, -124, 238, -20, -89, 60, -33, -68, -150, -1, -50, 65, 23, -77, 107, 60, 183, -27, 70, -54, -137, 99, -2, -285, 31, 70, -37, 118, 200, 76, 109, 79, -90, -236, -40, 65, -46, -18, -24, 10, -246, 65, -135, -273, -106, 143, 68, 117, -92, -36, -70, -79, 151, -39, 27, 176, -93, 240, -45, -59, -28, 321, 79, -25, -172, 132, -72, -83, 167, 84, 152, 42, -17, -117, 97, 290, 381, -141, 23, 144, 168, 126, -114, 256, 90, -42, -88, -216, -41, -71, -54, 8, -132, 175, -53, 122, 56, 52, -15, 18, -199, 77, 48, -59, 13, 16, 47, -25, -165, 212, 40, 11, 171, 17, -96, 43, 27, -71, 28, -32, 85, -121, -50, -315, -68, -58, -123, 26, 120, 248, 156, 53, -75, -60, -1, -373, 8, 70, 33, 63, 123, 9, 78, 105, 222, 110, -136, -59, -159, 115, 278, -26, 69, 84, 83, -71, -66, -212, -3, 62, 62, -52, -59, -51, -67, 105, 55, -292, 129, -172, -101, 4, 40, 1, -20, 3, -125, 53, 13, 8, 235]
8109B35l05L68j84j89JJ75k18R4J7j21k24L77O0j86L84j90Lk64K75j56L81k29
8131A04k48J73m5m9J60j74J35p0K85j78J82j14l16K68j66k1j6k05K13J73j19L38
8153C10l94K31k46O9K32k33J05R3j97n8j44K44K93m46J47k82M11j81R8o2j3j19
8175a42j33N86o37L07K0Nk38K74kr1j75J27J08n2J44l02
$$ y = [235, -70, 298, 114, -75, -74, 101, -117, -23, -6, -127, -351, 26, 86, -100, 284, 94, 97, -167, 108, -48, 333, 104, -144, 29, -16, -65, 95, -79, 56, -14, 271, 93, 275, 161, -155, 113, -53, -74, -90, -295, -82, 91, -28, 310, -84, 147, -99, -30, 202, -31, 74, 167, -30, -88, -232, 12, 305, -141, 6, -276, 135, -46, 52, -10, -23, -142, -275, 311, -326, -19, 1, 6, -232, 42, 40, -51, -226, -99, 9, -43, 101, -201]
8191b01
$$ Imaginary data points
##PAGE= N=2
##DATA TABLE= (X++(I..I)), XYDATA
0@%%%%%%%%%oJ4j6J7k5L2m0M9n7P2q8J10j34J60j90K22k57K98l46L99m60N27o00
32c19O86p82Q82r93J116j251J400j562J741j936K149k384K638k915L219l552L917
49B054m316M753n235N769o362P024p770Q616r580J0696j2002J3554j5442J7787
63I546k0798K4828l0526L9258n4481Q8577l05686M3709L52554l67010Q5195K76188
75A41354k06571k78602L09484J57175j66254N9101K09901j29702j02103J26341
85A20124J9715j34908M7819R2121o6778j00926K5851K3226n3310l6568O8233J4940
97A9539j14367m5568J06094K7882m4643O0455M0964r6277n2J03701k1009l0334
109F385R5898j5491j10085O5985Q1020j11966l8967J06099k1737q5280L9587R290
$$ y = [0, 0, 0, 0, 0, 0, 0, 0, 0, 0, -6, 8, -8, 9, -16, 16, -24, 25, -32, 40, -48, 62, -72, 88, -102, 120, -137, 161, -185, 214, -246, 281, -319, 367, -415, 467, -526, 590, -661, 739, -823, 918, -1018, 1131, -1253, 1385, -1530, 1689, -1863, 2054, -2262, 2491, -2744, 3025, -3337, 3687, -4083, 4533, -5047, 5649, -6353, 7201, -8241, 9546, -11252, 13576, -16950, 22308, -32173, 56404, -249282, -205573, 146981, -220029, -134834, 141354, -65217, -343819, -34335, 122840, -43414, 15687, 225588, 95886, -6217, 120124, 139839, 4931, 52750, 144871, 78093, -22833, 3018, 26244, -27066, -63634, 4599, 19539, -94828, -140396, -34302, -6420, -51063, 9392, 50356, -45921, -45973, 57728, 36719, 6385, 102283, 86792, -23293, 42692, 123712, 11746, -27221, 78878, 57141, -28139, 11448, 20738]
121B0738p4316P008M0834k020L3990n710j01312m202Q3251k5516j1526J07168
133F8387j2014j19689K8586O2007o1292Q942Q4197m1526m9359O0339j3006p3691
145e8119M6849M7879n9987m265M7350m6382l4504O0737J4660k8413K5538j1704
157c61o2045K7653O3493j7506n660M3497k3886n8168K4090N0785p101k0401J0596
170B4986Q687k0455k2048J8137K5610k6856k7000K8680j040n1868J2412M2737
182A1982l1859j0296N4284k3156o3985L8780L3017n2072K2513P6857l7025n1638
194c2598N0618L908o5071L1289O0153l7388j3072M8240k7499n2635L4218K3067
206B3230l6164J3619L6002l3096k8651K7782O218j8842J3931J2853k1545j3687
$$ y = [20738, -53578, -46570, -5736, -7756, 26234, 20524, -80788, -84990, -1739, -27255, -38781, 68387, 56373, -63316, -34730, 27277, -34015, -25073, 59124, 17598, -31761, 28578, 15572, -58119, -11270, 36609, -23378, -27643, 19707, -26675, -61179, -442, 14218, -14195, 11343, -361, -62406, -34753, 28740, 11234, 5574, 49071, 25185, -32983, -8893, 41892, 34791, 14390, 24986, 33673, 13218, -8830, 9307, 34917, 8061, -18939, 9741, 8701, -43167, -30755, 11982, -19877, -30173, 24111, 955, -63030, -24250, 8767, -43305, -20792, 56065, 19040, -32598, 18020, 21928, -43143, -11854, 48299, 10911, -2161, 46079, 18580, -34055, 163, 23230, -12934, 685, 36687, 3591, -25060, 2722, 8940, -9902, 4029, 16882, -4663, -18350]
218a8350N260J512O960J1639j461p106r446j3040K416J4517O919O100N863j0950
232H33p103J0487J237n727J2013O822j0992O565J3903j4164j2856R011l543j0123
246c637J2409L177j9614j944P785j0140k160J0395q969q915J3083K913r235O502
260h350K806r698J2417J9182r729q659Q203r848p938K5211J0406k0197J625J1004
274A6435j8618p249J9008r613k3475J5551J9728j4411k836J2920j9436k0612K1475
287a1133J6397j4900J557J8352m660o083J7720J863k6684q588J9694R713K885
300A6133J5195O10k8540j7735R512p4j0441J0210J6156o754n745Q896j3234l0706
314c6517L240K5279P041Q543J9174r464k7012M561J5658p284j087J5540j247q675
$$ y = [-18350, -13090, -11578, -4618, 7021, 5560, -1546, -10992, -24032, -21616, -7099, -180, 5920, 11783, 833, -6270, 4217, 5454, -273, 11740, 18562, 7570, 14135, 28038, 13874, 1018, 10029, 6486, -3637, 8772, 11949, -7665, -9609, -1824, -11964, -14124, -3729, -12698, -21613, -8530, -5617, -14852, -8350, -5544, -15242, -2825, 16357, 6628, -2031, 6172, -3676, -11614, 13597, 24003, 3806, 5431, 16435, -2183, -9432, 9576, -37, -23512, -7961, 11767, -2644, -5480, 7440, -11996, -32608, -11133, 5264, -9636, -8079, 10273, 5613, -470, 17250, 19113, -7571, -16159, 3535, 13248, 16133, 31328, 31938, 3398, -14337, -4825, -4899, -15340, -5130, 11026, 4272, -1473, 7423, -5811, -36517, -33277, -7998, -957, 7586, 26760, 17296, -9716, -5155, 10503, 3219, 2132, 17672, 16425, 7750]
328G750J2561K996k4872j3809N447k78K325J3270m944j9999m638N773K233M945
342a1240N470n756m039P953O562J06K430J646K78Q335O896p204j0185m135L94
357b489R025J4886J547j3316j2733o453q47N522Q536J081l210K596L920k987p197
372b119o327l433M706J3032J1467j532j0884q141l098o68M701N708m167m411P294
387B128M399n304l017k213q418L28J4443M750p854N02K919o281J836R587p536
402B69j2013Q082R420k383L555K764j3870r113J1148Q562m992j007k11j0053k846
417a2688J1653M757n511r82o99p291l617M083J776K166R678Q838m384j1413q434
432a2068l773L119J6340J8813K942r353j1710j0381m962Q172J2541N237J676J09
$$ y = [7750, 20311, 23307, -1565, -15374, -9927, -10205, -7880, 5390, 446, -19553, -24191, -18418, -16185, -11240, -5770, -11526, -15565, -7612, -1050, -944, 1486, 3132, 3410, 11745, 18641, 11437, 1252, -2883, -2489, 6536, 21422, 22969, 9653, -3080, -9533, -10380, -4858, 3678, 4759, 1549, 4145, 8065, 5078, -2119, -8446, -11879, -7173, 5859, 17326, 15794, 4910, -3231, -6329, -6997, -2296, 3412, -755, -5166, 2128, 6527, 1223, -1794, -4007, -12425, -12097, 2346, 7096, -758, -256, 2663, -3618, -1782, 7805, 269, -11744, -3662, 5758, 3375, 6930, 9694, -4176, -13289, -2141, 6421, 1429, 422, 211, -9842, -12688, -1035, 3722, -1789, -2771, -3470, -10761, -14378, -10295, -8519, -6353, 3325, 12163, 7779, -3634, -12068, -15841, -12722, 3618, 22431, 25373, 16020, 4310, -6071, -11033, -2861, 9680, 14917, 16593, 16702]
446A6702r552j0331R94J076j544O604P748o490q568J026J401j285N111J551r979
461e536o686L343K306N808J0795j913j4683m471L602n99N696J4534L640r711m242
476A883K154j519R80P297K545n896l898j931m038O83M560l207q751m943j706m510
492b0297K05Q463M123n507m447O24m0K178O540Q753O398j58n232j486N661N359
508A1137K197O165M457r186j2705k87O263O05J519M504m271j1529q577l137N56
523a2289O141Q039L564j238m528r395p905N346J5224P555q2j940m623p453J86
538c398R475N700l474p284o786j6P697L829l963j044k767j3275n652J2800Q627
553D69k007M059O967o975j2185q26O186P621J0831N828l559o658p389o763M347
$$ y = [16702, 7150, -3181, -2187, -1111, -2655, 3949, 11697, 5207, -3361, -2335, -934, -2219, 2892, 4443, -5536, -12222, -8879, -6573, -765, 10030, 8117, -6566, -11037, -7435, -8034, -2338, 12196, 15836, 6125, 1883, 4037, 2518, 3498, 10795, 13340, 7444, 3546, 1615, -2423, -1740, 2820, -387, -9138, -14081, -15787, -20297, -20092, -11629, -7506, -13013, -17460, -16836, -16876, -14698, -8158, 595, 6993, 6835, 1603, 117, 5778, 11137, 13334, 19499, 23956, 14770, 2065, 1778, 8041, 8646, 10165, 14669, 10398, -1131, -9708, -12845, -12289, -6148, 1891, 5455, 4217, -311, -9706, -17611, -12265, 2959, 10514, 10432, 8492, 3869, -3584, -3398, 6077, 11777, 8303, 1019, -5767, -5783, 1914, 5743, 1780, 736, -2031, -15306, -20958, -8158, 469, -1538, 2521, 9488, 2513, -9672, -10498, -4312, 3309, 14140, 19968, 16409, 9751, 2362, -4401, -54]
568e4J0709j252q717l375q66l535k871M28k61k492j091K868L128n10k899K914
584g876R276R151L731k881p169j458N417N213O156P007p278j7464m570M586m165
599b324o133K198j368p643j246Q04k911p65K27k287M485P896j080J582J3819P661
615A2915n611k003j150m851N309J5374P486k671q369j4048q325O958Q377o50j380
630G361l228q587j843N827K035j305n64k823n5O321N40m277M071L784l396j231
646B630J980n562m902M228M502J06M82m419n989J782K964l094L80J681l285K196
662d320P002k65m343K38l501k946O376L354n082J748P319j837k952J483q596j1636
678a7958O410J2490M506N737j49j6001j1830K517L993N300J1324L165o806k343
$$ y = [-54, 10655, 9403, 686, -2689, -3555, -7090, -9961, -9533, -9794, -12286, -13377, -10509, -7381, -7891, -10790, -7876, 1400, 10551, 14282, 11401, 4232, 2774, 8191, 13404, 19560, 26567, 19289, 1825, -2745, 1841, -2324, -8457, -6259, -7627, -15270, -16516, -15712, -18623, -19388, -19161, -21448, -16963, -9067, -10147, -8565, 5254, 12915, 7304, 5301, 4151, -700, 4609, 19983, 27469, 24798, 16429, 2381, -5944, 1014, 9391, 8741, 7361, 4133, -4454, -6297, -470, 1565, 260, -304, -3127, -3182, 3139, 3679, -598, 3473, 7257, 3861, 2630, 4610, -952, -5854, -1626, 2876, 2982, 3464, -955, -6944, -5162, -2198, -5292, -4912, -3231, -6516, -4320, 2682, 2417, -1926, -1688, -5189, -8135, -1759, 1595, -3487, -1739, 5580, 3743, 791, 2274, -6322, -17958, -11548, 942, 5448, 11185, 11036, -4965, -16795, -14278, -10285, -4985, 6339, 9504, 2698, 355]
692C55r85o518K79P312K813J969O433m86o138j28J488j302J104K78k034K86J398
709F124m83K56k684p328k569M306L31r54L185k926n927M141O111l992o4L399n949
726e023l669J0061M314m283J728J543p539k024N084j040j843M334Q13m136K175
741D95J065n161l8L648j332q88M468L53j403R77j425l044Q50m57j574L419J107
758A060m093o46K801k157r20L343r42l856K889K770n3L916L671l515l086J769
774B951j633q73M977K793k466q79j204l282n69J519j852j14J041j510j30L756
790B525m0m097q99q00k716L355M301o45J84Q26l599k928K130q09k586L825M367
807B394j883l17J356m768l083M662K242k012K351M46l719K86L187j108k693J187
$$ y = [355, -630, -7148, -6869, 443, 3256, 5225, 11658, 11172, 5034, 4906, 6394, 5092, 6196, 6474, 4440, 4726, 6124, 5641, 5897, 3213, -4115, -6684, -2378, -2047, -3001, 184, -2742, -8669, -4528, 1583, -2409, -2473, 926, -5023, -8692, 1369, 5683, 1400, 3128, 4671, -2868, -4892, 192, -848, -2691, 1643, 2456, -1680, 495, 1560, -3601, -3639, 9, -1323, -2211, 2257, 2610, 1207, 2184, 759, -2285, -1435, -1892, -3466, -47, 1060, -3033, -3679, -878, -3035, -3955, -612, -1554, -5410, -2521, 249, 196, 4112, 7783, 4268, 1182, 2951, 1318, 445, 5422, 8215, 5749, 4870, 3666, 384, -185, 1334, -518, -632, 409, -1101, -1231, 2525, 2485, -1612, -2511, -3311, -6027, -2672, 1629, 984, 1168, 1994, -1605, -4533, -2403, -3212, -5798, -1973, 2394, 511, 194, 1550, -3218, -6301, -1639, 603, -1409, 942, 1388, -2331, -2045, 1142, 34, -2659, -1472]
823a472l13j458J541J913q00L48K194J165J18q05k974L03L285K354K443J500l785
840E557m485M32n5j273M75k46k748K12L920j662m192j561k595j582N719O667K81
857B864m40L3l066j539K780J642L89L501K422k027k643l006m105m56M473J765
873B587j568k379n072l834L689M251N94J53k081m625K34M730J964R85K375L04
889B307j268N88J79k752M21L771K017J392J391l110m271J617J791j125K96o28
905B616l036J220M396K08k883l596n075k510L269M214J691Q01m50m296j836m89
921e756j997J063N658L012K352J775m593o937k80K661J342M299L022l165l470
936a014J915p59k890J101K52k505L274N287j194k306R62k921k106L396J628j800
$$ y = [-1472, -1785, -3243, -1702, 211, -589, -241, 1953, 3118, 3236, 2431, -543, -240, 3045, 5399, 7842, 9342, 5557, 1072, 1504, 1449, 176, 651, 405, -2343, -2131, 1789, 127, -4065, -5626, -8221, -9803, -4084, 2583, 2864, 2424, 2457, -609, -2148, 632, 2274, 2663, 6164, 8586, 6559, 3916, 910, -3195, -3651, 822, 2587, 1019, -1360, -6432, -10266, -6577, -2326, -1732, -1579, -3660, -8285, -8051, -3321, -1357, -372, 2003, 2307, 1039, 1627, 1806, -946, -525, 3246, 5263, 6655, 8046, 4936, 665, 2282, 4073, 2948, 3244, 2616, -420, 800, 5196, 5404, 2521, -1075, -6150, -8660, -5391, -1177, 514, 1315, 865, -3431, -5267, -5756, -7753, -6690, -1032, 1980, 4332, 6107, 1514, -5423, -5703, -3042, -1700, 2599, 5621, 2456, -1014, 901, 142, -2748, -1647, -1395, -3900, -626, 4661, 3467, 1161, 2123, -798, -2904, 492, 2120, 320]
952C20J7J377o13L7l48k642j779P55N63P07K122j746k503L222K657j011J667j48
970B654l880P91N231Q59N12K707k323m373Q90Q04m369J39L766p11j47J807l739
987F18n963L51n7l84M604K983l496j062J650l613j359L502R8j376L048R85k326
1004a797N75J052k658O19K805k758j147L019Q01k01L258o19m445m68j56j817L379
1021e58L829l386k432K262k486l259L846J699l858J577K886k199Q66M206j814
1036A179j440L211q61l399L543K822j953K179K157l439k427L98k194j55M172O57
1052D450l37L021j899n667M49K354k180K720M984k736l078J561k960m286L631
1067B7P61n063O15K143m920j647M954j002l064J776p68l090K756M573L45L214
$$ y = [320, 337, 1714, 1101, 1138, 790, -1852, -3631, -2876, -2313, -1606, 516, -1230, -3733, -511, 2146, 1135, 2802, 2654, -1226, -435, 4796, 5655, 6167, 8874, 6551, 2178, 3068, 3872, -497, -358, 3408, 2697, 2550, 4357, 618, -5345, -4994, -5051, -5435, -831, 2152, -1344, -2406, -756, -4369, -5728, -2226, -2128, -3504, -456, 529, -1797, -1222, -170, -2828, -2209, 596, -2162, -3309, -290, 511, 310, 3568, 2949, -1496, -1964, -2120, -3937, -558, 3271, -115, -2547, -285, -2771, -6030, -2184, -485, -4343, -2766, 120, -2079, -1213, 2993, 1179, -261, 2950, 2089, -1310, 2233, 5055, 3102, 5281, 7438, 3999, 1572, 1970, -224, -379, 3793, 4450, 4113, 7134, 5235, -432, 17, 2371, 191, 2911, 7895, 5159, 2081, 3642, 682, -3604, 27, 788, -4275, -3660, -1517, -6437, -8084, -3130, -4132, -7196, -5420, -6188, -9278, -6522, -1949, -1604, 1610]
1083A610J901m344j998K830O11K41M134j25l440L46M99k836O26J89l936l43M319
1100B84q33j177L045j797m662K292K613j865K434L371k661l11K975k606l256M141
1116A987J541l002K200K117m128j041L901r35j314K689j402k792K103J031k827
1131A28Q11J073j945N49J713l509m014N49j133J080O045J552n525j646n65l010
1147g847K593P175J25j334J974j258l113K240J186k378J097K712j186j025J798
1162B759j568k294J162j000k704J689K166k57L201J791m944l128J094J42J760
1177a31N125L2l816j85m02k311J736K228l193j532L259l27k079J970k57l514Q42
1194b555K668j139k73Q16j686M58L328N97k158L57p93k583J249L246k82L58J563
$$ y = [1610, 3511, -833, -2831, -1, 610, 851, 4985, 4860, 1420, 1766, 2265, -571, 55, 244, -3692, -4035, 284, -549, -1726, 1319, -478, -5140, -2848, -235, -2100, 334, 3705, 1044, 733, 3708, 1102, -2154, 1987, 3528, 526, 2726, 4843, 715, -326, 3575, 2640, 1326, 4015, 2613, -179, 1924, 2955, 128, 939, 2012, 67, 616, 2329, -1180, -5194, -4645, -5778, -4698, 1347, 2899, -2626, -4272, -4837, -7847, -5254, 1921, 2046, 712, 2686, 1428, -1685, 555, 1741, -637, 460, 3172, 1986, 961, 2759, 1191, -1103, 59, -941, -3645, -1956, 210, -47, 3154, 4945, 1, -3127, -2033, -1891, -131, 4994, 5026, 1210, 1025, 623, -1688, 48, 2276, -917, -2449, 810, 483, -1596, 374, 117, -3397, -2555, 113, -1026, -1299, -483, -2169, -1711, 1617, 2214, 56, 413, -380, -2963, -1714, 1532, 1250, 1608, 3171]
1211C171j684j741P19j892j065L143J620o80J83l08l006q15J115m65r01O15m12
1228b403N02K888R57l778j114j98j305K686N576J083k017j67j786j441K574J854
1244C911j010q6P08j904p84J896o94k156l03p4j660r6J042K58J105N55j956j104
1262b352N06r18R22K520J418j921o8M41n22M99J062j879j295J118Q23J30K063
1279B547j4k889j405N50n39k6J644J50n0P0m00j153q17r79p93J452J986R15M37
1298F86N32r85j625K28L50M00K222J461m44M94l77k104q55J045o49n84Q01Q31
1316A427j149K82L16j763q66K20L52M34K252N50n57J43j8p70j39J034l40n10K17
1335A115k35r33J79j2j536j245p67q10M80J579J001n9n62q31r71O73P74J523J324
$$ y = [3171, 1487, -254, 465, -1427, -2492, 651, 2271, 1591, 1774, 1466, -1540, -2355, -1240, -1705, -2606, -1991, -2403, -1901, 987, 1944, -1834, -2948, -3146, -4451, -1765, 3811, 4894, 2877, 2710, 924, -517, 2057, 3911, 2901, 2815, 3523, 1619, 835, 2731, 2037, -119, -422, -496, -2156, -2252, -1210, -952, 153, 708, -1248, -2352, -1846, -2764, -1842, 678, 2096, 175, 107, 548, 26, 525, 1587, -292, -1587, -469, 354, 484, 2547, 2533, -356, -1761, -1211, -1750, -1776, -132, 18, -32, 38, -362, -1515, -2332, -3311, -4104, -2652, -666, 249, 686, 1218, 233, -1392, -1164, -814, -414, 1808, 3269, 2825, 3319, 2942, 838, -17, 1028, 379, -205, 596, 1427, 278, 560, 876, -887, -1753, -1533, -1181, -747, 1505, 2055, 1498, 1641, 1623, 853, 714, 1748, 1408, 898, 1115, 880, -53, 126, 114, -1422, -2667, -3434, -4244, -3764, -2185, -1184, -1243, -1805, -2636, -3607, -2934, -2160, -637, 687]
1354F87%k49K9J22k19%M63Nl81O56L74o52K70N34o79J7J12n76k98R72O37l26O14
1377B112j20j329q10o0p28l55N29L86L84O71k73j215p74M3k09J655J886N51m29
1396A915J43R8r71j14k15n30j73J003N88p16j004j622j671m32N33N16M47M87r8
1415a816N3k33J06p88N15O80J335R53O29n00n34J37O2K04J02m42o82R58P1L56
1435A166o4o57r21Q3K08P3j96J82L38J47L92O96o18j595k90J30M75J536L04M9
1455A438Q0o44m82k47k96m37M59J330Q81l73p00j727j348k11Q38K12P21M84l10
1474c32m82L61k97p03K68J342J260J088N13q7j057m72M38r5j70L3r25m56j94m79
1494d46m91r84j134n41K52J21O6L04K78N25J289J052l38n1M90M65P33J530P42
$$ y = [687, 687, 438, 467, 589, 370, 370, 833, 838, 457, 1113, 1487, 835, 1105, 1639, 960, 977, 1089, 513, 215, 1187, 1824, 1498, 2112, 1992, 663, -147, -207, -935, -1290, -761, -375, 9, 680, 407, -808, -1582, -1539, -1748, -93, 1793, 2344, 1915, 2058, 2156, 1185, 1071, 856, 326, 153, 1156, 1744, 1028, 24, -1598, -3269, -3701, -3168, -2652, -2205, -1718, -1816, -1763, -1996, -1890, -2678, -2163, -1483, -148, 805, 1434, 934, 400, 537, 599, 803, 905, 463, -219, 739, 810, 1166, 1102, 445, -476, -393, -185, -112, -308, -126, 212, 359, 751, 1447, 829, -766, -1056, -926, -451, 1085, 1389, 1438, 1518, 874, 392, 145, -151, -588, -129, 1201, 2082, 1709, 1009, -718, -2066, -2277, -1439, -1227, -506, -22, -332, -814, -453, -750, -1453, -1185, 157, 1417, 2505, 3018, 2931, 1874, 1402, 1840, 1745, 1575, 1608, 683, 227, 33, -446, -937, -1921, -3055, -3596, -3344, -3223, -3157, -2853, -2575, -2050, -761, 291, -47, -98, 392, 857, 1590, 3120, 3862]
1513C862j93pj004r89m67k86j064k5P64Q9r58q78r26j674J01R62K40L60P59L55
1533i79j7Q22m36r97P4J151L31J358J605l38q53o21j111o18R90N48j08P67L43
1552A911j438j164J65m74r39J096O29m75J87M39n67O93K06o21j97R25q3M35J679
1571B407L99q53k78Oj318K49L48n46J10R17q12r57L47j139j133P96Q02m85J012
1590a28R18n62j25R45o43o25J257j34p82Q82P77j207l10q5k211j206O67J5j7J041
1610a533J78j632r9M97p66P02K433l99O0J238M21l17J096M49j080k28J79n26L50
1629A023J788n95o32k19j526j885J295R74p6R49Q68j702n09J028o61n04J727J16
1647A459j503J151J010j674K88K88j736p43J708l81o81J208L05j528R04K08j482
$$ y = [3862, 3669, 3662, 2658, 1669, 1202, 916, -148, -173, 591, 680, -278, -1156, -2082, -3756, -3655, -2693, -2453, -2093, -1334, -979, -996, -174, -610, -1607, -1533, -382, -51, 1307, 2912, 2574, 1721, 1100, -11, -629, 361, 909, 801, 1568, 1911, 473, -691, -526, -1000, -1939, -843, -214, -689, -502, -63, -630, 63, 269, -352, -549, 376, 293, 728, 2407, 2806, 1953, 1675, 1681, 363, 612, 960, 414, 524, 1441, 629, -328, 19, -1120, -2253, -1457, -655, -1140, -128, 790, 228, 103, 1048, 405, -220, 1037, 903, 121, 1003, 1780, 573, 263, 178, -2033, -3239, -2572, -2557, -2574, -1533, -1355, -2987, -3086, -2589, -3355, -2653, -220, -619, -559, 679, 1100, 783, 1879, 2328, 1248, 1020, 1199, 673, 1023, 2811, 2216, 1584, 1365, -161, -2046, -751, 223, 147, 1096, 1964, 262, -247, 781, 120, -384, 1343, 1459, -44, 1107, 2117, 443, 731, 1019, -717, -1460, 248, -133, -814, 394, 699, -829, 75, 283, -1199]
1664a199J71J114p11J04J633m72j281M90n88j364Q99M09m15M52J291j405n65J304
1682a33n34o57J312N20j263O98J366p93K20J657j999j815Q08k78K58J884N93j817
1700B7k88p4r61J09K050O7m74J249l06p96Q75pj596K62P44j178K71J405q89j391
1720i01R08j191j680J547Q65q64J124J350k010r44K023j85q03J865k32j349O29
1737A52J010j179j09P61j638o41J338k11o15R71J56j022Q65J072j102LO58j274
1755h05M60K282l10m84N00j026k197M86O02l79P44J029j107q01K79l52q91J412
1773e58O74r47R81J142r84M20J538j252j579Q21N78j10J562P45j576r62q5j546
1791a138K24J827m16p90P92k2j685J130J49j275K55Q83j019m7J452o86n82R16
$$ y = [-1199, -1028, 86, -625, -521, 1112, 640, -641, -151, -739, -2103, -1204, -795, -1210, -758, 533, -872, -1437, -133, -667, -1324, -12, 508, -755, -57, 1309, 516, 736, 2393, 394, -1421, -613, -891, -633, 1251, 1844, 27, -261, -335, -1296, -1187, 863, 930, 456, 1705, 1399, 603, 1478, 1471, -125, 137, 881, -297, -26, 1379, 490, -901, 7, -1184, -2864, -1317, -452, -1316, -192, 1158, -852, -1796, 227, 42, -761, 1104, 872, -477, 152, 1162, -17, -126, 635, -1003, -1644, -306, -517, -1132, -161, -5, -1027, -162, 910, -192, -189, 469, -805, -345, 1937, 1627, 1143, 1643, 617, -1580, -1094, -492, -871, -127, 902, -205, -1006, -727, -1079, -1970, -558, 116, -831, 150, 1292, 308, 728, 2266, 1014, -565, 256, 834, 724, 2286, 3031, 1455, 493, 408, -1138, -914, 913, 497, -293, 499, 477, -1208, -78, 71, -1204, -949, -66, -1085, -1132, 320, -366, -948, -32]
1809c2j97j296N77J010m55J18J282o50m55R36l45j349R75J14j165Q99J031q99
1827I9m02J00j111q86J123K39j53J201J06j138N67P33p26K97J186o60l6J568k27
1846A880o30N03m40j891K04R92q06L91Q54r68j216O58k32o89Q29J108o58J94J238
1865A321p72O3R45o47j366Q47J44p52M94N98r63q46J37j217j88Q48k66j35J361
1884c94n19l55O51L67j139M37J062m64L47J279P8r24O66k44j102N75J030q59Q0
1903E72J228q87l40O11j39j102O40K40o71N17Q93r69l92J95j000p30P92L56n09
1922f95O36L61p87K74M77j071K51J032n28L2J291n8q06J01K57j552l64Q50o86
1941i85K47J099o63r51j76Rj010M78R82k82J58J084j97n66R10k40n53P95L68K9
$$ y = [-32, -229, -1525, -948, 62, -393, -275, 1007, 357, -98, 838, 493, -856, 119, 233, -932, -33, 998, 99, -303, -203, -1314, -2200, -1077, -838, -991, 210, 316, -822, -255, 478, -248, 49, 1235, 575, 539, 2107, 1880, 1250, 1753, 1313, -578, -374, 618, -188, 203, 1057, 89, -1127, -469, -701, -1390, -561, 547, -111, 83, 1321, 549, 612, 1557, 910, -456, 391, 535, -217, 277, 875, -88, -934, -797, -2014, -2202, -1354, -1620, -1755, -394, -913, -1268, -617, -250, -1389, -952, 110, -354, -7, 1272, 1350, 426, 1092, 848, -254, 321, 1351, 492, 572, 1800, 913, 573, 1184, 1045, -57, 583, 823, 152, 669, 1562, 593, 201, 396, -604, -1334, -542, -186, -695, -59, 302, -485, -211, 266, -805, -554, 478, -50, -18, 1273, 1215, 409, 510, 767, -785, -1149, -299, -985, -738, 361, -302, -1253, -1429, -1420, -2430, -1952, -970, -1252, -1094, -10, -207, -773, 137, -103, -656, 139, 507, 536]
1961E36N09K31o00k84K96m58m51Q51N0q04Q74M28j132L15L76p88J82Q39o01r8
1981B71Q81Oo48J90J52r98J03M66l08L7N99j58n64O74j08j009J06N49p89M00J159
2002A011j103J28j16j049n54L57M31o11R33q1m72K22L01p54j91J276J73k15J519
2021A205j59n27J4R7q83J61O37p32l70R64o89q08K48k55p84O31M64p6N54L71k47
2042a84J54R65k40k23L10Q01n74O19O69j023k03L49n68q66L50Jn50M04K41o73
2062b41L26L1r41l22N77J18j64R52J14p07K92l88n35J31N54o4J50N29m70m70K06
2083c22R7m41J5L91k93M42L92j81k87K91q02m29N56M01j99N26J51q90K18L30m18
2104d52J77Q31j20l0O00j28k88N17J37o66P1R0l94q5N41k90m96o0k42n15k02O72
$$ y = [536, 1045, 1276, 676, 392, 688, 230, -221, 630, 680, -124, 750, 1178, 46, 361, 737, -51, 131, 970, 369, 271, 1152, 1158, 510, 700, 852, -146, -43, 423, 115, 152, 751, 593, 29, 703, 595, -414, -308, 241, -548, -148, 1011, -92, 36, -80, -1129, -1683, -1326, -895, -1506, -573, -654, -1126, -904, -603, -1357, -1548, -272, -99, -314, 1205, 1046, 519, 533, 630, -253, -92, 545, -187, -557, 407, -282, -1090, -842, -1097, -1881, -1250, -786, -862, -308, 63, -184, -30, 935, 695, 472, 782, 1583, 1009, 1628, 2297, 1274, 1071, 1420, 852, -14, 336, 337, -213, 191, 432, -241, 85, 116, -825, -1147, -570, -452, -616, 336, 450, -257, 35, -353, -888, -757, -203, -267, -117, 412, -58, -528, -322, -225, -666, -651, -260, -553, -111, 281, 100, -187, 104, -698, -1127, -571, -170, -369, 157, 308, -582, -364, -34, -452, -275, 556, 436, 406, 1006, 878, 590, 1107, 1244, 578, 649, 739, 345, 260, 801, 511, 15, -45, -287, -802, -1004, -332]
2126c32j73Q3P52k70JJ11k00l18M76J32J25M90j38n53k52p6n17k61K61j56m61
2147a276O72o4r0Q4J29n39o2N28j7L64J024n2k68j03r5m18J81O24p0K99j22k73
2169D56l25J68k08j37M36k7l62O3Q07K89m47J53o97n23Q4L62M3M73l3m53k63J14
2191b7o31l96O75P2J76L21m9k50J0J11k28k15M56m5R6K89k40j41p9K4k02r0J41
2214b22j22j59N06k1m9K58o42j91K93J11J77M62l4l67O1m72k40J83J74J29j64
2235c29K30L13r7J46Q8O4k47j50L75K63L81J23q1k37p97n10L4P7L83k50Pl29k34
2258g77k08K09n5K43q3P8L56O83j9K54J02k62j28p3K27m3K16j06m39k24o18q7
2280g54k8q3jL37O8J10k05J23J62N3j44O2L74L19K45Q1j93q2k90K11k90P5j52
$$ y = [-332, -505, -422, 330, 60, 61, 172, -28, -346, 130, 262, 387, 877, 739, 186, -66, -142, -659, -920, -659, -815, -1276, -604, -668, -758, -674, -545, -1084, -1146, -618, -635, -271, 753, 701, 433, 330, 235, -183, -2, 622, 552, 851, 729, 456, 131, 299, 91, -46, 390, 363, 1, 64, 871, 1160, 713, 866, 169, -354, -270, 92, 135, 608, 575, 122, -141, -27, -658, -1054, -379, -307, -131, 190, 141, -109, -99, 12, -216, -431, 25, -20, 76, 365, 125, -16, -95, -71, -273, -363, -222, -344, -503, 3, -18, -67, 191, -451, -642, -349, -238, -61, 401, 367, 0, 61, -411, -651, -468, -294, -165, -329, -99, 214, 117, 263, 351, 415, 168, 18, 393, 656, 1037, 1160, 1079, 842, 45, -465, -431, -354, 29, -221, -214, -543, -777, -985, -776, -831, -588, -671, -593, -237, 446, 427, 681, 783, 521, 393, 320, 547, 504, 720, 614, 175, -49, -667, -754, -782, -865, -866, -529, -461, -351, -556, -433, -271, -218, -362, -300, 74, 393, 638, 719, 526, 444, 154, 365, 75, 150, -2]
2303bl36J78K24R0j86l21k58o7J53R2M92O11k27o4m07k88K79J56L02K99l19J96
2325E97k23j12M41l10l62j03N1r2L45L67k39k39m45j00m58M75K16j07j67k8l84
2346h77J9K23L00l68L60J17K11J57R7j40M26j98m32J8J0K59O4q0k27l37j10L14
2368a94m76j59L80J19L9L88j7J21J21j15p3Q2L17N58k59j0J20p06q5R8m68K32
2390A3K09k10k47K64n8L7j02J05j95j05L80K30L41J62j81o46N2K5J01P3p5k22
2412d9k38j22l21J9K19l90k55L51L38J11K25L51m21p6M6M5J43J97L57k5qm6k79
2435A72JJ03p30L41j83M79P0%j3J2l21oq5j18M92j68N6K32l19J7j04K22n05K08
2459a47K15Q3J41K49j34k89Jr8J1o4N26k54o4m9k33l77J46j99j68K66j32r5L03
$$ y = [-2, -338, -160, 64, 154, -32, -353, -611, -678, -525, -433, 59, 670, 443, 379, -28, -316, -37, 119, 421, 720, 401, 597, 374, 262, 703, 393, 31, -72, -21, -113, 232, 599, 360, 121, -324, -424, -882, -407, -191, -298, -465, -493, -877, -858, -635, -335, -703, -343, -226, -15, 142, 239, 99, 525, 327, -105, -87, -77, 182, 246, 166, -61, -398, -508, -194, -670, -829, -449, -330, -291, 97, 80, 201, 322, 207, 134, 216, 533, 1091, 832, 822, 942, 236, 151, 249, -219, 13, 222, 12, -235, 29, -29, 8, -94, 11, -184, -289, 91, 321, 662, 824, 643, -3, 49, 74, 175, 248, 173, -49, -287, -409, -730, -711, -492, -882, -1137, -786, -448, -337, -112, 239, -182, -258, -212, -167, -24, 173, 530, 505, 497, 451, 172, 173, 276, -454, -113, -296, 183, 253, 253, 240, 252, -69, -75, -160, -278, 214, 46, 102, 334, 15, 32, -72, 150, -355, -147, 68, 151, 292, 541, 407, 118, 119, 21, 32, -32, 494, 240, 176, 127, -106, -483, -337, -536, -704, -438, -570, -665, -362]
2482c62m4l52P6L70l1K8J84M52J33J0J70l89Q5K99m91j95N72m22J4k25l1k12K13
2505a48n2l92N40K52K0m6K33K5k42M60l46j82K55L96j93o5J10k24m96J41k32l08
2527d94O22k37k9r1M03n10K44j87j46J02M52j6k74L52l02k97M3R5l69J33L15k06
2549c97j25M47q6j50k4k74J48M48M01R7j23K40n09j14Rj05o2J92mp9n1J30l78
2572c69K71J11J64k24M14K7j82O54r3m06J40j9j39O8J41j6m04O0J87m08K34j54
2594E7o3K4K74k63J68J4J7n21L85P6m74L49K0j51l16K31j06kl2j92l33K05M24
2617b09k25K31K51k67l64L84l6M2M64J15k56K88k16j92J04l5o01L70K07m60M53
2638D8K10j77k30M56m63o8N29L73k88K79K29J8p41N47l26k46K62j93l67O4L22
$$ y = [-362, -406, -758, -682, -312, -343, -315, -131, 321, 454, 464, 634, 245, 330, 629, 138, -57, 515, 93, 107, -118, -149, -361, -148, -200, -592, -52, 200, 220, 174, 407, 432, 190, 650, 304, 122, 377, 773, 580, 515, 625, 401, -95, 46, -186, -494, 128, -109, -138, -229, 174, -336, -92, -279, -425, -323, 129, 113, -161, 191, -111, -408, -365, -270, -639, -506, -191, -397, -522, -75, -161, -311, -335, -609, -461, -13, 388, 485, 362, 602, 93, -21, -12, -117, -179, 13, 9, -70, -121, 9, -369, -98, 13, 177, -47, 367, 394, 212, 866, 773, 367, 507, 488, 349, 417, 558, 542, 138, 198, 385, -23, 211, 57, -6, 18, 292, 29, 197, 211, 228, -293, 92, 168, -306, 43, 63, -88, -404, -173, -279, -281, -313, -505, -838, -633, -209, -434, -203, 48, -219, -583, -199, -235, -193, 271, 386, 130, 418, 202, 10, 114, 79, -522, -152, 55, -405, 48, 258, 81, -149, 307, -156, -224, 305, 678, 390, 669, 898, 916, 175, 722, 396, 150, 412, 219, -148, -84, 238]
2659B38m99l57M36l12O2K32M21o90N49J52n15L41K03j07j06L23l27M2k6J29o00
2680d11K39k19m74M27J83l13M9M24m34m38O45OK39J14M64n49K13M33m05o3J44
2701B74nk74k0K60p5L33J32n99n2J85k34J67L07J69l09Q9Pn06P8L99m23J37J38
2724A78j73k42L78O0n90K41j12j16K86L0Q1K17Ml41j27l3k8kJ81K7l06K9K83l33
2748d08n6K23m84L69L63O5K6k40J33k58L59M02n77K02J43l8k60L50M3n88K96j23
2770e8o7k14K09K34oM13l33k20K54J82j52J63L98l71M2K00m40J21L6k11n39K85
2792g4%l12M08O6k15n6k46J33j21O41N2j71K69l0n48M28o8j42j59L52r5j99k0
2815a07J48n50K59rm73K09L6J54L13O4m64K25J22K10k72J6M17k86J03J72m56K98
$$ y = [238, -261, -618, -182, -494, -432, -200, 221, -469, 80, 232, -283, 58, 261, 154, 48, 371, 44, 86, 60, 189, -411, -172, -391, -865, -438, -255, -568, -519, -95, -529, -967, -322, -316, -77, 37, 501, -48, 165, 598, 193, 130, 274, 269, -5, -25, 235, 160, 493, 625, 26, -26, 159, -75, 92, 399, 568, 259, 348, 355, -151, -73, 326, -97, 40, 178, 5, -237, 141, 201, -389, -148, -260, -376, -90, -60, 21, 238, 242, -99, -226, -259, -287, -289, -108, -81, -387, -358, -75, -408, -464, -241, -725, -356, 7, 72, 98, -142, -9, -267, 92, 494, -83, 119, 262, 224, -36, 314, 357, -231, 65, -58, -125, -339, -130, 104, 98, 511, 178, -42, 212, 394, 242, 405, 803, 432, 474, 674, 234, 355, 391, 180, -359, -74, -74, -386, 22, 88, -127, -183, -429, -296, -417, 224, 276, 105, 374, 344, -204, 224, 156, 14, -145, 207, 112, -87, -107, 41, -509, -250, -259, -732, -523, -487, -333, -20, 44, -420, -195, -73, 137, -135, -119, 298, 12, 115, 287, -169, 129]
2837A29j02r4j73K78K6j8K60p5l41J09J61j23J22J93L6k89M68j12m47J91o6k55
2859a22n5N15j53K00j57k55J74k09L28m61M68K27m53Q9k73k34O0J85k40r0r9K7
2881e28J6j41L40R0Jk09M6J00J15M53j62L1K44l54q5L65m60L3K23k19j63L62l33
2904b35K42k26M3j52Q3K48Q2j98M16J22j77n2J94P1J14K5j03j9J95l29r7K28o25
2927a50j70K66J42l08J36J9l55L9J80J98j28M66l45L1J64k49j17O6J92m64P0K96
2949b1k10j04J20O2k09n5J07j69J22M06k0k42J24j2N7j2J5j41Q4J32j12K66p9
2972A09J15k08r5L28n17M90j29q3M04l4j28j31N5K43k19J65n3j02j04Jp5l2j09
2995a09j04K03J02j65P9k8j21p3L09J04J19p4k56J40n1j07o5k42K76j24m9O2k
$$ y = [129, 27, -67, -240, 38, 64, 46, 306, 231, -110, -1, 160, 37, 159, 352, 388, 99, 567, 455, 8, 199, 133, -122, -177, 338, 185, 385, 228, -27, 147, -62, 266, -195, 273, 500, 47, 136, -137, -371, -311, -126, -366, -456, -555, -528, -512, -653, -313, -223, -222, -431, -385, -285, -170, 283, 121, 152, 396, 42, -43, 322, -138, -105, 118, -101, -264, 98, -235, 7, -219, -176, -328, -245, 3, 85, -113, 303, 425, 248, 196, 390, 461, 575, 600, 497, 478, 673, 344, 247, 475, -150, -320, -54, 88, -220, -84, -65, -420, -381, -201, -3, -131, 335, -10, 21, 185, -64, -181, -115, 77, -387, -317, -21, -231, -335, -215, -153, -362, -417, -310, -479, -357, 49, 29, -213, -89, -101, -44, -56, -41, -182, -98, 34, -78, 188, 109, 224, 16, -79, 249, -268, 222, 93, 10, 414, 380, 252, 121, 176, 419, 200, 365, 312, 210, 106, 107, 32, 0, -109, -213, -10, 92, -73, 6, -22, -143, -216, 93, 197, 316, 242, -14, 126, 75, -32, -97, -339, -63, -187, -236, -174, -176]
3018a76q1K21K35k90o5J37q5K2L40l00j5J66J86o72L54K32m92Q5P3q8j2j23M14
3041F6l05K5J33k06J37L06K77k0p7J42j56j64K23j52p8L74m65L55l23K03k89j68
3063a62l8k39N34j57n0Q5J53Rl27M54l01k36N35j43J08q7m6n5J33j51m58J93K92
3086D6p4p5k95J84l96M70k92j7K94J74p4k8K22nj55n7J16k40L3K89Q8j55K04j6
3110B41j04P7J05k34J84j5J43k37N42o87m6L36l63JK65l21O2P6j82J47k4K51j99
$$ y = [-176, -257, -36, 199, -91, -156, -19, -104, -82, 258, -42, -57, 109, 295, -377, -23, 209, -283, -198, -125, -213, -225, -348, 66, -239, -214, -81, -287, -150, 156, 433, 413, 336, 478, 322, 158, 381, 229, 151, 525, 60, 415, 92, 295, 6, -162, -200, -439, 95, -62, -112, -27, 126, 135, -192, 262, -39, -275, 260, 117, 225, 138, 92, 37, 170, 19, -439, -246, 46, -28, -103, -398, -214, -610, -140, -432, -449, -155, 19, -55, -83, 139, 134, -21, -78, 38, -202, -169, 120, 208, 53, 257, 241, 137, 214, 319, 85, 269, 254, 397, 160, 702, 15, -31, 305, -58, -57, 208, -113, -51, 25, -157, -10, -34, 217, 18]
$$ [...]
8191a33
##END NTUPLES=NMR FID
##END=
