##TITLE=1H_LR-758-R4-S3-CR8
 CDCl3
 8 sc, 
 28.11.2023
##JCAMPDX= 6.0         $$ Bruker NMR JCAMP-DX V2.0
##DATA TYPE= NMR FID
##DATA CLASS= NTUPLES
##ORIGIN= UXNMR, Bruker Analytische Messtechnik GmbH
##OWNER= root
$$ XWIN-NMR		Version 3.5
$$ Tue Nov 28 16:14:09 2023 Russian Standard Time (UT+4h)  she@DPX200
##.OBSERVE FREQUENCY= 200.1313
##.OBSERVE NUCLEUS= ^1H
##.DELAY= (6, 6)
##.ACQUISITION MODE= SIMULTANEOUS
##.ACQUISITION SCHEME= undefined
##.AVERAGES= 8
##.DIGITISER RES= 18
##SPECTROMETER/DATA SYSTEM= spect
##.PULSE SEQUENCE= zg30
##.SOLVENT NAME= CDCl3
##.SHIFT REFERENCE= (INTERNAL, CDCl3, 0, 15.7039)
##AUDIT TRAIL= $$ (NUMBER, WHEN, WHO, WHERE, WHAT)
$$ ##TITLE= Audit trail, XWIN-NMR		Version 3.5
$$ ##JCAMPDX= 5.01
$$ ##ORIGIN= Bruker BioSpin GmbH
$$ ##OWNER= she
$$ F:/spectra/data/she/nmr/H-F/1/audita.txt
$$ ##AUDIT TRAIL=  $$ (NUMBER, WHEN, WHO, WHERE, WHAT)
(   1,<2023-11-28 16:12:44.37 +0400>,<she>,<DPX200>,
      <created by zg, POWCHK disabled, PULCHK disabled
       configuration hash MD5:
       00 E9 B6 7A A2 85 ED C7 34 08 36 98 17 FE 4E 26
       data hash MD5: 16K
       34 90 EE 66 74 38 D2 18 0F 88 F4 91 21 3E D0 91>)
$$ ##END=
$$ 
$$ hash MD5
$$ 58 CB 68 90 EC 09 20 CF 94 46 E4 7E 88 49 B2 13
##$RELAX= 
##$RELAX= 
##$RELAX= 
##$RELAX= 
##$RELAX= 
##$RELAX= 
$$ Bruker specific parameters
$$ --------------------------
##$DU= <F:/spectra>
##$EXPNO= 1
##$NAME= <H-F>
##$PROCNO= 1
##$TYPE= <nmr>
##$USER= <she>
##$AMP= (0..31)
100 100 100 100 100 100 100 100 100 100 100 100 100 100 100 100 100 100 
100 100 100 100 100 100 100 100 100 100 100 100 100 100 
##$AQSEQ= 0
##$AQ_mod= 1
##$AUNM= <au_zg>
##$AUTOPOS= <>
##$BF1= 200.13
##$BF2= 200.13
##$BF3= 200.13
##$BF4= 200.13
##$BF5= 200.13
##$BF6= 200.13
##$BF7= 200.13
##$BF8= 200.13
##$BYTORDA= 1
##$CFDGTYP= 0
##$CFRGTYP= 5
##$CHEMSTR= <none>
##$CNST= (0..31)
1 1 145 1 1 1 1 1 1 1 1 1 1 1 1 1 1 1 1 1 1 1 1 1 1 1 1 1 1 1 1 1 
##$CPDPRG= <>
##$CPDPRG1= <>
##$CPDPRG2= <>
##$CPDPRG3= <>
##$CPDPRG4= <mlev>
##$CPDPRG5= <mlev>
##$CPDPRG6= <mlev>
##$CPDPRG7= <mlev>
##$CPDPRG8= <mlev>
##$CPDPRGB= <>
##$CPDPRGT= <>
##$D= (0..31)
0 1.2 0 0 0 0 0 0 0 0.06 0 0.03 0 0 0 0 0.0002 0 0 0 0 0 0 0 0 0 0 0 0 
0 0 0 
##$DATE= 1701173563
##$DBL= (0..7)
120 120 120 120 120 120 120 120 
##$DBP= (0..7)
150 150 150 150 150 150 150 150 
##$DBP07= 0
##$DBPNAM0= <>
##$DBPNAM1= <>
##$DBPNAM2= <>
##$DBPNAM3= <>
##$DBPNAM4= <>
##$DBPNAM5= <>
##$DBPNAM6= <>
##$DBPNAM7= <>
##$DBPOAL= (0..7)
0.5 0.5 0.5 0.5 0.5 0.5 0.5 0.5 
##$DBPOFFS= (0..7)
0 0 0 0 0 0 0 0 
##$DE= 6
##$DECBNUC= <off>
##$DECIM= 32
##$DECNUC= <off>
##$DECSTAT= 4
##$DIGMOD= 1
##$DIGTYP= 9
##$DL= (0..7)
0 120 120 120 120 120 120 120 
##$DP= (0..7)
150 150 150 150 150 150 150 150 
##$DP07= 0
##$DPNAME0= <>
##$DPNAME1= <>
##$DPNAME2= <>
##$DPNAME3= <>
##$DPNAME4= <>
##$DPNAME5= <>
##$DPNAME6= <>
##$DPNAME7= <>
##$DPOAL= (0..7)
0.5 0.5 0.5 0.5 0.5 0.5 0.5 0.5 
##$DPOFFS= (0..7)
0 0 0 0 0 0 0 0 
##$DQDMODE= 0
##$DR= 18
##$DS= 0
##$DSLIST= <SSSSSSSSSSSSSSS>
$$ [...]
##$SUBNAM2= <"">
##$SUBNAM3= <"">
##$SUBNAM4= <"">
##$SUBNAM5= <"">
##$SUBNAM6= <"">
##$SUBNAM7= <"">
##$SUBNAM8= <"">
##$SUBNAM9= <"">
##$SW= 18.0517328524113
##$SWIBOX= (0..15)
0 0 2 0 0 0 0 0 0 0 0 0 0 0 0 0 
##$SW_h= 3612.71676300578
##$TD= 16384
##$TD0= 1
##$TE= 0
##$TE2= 300
##$TE3= 300
##$TEG= 300
##$TL= (0..7)
0 120 120 120 120 120 120 120 
##$TP= (0..7)
150 150 150 150 150 150 150 150 
##$TP07= 0
##$TPNAME0= <>
##$TPNAME1= <>
##$TPNAME2= <>
##$TPNAME3= <>
##$TPNAME4= <>
##$TPNAME5= <>
##$TPNAME6= <>
##$TPNAME7= <>
##$TPOAL= (0..7)
0.5 0.5 0.5 0.5 0.5 0.5 0.5 0.5 
##$TPOFFS= (0..7)
0 0 0 0 0 0 0 0 
##$TUNHIN= 0
##$TUNHOUT= 0
##$TUNXOUT= 0
##$USERA1= <user>
##$USERA2= <user>
##$USERA3= <user>
##$USERA4= <user>
##$USERA5= <user>
##$V9= 5
##$VALIST= <valist>
##$VCLIST= <CCCCCCCCCCCCCCC>
##$VD= 0
##$VDLIST= <DDDDDDDDDDDDDDD>
##$VPLIST= <PPPPPPPPPPPPPPP>
##$VTLIST= <TTTTTTTTTTTTTTT>
##$WBST= 1024
##$WBSW= 4
##$XGAIN= (0..3)
0 0 0 0 
##$XL= 0
##$YL= 0
##$YMAX_a= 159465
##$YMIN_a= -177532
##$ZGOPTNS= <>
##$ZL1= 120
##$ZL2= 120
##$ZL3= 120
##$ZL4= 120
##$ABSF1= 10
##$ABSF2= 0
##$ABSG= 5
##$ABSL= 3
##$ALPHA= 0
##$AQORDER= 0
##$ASSFAC= 0
##$ASSFACI= 0
##$ASSFACX= 0
##$ASSWID= 0
##$AUNMP= <proc_1d>
##$AZFE= 0.1
##$AZFW= 0.1
##$BCFW= 1
##$BC_mod= 2
##$BYTORDP= 1
##$COROFFS= 0
##$CY= 11.3945322036743
##$DATMOD= 1
##$DC= 2
##$DFILT= <>
##$DTYPP= 0
##$F1P= 15.7292609196834
##$F2P= 12.9074282941183
##$FCOR= 0.5
##$FTSIZE= 0
##$FT_mod= 4
##$GAMMA= 1
##$GB= 0.15
##$INTBC= 1
##$INTSCL= 1
##$ISEN= 128
##$LB= 0.24
##$LEV0= 0
##$LPBIN= 0
##$MAXI= 10000
##$MC2= 0
##$MEAN= 0
##$ME_mod= 0
##$MI= 1.114404
##$NCOEF= 0
##$NC_proc= 0
##$NLEV= 6
##$NOISF1= 3.799351
##$NOISF2= 2.8
##$NSP= 1
##$NTH_PI= 0
##$NZP= 0
##$OFFSET= 15.70392
##$PC= 1
##$PHC0= -24590.88
##$PHC1= 13.2527
##$PH_mod= 1
##$PKNL= yes
##$PPARMOD= 0
##$PSCAL= 0
##$PSIGN= 0
##$REVERSE= no
##$SF= 200.130013532006
##$SI= 16384
##$SIGF1= 3
##$SIGF2= 2
##$SINO= 400
##$SIOLD= 16384
##$SREGLST= <1H.CDCl3>
##$SSB= 0
##$STSI= 0
##$STSR= 0
##$SW_p= 3612.71676300578
##$SYMM= 0
##$S_DEV= 0
##$TDeff= 0
##$TDoff= 0
##$TI= <>
##$TILT= no
##$TM1= 0
##$TM2= 0
##$TOPLEV= 0
##$USERP1= <user>
##$USERP2= <user>
##$USERP3= <user>
##$USERP4= <user>
##$USERP5= <user>
##$WDW= 1
##$XDIM= 8192
##$YMAX_p= 0
##$YMIN_p= 0
$$ End of Bruker specific parameters
$$ ---------------------------------
##NTUPLES= NMR FID
##VAR_NAME=  TIME,          FID/REAL,        FID/IMAG
##SYMBOL=    X,             R,               I
##VAR_TYPE=  INDEPENDENT,   DEPENDENT,       DEPENDENT
##VAR_FORM=  AFFN,          ASDF,            ASDF
##VAR_DIM=   8192,          8192,            8192
##UNITS=     SECONDS,       ARBITRARY UNITS, ARBITRARY UNITS
##FACTOR=    0.0002768,     1,               1
##FIRST=     0,             0,               0
##LAST=      2.2672688,     0,               0
##MIN=       0,             -177532,         0
##MAX=       2.2672688,     159465,          0
$$ Real data points
##PAGE= N=1
##DATA TABLE= (X++(R..R)), XYDATA
0 0 0 0 0 0 0 0 0 0 0 0 0 0 0 0 0 0 0 0 2 -8 8 -8 8 -8 8 -12 16 -16 18 -21 24 -27 31 -35 38 -43 49 -53 59 -67
40 -67 74 -81 89 -100 110 -122 132 -148 163 -178 196 -217 239 -263 293 -325 363 -409 460 -525 604
61 604 -706 839 -1024 1291 -1713 2456 -4016 8534 -45279 -177532 26931 112221 -37093
74 -37093 11846 159465 49575 -68723 36264 92156 8781 18284 86792 54304 8807 34529
86 34529 26735 -35512 -43638 18039 38247 -5578 -11241 23222 -18838 -73325 -5892 49747 -31279
99 -31279 -61276 26046 28601 -25542 26812 52121 -36886 -43482 29581 6391 -11266 63571 45446
112 45446 -43363 -1991 52459 -27385 -54174 34484 36857 -27883 -1717 32195 -22727 -58231
124 -58231 -17406 16844 10463 -6320 -16847 -19289 -24924 -23512 6951 26752 1730 -12942 -3179
137 -3179 -14666 -18034 10913 7954 -11682 15249 27280 -15938 -22562 4654 -15772 -27478 16536
150 16536 21359 -14327 -4446 8173 -16933 -5238 24515 -4100 -22466 18029 25155 -2506 19043
163 19043 38911 -1465 -23464 5482 14141 -867 4515 15348 6552 -8240 -16097 -14053 -10378
176 -10378 -18460 -16578 2149 313 -18496 -12834 -4572 -15249 -5708 13723 680 -10620 6563
189 6563 7062 -3427 17992 31297 8258 2405 16470 4309 -3824 17038 20216 6242 13430
202 13430 14759 -6325 -7109 5419 -5199 -10241 5326 3025 -12619 -7868 -524 -9652 -13016 -5113
216 -5113 -6181 -10917 -8663 -4125 -549 1504 1505 3500 2440 -6357 -4611 5525 4962 4325 14122 10188
232 10188 -4547 994 8499 -5023 -8412 5696 -68 -11360 3825 11333 -7333 -10786 1109
245 1109 -7075 -14487 -222 6104 -3808 -185 10613 4016 -5273 -3620 -2899 -5339 529 10673 10377
260 10377 1440 -4613 -3588 -2740 -3933 533 4496 -1729 -4723 3416 5265 -3338 -2049 3204 -1017
275 -1017 -935 7493 4700 -5740 -2470 4711 3305 4147 7524 -1252 -9322 -3995 911 -900 1685 3231
291 3231 -723 -605 3955 335 -7054 -7562 -4735 -1249 6357 10631 3954 -4828 -7574 -6487 -4034 -1235
307 -1235 1261 1873 1559 3178 4581 -11 -7731 -7798 -1597 2654 6957 11335 5162 -4917 -3416 3221
323 3221 1698 130 4545 1829 -3341 1957 6913 -1433 -7259 -1842 75 -1353 2528 2776 -6309
338 -6309 -10085 -1965 3688 2499 1313 -143 -5197 -7264 -2363 1519 -1197 -2642 1947 5351 2720
353 2720 441 -1292 -6478 -7063 3085 11294 9090 5215 3548 -1214 -4079 734 3396 328 809
368 809 4940 5252 2189 -466 -5914 -10448 -7342 -759 2621 2080 -1215 -4778 -5254 -2772 -1182 -559
384 -559 -801 -899 875 3775 4224 1038 -802 209 2286 4143 4386 1403 -2558 -3066 -241 3933 5150
401 5150 1675 -1002 -1332 -2719 -1755 1701 1478 -1222 1422 5483 3252 102 -625 -3800 -6090 -786
417 -786 4684 2499 211 69 -2683 -5390 -4434 -4438 -5383 -4208 -559 1615 439 -2866 -5585 -6783 -5963
434 -5963 -2575 2038 3224 -483 -1044 1023 288 -145 2614 2865 853 2714 5108 3857 3021 4121
450 4121 3667 2503 3512 1662 -1509 -1631 -285 51 1040 938 -2162 -4011 -4978 -5526 -2974 -503 -1600
467 -1600 -2235 1507 2254 -397 2000 4620 2482 1320 5305 6280 5757 7333 8155 5903 3667 1977
483 1977 -258 -743 238 894 1139 266 -2707 -4776 -6258 -8382 -6703 -2992 -4663 -6200 -2712 -1981 -6608
500 -6608 -4391 1367 -912 -4863 -1850 334 -1372 926 5110 4705 2263 -293 -1852 -841 1505
515 1505 2380 3504 5110 3262 -192 -620 -1638 -2812 -853 1206 705 1232 1129 -3347 -4021 489 878
532 878 -1649 -794 18 -2387 -1764 1699 2563 2016 35 -2887 -1888 704 -697 -1832 1643 1420 -2256
549 -2256 -1216 802 -1790 -3303 -843 314 366 1698 743 -43 3795 5530 2748 2222 2484 -415 267
566 267 5833 8611 6406 2892 -947 -2874 -2552 -2166 -921 2053 1343 -2393 -2562 -2189 -6054 -7174 -2774
583 -2774 37 720 2514 514 -2884 -1157 2661 2024 2523 5254 2385 -1049 1996 6275 3812 1515
599 1515 1233 2 -581 -744 -891 -916 -1595 -4117 -3385 -895 -2909 -6473 -5184 -3863 -5027 -4552 -3009
616 -3009 -4525 -3969 -692 529 -156 -449 -2671 -4689 -618 4786 6230 6219 4973 1325 50 782 1560
633 1560 2776 5264 4271 2036 3581 1612 -3388 -3627 -158 -29 280 2297 128 -3312 -2624 -184
649 -184 419 983 836 -1188 -1310 962 2172 2231 1735 160 -623 448 446 109 594 -145 -1588 515 1286
668 1286 -1333 -1846 223 -562 -1901 111 330 -1694 -598 2438 2457 1500 922 -1660 -3304 -1462 1312
685 1312 2396 2990 1067 -1496 -2269 -2197 -2693 -1210 655 95 275 999 -655 -2901 -2226 -1157 -1182 406
703 406 1235 -267 -1148 352 169 853 1130 284 -751 2 1091 1664 2547 1960 202 100 887 -413
721 -413 -464 1240 287 -997 307 576 -1357 -1647 -534 -1698 -2169 -1106 -1203 -1877 -520 1067 284 497
739 497 100 -821 -985 198 1484 2475 2418 1874 1429 707 -741 -301 1273 679 70 1395 1262 -938 -922
758 -922 24 -1009 -1560 86 144 -819 -163 798 233 -192 -165 -801 -1490 -983 -427 -218 208 758 223 -702
778 -702 -1053 -1419 -616 -51 213 575 1274 595 -113 875 666 -374 -164 846 372 752 1432 752 260 19
798 19 -497 -413 -185 -463 -415 462 534 172 387 132 -1030 -373 546 556 -143 502 309 -559 384 1040 -199
819 -199 -1348 -917 -891 -829 -167 434 368 -325 -287 -173 -696 -920 -775 62 1020 1400 1846 1022 -400 -1278 -356
840 -356 131 187 1099 1066 296 356 642 -135 -1024 -741 60 439 1034 1451 290 -806 -711 -362 -350 -398 -697 -867
862 -867 -517 -446 42 -40 -518 -1453 -384 340 -146 -106 256 -56 636 1635 2005 991 640 11 -402 247 1049
883 1049 664 830 431 253 -171 -1094 -1679 -2304 -1535 -973 65 677 -200 -1853 -1907 -1218 -789 -414 569 684
903 684 322 975 1275 156 -779 -306 351 913 1503 1754 1114 -322 -84 300 752 321 89 83 130 189 226
924 226 151 -926 -775 180 -24 -495 -158 -304 -982 -388 774 698 -9 6 -313 -809 75 433 248 585 723
945 723 811 586 74 -1236 -1148 -492 115 1077 1067 431 -502 -386 -481 -257 115 583 545 468 978 946 332 -366
967 -366 -220 -99 325 210 283 30 -435 -752 -928 -1278 -1443 -1909 -1287 -1299 -1114 -594 -817 -1407 -1128 -453 -119
988 -119 -227 573 408 -62 716 1313 1082 903 901 633 219 210 372 541 795 642 642 449 -573 -1156 -789 -696
1010 -696 -561 72 193 -310 -590 -548 -596 -779 245 165 48 512 1020 714 752 1279 800 465 720 1012 1335
1031 1335 1104 1410 926 741 459 -550 -551 -28 -359 -588 -19 -473 -993 -1231 -640 -1066 -1227 -915 -785 -758
1051 -758 -26 -133 -84 305 -167 -502 -567 -214 -270 541 334 334 565 -69 -973 -831 -104 -343 -702 231 362 -296
1073 -296 -335 202 -254 -228 381 431 -15 359 394 294 763 806 573 -301 -186 -559 -269 207 445 218 -158 -498
1095 -498 -817 -565 -665 -954 -302 382 -38 28 433 -230 -509 139 306 144 528 520 376 635 1211 806 427
1116 427 216 315 319 695 961 812 539 231 -739 -417 -87 -399 -584 95 -404 -574 -483 -286 -882 -461 -319
1137 -319 -100 -293 -223 -355 205 641 943 456 515 13 -166 320 686 328 484 595 -180 -147 162 -784 -999
1158 -999 -239 -383 -337 -242 -68 -764 -947 -469 -443 -229 -313 -9 -125 290 282 310 -390 -515 -502 -104 190 445 447
1181 447 241 -285 -336 165 256 -80 398 585 20 65 428 -236 -24 245 192 23 -247 -358 -548 -248 413
1202 413 430 381 -145 -813 -744 -243 -115 445 357 376 -141 -3 240 -642 -274 -148 127 -77 301 -74 -336 -214
1224 -214 8 -66 -61 250 -197 144 695 638 571 104 -92 -236 255 638 181 556 427 -363 -307 79 -148 -330
1246 -330 -24 -129 -148 -161 -60 -598 -111 272 156 -218 -102 -262 -293 71 5 338 235 -173 -377 -87 -116 174
1268 174 323 141 -143 3 92 -37 -363 -100 -41 -56 -7 637 335 199 33 19 -283 -187 130 -218 147 181
1290 181 190 243 -64 -268 -236 -227 76 128 430 233 -100 103 176 162 -224 180 210 11 347 273 -7 165 143 -141
1314 -141 -133 -218 -102 51 124 204 261 -102 -122 -209 -109 -366 -286 9 -216 -88 -147 2 -145 -543 -238 -72 -75 125
1338 125 -21 351 68 41 140 -266 -10 126 -103 23 12 -63 -87 155 -82 -342 -157 -479 -195 142 191 -149
1360 -149 283 154 -58 -63 235 -9 -178 273 104 129 279 -34 81 -320 -193 -322 -209 -142 -58 -58 -39 -82 -473
1383 -473 90 -309 188 296 364 -132 302 253 141 -3 551 250 113 57 42 147 58 387 -98 44 -93 159
1405 159 3 35 -6 -16 -110 -30 -159 -213 -217 -576 -422 -167 -204 -65 199 110 -96 -111 -171 -9 -160 148 -62 376
1429 376 303 146 109 -131 -171 -206 143 -165 188 16 -33 -120 -73 -184 -579 -330 -211 114 -218 41 -295 -328 54
1452 54 -40 150 52 -129 -141 236 359 353 58 204 169 466 262 -129 -138 119 -9 47 180 -38 -13 -227 115 115
1476 115 -175 403 387 135 -25 36 264 -144 -13 61 214 301 259 181 -56 -54 -191 -43 -131 25 63 36 -74 -9
1500 -9 26 -287 -150 -131 329 -170 256 219 6 106 149 146 -111 224 79 14 206 332 71 116 -182 80 71 25
1524 25 101 -174 -182 -52 -166 -48 -227 -580 -401 -118 -239 41 -56 223 27 205 -58 18 -443 -125 -58 321
1546 321 110 353 277 453 -26 21 -72 -166 -181 151 187 156 59 49 -271 -111 2 33 57 44 277 63 -86 -239
1570 -239 135 111 192 184 -141 390 122 -29 310 284 224 96 81 -229 -129 53 -3 -9 -41 -72 127 94 -2 -213 -225
1595 -225 131 -39 -187 16 265 245 -31 19 215 -99 25 204 138 270 94 148 69 -55 -172 111 379 -347
1617 -347 18 -320 -337 38 -70 -64 -125 156 -87 -169 19 -226 -247 0 -3 62 394 20 146 196 139 -74 158 -129
1641 -129 -244 -91 116 122 111 13 10 4 42 -60 -19 -285 90 285 -142 152 -2 48 99 279 -67 -237 86 6
1665 6 149 106 242 -9 271 -160 -106 164 58 -43 -21 81 -87 -105 116 37 -429 62 51 -28 -71 241 50
1688 50 -149 37 -121 -195 -271 -254 -172 192 48 259 86 -328 228 -89 -230 285 340 366 156 -46 114 132 -77
1711 -77 201 -150 180 125 -46 60 19 -247 54 -252 123 -114 -33 94 115 337 3 149 60 -201 -87 134
1733 134 162 -96 147 -2 -110 282 57 -35 95 101 19 93 -16 11 67 -214 397 19 132 -134 55 75 106
1756 106 91 -94 -126 -9 -403 -26 195 59 274 -107 149 399 -282 -195 -33 -44 18 -281 120 -74 -137 113
1778 113 -59 -182 -35 -105 -167 253 -36 241 35 51 -29 -50 -63 118 -81 -41 66 48 84 19 45 -51 -16 -94 73
1803 73 81 -37 89 10 -111 18 90 -56 -14 -183 37 -86 40 78 -112 -240 -129 -147 40 79 -14 -34 54 76
1827 76 99 -143 24 45 -18 -71 49 105 62 5 -172 -32 -6 200 43 -130 -346 -15 -228 -27 56 -73 -162 24
1851 24 39 -124 65 -78 183 106 -50 -126 -2 107 51 -111 -206 208 58 -266 186 160 -192 -46 -188 10
1873 10 -117 -47 -286 180 -161 -188 -22 161 142 48 24 -120 193 24 -54 -109 -76 -170 84 65 -73 -27 -181 -72
1897 -72 14 -110 115 211 -128 16 27 -250 -32 -31 -80 -30 -220 307 -9 -32 26 -119 18 -36 -122 187 -139 0
1921 0 -79 -281 -6 -19 -115 -3 -184 -122 -60 206 -335 196 -80 -411 37 -151 -26 -411 -125 87 -119 43
1943 43 30 -241 59 72 -105 82 264 60 10 66 -4 -12 -212 -324 55 -48 51 -139 -317 170 -240 -141 150
1966 150 213 68 -37 -152 -267 80 -60 -83 -6 190 -39 291 53 -61 418 -180 -171 92 188 -26 -215 -84
1988 -84 62 185 -123 -28 -14 147 -101 -85 79 -347 106 78 42 138 102 147 243 -3 -109 -9 -39 -98 19 11 -138
2013 -138 101 294 -114 158 -56 -89 -120 -54 -147 43 -133 125 233 -8 165 161 155 4 -59 77 -37 -22 -34 -63
2037 -63 181 -65 -86 145 -6 176 63 -136 -249 -113 51 -181 174 264 315 2 -82 -138 243 -89 -208 -29
2059 -29 -92 230 -109 -152 113 -126 91 50 -23 118 -46 -167 13 -20 20 99 13 -21 5 -218 -459 -115 46 20
2083 20 -70 52 -308 -51 106 36 91 -83 7 -56 -210 67 -10 100 37 141 -208 161 152 -34 217 351 -55
2106 -55 -120 -47 205 -57 36 16 -127 226 -28 78 29 76 -113 161 42 288 170 -78 -286 75 289 224 197
2129 197 -104 -51 -56 73 20 82 12 -257 -63 -390 22 -94 -206 51 -35 -130 -68 54 126 30 55 291 -79 293
2153 293 55 51 -42 85 -11 7 56 -58 117 -242 -93 -135 99 9 -132 -170 -24 101 110 30 -180 -37 -223 14
2177 14 178 -207 -55 -129 45 -136 -129 182 113 -135 206 19 -149 -17 157 155 149 -296 -100 -62 258 -17 23 92
2201 92 34 97 -29 82 -87 7 97 90 -57 -55 -251 77 -226 -97 -179 113 162 -187 51 -5 150 79 -78 -41 -79
2226 -79 -1 -9 -54 -260 -31 -19 -116 148 -39 -3 126 187 281 225 129 -180 -47 -107 -16 78 216 76 82 -8 -173 274
2252 274 -41 -42 54 101 -143 -108 -146 116 -97 -146 -135 109 28 131 110 -264 62 94 268 19 230 219 -66 74
2276 74 2 -69 81 302 67 164 -27 31 146 -101 -80 26 -68 133 -49 -29 303 52 250 -17 -38 79 -45
2299 -45 100 -111 -121 61 61 81 3 -79 -109 31 33 -172 91 -80 -142 -126 116 7 -304 355 173 -193 172 -69
2323 -69 -233 36 42 -105 -69 -62 -17 -60 137 259 5 170 -44 144 -128 -217 39 61 49 -35 53 -46 155 -218 -30
2348 -30 93 91 83 186 34 -34 -235 -195 148 153 294 -232 -174 -159 -261 -81 -162 -62 -26 -9 183 -23 28 -18 -36 78
2374 78 162 -42 -20 68 -48 -255 13 -121 96 41 -113 292 111 -165 -82 -261 -116 -111 105 -67 -53 -190 -49
2397 -49 -77 -116 76 162 272 -88 34 289 14 -60 105 90 116 -109 168 268 75 212 66 180 132 131 34 -326
2421 -326 82 63 235 -54 -59 -20 93 -109 -55 322 -13 434 170 -163 -99 56 -146 -80 -209 108 27 41 268
2444 268 -165 -103 12 -40 60 -64 -28 88 -185 -44 9 -370 -165 47 -262 -84 -199 -162 7 118 169 46
2466 46 133 -104 45 -313 -55 31 235 -73 169 85 59 -13 -123 -27 -142 6 12 -16 -21 -64 -58 -127 73 -88 185
2491 185 24 29 34 -20 -31 -75 7 -2 16 357 311 -69 357 112 122 -27 -97 -204 -166 391 257 47 142 -45 17 130
2517 130 77 -273 82 -41 -30 -288 33 5 -92 273 123 210 83 -198 124 -214 63 109 132 35 -114 104 235
2540 235 145 -19 53 91 -128 25 -51 -229 -101 -230 -60 -7 371 -9 191 -129 -106 194 -71 133 -143 -59
2562 -59 -338 -69 31 50 114 100 175 28 -99 -22 -94 236 220 160 147 -184 -87 -121 148 -32 -107 34 -31 -113 -120 127
2588 127 300 -55 -202 -32 -91 92 -67 -69 -118 -88 143 39 -1 141 -70 -128 -87 85 -91 47 64 65 -162 -76
2612 -76 91 -104 -194 242 -126 45 -50 6 -333 -114 202 109 -76 -90 27 242 175 -54 -230 -104 210 -175
2634 -175 21 -97 237 34 -2 -84 108 59 -14 -85 35 106 3 -19 -58 123 193 180 -83 -187 80 72 -71 -40
2658 -40 -2 121 267 78 -297 -65 -15 -213 -24 -67 -307 110 -310 52 80 -122 5 -165 254 -154 -59 52
2680 52 -55 63 -171 -55 -309 88 -94 -81 -85 60 169 206 10 109 37 106 363 -104 -205 140 -137 11 -145
2703 -145 -189 289 241 -23 -159 -103 -31 -273 189 -320 132 -137 -151 -11 172 41 73 112 41 -241 -58 189 -28
2726 -28 -350 114 1 -12 127 163 34 -125 7 -172 195 -118 32 90 -165 -33 327 29 153 184 39 108
2748 108 -63 -49 -144 45 146 -93 -368 -52 -153 -277 -23 126 -76 87 -207 -92 -86 17 90 -69 174 125
2770 125 71 -35 34 5 255 -97 -7 -123 271 -4 165 -196 32 186 339 197 130 -185 10 -182 64 -289
2792 -289 167 -69 52 -112 -171 116 260 -15 -81 -53 -244 -64 205 -79 94 56 -110 -112 159 346 46 80
2814 80 -21 144 130 41 -25 116 -115 -119 60 326 160 -90 -211 108 -85 82 -51 144 49 -101 140 -61
2836 -61 -134 46 50 -157 -142 -23 -2 -69 -104 -111 135 87 -176 14 72 -144 82 -88 154 -297 104 310 -64 132
2860 132 240 -53 -110 36 22 39 164 1 -157 24 22 -90 165 -100 -93 -51 -139 -242 -116 112 -26 165 -91
2883 -91 -112 143 -463 -107 11 82 48 -50 102 24 -17 65 -129 159 -3 4 36 -93 62 41 81 384 -228 -30
2907 -30 -170 68 -3 -69 0 -137 121 48 -137 -114 -282 391 43 207 218 47 6 -99 65 -168 -92 -40 -77 -15
2931 -15 28 -128 5 165 -37 -233 113 13 -118 157 92 166 -7 -158 34 -182 136 69 158 261 -12 -55
2953 -55 -238 -10 -296 20 -64 226 48 -43 -85 -124 128 5 210 171 21 99 -17 -20 -14 -64 -56 431 183 -142 -41
2978 -41 427 85 -75 -169 180 194 259 75 -183 -61 -40 272 -19 145 -42 -126 -45 -128 -127 143 147 -37 -318 15
3002 15 -25 -354 -401 198 62 -261 76 380 -196 -156 -68 -94 139 -75 232 -232 -267 189 -55 250 142 89 -88
3025 -88 80 191 39 167 110 111 -245 40 -115 -162 -164 265 -33 -165 7 -8 -112 -91 35 8 74 -203 323 29
3049 29 -165 -150 -38 18 178 -179 142 171 -31 252 197 304 69 20 -354 132 3 25 -259 -192 336 7 108
3072 108 -95 -8 296 1 27 2 -46 133 -117 3 -1 -197 -219 -124 216 124 -218 -93 138 144 -96 -34 -87 64
3096 64 -95 -69 165 -99 76 5 8 53 -324 -88 -100 248 145 -9 -97 50 103 112 118 33 -194 84 -15 -161 -101
3121 -101 -67 5 191 107 115 87 128 -34 125 -154 33 -197 -108 -99 -47 -26 236 186 -52 122 72 22 5 144 -175
3146 -175 37 -37 -323 210 -19 31 0 -20 211 -68 136 6 318 166 128 37 79 -110 85 28 153 87 -41
3169 -41 143 65 193 53 161 -100 10 -12 -106 -7 101 365 -102 -259 163 157 -6 66 -292 296 -217 167 -134
3192 -134 -58 -55 -27 56 130 18 6 5 -40 31 -18 -173 -201 188 164 40 -78 -2 -55 116 -181 47 51 42 -30 102 -140
3219 -140 -118 -137 53 -40 192 206 27 60 120 -57 71 -22 -146 -129 32 64 97 -114 -50 -307 -202 170 -109 -25
3243 -25 -176 -118 44 133 39 -120 122 195 -44 8 285 -154 -115 -4 65 -150 68 -87 -56 -19 -164 -151 -166 175
3267 175 -95 44 78 160 238 9 -293 14 171 -64 -193 5 -152 -163 -114 -55 5 87 -182 124 -66 -95 -129
3290 -129 26 -44 24 196 50 -158 129 -152 -75 112 60 -298 -75 -147 223 -219 111 -59 -111 118 -150 -28
3312 -28 -355 -92 139 -43 61 131 188 -23 -162 192 126 156 4 76 42 81 -30 -120 223 33 -141 -168 107
3335 107 -124 254 80 -40 -114 10 125 11 -92 -102 92 195 -165 106 221 145 84 -209 99 27 -8 117
3357 117 155 -82 102 77 162 145 -317 117 -57 -11 57 -46 -83 -150 -7 74 -63 71 20 144 -185 -17 159
3380 159 -39 0 30 44 -115 180 -73 190 29 47 -41 276 -202 -205 61 235 73 72 27 4 -57 -36 -266 -56
3404 -56 67 39 -260 -86 -121 -132 79 39 236 147 -188 -12 -192 66 -114 -54 -63 97 126 -73 43 -10 79 170
3428 170 162 162 28 -14 283 150 224 115 -172 -109 42 -216 40 257 84 -193 184 -225 281 35 -262 -352 -26
3451 -26 -289 220 -174 -152 188 209 57 -39 131 92 -190 316 347 136 267 -79 -5 98 117 -23 -58 226 140
3474 140 -125 -99 -356 101 22 4 -104 -260 64 -197 -42 232 -424 5 -139 80 -39 -273 -120 -65 15 -143
3496 -143 54 -33 72 -237 -155 -194 68 -104 -6 -121 84 -159 58 -149 -533 8 -179 28 10 106 55 92 183
3519 183 48 -142 225 -54 -32 59 -182 83 -179 -60 139 56 111 -144 -86 185 5 -35 181 -28 132 -152
3541 -152 127 102 -31 -24 -193 -149 -2 -62 -94 202 36 132 161 -105 125 69 22 -252 -62 16 -105 248 127 237
3565 237 94 -124 -37 -212 -55 222 176 3 -152 240 -174 166 108 1 -111 98 176 -148 -28 -240 -101
3586 -101 154 -47 130 115 39 -254 246 -256 200 -245 -259 115 129 -51 49 -67 -190 -88 -112 90 6 123
3608 123 -124 -19 125 91 -88 -10 59 68 221 164 36 211 36 -48 -107 -110 68 60 -189 -23 115 -127 -90 289
3632 289 -52 -198 -221 39 -83 0 53 84 -257 -246 6 -64 -160 176 102 204 -91 -81 51 -134 -219 -131 81 -58
3656 -58 10 178 -88 -49 363 -105 164 51 66 196 -21 51 40 -28 191 42 301 139 210 42 -247 2 -35
3679 -35 -48 -92 202 123 70 -7 95 45 -149 -66 -103 -70 134 -100 -40 -73 -71 -46 -98 -13 -73 -238 34 129 -6 -40 -11
3706 -11 179 -25 -24 -81 -160 16 -2 110 89 -236 9 -127 278 -140 -9 -272 -294 0 -20 105 -105 -58 -275
3729 -275 -5 -299 228 217 -24 27 -111 65 8 -76 -55 -326 124 125 -180 52 -245 165 224 -320 209 -30 97
3752 97 249 20 38 -13 -73 -145 234 -182 50 -13 -17 107 -12 -23 -59 87 90 -89 66 -137 146 101 -134 272
3776 272 84 -47 200 51 -165 139 -58 140 -20 164 50 -253 80 -174 43 -189 -20 14 -80 -95 -110
3797 -110 125 5 47 -147 275 0 -150 58 80 -83 107 -97 72 -203 -86 85 330 -112 67 68 272
3818 272 -54 -154 42 72 -80 20 -49 -67 -145 -111 242 -86 -97 219 -110 -116 308 -67 -95 -30 -283 -125 95
3841 95 63 -20 78 143 128 -7 89 -192 -77 133 -100 100 -182 78 199 261 -92 201 88 66 -58 -98 -104 -111 86
3866 86 17 -51 36 24 114 154 -51 60 118 5 -236 -169 91 61 -277 -124 -309 -109 -212 276 42 -198 121
3889 121 -63 -284 81 -33 -145 9 -15 -149 -124 -17 -151 179 -275 -87 -118 -133 130 64 259 -6 -52 -143
3911 -143 -93 -123 -65 77 -12 39 -108 127 -146 -185 15 -20 61 -34 131 158 76 -84 -63 -219 133 -86 2 -21 17
3936 17 192 -111 97 -142 53 -89 -80 20 100 177 -121 13 47 -4 120 86 -346 -136 89 254 -198 155 -47
3959 -47 -103 -210 -135 188 -125 200 -113 -225 -214 7 -98 106 25 15 42 -59 75 164 94 61 136 37 -35 30 -170
3984 -170 -184 -18 -178 46 114 58 -164 -79 65 -78 40 -92 190 -111 -45 -173 -65 375 72 53 -166 -4
4006 -4 51 -76 -71 129 341 111 233 -65 164 -141 75 49 113 -67 -7 154 -284 108 148 135 256 -24 -37 -19
4030 -19 7 64 -23 119 34 -164 -7 264 -83 -132 3 -306 121 46 -123 -184 17 -14 28 -230 -5 190 -90
4053 -90 114 -168 50 -83 -91 286 57 235 -84 51 73 -129 94 -153 -80 -90 31 -7 38 -109 38 -21 -21 -19
4077 -19 -161 -12 12 -92 -235 -122 111 35 85 23 -58 -164 -148 71 37 -234 82 49 69 140 -133 -32 -41 -28 86
4102 86 -101 -20 354 -115 -25 -114 -9 -3 -31 -28 115 -183 270 101 -376 144 -216 -134 -69 -94 -111 -170 -30 40 232
4127 232 38 -110 58 -228 146 -63 -86 89 -56 258 47 -146 11 273 251 -40 -110 -80 -136 -41 39 148
4149 148 -134 -28 -173 -139 -28 -19 259 89 146 -29 80 -98 94 263 131 -376 -5 294 44 247 38
4170 38 40 97 -280 66 -9 25 -66 0 -53 17 302 212 -116 -76 262 -182 -65 109 -94 268 -12 -127 60 -12
4194 -12 -79 -189 281 33 126 232 157 7 -80 -174 71 235 155 212 -111 315 -102 111 137 22 7 0 -444 30
4218 30 115 -72 274 -122 -115 -205 216 -86 91 -27 32 -411 372 -97 111 98 244 -80 50 163 6 -112
4240 -112 63 8 -210 107 -24 131 11 -6 -5 -227 -149 175 -120 66 143 89 -159 -122 164 -87 -49 37 52 26
4264 26 88 -124 13 -215 -122 280 204 -112 -3 -25 20 -62 -264 -45 -26 93 30 -49 62 -86 89 -70 -137 123
4288 123 45 -118 -125 -5 37 -313 298 -145 -134 -58 -219 -169 176 186 306 -112 -32 118 -269 99 -147 67 250
4311 250 98 208 -133 76 -117 15 -2 161 -130 36 -28 108 -25 -25 -71 -40 -125 119 50 -322 34 -62 -121
4334 -121 158 23 -104 123 -84 -14 196 250 106 -182 -13 30 17 -98 42 193 -49 137 259 -4 -85 234
4356 234 69 85 89 -141 -45 -13 -17 142 97 174 -92 -351 11 190 193 -181 190 162 81 -92 -89 180 -141 5 52
4381 52 260 -173 302 40 208 0 -71 112 219 52 54 45 -279 61 -129 151 -82 208 74 159 -147 148
4403 148 31 33 30 -197 -122 -96 -196 96 167 140 -39 28 -99 54 -137 110 36 -18 171 262 -100 -249 76 -370
4427 -370 57 327 183 77 257 45 24 -151 -37 -112 -124 87 121 -4 109 73 3 -4 -91 366 -225 -36 64
4450 64 251 90 10 -17 -13 -82 -5 58 97 -21 -122 -165 -50 150 110 100 323 -193 113 -25 -43 149 127 70 -48
4475 -48 -16 -76 211 -103 -77 -88 -14 234 -171 47 -103 -29 68 -48 -43 -34 110 26 -204 103 248 -180 35 -255
4499 -255 230 -15 -93 -32 2 26 -211 16 331 35 145 -133 -40 -5 16 116 -142 171 -36 15 -20 134 159
4522 159 227 8 126 -394 39 166 71 56 40 -22 32 -12 -29 -36 -79 11 -218 -139 52 -16 -221 -52 -220 -110 -160
4547 -160 -89 86 -41 -25 -282 40 142 24 47 13 -117 244 126 -156 252 155 140 140 -171 21 86 -108 118
4570 118 -84 292 -43 -4 257 20 3 -149 59 -203 -135 -236 82 271 -94 -160 -73 -230 -39 -118 206 -63
4592 -63 -107 -116 9 24 99 -116 13 -132 -76 23 -20 177 3 131 -84 -225 74 -92 31 -56 -190 -154 20 32
4616 32 38 50 49 66 212 280 59 54 -259 209 -28 119 46 -138 67 163 7 -105 -59 7 318 113 -167 286 -8
4641 -8 -59 61 56 -64 -14 93 -59 -47 552 196 -180 -11 -82 -349 -95 -83 15 188 -161 209 156 -313 -46 205
4665 205 271 67 47 117 -173 -100 367 56 -175 -86 -107 -136 -111 140 -28 -36 233 106 42 144 -258 -132 274 -146
4689 -146 -27 94 -87 45 -39 -47 -56 -172 -199 -136 17 110 -58 128 -62 202 -16 -17 -42 -97 -39 88 1 -24 36
4714 36 -120 75 -332 -48 143 78 105 -22 -48 99 27 -45 -131 -40 64 -193 -8 84 61 167 -38 -99 148 273
4738 273 -303 19 189 129 -125 320 -31 114 -75 -48 35 130 235 21 51 -148 -79 67 8 14 241 79 101
4761 101 189 -139 -108 -123 -59 105 -122 -4 260 -34 -141 -111 248 -53 -18 -190 -36 -153 138 21 101 -135
4783 -135 190 60 -115 2 -116 258 -331 -12 -235 136 -15 85 -58 345 32 -111 321 -19 -36 113
4803 113 -178 -83 -48 -64 -57 -256 -163 116 -30 -70 -39 -122 -123 128 -45 -113 2 49 169 -53 -112 -287 214 198 -33
4828 -33 -96 3 9 109 46 -132 -146 -42 -105 92 -63 277 -87 31 -171 -32 -262 -36 -89 -342 -64 -56 -28 -71
4852 -71 -78 -140 234 -225 -81 -50 10 20 -115 55 213 -147 -136 79 60 -156 230 34 -65 -58 -66 -60 79 -130 83
4877 83 -87 -357 -17 -6 83 -50 157 205 99 148 -76 -180 67 105 41 183 -231 200 -46 191 234 27 -200
4900 -200 257 -108 102 -85 -3 -131 60 -5 55 9 -369 82 -111 -87 -230 -130 -136 221 -56 103 -189 136
4922 136 -323 -112 14 -10 99 53 2 -132 154 -148 -45 -32 11 5 267 -20 -57 290 -258 11 111 203 -150
4945 -150 -20 61 84 97 -265 20 34 179 -34 4 -198 44 120 -185 216 -48 -292 -35 -138 -156 17 240
4967 240 67 139 -57 31 30 13 -197 -146 -35 8 -54 51 -164 194 -175 -131 146 30 -83 -270 -85 -163 54
4990 54 -291 61 -90 149 -25 200 56 51 -129 9 35 -39 -59 31 156 4 -14 -10 250 43 -143 -5 317
5013 317 140 -160 -260 239 7 -63 28 -118 -15 -187 55 81 126 114 24 -66 -30 81 43 -152 -71 35 -27 -144
5037 -144 73 -40 225 237 -177 -123 -396 -84 -14 -20 -47 120 -78 332 89 -25 167 -152 -42 9 279 153
5059 153 -90 -14 104 15 84 141 -57 245 38 116 -216 197 -86 -237 15 -21 173 -113 -206 259 -128 37
5081 37 -72 -99 -118 -189 -8 131 -180 27 -125 -55 16 -139 165 -475 224 314 88 255 -75 -228 151 -130
5103 -130 -72 -85 27 -223 -1 274 92 -56 -43 45 -27 44 -118 39 68 151 36 -128 -99 146 170 -24 -96 -40
5127 -40 87 268 -8 -23 -338 250 -152 -44 10 -69 27 -220 49 25 -105 94 19 22 -202 -237 94 16 138 143
5151 143 -132 -45 -198 57 -47 -218 -36 182 67 -125 -28 231 117 -107 -144 -229 8 2 0 20 -127 31 -26
5174 -26 -114 -56 -10 64 -146 -59 36 89 -135 -184 -34 -73 -12 -143 -111 89 28 -48 158 57 -292 201 -252 31 7
5199 7 -54 175 130 81 -79 34 0 96 41 78 -116 -40 47 -99 -35 -70 -7 -24 34 -68 -141 296 49 -79 68 -73
5225 -73 -116 74 19 77 44 22 -137 80 -74 -136 -86 94 17 89 196 -56 186 189 209 146 79 -10 -125 -206 -120 -21
5251 -21 127 -297 189 171 -94 167 27 -133 257 -17 65 -65 -47 -328 -6 -76 23 38 47 36 111 468 -66 -71
5275 -71 177 65 79 82 -37 104 75 -66 -94 96 94 -91 -16 -152 -48 14 -110 -170 80 49 312 281 -10 -107 169
5300 169 108 -235 15 -175 1 -196 -325 235 -172 -131 140 -164 12 200 -90 16 9 85 -58 207 -33 -399
5322 -399 99 -70 -186 -134 216 -128 197 -75 16 21 -20 88 91 -151 -218 -138 -47 53 169 127 74 -281 -65 99
5346 99 59 -56 -47 -106 -1 -142 57 64 125 -68 -52 -29 5 30 66 7 -113 46 39 -259 -212 38 99 -128 118 -61
5372 -61 133 28 -249 120 85 -99 67 103 -54 -160 250 -1 19 63 -84 299 40 -140 -261 24 -65 286
5394 286 303 -163 -96 -138 -13 -35 110 15 -11 0 -152 17 49 -52 159 8 -9 76 -97 -83 -59 -77 -34 -211 152
5419 152 37 -59 -162 -27 56 -9 3 -58 -373 77 159 -14 -51 81 290 14 233 -310 -219 67 -310 5 222
5442 222 -70 32 28 44 -156 -128 -64 -202 164 321 -41 -43 -19 -187 -180 -11 -61 -61 49 238 37 82 -154 -40 -67
5467 -67 -15 -122 -139 -193 -157 12 -40 -149 43 361 -48 216 -62 35 -10 -305 -152 33 -26 -137 -34 -19 71 176
5491 176 427 190 -162 -191 -314 -185 -44 9 362 -179 100 -280 129 111 134 261 153 -152 440 -10 110
5512 110 -73 -82 -90 -394 96 -94 -166 63 263 -98 48 -202 23 -106 29 -178 -132 -214 -269 64 -42 31 -42
5535 -42 143 -194 -66 -390 24 30 18 -58 -41 150 -35 -221 4 -182 -330 111 -55 127 201 -15 -399 -281
5557 -281 -180 -148 34 70 66 193 330 -180 183 19 18 -154 -3 204 -15 -85 92 -59 76 -143 55 38 -238
5580 -238 -170 -13 -65 -46 -152 134 -50 -122 -4 -44 37 -37 45 238 156 90 192 82 -220 146 60 50 219 179
5604 179 39 -33 -60 59 -277 -52 -194 427 87 107 124 -6 61 -161 434 -142 -38 -25 46 58 -20 -19 -8 -7 254
5629 254 -263 -232 156 -302 -181 13 -171 -49 -178 246 -53 -49 -278 52 92 317 247 -25 181 33 117 198
5651 198 -3 -72 -1 -186 5 140 71 -128 -141 214 -176 63 73 249 60 -221 -95 91 -129 161 -3 91
5673 91 74 -34 -2 -85 -41 -195 -111 -251 -157 -132 -200 -77 -99 63 -77 30 161 -158 -56 -17 89 3 187 -19
5697 -19 -22 68 -38 -207 6 -385 27 114 -84 204 -11 15 170 -40 185 135 -72 -228 -30 131 133 102 -149
5720 -149 244 1 155 -188 -109 -4 40 -151 -196 43 -170 -106 105 -132 273 -298 239 31 -265 18 -14 -123
5742 -123 -201 19 -21 43 286 22 118 121 169 135 -86 66 83 78 -214 -112 -116 91 298 89 109 -276 -179 22 102
5767 102 -76 -5 10 -2 -65 133 -1 157 -120 -42 -225 3 34 149 195 -56 -89 58 -8 21 25 -138 232 37
5791 37 174 -11 44 -252 94 -151 140 -14 10 66 -27 23 271 -153 -170 125 12 -135 -128 -25 184 194 11
5814 11 -153 25 197 142 94 -84 7 -244 -22 -26 -63 -303 167 -76 -13 -82 -6 -16 166 31 6 80 25 53 -52
5839 -52 -171 -39 85 -65 -242 -81 59 -10 24 -53 140 -236 18 32 81 -26 16 -144 -122 -4 226 169 -36
5862 -36 21 0 -347 -196 37 -111 100 -107 -128 -34 -127 128 -230 67 -89 -322 2 -85 -28 79 254 -187 -114
5885 -114 -152 -179 -99 -26 -51 -163 -35 18 36 -123 26 -269 -58 117 -133 12 182 -80 64 12 96 109 251
5908 251 46 -22 -49 -340 106 212 53 0 -215 -174 -149 131 184 120 -33 -57 -200 -395 -29 -27 -14 53 -271 -3
5932 -3 -268 124 321 -196 -81 103 -24 17 -27 168 -237 41 32 110 -58 -29 -96 17 79 17 125 75 211 -63
5956 -63 -348 -81 -101 115 -83 -6 -120 81 32 -361 -154 -181 100 36 -69 44 130 -134 -261 -109 34 51 28
5979 28 66 -76 122 33 56 273 28 -103 58 -33 -146 -10 245 -76 -150 -51 -237 -3 -122 -4 44 26 34 143
6003 143 0 54 93 -184 -227 -176 35 98 102 -89 -87 -16 -65 -137 69 -130 85 78 146 -216 -51 10 80 86 170 -22 -138
6030 -138 222 138 71 24 273 -366 163 100 -228 2 111 400 -78 -89 -258 -105 158 17 94 194 42 -124
6052 -124 -101 -33 -79 207 -145 284 -238 -94 135 -150 -45 -70 -138 -15 130 45 -228 -123 136 41 -15 -142 -17
6075 -17 73 -117 -350 34 -128 48 -4 -235 -64 -47 -8 175 -184 147 -159 -310 -110 -160 -112 -99 174 135 177
6098 177 -241 -102 51 -15 -42 -87 36 -167 -140 -49 15 10 -37 -190 132 -51 -280 18 161 -25 126 29 132
6121 132 70 84 44 129 -17 -44 -29 -162 60 17 68 306 -41 189 -164 109 37 119 9 -132 -60 -15 -214 184
6145 184 -169 0 57 -134 70 182 -153 -33 281 214 -60 -73 79 -213 -296 109 55 160 -103 95 164 -246
6167 -246 112 -229 129 -2 439 -158 25 -158 85 156 -145 -103 67 -152 -36 -9 36 218 -76 -36 -201 -30
6189 -30 -236 38 -310 43 134 -142 39 -24 -124 -88 97 -76 -166 -64 -86 47 -16 50 5 -103 -25 83 253
6212 253 18 30 -118 289 -206 -97 32 264 156 114 228 -121 -157 -61 -168 -32 117 -157 143 -264 29
6233 29 -311 210 -80 -92 140 -28 -40 167 58 -165 -194 -171 189 70 14 98 -56 154 54 -102 226 -100
6255 -100 138 193 36 -156 71 87 173 17 -196 -68 -148 -39 36 -52 120 128 7 -143 -188 56 -95 -61 -5 -33
6279 -33 251 -175 -39 73 63 -82 259 117 80 70 153 141 -12 -147 -94 275 -300 93 64 57 73 -13 68 149 -41
6304 -41 -111 159 12 -120 73 168 -58 -68 44 54 -51 267 -191 -47 -4 79 200 91 125 -50 168 -77 47
6327 47 -149 49 -220 -50 -194 19 292 -21 -49 198 -24 214 -41 -290 63 198 27 -166 239 -29 158
6348 158 80 1 -162 51 -44 27 98 -71 -120 -145 122 143 69 327 -40 4 -68 -62 -26 174 -5 -94 211 -212 133
6373 133 -21 88 -170 35 -72 136 77 -283 -70 139 -118 -160 -11 65 -39 83 -222 -189 -8 154 16
6394 16 -48 97 120 160 -55 -199 26 -113 -145 4 -35 302 117 218 -70 -130 -52 173 -287 78 78 -223 119
6417 119 104 -121 12 20 -56 -125 -159 -48 -73 -111 -168 -126 192 25 358 186 -178 -207 175 -233 135 20 -67 -62 62
6442 62 -103 117 91 -138 -138 -229 11 -297 -113 -145 -160 -24 68 -94 98 -108 12 61 -111 89 -102 -187 -105 77
6466 77 116 1 -72 198 59 36 -39 26 299 -94 -252 253 2 83 -64 6 37 -261 45 175 33 -18 438
6489 438 -112 -140 15 15 206 11 83 129 -201 -72 83 -203 -191 32 64 -214 -37 -48 109 -30 -53 82 15
6512 15 -80 -150 198 -74 -172 86 -18 66 12 -199 -72 -38 -43 -111 29 -72 -209 257 -180 -67 23 -142 13 14
6536 14 47 -20 11 130 -42 178 -169 77 -3 -75 -251 -98 -137 214 64 -266 58 36 177 16 81 -290 -173
6559 -173 -87 82 -10 86 -148 -251 105 -157 -91 -69 115 61 85 -138 -140 -35 -287 118 -29 14 -131 73 273
6582 273 -76 75 140 2 -43 -284 -3 16 -5 -15 186 179 24 121 -79 -115 -119 62 -47 -123 -38 -68 -105 33 120
6607 120 36 -29 -10 35 -2 -237 -78 -141 -126 44 -281 91 26 -75 -6 16 -35 183 -10 -96 189 -43 -38 75 -5
6632 -5 60 148 89 31 72 -215 -38 -72 -38 194 -7 35 108 -84 29 16 111 46 377 14 -279 -242 -17 -1 -154
6657 -154 -78 -144 76 46 -211 256 -126 -73 169 126 61 124 -184 33 298 101 -79 168 52 -84 -21 264 101
6680 101 171 128 -76 -177 40 77 -158 87 -81 127 77 -36 92 49 28 63 -218 160 -23 215 174 -68 44
6703 44 -179 -34 -14 112 -17 65 -52 65 -262 101 -89 -62 21 44 104 177 -265 -130 -18 134 363 101 23
6726 23 381 33 -82 121 4 30 -80 118 3 -25 -13 -35 163 -61 -141 3 -94 -250 -51 422 76 -161
6748 -161 188 74 373 192 -11 155 99 -85 11 -56 -239 71 -201 65 116 -199 142 -35 30 -205 31 -229
6770 -229 -60 42 264 19 -180 7 119 16 53 136 -53 388 150 58 78 -22 -155 8 -146 -32 -326
6791 -326 -5 -69 -363 89 -114 17 -9 -297 -19 195 63 -49 93 108 -289 112 63 136 -6 14 -317 14
6813 14 328 105 -67 -221 -129 66 -5 104 -162 92 -48 95 59 28 -99 -175 -129 67 -120 -155 -136 -9 117
6836 117 80 117 -65 31 -303 59 -198 -301 -186 -206 -15 241 239 -185 -218 234 30 57 8 96 -54 -28 89 -300
6860 -300 -122 -2 162 -37 -68 -94 -139 -57 6 190 -7 230 57 48 93 254 -85 156 28 -62 -239 -354 56
6883 56 96 -66 6 -138 -24 -21 43 -442 86 82 162 125 71 111 -168 -75 -34 147 208 9 -129 16 82 -31 105
6908 105 79 -59 176 62 199 51 -250 11 -109 41 -156 -210 -235 -73 -114 44 216 213 -150 135 6 1 -95
6931 -95 -70 -10 10 60 309 -36 -105 -35 -402 -144 -29 29 -4 79 -122 -285 -150 -85 10 -78 120 40 -172 -37 -111
6956 -111 65 -252 -189 196 -39 177 -344 -28 269 -138 -30 -88 -62 -114 37 169 160 -284 93 38 -140 153
6978 153 -20 63 53 235 -7 48 -141 -23 -81 93 140 328 -194 85 95 28 83 67 151 102 -258 -89 -50 -35
7002 -35 -18 -222 -2 -206 112 -22 106 -31 -26 35 -85 138 81 25 -104 -114 -132 138 59 -297 -34 148 -7
7025 -7 -34 -125 22 -35 -99 304 28 -56 -65 -292 -132 -146 95 177 -154 -27 -218 -67 92 -170 254 118 11 -120
7049 -120 -38 166 159 287 -136 -374 33 131 -225 204 -53 -14 -65 -150 -144 102 137 -76 -164 -166 370 72 -60 13 -60
7074 -60 -44 21 119 173 -20 129 -4 33 -62 -266 -3 -378 -139 -38 70 -163 160 -78 81 237 -91 -27 -255
7097 -255 -41 -44 149 18 127 208 -106 -141 -5 158 -131 53 141 -44 -49 100 -71 -146 -56 219 32 -3 -68 -97
7121 -97 103 18 66 -60 146 178 -52 193 247 -79 117 -196 -202 114 35 179 174 -103 -3 -4 12 -39 138 360 131
7146 131 -139 71 31 37 41 148 65 55 172 -122 -283 90 -126 49 202 -172 184 1 -44 64 110 90 221
7169 221 -239 33 -104 127 -281 21 -141 54 302 305 154 18 70 -140 76 4 151 -224 -53 107 -56
7190 -56 -55 72 341 -38 16 140 16 -187 44 96 -73 -9 20 144 -89 239 86 -192 -194 142 -3 -103 343
7213 343 -200 -93 -7 -235 -8 -58 -50 35 -323 261 -135 12 -75 -51 72 7 -63 85 -33 -74 -89 -32 155 -31
7237 -31 19 201 -219 -163 139 -93 -161 102 26 -84 175 17 216 15 -10 -168 25 122 11 -45 -3 184 85
7260 85 -127 -10 -99 118 127 -78 172 -151 -109 -222 165 -255 -8 116 142 -136 261 -305 217 -112 -64 128
7282 128 -79 -64 192 106 47 9 64 8 -200 71 35 90 -88 85 -125 -206 -27 -90 255 -4 63 -41 110 -130
7306 -130 -36 62 -58 73 88 14 -178 190 55 144 110 80 80 179 -52 127 -19 109 -176 -121 -109 -142 7 223
7330 223 -335 105 3 -188 -127 136 -115 -149 -244 8 -68 -71 25 -35 112 -58 -46 115 -238 55 -67 -38 94
7353 94 -54 227 269 -109 35 -3 -65 228 79 -273 307 -140 -15 -162 -122 -105 107 166 96 42 -104 84 -185
7376 -185 -124 -23 62 163 163 176 67 276 1 31 -15 56 -94 2 122 -15 -127 -362 -177 156 -170 -100 -84 -84
7400 -84 57 35 -170 67 117 255 -217 -70 55 -37 -72 -123 -36 69 157 -126 -162 -68 -34 110 153 -7 144 -27
7424 -27 218 121 -39 -91 66 -85 -216 -100 -64 198 57 -156 157 -77 164 282 -186 -132 -9 -172 -285 37
7446 37 84 -48 -5 -96 -98 -53 -217 -59 81 -13 354 218 33 118 72 -77 -100 -79 -167 -2 55 94 163 56 -35 -48
7472 -48 230 20 -115 -12 -330 -127 40 -64 29 -79 95 234 -274 133 -83 45 -65 -177 -66 51 -72
7493 -72 278 164 -221 -25 -126 207 -108 29 -200 -306 -155 46 -140 4 136 -138 -36 -78 -91 277 -75
7514 -75 -65 -47 -129 196 20 87 -40 69 -41 -55 3 52 97 -382 -16 -59 299 -18 -293 -91 176 -166 100
7537 100 120 -46 -158 -62 -162 -109 -243 121 174 -18 1 -121 22 186 80 -31 205 -53 20 23 6 -146 108
7560 108 155 -216 99 -381 -273 -205 29 -109 -140 273 -55 -73 -237 -63 -3 93 -65 229 131 -15 -74 182 136
7583 136 -263 -74 -27 182 -57 58 -11 171 -126 -7 249 -203 -195 28 126 31 161 -140 174 -145 -67 45
7605 45 117 -155 88 -6 -48 19 -40 -20 -162 255 127 7 38 190 -8 -205 -186 138 163 13 106 -86 146 -178
7629 -178 -110 158 -170 -173 -62 -250 -42 -85 68 18 -113 -128 -116 33 -62 16 -3 -159 26 84 50 13 -55 161 -125
7654 -125 133 -140 -504 -180 15 -95 42 -340 175 26 -315 164 -377 271 -106 -239 192 43 96 -51
7674 -51 -252 -46 13 -188 -75 50 -56 -127 59 34 30 165 -5 126 -80 205 46 201 -143 -5 -30 -247
7696 -247 235 27 -84 67 -147 -13 17 -26 -15 -8 -25 276 -95 -290 115 131 93 -113 18 -83 86 27 -112
7719 -112 41 -108 99 18 231 -74 -17 -43 33 -204 71 -13 -118 -105 -355 -94 -17 -27 148 74 38 58 -127 1
7743 1 213 176 -96 -45 53 -94 0 -141 55 -83 63 -154 -2 -19 -8 23 6 156 38 193 37 -74 135
7766 135 280 59 -17 -262 54 -48 269 64 -351 -36 -133 -164 -345 -201 273 -75 -190 63 -42 -89 -210
7787 -210 294 -63 -119 167 -158 -80 -120 48 -115 153 112 -80 -1 92 -189 18 -164 -131 -284 128 142 5 -73
7810 -73 105 10 -1 -127 -26 -63 -100 37 -120 -28 240 54 112 -25 79 -109 51 39 -113 -27 -123 113 -215
7833 -215 113 -155 -130 0 -250 -11 -381 -168 -5 11 19 -116 49 199 -101 -62 -40 -36 128 -111 -82 1 -321
7856 -321 40 -94 -105 -44 18 72 -255 28 -236 -102 -98 -40 52 -14 -88 -81 -26 203 225 137 -31 -81 323 2 17 183
7882 183 -361 -103 -82 -48 -32 42 -139 35 -61 -55 -97 -10 13 -168 333 -28 168 -131 -69 -23 -47 -20 -88 -41 -71 -7
7908 -7 -26 310 -78 -266 91 108 14 -163 228 -28 237 -42 12 -38 233 2 -4 69 90 -107 48 -35 -18 212
7932 212 153 12 -252 202 157 -183 -457 122 -77 -131 43 534 -21 28 178 -47 -4 -360 24 -212 -141 47
7954 47 137 -60 46 105 -304 -21 -174 -12 9 -91 152 42 3 -122 155 -7 43 186 -140 63 75 -102
7976 -102 78 -105 79 -214 -221 176 73 -64 -232 -57 122 66 50 -9 77 -19 -106 7 -94 285 155 -235 -164
7999 -164 -277 -86 -157 -76 -13 193 -164 116 91 104 -370 104 -46 26 17 -14 -255 81 119 4 88 -226 234 -86
8023 -86 -133 20 -11 -155 -35 80 84 5 -43 13 96 -46 -223 0 135 70 -57 120 266 -9 -142 -13 62 156
8047 156 173 59 242 253 24 68 -77 70 189 204 366 -251 16 82 97 -42 -216 -1 57 81 -35 -172 -6
8070 -6 152 -378 -292 118 -42 -443 59 -190 9 6 -223 -65 69 -38 183 -6 7 -261 40 -147 118 -161
8092 -161 -215 -126 -182 224 179 69 -44 -157 -93 353 -111 -9 -119 -41 113 38 -38 54 170 -22 156 22 84
8115 84 92 14 169 -33 182 -235 41 47 -277 -147 -113 -183 89 -144 10 67 -129 -150 161 82 -108 -192 138 44
8139 44 95 169 -417 -245 -107 -8 77 -17 14 74 160 -63 -268 -27 -74 -13 63 -71 -285 -184 117 191 103 -185 263
8164 263 -58 -156 143 -57 175 -194 17 191 -74 56 19 -95 -229 40 152 188 -299 132 -106 4 -61
8185 -61 -32 -151 -34 77 -89 -35
8191c5
$$ Imaginary data points
##PAGE= N=2
##DATA TABLE= (X++(I..I)), XYDATA
0 0 0 0 0 0 0 0 0 0 0 0 0 -6 8 -8 8 -8 16 -16 18 -24 32 -32 40 -48 56 -64 79 -88 104 -119 136 -154 175 -199
34 -199 223 -253 284 -317 355 -396 442 -491 543 -603 667 -736 814 -896 988 -1089 1199 -1321
52 -1321 1457 -1607 1775 -1967 2180 -2430 2718 -3057 3464 -3966 4595 -5414 6532 -8151 10724
67 10724 -15456 27049 -120610 -83006 96626 -93583 -77860 63392 -9231 -155314 -33467
78 -33467 51862 -28124 -41387 55116 39513 -4489 25693 45570 -5855 -6252 49397 62832 5633
91 5633 -7916 30031 15745 -30568 21318 67805 -18267 -73138 11072 30447 -35721 -5157
103 -5157 39008 -34285 -50943 32565 22971 -26496 24407 25898 -54298 -15777 66338 9026 -31163
116 -31163 52109 59399 -25616 -16603 32300 -5614 -31044 24996 59998 30123 -6144 -22023
128 -22023 -23093 -19404 -11441 14488 29935 1912 -19529 -6005 -9027 -19671 975 4323 -16636
141 -16636 4232 26014 -8236 -19136 14580 2573 -22262 8461 16019 -24889 -19359 9743
153 9743 -7372 -9265 16063 -10662 -40350 -4890 11032 -18350 -4921 24993 -3921 -23253
165 -23253 12978 27314 3456 1886 14935 9740 1157 5205 14598 18924 9000 536 6645 -783
179 -783 -22586 -17891 -799 -6025 -5145 7951 -9059 -30788 -18224 -12106 -23396 -6159 12464
192 12464 -6151 -13840 6081 1548 -11057 5576 12787 -2804 3880 16643 5571 6348 22965
205 22965 14694 1455 11151 10655 -5720 538 14994 8562 2675 8184 3747 -8269 -10318 -7325
219 -7325 -5373 -3271 -2175 -476 -1025 -7970 -9245 -1866 -3160 -7983 718 3355 -5022 3019 15706
234 15706 4524 -4204 7295 4379 -8867 3349 15060 -645 -5637 9138 4018 -9463 -1234
247 -1234 3464 -9793 -8920 4624 2084 -6451 -2020 1771 -2002 -798 4142 782 -7424 -7688 600
262 600 6263 5818 5209 4036 -4827 -11082 -3396 910 -4471 -1830 6994 4191 -876 2371 -1776 -13342
278 -13342 -8121 4814 6364 5722 9075 2164 -6783 -1457 3049 -1205 -1386 2549 1418 2260 6681
293 6681 3509 -5200 -6241 -2539 377 3902 5786 394 -4784 -2849 1672 2575 1668 -423 -2817 -3781
309 -3781 -1616 1216 -870 -4959 -3598 2778 3201 298 -559 -5959 -11235 -4202 7598 8085 3372 4379
325 4379 1232 -5854 -2078 4164 -442 -3046 6170 10340 5464 2868 146 -8529 -10646 260 7971
340 7971 5622 2592 1182 -2831 -5241 -2244 -400 -4189 -5269 617 4740 1561 -1996 -3837 -7443
355 -7443 -8195 -266 5518 744 -3713 -1816 -1009 -879 4073 5753 456 -948 3509 4597 2113 2087
371 2087 1661 611 4077 7675 5140 -1175 -5785 -7089 -3789 1303 3173 1780 -993 -3831 -4992
386 -4992 -3686 -4206 -4914 -3187 1588 4709 5469 3075 -2235 -5724 -4748 -406 4134 5409 2834 620
402 620 1320 203 -1253 -346 -1302 -3358 298 5946 4559 816 921 -433 -2250 1623 5846 2796
418 2796 296 2468 2851 1509 3069 2655 -368 -1160 813 1122 -1042 -2548 -3034 -1716 -391 -66 -177
435 -177 -3147 -8032 -8659 -4058 -2006 -1788 438 -6 -3772 -4371 -2603 -3787 -3442 196 2485 3412 5086
452 5086 3842 319 -271 1670 1945 2847 3466 2575 1662 1773 640 -251 -803 -4709 -6892 -3830 -2236
469 -2236 -4218 -2239 -59 -3554 -6318 -3527 -1712 -2655 270 3478 4121 4322 5398 4873 4914 6092 5798
486 5798 5674 5849 4925 5006 5718 4097 3728 4404 409 -4287 -2320 -707 -4341 -2337 3062 -236 -6564
503 -6564 -5537 -3627 -6150 -4831 -60 239 -2066 -2413 -2507 -1284 120 -263 -761 493 -14 -1110 735
520 735 2864 2000 2596 3191 313 -1257 -898 -2323 -1523 3919 5208 356 -1222 -1367 -4478 -3811 59
537 59 1737 957 228 -524 151 1720 -584 -2790 -775 624 -2026 -316 2782 349 -2733 -1564 -1540
554 -1540 -4152 -4225 -3873 -3416 407 2260 -1073 -3074 -1938 -3719 -2889 3033 6089 3325 1292 1166 2081
571 2081 4002 4591 4329 4600 3273 -404 -240 2317 283 -1010 1933 1768 -1442 -3287 -5026 -7399
587 -7399 -3899 1999 1434 -51 993 -1963 -5624 -1327 3563 2648 1621 3367 4561 4269 4437 3435
603 3435 2996 1908 984 2330 5662 4772 751 1414 1922 -1474 -3124 -2770 -4149 -3778 -617 271 -2792
620 -2792 -4742 -6685 -8483 -5381 -901 -788 -2707 -3220 -4209 -3231 -194 787 1387 1962 786 -566 1243
637 1243 2315 -24 1184 5223 4278 1232 581 -1280 -4277 -1880 2359 2395 1403 386 -2310 -3211 -1206
654 -1206 -122 -644 -162 42 767 2328 2548 737 -154 -798 -1554 615 3013 839 510 2446 1088
671 1088 -1730 -1035 -1068 -2899 -1115 2783 2793 873 -178 -1605 -2350 -282 2299 2043 1453 707 -588
688 -588 3 1455 934 722 1056 -132 -1421 -109 -649 -1643 -74 1265 462 -373 -758 -3051 -3515 -1268
706 -1268 139 199 993 -475 -1740 -1363 -911 -1038 -492 4 -512 842 2449 1517 540 1274 150 -949
724 -949 731 2141 606 1268 2707 1274 -609 -281 -1116 -2307 -1436 325 53 -510 -748 -1641 -2105 -1797
742 -1797 -674 -707 -805 -738 -81 588 406 879 1596 1138 -699 502 1090 -134 147 2179 1593 181 684
761 684 509 -1358 -989 291 469 480 1479 945 -275 -363 -103 -502 -411 142 115 108 -97 -265 -13 -380 -1322
782 -1322 -1211 -1018 -1090 -1203 160 712 157 -322 358 -737 -860 -203 -152 213 851 1336 704 531 -120 -679
802 -679 -623 65 -422 372 963 393 504 1149 355 -1162 -862 -128 -312 1072 2300 1170 -20 -74 -308
821 -308 -709 -532 414 332 -94 316 648 -417 -1065 -1164 -470 -280 -266 -111 52 -784 -618 729 843 -137 -307
842 -307 66 -958 -366 880 801 -166 318 807 307 201 348 -417 -802 455 1906 1623 1230 222 -452
861 -452 -788 -554 -367 -101 241 -148 197 223 -842 -1555 -2142 -1797 -1094 437 1215 285 -352 -252 -298 -82
881 -82 540 811 814 1738 1686 1676 933 9 -73 104 805 616 264 -233 -1350 -1158 -73 48 -1244 -1130 -1121 -1707
903 -1707 -1336 -210 -540 -917 -82 357 316 -214 -130 -932 -725 -38 1336 1528 1059 301 280 -197 -73 47
923 47 255 113 539 1362 1401 86 -582 -1018 -1457 -854 1046 963 -6 24 -322 -830 -510 -273 -477 -424 24
944 24 665 732 298 -59 -325 70 259 482 317 -89 -383 -33 701 289 -114 87 -397 -447 32 343 234
965 234 342 933 1204 986 948 686 218 525 758 1378 1591 1105 474 141 -318 -947 -922 -652 -1390 -882 -92
986 -92 -248 -1397 -1501 -1623 -2376 -1655 -203 -397 -498 68 -151 -439 -129 6 -90 389 592 762 1245 647
1006 647 -93 540 494 -208 -58 166 -441 -382 -266 42 -530 -131 -379 -1307 -1514 -924 -855 -242 -5 271 -380
1027 -380 -312 281 -17 360 441 848 1274 1533 992 1281 1736 1361 746 990 819 280 738 1397 743 296 218
1048 218 -483 -1139 -1060 -259 -356 -215 238 -399 -332 -311 -623 -242 -25 -189 63 -54 -217 380 487 104 -468
1069 -468 -51 -221 -829 -766 392 -9 -243 269 -131 -1217 -896 -342 -260 355 1065 506 -10 -234 -66 19
1089 19 180 613 370 383 253 55 400 95 -425 85 -125 -651 -922 -206 -379 -665 157 53 -736 -745 -712 -810
1111 -810 -417 355 474 -300 -4 -75 81 509 779 -62 73 590 734 797 1412 976 364 43 164 -337 29
1132 29 192 468 136 175 -119 -952 -1072 -1084 -592 169 502 208 -236 -320 -351 194 477 257 512 831 214 256
1154 256 1024 780 157 278 336 38 208 282 -225 -120 155 169 -439 -358 -247 -600 -188 218 -183 -461 -24
1175 -24 -402 207 220 -227 -451 -200 -627 -198 711 616 84 122 59 -409 -465 94 209 86 771 895 190 -370
1197 -370 -253 -665 -71 535 640 262 229 -181 -315 -11 -13 40 -81 -40 -236 -12 463 -203 -332 7 -51 -485
1219 -485 -18 -46 -113 -146 129 60 -257 -250 -505 -345 -139 -223 -111 202 -95 -7 439 185 117 -133 37 22 138
1242 138 722 667 580 335 177 -348 -378 129 -187 48 401 90 -165 -568 -284 -482 -185 -64 313 118 103
1263 103 -184 22 139 -471 -168 -160 -192 -43 102 221 28 92 291 -391 -232 -22 -29 -82 11 327 311 -102 -101 -167
1287 -167 -238 22 -186 -150 -77 243 -52 141 -267 -296 -124 -378 -176 -146 278 518 142 380 48 -233 -201 -73
1309 -73 -34 175 401 359 339 -32 35 152 54 -198 212 133 -120 255 251 -14 -57 22 349 -180 -167 386 -77 429
1333 429 53 -78 -266 -560 -254 35 -318 -122 44 -184 19 147 -32 -527 -37 140 217 235 6 194 -21
1354 -21 -140 -204 137 -176 31 28 212 -52 111 225 -112 -335 -233 -119 20 390 56 250 138 337 -5
1375 -5 154 -95 -52 -158 312 35 -239 -60 -147 -216 -175 -96 -628 -357 -161 -151 -44 -31 325 -60 -195 -7 224
1398 224 283 297 453 522 277 378 95 176 -61 117 32 325 349 404 100 -305 -93 -25 -454 -190 124 140 -184
1421 -184 59 115 -126 -330 -212 -351 -122 38 152 164 -44 135 414 275 132 302 77 233 117 356 63
1442 63 218 420 250 -119 -420 -202 -331 -264 -373 -135 -22 -417 -345 -628 -274 -277 -66 -126 -116 161 26 116 -45
1465 -45 -149 -86 -113 224 132 103 188 -129 121 154 -442 -23 -86 19 67 169 46 -217 -290 -21 -47 -100 49 159
1489 159 99 114 151 236 4 -64 52 116 77 85 -47 260 -15 164 -193 -156 -367 -193 134 -95 94 245 107
1512 107 164 -260 -224 -145 116 206 221 184 139 254 315 41 -126 273 22 -118 230 260 103 90 263 86 -597
1535 -597 -246 31 0 -107 -67 -209 -435 -241 -168 -132 -262 20 -55 -61 -104 35 184 220 -250 104 284 18 -172
1558 -172 254 -90 238 11 211 -125 21 162 -164 -258 59 -89 26 -155 -69 -55 -334 -2 -72 139 159 274
1580 274 251 -30 181 221 47 23 210 277 246 -28 304 175 68 -14 100 -168 -121 226 156 32 0 397 80
1603 80 -114 -25 -220 48 -37 -26 -8 -88 -166 202 -178 -86 -181 42 60 83 -25 103 -159 -393 93 -108 -82 -315
1627 -315 177 99 -56 -41 63 -14 -99 -164 94 33 14 180 189 222 -34 165 259 -378 98 -72 -46 64 17 68 -108
1652 -108 -117 -297 -318 -309 64 7 34 -193 -250 -315 111 -96 129 161 207 -364 36 37 60 142 -169 -71 6 363 344 195
1678 195 72 641 -28 102 159 -27 40 107 -192 -22 244 246 -127 -253 -179 -1 -16 203 -29 -148 -234 -155 6
1701 6 255 -154 -286 -380 -59 -11 155 116 -49 13 -1 73 -172 -162 -44 -158 -3 -104 237 165 -28 -120 26 5
1725 5 -96 -97 183 -206 -390 295 109 184 -280 -275 167 30 229 91 8 -171 15 -173 75 129 29 132 127 275
1749 275 24 17 147 174 269 20 -1 86 30 -189 433 80 5 27 -63 -19 -1 -100 -76 4 -82 283 21 -54 -91 18
1775 18 -20 -338 -114 22 -46 -122 -190 20 54 -160 132 218 -88 4 110 -290 -115 -101 -10 117 -55 61 228
1798 228 174 192 -90 92 -63 -115 48 132 273 177 149 -46 -175 -42 3 123 136 188 -133 -27 183 77 -9
1821 -9 -2 -63 -49 -80 55 -72 -54 -27 -109 -216 73 -9 176 24 84 101 34 191 -36 51 4 -215 -189 -75 86 -154
1847 -154 46 312 -16 23 -41 -28 -266 340 -63 -2 -50 -30 -3 -88 -65 -255 259 -87 227 -6 297 -110 -6
1870 -6 120 -75 -41 -122 -6 -79 101 -359 -13 213 3 90 -439 -142 476 -229 -84 210 -22 -100 -177 -19 -128
1893 -128 138 84 48 -298 -93 -33 -230 -159 -94 -62 69 21 55 60 275 47 63 -2 54 141 68 19 -255 -71 39
1918 39 284 100 -45 118 -79 -17 30 -175 41 12 89 -24 -55 -88 -121 -26 -46 -181 14 89 91 -358 -5 158
1942 158 227 166 29 -120 129 -142 116 -8 156 -160 -161 -16 101 -76 -20 123 294 -43 -351 1 163 -93
1964 -93 34 208 -135 183 134 -355 -34 -117 -35 -54 69 -78 85 291 -37 -38 -51 3 -120 132 -207 -69 -71 -76
1988 -76 -175 -47 -183 184 -213 78 -136 103 92 75 11 78 181 -145 95 80 153 142 89 -140 157 -118 -127 -13
2012 -13 -148 140 16 -287 467 156 209 -230 -98 170 83 -84 247 257 114 82 -48 -113 204 10 -279 -46
2034 -46 80 -59 -52 -279 -96 233 162 280 -37 65 -181 -4 -106 -206 -6 69 -303 44 -221 24 325 63
2056 63 -85 137 180 -288 181 57 -207 -22 -45 61 -167 101 162 -138 137 -59 205 -99 119 55 152 171
2078 171 359 176 -16 111 -197 37 12 -161 -96 -192 215 -103 2 -134 -186 -13 -111 -73 -143 216 -147 104
2100 104 -127 66 242 124 -103 -159 -86 104 -24 -172 -76 -71 -115 -176 -87 -215 122 134 80 91 15 -109 -32 59 -147
2125 -147 -54 -226 52 -103 126 68 93 -236 -330 -29 95 54 -3 32 139 50 111 238 25 -183 -40 435 -36
2148 -36 -167 -38 -14 41 -67 204 -104 187 -17 165 -25 -202 61 46 50 -271 48 197 -109 -47 -69 -131 -138 195
2172 195 -139 -17 -140 -9 -78 -82 -35 4 261 -123 -126 8 128 92 44 377 78 -179 74 -326 82 -16 220
2195 220 -95 -141 122 -45 -201 4 4 128 -121 -105 51 118 61 -272 -99 -73 3 -170 322 -101 -41 113 50
2218 50 -70 160 172 -85 -126 -26 109 162 -58 17 -81 399 139 -264 -51 -16 -185 116 -57 -118 75 -50 -84
2241 -84 -89 80 -160 -185 41 -29 -13 -135 -66 -207 1 257 56 46 32 -25 101 -160 -134 -261 12 36 60 -10 16
2266 16 164 -111 -41 49 116 -157 -124 92 -80 252 55 -68 -21 -22 -73 89 73 16 -24 31 96 -63 -49 164 -15
2291 -15 136 14 12 134 -128 -1 0 147 100 -120 53 17 221 108 211 63 57 111 197 122 174 -8 -273 251
2315 251 -85 96 -49 -168 -213 -220 119 15 -130 76 -140 -90 -82 -205 -183 -101 -68 -90 23 -163 -126 -81 149 -3
2339 -3 81 -31 110 46 49 -157 -84 229 -245 -123 -19 -72 -120 90 79 10 -32 111 -35 52 -145 16 134 -224
2363 -224 -81 -101 -75 58 203 131 121 -195 12 -16 -246 78 162 128 87 -74 -200 27 153 -107 13 24 161
2386 161 -7 -196 -142 -46 256 -39 142 62 -74 -8 194 -18 101 -62 -37 -152 1 162 -77 -204 121 145
2408 145 75 -4 -111 278 -54 82 -312 -117 -100 -224 148 199 -160 101 179 3 149 61 -215 -234 -187 -70 242
2431 242 20 100 -66 268 -107 -71 39 -24 109 -64 -138 -60 -9 -61 -190 46 -16 -120 -211 30 -84 -438 -147
2454 -147 193 52 -104 110 -36 -143 23 110 -92 -147 155 -11 206 -85 125 30 -178 65 162 246 31 -16
2476 -16 -113 -102 116 200 136 96 260 -72 -211 -255 89 -23 180 2 223 -78 -11 26 -117 -33 -132 -165 -81 138
2500 138 -69 134 -271 -159 9 -87 -79 -230 77 120 -141 140 -124 -151 208 -187 169 65 -135 -94 22 84
2522 84 -223 -160 3 -77 -90 -16 -168 -161 -43 -257 -108 -219 -2 163 90 -108 -7 81 -112 100 -246 16 -197
2545 -197 -84 -105 277 -46 253 246 30 -40 105 48 -61 213 98 255 190 -136 -24 208 159 122 -134 227 145
2568 145 -40 -233 192 -357 -30 5 -99 5 -329 -125 97 -182 -268 -179 48 104 -206 51 -74 -12 -141 53
2590 53 103 -132 -112 5 70 40 76 -168 -70 24 -148 188 64 -89 -74 85 1 253 -95 -279 -229 121 199 -13
2614 -13 210 -125 -304 -119 -258 -77 25 111 -47 147 233 42 -30 -202 35 -132 327 -79 -148 17 104 131
2636 131 -198 118 175 -53 -3 282 112 140 -98 73 217 -99 269 -10 138 29 -123 125 -158 31 104
2657 104 82 4 275 6 165 -29 -170 188 -200 4 -76 -48 -106 51 142 -12 -50 73 404 101 -156 29
2679 29 450 52 -63 -154 -133 -293 -117 -30 46 -164 -149 -39 -176 -153 -165 -101 -154 -175 -216 -15 -53 -7 -148 61 -34
2704 -34 153 159 -93 -177 82 222 158 18 -29 -282 278 102 -215 -153 -28 -269 -16 -34 207 -111 -157 119 73
2727 73 -30 -81 200 4 303 115 -222 193 -61 -34 264 44 -68 -290 -45 -41 163 -178 -112 165 67 -14 -117
2750 -117 -274 -72 -58 -145 132 -207 -139 217 109 -32 301 -61 -371 -199 33 126 -153 197 -32 80 -46
2771 -46 -36 61 266 -43 46 229 -127 7 36 49 -161 -126 138 64 -6 -62 -62 -190 -28 74 -27 -171 9 -75
2795 -75 -18 -85 86 -13 -104 -176 -167 -9 83 -22 31 96 109 86 -138 250 -307 -80 -75 163 329 -170 -186 -18 -53 -126
2821 -126 -54 -33 69 -62 256 135 -98 -18 25 -17 9 -254 86 -244 265 -17 -68 -40 122 107 120 -233 51
2844 51 85 27 121 -102 -63 -261 -337 94 -272 -47 181 59 -75 -30 64 -251 175 27 123 108 -111 84 -289
2867 -289 -211 -59 171 -33 203 -228 362 -113 -15 18 -53 80 -85 -37 -17 -22 -43 -136 29 29 -192 -11 29 7 -88
2892 -88 329 -197 218 116 212 131 -25 -23 -12 -85 -275 71 -109 -55 -167 -5 -75 -57 -176 -157 94 235 27 90
2916 90 -139 -282 -101 -79 13 54 46 344 -65 -246 -80 133 -1 42 -50 87 116 -31 -17 -314 -81 296 16
2939 16 -317 126 -86 25 13 137 -311 -232 125 -201 220 -225 -118 107 149 -215 -73 164 140 97 78 -95
2961 -95 -39 136 100 -27 -300 97 72 149 -127 -91 -41 144 -87 149 101 131 -70 67 -92 -234 -136 267 -241
2984 -241 -115 95 -125 -55 -81 -132 141 -170 95 129 -2 -169 104 -129 126 -133 -61 176 130 44 -59 -44 16
3007 16 -164 1 74 -16 93 82 -246 -115 217 -72 -71 -250 146 167 11 256 183 176 49 25 17 46 4 -220 48
3032 48 143 25 -227 39 35 -9 -85 21 171 -29 -127 188 71 -123 137 125 -110 -203 93 44 -44 -53 -281 42
3056 42 -316 -116 19 -258 136 43 -341 13 -68 -59 83 -88 -21 3 -51 272 8 -135 -135 -67 -48 -133 -26 28 137
3081 137 -108 -148 281 32 -61 -77 100 -10 -12 -153 -323 80 29 -48 -46 42 24 -12 -186 -39 -124 -40 32 -40 88
3106 88 -213 102 31 242 38 33 -30 -140 -147 82 346 155 81 46 42 -46 83 119 97 154 102 -135 80 98 6 -82
3132 -82 -62 29 76 209 -46 -4 -235 -100 -123 -88 -42 232 81 -114 212 45 -229 -127 57 55 222 -82 25
3155 25 173 -93 -333 -8 -40 -155 -185 -58 -7 -70 -284 61 92 -17 -217 -26 21 -146 40 153 -251 -67
3177 -67 -77 -17 141 178 160 24 283 -98 336 -37 61 -220 40 -86 89 130 -36 1 -195 -85 -25 -32 -28 78
3201 78 209 -10 -62 -95 -247 75 49 -102 118 161 -68 -139 257 57 -189 -69 105 71 -162 210 -79 -139 -199
3224 -199 312 175 -48 -56 75 -161 -48 48 0 -51 91 -193 -14 -58 -247 -112 100 -18 -220 -23 6 19 -78
3247 -78 128 214 47 -50 247 53 226 125 71 -77 -39 -5 -27 -106 249 225 207 -7 -27 17 56 -115 134 -173
3271 -173 -122 127 -50 -169 -117 3 -5 166 -61 -71 -58 155 42 10 -24 78 41 -136 -60 -51 -193 -311 240 98
3295 98 52 -271 -26 -69 -145 47 1 11 -171 30 -112 40 -41 -80 -88 99 154 126 237 12 33 154 264 189 128
3320 128 -78 -128 -191 -45 -112 -77 -98 105 34 6 34 26 -280 -10 115 -238 -293 284 -113 15 180 -80 68 135
3344 135 -78 127 297 -17 -59 36 -44 75 59 85 -330 87 -44 -102 -220 111 -13 146 -59 36 -92 -101 168
3367 168 81 20 -3 17 -33 61 -89 248 -25 -69 85 122 -50 -65 69 179 329 146 -20 115 -66 202 -32
3390 -32 -175 160 -73 292 35 141 -311 -244 -132 -234 33 -303 -43 88 18 -228 -5 135 -93 -121 81
3411 81 98 -72 96 298 -148 -72 119 56 -92 87 80 40 78 88 20 43 -167 -66 -154 -110 196 17 36 -30 256
3436 256 102 -160 15 -110 145 151 -140 -306 96 39 -5 -47 -37 -112 45 44 145 -16 -148 -124 -78 -41 78 -42
3460 -42 95 -60 -237 65 176 17 -17 66 -89 10 108 -113 -148 112 31 -10 -20 138 -230 203 -85 -21 189
3483 189 -23 -62 105 209 48 127 19 -392 117 524 -87 317 207 -37 116 -165 242 -14 86 1 -11
3504 -11 -26 -170 159 -185 75 -129 129 72 -166 -60 380 -154 179 -34 184 316 -162 39 -163 21 192
3525 192 74 -143 -32 52 -155 -212 156 -116 -104 -20 -250 50 -39 -114 -3 134 2 -188 27 -2 -96 121 139
3548 139 0 -168 81 48 -39 -339 106 137 -152 -92 -47 -156 11 24 -74 -193 173 -25 38 -356 -162 197 -182
3571 -182 -80 -32 153 -13 -181 178 -365 32 -21 8 -221 92 73 254 -196 222 -106 55 237 -100 5
3592 5 42 -155 -34 278 -13 -197 -163 -97 -38 -21 60 -72 1 120 -34 459 -108 -43 -178 -45 -36 73 -68 162
3616 162 180 203 172 -24 -110 -65 15 -41 -247 -201 110 -139 -96 -65 -232 3 121 135 -107 -347 -287 -119 92 -68
3640 -68 9 121 20 165 -110 -31 118 -42 35 -46 -39 51 111 0 -137 -204 131 -79 26 15 251 -160 -143 41
3664 41 32 -127 40 -138 30 56 -86 -266 46 48 111 -29 57 -100 16 -27 -72 -12 -105 -223 188 98 88 -75 83
3689 83 38 70 101 292 -53 67 -46 32 -101 -367 151 92 -95 -9 9 -61 52 146 -165 -111 -55 98 -38 -67
3713 -67 -99 8 -260 150 344 325 96 -253 67 -194 -235 207 128 -160 -79 101 36 84 -27 40 -151 -37 68
3736 68 118 241 -124 -230 43 -134 265 7 -88 96 -63 103 67 -22 82 -64 16 -1 -127 -144 54 163 123
3759 123 -22 -56 -67 204 40 -206 -270 -178 -13 -271 8 -314 -89 -10 -95 37 -37 -93 65 -68 44 108 8
3782 8 132 25 101 -88 117 215 56 -110 -247 102 135 172 56 144 -72 176 -44 279 37 96 117 18 200
3805 200 -209 14 -67 29 -37 -70 59 -30 -24 174 -37 178 167 98 122 -118 -97 -78 97 168 -205 88 410 -31
3829 -31 25 -89 111 72 -116 172 158 92 -22 -25 -80 17 -264 -39 -234 55 61 -8 -106 10 -72 167 -121 134 -222
3854 -222 53 82 -88 6 150 -4 183 -76 73 76 289 -67 -211 12 -74 25 -131 28 -201 -42 105 -226
3876 -226 283 -1 15 -130 -18 -31 119 77 82 -234 -167 185 -44 -225 194 153 137 -235 -226 42 146 20 109 145
3900 145 -115 -74 79 79 -208 -57 -104 287 63 -76 114 -142 -254 -104 -70 -136 -190 -60 109 -137 35 28 153
3923 153 63 -134 126 94 -165 59 -238 116 147 -228 -163 -185 -94 -163 -23 -226 0 47 -38 -188 15 -309 54
3946 54 313 -28 -6 29 31 137 -14 59 97 -37 -12 -2 -91 29 12 54 -76 43 -23 -38 -135 -17 -7 -19 -161 -38
3972 -38 -121 14 40 -171 199 153 -175 75 269 17 -11 -45 -64 -29 51 98 84 -71 -166 -86 -30 204 70 215 -25
3997 -25 -142 -203 -52 71 117 13 -54 -274 26 15 100 -187 -67 -146 137 16 -178 -207 -145 80 -128 296 -184
4020 -184 -128 139 173 -265 -146 2 17 -38 -100 -92 11 187 110 -156 157 -218 -86 309 161 -65 10 26 231
4043 231 29 199 -117 4 -158 -132 115 130 -160 81 37 339 -54 -83 -118 87 -313 -10 134 -149 -71 34
4065 34 122 188 162 81 268 85 -209 90 37 -200 74 -61 377 -12 -180 155 -272 121 139 -92 127 193 9
4088 9 -137 -16 -193 175 -56 3 -20 -110 151 221 -84 64 -127 -38 -14 52 224 -108 -138 -292 132 -68 145
4111 145 -153 -36 -40 52 -228 81 -272 -237 80 17 -96 79 205 275 250 -35 222 -127 -226 54 -142 221 369
4134 369 -221 32 115 86 232 64 64 -97 -253 188 71 244 51 27 -75 141 57 142 -24 170 141 99 40
4157 40 -91 39 -162 69 30 32 -182 15 209 229 -217 136 -41 76 97 4 106 212 142 139 67 -57 -62 -428
4181 -428 105 -78 0 -129 22 -10 -212 334 131 25 -192 92 -38 -74 281 34 -60 -49 -280 -285 318 -144
4203 -144 -122 68 125 -13 110 -40 33 129 -77 -83 -97 -181 85 235 -294 -12 63 -224 -58 -73 -191 -232 -39 210
4227 210 -84 -191 -329 -22 -118 -11 -110 92 -167 -38 119 -44 -1 137 -132 103 226 -33 89 56 -65
4248 -65 -169 -154 -168 89 2 -148 37 -27 -35 118 -67 41 38 23 27 257 112 9 34 274 12 11 -156 51 -271
4273 -271 232 -90 364 31 -85 24 -22 47 68 43 -22 -133 -113 9 -29 -95 141 55 -20 -103 -237 -184 250 192
4297 192 197 -50 -38 -173 -50 -29 121 54 212 239 -185 -268 -46 273 84 27 151 -80 -65 -91 -156 -101 -79 -92 -24
4322 -24 201 -104 -70 -46 237 -168 84 -339 -152 -284 43 31 113 145 -109 -77 127 269 160 -161 -101 56 -18
4345 -18 -143 297 85 245 -29 240 176 -99 -261 -452 102 -92 -119 -233 -28 -49 21 41 133 -251 -135 -349
4367 -349 117 -104 262 -90 -88 44 -154 64 -27 191 1 13 -15 163 -236 -194 208 -29 -7 -225 -55 -51 81
4390 81 -32 -34 -37 -139 132 -192 264 241 71 38 13 157 21 216 -143 98 -6 170 33 -49 14 207 -148
4413 -148 113 -77 158 54 -54 54 -36 -3 -62 80 268 71 -46 171 -114 64 -84 -129 -295 -86 -62 -362
4435 -362 -212 -34 58 93 131 -205 -207 4 -40 -63 93 -29 -76 74 57 56 -206 -96 -502 -48 -108 -37 -88 -143 -128
4460 -128 -157 -90 -162 245 92 72 131 -147 139 108 -98 -93 274 17 -101 280 -168 186 102 83 -153 -136 -167 -169 51
4485 51 128 -47 74 86 59 -96 190 -41 -96 150 -85 47 -12 -44 83 -394 -122 24 79 218 114 7 199
4508 199 59 -37 -130 -39 255 1 40 125 22 171 181 55 100 -79 99 64 -218 201 -84 30 83 -25 166
4531 166 149 67 -24 79 51 -186 123 45 -140 -173 3 157 -172 -154 -217 -327 51 259 108 72 98 -147 107
4554 107 -21 -230 21 87 -96 -92 -78 -174 -61 -13 113 333 98 -42 175 -12 92 45 71 -65 32 157 -11
4577 -11 285 181 111 -234 -21 -251 137 42 179 186 -182 -23 186 -78 119 -41 -41 -61 -108 -124 -15 -30 -84 -20
4601 -20 216 225 -41 -41 -213 117 -113 -5 0 -364 -20 -49 -329 -105 35 -152 -40 -180 127 -277 -105 107 -97
4624 -97 57 86 272 -318 88 72 -121 -57 123 -249 -69 179 43 -30 -17 74 263 420 30 -18 -60 118 -272
4647 -272 -43 -75 -96 5 -8 -286 -47 -124 -48 -64 63 160 -88 -46 -121 78 -255 2 -74 -40 -46 -60 -369 -26 -69
4672 -69 151 -103 -161 47 40 132 22 38 2 80 -57 -127 -137 6 145 -76 0 55 -26 34 -171 -102 -32 252 38
4697 38 207 233 260 -66 -282 95 -127 374 -119 -111 34 69 215 187 -78 152 -94 -82 -122 31 121 44 -142 -67
4721 -67 224 -73 -192 64 -85 -68 248 -24 -84 126 -32 -174 -231 75 2 126 9 117 -287 -35 -176 -97
4743 -97 243 -9 127 137 -123 -89 223 -101 73 -263 206 -106 -161 42 9 48 239 -31 48 48 39 256 79 143
4767 143 -79 -92 -302 -89 -64 -437 75 32 -157 -177 -120 -138 -225 92 -102 -50 6 -171 -96 -50 -16 317 66 89
4791 89 -146 1 67 -68 -31 -61 160 -53 157 102 185 73 191 -79 119 -91 270 83 -98 126 -32 77
4813 77 53 214 134 95 161 -72 65 179 4 168 154 104 253 -145 258 58 -71 131 35 -207 119 -225 76
4836 76 -165 -163 -62 -14 -25 129 46 -163 160 144 -118 -68 87 -296 161 -86 -261 92 -46 260 -20 -106 50
4859 50 120 186 -152 15 264 -165 45 -188 -7 24 46 1 29 -185 86 8 -195 -69 16 -51 -57 -119 59 -198
4883 -198 -11 19 49 84 -39 -81 27 -126 137 -95 -222 236 21 165 -134 140 -101 14 -27 12 -174 -127
4905 -127 17 -197 111 -272 211 -31 -3 68 -184 -209 -1 -31 250 65 -45 60 28 -152 -184 -11 -188 116
4927 116 -50 -29 2 -45 72 -57 110 35 229 -8 161 -14 -22 -127 130 -120 -1 47 159 -133 -91 243 -296
4950 -296 -11 -10 -11 -260 -91 -379 -214 -80 197 -140 9 -172 52 69 387 92 29 63 80 -122 -175 -106 89
4973 89 -25 207 115 -91 -159 -54 -79 -32 -42 -227 303 64 79 -65 17 166 -115 180 17 -48 -81 140 393
4996 393 -204 88 98 214 212 50 41 51 207 62 -49 104 -170 204 -107 156 172 32 301 116 1 40 80
5019 80 95 -100 31 -43 224 77 -9 -141 -66 -18 128 -232 -249 -184 38 140 139 82 35 -251 61 12 318 265 15
5044 15 89 101 -58 -79 229 -80 -90 165 152 16 63 64 19 23 141 198 253 59 56 -120 -77 62 121 -68 102 162
5070 162 76 165 -332 -71 -52 -130 -118 233 -248 -250 33 156 -121 -31 -79 -3 117 169 -158 -61 275 349 -32 39 163
5095 163 194 101 -95 -251 19 314 -70 167 70 63 5 -73 -100 321 87 -136 -68 88 -141 -241 33 68 -296
5118 -296 -204 -35 -16 104 -95 -130 -125 0 -128 -98 -40 158 295 -52 -138 -297 -14 -3 37 70 257 29 69 144
5142 144 63 396 -27 107 -10 -241 -21 239 71 -139 28 26 37 24 -57 40 81 -197 -76 -276 -81 178 -197
5165 -197 -96 -239 -278 -263 127 -72 182 -111 -243 -168 200 191 -283 -7 203 44 228 -90 60 -11 -150 -111
5187 -111 61 53 13 1 -95 -13 -58 108 -144 -99 -136 67 -336 -47 53 10 -120 -72 211 -373 69 106 -78 -14
5211 -14 114 69 -294 -122 65 245 -8 33 -42 -37 0 -15 -3 -131 -62 9 -132 83 -43 38 37 -15 -190 46 323
5236 323 -66 118 185 -242 70 270 309 71 -25 -13 -75 -153 92 116 -53 -19 29 195 88 -133 -116 -69 -218 -130
5260 -130 61 119 60 62 190 95 -49 2 31 -41 -131 189 121 -1 -89 -80 -27 -153 185 148 162 -91 -78 118 67 -61
5286 -61 -180 38 -91 -65 267 55 151 32 -88 -22 160 -139 133 -25 -116 80 -73 31 352 67 -15 -235
5308 -235 -213 -120 -79 -197 48 275 154 32 -47 173 77 -113 -3 -169 -55 -138 79 -488 -275 232 -101 46
5330 46 -194 -64 -98 11 -46 -68 234 -182 -157 128 -26 124 104 26 -54 140 -76 51 -21 -213 -217 -135 -182 80
5354 80 -105 -286 170 78 -66 -129 186 -43 130 12 -39 38 10 48 -37 27 14 188 178 216 -30 186 43 -31
5378 -31 48 -199 195 87 287 -197 139 -77 238 -71 178 81 -284 -183 -103 222 119 -88 130 215 37 82
5400 82 57 -63 -97 -26 -112 40 -52 92 -75 -49 54 41 28 45 133 32 22 57 18 26 -351 39 -81 207 -275
5425 -275 -23 22 236 69 -233 7 -84 -7 -213 35 122 3 3 -7 -96 -131 62 113 -37 11 -124 -47 -200 -103
5449 -103 -272 -118 31 -83 -69 52 -168 -69 56 62 -46 9 55 300 105 43 102 -97 56 -37 -81 -258 -71
5472 -71 40 -100 7 -135 -96 -24 244 90 191 -122 14 -58 -115 -45 -262 -34 -86 275 44 -166 -59 153
5494 153 148 -149 -146 -155 74 235 10 124 -206 -9 257 126 -45 -1 117 183 59 51 176 35 -4 7 127 0
5518 0 72 -128 -34 10 -61 79 -162 -128 138 187 98 -266 298 -71 -124 153 38 103 116 119 -98 45 169 13 -177
5543 -177 -32 -134 249 -70 81 137 406 133 92 -117 259 -165 77 13 -40 -10 96 136 271 65 -223 44
5565 44 296 240 -2 -60 -259 -76 -122 102 -180 -26 -88 19 1 -48 -328 2 31 48 -71 -68 5 161 42 -173
5589 -173 -204 -32 238 -20 -144 -35 61 57 -75 47 28 -54 -365 -116 206 227 68 -254 -100 53 -32 -28 96
5612 96 74 -77 5 -6 -166 -12 -185 -85 -109 -164 -66 45 144 158 98 -175 171 138 -137 -56 -9 152 -84 8 21
5637 21 -81 166 262 -143 -155 -49 35 143 194 18 167 -1 -144 -32 -81 -140 1 14 20 79 -50 232 171 103
5661 103 -199 -100 230 -242 -49 23 -92 66 203 -119 -52 -12 -52 256 141 -91 214 -178 -155 -54 2 37 72
5684 72 -38 -166 -89 -87 53 -172 -141 30 122 78 -54 -211 46 -18 47 -131 -226 2 4 -34 1 38 -98 290 12
5709 12 147 65 79 180 96 -342 -125 67 57 -258 98 306 -52 179 -60 -189 -15 -31 115 18 1 51 -403
5732 -403 264 -281 -184 217 44 95 -227 187 43 -48 -161 -102 50 132 109 25 -84 -148 99 -96 38 56 496
5755 496 -50 -149 86 -218 135 331 -46 205 104 307 287 -92 -11 64 -209 -27 269 -65 110 149 255 24
5777 24 108 -140 -21 -126 184 -30 -53 24 -108 130 24 339 -97 -17 174 -102 -169 119 138 91 249 42 77
5800 77 45 1 22 -5 165 31 -130 -66 -55 112 152 47 416 -17 103 32 149 -72 51 253 -264 42 34 -337
5824 -337 25 21 253 -24 -273 -105 122 -335 -106 156 -81 65 154 -106 -415 -97 44 117 24 243 -30 -224
5846 -224 156 -33 -129 172 -43 70 125 -33 -26 18 7 -208 86 177 44 207 62 -32 -15 5 51 -169 -93 -8
5870 -8 47 -111 11 -16 120 186 165 -74 260 265 -21 -64 153 -27 179 56 -116 -172 -22 44 21 -29 19 203 -52
5895 -52 114 3 80 7 -18 27 84 -1 36 326 21 5 -107 -287 -189 -334 313 -24 56 1 62 -59 29 283 -38
5920 -38 -2 130 16 -62 40 35 109 68 51 167 -134 135 223 94 98 5 -97 89 70 -46 186 -276 -132 55
5944 55 -127 323 104 31 -30 146 -303 89 234 -173 203 35 -36 161 -169 -170 23 -206 -3 -10 -117 84 111
5967 111 -75 -91 44 -74 -178 -38 -50 111 79 181 82 38 130 130 -84 46 -239 343 -131 -194 -107 -173 -173 -48
5991 -48 10 46 111 2 -1 73 -179 132 -4 446 126 -104 -180 91 186 -115 -105 -188 190 -140 1 67 78 201
6015 201 -3 -146 192 -36 40 -88 46 -133 -214 -101 -210 35 -83 -18 122 -176 -18 -136 -85 -49 138 -185
6037 -185 -124 127 254 -126 -67 -104 47 147 130 -97 239 -293 -97 -109 123 85 -99 -185 8 25 3 210 -221
6060 -221 129 11 71 169 -8 -55 181 -92 -32 111 19 -153 -115 -21 16 7 -234 127 -319 279 -26 -129 -135 156
6084 156 -68 -58 -39 -11 69 -64 41 -50 66 85 322 201 -44 203 -134 -261 -68 21 -255 0 10 -110 -88
6107 -88 24 476 16 -218 95 38 239 7 116 -136 211 94 -48 365 -35 165 -153 154 107 -10 114
6128 114 -53 -52 45 131 77 128 69 225 -60 80 5 282 -37 100 -9 90 -139 -60 -120 -150 -127 -242 88 -18
6152 -18 40 69 34 -89 127 -243 19 362 -63 -34 120 293 28 7 91 -238 -1 332 -20 -200 24 -306
6174 -306 -36 79 21 -107 121 53 -142 78 -235 -73 -160 -58 -184 -67 285 -120 130 -145 141 -69 85
6195 85 127 161 -114 -119 -23 237 -110 79 -339 -410 -87 -28 -128 -2 -70 -136 307 -69 237 -238 -218 111 174 286
6219 286 104 -69 -54 -222 -186 5 -106 235 -56 -91 176 266 113 -114 -22 186 39 -252 -158 35 -161 -156 22
6242 22 206 97 -148 -65 -158 101 133 79 -22 -88 -169 141 42 -34 83 -6 96 49 3 59 -65 -202 7 -96
6266 -96 272 34 -15 -261 129 214 -242 161 -22 -16 -339 103 55 60 221 18 41 -121 171 -21 -96 217 93
6289 93 93 238 -215 -136 71 286 -292 30 124 -115 233 -15 -150 -79 -12 398 -18 164 -280 237 -35 117
6311 117 162 24 88 -67 6 -12 -250 -280 -36 -75 54 71 29 103 78 -271 -39 -45 -29 167 242 194 251 11 214
6336 214 -201 -152 -194 -31 12 -144 291 -13 135 -93 -321 4 -165 215 -198 45 -27 -35 -124 -3 66 137 32
6359 32 -88 23 81 32 85 -26 -24 -70 104 -157 -49 132 -31 -10 -269 120 3 -111 151 -61 -310 119 205
6382 205 -154 163 37 -170 34 -47 -18 72 -16 97 202 33 -154 -69 214 33 -216 193 41 -31 85 169
6404 169 -83 -63 -138 40 -40 18 -119 330 184 76 -155 144 34 14 41 -19 336 -175 -199 0 5 -307 -389 -98
6428 -98 -31 125 42 55 -4 48 278 -160 -27 79 -177 -92 -34 74 -48 -166 165 -63 53 -324 -4 188 -70
6451 -70 -153 91 159 -107 48 -68 -88 33 -213 63 70 -342 -82 -22 247 361 46 85 411 -126 -141 -137 291 13
6475 13 198 125 67 69 231 -36 -236 125 -37 -60 -193 49 195 164 -61 35 195 -124 120 -17 83 -85 18
6498 18 -72 -23 -303 198 101 97 -74 -9 96 -111 39 88 -27 169 -7 -180 161 183 77 -63 -11 -215 -120 89
6522 89 37 92 5 -206 -68 88 4 129 59 -127 -77 49 -43 -45 199 -56 145 43 39 257 -66 -99 237 113
6546 113 185 -97 -189 -41 177 296 15 115 -4 147 -310 -143 -86 109 121 -159 101 -30 132 66 -177 164
6568 164 -155 -88 -248 -69 -284 -206 191 -14 -75 -10 212 170 176 -84 100 -97 127 -246 -130 26 382 -14
6590 -14 126 -72 39 -229 -122 -64 66 58 -166 -153 95 -33 99 3 22 51 -104 -193 -377 302 5 -275 6
6613 6 -94 -87 -20 -100 88 -16 -5 36 201 26 180 196 -8 8 254 17 257 -94 -124 48 60 52 156 97 168
6638 168 -96 249 -101 -45 52 20 -93 -52 189 53 -26 -43 66 -1 170 45 25 -115 -121 -204 -129 56 115 -114
6662 -114 102 -110 139 131 -36 124 -69 -154 160 110 -23 -90 -42 46 69 -127 22 11 -27 74 -135 -138 6 17
6686 17 -64 -288 -25 -184 108 -86 -67 31 -84 62 153 237 116 18 -174 182 154 47 -110 166 61 98 -28
6709 -28 -191 -154 37 250 -289 136 227 154 58 -237 167 -15 221 125 28 -141 -162 41 142 -281 -3 105 265
6732 265 -166 33 -69 87 56 -26 182 -64 49 61 -6 -236 -26 94 156 127 141 153 -40 -218 193 141 104
6755 104 11 129 3 -45 249 25 -18 -269 -106 30 -56 31 107 141 -29 225 71 -11 7 -135 135 143 -109 87
6779 87 133 99 -238 77 -76 166 -50 -234 -68 -10 12 -21 -80 -67 -47 311 199 188 13 -196 16 -338 146
6802 146 72 359 -49 -63 221 -31 305 304 132 183 57 -102 143 -44 -79 -34 -381 -94 -59 16 -267 -144 44
6825 44 59 -84 -40 -14 -168 9 -56 114 -116 -20 -86 212 -65 52 12 149 142 -257 81 131 140 -206 9 53 186
6850 186 232 -112 -100 265 54 37 -48 -173 -275 -355 21 27 -246 -8 -379 158 -146 -93 27 -199 41 154 12
6873 12 -122 -174 -13 -288 -120 -65 -224 176 104 -153 -321 -11 1 -103 -178 -161 -318 -106 127 47 155 -32 -151
6896 -151 178 43 -1 -192 -225 -296 194 60 -292 -49 109 -27 101 231 -27 154 -10 70 52 -19 -14 -85 120
6919 120 -6 -31 -302 -274 -20 -79 -46 -200 -6 123 -245 41 -132 73 83 311 -193 20 44 128 -62 -373
6941 -373 -82 134 -44 -366 274 237 -166 -6 -79 -132 -244 -110 -39 163 -14 33 -41 56 -12 165 117 66 27 7
6965 7 -76 70 -42 38 5 -9 190 41 192 -141 173 2 -181 -144 -16 33 -63 95 97 46 -75 -83 -141 64 -27
6990 -27 -131 50 31 -94 -22 106 -66 212 2 151 -146 70 161 -40 -144 -10 3 112 -69 -230 128 45
7012 45 261 43 190 -185 -329 -129 -31 34 53 -138 -22 -347 78 -355 -75 -11 48 -68 -92 272 119 -235
7034 -235 92 163 -38 -91 144 -150 -2 180 -83 71 108 -45 -106 161 111 -38 206 -57 -49 81 -42 -129 -308
7057 -308 239 -11 -105 -135 147 -64 -66 338 269 44 46 -219 -79 -102 161 -25 3 -21 1 -1 31 91 202 110 -67
7082 -67 91 71 -7 48 177 76 20 -1 73 -113 -302 -353 -19 -21 -148 -106 302 -66 -237 -154 23 -54 8 122 308
7107 308 277 86 -86 -78 -96 159 99 293 98 317 -298 -255 -156 -17 54 -7 73 -301 104 -152 41 -32 44 -44
7131 -44 48 -111 -219 -175 -153 -34 -14 -185 -163 -37 114 -350 118 296 -95 32 -29 -78 39 -49 -92 -269 11
7154 11 6 -45 -61 47 -91 50 64 70 -58 -205 -79 3 23 -101 23 84 298 86 -56 8 77 250 -152 -3
7178 -3 117 -199 137 16 -128 150 221 232 -141 -103 -189 -58 116 -58 21 98 -56 -133 -53 -3 99 330 90 83
7202 83 -62 134 92 -66 171 -229 191 272 19 -58 -162 38 74 63 158 -272 81 95 -229 -20 -23 -13 -217 -112
7226 -112 115 72 -248 105 -16 124 -65 -262 -52 -87 -26 20 -70 -73 14 100 -76 -112 -117 -195 -223 109 171 157 -12
7251 -12 154 93 -24 -142 7 65 167 -126 5 19 -209 113 -54 361 41 164 -155 -162 11 -102 420 3
7273 3 149 91 -118 -270 -30 46 -39 -104 9 166 71 -199 -209 64 -108 73 12 -190 -32 -13 100 161 34 45
7297 45 155 -287 -20 -91 -240 98 -209 -59 -160 -73 -141 -23 -33 363 164 55 2 -66 -92 -114 -45 -96 27 21
7321 21 -103 -87 -168 -161 128 -151 76 -122 79 98 175 18 -81 128 43 -141 -65 -31 -96 6 -45 -174 -174 79 -170
7346 -170 222 17 101 111 9 -182 -77 1 286 39 142 181 -270 22 -66 157 133 103 4 -358 65 -224 5
7369 5 -73 235 28 298 17 88 -107 -298 52 165 181 -239 -77 -150 -123 -78 -121 -198 -66 -123 61 -108 -137 9
7393 9 -107 50 205 -342 -203 -100 61 -168 -194 -108 278 75 -57 23 19 -228 -158 83 -74 -222 125 -1 -19
7416 -19 178 94 188 -193 -72 -8 -17 -33 -160 31 169 51 -158 -171 201 -217 117 -81 -150 133 -139 78 6
7439 6 8 -157 -98 159 69 104 22 192 94 -82 466 -62 -70 80 13 55 -171 227 13 50 -66 83 -243 191 68
7464 68 -91 57 171 -121 117 -184 137 -85 287 -56 -98 131 3 -94 -256 -9 1 78 139 66 -44 -166
7486 -166 22 365 -47 20 77 49 -173 -191 -72 -357 151 -50 -123 -107 95 29 -73 43 -162 12 -291 -130
7508 -130 -18 -30 178 -72 23 269 -109 -19 37 139 124 -136 -1 100 -17 127 58 102 -60 -141 -66 -250 -44
7531 -44 -341 -74 167 84 143 109 -21 -28 26 -6 135 61 -287 35 77 176 -2 4 -39 254 146 38 191 -78 -26
7556 -26 -145 -179 104 222 33 53 25 -165 -38 119 -124 26 -128 -48 -136 5 -223 106 -30 40 192 36
7578 36 -67 48 -191 294 -200 -244 -102 -247 -144 85 21 -114 -210 14 -148 -22 -238 -41 -175 88 57 24
7600 24 24 16 105 167 -48 -82 272 164 81 -1 -139 -124 80 -22 -31 188 47 -357 -48 -187 159 -105 -186 -63 56
7625 56 2 -32 90 -176 -51 271 115 -81 160 -29 296 65 9 221 -67 23 -40 138 -110 116 -65 -68 -226
7648 -226 81 125 22 187 144 102 -12 -181 28 16 -101 -50 -43 252 23 -34 -106 -59 -192 -157 -4 -314 -93 -73
7672 -73 213 23 33 111 -67 -52 88 -168 -179 -140 219 157 -30 -167 285 -204 56 79 240 -233 125 227 208
7695 208 71 -51 -120 -109 187 -54 36 -52 27 51 -8 -75 406 0 203 -223 -28 -134 -24 50 -22 -116 71 130
7719 130 -118 -268 -8 -21 14 84 -7 -52 -33 -74 101 -41 156 -158 -239 226 130 132 143 -127 128 212 -39 -54 -98
7744 -98 3 197 -133 98 107 92 -305 43 -41 137 169 -243 -7 -162 -79 29 -262 -60 -216 115 -332 208
7766 208 142 -7 31 -105 -133 182 274 98 -321 29 38 -14 79 -344 32 -196 -76 -181 -159 -85 -4 196 42 101
7790 101 44 -176 -178 67 59 150 -11 -216 -89 251 -10 130 98 -174 -106 -89 -136 -81 -43 -175 -254 88 -7 -308 -214
7815 -214 -48 270 85 -42 -93 84 -20 -82 -351 6 54 -231 -24 -46 -199 -57 -19 -104 -228 27 -66 -5 -25
7838 -25 237 -64 -160 169 20 103 -26 182 -73 37 -111 87 94 310 -49 5 -1 70 -234 -70 25 -1 -159 -54
7862 -54 -115 -135 49 -117 -77 248 -159 -19 265 -396 -274 191 -45 172 151 75 -104 -8 121 87 -46 71 -47
7885 -47 50 28 -88 65 22 69 58 -66 100 13 13 -6 108 197 -40 273 -418 -167 25 -141 208 78 18 14 -112
7910 -112 -262 88 -70 153 33 162 520 193 -140 -240 119 -234 286 214 -87 99 25 5 -49 26 -82 -118
7932 -118 218 -45 -231 86 -212 242 -293 -24 167 -42 81 91 -43 218 -115 42 15 290 -82 -52 150
7953 150 100 -41 173 -195 91 7 -53 -107 -68 38 -194 -140 -17 247 -11 -23 61 62 179 129 -155 -8 192 128
7977 128 -29 101 21 133 22 -41 -140 132 75 63 -171 -96 30 15 145 -84 50 -114 -229 77 -147 -63 54
8000 54 137 -54 -200 173 -119 2 -299 -69 -165 26 -84 242 195 -61 -64 100 -209 -51 78 4 213 -95
8022 -95 67 -147 -13 90 160 56 -197 -83 -6 -206 -36 -69 103 33 -190 43 125 -164 30 139 50 -41 166
8045 166 -88 0 -135 -218 -4 41 344 -135 2 110 -85 76 62 59 -19 -157 1 67 133 117 -181 -357 36
8068 36 -115 -65 148 125 101 105 209 -71 108 262 82 128 50 248 -74 -73 9 259 -269 102 149 44 -77 -63
8092 -63 -21 233 -217 -199 -279 85 18 -13 -20 -82 -111 30 85 -252 -94 -74 -12 135 169 -89 169 -53 45 5 -82 -21
8118 -21 -69 -143 281 -5 32 -56 -2 -35 -366 -88 -52 -56 233 73 -175 155 189 -104 -166 34 -112 -97 -61 52 -191
8143 -191 73 -188 -158 -114 28 -182 213 -197 127 -10 -5 -80 -120 -27 -259 -228 101 -130 -184 262 21 32 -239
8166 -239 434 -6 98 194 79 -89 89 238 73 26 117 171 191 264 114 -18 70 -209 -95 363 73 55 77
8189 77 6 89
8191H9
##END NTUPLES=NMR FID
##END=
