##TITLE=1H_LR-758-R4-KAO-CR4-iPrOH
 CDCl3
 8 sc, 
 6.10.2023
##JCAMPDX= 6.0         $$ Bruker NMR JCAMP-DX V2.0
##DATA TYPE= NMR FID
##DATA CLASS= NTUPLES
##ORIGIN= UXNMR, Bruker Analytische Messtechnik GmbH
##OWNER= root
$$ XWIN-NMR		Version 3.5
$$ Fri Oct  6 14:57:30 2023 Russian Standard Time (UT+4h)  she@DPX200
##.OBSERVE FREQUENCY= 200.13135
##.OBSERVE NUCLEUS= ^1H
##.DELAY= (6, 6)
##.ACQUISITION MODE= SIMULTANEOUS
##.ACQUISITION SCHEME= undefined
##.AVERAGES= 8
##.DIGITISER RES= 18
##SPECTROMETER/DATA SYSTEM= spect
##.PULSE SEQUENCE= zg30
##.SOLVENT NAME= CDCl3
##.SHIFT REFERENCE= (INTERNAL, CDCl3, 0, 15.7039)
##AUDIT TRAIL= $$ (NUMBER, WHEN, WHO, WHERE, WHAT)
$$ ##TITLE= Audit trail, XWIN-NMR		Version 3.5
$$ ##JCAMPDX= 5.01
$$ ##ORIGIN= Bruker BioSpin GmbH
$$ ##OWNER= she
$$ F:/spectra/data/she/nmr/H-F/1/audita.txt
$$ ##AUDIT TRAIL=  $$ (NUMBER, WHEN, WHO, WHERE, WHAT)
(   1,<2023-10-06 14:56:15.81 +0400>,<she>,<DPX200>,
      <created by zg, POWCHK disabled, PULCHK disabled
       configuration hash MD5:
       00 E9 B6 7A A2 85 ED C7 34 08 36 98 17 FE 4E 26
       data hash MD5: 16K
       D6 5A 9A 01 36 AF ED 0C AF 48 30 C7 CA 35 C7 2B>)
$$ ##END=
$$ 
$$ hash MD5
$$ A4 69 29 BA FB 53 6F E1 47 82 B6 AE 54 87 3C 4F
##$RELAX= 
##$RELAX= 
##$RELAX= 
##$RELAX= 
##$RELAX= 
##$RELAX= 
$$ Bruker specific parameters
$$ --------------------------
##$DU= <F:/spectra>
##$EXPNO= 1
##$NAME= <H-F>
##$PROCNO= 1
##$TYPE= <nmr>
##$USER= <she>
##$AMP= (0..31)
100 100 100 100 100 100 100 100 100 100 100 100 100 100 100 100 100 100 
100 100 100 100 100 100 100 100 100 100 100 100 100 100 
##$AQSEQ= 0
##$AQ_mod= 1
##$AUNM= <au_zg>
##$AUTOPOS= <>
##$BF1= 200.13
##$BF2= 200.13
##$BF3= 200.13
##$BF4= 200.13
##$BF5= 200.13
##$BF6= 200.13
##$BF7= 200.13
##$BF8= 200.13
##$BYTORDA= 1
##$CFDGTYP= 0
##$CFRGTYP= 5
##$CHEMSTR= <none>
##$CNST= (0..31)
1 1 145 1 1 1 1 1 1 1 1 1 1 1 1 1 1 1 1 1 1 1 1 1 1 1 1 1 1 1 1 1 
##$CPDPRG= <>
##$CPDPRG1= <>
##$CPDPRG2= <>
##$CPDPRG3= <>
##$CPDPRG4= <mlev>
##$CPDPRG5= <mlev>
##$CPDPRG6= <mlev>
##$CPDPRG7= <mlev>
##$CPDPRG8= <mlev>
##$CPDPRGB= <>
##$CPDPRGT= <>
##$D= (0..31)
0 1.2 0 0 0 0 0 0 0 0.06 0 0.03 0 0 0 0 0.0002 0 0 0 0 0 0 0 0 0 0 0 0 
0 0 0 
##$DATE= 1696589775
##$DBL= (0..7)
120 120 120 120 120 120 120 120 
##$DBP= (0..7)
150 150 150 150 150 150 150 150 
##$DBP07= 0
##$DBPNAM0= <>
##$DBPNAM1= <>
##$DBPNAM2= <>
##$DBPNAM3= <>
##$DBPNAM4= <>
##$DBPNAM5= <>
##$DBPNAM6= <>
##$DBPNAM7= <>
##$DBPOAL= (0..7)
0.5 0.5 0.5 0.5 0.5 0.5 0.5 0.5 
##$DBPOFFS= (0..7)
0 0 0 0 0 0 0 0 
##$DE= 6
##$DECBNUC= <off>
##$DECIM= 32
##$DECNUC= <off>
##$DECSTAT= 4
##$DIGMOD= 1
##$DIGTYP= 9
##$DL= (0..7)
0 120 120 120 120 120 120 120 
##$DP= (0..7)
150 150 150 150 150 150 150 150 
##$DP07= 0
##$DPNAME0= <>
##$DPNAME1= <>
##$DPNAME2= <>
##$DPNAME3= <>
##$DPNAME4= <>
##$DPNAME5= <>
##$DPNAME6= <>
##$DPNAME7= <>
##$DPOAL= (0..7)
0.5 0.5 0.5 0.5 0.5 0.5 0.5 0.5 
##$DPOFFS= (0..7)
0 0 0 0 0 0 0 0 
##$DQDMODE= 0
##$DR= 18
##$DS= 0
$$ [...]
##$SUBNAM2= <"">
##$SUBNAM3= <"">
##$SUBNAM4= <"">
##$SUBNAM5= <"">
##$SUBNAM6= <"">
##$SUBNAM7= <"">
##$SUBNAM8= <"">
##$SUBNAM9= <"">
##$SW= 18.05172834244
##$SWIBOX= (0..15)
0 0 2 0 0 0 0 0 0 0 0 0 0 0 0 0 
##$SW_h= 3612.71676300578
##$TD= 16384
##$TD0= 1
##$TE= 0
##$TE2= 300
##$TE3= 300
##$TEG= 300
##$TL= (0..7)
0 120 120 120 120 120 120 120 
##$TP= (0..7)
150 150 150 150 150 150 150 150 
##$TP07= 0
##$TPNAME0= <>
##$TPNAME1= <>
##$TPNAME2= <>
##$TPNAME3= <>
##$TPNAME4= <>
##$TPNAME5= <>
##$TPNAME6= <>
##$TPNAME7= <>
##$TPOAL= (0..7)
0.5 0.5 0.5 0.5 0.5 0.5 0.5 0.5 
##$TPOFFS= (0..7)
0 0 0 0 0 0 0 0 
##$TUNHIN= 0
##$TUNHOUT= 0
##$TUNXOUT= 0
##$USERA1= <user>
##$USERA2= <user>
##$USERA3= <user>
##$USERA4= <user>
##$USERA5= <user>
##$V9= 5
##$VALIST= <valist>
##$VCLIST= <CCCCCCCCCCCCCCC>
##$VD= 0
##$VDLIST= <DDDDDDDDDDDDDDD>
##$VPLIST= <PPPPPPPPPPPPPPP>
##$VTLIST= <TTTTTTTTTTTTTTT>
##$WBST= 1024
##$WBSW= 4
##$XGAIN= (0..3)
0 0 0 0 
##$XL= 0
##$YL= 0
##$YMAX_a= 92722
##$YMIN_a= -108622
##$ZGOPTNS= <>
##$ZL1= 120
##$ZL2= 120
##$ZL3= 120
##$ZL4= 120
##$ABSF1= 10
##$ABSF2= 0
##$ABSG= 5
##$ABSL= 3
##$ALPHA= 0
##$AQORDER= 0
##$ASSFAC= 0
##$ASSFACI= 0
##$ASSFACX= 0
##$ASSWID= 0
##$AUNMP= <proc_1d>
##$AZFE= 0.1
##$AZFW= 0.1
##$BCFW= 1
##$BC_mod= 2
##$BYTORDP= 1
##$COROFFS= 0
##$CY= 11.3945322036743
##$DATMOD= 1
##$DC= 2
##$DFILT= <>
##$DTYPP= 0
##$F1P= 15.7292609196834
##$F2P= 12.9074282941183
##$FCOR= 0.5
##$FTSIZE= 0
##$FT_mod= 4
##$GAMMA= 1
##$GB= 0.15
##$INTBC= 1
##$INTSCL= 1
##$ISEN= 128
##$LB= 0.24
##$LEV0= 0
##$LPBIN= 0
##$MAXI= 10000
##$MC2= 0
##$MEAN= 0
##$ME_mod= 0
##$MI= 1.114404
##$NCOEF= 0
##$NC_proc= 0
##$NLEV= 6
##$NOISF1= 3.799351
##$NOISF2= 2.8
##$NSP= 1
##$NTH_PI= 0
##$NZP= 0
##$OFFSET= 15.70392
##$PC= 1
##$PHC0= -22425.93
##$PHC1= 5.852712
##$PH_mod= 1
##$PKNL= yes
##$PPARMOD= 0
##$PSCAL= 0
##$PSIGN= 0
##$REVERSE= no
##$SF= 200.130013532006
##$SI= 16384
##$SIGF1= 3
##$SIGF2= 2
##$SINO= 400
##$SIOLD= 16384
##$SREGLST= <1H.CDCl3>
##$SSB= 0
##$STSI= 0
##$STSR= 0
##$SW_p= 3612.71676300578
##$SYMM= 0
##$S_DEV= 0
##$TDeff= 0
##$TDoff= 0
##$TI= <>
##$TILT= no
##$TM1= 0
##$TM2= 0
##$TOPLEV= 0
##$USERP1= <user>
##$USERP2= <user>
##$USERP3= <user>
##$USERP4= <user>
##$USERP5= <user>
##$WDW= 1
##$XDIM= 8192
##$YMAX_p= 0
##$YMIN_p= 0
$$ End of Bruker specific parameters
$$ ---------------------------------
##NTUPLES= NMR FID
##VAR_NAME=  TIME,          FID/REAL,        FID/IMAG
##SYMBOL=    X,             R,               I
##VAR_TYPE=  INDEPENDENT,   DEPENDENT,       DEPENDENT
##VAR_FORM=  AFFN,          ASDF,            ASDF
##VAR_DIM=   8192,          8192,            8192
##UNITS=     SECONDS,       ARBITRARY UNITS, ARBITRARY UNITS
##FACTOR=    0.0002768,     1,               1
##FIRST=     0,             0,               0
##LAST=      2.2672688,     0,               0
##MIN=       0,             -108622,         0
##MAX=       2.2672688,     92722,           0
$$ Real data points
##PAGE= N=1
##DATA TABLE= (X++(R..R)), XYDATA
$$ [...]
$$ plain form
1797 378 -180 -245 -26 73 101 -195 -232 -533 -410 -512 -464 -151 -252 64 66 -32 -90 233 -20 46 308 389 241 613
1821 613 692 355 525 645 314 152 337 -215 143 211 -221 184 260 -245 -506 11 -255 -525 -153 -1000 -874
1842 -874 -245 -414 -410 -275 -60 -494 -126 103 -331 -157 158 -248 88 554 289 217 325 158 164 364 142 229
1864 229 180 -9 -65 96 -20 42 14 -69 -246 -166 -258 47 160 -127 -203 239 204 -22 191 210 -110 403 61
1887 61 122 256 368 203 152 340 99 -191 -57 -172 -313 -77 -275 -478 -117 -330 -574 -581 -267 -484 -536 -248
1909 -248 -552 -282 -361 -71 -188 241 28 169 392 523 325 218 174 221 396 231 33 435 220 299 47
1930 47 -191 -539 5 -540 -312 -201 -515 -425 -117 -198 -743 9 -315 -251 -277 44 -175 -261 551 148 112 614
1952 614 120 -70 354 183 -49 290 499 47 94 120 -5 -72 -109 -274 -204 -88 -428 -463 -207 -205 -109 -451 -115
$$ packed form
1797C78n58o5K19R9K8k96l7l01J23j02M8L13j01L16Kr8n8L23k53O6K62Q1j48L72
1821F13P9l37J70J20l31j62J85n52L58O8m32M05P6n05k61N17k66k70L72q47J26
1842h74O29j69MJ35K15m34L68K29m34J74L15m06L36M66k65p2J08j67OK00k22Q7
1864B29m9j89n6J61j16O2k8q3j77Q0r2L05J13k87p6M42l5k26K13J9l20N13l42
1887F1O1J34J12j65n1J88k41k90J34j15j41K36j98k03L61k13k44pL14k17n2K88
1909b48l04K70p9K90j17M29k13J41K23J31j98j07m4M7J75j65j98M02k15P9k52
1930D7k38l48N44n45K28J11l14R0L08q1n45P52l24O4k6L21k19q6Q12m03l6N02
1952F14m94j90M24j71k32L39K09m52M7K6j25o7l7j65P0J16l40l5K56KR6l42L36
$$ plain form
1975 -115 -20 18 -242 46 -102 -15 168 245 46 190 525 186 106 51 -107 -5 22 25 5 66 -58 -158 -98 -208
1999 -208 -544 -367 -470 -409 -280 -120 -501 -700 95 -257 -80 160 -64 -100 15 252 13 532 56 80 502
2020 502 130 270 -45 -62 -51 -202 74 -220 -66 226 -306 -289 -163 -645 -372 -324 -559 -359 -368 -99 -5 71 93
2043 93 -140 151 -61 0 205 225 201 438 414 201 422 564 107 356 111 -171 115 173 -262 -149 164 -247
2065 -247 -126 -170 -400 -305 -299 -168 -376 -297 -134 -211 36 143 -232 367 188 -93 189 37 179 218 173 383 128
2088 128 228 -68 116 9 -25 17 -150 -69 15 -21 -93 12 -100 -68 36 -9 -116 88 -19 -48 -248 197 12
2111 12 114 98 180 165 14 136 5 146 358 -11 -2 63 -126 -56 40 -250 -80 -21 -293 -301 -120 -134 90 -29
2135 -29 46 244 134 -283 -239 58 -38 -35 230 242 261 425 499 219 205 300 196 137 49 160 53 324 145 151 -157
$$ packed form
1975a15R5L8k60K88j48Q7J83P7j99J44L35l39q0n5j58J02K7Lk0O1j24j00O0j10
1999b08l36J77j03O1J29J60l81j99P95l52J77K40k24l6J15K37k39N19m76K4M22
2020E02l72J40l15j7J1j51K76k94J54K92n32J7J26m82K73M8k35K00rK69R4P6K2
2043I3k33K91k12O1K05K0k4K37k4k13K21J42m57K49k45k82K86N8m35J13L13m11
2065b47J21m4k30R5OJ31k08P9J63p7K47J07l75N99j79k81K82j52J42L9m5K10k55
2088A28J00k96J84j07l4M2j67Q1Q4l6p2J05j12L2J04m5j07K04j07k9k00M45j85
2111A2J02j6Q2j5j51J22j31J41K12l69RO5j89P0R6k90J70N9k72qJ81j4K24j19
2135b9P5J98j10m17M4K97r6LK65J2J9J64P4k80j4R5j04n9q8J11j07K71j79Ol08
$$ plain form
2160 -157 -47 139 -320 -73 -171 -307 -181 -485 -6 36 -17 -206 -12 -106 -154 -57 102 305 140 -173 209 319
2182 319 195 149 286 61 287 283 19 106 87 185 -248 -277 17 -127 -11 -306 -334 128 -149 8 54 -227 -140
2205 -140 8 -63 -200 -16 296 137 -6 178 407 182 -39 -85 238 -43 130 -157 9 -133 260 237 13
2226 13 -140 189 -135 -217 -82 24 -179 -107 -78 -83 270 241 130 325 285 375 228 267 144 372 112 354 450 110
2250 110 564 52 -69 -215 -60 -185 -61 99 -45 -190 104 -60 -362 150 -165 -198 -207 -77 -107 -96 -167 221
2272 221 27 372 299 434 300 -95 51 137 323 224 416 404 47 -20 -150 146 -217 -36 -181 4 -10 -125
2294 -125 -176 39 -241 -423 -82 -45 -125 -297 -191 37 7 382 -127 390 226 -27 -38 222 577 -51 227 158
2316 158 -88 18 224 172 -80 -69 -69 167 -19 -190 -103 -364 264 129 54 11 20 83 -103 96 -151 97 2 185
$$ packed form
2160a57J10J86m59K47r8j36J26l04M79M2n3j89J94r4m8R7J59K03j65l13L82J10
2182C19j24m6J37k25K26mk64Q7j9R8m33k9K94j44J16k95k8M62k77J57M6k81Q7
2205a40J48p1j37J84L12j59j43J84K29k25k21m6L23k81J73k87J66j42L93k3k24
2226A3j53L29l24q2J35J06k03P2K9nL53k9j11J95m0R0j47L9j23K28k60K42R6l40
2250A10M54n12j21j46J55j25J24J60j44j45K94j64l02N12l15l3rJ30l0J1p1L88
2272B21j94L45p3J35j34l95J46Q6J86r9J92j2l57o7j30K96l63J81j45J85j4j15
2294a25n1K15k80j82L41L7q0j72J06K28l0L75n09N17j64k53j1K60L55o28K78o9
2316A58k46J06K06n2k52J1%K36j86j71Q7k61O28j35p5m3RO3j86J99k47K48r5J83
$$ plain form
2340 185 160 212 62 -40 122 -108 -209 45 154 -204 -173 -3 -22 269 -28 -151 -47 -397 -465 -256 -8 -13
2362 -13 -73 -81 153 -192 270 32 -351 -84 108 73 402 14 414 140 22 318 -31 27 63 -198 -262 120 -32
2385 -32 302 -51 -266 25 -58 22 -177 -321 22 -75 -247 -162 -16 73 149 189 89 -133 -61 279 -170 143 91
2408 91 60 383 245 -62 -49 64 8 -11 64 -52 -41 13 -48 75 58 197 -12 -211 5 302 -196 -98 10 105
2432 105 149 70 405 209 10 -54 69 44 238 -29 224 145 11 132 -186 50 97 52 174 -7 2 217 89
2455 89 102 310 -57 107 180 22 23 -48 248 -51 -30 111 -101 137 180 67 91 81 156 -61 259 97 113 159
2479 159 125 28 -397 22 -44 -140 -254 38 -209 -54 -35 30 -5 203 91 -117 13 307 14 198 222 328 211
2502 211 111 168 -10 93 85 46 361 243 136 -64 6 -181 -24 148 -30 -141 -167 5 -65 77 -285 -147
$$ packed form
2340A85k5N2j50j02J62k30j01K54J09l58L1J70j9K91k97j23J04l50o8K09K48n
2362a3o0qK34l45M62k38l83K67J92l5L29l88M00k74j18K96l49N8L6k61o4L82j52
2385c2L34l53k15K91q3Q0j99j44L43r7j72Q5J46Q9P6M0j00k22P2L40m49L13n2
2408I1l1L23j38l07J3J13n6j9P5j16J1N4o1J23j7J39k09j99K16K97m98R8J08R5
2432A05M4p9L35j96j99o4J23k5J94k67K53p9j34J21l18K36M7m5J22j81RK15j28
2455H9J3K08l67J64P3j58Jp1K96k99K1J41k12K38M3j13K4j0P5k17L20j62J6M6
2479A59l4r7m25M19o6r6j14K92k47J55J9O5l5K08j12k08J30K94k93J84K4J06j17
2502B11j00N7j78J03ql9L15j18j07k00P0j87J57J72j78j11k6J72p0J42l62J38
$$ plain form
2524 -147 104 300 -107 9 -18 -72 -110 -155 -32 -185 -60 -133 8 141 90 104 -90 -48 -77 17 -198 -12 9 -351
2548 -351 -80 -158 -121 164 152 -17 -330 50 81 39 302 125 -46 216 134 154 318 26 -89 -61 78 24 1
2571 1 -86 34 -68 13 -222 -203 -195 -85 -76 -68 -73 -191 -37 139 54 -141 -10 146 -180 175 -99 25 245 138 104
2596 104 98 24 22 -27 -21 -64 -73 151 211 133 -199 281 -97 -38 -61 14 -87 -200 -71 -34 14 -169 -177 -170 60 72 32 31 -71
2625 -71 -3 -118 182 82 158 96 -4 387 471 -164 158 97 -193 31 161 -228 -83 -106 -43 -167 28 -4 177
2648 177 28 -180 344 -50 236 -270 370 116 41 87 51 -104 149 185 166 -38 130 120 120 97 70 27 93 107
2672 107 -198 94 -17 -221 -130 -105 -144 -130 -15 209 -9 20 134 177 95 61 18 169 169 -24 22 -33 232 160 105
2697 105 -53 83 63 -54 171 -132 79 -130 25 -87 -1 59 -210 -209 -166 -95 27 -58 -157 -220 -135 111 199 160
$$ packed form
2524a47K51J96m07J16k7n4l8m5J23j53J25p3J41J33n1J4j94M2k9R4k15J86K1l60
2548c51K71p8L7K85j2j69l13L80L1m2K63j77j71K62q2K0J64k92j15K8J39n4k3
2571Aq7J20j02Q1k35J9QJ10RQnj18J54J76q5j95J31J56l26L55k74J24K20j07l4
2596A04op4km9Om3rK24O0p8l32M80l78N9k3P5j01j13J29L7M8j83qPK30J2m0jj02
2625g1O8j15L00j00P6o2j00L91Q4o35L22o1k90K24J30l89J45k3O3j24J95l2J81
2648A77j49k08N24l94K86n06O40k54p5M6l6j55K53L6j9k04J68j0%k3k7m3O6J4
2672A07l05K92j11k04R1K5l9J4J15K24k18K9J14M3q2l4m3J51%j93M6n5K65p2n5
2697A05j58J36k0j17K25l03K11k09J55j12Q6O0k69JM3P1J22q5r9o3Q5K46Q8l9
$$ plain form
2721 160 210 244 231 208 163 -93 94 109 226 -66 31 87 108 193 -40 -375 -180 -36 23 -167 -284 -375 22 -250
2745 -250 -100 -256 -44 8 51 240 -197 -56 -73 -16 76 88 202 314 267 145 -240 13 123 -65 -119 142 -101
2768 -101 95 171 -187 5 55 -170 -136 -409 -236 -106 -59 235 -94 -15 -134 91 -2 125 258 -85 -16 116
2790 116 223 101 119 277 45 14 201 -56 -148 -149 -165 -205 -165 94 -60 -161 -103 -302 2 -281 58 -172 -445
2813 -445 -45 -120 -33 286 -55 -118 -81 -18 126 357 229 -30 106 97 -31 88 234 85 132 -22 -111 45 -240
2836 -240 -112 -4 17 -259 -158 -236 -422 -386 -56 -118 -134 59 73 219 -10 406 -80 288 45 111 170 241 299
2859 299 304 117 202 -6 -52 -58 -42 76 39 -232 2 -111 -1 -146 -85 -269 -290 -335 -174 73 -27 -85 182 -21
2883 -21 150 -57 326 -14 22 -84 163 83 -27 126 66 157 60 20 -132 -193 -75 40 -54 3 103 -62 -229
$$ packed form
2721A60N0L4j3k3m5k56J87J5J17k92R7N6K1Q5k33l35J95J44N9j90j17r1L97k72
2745b50J50j56K12N2M3J89m37J41j7N7R2J2J14J12m7j22l85K53J10j88n4K61k43
2768a01J96P6l58J92N0k25L4k73J73J30M7K94l29P9j19K25r3J27J33l43O9J32
2790A16J07j22J8J58k32l1J87k57r2jj6m0M0K59j54j01N8j99L04k83L39k30k73
2813d45M00p5Q7L19l41o3L7O3J44K31j28k59J36rj28J19J46j49M7j54q9J56k85
2836b40J28J08K1k76J01p8j86L6L30o2j6J93J4J46k29M16m86L68k43O6N9P1N8
2859B99Nj87Q5k08m6oJ6J18l7k71K34j13J10j45O1j84k1m5J61K47j00n8K67k03
2883b1J71k07L83l40L6j06K47q0j10J53o0R1r7m0j52o1J18J15r4N7J00j65j67
$$ plain form
2906 -229 41 77 -50 -12 -450 74 136 76 5 152 -203 -46 363 -170 261 54 30 62 300 1 -88 42 -85
2929 -85 -8 -89 157 49 -172 60 -274 -422 -149 -367 -189 -227 23 -72 165 -122 53 -27 -168 3 41 117 58
2952 58 136 428 193 135 148 -84 253 170 261 45 83 183 97 -124 -157 82 -184 -219 -203 -250 -162 -300 97 45 -176
2977 -176 115 216 136 -106 67 12 -122 45 228 257 187 165 -6 181 -213 116 200 230 -50 -13 -38 42 -116
3000 -116 -254 -242 19 -256 0 22 222 14 74 45 -279 -65 -84 411 318 -19 -143 61 96 69 208 330 447
3023 447 111 21 236 -44 -9 -271 63 -38 -49 -145 -146 -67 -159 -93 -90 -137 -80 26 -37 25 -62 248 -22 323 -113
3048 -113 -170 135 224 500 26 -97 104 383 183 119 128 56 132 -224 -171 -207 -96 -105 -55 -301 -196 -207 11 -98
3072 -98 -491 -169 -112 123 -157 73 69 397 178 219 60 167 191 40 321 311 -1 -14 135 320 -157 -55 -56
$$ packed form
2906b29K70L6j27L8m38N24O2o0p1J47l55J57M09n33M31k07k4L2K38k99q9J30j27
2929h5P7q1K46j08k21K32l34j48K73k18J78l8K50r5K37k87J75q0j41J71L8P6n9
2952E8P8K92k35n8J3k32L37q3R1k16L8J00q6k21l3K39k66l5J6m7Q8j38L97n2k21
2977a76K91J01q0k42J73n5j34J67J83K9p0k2j71J87l94L29Q4L0k80L7k5Q0j58
3000a16j38J2K61k75K56K2K00k08O0k9l24K14j9M95r3l37j24K04L5k7J39J22J17
3023D47l36r0K15k80L5k62L34j01j1r6jP9r2O6Lm7N7J06o3O2q7L10k70L45m36
3048a13n7L05Q9K76m74j23K01K79k00o4Rp2P6l56N3l6J11rN0k46J05j1K18j09
3072i8l93L22N7K35k80K30mL28k19M1j59J07K4j51K81j0l12j3J49J85m77J02j
$$ plain form
3095 -56 -322 -123 -226 -43 -163 -125 -398 -33 39 -88 -272 -55 -342 -115 101 -145 -137 -17 265 -80 209 257
3117 257 133 79 144 -36 112 137 209 -8 154 79 14 61 -173 186 -302 61 -212 -163 181 -119 -86 -236 66
3140 66 18 -10 141 30 -5 265 187 -114 -35 -7 -128 -137 161 301 29 173 72 -170 117 -49 38 -51 -146 -47
3164 -47 -208 -17 -10 138 -255 185 74 179 158 224 116 -28 -56 178 276 150 350 207 105 2 255 40
3186 40 376 -124 195 74 -147 450 60 -28 114 166 -95 -33 -14 -63 -66 -85 -325 -173 39 39 23 -40 88 -64
3210 -64 298 177 13 147 181 28 435 359 194 32 131 -32 188 -51 -154 13 -124 -63 -208 -111 -191 -9
3232 -9 -169 -227 41 -191 -48 -69 -134 114 -114 121 -292 -88 -15 107 73 130 -1 31 -84 100 53 38 -70 54
3256 54 -104 -22 -87 -79 -294 -55 -181 -50 -16 -278 -149 -277 -62 -183 -47 -25 76 69 -133 61 -75 58 21
$$ packed form
3095e6k66J99j03J83j20L8k73L65P2j27j84K17k87K27K16k46QJ20K82l45K89M8
3117B57j24n4O5j80J48K5P2k17J62p5o5M7k34L59m88L63k73M9L44l00L3j50L02
3140F6m8k8J51j11l5K70p8l01P9K8j21rK98J40k72J44j01k42K87j66Q7q9r5R9
3164d7j61J91PJ48l93M40j11J05k1O6j08j44k8K34R8j26K00j43j02j03K53k15
3186D0L36n00L19j21k21N97l90q8J42N2k61O2J9m9lj9k40J52K12%j6o3J28j52
3210f4L62j21j64J34L4j53M07p6j65j62R9j63K20k39j03J67j37O1j45R7q0J82
3232ij60n8K68k32J43k1o5K48k28K35m13K04P3J22l4N7j31L2j15J84m7j5j08J24
3256E4j58Q2o5Qk15K39j26J31L4k62J29j28K15j21J36K2J01pk02J94j36J33l7
$$ plain form
3279 21 -43 48 105 24 -2 96 200 76 296 37 -13 -256 -110 -58 -260 16 -264 -114 76 4 7 -237 145 248
3303 248 -17 124 98 -184 147 178 178 101 -140 124 112 485 82 191 185 55 26 -140 177 -100 32 -62 32 -179
3327 -179 -239 -200 -244 80 -305 -318 112 -365 -307 -36 20 66 27 70 95 147 153 40 272 -8 272 295 227 -60 123
3352 123 -62 115 -258 -159 13 -47 -116 -14 96 -220 37 -151 22 40 -187 95 7 -144 -216 -42 147 105
3374 105 193 247 65 -262 161 10 269 -98 -290 45 -153 -83 66 -9 -123 6 -61 -175 -29 -90 -205 50
3396 50 72 -235 -251 -313 -163 53 -48 126 198 165 336 144 25 92 37 103 33 116 245 271 -152 181 -10 -89
3420 -89 -9 90 13 -72 30 69 53 -217 -172 13 -158 -29 -148 -43 258 67 197 -14 -20 46 139 -182 55 112
3444 112 10 158 -52 99 194 -200 68 51 -146 122 -118 -330 188 10 -108 -52 196 -196 -133 -79 -255 111
$$ packed form
3279B1o4R1N7q1k6R8J04j24K20k59n0k43J46N2k02K76k80J50J90p2Lk44L82J03
3303B48k65J41k6k82L31L1%p7k41K64j2L73m03J09oj30k9j66L17k77J32r4R4k11
3327a79o0L9m4L24l85j3M30m77N8K71N6M6l9M3K5N2Oj13K32k80K80K3o8k87J83
3352A23j85J77l73R9J72o0o9J02J10l16K57j88J73J8k27K82q8j51p2J74J89m2
3374A05Q8N4j82l27M23j51K59l67j92L35j98P0J49p5j14J29o7j14J46o1j15K55
3396E0K2l07j6o2J50K16j01J74P2l3J71j92j19O7n5O6p0Q3J29K6m23L33j91p9
3420h9Q0R9p7q5J02L9j6k70M5J85j71J29j19J05L01j91J30k11oO6R3l21K37N7
3444A12j02J48k10J51R5l94K68j7j97K68k40k12N18j78j18N6K48l92O3N4j76L66
$$ plain form
3466 111 -34 -60 0 282 64 149 164 -11 238 13 -179 -16 407 208 29 -24 -61 36 -110 -54 -102 -33 -75 -63
3490 -63 -25 -36 -202 124 62 -112 -90 -48 60 50 148 -28 199 183 56 41 103 273 216 52 160 -200 -50 66
3514 66 41 106 -242 97 -7 -197 39 -29 312 -77 -172 -258 -194 -163 -231 -89 -183 -201 29 61 -176 -14 -162 120
3538 120 250 167 211 22 -73 221 62 50 63 235 27 -115 78 -20 -279 -116 -78 -342 -82 56 -29 -146 78
3561 78 -69 -11 278 14 -181 22 364 -255 -36 -65 -148 9 -25 54 -73 123 -47 55 24 -209 44 -19 351
3584 351 -58 -109 198 -57 102 3 44 147 -73 -156 13 -27 72 91 111 100 77 -50 41 123 349 -215 -80 52
3608 52 161 -40 41 4 -81 1 178 -14 -176 16 73 3 -115 -23 93 -50 -108 297 226 -95 -29 -76 -178 141
3632 141 -50 -195 287 19 -256 191 155 267 74 -117 60 78 83 -273 73 -36 -95 29 -32 98 103 -88 -5
$$ packed form
3466A11j45k6O0K82k18Q5J5j75K49k25j92J63M23j99j79n3l7R7j46N6m8O9m2J2
3490f3L8j1j66L26o2j74K2M2J08j0R8j76K27j6j27j5O2J70n7j64J08l60J50J16
3514F6k5O5l48L39j04j90K36o8L41l89r5q6O4L1o8J42r4j8K30L2k37J62j48K82
3538A20J30q3M4j89r5K94j59j2J3J72k08j42J93r8k59J63L8k64K60J38q5j17K24
3561G8j47N8K89k64j95K03L42o19K19k9q3J57l4P9j27J96j70J02l1k33K53o3L70
3584C51m09n1L07k55J59r9M1J03k20q3J69m0R9J9K0j1k3j27R1Q2K26n64J35J32
3608E2J09k01Q1l7q5Q2J77j92j62J92N7p0j18R2J16j43n8M05p1l21O6m7j02L19
3632A41j91j45M82k68k75M47l6J12j93j91J77J8Nl56L46j09n9J24o1J30Nj91Q3
$$ plain form
3655 -5 -73 9 108 -91 -10 16 152 -92 -40 -33 203 291 14 -67 -11 -275 -205 -27 81 7 -98 -120 -110 143 -230 33
3681 33 -238 56 16 -256 -125 102 -234 68 -65 -57 -42 22 136 -116 169 -25 182 -21 39 -140 83 -136
3703 -136 -3 -140 120 -116 161 57 115 45 -118 -208 209 -35 25 -51 -315 -83 -116 -136 -122 236 -4 36 86
3726 86 282 5 -82 -138 -117 78 100 265 -124 -27 76 -67 189 -320 164 38 -281 -99 -185 -204 28 -91 -71
3749 -71 153 -14 67 -42 85 81 33 71 -25 46 139 -151 71 108 -20 -95 125 -22 73 -33 30 -69 -131 -219 23
3774 23 -74 -54 -264 -219 -183 153 42 -61 -83 -1 -62 -298 17 -55 -29 -168 26 173 -16 229 85 204 179 53
3798 53 262 169 104 -3 -6 -35 -156 -65 203 -118 0 81 76 -100 -7 -56 106 -181 21 -137 -84 -19 -99 87 43
3823 43 142 27 -83 -30 79 2 187 50 -55 -65 -34 217 193 -20 -276 -141 37 117 -180 67 167 -51 -193
$$ packed form
3655eo8Q2R9j99Q1K6J36k44N2PK36Q8k77q1N6k64P0J78J08p4j05k2J0K53l73K63
3681C3k71K94m0k72J31K27l36L02j33QJ5O4J14k52K85j94K07k03O0j79K23k19
3703a36J33j37K60k36K77j04N8p0j63r0M17k44O0p6k64K32l3k0J4L58k40M0N0
3726H6J96k77q7n6K1J95K2J65l89R7J03j43K56n09M84j26l19J82q6j9K32j19K0
3749g1K24j67Q1j09J27mm8L8r6P1R3k90K22L7j28p5K20j47R5j06O3r9o2q8K42
3774B3r7K0k10M5L6L36j11j03k2Q2o1k36L15p2K6j39J94J47j89K45j44J19k5j26
3798E3K09r3o5j07lk9j21R1K68l21J18Q1nj76R3m9J62k87K02j58N3O5q0J86m4
3823D3R9j15j10N3J09p7J85j37j05j0L1K51k4k13k56J35J78Q0k97K47J00k18j42
$$ plain form
3846 -193 -6 -30 200 -36 -56 167 -125 191 38 192 -170 152 36 302 82 199 -50 -56 -54 -75 -168 -109 54
3869 54 -262 272 -174 -28 -138 16 23 -98 -216 58 -247 5 165 -102 46 38 42 56 -34 263 96 -31 -47
3892 -47 150 -126 -123 -259 5 38 -14 26 113 -99 79 -165 -33 -134 -70 -5 -10 -222 11 21 75 -142 -9 -6 -42
3917 -42 -94 43 281 108 92 178 -7 -77 -4 141 -165 87 -43 -231 43 -112 19 155 8 180 -135 -183
3939 -183 -43 38 -97 230 -63 24 87 -239 -117 -106 16 117 72 72 -20 56 -31 104 16 33 -43 -162 52 169
3963 169 -39 -219 43 -293 -57 -61 -85 -40 71 -129 -23 -236 -65 -13 -118 -102 -112 312 136 -10 27 31 62 171
3987 171 37 226 182 -25 63 -21 70 176 177 -50 -15 -43 -283 107 -170 -129 -49 144 -202 -2 56 142 54 -8 131
4012 131 159 132 -38 62 61 98 27 -110 112 87 6 76 39 131 -13 138 -21 29 -56 -65 13 210 -41 -173 -232 -165
$$ packed form
3846a93J87k4K30k36k0K23k92L16j53J54l62L22j16K66k20J17k49oKk1r3N9J63
3869E4l16N34m46J46j10J54Pj21j18K74l05K52J60k67J48qMJ4r0K97j67j27j6
3892d7J97k76Lj36K64L3n2M0Q7k12J78k44J32j01O4O5nk12K33J0N4k17J33Ll6
3917d2n2J37K38j73j6Q6j85p0P3J45l06K52j30j88K74j55J31J36j47J72l15m8
3939a83J40Q1j35L27k93Q7O3l26J22J1J22J01m5%r2P6q7J35q8J7p6j19K14J17
3963A69k08j80K62l36K36mk4M5J11k00J06k13J71N2j05J6j0M24j76j46L7ML1J09
3987A71j34J89m4k07Q8q4R1J06Jk27L5k8k40L90k77M1Q0J93l46K00N8Q6q8o2J39
4012A31K8k7j70J00jL7p1j37K22k5q1P0l7R2j44J51j59N0q5rP8J97k51j32n9O7
$$ plain form
4038 -165 -82 -132 -183 11 -44 -14 -168 -1 -31 45 141 -127 107 -76 146 19 4 -114 202 234 63 103 -114 -71
4062 -71 -93 102 -162 -11 92 -38 -137 -144 37 -237 -160 67 34 43 45 50 248 -78 109 148 89 -82 -58 206 -15
4087 -15 101 76 11 123 58 2 -22 118 -91 18 164 -161 -268 -6 -292 227 52 -102 112 45 -58 -228
4109 -228 30 -63 22 -93 86 102 51 165 -95 -129 124 135 233 53 95 167 16 333 -271 -63 160 -101 -194
4132 -194 0 -66 -167 88 -244 -245 61 0 -20 -208 49 -7 -26 -64 132 -129 -176 76 -191 -85 -48 109 39 33
4156 33 193 117 -252 -130 63 -74 -17 -148 -15 -129 -34 104 51 -11 63 114 -110 -260 -150 262 59 88 46
4179 46 34 -72 -31 -292 -88 -106 312 63 178 119 156 122 54 -222 -264 -280 42 102 49 56 -103 80 -155 -183 -371
4204 -371 -111 -36 -56 -188 -200 10 274 -12 -48 99 -38 67 -19 -40 131 216 -6 195 22 3 81 83 30 -58
$$ packed form
4038a65Q3n0n1J94n5L0j54J67l0P6R6k68K34j83K22j27j5j18L16L2j71M0k17M3
4062g1k2J95k64J51J03j30r9pJ81k74P7K27l3RKNJ98l26J87L9n9j71K4K64k21
4087a5J16k5o5J12o5n6k4J40k09J09J46l25j07K62k86N19j75j54K14o7j03j70
4109b28K58r3Q5j15J79J6n1J14k60l4K53J1R8j80M2P2j51L17o04K08K23k61r3
4132a94J94o6j01K55l32jL06o1k0j88K57n6j9l8J96k61m7K52k67J06L7J57p0o
4156C3J60p6l69J22J93j37N7j31J33j14R5J38n3o2P4N1k24j50J10M12k03K9m2
4179D6j2j06M1k61K04j8M18k49J15n9L7l4o8k76m2j6L22O0n3Pj59J83k35k8j88
4204c71K60P5k0j32j2K10K64k86l6J47j37J05q6k1J71Q5k22K01j73j9P8Kn3q8
$$ plain form
4228 -58 -128 -209 -41 -26 77 64 -179 46 43 -119 119 17 14 -87 -15 67 -12 -129 154 164 41 -35 -5 97 -61
4253 -61 61 164 167 45 -79 -123 101 82 -202 -245 161 30 -35 -49 -335 110 -58 -133 244 -71 -179 -387 141
4276 141 170 -69 56 132 -49 186 361 -50 190 -93 139 49 -105 72 -66 14 99 64 -45 -103 -261 1
4298 1 -139 7 74 -36 -355 -97 -127 198 -122 55 140 212 -266 23 45 -92 23 48 -1 -22 -104 78 52 129
4322 129 62 -43 -128 -71 51 119 -162 -200 -87 -104 -145 -281 35 -21 30 -77 14 -26 -73 221 -33 113 -40 66
4346 66 285 -46 -167 20 -76 29 -110 57 -130 274 208 -115 97 46 -110 102 -133 -87 -21 -57 -58 -1 4 -25
4370 -25 -53 206 -68 507 177 34 -119 316 77 166 86 248 -84 -9 42 -24 -175 -24 149 -2 156 -37
4392 -37 20 101 112 -413 -166 4 -184 -27 111 -48 -161 238 148 48 -112 12 164 172 -122 88 -119 60
$$ packed form
4228e8p0q1J68J5J03j3k43K25lj62K38j02lj01P2Q2p9j17K83J0j23p6L0J02j58
4253f1J22J03Lj22j24m4K24j9k84m3M06j31o5j4k86M45j68p5L77l15j08k08N28
4276A41K9k39J25P6j81K35J75m11K40k83K32r0j54J77j38Q0Q5l5j09n8j58K62
4298Aj40J46O7j10l19K58l0L25l20J77Q5P2m78K89K2j37J15K5m9k1q2J82k6P7
4322A29o7j05q5N7J22O8k81l8J13j7m1j36L16n6N1j07R1m0m7K94k54J46j53J06
4346F6K19l31j21J87r6J05j39J67j87M04o6l23K12n1j56K12k35M6O6l6jN7Nk9
4370b5k8K59k74N75l30j43j53M35k39Q9q0J62l32P5N1o6j51J51J73j51J58j93
4392c7N7Q1J1n25K47J70j88J57J38j59j13L99r0j00j60J24J52Qk94K10k07J79
$$ plain form
4414 60 -62 -49 52 -6 141 83 -327 -69 -175 -73 135 127 45 83 119 -132 36 -244 -25 -58 -121 194 37 -83
4438 -83 3 -126 97 59 -27 169 89 44 -7 22 198 100 90 -56 162 75 -325 104 -194 -76 -261 -63 -51 169
4462 169 -225 23 -144 -199 70 -132 -18 42 -1 -173 138 -101 161 45 -96 173 48 1 -64 -6 1 -100 183
4485 183 -7 177 251 307 -159 116 -84 -232 115 -118 47 89 132 82 7 197 -84 8 -60 -37 -64 292 35
4508 35 118 -137 123 237 -100 38 217 33 -124 169 98 113 -104 -71 96 -28 -66 53 24 -197 130 0
4530 0 -98 -83 -180 -112 -12 59 20 122 -35 206 69 64 228 -101 170 266 46 -208 -43 266 -27 -155 122 -126
4554 -126 130 -101 77 -162 141 27 -162 -32 -175 -107 -43 -60 -183 60 263 279 107 -145 -132 -161 -8 115
4576 115 86 154 -8 166 89 -74 65 -19 37 -76 24 66 -66 -177 31 -150 -82 0 84 -167 -147 140 79 -84
$$ packed form
4414F0j22J3J01n8J47n8m10K58j06J02K08qq2L8L6k51J68k80K19l3o3L15j57j20
4438h3Q6j29K23l8q6J96q0m5n1K9J76r8j0j46K18q7m00M29k98J18j85J98J2K20
4462A69l94K48j67n5K69k02J14O0m3j72L11k39K62j16j41K69j25m7o5N8Pj01K83
4485A83j90J84P4N6m66K75k00j48L47k33J65M2M3n0p5J90k81R2o8K3k7L56k57
4508C5Q3k55K60J14l37J38J79j84j57K93p1J5k17L3J67j24l8J19k9k21L27j30
4530@r8J5r7O8J00P1l9J02j57K41j37nJ64l29K71R6k20k54J65L09k93j28K77k48
4554a26K56k31J78k39L03j14j89J30j43O8O4j7j23K43K03J6j72k52J3k9J53J23
4576A15k9O8j62J74p7j63J39q4N6j13J00M2j32j11K08j81O8Q2Q4k51K0K87o1j63
$$ plain form
4600 -84 -112 -94 435 52 128 191 3 208 87 204 -34 66 -56 75 26 -144 -203 194 60 55 -26 -40 135 258
4624 258 -233 -74 262 35 -59 -70 82 -66 -95 -190 82 22 147 -160 -138 166 61 216 3 -122 174 114
4646 114 115 185 180 -49 -110 -10 123 -27 -134 134 -68 -86 -262 -156 121 -29 -58 57 -55 -175 137 57 166
4669 166 33 -53 71 158 -152 -152 -101 -65 -151 79 112 6 6 14 -81 -62 -44 -245 -10 148 347 -63 -192 -255 -133
4694 -133 81 12 99 174 75 -98 -173 51 228 -78 -57 -70 -76 104 -28 -132 187 -109 75 -18 -51 50 -189 286
4718 286 -135 53 42 -155 18 -87 -30 -77 44 -243 -32 97 40 -223 211 -31 -53 149 -85 42 99 154
4740 154 189 83 -172 29 16 52 -227 -56 -55 221 25 36 61 36 83 190 -118 -44 58 9 279 94 78 -136
4764 -136 261 -28 -228 182 -202 159 -271 -31 -272 89 -67 -7 -27 43 31 -87 33 -250 -98 42 -237
$$ packed form
4600h4k8J8N29l83P6O3j88K05j21J17k38J00j22J31m9j70n9L97j34nq1j4J75J23
4624B58m91J59L36k27r4j1J52j48k9r5K72o0J25l07K2L04j05J55k13j25K96o0
4646A14JP0nk29o1J00J33j50j07K68k02j8j76J06K77j50k9J15j12j20L12q0J09
4669A66j33q6J24Q7l10%N1L6q6K30L3j06%Qr5J9J8k01K35J58J99m10j29o3J22
4694a33K14o9Q7P5r9j73p5K24J77l06K1j3oJ80j32j04L19k96J84r3l3J01k39M75
4718B86m21J88j1j97J73j05N7m7J21k87K11J29n7k63M34k42k2K02k34J27N7N5
4740A54L5j06k55K01j3L6k79J71JK76j96J1K5k5M7J07l08P4J02m9K70j85j6k14
4764a36L97k89k00M10l84L61m30K40k41L61j56O0k0P0j2j18J20k83J52J40k79
$$ plain form
4785 -237 99 -234 66 40 -69 263 -3 13 -233 145 -116 186 -98 185 88 -3 202 -12 192 15 245
4806 245 0 -47 -76 106 42 35 32 127 -88 -1 -136 -4 230 64 -121 -157 98 -110 -162 36 -207 40 -148 -240
4830 -240 121 22 12 61 -298 347 -88 123 -169 -2 -65 -83 140 -78 -45 -166 -61 -21 31 29 -90 9 63 10
4854 10 -5 26 117 -186 -106 294 -28 -151 -16 -1 -170 -19 137 84 256 289 -75 -93 -52 180 8 38 -21 -212
4878 -212 -53 67 61 -209 40 68 -144 151 -56 8 -78 -17 196 29 -49 39 -14 -171 136 -5 23 -162 44
4901 44 76 -165 39 -75 -164 -83 -63 106 -153 25 -250 -18 67 79 -163 -85 172 57 41 -52 -265 97 -56
4924 -56 190 -39 9 -144 -119 106 -205 238 10 173 151 -14 -255 23 -7 -61 -268 85 -72 24 46 -261 3
4947 3 62 -80 -14 293 27 24 -16 151 57 61 147 -142 60 17 -71 166 -46 63 -107 240 -146 -75 172 53 128
$$ packed form
4785b37L36l33L00k6j09L32k66J6k46L78k61L02k84K83r7r1K05k14K04j77K30
4806B45k45m7k9J82o4plR5k15Q7j35J32K34j66j85l6K55k08n2J98k43K47j88r2
4830b40L61r9j0M9l59O45m35K11k92J67o3j8K23k18L3j21J05M0N2kj19R9N4n3
4854A0j5L1R1l03Q0M00l22j23J35J5j69J51J56n3J72L3l64j8M1K32j72L0n9j91
4878b12J59J20ok70K49K8k12K95k07O4q6O1K13j67p8Q8n3j57L07j41K8j85K06
4901D4L2k41K04j14q9Q1K0J69k59J78k75K32Q5J2k42P8K57j15j6r3k13L62j53
4924e6K46k29M8j53K5K25l11M43k28J63k2j65k41K78l0n4k07L53j57R6K2l07K64
4947CN9j42O6L07k66lm0J67r4MQ6k89K02m3q8K37k12J09j70L47l86P1K47j19P5
$$ plain form
4972 128 -216 -136 110 265 -34 304 -266 33 55 -10 71 50 149 -107 -100 -100 182 4 178 -47 4 161 282 44
4996 44 -236 -101 -9 41 18 20 -176 41 110 66 -63 -112 41 49 -107 -20 51 -11 140 -55 -196 82 -197 77 -123
5021 -123 -119 -70 -163 167 229 -68 -8 182 271 128 6 6 266 37 144 -42 -119 119 47 -50 207 27 -6 -80 70
5046 70 3 -525 31 -32 20 3 68 -31 111 103 24 -192 209 -23 -88 -8 5 105 177 -151 -98 -236 -180 80 75 211
5072 211 57 21 -101 182 47 -122 92 -12 194 123 83 95 -42 -2 -181 49 150 111 -57 -94 185 214 -195
5095 -195 109 151 -1 -56 -156 -157 -48 -53 116 -86 -58 -177 39 76 2 78 161 -145 -109 -34 109 -131 -101 101 -64
5120 -64 149 134 208 44 50 97 -110 -259 102 -94 -202 -63 48 50 -83 15 351 -195 115 -110 -50 247 -80
5143 -80 -41 26 -26 176 322 -24 60 223 106 -227 182 37 37 38 -114 286 130 -34 196 -75 60 -83 139
$$ packed form
4972A28l44Q0K46J55k99L38n70K99K2o5Q1k1R9k56P%K82j78J74k25N1J57J21k38
4996D4k80J35R2N0k3Kj96K17O9m4j29m9J53Qj56Q7P1o2J51j95j41K78k79K74k00
5021a23MM9r3L30O2k97O0J90Q9j43j22%K60k29J07j86p7K38p2r7K57j80l3p4J50
5046G0o7n28N56o3N2j7O5r9J42qp9k16M01k32o5Q0J3J00P2l28N3j38N6K60nJ36
5072B11j54l6j22K83j35j69K14j04K06p1m0J2j37M0j79K30J01l9j68l7K79K9m09
5095a95L04M2j52n5j00jJ09nJ69k02K8j19K16L7p4P6Q3l06L6P5J43k40L0K02j65
5120f4K13j5P4j64OM7k07j49L61j96j08J39J11Kj33R8L36n46L10k25O0K97l27
5143h0L9O7n2K02J46l46Q4J63j17l33M09j45%Jj52M00j56j64K30k71J35j43K22
$$ plain form
5166 139 83 -190 -162 -77 50 128 192 -96 62 -131 9 -74 -61 89 -97 323 13 -81 182 18 -183 -10 146
5189 146 171 74 80 207 161 -27 -76 139 26 -76 64 -75 -48 170 -99 103 -135 182 134 57 57 42 179 -39
5213 -39 69 -20 -91 -66 415 -73 100 -5 -19 -100 352 40 34 102 -107 135 -123 -79 -296 -30 -146 -241 -4 -31
5237 -31 42 -186 -177 -269 -78 61 135 -113 -39 50 83 -42 134 86 145 3 202 38 79 249 -67 -12 -172 70
5261 70 -72 112 -31 -75 -108 -90 -61 21 47 -52 89 103 69 -109 256 -90 -59 142 -95 130 -59 -20 18 153
5285 153 132 117 89 -8 218 95 -40 -129 180 -89 -13 70 -267 -1 -64 -179 217 -37 118 -200 117 9 11
5308 11 -58 57 73 -78 339 144 108 139 5 4 -233 -189 -68 75 148 24 254 -74 62 72 -94 -256 34
5331 34 -6 -12 144 -161 69 -60 27 -55 89 -47 113 116 93 191 -141 -162 173 134 -17 54 281 56 70 -150 126
$$ packed form
5166A39n6k73K8Q5J27P8O4k88J58j93J40q3J3J50j86M20l10r4K63j64k01J73J56
5189A46K5r7OJ27m6j88m9K15j13j02J40j39K7K18k69K02k38L17m8p7%j5J37k18
5213c9J08q9p1K5M81m88J73j05j4q1M52l12oO8k09K42k58M4k17K66j16r5K37k7
5237c1P3k28Rr2J91J39P4k48P4Q9L3j25J76m8N9j42J99j64M1J70l16N5j60K42
5261G0j42J84j43m4l3J8K9Q2K6r9J41J4l4j78L65l46L1K01k37K25j89L9L8J35
5285A53k1j5k8r7K26j23j35q9L09k69P6Q3l37K66o3j15L96k54J55l18L17j08K
5308A1o9J15J6j51M17j95l6L1j34jk37M4J21J43P3j24K30l28J36J0j66j62K90
5331C4m0oJ56l05K30j29Q7q2J44j36J60Lk3R8l32k1L35l9j51P1K27k25J4k20K76
$$ plain form
5356 126 122 -64 -289 65 7 -259 6 -141 -46 37 93 51 107 -129 -112 -76 -281 -286 -65 -18 -282 6 -108 291
5380 291 53 47 29 -228 -45 149 -82 -200 -51 -220 82 132 -246 4 46 -160 -72 151 -98 -239 165 87
5402 87 112 -74 -80 -176 90 159 -84 -55 49 45 -98 156 -62 -112 -190 1 -158 114 -209 56 -13 46 5 -2 23 -42
5428 -42 -381 -254 -98 -79 -96 263 3 24 3 76 -187 -10 -90 124 135 -307 53 28 -14 -70 -41 39 -180 -32
5452 -32 34 -111 242 -148 -98 15 28 68 201 89 -75 -18 -9 -65 148 -98 -187 129 -13 -118 -210 50 188 37
5476 37 -293 -170 -134 250 -12 -253 -344 25 -238 79 215 -267 81 -166 -153 -130 -241 96 -44 -206 -118 -139
5498 -139 -79 -15 49 -206 68 3 -74 -250 -115 -108 20 -79 75 -15 305 276 213 87 -53 30 11 142 88 -79 15
5523 15 -126 154 -20 219 45 -143 -257 290 -90 19 4 -84 21 -222 -179 100 -122 -70 0 292 232 86
$$ packed form
5356A26mj86k25L54n8k66K65j47R5Q3N6m2N6k36J7L6k05nK21M7k64K88j14L99
5380B91k38oj8k57J83J94k31j18J49j69L02N0l78K50M2k06Q8K23k49j41M04p8
5402H7K5j86or6K66O9k43K9J04mj43K54k18n0p8J91j59K72l23K65o9N9m1pK5o5
5428d2l39J27J56J9j7L59k60K1k1P3k63J77q0K14J1m42L60k5m2n6K9Q0k19J48
5452c2O6j45L53l90N0J13J3M0J33j12j64N7Rn6K13k46q9L16j42j05r2K60J38j51
5476C7l30J23L6L84k62k41r1L69k63L17J36m82L48k47J3K3j11L37j40j62Q8k1
5498a39O0O4O4k55K74o5p7j76J35PJ28r9J54r0L20k9o3j26j40Q3j9J31n4j67R4
5523A5j41K80j74K39j74j88j14N47l80J09j5q8J05k43M3K79k22N2P0K92o0j46
$$ plain form
5545 86 162 -212 -125 -70 -110 36 443 -167 -99 -253 188 -40 50 -216 -117 -91 -117 -126 -26 -34 165 -13 -69 26 19 -170
5571 -170 125 172 37 66 63 -404 -112 -216 -20 167 97 77 41 -323 -28 -21 108 15 95 -31 214 129 143 119 -78
5596 -78 112 12 237 -56 87 -104 167 43 -91 -64 73 -71 26 -46 61 -34 131 149 11 200 7 112
5618 112 131 117 -2 84 -72 -291 213 -124 173 8 -1 -73 111 -162 -114 58 12 137 -10 150 73 142 185 82
5642 82 146 32 -20 127 -268 -175 -84 -47 102 30 -294 -125 -115 -120 91 130 -109 -205 -6 61 -281 -151 -47 -119 -151
5667 -151 -44 -49 97 59 52 -40 -63 75 199 291 29 -81 80 274 21 -191 -135 132 -74 141 -95 6 -65
5690 -65 22 -147 -78 61 79 35 -5 -171 137 27 -23 14 -17 134 -64 -34 70 -78 -55 23 60 76 10 25 -101
5715 -101 25 32 2 15 -171 -156 257 -94 -161 -93 48 166 101 21 147 -150 206 3 -143 -27 3 -90 75 -386
$$ packed form
5545H6P6l74Q7N5m0J46M07o10O8j54M41k28R0k66R9K6k6rJ00qJ99j78n6R5pj89
5571a70K95M7j35K9lm67K92j04J96J87p0k0l6l64K95PJ29r3Q0j26K45q5J4k4j97
5596g8J90j00K25k93J43j91K71j24j34K7J37j44R7p2J07r5J65J8j38J89j93J05
5618A12J9j4j19Q6j56k19N04l37K97j65rp2J84k73M8J72m6J25j47J60p7O9M3j03
5642H2O4j14n2J47l95R3R1L7J49p2l24J69J0nK11L9k39r6J99O7l42J30J04p2l2
5667a51J07nJ46l8pr2k3J38J24R2k62j10J61J94k53k12N6K67k06K15k36J01p1
5690f5Q7j69O9J39J8m4m0j66L08j10n0L7l1J51j98L0J04j48K3P8L7J6o6J5j26
5715a01J26Pl0J3j86J5M13l51o7O8J41J18o5q0J26k97L56k03j46J16L0r3J65m61
$$ plain form
5739 -386 -101 96 -27 -271 25 -89 -17 112 -70 -28 -61 133 -55 82 -100 215 10 47 -56 -181 -6
5760 -6 -68 121 177 278 -8 -25 -9 -139 45 126 73 -1 -84 79 54 -247 148 178 -50 150 -83 -50 -17 -84 11
5785 11 50 54 -87 -62 -341 -107 219 215 -39 -91 -131 94 100 -95 -80 173 -238 59 -160 329 -49 -52 91 130 156
5810 156 -60 -143 129 91 60 134 -27 27 -226 48 62 34 28 -122 70 -95 -198 167 -234 79 80 56 29 -8 91
5835 91 -244 106 -87 -91 -98 -37 -29 -223 23 207 88 70 -77 29 123 243 -109 131 -143 138 39 -286 -94 -290
5859 -290 -164 -209 111 -59 25 35 194 101 34 15 153 162 -93 155 -75 161 130 -66 85 113 24 -75 184 -28
5883 -28 44 7 35 -158 -227 50 -151 -28 -41 -230 -206 76 131 -122 199 125 -5 -346 -286 3 108 -111 -3
5906 -3 -146 81 63 -149 -59 -78 -35 31 -1 92 -171 -43 -136 -35 -46 -105 -69 -266 183 118 159 124 -30 54 -16 41
$$ packed form
5739c86K85J97j23k44K96j14P2J29j82M2l3J94j88J37j82L15k05L7j03j25J75
5760fo2J89N6J01k86j7J6j30J84Q1n3p4q3J63k5l01L95L0k28K00k33L3L3o7R5
5785A1L9Mj41K5k79K34L26mk54n2m0K25Oj95J5K53m11K97k19M89l78lJ43L9K6
5810A56k16q3K72l8l1P4j61N4k53K74J4k8oj50J92j65j03L65m01L13Jk4k7l7R9
5835I1l35L50j93mpO1Qj94K46J84j19j8j47J06R4J20l52K40k74K81r9l25J92j96
5859b90J26m5L20j70Q4J0J59r3o7j9J38Rk55K48k30K36l1j96J51K8q9r9K59k12
5883b8P2l7K8j93o9K77k01J23j3j89K4K82N5k53L21p4j30l41O0K89J05k19J08
5906cj43K27j8k12R0j9M3O6l2R3k63J28r3J01j1n9L6j97M49o5M1l5j54Q4p0N7
$$ plain form
5932 41 -80 21 140 -18 109 -95 -116 -227 100 112 326 195 29 -106 46 127 -58 -45 -80 -29 -84 -36 111
5955 111 7 -73 -105 -154 -249 -36 -61 -145 10 2 -89 -352 -34 107 -43 81 366 -144 59 79 103 -104 238 -106
5979 -106 68 -362 -91 -5 -80 217 30 -47 -70 -116 64 10 -91 132 -118 103 -65 116 -90 22 165 184
6001 184 -119 -103 130 199 196 -28 -206 -102 -48 27 133 148 156 133 -87 243 110 20 68 -165 -29 -132 58 -50
6025 -50 284 40 68 116 124 -31 57 1 -102 47 -14 100 -196 165 -126 45 -243 -146 -6 -179 6 -108 148
6048 148 30 135 132 93 -74 -108 25 83 -44 33 35 -1 184 -46 14 -80 -116 131 94 -54 -19 132 -53 -162 -139
6073 -139 -45 67 80 64 -245 -130 70 -176 30 65 -188 89 6 0 -212 14 -6 262 66 -66 46 -87 201
6096 201 79 -64 -99 -121 123 43 -49 5 104 51 -28 72 132 -46 -15 7 -16 165 -60 118 4 159 -261 101
$$ packed form
5932D1j21J01J19j58J27k04k1j11L27J2K14j31j66j35J52Q1j85J3l5N1n5M8J47
5955A11j04q0l2m9r5K13k5q4J55qr1k63L18J41j50J24K85n10K03K0K4k07L42l44
5979a06J74m30K71Q6p5K97j87p7k3m6J80n4j01K23k50K21j68J81k06J12J43J9
6001A84l03J6K33O9lk24j78J04N4P5J06J5Qk3k20L30j33r0M8k33J36j03J90j08
6025e0L34k44K8M8Qj55Q8n6j03J49o1J14k96L61k91J71k88R7J40j73J85j14K56
6048A48j18J05ll9j67l4J33N8j27P7Kl6J85k30O0r4l6K47l7j48L5J51j85j09K3
6073a39R4J12J3j6l09J15K00k46K06L5k53K77q3ok12K26k0K68j96j32J12j33K88
6096B01j22j43l5k2K44q0r2N4R9n3p9J00O0j78L1K2k3J81k25J78j14J55m20L62
$$ plain form
6120 101 105 -98 23 -122 -11 -48 6 6 86 98 31 -21 44 -50 123 -121 -71 26 173 -11 76 4 -80 -108 -105 -45 59
6147 59 1 -136 123 98 -198 36 44 -190 133 38 168 127 228 254 -27 -114 22 41 124 -103 197 -123 72 -389
6171 -389 -89 192 -156 3 -277 -60 -68 15 114 73 -5 126 -36 46 33 90 -179 73 -2 3 78 -88 190 142 -11
6196 -11 -188 -30 -74 349 103 91 -90 -190 254 29 208 -266 -10 58 -142 19 -113 11 169 101 246 1
6218 1 -255 255 169 50 176 -16 125 138 -76 32 -24 -47 14 -102 162 37 27 -146 113 -143 101 181 -85
6241 -85 -131 -93 93 187 -10 134 -50 54 -29 131 -100 -13 195 18 -161 83 49 -198 119 134 -153 -62 -29
6264 -29 145 -196 145 -79 117 -6 -101 329 56 -67 -131 -6 87 40 201 -60 142 -78 -1 243 10 45
6286 45 -159 -313 -205 -67 88 -57 -80 -80 -2 -173 -36 -88 -21 13 11 176 54 -12 -249 16 66 138 -167 187
$$ packed form
6120A01Mk03J21j45J11l7N4%Q0J2o7n2O5r4J73k44N0R7J47j84Q7p2q4k8LO0J04
6147E9n8j37K59k5k96K34Qk34L23r5J30m1J01K6k81q7J36J9Q3k27L00l20J95m61
6171c89L00K81l48J59k80K17qQ3R9m1p8J31j62Q2j3N7k69K52p5NP5j66K78m8j53
6196a1j77J58m4M23k46j2j81j00M44k25J79m74K56O8k00J61j32J24J58o8J45k45
6218Ak56N10q6j19J26j92J41J3k14J08n6k3O1j16K64j25j0j73K59k56K44Q0k66
6241h5m6L8J86R4j97J44j84J04q3J60k31Q7K08j77j79K44l4k47L17J5k87R1L3
6264b9J74l41L41k24J96j23r5M30k73j23o4J25R3m7J61k61K02k20P7K44k33L5
6286D5k04j54J08J38J55j45k3%P8j71J37n2O7L4kJ65j22o6k37K65N0P2l05L54
$$ plain form
6310 187 91 -263 298 350 -187 7 67 2 92 0 -51 13 71 295 203 -105 67 76 -82 -121 -108 -8 105 -118 -82
6335 -82 207 198 -1 -9 120 291 187 266 -100 225 24 21 87 -131 -173 72 -27 108 -83 76 -73 32 234 -191
6359 -191 -56 30 -74 167 5 27 199 -27 43 -85 64 -157 2 -123 -70 -77 -52 109 -144 -59 -42 134 91
6382 91 -8 -135 222 -66 31 -102 59 -1 35 -4 47 -184 -77 1 211 58 133 152 -7 324 56 31 209 -99
6406 -99 324 118 -3 -135 31 -98 -28 -168 168 87 109 -69 -119 269 -69 -3 -230 -92 -47 160 0 11 -44
6429 -44 -19 -315 120 -89 78 351 -8 45 224 -70 73 137 -152 -198 34 -132 107 -44 116 9 -246 -33
6451 -33 69 217 58 -173 17 -27 256 -19 -62 -273 -79 -170 74 -146 -156 -164 -315 -59 -229 131 -73 -78 3
6474 3 45 5 -52 96 91 -109 -23 -314 159 9 85 -29 -130 -190 32 -222 34 -50 -115 -161 -192 -107 -115 17 -60 -15
$$ packed form
6310A87r6l54N61N2n37J94O0o5R0r2n1O4N8K24r2l08J72Rj58l9J3J00J13k23L6
6335h2K89rj99qJ29J71j04P9l66L25k01lO6k18m2K45r9J35j91J59j49J05K02m25
6359a91J35Q6j04K41j62K2J72k26P0j28J49k21J59j25N3pK5J61k53Q5J7J76m3
6382I1r9j27L57k88R7j33J61o0L6l9N1k31J07P8K10j53P5J9j59L31k68k5J78l08
6406i9M23k06j21j32J66j29P0j40L36q1K2j78n0L88l38O6k27J38M5K07j60J1n5
6429d4K5k96M35k09J67K73l59N3J79k94J43O4k89m6K32j66K39j51J60j07k55K13
6451c3J02J48j59k31J90m4K83k75m3k11J94r1K44k20j0qj51K56j70L60k04nQ1
6474CM2m0n7J48nk00Q6k91M73j50P6j14j01o0K22k54K56q4o5m6l1Q5qJ32p7M5
$$ plain form
6500 -15 6 19 69 -145 -61 19 -231 56 -71 -1 42 186 126 140 192 155 -8 36 67 253 -105 -272 16 108 -21
6525 -21 27 229 5 108 -262 -103 40 75 -47 -46 -57 -2 -81 133 -127 136 66 64 213 -62 -54 106 -1 219
6549 219 -191 -101 -201 8 -20 126 -70 30 52 -267 37 2 -36 -225 -68 -210 -229 -180 107 201 29 199 155
6572 155 299 -81 55 31 -74 -182 -186 -112 140 -131 26 -40 -90 9 -168 142 -162 -66 27 368 179 -176 46
6595 46 -21 69 -16 -42 -90 -13 -14 -95 73 -172 -183 -10 96 -162 201 -40 -53 -44 -109 298 246 -234 190 35 125 -64
6621 -64 -199 7 150 94 58 59 -60 221 -213 -1 -169 246 111 -155 -25 -115 93 -76 -142 26 14 229 0
6644 0 156 59 86 208 -198 -160 183 -106 -125 150 -255 126 -138 98 -176 -31 56 -196 17 111 -27 -95 -10
6667 -10 -285 7 -81 92 -40 5 -112 -66 -70 -92 -69 145 -75 180 135 -252 -161 -58 181 -198 98 -227 159
$$ packed form
6500a5K1J3N0k14Q4Q0k50K87j27P0M3J44o0J4N2l7j63M4L1J86l58j67K88R2j29
6525b1M8K02k24J03l70J59J43L5j22Jj1N5p9K14k60K63p0kJ49k75QJ60j07K20
6549B19m10R0j00K09k8J46j96J00K2l19L04l5l8j89J57j42j9M9K87R4j72J70m4
6572A55J44l80J36k4j05j08mP4K52k71J57o6n0R9j77L10l04R6R3L41j89l55K22
6595D6o7R0q5k6m8P7jq1J68k45j1J73J06k58L63k41j3Ro5M07n2m80M24j55R0j89
6621f4j35K06J43n6l6Jj19K81m34K12j68M15j35k66J30r0K08j69o6J68j2K15k29
6644@J56r7K7J22m06L8L43k89j9K75m05L81k64K36k74J45Q7k52K13R4j38o8Q5
6667a0k75K92q8J73j32M5j17M6mk2K3K14k20K55m5l87R1J03K39l79K96l25L86
$$ plain form
6690 159 70 29 -16 -71 -238 76 116 140 93 -7 232 -30 100 -207 -140 126 65 75 -44 24 -24 -99 -124 45 -65
6715 -65 74 48 -432 -21 -117 -182 -57 -17 -82 -121 179 52 4 -69 205 -94 -198 91 -96 -62 13 128 -164 -92
6739 -92 13 -61 -51 -199 85 31 145 -26 -8 -219 46 29 128 10 208 -99 -127 -51 85 -19 89 98 272 -135
6763 -135 30 -181 -51 25 41 521 -90 -285 -79 -11 -156 23 -11 -146 265 -135 59 -102 53 159 -150
6784 -150 -89 -67 155 -121 -188 -154 40 -15 33 -96 -12 127 15 -133 5 -170 154 15 -62 309 -68 -16 -170
6807 -170 -237 -146 24 -84 -184 50 314 -158 -12 -96 -192 -123 -7 136 -14 114 42 74 125 18 -115 -67 138
6830 138 31 15 71 74 126 172 142 -103 189 312 176 -83 131 -215 -280 -41 207 52 348 -108 -1 14 102
6853 102 4 -25 -233 -149 28 -34 29 23 -56 -141 -6 8 -228 -64 -8 -60 128 94 130 -39 -39 55 95 261 86 25
$$ packed form
6690A59q9m1m5n5j67L14M0K4m7j00K39k62J30l07O7K66o1J0j19O8m8p5k5J69j10
6715f5J39k6m80M11r6o5J25M0o5l9L00j27m8p3K74k99j04K89j87L4P5J15k92P2
6739i2J05p4J0j48K84n4J14j71J8k11K65j7R9j18J98l07k8P6J36j04J08RJ74m07
6763a35J65k11J30P6J6M80o11j95K06O8j45J79l4j35M11m00J94j61J55J06l09
6784a50O1K2K22k76o7L4J94n5M8j29Q4J39j12j48J38j75L24j39p7L71l77N2j54
6807a70o7R1J70j08j00K34K64m72J46q4r6O9J16J43j50J28p2L2N1j07j33M8K05
6830A38j07j6N6LN2M6l0k45K92J23j36k59K14l46o5K39K48j55K96m56J07J5Q8
6853A02r8k9k08Q4J77o2O3op9q5J35J4k36J64N6n2J88l4L6j69%R4M0J66j75o1
$$ plain form
6879 25 -64 199 40 81 48 -17 90 32 126 -93 12 -113 249 -195 -244 46 199 -361 -106 120 162 40 -133
6902 -133 111 49 165 190 32 -104 43 2 -60 135 108 -54 -155 42 31 170 -31 -194 -77 -49 -42 -166 63
6925 63 127 74 -94 62 -91 -36 -77 -51 -98 95 14 69 92 -146 125 18 115 -56 143 -122 31 -236 220 -124
6949 -124 252 243 -73 40 -116 4 10 35 127 175 -102 5 -178 -77 71 -96 179 137 -195 -68 -60 31 -24 109
6973 109 -16 -53 -14 194 -33 -80 -96 158 114 31 233 63 77 -83 -21 -83 157 -17 63 -66 53 -55 27 268
6997 268 50 136 -114 -36 -173 -87 124 -136 -90 -267 6 34 61 219 -229 -326 311 137 88 -106 -19 -32 115
7020 115 35 -75 -17 -73 -70 -112 121 -39 116 -128 52 61 -69 -21 39 -34 -5 -16 112 -217 -29 22 116 99 -232
7045 -232 -182 11 37 -10 283 -283 -1 -105 10 80 55 -73 -75 -70 173 257 -24 -83 -4 -183 -330 -61 61 71
$$ packed form
6879B5q9K63j59M1l3o5J07n8R4k19J05j25L62m44m9K90J53n60K55K26M2j22j73
6902a33K44o2J16K5j58j36J47m1o2J95k7j62j01J97j1J39k01j63J17K8Pj24K29
6925F3O4n3j68J56j53N5m1K6m7J93q1N5K3k38K71j07R7j71J99k65J53k67M56l44
6949a24L76rl16J13j56J20OK5R2M8k77J07j83J01J48j67K75m2l32J27QR1n5J33
6973A09j25l7L9K08k27m7j6K54m4q3K02j70J4j60O2o2K40j74Q0j29J19j08Q2K41
6997B68k18Q6k50P8j37Q6K11k60M6j77K73K8K7J58m48r7O37j74m9j94Q7j3J47
7020A15q0j10N8n6Lm2K33j60J55k44J80Rj30M8O0p3K9j1J28l29J88N1R4j7l31
7045b32N0J93K6m7K93n66K82j04J15P0k5j28kNK43Q4k81n9P9j79j47K69J22J0
$$ plain form
7069 71 -145 38 -16 -23 -65 -3 -21 172 38 39 42 -4 189 -88 25 311 21 -113 -137 -95 -70 -186 110 -58 -147
7094 -147 5 -15 -152 143 -53 -131 91 -107 -308 66 -59 130 168 8 -125 -92 89 89 -23 -55 -94 42 166
7117 166 -38 59 108 -200 48 -26 235 343 137 279 14 77 -392 63 -40 -103 210 -48 -118 -38 95 -59
7139 -59 -49 5 126 299 26 224 51 74 46 148 151 -113 81 -126 99 156 1 101 146 -57 57 8 30 256
7163 256 -97 108 -10 82 102 -262 -160 -46 97 -98 109 -323 -155 -120 -69 -68 -36 -170 79 -55 77 206
7185 206 -11 -110 32 296 129 114 68 -31 154 307 58 296 61 241 109 -132 77 -194 280 152 -195
7206 -195 95 348 141 -123 270 -137 -21 -90 -69 118 -388 -369 189 -141 -87 -191 -143 20 -43 -47 -175 12 53
7229 53 8 163 16 5 74 82 46 76 272 -7 -36 129 -112 -14 260 199 69 60 -23 63 232 -7 69 -116 -37 -32
$$ packed form
7069G1k16J83n4pm2O2j8J93j34JLm6J93k77J13K86k90j34k4M2K5j16K96j68q9
7094a47J52k0j37K95j96p8K22j98k01L74j25J89L8j60j33L3J81%j12l2l9J36J24
7117A66k04R7M9l08K48p4K61J08k06J42k65O3m69M55j03o3L13k58p0Q0J33j54
7139e9J0N4J21J73k73J98j73K3k8J02Lk64J94k07K25N7j55J00M5k03J14m9K2K26
7163B56l53K05j18R2K0l64J02J14J43j95K07m32J68L5N1JL2j34K49j34J32J29
7185B06k17r9J42K64j67j5m6r9J85J53k49K38k35J80j32k41K09k71M74j28l47
7206a95K90K53k07k64L93m07J16o9K1J87n06J9N58l30N4j04M8J63o3mj28J87M1
7229E3m5J55j47j1O9Ql6L0J96k79k9J65k41R8K74o1j30rq3Q6J69k39P6j85P9N
$$ plain form
7255 -32 17 81 -129 336 90 153 -25 -294 215 213 -139 -17 -249 -8 169 -83 -32 -27 165 -70 15 -188 -176 106
7279 106 -23 225 -33 -95 -61 -50 -148 335 -145 113 58 86 -92 16 29 -19 259 -222 -109 -83 -79 135 139 22
7303 22 42 16 49 176 148 94 193 -8 -51 -205 -220 -246 159 22 -63 206 -171 -115 92 250 -59 157 -45 -71
7327 -71 -102 62 -147 -85 56 100 -258 -219 -335 36 -89 -92 93 7 -260 -46 84 -128 152 12 -69 -308 -38
7350 -38 52 33 35 38 211 212 -73 74 -80 -9 61 -98 -151 20 -197 -89 37 -88 -257 81 -41 -213 -87 -4
7374 -4 -150 -138 -353 -61 -56 -183 171 4 -39 -80 -20 -112 -38 36 -65 329 -255 -203 -102 -25 -127 -99 163 -75 -186
7399 -186 115 -349 -38 154 -66 -172 -28 74 20 -214 248 348 -216 -158 -115 141 -116 -81 -221 199 76
7420 76 152 176 -89 37 236 -12 113 -14 102 6 54 178 326 55 44 113 -113 51 -100 121 -9 156
$$ packed form
7255c2M9O4k10M65k46O3j78k69N09kl52J22k32K41J77k52N1NJ92k35Q5k03J2K82
7279A06j29K48k58o2L4J1r8M83m80K58n5K8j78J08J3m8K78m81J13K6MK14Mj17
7303B2K0k6L3J27k8n4R9k01m3j54j5k6M05j37q5K69l77N6K07J58l09K16k02k6
7327g1l1J64k09O2J41M4l58L9j16L71j25lJ85q6k67K14J30k12K80j40q1k39K70
7350c8R0j9KLJ73Jk85J47j54P1P0j59n3J71k17J08J26j25j69L38j22j72J26Q3
7374dj46J2k15K92Nj27L54j67m3m1O0r2P4P4j01L94n84N2J01P7j02K8K62k38j11
7399a86L01m64L11J92k20j06J44J02n4k34M62J00n64N8M3K56k57L5j40M20j23
7420G6P6K4k65J26J99k48J25j27J16r6M8J24J48k71j1O9k26J64j51K21j30J65
$$ plain form
7442 156 40 168 158 53 90 73 -30 -37 -2 -5 92 80 81 -128 5 -221 -45 234 -230 -36 28 -20 112 16 73
7467 73 -321 44 -39 150 -161 -139 148 375 276 390 -89 -64 35 -282 202 99 -81 -3 153 86 53 -38 59 2
7491 2 140 64 1 -27 11 113 103 -200 79 -46 62 -209 265 128 -155 112 -217 -178 -187 75 -199 300 -53
7514 -53 -342 173 37 94 -20 -94 26 -33 32 -270 -82 -15 126 -210 -46 -145 73 48 277 -155 153 173 -58
7537 -58 -214 -48 -21 69 -78 97 -82 176 -27 -458 -91 105 135 -1 -30 95 143 -70 -20 381 32 59 -190
7560 -190 -13 129 -182 72 134 -64 0 -89 -49 -65 172 13 36 84 -81 86 -117 38 2 -149 118 142 -176
7583 -176 2 -126 -32 76 -110 15 66 -143 139 109 -310 91 141 -135 -21 170 101 27 106 -149 -22 72 49
7606 49 97 21 -66 -259 2 -32 18 120 -179 -111 201 -133 57 -20 178 222 28 -105 -109 13 -52 46 144 134 117
$$ packed form
7442A56j16J28j0j05L7j7j03pL5lR7j2Jk09J33k26J76K79m64J94O4m8J32r6N7
7467G3l94L65q3J89l11K2K87K27r9J14m79K5R9l17M84j03j80P8J56o7l3r1R7n7
7491BJ38p6o3k8L8J02j0l03K79j25J08k71M74j37k83K67l29L9rK62k74M99l53
7514e3k89N15j36N7j14p4J20n9O5l02J88O7J41l36J64r9K18k5K29m32L08K0k31
7537e8j56J66K7R0j47J75j79K58k03m31L67J96L0j36k9J25M8k13N0M01l49K7k49
7560a90J77J42l11K54O2j98O4q9M0j6K37j59K3M8j65J67k03J55l6j51K67K4l18
7583a76J78j28R4J08j86J25N1k09K82l0m19M01N0k76J14J91o9p4P9k55J27R4k3
7606D9M8p6q7j93K61l4N0J02k99O8L12l34J90p7J98M4j94j33mJ22o5R8R8j0j7
$$ plain form
7631 117 14 -30 -52 169 152 -98 121 27 -24 30 9 -106 -66 174 -64 -58 156 167 59 -356 12 74 100 52 228
7656 228 -192 -106 35 -43 -46 37 -260 -77 79 79 -51 -55 22 73 -61 -158 -213 3 137 411 40 -119 214 54
7680 54 -50 -269 13 62 4 111 -208 -87 -63 -101 -51 37 163 -10 148 4 123 181 80 -313 -125 -69 -195
7703 -195 135 -38 150 174 142 102 -143 54 -119 186 -130 -130 370 -54 -45 293 -179 8 200 150 34 -92 -123
7726 -123 -11 224 234 200 -54 -5 0 115 -134 -63 -33 208 -128 331 133 109 -162 97 72 115 -104 283 176
7749 176 -27 -184 -141 -130 136 21 222 -170 -1 -158 -139 228 -269 -67 -70 -90 108 -142 -19 114 188 33
7771 33 67 -235 -44 77 29 -56 223 52 -83 -6 156 90 56 108 -80 -233 14 44 133 -45 146 -3 -116
7794 -116 44 212 159 -152 187 -206 -56 35 -62 -2 -196 -136 41 -3 224 92 200 -80 98 329 -150 -152 80
$$ packed form
7631A17j03m4k2K21j7k50K19r4n1N4k1j15M0K40k38OK14J1j08m15L68O2K6m8J76
7656B28m20Q6J41p8lQ3k97J83J56%j30mP7N1j34r7n5K16J34K74l71j59L33j60
7680E4j04k19K82M9n8J07l19J21K4l8N0Q8J26j73J58j44J19N8j01l93J88N6j26
7703a95L30j73J88K4l2m0k45J97j73L05l16%N00m24RL38m72J87J92n0j16j26l1
7726a23J12K35J0l4k54M9NJ15k49P1L0K41l36M59j98k4k71K59k5M3k19L87j07
7749A76k03j57M3J1K66j15K01l92J69j57J9L67m97K02lk0J98k50J23J33P4j55
7771C3L4l02J91J21m8q5K79j71j35P7J62o6l4N2j88j53K47L0Q9j78J91j49j13
7794a16J60J68n3l11L39l93J50R1r7O0j94O0J77m4K27j32J08k80J78K31m79kK32
$$ plain form
7817 80 -162 66 30 167 128 33 164 -189 -55 -117 77 -44 -5 -159 60 326 66 89 84 133 187 -194 64 118
7841 118 -100 61 -68 147 -118 -22 65 -20 -56 119 181 -175 104 62 -174 197 -2 48 103 67 -96 -194 67
7864 67 -182 55 -476 -161 14 -152 -3 -41 -110 -160 68 206 200 -316 224 -23 87 56 55 -13 -12 69 183 -191
7888 -191 145 -27 54 42 30 6 2 43 -185 4 -115 159 23 194 -182 228 -1 4 -315 -107 -34 142 -142
7911 -142 -93 50 -48 -269 -69 -42 -29 -24 13 10 -67 34 -110 189 188 20 290 -179 29 153 139 -12 -88 114 -313
7936 -313 170 129 69 103 230 -206 212 -149 -180 9 -35 137 -153 4 -17 66 -139 -4 -137 102 2 125
7958 125 -93 55 -5 -138 221 209 84 51 -86 -47 1 -10 -59 -24 -105 152 319 -139 -207 -12 47 -234 6 58
7982 58 -89 188 -210 -140 -200 -58 -4 202 -114 15 86 173 83 138 393 -86 -74 17 -96 -100 107 -62 -30 56 165
$$ packed form
7817H0k42K28l6J37l9r5J31l53J34o2J94j21L9j54K19K66k60K3nM9N4l81K58N4
7841A18k18J61j29K15k65R6Q7q5l6J75O2l56K79m2k36L71j99N0N5l6j63r8K61
7864F7k49K37n31L15J75j66J49l8o9n0K28J38on16N40k47J10l1jo8JQ1J14l74
7888a91L36j72Q1j2j2k4mM1k28J89j19K74j36J71l76M10k29Nl19K08P3J76k84
7911a42M9J43r8k21K00K7J3NL7lp7J01j44K99jj68K70m69K08J24j4j51p6K02m27
7936c13M83m1o0L4J27m36M18l61l1J89m4J72k90J57k1Q3k05J35j33K39j00J23
7958A25k18J48o0j33L59j2j25l3j37L9M8j1m9L5q1K57J67m58o8J95N9k81K40N2
7982E8j47K77l98P0o0J42N4K06l16J29P1Q7r0N5K55m79J2R1j13mK07j69L2Q6J09
$$ plain form
8007 165 76 64 -130 242 -125 -171 -111 -214 -31 -330 -118 102 11 -59 41 265 10 318 -89 -24 -144 120
8029 120 88 45 62 -109 49 -27 248 -19 253 -124 -19 -156 198 -86 -29 -150 -75 -43 136 -100 -116 -42 78
8052 78 42 215 52 -54 40 49 85 86 -278 138 -64 -22 -34 17 -22 26 71 55 -199 48 -220 -38 135 41 153
8077 153 -204 -135 -98 -229 -101 190 -206 -356 -188 93 -291 96 17 26 173 6 7 -1 -287 109 141 -234 173
8100 173 -64 54 -104 136 -284 -28 -28 58 -229 -114 34 -56 45 -8 138 -15 168 59 -105 -69 6 124
8122 124 58 121 -10 -87 -83 -213 -158 66 -138 132 166 27 -130 317 135 76 82 -11 -77 -41 -88 -105 97 -146 271
8147 271 26 -199 -110 171 80 -26 152 107 51 -53 114 -233 68 102 96 -40 -236 -47 154 -162 56 -151
8169 -151 12 -38 -224 -135 -180 72 -59 -40 56 148 15 97 152 -20 72 -65 196 65 -25 160 343 -141
$$ packed form
8007A65q9j2j94L72l67m6O0j03J83k99K12K20r1p0J00K24k55L08m07O5j20K64
8029A20l2m3J7j71J58p6K75k67K72l77J05j37L54k84N7j21P5L2J79k36j6P4J20
8052G8l6J73j63j06R4RL6Jl64M16k02M2j2N1l9M8M5j6k54K47k68J82J73r4J12
8077A53l57O9L7j31J28K91l96j50J68K81l84L87p9RJ47j67Jqk86L96L2l75M07
8100A73k37J18j58K40m20K56%Q6k87J15J48r0J01n3J46j53J83j09j64L6P5J18
8122A24o6O3j31p7Mj30N5K24k04K70L4j39j57M47j82n9Or3o6L6m7j7K02k43M17
8147B71k45k25Q9K81r1j06J78m5n6j04J67l47L01L4oj36j96J89K01l16K18k07
8169a51J63n0j86Q9m5K52j31J9R6R2j33Q2N5j72R2j37K61j31r0J85J83m84
8191a41
$$ Imaginary data points
##PAGE= N=2
##DATA TABLE= (X++(I..I)), XYDATA
$$ plain form
0 0 0 0 0 0 0 0 0 0 0 0 0 0 0 -8 8 -8 8 -8 16 -16 16 -24 24 -32 40 -44 49 -57 68 -80 89 -103 116 -131 148
35 148 -168 187 -210 235 -262 293 -325 358 -398 440 -486 537 -593 653 -720 793 -873 961
53 961 -1061 1174 -1297 1441 -1606 1795 -2019 2287 -2616 3031 -3569 4304 -5368 7053 -10143
68 -10143 17698 -80491 -53044 38812 -81549 -29486 24700 -74282 -99348 20808 2890 -42587
80 -42587 12365 19626 -43601 -10427 28078 1883 4458 40596 20917 4 16112 28387 14615
93 14615 14156 23437 16290 822 15097 29820 14269 42 3182 -5307 -5418 8831 1260 -8527
107 -8527 202 -12698 -20679 5535 886 -26176 -2796 7670 -27768 -19579 5760 -18013 -14627
120 -14627 17758 -2800 -21269 2001 -6667 -15876 14411 6992 -24210 -4910 5538 -13511 5823
$$ packed form
0@%%%%%%%%%%%%%qJ6j6J6j6K4l2L2m0M8n6P2q4R3j06J25j48J69j92K19k47K79
35A48l16L55l97M45m97N55o18O83p56Q38r26J023j130J246j373J513j666J834
53I61k022K235k471K738l047L401l814M306m903N647o600P873r672J2421j7196
68a0143K7841r8189K7447R1856j20361N2063N4186r8982k5066J20156j7918m5477
80d2587N4952P261o3227L3174L8505k6195K575L6138j9679k0913J6108J2275j3772
93A4615m59R281p147j5468J4275J4723j5551j4227L140q489j11J4249p571r787
107h527Q729j2900p981K6214m649k7062K3380J0466l5438Q189K5339k3773L386
120a4627L2385k0558j8469K3270q668r209L0287p419l1202J9300J0448j9049J9334
$$ plain form
133 5823 20442 -9002 -11422 5332 -6504 -2063 14674 605 -3393 9696 -3101 -5297 18662
146 18662 11156 -4711 8158 3307 -14553 2647 14457 -1657 -1619 4034 -8543 -5159 9156
159 9156 804 -10163 -6499 -7699 -11126 -2598 4088 -2879 -12655 -7730 -530 -6231 -7015 4332 -1579
174 -1579 -14224 -1428 6267 -6349 1194 14593 419 -3277 9137 315 -3904 12333 7382
187 7382 -2817 9564 6415 -6111 8045 12768 -4259 2035 9123 -9297 -7039 9740 -865
200 -865 -3611 12865 1917 -11638 3603 6186 -5717 4544 11142 -5161 -5517 7925 4582 1285
214 1285 10150 8820 -1763 -810 4363 2684 1434 4494 3542 -1273 -937 4375 2916 -1679 -145 -2172
230 -2172 -7464 -3964 400 -3463 -3182 -401 -3638 -4753 -1275 -3309 -4107 -258 -1597 -3819 -1198 -3356
$$ packed form
133E823J4619k9444k420J6754j1836M441J6737j4069l998J3089j2797k196K3959
146A8662p506j5867J2869m851j7860J7200J1810j6114L8N653j2577L384J4315
159I156q352j0967L664j200l427Q528O686o967r776M925P200n701p84J1347n911
174a579j2645J2796P695j2616P543J3399j4174l696J2414q822m219J6237m951
187G382j0199J2381l149j2526J4156M723j7027O294P088j8420K258J6779j0605
200h65k746J6476j0948j3555J5241K583j1903J0261O598j6303l56J3442l343l297
214A285Q865j330j0583R53N173j679j250L060r52m815L36N312j459m595J534k027
230b172n292L500M364l863K81K781l237j115L478k034p98L849j339k222K621k158
$$ plain form
246 -3356 -4338 3438 4378 -127 3607 1764 -5510 -1582 3167 -1661 133 6892 2241 -1186 2776 -747
262 -747 -3859 2996 5204 195 1063 594 -2623 865 5039 2930 3870 5060 1745 1628 2184 -1859 -1432
279 -1432 4564 4130 2354 4345 735 -4524 -513 1388 -3333 -3675 -306 -2730 -4298 -1128 -3333 -8217
295 -8217 -4624 1130 -854 -3534 -2329 -5399 -8247 -983 3881 1145 1735 5631 2408 -893 2659
310 2659 3346 418 6116 10001 3874 1485 4057 2498 3535 8074 5114 -1097 -392 96 -2201 -788
326 -788 283 -2436 -762 1190 -2408 -4966 -4702 -6136 -4061 552 -1594 -5138 -3842 -2337 -2520 720
342 720 1246 -2363 -2590 -359 -1229 -2609 -296 928 1622 3084 2076 -1435 -2690 -247 2009 1787 162
359 162 -1529 -2527 -1394 1985 2959 1237 -335 488 -505 -1174 -625 118 870 2720 3888 2202 -313
$$ packed form
246c356r82P776R40m505L734j843p274L928M749m828J794O759m651l427L962l523
262g47l112O855K208n009Q68m69l217L488M174k109R40J190l315j17N56m043M27
279a432N996m34j776J991l610n259M011J901m721l42L369k424j568L170k205m884
295h217L593N754j984k680J205l070k848P264M864k736N90L896l223l301L552
310B659O87k928N698L885o127k389K572j559J037M539k960o211P05M88k297J413
326g88J071k719J674J952l598k558K64j434K075M613k146l544J296J505j83L240
342G20N26l609k27K231q70j380K313J224O94J462j008l511j255K443K256k22j625
359A62j691r98J133L379R74j722j572Q23r93o69N49P43P52J850J168j686k515
$$ plain form
376 -313 -383 1911 2917 2292 1509 29 -2417 -519 2643 1280 -86 1541 404 -2067 -642 -1374 -3734
393 -3734 -1652 1612 -194 -1804 174 -568 -638 2147 1190 -1522 -714 1067 1297 2381 2319 628 803
410 803 3085 3256 1988 791 -1168 -1761 90 997 1121 1008 307 -1214 -1731 -1590 -1951 -1580 6 -739
428 -739 -3657 -4329 -2777 -940 1935 4095 1072 -3407 -4242 -2454 -786 2892 4065 1003 -1103 -950
444 -950 -1263 225 3481 2688 -179 -1596 -3317 -4331 -1431 1772 1123 -635 -1811 -3757 -2978 -1434
460 -1434 -884 -1835 -2515 -3066 -1516 1471 1612 288 -86 -295 -470 1724 3805 2918 1060 977 1542 2759
478 2759 4519 5868 4493 2303 1608 1222 1428 3403 3946 2220 1876 2883 1310 1264 2880 1232 -1741
495 -1741 -894 -345 -563 473 1403 -183 -1668 -2601 -2415 -392 572 -1442 -2854 -4105 -6022 -4615 -416
$$ packed form
376c13p0K294J006o25p83j480k446J898L162j363j366J627j137k471J425p32k360
393c734K082L264j806j610J978p42p0K785r57k712Q08J781K30J084o2j691J75
410H03K282J71j268j197j959n93J851R07J24j13p01j521n17J41l61L71J586p45
428g39k918o72J552J837K875K160l023m479q35J788J668L678J173l062k106J53
444i50l13J488L256p93k867j417j721j014K900L203o49j758j176j946P79J544
460a434N50r51o80n51J550K987J41j324l74k09j75K194K081q87j858q3N65J217
478B759J760J349j375k190o95l86K06J975N43j726l44J007j573m6J616j648k973
495a741Q47N49k18J036R30j586j485r33J86K023R64k014j412j251j917J407M199
$$ plain form
512 -416 1102 -757 -1801 -3772 -6271 -5009 -2558 -851 71 -1298 -3397 -3746 -2278 -64 2502 2604
528 2604 1007 -1753 -2491 312 3905 4830 4095 3404 1656 1480 4246 6160 3626 1175 822 696 2223
545 2223 3540 3300 2051 -595 -2089 -995 394 -1289 -1946 -1549 -3822 -5026 -2767 -1490 -992 -859
561 -859 -2512 -4400 -3770 -2854 -1635 569 685 -1816 -743 1699 1682 2055 2908 2299 1348 2349 2130 2339
579 2339 3049 3699 4900 5302 2418 428 1076 1703 2653 3219 983 -1302 -1276 -649 1031 2173 -109 -3009
597 -3009 -2779 -2672 -3622 -2829 -1586 -3043 -3493 -2600 -2441 -2679 -3057 -3375 -3195 -3611 -4794 -2792 -553 -1703
615 -1703 -1929 -1437 -2447 -1407 1607 1434 -1005 -1488 -1793 -285 3857 4656 2098 1390 1334 905 3636 4726
633 4726 2765 1591 1144 628 1997 3106 2268 2432 2817 -23 -1172 -254 -1074 -1154 1257 406 -1962 -1513
$$ packed form
512d16J518j859j044j971k499J262K451J707R22j369k099l49J468K214K566J02
528B604j597k760p38K803L593R25p35o91j748j76K766J914k534k451l53j26J527
545B223J317k40j249k646j494J094J389j683o57L97k273j204K259J277M98J33
561h59j653j888O30R16J219K204J16k501J073K442j7L73Q53o09r51J001k19K09
579B339P10O50J201M02k884j990O48O27R50N66k236k285K6O27J680J142k282k900
597c009K30J07r50P93J243j457m50Q93J59k38l78l18J80m16j183K002K239j150
615a703k26M92j010J040L014j73k439m83l05J508M142P99k558p08n6m29K731J090
633D726j961j174m47n16J369J109q38J64L85k840j149R18q20q0K411q51k368M49
$$ plain form
651 -1513 -1133 -1607 -262 -223 -1603 -1486 -1293 -1404 -830 -552 113 979 748 227 225 -204 -799 357 505 -1411
671 -1411 245 1947 726 2147 1772 -2038 -2625 -105 480 1311 1713 -1497 -4072 -1729 253 789 2051
688 2051 794 -2576 -2377 -1666 -1926 377 1961 579 -104 379 -1163 -986 469 431 -319 -231 -674 -1208
706 -1208 -377 43 -186 -279 -88 74 88 -754 -1547 -1306 -1161 112 1844 723 -262 419 -117 -415 1335
725 1335 622 -953 695 1271 267 1161 2059 167 526 1535 58 -277 552 -578 -835 1095 108
742 108 -541 512 733 -361 295 69 -1235 -931 -292 -593 390 1461 713 614 636 -273 -194 492 706 475
762 475 223 -432 -303 356 509 839 469 -968 -1449 -1305 -1383 -1097 -754 -857 -1433 -1043 -747 -1012 -587 -1039
782 -1039 -2033 -1705 -1248 -1041 -355 101 -560 344 517 247 697 540 -76 -4 429 124 346 849 594 571 1018
$$ packed form
651a513L80m74J345L9j380J17J93j11N74K78O65Q66k31n21km29n95J156J48j916
671a411J656J702j221J421l75l810n87K520N85Q31M02l210k575K343J982N36J262
688B051j257l370J99P11k60K303J584j382o83M83j542J77J455l8p50Q8m43n34
706a208Q31M20k29r3J91J62J4q42p93K41J45J273J732j121r85O81n36k98J750
725A335p13j575J648N76j004Q94Q98j892L59J009j477l35Q29j130k57J930r87
742A08o49J053K21j094O56k26j304L04O39l01R83J071p48r9K2r09P9O86K14k31
762D75k52o55J29O59J53L30l70j437m81J44p8K86L43j03n76L90K96k65M25m52
782a039r94L28M57K07O86M56o61R04J73k70M50j57o16P2M33l05K22N03k55k3M47
$$ plain form
803 1018 842 -439 232 183 -500 113 247 -859 272 998 297 159 66 -949 -1090 -245 25 -451 284
822 284 344 -183 333 427 -272 -9 -117 -483 -850 -1566 -1063 71 -13 34 -189 -1285 -1371 -494 -311 -974 -702
843 -702 -647 -521 700 1079 623 433 875 650 1175 1731 882 682 1671 2075 1980 2709 1853 899 1416 928 23
864 23 717 1136 400 43 -207 -1125 -1076 429 480 -749 -1710 -3207 -3166 -2049 -862 -274 -439 -1793 -2288 -2029
884 -2029 -1438 -1131 -438 -523 -697 -865 -1258 -938 46 1447 1443 1037 28 -803 -571 211 729 999 1092 51
904 51 985 1027 675 243 136 -28 564 1131 866 273 603 949 873 1436 1486 992 1019 446 -535 180 326 545
926 545 1394 1222 -310 -939 -1245 -1245 -439 -109 -1263 -1590 -1582 -1508 -978 -216 -1000 -1539 -863 -872 -1304 -594 -893 -689
948 -689 201 572 110 527 967 493 786 367 -172 351 773 784 841 128 -434 -261 418 -291 -730 -880 -1902
$$ packed form
803A018j76j281O71m9o83O13J34j106J131P26p01j38r3j015j41Q45K70m76P35
822B84O0n27N16R4o99K63j08l66l67p16N03J134q4M7k23j096q6Q77J83o63K72
843g02N5J26J221L79m56j90M42k25N25N56q49k00R89M04r5P29q56r54N17m88r05
864B3O94M19p36l57k50r18M9J505N1j229r61j497M1J117J187N88j65j354m95K59
884b029N91L07O93q5j74j68l93L20R84J401mm06j009q31K32P82N18K70R3j041
904E1R34M2l52m32j07j64N92N67k65n93L30L46p6N63N0m94K7n73r81P15J46K19
926E45Q49j72j532o29l06%Q06L30j154l27QP4N30P62p84n39O76rm32P10k99K04
948f89Q90L71m62M17M40m74K93m19n39N23M22J1N7p13n62J73O79p09m39j50j022
$$ plain form
969 -1902 -1736 -795 -1085 -1247 -668 -1550 -1541 -662 -1436 -1553 -680 -356 -1049 -331 -118 -556 507 1202 242 -338
989 -338 -660 -1382 -341 623 6 -391 -11 -762 -980 -258 -705 -920 -664 -1405 -2175 -1415 -1025 -1185 201 128
1009 128 -599 -377 -382 -307 407 1115 445 1086 956 977 1989 2424 1017 1138 948 123 540 981 494 205 476
1030 476 -202 -456 73 -791 -1191 -909 -1794 -2525 -1391 -1579 -1614 -698 -736 -1680 -991 -1183 -1431 -1045 -399 -1460
1050 -1460 -910 -322 -1165 -215 1065 -23 -359 -73 -1041 -920 85 25 -385 49 -597 -833 279 309 -358
1069 -358 237 -218 -1146 22 423 20 651 992 438 896 1567 1118 1399 1605 538 615 1482 1669 1711 2041
1089 2041 592 -14 585 454 208 610 -952 -1382 -486 -937 -1250 -212 -892 -1812 -717 -943 -1441 -656
1107 -656 -620 -1395 -175 891 -138 884 1571 245 449 1313 914 917 2386 1465 1141 1609 1368 972 1542
$$ packed form
969a902J66R41k90j62N79q82RQ79p74j17Q73L24o93P18K13m38J063O95r60n80
989c38l22p22J041R64o17l97L80p51k18P22m47k15K56p41p70P60L90j60J386p3
1009A28p27K22nP5P14P08o70O41j30K1J012M35j407J21j90q25M17M41m87k89K71
1030D76o78k54N29q64m00K82q85p31J134j88l5R16l8r44O89j92k48L86O46j061
1050a460N50N88q43R50J280j088l36K86r68J21J005o0m10M34o46k36J112L0o67
1069c58N95m55r28J168M01m03O31L41n54M58O71m49K81K06j067P7Q67J87M2L30
1089B041j449o06N99j31k46M02j562m30Q96m51l13J038o80r20J095k26m98P85
1107f56L6p75J220J066j029J022O87j326K04Q64l99LJ469r21l24M68k41l96N70
$$ plain form
1126 1542 1284 513 793 -51 -544 -275 -302 -92 573 227 -836 -1043 -1432 -2099 -743 -29 -560 -660 -978
1145 -978 -1592 -332 722 142 90 256 -904 -671 397 273 -1 920 432 10 705 318 -349 477 -15
1164 -15 -824 -40 389 -349 381 656 -232 94 914 313 313 931 1 108 1341 1084 1065 1213 824 382 1151
1185 1151 842 553 233 220 -8 350 67 -180 52 -141 -524 -676 -874 -1690 -1343 -931 -882 -133 -261 -916
1205 -916 -732 -5 -63 -97 343 -468 -11 675 413 463 1491 1082 452 772 276 -285 205 412 -363 -237 -180
1226 -180 -465 -145 -182 -1058 -1377 -1249 -1390 -1056 -38 -996 -1470 -1103 -689 40 475 67 -579 -367 -205 448
1246 448 1075 1069 691 447 655 701 564 711 394 540 -263 -502 -92 -283 -315 136 -312 -859 -783 -590 -947 -1041
1268 -1041 -595 -988 -555 -203 -362 -366 161 75 -90 306 421 -428 19 364 482 789 977 526 548 482 115
$$ packed form
1126A542k58p71K80q44m93K69k7K10O65l46j063k07l89o67J356P14n31j00l18
1145i78o14J260J054n80n2J66j160K33J068j24k74R21m88m22O95l87o67Q26m92
1164a5q09P84M29p38P30K75q88L26Q20o01%O18r30J07J233k57j9J48l89m42P69
1185A151l09k89l20j3k28L58k83k47K32j93l83j52j98q16L47M12M9P49j28o55
1205i16J84P27n8l4M40q11M57O86k62N0J028m09o30L20m96n61M90K07p75J26N7
1226a80k85L20l7q76l19J28j41L34J018r58m74L67M14P29M35m08o46K12J62O53
1246D48O27ol78k44K08M6j37J47l17J46q03k39M10j91l2M51m48n47P6J93l57r4
1268a041M46l93M33L52j59mN27q6j65L96J15q49M47L45J18L07J88m51K2o6l67
$$ plain form
1289 115 26 -162 -178 -361 241 252 -74 -121 -131 -164 -385 -240 -43 166 -166 24 295 362 886 979 532 577 239
1312 239 311 299 503 304 -115 109 293 -159 175 -97 -973 -1076 -1034 -1201 -1136 -611 -967 -1589 -1042 -358 -677
1333 -677 -478 -514 -862 -1093 -391 -116 422 869 622 428 1117 1028 781 967 1029 907 802 919 1235 1053 957
1354 957 862 573 370 105 16 -184 -211 -401 -199 -562 -207 -512 -306 -248 -519 -772 -686 -474 -409 -15 -7 10 176
1377 176 540 492 163 632 214 298 171 224 -77 212 637 570 254 273 -363 -299 23 -197 -240 -166 -225 -29 174
1400 174 171 122 141 89 0 170 94 0 129 131 535 628 479 203 165 -5 -352 -261 -271 -261 -9 -411 -149 -511 -535
1425 -535 -373 -576 -779 -733 -718 -587 -345 -253 103 131 -85 133 230 112 544 362 705 783 826 651 758 1038
1447 1038 802 864 877 299 5 77 67 -45 57 -87 -344 -80 -420 -443 -514 -456 -563 -376 -224 -201 -339 166
$$ packed form
1289A15q9j88j6j83O02J1l26m7j0l3k21J45J97K09l32J90K71O7N24R3m47M5l38
1312B39P2j2K04j99m19K24J84m52L34k72q76j03M2j67O5N25l56o22N47O84l19
1333f77J99l6l48k31P02K75N38M47k47j94O89q9k47J86O2j22j05J17L16j82r6
1354I57r5k89k03k65q9k00k7j90K02l63L55l05K06N8k71k53Q6K12O5L94QJ7J66
1377A76L64m8l29M69m18Q4j27N3l01K89M25o7l16J9o36O4L22k20m3P4n9J96K03
1400A74lm9J9n2q9J70p6r4J29KM04R3j49k76l8j70l47R1j0J0K52m02K62l62k4
1425e35J62k03k03M6J5J31K42R2L56K8k16K18R7j18M32j82L43P8M3j75J07K80
1447A038k36O2J3n78k94P2j0j12J02j44k57K64l40k3p1N8j07J87J52K3j38N05
$$ plain form
1469 166 358 364 428 341 257 201 449 433 490 700 815 693 754 488 149 132 53 -170 31 -17 -229 -534 -96 -217
1493 -217 -275 -277 -690 -673 -818 -543 -402 -518 -103 113 -41 48 -76 -259 -97 272 354 51 -17 287 154 270
1515 270 385 347 82 133 -87 -398 -448 -229 -65 -194 132 -486 -30 -31 -247 -305 -128 -38 -157 276 52 446
1537 446 677 647 287 816 471 260 141 189 182 185 197 292 549 -63 -488 -17 -221 -620 -426 -210 -588 -545 -109
1560 -109 -123 -105 60 -81 -242 -100 -52 -110 168 43 180 259 424 364 395 449 236 140 -190 235 -75 19 -109
1583 -109 -53 -244 -108 -436 -475 -618 -593 -260 -464 -599 -439 -566 60 123 -434 -104 -143 -167 -394 87 63 87 372
1606 372 430 221 786 846 510 4 158 -161 116 468 9 99 7 -419 -167 57 100 -385 -121 -457 -316 30
1628 30 -142 -397 71 -142 -548 -29 34 -29 13 -502 -233 268 281 270 336 115 -318 11 209 68 -126 276
$$ packed form
1469A66J92OO4q7q4n6K48j6N7K10J15j22O1k66l39j7p9k23K01m8k12l05M38j21
1493b17n8km13J7j45K75J41j16M15K16j54Q9j24j83J62L69Q2l03o8L04j33J16
1515B70J15l8k65N1k20l11n0K19J64j29L26o18M56jk16n8J77R0j19M33k24L94
1537D46K31l0l60N29l45k11j19M8pLJ2R5K57o12m25M71k04l99J94K16l78M3M36
1560a09j4J8J65j41j61J42M8n8K78j25J37P9J65o0L1N4k13r6l30M25l10R4j28
1583a09N6j91J36l28l9j43K5L33k04j35J60j27O26O3n57L30l9k4k27M81k4K4K85
1606C72N8k09N65O0l36n06J54l19K77L52m59R0r2m26K52K24M3m85K64l36J41L46
1628C0j72k55M68k13m06N19O3o3M2n15K69N01J3j1O6k21m33L29J98j41j94M02
$$ plain form
1650 276 -188 170 59 54 151 275 -153 -214 -33 71 -267 163 75 143 566 336 -303 113 122 -382 52 -13 -250
1673 -250 -121 38 -148 82 39 -263 -513 -368 -733 -401 -454 -767 -808 -586 -329 -553 -132 -280 -800 -537 -471
1694 -471 -262 145 415 -324 -167 278 471 644 753 214 160 287 35 564 385 82 222 322 127 72 152
1715 152 -242 -318 126 -505 -358 221 -198 -266 5 -25 -390 -13 143 -552 -65 70 -444 125 419 -267 20
1736 20 -60 -309 21 59 -43 -240 31 56 95 74 -119 -367 127 -198 -561 -261 -222 -546 0 -102 22 -2 -204
1759 -204 -447 0 -153 -22 -8 127 -149 -9 165 19 238 428 -22 30 -26 -172 -86 180 -48 -285 193
1780 193 160 -50 352 -180 -791 -276 -59 -83 76 106 -54 4 495 186 174 190 -142 -142 232 282 394 176 116
1803 116 -78 15 70 -59 -7 140 -184 -169 -372 -170 191 -164 -318 28 -129 -530 -6 -93 -186 200 325 -97
$$ packed form
1650B76m64L58j11nR7J24m28o1J81J04l38M30q8O8M23k30o39M16Rn04M34o5k37
1673b50J29J59j86K30m3l02k50J45l65L32n3l13m1K22K57k24M21j48n20K63O6
1694d71K09M07K70p39J57M45J93J73J09n39n4J27k52N29j79l03J40J00j95n5Q0
1715A52l94p6M44o31J47N79m19o8K71l0l65L77J56o95M87J35n14N69K94o86K87
1736B0q0k49L30L8j02j97K71K5L9k1j93k48M94l25l63L00L9l24N46j02J24k4k02
1759b04k43M47j53J31J4J35k76J40J74j46K19J90m50N2n6j46Q6K66k28k37M78
1780A93l3k10M02n32o11N15K17k4J59L0j60N8M91l09j2J6l32%L74N0J12k18o0
1803A16j94R3N5j29N2J47l24J5k03K02L61l55j54L46j57m01N24q7r3L86J25m22
$$ plain form
1825 -97 302 557 -51 470 573 478 212 320 171 171 373 360 418 399 132 -213 232 142 -396 -218 -218 -302 -348 207
1849 207 -278 -190 -270 -434 -215 -13 -201 -197 17 -350 5 11 82 -99 136 -153 -328 29 -179 249 67 -111
1871 -111 -202 110 100 -33 131 124 -241 -81 -14 -164 50 168 -32 377 458 266 -5 426 94 422 333 276 415
1894 415 370 348 213 540 81 -176 -118 55 -281 -287 -219 -29 88 26 -213 -365 -240 -167 -655 -447 -273 -166 50
1917 50 66 -35 -350 47 56 115 292 33 255 314 265 256 164 47 315 197 -25 95 61 -139 -107 58 -251 90
1941 90 162 -420 -77 -123 -461 -500 23 -313 -434 267 -88 -43 13 159 -77 49 283 -159 -41 -128 -103 75 262
1964 262 31 86 6 -423 -113 -282 -225 -116 -139 -145 96 -15 -41 -193 130 -34 -192 -251 0 0 74 163 -62 347
1988 347 341 265 310 153 41 263 263 186 138 25 116 -36 -69 -331 -111 48 -408 -340 -9 -221 -350 234 106 -157
$$ packed form
1825i7L99K55o08N21J03r5k66J08j49%K02j3N8j9k67l45M45r0n38J78%q4m6N55
1849B07m85Q8q0j64K19K02j88MK14l67L55OP1j81K35k89j75L57k08M28j82j78
1871a11r1L12j0j33J64pl65J60O7j50K14J18k00M09Q1j92k71M31l32L28q9n7J39
1894D15m5k2j35L27m59k57N8J73l36oO8J90J17o2k39j52J25P3m88K08J74J07K16
1917E0J6j01l15L97RN9J77k59K22N9m9rr2j17K68j18k22J20l4k00L2J65l09L41
1941I0P2n82L43m6l38l9N23l36j21P01l55M5N6J46k36J26K34m42J18q7K5J78J87
1964B62k31N5q0m29L10j69N7J09k3oK41j11k6j52L23j64j58n9K51%P4Q9k25M09
1988C47op6M5j57j12K22%p7m8j13R1j52l3k62K20J59m56O8L31k12j29N84j28k63
$$ plain form
2012 -157 -68 231 -148 -56 109 94 135 240 54 333 339 311 222 204 252 -12 -46 60 -89 250 -112 -156 92 -23
2036 -23 -301 -220 -92 -599 -77 -366 -162 -2 -18 -46 -2 -62 159 -85 110 5 122 238 345 465 520 258
2058 258 365 312 77 254 160 -26 9 -38 87 -350 347 -301 -184 -210 -198 -202 -38 -143 -195 -19 -140 63 120
2081 120 -2 343 115 183 32 333 308 191 227 491 197 44 -12 40 -77 -174 23 -236 -34 -316 -398 -12
2103 -12 -178 -345 -131 -73 -88 17 27 -225 145 -17 -78 224 111 231 103 269 -48 84 171 93 -11 261
2125 261 185 -273 -172 1 -231 -166 -138 -407 -498 -208 -497 -274 -398 -54 -181 -295 -271 -142 -260 -580 370 296
2147 296 -83 494 416 237 255 147 281 -182 357 268 267 284 8 186 52 163 -309 -228 -206 -271 -392 -379 -313 -90
2171 -90 -109 -207 -193 -78 -152 -109 -161 -119 -94 145 0 236 226 199 253 319 321 -34 127 132 -33 167 -22 -148 -229 -64
$$ packed form
2012a57Q9K99l79R2J65j5M1J05j86K79Ok8q9j8M8k64l4J06j49L39l62m4K48j15
2036b3k78Q1J28n07N22k89K04J60j6k8M4o0K21k44J95j05J17J16J07J20N5k62
2058B58J07n3k35J77r4j86L5m7J25m37O97o48J17k6J2mJ64j05n2J76j21K03N7
2081A20j22L45k28O8j51L01k5j17L6K64k94j53n6N2j17r7J97k59K02k82q2L86
2103a2j66j67K14N8j5J05J0k52L70j62o1L02j13J20j28J66l17J32Q7p8j04K72
2125B61p6m58J01J73k32O5K8k69r1K90k89K23j24L44j27j14K4J29j18l20R50p4
2147B96l79N77p8j79J8j08J34m63N39q9jJ7k76J78j34J11m72Q1K2o5j21J3O6K23
2171i0j9r8J4J15p4M3n2M2K5K39j45K36j0k7N4O6Kl55J61Nj65K00j89j26q1J65
$$ plain form
2197 -64 181 -232 -323 -341 -100 -200 -149 -136 -160 47 -237 -54 27 -392 229 -52 176 -5 41 96 272 285 291 242
2221 242 26 234 191 106 72 -242 -130 -135 -39 -40 -370 -287 -171 -263 -403 -124 -214 -131 -133 -264 160 396 74 324 -44
2246 -44 -60 62 288 147 388 161 259 275 370 114 -121 -76 -124 -11 -145 -146 -276 -210 -224 -107 -154 -264 -131 -181
2270 -181 -32 -89 -59 -193 111 21 217 254 129 439 191 622 361 292 501 247 180 87 299 -4 43 4 52
2293 52 -75 -148 -331 -269 -89 -4 -472 -9 -310 -219 -107 -37 -298 -39 -140 -123 -110 242 80 77 -55 273 93
2316 93 236 153 25 74 321 -31 289 196 7 -272 -245 -259 -155 -316 -195 -185 -166 -315 38 -46 151 -46 -2
2339 -2 12 142 415 415 214 211 274 477 204 96 170 221 190 136 163 2 -236 -32 -46 -294 -38 -18 -154 -242 -284 -431
2365 -431 -338 33 -276 -250 69 -69 143 9 166 -213 55 219 194 260 373 -58 455 413 448 5 187 284
$$ packed form
2197f4K45m13r1j8K41j00N1J3k4K07k84J83Q1m19O21k81K28j81M6N5J76J3Om9
2221B42k16K08m3q5l4l14J12nR6jl30Q3J16r2j40K79r0Q3kj31M24K36l22K50l68
2246d4j6J22K26j41K41k27R8J6R5k56k35M5m8J13j34jj30O6j4J17m7j10J33n0
2270a81J49n7L0j34L04r0J96L7j25L10k48M31k61o9K09k54o7r3K12l03M7l9M8
2293E2j27p3j83O2J80Q5m68M63l01R1J12P0k61K59j01J7J3L52j62lj32L28j80
2316I3J43q3j28M9K47l52L20r3j89k79K7j4J04j61J21J0J9j49L53q4J97j97M4
2339bJ4J30K73%k01lO3K03k73j08P4N1l1n4K7j61k38K04j4k48K56K0j36q8m2j47
2365d31R3L71l09K6L19j38K12j34J57l79K68J64k5O6J13m31N13m2L5m43J82R7
$$ plain form
2387 284 -52 -66 -13 106 -32 -202 -165 -185 -227 -69 -256 -236 -61 -280 -283 -79 -189 -124 -124 -172 125 227 176 337
2411 337 284 425 346 -74 371 293 48 59 265 54 172 -5 -183 -248 -329 206 -92 -237 -199 -148 -217 -239 -246 -2
2435 -2 -288 57 226 16 176 219 55 71 -143 130 31 170 110 188 392 269 -192 109 -321 -142 55 -244
2457 -244 -199 -7 104 -182 -122 -252 1 106 50 121 -273 -7 221 198 265 143 205 164 -76 135 -191 -18 -119
2480 -119 211 -61 -92 69 -8 -58 -42 -161 -125 9 -268 -426 -168 -209 -359 -319 -316 -260 -175 94 -250 -186 -79 -1
2504 -1 394 118 203 237 327 250 135 158 64 390 258 105 -31 168 62 18 -80 35 -498 -161 -28 -139 -345
2527 -345 91 -295 -140 -179 -32 -270 -57 -2 -109 0 105 -128 73 381 -102 67 67 226 143 103 124 81 120
2550 120 -11 82 100 -64 55 -246 -238 -256 -121 -257 -248 -127 -175 66 -79 -87 -266 -218 -148 217 177 34 204 56
$$ packed form
2387B84l36j4N3J19j38j70L7k0m2J58j87K0J75k19lK04j10O5%m8K97J02n1J61
2411C37n3J41p9m20M45p8k45J1K06k11J18j77j78o5q1N35k98j45L8N1o9k2pK44
2435bk86L45J69k10J60M3j64J6k14K73r9J39o0P8K04j23m61L01m30J79J97k99
2457b44M5J92J11k86O0j30K53J05n6P1l94K66K28k3O7j22O2m1k40K11l26J73j01
2480a19L30k72l1J61p7n0J6j19L6J34k77j58K58m1j50M0LN6Q5K69l44O4J07P8
2504aL95k76Q5L4R0p7j15K3r4L26j32j53j36J99j06m4r8J15n33L37J33j11k06
2527c45M36l86J55l9J47k38K13N5j07J09J05k33K01L08m83J69%J59q3m0K1m3L9
2550A20j31R3J8j64J19l01Qj8J35j36RJ21m8K41j45qj79M8P0L65m0j43J70j48
$$ plain form
2574 56 328 186 290 350 282 340 150 -79 10 53 -8 -73 -414 -1 -107 -125 -17 -243 -214 -289 -260 -369 -124 -178
2598 -178 285 35 113 -32 137 205 -144 12 314 236 245 126 75 229 8 -157 55 229 77 145 -272 -127
2620 -127 -122 -317 112 -55 -227 -357 -57 -100 -286 64 -367 -202 159 22 113 115 430 94 235 104 52 -10 161
2643 161 293 -54 112 -30 40 80 -291 -51 -153 -62 219 -258 -238 -184 -255 -399 -213 -251 -259 -287 -49 -84 -25 63
2667 63 -34 -30 245 203 -17 -167 62 70 4 5 -88 183 105 15 -67 76 102 -37 -216 -51 -358 -167 -93 -259 -33
2692 -33 20 -47 140 -136 31 -59 150 -20 -92 -24 115 167 149 -29 162 215 313 244 21 -4 -38 108 163 133 -86
2717 -86 -269 -198 -66 -254 -129 -252 -247 -338 -108 41 -270 146 -33 -129 35 38 -71 360 257 110 120 339 331 146
2741 146 217 307 126 -129 75 227 -105 -64 -118 -202 -295 -294 -177 -234 -33 -313 -32 -122 -45 -182 -209 87 -188 -165
$$ packed form
2574E6K72j42J04O0o8N8j90k29Q9M3o1o5l41M13j06j8J08k26K9p5K9j09K45n4
2598a78M63k50P8j45J69O8l49J56L02p8Rj19n1J54k21j65K12J74j52O8m17J45
2620a27Nj95M29j67j72j30L00m3j86L50m31J65L61j37R1KL15l36J41j31n2o2J71
2643A61J32l47J66j42P0M0l71K40j02R1K81m77K0N4p1j44J86l8qk8K38l5N9Q8
2667F3r7MK75m2k20j50K29Qo6Jr3K71p8r0q2J43K6j39j79J65l07J91P4j66K26
2692c3N3o7J87k76J67r0K09j70p2O8J39N2j8j78J91N3R8o9k23k5l4J46N5l0k19
2717h6j83P1J32j88J25j23Nr1K30J49l11M16j79r6J64Lj09M31j03j47J0K19qj85
2741A46P1R0j81k55K04J52l32M1n4q4r3JJ17n7K01k80K81r0P7j37k7K96k75K3
$$ plain form
2765 -165 152 -132 -102 35 60 -64 56 217 6 191 195 5 9 278 103 11 312 116 91 108 -111 -365 -176
2788 -176 150 177 43 -7 -130 -61 20 8 148 28 120 -134 151 67 330 151 -17 47 38 -33 62 303 -240 -168
2812 -168 6 -267 -52 1 26 71 -106 -135 -431 -31 92 -281 117 -150 43 -57 -81 -39 -167 11 62 172
2834 172 146 141 -41 -15 185 -152 499 136 181 -9 -12 202 -223 -256 -367 -51 33 -120 -1 100 -50 -125 -91 88
2858 88 -41 -53 33 1 228 -220 -84 129 30 -83 17 117 6 100 185 43 158 43 -321 89 -314 -182
2880 -182 -18 29 -162 -74 9 -24 -162 110 -227 96 -89 -300 -166 154 169 5 55 -106 141 153 138 178 60
2903 60 -15 164 -21 -134 28 -31 -34 -44 -110 156 -187 -59 -199 -264 -35 -93 -60 100 6 -219 -87 198 23 1
2927 1 117 157 42 278 255 -58 85 15 -215 251 35 -258 -50 74 -226 -148 -16 -202 -126 -14 -153 -79 -153
$$ packed form
2765a65L17k84L0J37K5j24J20J61k11J85Mj90MK69j75r2L01j96k5J7k19k54J89
2788a76L26K7j34n0j23O9Q1j2J40j20R2k54K85q4K63j79j68O4rp1R5K41n43P2
2812a68J74k73K15N3K5M5j77k9k96M00J23l73L98k67J93j00k4M2j28J78N1J10
2834A72k6nj82K6K00l37O51l63M5j90lK14m25l3j11L16Q4j53J19J01j50p5L4J79
2858H8j29j2Q6l2K27m48J36K13r9j13J00J00j11R4Q5j42J15j15l64M10m03J32
2880a82J64M7j91Q8Q3l3j38K72l37L23j85k11J34L20J5j64N0j61K47J2j5M0j18
2903F0p5J79j85j13J62n9lj0o6K66l43J28j40o5K29n8L3J60r4k25J32K85j75k2
2927AJ16M0j15K36k3l13J43p0k30M66k16k93K08J24l00P8J32j86P6J12j39P4p4
$$ plain form
2950 -153 196 -86 -13 60 45 64 -99 179 247 65 23 241 -27 24 -84 194 68 -111 -97 186 131 96 114 13
2974 13 309 -137 -185 71 -26 20 -57 -33 17 -137 -206 -372 -100 175 11 281 -59 26 179 39 -166 278 91
2997 91 32 -124 -58 34 36 102 217 4 203 200 47 151 -306 23 -39 -80 96 274 48 48 12 -56 -76 242 -95
3022 -95 48 33 265 -68 144 81 100 56 -69 -25 240 -35 -155 126 -90 -58 67 137 -7 -119 150 -72 -56
3045 -56 -174 -199 -116 -117 -177 -202 -32 -18 20 126 -135 -114 -37 232 124 3 119 -24 54 -169 79 -336 -32 121
3069 121 -14 158 -136 -287 47 -47 25 86 -260 -160 176 -49 -20 -115 73 -17 168 67 48 -35 320 230 23
3092 23 319 -9 434 339 62 -77 114 -109 -109 -121 -58 -152 -143 132 -105 -114 -64 -143 -87 -183 -249 -443 -51 -120 71 -28
3118 -28 195 80 -370 40 125 10 -265 -85 158 51 -170 132 23 -112 -138 -413 29 62 -191 -119 -153 139
$$ packed form
2950a53L49k82P3P3j5J9j63K78O8j82m2K18k68N1j08K78j26j79J4K83n5l5J8j01
2974A3K96m46m8K56r7M6p7K4N0j54o9j66K72K75j64K70l40Q5J53j40k05M44j87
2997I1n9j56O6R2KO6J15k13J99lj53J04m57L29o2m1J76J78k26%l6o8k0L18l37
3022i5J43j5K32l33K12o3J9m4j25M4K65k75j20K81k16L2J25P0j44j12K69k22J6
3045e6j18k5Q3jo0k5J70J4L8J06k61K1P7K69j08j21J16j43P8k23K48m15L04J53
3069A21j35J72k94j51L34r4P2O1l46J00L36k25K9r5J88r0J85j01j9q3L55r0k07
3092B3K96l28M43r5k77j39J91k23%j2O3r4RK75k37rN0p9N6r6o6j94L92o9J91r9
3118b8K23j15m50M10Q5j15k75J80K43j07k21L02j09j35k6k75M42L3k53P2l4K92
$$ plain form
3140 139 -131 -161 116 10 -87 15 -139 -163 143 -69 -3 -147 231 123 170 -69 269 207 198 -85 -89 36 34 -174
3164 -174 22 102 -272 -194 -91 22 -136 -92 130 42 -130 155 -46 84 82 -85 -2 75 -97 212 110 116 484
3187 484 -95 194 146 125 268 258 -232 50 154 -104 186 -96 -36 -75 -195 2 49 -121 -112 -207 -228 85 72 -165
3211 -165 -163 -145 221 116 342 -155 195 100 -60 65 -112 182 -110 105 -77 113 42 -69 -131 -67 28 138 -90
3234 -90 -174 -111 -382 26 69 -10 -193 -131 169 75 -64 -76 224 56 31 200 -34 104 363 173 17 -120 -180
3257 -180 302 24 53 34 93 190 194 -214 -104 -230 -267 -234 25 -71 -79 -223 -92 101 36 100 115 325 106 114 197 121
3283 121 65 91 14 389 -106 -115 199 314 163 207 -240 27 -99 39 -160 -175 -69 -241 -223 -309 -207 201 -109
3306 -109 -111 -5 40 -104 267 172 26 -51 -22 -52 227 275 238 150 119 25 -76 -167 272 105 231 -168 143 65 -64
$$ packed form
3140A39k70l0K77j06r7J02j54k4L06k12O6j44L78j08M7k39L38o2rk83mJ25kk08
3164a74J96Q0l74P8J03J13j58M4K22q8j72K85k01J30kj67Q3P7j72L09j02OL68
3187D84n79K89m8k1J43j0m90K82J04k58K90k82O0l9j20J97M7j70Rr5k1L13j3k37
3211a65KJ8L66j05K26m97L50r5j60J25j77K94k92K15j82J90p1j11o2O4R5J10k28
3234i0q4O3k71M08M3p9j83O2L00r4j39j2L00j68k5J69k34J38K59j90j56j37o0
3257a80M82k78K9j9N9R7Mm08J10j26l7L3K59r6qj44J31J93o5O4J5K10k19QQ3p6
3283A21n6K6p7L75m95rL14J15j51M4m47K67j26J38j99j5J06j72J8q6J02M08l10
3306a09kJ06M5j44L71r5j46p7K9l0K79M8l7q8l1r4j01r1M39j67J26l99L11p8j29
$$ plain form
3331 -64 97 -21 -93 -224 -196 -46 146 -30 216 -296 -221 -3 -106 -176 20 -8 145 118 288 -233 -51 188
3353 188 17 106 -5 -187 164 209 -182 177 -104 -363 68 145 -195 -209 55 91 -126 246 155 55 148 -146
3375 -146 14 78 223 271 32 81 265 127 131 259 107 269 -59 406 -43 -61 243 -70 81 -248 -5 -86
3397 -86 -303 -112 -122 2 -86 122 79 78 78 74 71 -340 175 142 -223 197 263 150 20 218 -65 61 76 7 -4 -11
3423 -11 -15 38 124 138 -156 -112 172 -160 32 67 124 -26 249 -37 250 39 -61 50 -163 -23 241 361 118
3446 118 -55 -108 218 16 140 142 105 216 -41 -278 -241 -54 -221 -50 -109 62 -179 -116 -264 7 -71 -128 -225
3469 -225 44 64 99 398 67 225 -113 100 93 304 155 -61 159 133 196 -165 -73 232 -28 29 -57 15 136
3492 136 -162 -302 242 -20 -237 102 -252 -68 -27 118 -29 116 76 138 -24 304 197 75 142 -69 139
$$ packed form
3331f4J61j18p2j31K8J50J92j76K46n12P5K18j03p0J96k8J53k7J70n21J82K39
3353A88j71Q9j11j82L51M5l91L59k81k59M31P7l40j4K64L6k17L72r1j00R3k94
3375a46J60O4J45M8k39M9J84j38MJ28j52J62l28M65m49j8L04l13J51l29K43q1
3397h6k17J91j0J24q8K08m3j%mlm11N15l3l65M20O6j13j30J98k83J26J5o9j1p
3423a1mN3Q6J4k94M4K84l32J92L5N7j50K75k86K87k11j00J11k13J40K64J20k43
3446A18j73n3L26k02J24Kl7J11k57k37L7J87j67J71n9J71k41O3j48K71p8n7r7
3469b25K69K0L5K99l31J58l38K13pK11j49k16K20k6O3l61R2L05k60N7q6P2J21
3492A36k98j40N44k62k17L39l54J84M1J45j47J45m0O2j62L28j07j22O7k11K08
$$ plain form
3513 139 67 247 -140 -221 -57 42 103 -135 106 -66 -135 -109 5 -431 -29 -196 -35 78 -271 -109 -78 -7 -74
3536 -74 115 -180 73 -54 137 107 236 362 39 367 124 107 -9 59 -55 47 -162 -35 -137 -7 46 -120
3558 -120 -40 14 -352 -53 -61 93 9 -254 27 -183 -154 -1 -20 50 148 21 -124 7 -6 253 331 161 -108 81
3582 81 -12 328 37 -75 -89 -121 -126 -140 230 150 -150 -46 -96 41 -112 -55 -20 3 -149 12 -250 40 69 -150
3606 -150 42 -26 78 157 50 60 345 79 221 -92 98 -316 181 177 36 -62 94 50 22 -144 6 160 -78
3629 -78 -52 98 82 247 218 245 82 91 20 155 165 76 -106 -136 7 25 -149 120 196 1 -80 -18 -90 -35 129 -152
3655 -152 140 -166 59 -351 -79 -75 -173 -184 -66 -187 -101 41 58 90 126 147 106 252 171 140 42 88 195 15 -76
3680 -76 -5 153 203 -103 31 -181 120 -104 -27 -249 -236 126 90 -82 -25 74 -115 -46 134 21 87 203 119 -82
$$ packed form
3513A39p2J80l87q1J64R9O1k38K41j72o9K6J14m36M02j67J61J13l49J62L1P1o7
3536g4J89k95K53j27J91l0J29J26l23L28k43j7j16O8j14J02k09J27j02J30N3j66
3558a20Q0N4l66K99qJ54q4k63K81k10K9J53j9P0R8j27j45J31j3K59P8j70k69J89
3582H1r3L40k91j12j4l2nj4L70q0l00J04n0J37j53N7L5K3j52J61k62K90K9k19
3606a50J92o8J04P9j07J0K85k66J42l13J90m14M97mj41r8J56m4k8j66J50J54k38
3629g8K6J50j6J65k9K7j63Rp1J35J0q9j82l0J43J8j74K69P6j95q1O2p2N5J64k81
3655a52K92l06K25m10K72Mr8j1J18j21Q6J42J7L2L6K1m1J46q1l1r8M6J07j80r1
3680g6P1J58N0l06J34k12L01k24P7k22J3L62l6j72N7R9j89O9J80j13O6J16q4k01
$$ plain form
3704 -82 141 89 363 24 -126 166 31 53 -112 253 59 186 -95 85 248 185 264 21 -44 51 -218 -145 -40
3727 -40 -245 -32 178 -329 52 181 67 31 -165 346 79 205 -109 -185 44 54 -69 46 174 96 -194 -51
3749 -51 138 10 -187 -260 11 136 -51 -138 70 62 21 -129 98 244 -180 14 -196 30 -1 306 37 160
3771 160 39 30 91 50 283 -11 -18 -98 367 -19 171 -119 127 21 5 -168 -46 52 -74 -133 -149 -33 -87 14
3795 14 50 -52 196 202 -232 -13 247 91 -230 -67 2 60 103 -42 -34 -102 -32 305 45 -81 -123 -184 -216 -183 18
3820 18 -124 -60 64 -43 -51 16 -173 -44 78 158 116 177 155 154 55 -96 70 140 34 72 25 178 129 -39 -98 -85
3846 -85 -148 -114 49 -18 34 152 -190 91 7 -165 -146 264 -22 -31 53 180 -135 105 -70 -70 36 179 1 116
3870 116 91 275 5 110 31 -60 269 -13 25 14 135 72 -80 -190 -2 -42 -110 -118 -113 -9 -203 -103 0 82
$$ packed form
3704h2K23n2K74l39j50K92j35K2j65L65j94J27k81J80J63o3P9k43o5R5k69P3J05
3727d0k05K13K10n07L81J29j14l6j96N11k67J26l14p6K29J0j23J15J28p8k90J43
3749e1J89j28j97p3K71J25j87q7K08qm1j50K27J46m24J94k10K26l1L07k69J23
3771A60j21rO1m1K33k94pq0M65l86J90k90K46j06j6j73J22R8j26n9j6J16n4J01
3795A4L6j02K48Om34K19K60j56l21J63O9N8M3j45Qo8P0L37k60j26m2o1l2L3K01
3820A8j42O4J24j07qO7j89J29J22Q0m2O1k2jr9j51J66P0j06L8m7J53m9j68n9J3
3846h5o3L4J63o7N2J18l42K81q4j72J9M10k86rQ4J27l15K40j75%J06J43j78J15
3870A16k5J84k70J05p9r1L29k82L8j1J21o3j52j10J88m0o8qNJ04j94J00J03Q2
$$ plain form
3894 82 132 -3 94 32 273 138 37 118 349 83 30 -77 112 143 108 258 -138 -34 -73 -39 83 -136 -8
3917 -8 -50 20 -131 -17 264 73 -116 -60 -210 -166 334 -12 172 -33 1 -171 2 168 54 118 62 -195 -35
3940 -35 162 211 27 -96 -12 -76 22 -119 -146 57 -98 -142 -51 -96 -117 36 40 236 72 317 76 -64 106 15
3964 15 127 189 -36 169 -131 68 258 135 -129 68 -80 -91 -386 74 83 9 -227 31 -332 -92 79 80 -53
3987 -53 -99 -140 -151 91 -222 199 36 -99 -19 -12 109 -74 190 336 110 11 76 149 -19 186 13 71 -225 -340
4011 -340 -154 115 -67 -73 -68 22 -254 -140 211 -176 81 81 247 25 63 237 71 163 5 245 84 190 -42
4034 -42 -116 -6 24 40 -115 72 164 -168 -127 -46 46 -93 145 -186 -19 69 -70 -36 99 32 -103 277 -35 -11
4058 -11 -117 -69 33 20 122 -164 58 152 -91 -135 115 342 179 19 -38 156 102 231 -36 303 24 16 -157
$$ packed form
3894H2N0j35R7o2K41j35j01Q1K31k66n3j07J89L1l5J50l96J04l9L4J22k19J28
3917hm2P0j51J14K81j91j89N6j50M4N00l46J84k05L4j72J73J66j14O4n6k57J60
3940c5J97M9j84j23Q4o4R8j41k7K03j55m4R1m5k1J53MJ96j64K45k41j40J70r1
3964A5J12O2k25K05l00J99J90j23k64J97j48j1k95M60Rp4k36K58l63K40J71Jj33
3987e3m6m1j1K42l13M21j63j35Q0PJ21j83K64J46k26r9O5P3j68K05j73N8k96j15
4011c40J86K69j82oNR0k76J14L51l87K57%J66k22L8J74j66R2j58K40j61J06k32
4034d2p4J10L0J6j55J87R2l32M1Q1R2j39K38l31J67Q8j39L4J35o7j35L80l12K4
4058a1j06M8J02j3J02k86K22R4k43m4K50K27j63j60n7J94n4J29k67L39k79qj73
$$ plain form
4081 -157 29 145 -160 -214 284 -84 -52 -59 293 127 -111 -38 213 197 167 65 184 -95 117 186 39 -123 44
4104 44 12 -150 87 -259 83 -88 -54 -8 -108 -298 281 274 74 155 234 68 175 3 3 -143 10 46 185 219
4128 219 104 -11 8 -70 135 -2 66 168 166 -2 -46 -121 15 -36 -106 94 31 -47 -17 36 -28 -219 -215 33 -242
4153 -242 -103 -112 1 161 -114 52 -105 -86 79 -226 -108 16 10 5 -92 151 59 -113 50 8 232 70 -125
4176 -125 128 68 -79 177 -84 -131 -310 -36 19 106 162 -34 179 103 -81 -19 163 132 -66 -6 101 151 99 -80
4200 -80 192 -69 -108 -81 59 -60 -132 5 25 -128 -85 8 108 75 218 -48 -81 -110 88 -27 -97 -172 231 -40
4224 -40 23 -39 120 -161 -184 -46 68 39 11 174 -183 -50 -141 113 -198 -62 -13 -41 145 69 -154 216 -177
4247 -177 -260 -196 -187 172 13 -214 -216 -79 70 326 78 121 201 129 -25 155 182 7 131 -145 -52 175 -12 98
$$ packed form
4081a57J86J16l05n4M98l68L2pL52j66k38P3K51j6l0j02J19k79K12O9j47j62J67
4104D4l2j62K37l46L42j71L4M6j00j90N79pk00Q1P9j66J07j72%j46J53L6J39L4
4128B19j15j15J9p8K05j37O8J02kj68m4p5J36n1p0K00o3p8L0N3o4j91MK48k75
4153b42J39rJ13J60k75J66j57J9J65l05J18J24onr7K43r2j72J63m2K24j62j95
4176a25K53o0j47K56k61m7j79K74N5Q7N6j96K13p6j84O2J82l1j98O0J07N0n2j79
4200h0K72k61l9K7J40j19p2J37K0j53M3R3J00l3J43k66l3k9J98j15p0p5M03k71
4224d0O3o2J59k81k3J38J14k9k8J63l57J33r1K54l11J36M9k8J86p6k23L70l93
4247a77q3O4RL59j59k27kJ37J49K56k48M3Q0p2j54J80K7j75J24k76R3K27j87J10
$$ plain form
4271 98 320 -115 -177 -163 -83 162 -260 -13 96 32 -266 -73 -105 -23 269 49 121 -78 -269 102 -13 -182 -10
4294 -10 -9 -23 -168 168 -196 -38 31 -126 -155 -70 -155 -208 -230 2 -71 -81 -178 62 185 -29 -140 -89 -61 306 -103
4319 -103 -107 78 -6 -13 -333 90 9 12 -36 106 35 77 75 -302 -145 26 -215 -117 33 48 -200 -229 118 -77 97
4344 97 37 -124 -77 -26 -2 -108 -3 -194 -119 -148 -34 -78 77 36 115 88 75 104 42 -95 -88 210 -79 169 103 31
4370 31 22 -79 32 -41 151 163 12 186 62 126 -95 98 -331 -95 -239 -112 62 -7 245 -55 -4 187 -94
4393 -94 184 90 0 99 62 -109 67 -151 -167 255 -8 435 -116 53 -262 -37 35 -41 41 -17 -151 -113 -180 47
4417 47 177 146 -157 -112 -38 32 -43 -22 -59 -254 172 21 69 56 79 31 -18 -378 -165 207 -122 -92 -163 76 -35
4442 -35 144 -21 -140 192 134 204 -72 137 192 114 384 -181 -105 -61 -215 123 -21 43 -25 -29 -264 -67 -90 176
$$ packed form
4271I8K22m35o2J4Q0K45m22K47J09o4k98J93l2Q2K92k20P2j99j91L71j15j69J72
4294a0Jj4j45L36l64J58O9j57k9Q5q5n3k2K32p3j0r7K40J23k14j11N1K8L67m09
4319a03mJ85q4pl20M23q1Lm8J42p1M2kl77J57J71k41R8J50J5k48k9L47j95J74
4344I7o0j61M7N1K4j06J05j91P5k9J14m4J55m1P9k7j3K9o2j37PK98k89K48o6p2
4370C1rj01J11p3J92J2j51J74j24O4k21J93m29K36j44J27J74o9K52l00N1J91k81
4393i4K78r4r0R9l7j71J76k18j6M22k63M43n51J69l15K25P2p6Q2n8j34L8o7K27
4417D7J30l1l03M5P4P0p5K1l7j95M26j51M8j3K3m8m9l60K13L72l29L0p1K39j11
4442c5J79j65j19L32n8P0k76K09N5p8K70n65P6M4j54L38j44O4o8mk35J97k3K66
$$ plain form
4466 176 -32 -338 -59 -126 167 3 16 -171 -252 111 -43 -20 -40 208 -54 204 91 133 238 -50 -174 24
4488 24 62 -270 41 -49 -143 154 100 -42 35 53 -37 134 -145 -193 199 -139 143 183 48 237 39 142 -28
4511 -28 318 -78 32 112 -46 -93 -96 7 -25 73 -41 106 101 9 -223 -71 -188 -58 -126 144 -29 -31 -78 -74 211
4536 211 32 -119 -17 -22 -376 -141 -15 184 285 16 64 10 111 174 -89 117 -41 -143 -157 28 -72 -146
4558 -146 -58 90 202 130 -116 -14 77 69 135 105 202 -3 -157 175 129 -20 65 188 -20 -146 234 184 46 175
4582 175 -76 62 100 3 -99 -101 -39 -80 148 -183 -38 -57 265 252 -125 -273 -185 169 -12 -77 -43 -29 56 -117
4606 -117 159 155 -59 35 -166 15 47 309 -71 23 -29 -23 77 108 9 -45 -48 10 -40 146 -34 -267 -117 75 9
4631 9 -79 -50 129 -156 12 -32 -161 87 -3 -28 58 170 54 451 137 117 -70 -48 -176 -174 166 -130 -212 -58
$$ packed form
4466A76k08l06K79o7K93j64J3j87q1L63j54K3k0K48k62K58j13M2J05k88j24J98
4488B4L8l32L11r0r4K97n4j42P7J8r0J71k79m8L92l38K82M0j35J89j98J03j70
4511b8L46l96J10Q0j58m7lJ03l2R8j14J47nr2k32J52j17J30o8K70j73km7MK85
4536B11j79j51J02nl54K35J26J99J01k69M8n4J01O3k63K06j58j02j4J85j00p4
4558a46Q8J48J12p2k46J02R1qO6l0R7k05j54L32m6j49Q5J23k08j26L80n0j38J29
4582A75k51J38L8r7j02kO2m1K28l31J45j9L22j3l77j48Q8L54j81o5L4J4Q5j73
4606a17K76mk14R4k01J81L2K62l80R4n2OJ00L1r9n4lN8n0J86j80k33J50J92o6
4631Iq8K9J79k85J68m4j29K48r0k5Q6J12j16L97l14k0j87K2j28KL40k96q2J54
$$ plain form
4655 -58 34 -30 -145 70 -71 112 126 167 157 -42 60 -95 12 234 13 53 -57 -177 299 -17 -2 46 289
4678 289 -51 -127 354 153 104 -35 25 -237 -141 -106 -193 126 -175 -112 -202 -14 -98 -133 -75 -125 241 -182 -148 151
4702 151 -54 -42 159 15 248 100 64 10 -91 132 25 -98 63 -118 61 150 30 2 71 183 51 -79
4724 -79 -20 -99 55 239 -16 -92 163 68 205 67 -116 -29 -157 -115 323 379 69 81 73 142 -17 88 20 -120
4748 -120 212 -37 138 -160 -1 -18 -51 134 -63 45 -61 -122 -7 51 -150 -48 134 -202 8 222 -34
4769 -34 115 22 7 154 117 255 -143 58 -115 44 114 -112 53 -116 -108 -208 76 -59 -45 77 -293 -255 93
4792 93 -6 -208 -10 -59 -65 154 134 -40 -58 -27 4 250 -17 151 -14 -222 -21 50 -130 275 108 -303 23
4815 23 -104 -30 18 -139 119 79 -154 143 -8 -148 -122 -63 -31 -96 3 12 -169 -77 113 216 -111 38 47 170 -19
$$ packed form
4655e8R2o4j15K15j41J83J4M1j0j99J02j55J07K22k21M0j10j20M76l16J5M8K43
4678B89l40p6M81k01m9j39O0k62R6L5q7L19l01O3r0J88q4l5N8n0L66m23L4K99
4702A51k05J2K01j44K33j48l6n4j01K23j07j23J61j81J79Q9j20k8O9J12j32j30
4724g9N9p9J54J84k55p6K55r5J37j38j83Q7j28M2M38N6l10J2qO9j59J05o8j40
4748a20L32k49J75k98J59j7l3J85j97J08j06o1J15N8k01J02J82l36K10K14k56
4769c4J49r3j5J47l7J38l98K01j73J59P0k26J65j69Qj00K84j35J4J22l70L8L48
4792I3r9k02J98m9oK19k0j74j8L1L1K46k67J68j65k08K01P1j80M05j67m11L26
4815B3j27P4M8j57K58m0k33K97j51j40K6N9L2o5R9Rj81R2J90J03l27J49RJ23j89
$$ plain form
4840 -19 -54 -282 -366 81 -3 -30 -142 -157 -19 99 -92 22 48 -52 -115 -181 33 -245 -84 -342 87 63 -41
4863 -41 236 -80 -2 119 -32 -147 14 -42 -15 -105 -168 127 -63 18 108 -120 -39 -102 -204 -50 -36 -182 3 31
4887 31 -192 121 5 -135 127 -10 -71 -151 70 266 -60 -17 -44 -7 43 325 -90 79 -163 204 91 120 128
4910 128 19 -7 176 15 -35 -3 -100 12 -20 108 -8 87 49 -113 -208 5 23 -147 -18 225 112 24 56 109
4934 109 185 233 -68 235 188 -153 33 -31 -63 24 80 -67 -44 26 -124 -244 14 -41 -149 -187 -250 151 -45 -138
4958 -138 192 -195 190 -37 93 51 -75 195 -197 242 79 80 138 32 -45 60 189 25 -84 -23 37 -39 143
4981 143 -123 -14 -147 -58 -13 -104 -51 50 74 -1 62 -55 56 155 5 2 39 51 -277 -31 -31 -90 20 119 49 125
5007 125 41 73 148 -15 -209 14 -94 -252 -45 105 -32 -64 28 -46 -337 -266 -330 -171 -90 -26 107 40 -120 137
$$ packed form
4840a9l5k28q4M47q4k7j12j5J38J18j91J14K6j00o3o6K14k78J61k58M29k4j04
4863d1K77l16P8J21j51j15J61n6K7r0o3K95j90Q1R0k28Q1o3j02J54J4j46J85K8
4887C1k23L13j16j40K62j37o1q0K21J96l26M3k7L7N0K82m15J69k42L67j13K9Q
4910A28j09k6J83j61n0L2r7J12l2J28j16R5l8j62r5K13J8j70J29K43j13q8L2N3
4934A09P6M8l01L03m7l41J86o4l2Q7N6j47K3P0j50j20K58n5j08l8o3M01j96r3
4958a38L30l87L85k27J30m2j26K70l92M39j63JN8j06p7J05J29j64j09O1O0p6J82
4981A43k66J09j33Q9M5r1N3J01K4p5O3j17J11R9j50lL7J2l28K46%n9J10R9p0P6
5007A25q4L2P5j63j94K23j08j58K07J50j37l2R2p4k91P1o4J59Q1O4J33o7j60K57
$$ plain form
5031 137 79 -188 76 361 -192 72 39 257 -32 -53 2 122 -285 86 103 -96 111 143 -79 -172 -171 -54 235
5054 235 -58 114 51 10 -110 -6 -18 36 57 185 -146 -74 75 47 -7 18 59 -54 16 -6 316 -139 -186 -63
5078 -63 -60 -11 109 -97 -61 214 105 -77 119 86 92 -173 -11 205 -135 -122 18 349 -50 -16 -17 140 48 -37 120
5103 120 159 30 145 39 266 83 202 51 -128 -277 36 -145 -31 -138 -16 102 82 -285 -60 -24 -66
5124 -66 38 -230 -24 -3 -25 44 -101 -11 -35 263 -154 88 55 -88 98 98 -64 63 -68 1 -35 -203 75 -63
5148 -63 -33 143 151 70 188 40 -15 -63 -218 -224 -19 163 -46 -15 184 106 -90 63 68 -119 85 170 -97 -44 174
5173 174 111 127 385 149 -51 -76 -10 -20 -133 -32 82 152 160 10 30 -35 75 106 80 -55 -135 218 239 -96 169
5198 169 167 -65 70 22 -161 -28 -640 -87 27 150 146 116 -220 180 -15 -21 -160 -87 -41 -429 135 -83 61
$$ packed form
5031A37n8k67K64K85n53K64l3K18k89k1N5J20m07L71J7j99K07L2k22r3JJ17K89
5054B35k93J72o3m1j20J04j2N4K1J28l31P2J49k8n4K5M1j13P0k2L22m55m7J23
5078f3LM9J20k06L6K75j09j82J96l3Ok65J62K16l40J3J40L31l99L4jJ57r2q5J57
5103A20L9j29J15j06K27j83J19j51j79j49L13j81J14j07J22J18k0l67K25L6m2
5124f6J04k68K06K1k2O9j45R0k4K98m17K42l3j43J86%j62J27j31O9l6j68K78j38
5148f3L0J76Qq1J18j48n5m8j55oK05J82k09L1J99p8j96J53Nj87K04Q5k67N3K18
5173A74o3J6K58k36k00k5O6j0j13J01J14P0Qj50K0o5J10L1k6j35q0L53K1l35K65
5198A69kk32J35m8j83J33o12N53J14J23ml0l36M00j95oj39P3M6l88N64k18J44
$$ plain form
5221 61 169 -153 97 199 6 -169 214 112 6 -8 -55 -100 206 52 32 99 -3 150 38 -312 59 -69
5243 -69 -98 26 218 35 32 276 14 70 13 -11 51 -391 -144 -135 151 -110 63 -163 -97 229 -193 -14 245 181
5267 181 56 208 178 66 176 116 -370 -205 -41 28 -194 -76 -326 -119 95 40 -3 68 -117 -140 56 -126
5289 -126 -165 -109 221 -16 51 254 -53 115 51 13 7 -31 7 -123 -17 -161 -97 60 -32 -11 4 3 244 166 -235
5314 -235 71 34 -68 32 16 40 100 38 -101 -315 37 -162 112 -130 -109 -121 -129 -150 23 177 9 96 -172 -57
5338 -57 193 -94 0 -88 131 -22 170 2 -54 4 82 -48 -56 269 240 129 121 152 -112 -20 72 -54 170 129 69
5363 69 152 -35 95 84 121 167 111 -96 -132 37 -44 115 170 -2 -52 -8 -297 -125 -187 -163 -34 -14 78 190 298
5388 298 -21 191 36 236 260 61 -70 -63 53 132 -72 -117 -36 261 6 -75 53 261 -70 -63 -17 -63 -61 194
$$ packed form
5221F1J08l22K50J02j93j75L83j02j06j4m7m5L06j54k0O7j02J53j12l50L71j28
5243f9k9J24J92j83lK44k62N6n7k4O2m42K47RK86k61J73k26O6L26m22J79K59o4
5267A81j25J52l0j12J10o0m86J65J64O9k22J18k50K07K14n5m3P1j85k3J96j82
5289a26l9N6L30k37O7K03l07J68o4l8ol8L8j30J06j44O4J57r2K1J5jK41p8m01
5314b35L06l7j02J00j6K4O0o2j39k14L52j99K74k42K1j2qk1J73J54j68Q7k68J15
5338e7K50k87R4q8K19j53J92j68n6N8P8j30qL25k9j11qL1k64R2R2j26K24m1o0
5363F9Q3j87J30j1L7M6n6k07l6J69q1J59N5j72n0M4k89J72o2K4J29K0R2J12J08
5388B98l19K12j55K00K4j99j31PJ16P9k04m5Q1K97k55q1J28K08l31PM6m6KK55
$$ plain form
5412 194 -174 -180 50 -141 50 105 216 -31 83 259 118 -76 -24 252 136 -50 -12 -54 113 124 31 58 -33
5435 -33 86 48 -66 -281 -60 42 -17 137 -86 120 -17 97 -50 8 -90 -126 80 -106 27 -102 -78 142
5457 142 86 -143 41 171 -105 -51 172 16 148 29 -44 246 -160 110 -87 122 70 -111 -60 26 54 -61
5479 -61 168 -175 -38 -42 171 57 76 24 55 29 -186 -132 -58 42 -240 -174 -52 -179 66 231 -151 53 -131
5502 -131 -87 -298 92 -322 83 -200 -219 -31 1 -103 -127 44 -327 -189 -158 -121 94 53 -17 176 77 -67 225
5525 225 33 -220 148 18 -34 61 204 21 -56 125 -164 49 -294 73 -203 -143 103 -112 18 -55 83 47
5547 47 24 130 -139 17 109 -60 9 43 -49 -75 56 34 -85 370 -66 48 285 26 -16 79 -139 -117 233 41
5571 41 -161 57 -210 -24 108 -8 129 -202 -126 -12 66 38 -107 109 26 150 180 -36 -142 37 5 -230
$$ packed form
5412A94l68oK30j91J91N5J11k47J14J76j41j94N2K76j16j86L8m2J67J1r3K7r1
5435c3J19l8j14k15K21J02n9J54k23K06j37J14j47N8r8l6K06j86J33j29K4K20
5457A42n6k29J84J30k76N4K23j56J32j19p3K90m06K70j97K09n2j81N1Q6K8j15
5479f1K29l43J37mK13j14J9n2L1k6k15N4P4J00k82O6J22j27K45J65l82K04j84
5502a31M4k11L90m14M05k83j9J88L2j04k4J71l71J38L1L7K15m1p0J93r9j44K92
5525B25j92k53L68j30n2R5J43j83p7J81k89K13l43L67k76O0K46k15J30p3J38l6
5547D7k3J06k69J56R2j69O9L4r2k6J31k2j19M55m36J14K37k59m2R5k18K2L50j92
5571D1k02K18k67J86J32j16J37l31P6J14P8k8j45K16q3J24L0k16j06J79l2k35
$$ plain form
5593 -230 197 23 66 -107 -202 -24 20 143 -90 44 38 -114 208 -6 -68 94 -16 -170 -53 126 -122 -192
5615 -192 116 -37 83 19 70 176 25 76 -42 -15 34 -127 7 85 62 48 -116 -75 -125 64 178 64 -102
5638 -102 265 167 46 147 -434 35 109 41 266 -84 -254 171 -292 -132 -1 110 90 127 36 128 18 40 201
5661 201 167 -168 -192 -6 59 112 -143 -295 -182 -51 39 350 79 -1 -222 338 20 40 -10 41 157 -273 142
5684 142 -186 -111 39 74 126 130 17 -23 -163 -307 5 79 -8 -148 100 -252 5 -97 25 221 210 95 31
5707 31 -14 -353 132 102 -12 -59 36 -46 -69 -187 13 -69 37 237 -250 133 -180 -53 152 -29 -88 200 31
5730 31 -25 -214 14 -89 220 90 157 -82 -59 142 -96 -49 -79 13 -160 125 7 -15 2 -258 -157 30 -198
5753 -198 68 84 42 -161 -96 132 12 -180 -40 45 -62 -112 -98 -75 -60 154 237 247 -132 240 31 104 71 111
$$ packed form
5593b30M27j74M3j73r5J78M4J23k33J34oj52L22k14o2J62j10j54J17J79k48p0
5615a92L08j53J20o4N1J06j51N1j18K7M9j61J34P8k3j4j64M1n0J89J14j14j66
5638a02L67r8j21J01n81M69P4o8K25l50j70M25m63J60J31J11k0L7r1R2j10K2J61
5661B01l4l35k4J86O5N3k55j52J13J31R0L11k71q0k21N60l18K0n0N1J16m30M15
5684A42l28P5J50L5N2Mj13m0j40j44L12P4q7j40K48l52K57j02J22J96j1j15o4
5707C1m5l39M85l0j14m7R5q2k3j18K00q2J06K00m87L83l13J27K05j81n9K88j69
5730C1n6j89K28j03L09j30O7k39K3K01k38M7l0R2j73K85j18k2J7k60J01J87k28
5753a98K66J6m2k03O5K28j20j92J40Q5j07n0J4K3J5K14Q3J0l79L72k09P3l3M0
$$ plain form
5777 111 176 156 -40 -135 -60 236 217 105 -259 -195 -24 21 116 27 70 -96 -45 -60 -75 -139 55 -276 62 119 70
5802 70 -112 -57 101 42 92 -202 207 266 -79 84 -67 77 -145 26 33 -311 -85 -65 -256 -28 182 -5 -42
5825 -42 -205 -75 -45 107 74 22 -15 94 51 67 -118 -262 -118 30 -115 0 1 103 42 -30 61 16 283 112
5849 112 -9 1 40 28 25 -245 -73 24 -79 -283 185 -36 44 -172 3 -234 242 20 132 16 -52 61 -194
5872 -194 134 -98 118 -5 -12 36 -53 100 -194 148 -57 184 190 -57 -107 141 223 154 -34 -1 -238 -185 6 210
5896 210 -26 103 256 44 -153 -158 116 161 13 16 86 -83 -81 -151 -147 40 8 -150 -114 -58 62 -9 149 36 52
5921 52 -21 67 -304 94 -93 85 137 -169 -76 65 -14 78 177 322 54 -144 -5 33 127 165 -81 -257 176 -172
5945 -172 210 255 -30 -101 -157 38 61 8 57 143 153 -189 49 70 -34 -59 -54 246 -91 142 186 52 -41 293 188
$$ packed form
5777A11O5k0j96r5P5K96j9j12l64O4J71M5R5q9M3j66N1j5j5o4J94l31L38N7m9
5802G0j82N5J58n9N0k94M09N9l45J63j51J44k22J71Pl44K26K0j91K28K10j87l7
5825d2j63J30L0J52l3n2l7J09m3J6j85j44J44J48j45J15JJ02o1p2R1m5K67j71
5849A12j21J0L9j2lk70J72R7j03k04M68k21Q0k16J75k37M76k22J12j16o8J13k55
5872a94L28k32K16j23pM8q9J53k94L42k05K41Ok47n0K48Q2o9j88L3k37N3J91K04
5896B10k36J29J53k12j97nK74M5j48LP0j69Kp0MJ87l2j58L6N6J20p1J58j13J6
5921E2p3Q8l71L98j87J78N2l06R3J41p9R2R9J45k68j98J39L8R4L8k46j76M33l48
5945a72L82M5k85p1n6J95K3n3M9Q6J0l42K38K1j04k5NL00l37K33M4j34r3L34j05
$$ plain form
5970 188 -44 -27 -36 93 -233 10 208 104 49 288 5 -89 161 -76 -14 -193 -75 128 -106 72 101 -172
5992 -172 210 108 40 -23 35 -65 85 -39 -122 14 -210 96 104 78 187 -156 -53 -92 105 -27 -342 -111 -7
6015 -7 -101 -307 -212 -78 77 -82 8 87 -215 -46 -142 -242 169 -37 156 49 -71 82 -183 -11 105 -70
6037 -70 171 -97 -59 -55 245 -34 79 50 -140 51 15 -77 -238 -49 -112 -262 4 -183 -112 172 139 147 -21 82
6061 82 66 181 53 -119 -216 -58 64 166 65 207 -8 101 -5 42 18 0 24 61 -33 -162 170 -75 -256
6084 -256 58 -88 -185 88 3 -65 50 -181 106 -33 51 -131 356 82 -116 -72 53 -90 -54 -63 -57 -77 -27 -84
6108 -84 223 16 24 -9 101 102 -21 -19 -26 -223 -60 -15 -105 23 -187 228 39 -11 114 29 -35 54 -146 91 -96
6133 -96 12 165 -105 -19 72 76 -149 69 -26 -65 53 68 -158 -46 -201 -14 26 -83 -98 -26 -71 103 -98 -58
$$ packed form
5970A88k32J7rJ29l26K43J98j04n5K39k83r4K50k37O2j79J18K03k34J78K9k73
5992a72L82j02o8o3N8j00J50j24q3J36k24L06Qk6J09l43J03l9J97j32l15K31J04
6015gr4k06R5J34J55j59R0P9l02J69r6j00M11k06J93j07j20J53k65J72J16j75
6037g0K41k68L8ML00k79J13k9j90J91l6r2j61J89o3j50K66j87P1K84l3Qj68J03
6061H2j6J15j28j72r7J58J22J02j01J42k15J09j06M7k4j8K4L7r4j29L32k45j81
6084b56L14j46r7K73q5o8J15k31K87j39Q4j82M87k74j98M4J25j43L6rOk0N0n7
6108h4L07k07Ql3J10Jj23Kpj97J63M5r0J28k10M15j89n0J25q5o4Q9k00K37j87
6133i6J08J53k70Q6R1Mk25K18r5l9J18J5k26J12j55J87M0j09j5P2m5J74k01M0
$$ plain form
6157 -58 16 87 6 16 -131 75 -92 105 33 -137 87 -59 409 73 160 -36 -115 -55 55 201 -145 -98 315
6180 315 -286 -135 -154 82 97 -74 88 -90 50 4 -88 -5 -137 113 -157 -30 -2 73 155 185 -141 -65 -231
6203 -231 -86 96 105 -250 -221 -100 8 36 -110 91 -49 -56 -192 274 72 31 -114 21 240 126 211 35 -10
6226 -10 -194 170 102 -134 3 -138 -125 155 -46 152 223 6 -205 -12 4 -127 -71 -85 -8 -168 142 -26 -74
6249 -74 67 207 19 47 -84 -51 -66 34 -244 -45 -204 -26 92 -238 265 244 -5 -137 169 138 104 -38
$$ packed form
6157e8P4P1q1J0j47K06j67J97p2j70K24j46M68l36Q7j96p9O0J10J46l46M7M13
6180C15o01J51j9K36J5j71J62j78J40m6r2Q3j32K50k70J27K8P5Q2L0l26P6j66
6203b31J45J82Rl55K9J21J08K8j46K01j40pj36M66k02m1j45J35K19j14Q5j76m5
6226a0j84L64o8k36J37j41J3K80k01J98P1k17k11J93J6j31N6j4P7j60L10j68m8
6249g4J41J40j88K8j31L3j5J00k78J99j59J78J18l30N03k1k49j32L06l1l4j42
$$ [...]
8191b00
##END NTUPLES=NMR FID
##END=
